lucene-dev mailing list archives

Site index · List index
Message view « Date » · « Thread »
Top « Date » · « Thread »
From Policeman Jenkins Server <jenk...@thetaphi.de>
Subject [JENKINS] Lucene-Solr-trunk-Linux (64bit/jdk1.8.0-ea-b79) - Build # 4784 - Failure!
Date Tue, 19 Mar 2013 23:52:44 GMT
Build: http://jenkins.thetaphi.de/job/Lucene-Solr-trunk-Linux/4784/
Java: 64bit/jdk1.8.0-ea-b79 -XX:+UseG1GC

1 tests failed.
REGRESSION:  org.apache.solr.cloud.UnloadDistributedZkTest.testDistribSearch

Error Message:
Still found shard2 in collection test_unload_shard_and_collection

Stack Trace:
java.lang.AssertionError: Still found shard2 in collection test_unload_shard_and_collection
	at __randomizedtesting.SeedInfo.seed([B71B11FD52BC8086:36FD9FE525E3E0BA]:0)
	at org.junit.Assert.fail(Assert.java:93)
	at org.apache.solr.cloud.UnloadDistributedZkTest.testUnloadShardAndCollection(UnloadDistributedZkTest.java:124)
	at org.apache.solr.cloud.UnloadDistributedZkTest.doTest(UnloadDistributedZkTest.java:77)
	at org.apache.solr.BaseDistributedSearchTestCase.testDistribSearch(BaseDistributedSearchTestCase.java:806)
	at sun.reflect.NativeMethodAccessorImpl.invoke0(Native Method)
	at sun.reflect.NativeMethodAccessorImpl.invoke(NativeMethodAccessorImpl.java:57)
	at sun.reflect.DelegatingMethodAccessorImpl.invoke(DelegatingMethodAccessorImpl.java:43)
	at java.lang.reflect.Method.invoke(Method.java:487)
	at com.carrotsearch.randomizedtesting.RandomizedRunner.invoke(RandomizedRunner.java:1559)
	at com.carrotsearch.randomizedtesting.RandomizedRunner.access$600(RandomizedRunner.java:79)
	at com.carrotsearch.randomizedtesting.RandomizedRunner$6.evaluate(RandomizedRunner.java:737)
	at com.carrotsearch.randomizedtesting.RandomizedRunner$7.evaluate(RandomizedRunner.java:773)
	at com.carrotsearch.randomizedtesting.RandomizedRunner$8.evaluate(RandomizedRunner.java:787)
	at com.carrotsearch.randomizedtesting.rules.SystemPropertiesRestoreRule$1.evaluate(SystemPropertiesRestoreRule.java:53)
	at org.apache.lucene.util.TestRuleSetupTeardownChained$1.evaluate(TestRuleSetupTeardownChained.java:50)
	at org.apache.lucene.util.TestRuleFieldCacheSanity$1.evaluate(TestRuleFieldCacheSanity.java:51)
	at org.apache.lucene.util.AbstractBeforeAfterRule$1.evaluate(AbstractBeforeAfterRule.java:46)
	at com.carrotsearch.randomizedtesting.rules.SystemPropertiesInvariantRule$1.evaluate(SystemPropertiesInvariantRule.java:55)
	at org.apache.lucene.util.TestRuleThreadAndTestName$1.evaluate(TestRuleThreadAndTestName.java:49)
	at org.apache.lucene.util.TestRuleIgnoreAfterMaxFailures$1.evaluate(TestRuleIgnoreAfterMaxFailures.java:70)
	at org.apache.lucene.util.TestRuleMarkFailure$1.evaluate(TestRuleMarkFailure.java:48)
	at com.carrotsearch.randomizedtesting.rules.StatementAdapter.evaluate(StatementAdapter.java:36)
	at com.carrotsearch.randomizedtesting.ThreadLeakControl$StatementRunner.run(ThreadLeakControl.java:358)
	at com.carrotsearch.randomizedtesting.ThreadLeakControl.forkTimeoutingTask(ThreadLeakControl.java:782)
	at com.carrotsearch.randomizedtesting.ThreadLeakControl$3.evaluate(ThreadLeakControl.java:442)
	at com.carrotsearch.randomizedtesting.RandomizedRunner.runSingleTest(RandomizedRunner.java:746)
	at com.carrotsearch.randomizedtesting.RandomizedRunner$3.evaluate(RandomizedRunner.java:648)
	at com.carrotsearch.randomizedtesting.RandomizedRunner$4.evaluate(RandomizedRunner.java:682)
	at com.carrotsearch.randomizedtesting.RandomizedRunner$5.evaluate(RandomizedRunner.java:693)
	at com.carrotsearch.randomizedtesting.rules.StatementAdapter.evaluate(StatementAdapter.java:36)
	at com.carrotsearch.randomizedtesting.rules.SystemPropertiesRestoreRule$1.evaluate(SystemPropertiesRestoreRule.java:53)
	at org.apache.lucene.util.AbstractBeforeAfterRule$1.evaluate(AbstractBeforeAfterRule.java:46)
	at org.apache.lucene.util.TestRuleStoreClassName$1.evaluate(TestRuleStoreClassName.java:42)
	at com.carrotsearch.randomizedtesting.rules.SystemPropertiesInvariantRule$1.evaluate(SystemPropertiesInvariantRule.java:55)
	at com.carrotsearch.randomizedtesting.rules.NoShadowingOrOverridesOnMethodsRule$1.evaluate(NoShadowingOrOverridesOnMethodsRule.java:39)
	at com.carrotsearch.randomizedtesting.rules.NoShadowingOrOverridesOnMethodsRule$1.evaluate(NoShadowingOrOverridesOnMethodsRule.java:39)
	at com.carrotsearch.randomizedtesting.rules.StatementAdapter.evaluate(StatementAdapter.java:36)
	at org.apache.lucene.util.TestRuleAssertionsRequired$1.evaluate(TestRuleAssertionsRequired.java:43)
	at org.apache.lucene.util.TestRuleMarkFailure$1.evaluate(TestRuleMarkFailure.java:48)
	at org.apache.lucene.util.TestRuleIgnoreAfterMaxFailures$1.evaluate(TestRuleIgnoreAfterMaxFailures.java:70)
	at org.apache.lucene.util.TestRuleIgnoreTestSuites$1.evaluate(TestRuleIgnoreTestSuites.java:55)
	at com.carrotsearch.randomizedtesting.rules.StatementAdapter.evaluate(StatementAdapter.java:36)
	at com.carrotsearch.randomizedtesting.ThreadLeakControl$StatementRunner.run(ThreadLeakControl.java:358)
	at java.lang.Thread.run(Thread.java:722)




Build Log:
[...truncated 9323 lines...]
[junit4:junit4] Suite: org.apache.solr.cloud.UnloadDistributedZkTest
[junit4:junit4]   2> 0 T2168 oas.BaseDistributedSearchTestCase.initHostContext Setting hostContext system property: /g/c
[junit4:junit4]   2> 4 T2168 oas.SolrTestCaseJ4.setUp ###Starting testDistribSearch
[junit4:junit4]   2> Creating dataDir: /mnt/ssd/jenkins/workspace/Lucene-Solr-trunk-Linux/solr/build/solr-core/test/J1/./solrtest-UnloadDistributedZkTest-1363736761294
[junit4:junit4]   2> 4 T2168 oasc.ZkTestServer.run STARTING ZK TEST SERVER
[junit4:junit4]   2> 5 T2169 oasc.ZkTestServer$ZKServerMain.runFromConfig Starting server
[junit4:junit4]   2> 5 T2169 oazs.ZooKeeperServer.setTickTime tickTime set to 1000
[junit4:junit4]   2> 6 T2169 oazs.ZooKeeperServer.setMinSessionTimeout minSessionTimeout set to -1
[junit4:junit4]   2> 6 T2169 oazs.ZooKeeperServer.setMaxSessionTimeout maxSessionTimeout set to -1
[junit4:junit4]   2> 6 T2169 oazs.NIOServerCnxnFactory.configure binding to port 0.0.0.0/0.0.0.0:0
[junit4:junit4]   2> 6 T2169 oazsp.FileTxnSnapLog.save Snapshotting: 0x0 to /mnt/ssd/jenkins/workspace/Lucene-Solr-trunk-Linux/solr/build/solr-core/test/J1/./org.apache.solr.cloud.UnloadDistributedZkTest-1363736761294/zookeeper/server1/data/version-2/snapshot.0
[junit4:junit4]   2> 105 T2168 oasc.ZkTestServer.run start zk server on port:46817
[junit4:junit4]   2> 105 T2168 oaz.ZooKeeper.<init> Initiating client connection, connectString=127.0.0.1:46817 sessionTimeout=10000 watcher=org.apache.solr.common.cloud.ConnectionManager@1501ed5f
[junit4:junit4]   2> 106 T2168 oascc.ConnectionManager.waitForConnected Waiting for client to connect to ZooKeeper
[junit4:junit4]   2> 106 T2174 oaz.ClientCnxn$SendThread.logStartConnect Opening socket connection to server localhost.localdomain/127.0.0.1:46817. Will not attempt to authenticate using SASL (access denied ("javax.security.auth.AuthPermission" "getLoginConfiguration"))
[junit4:junit4]   2> 107 T2174 oaz.ClientCnxn$SendThread.primeConnection Socket connection established to localhost.localdomain/127.0.0.1:46817, initiating session
[junit4:junit4]   2> 107 T2170 oazs.NIOServerCnxnFactory.run Accepted socket connection from /127.0.0.1:37411
[junit4:junit4]   2> 107 T2170 oazs.ZooKeeperServer.processConnectRequest Client attempting to establish new session at /127.0.0.1:37411
[junit4:junit4]   2> 108 T2172 oazsp.FileTxnLog.append Creating new log file: log.1
[junit4:junit4]   2> 742 T2172 oazs.ZooKeeperServer.finishSessionInit Established session 0x13d850b93d10000 with negotiated timeout 10000 for client /127.0.0.1:37411
[junit4:junit4]   2> 742 T2174 oaz.ClientCnxn$SendThread.onConnected Session establishment complete on server localhost.localdomain/127.0.0.1:46817, sessionid = 0x13d850b93d10000, negotiated timeout = 10000
[junit4:junit4]   2> 742 T2175 oascc.ConnectionManager.process Watcher org.apache.solr.common.cloud.ConnectionManager@1501ed5f name:ZooKeeperConnection Watcher:127.0.0.1:46817 got event WatchedEvent state:SyncConnected type:None path:null path:null type:None
[junit4:junit4]   2> 742 T2168 oascc.ConnectionManager.waitForConnected Client is connected to ZooKeeper
[junit4:junit4]   2> 743 T2168 oascc.SolrZkClient.makePath makePath: /solr
[junit4:junit4]   2> 746 T2173 oazs.PrepRequestProcessor.pRequest2Txn Processed session termination for sessionid: 0x13d850b93d10000
[junit4:junit4]   2> 747 T2175 oaz.ClientCnxn$EventThread.run EventThread shut down
[junit4:junit4]   2> 747 T2170 oazs.NIOServerCnxn.closeSock Closed socket connection for client /127.0.0.1:37411 which had sessionid 0x13d850b93d10000
[junit4:junit4]   2> 747 T2168 oaz.ZooKeeper.close Session: 0x13d850b93d10000 closed
[junit4:junit4]   2> 747 T2168 oaz.ZooKeeper.<init> Initiating client connection, connectString=127.0.0.1:46817/solr sessionTimeout=10000 watcher=org.apache.solr.common.cloud.ConnectionManager@1bc6118f
[junit4:junit4]   2> 748 T2168 oascc.ConnectionManager.waitForConnected Waiting for client to connect to ZooKeeper
[junit4:junit4]   2> 748 T2176 oaz.ClientCnxn$SendThread.logStartConnect Opening socket connection to server localhost.localdomain/127.0.0.1:46817. Will not attempt to authenticate using SASL (access denied ("javax.security.auth.AuthPermission" "getLoginConfiguration"))
[junit4:junit4]   2> 749 T2176 oaz.ClientCnxn$SendThread.primeConnection Socket connection established to localhost.localdomain/127.0.0.1:46817, initiating session
[junit4:junit4]   2> 749 T2170 oazs.NIOServerCnxnFactory.run Accepted socket connection from /127.0.0.1:37412
[junit4:junit4]   2> 749 T2170 oazs.ZooKeeperServer.processConnectRequest Client attempting to establish new session at /127.0.0.1:37412
[junit4:junit4]   2> 750 T2172 oazs.ZooKeeperServer.finishSessionInit Established session 0x13d850b93d10001 with negotiated timeout 10000 for client /127.0.0.1:37412
[junit4:junit4]   2> 750 T2176 oaz.ClientCnxn$SendThread.onConnected Session establishment complete on server localhost.localdomain/127.0.0.1:46817, sessionid = 0x13d850b93d10001, negotiated timeout = 10000
[junit4:junit4]   2> 750 T2177 oascc.ConnectionManager.process Watcher org.apache.solr.common.cloud.ConnectionManager@1bc6118f name:ZooKeeperConnection Watcher:127.0.0.1:46817/solr got event WatchedEvent state:SyncConnected type:None path:null path:null type:None
[junit4:junit4]   2> 750 T2168 oascc.ConnectionManager.waitForConnected Client is connected to ZooKeeper
[junit4:junit4]   2> 751 T2168 oascc.SolrZkClient.makePath makePath: /collections/collection1
[junit4:junit4]   2> 754 T2168 oascc.SolrZkClient.makePath makePath: /collections/collection1/shards
[junit4:junit4]   2> 756 T2168 oascc.SolrZkClient.makePath makePath: /collections/control_collection
[junit4:junit4]   2> 757 T2168 oascc.SolrZkClient.makePath makePath: /collections/control_collection/shards
[junit4:junit4]   2> 759 T2168 oasc.AbstractZkTestCase.putConfig put /mnt/ssd/jenkins/workspace/Lucene-Solr-trunk-Linux/solr/build/solr-core/test-files/solr/collection1/conf/solrconfig-tlog.xml to /configs/conf1/solrconfig.xml
[junit4:junit4]   2> 759 T2168 oascc.SolrZkClient.makePath makePath: /configs/conf1/solrconfig.xml
[junit4:junit4]   2> 762 T2168 oasc.AbstractZkTestCase.putConfig put /mnt/ssd/jenkins/workspace/Lucene-Solr-trunk-Linux/solr/build/solr-core/test-files/solr/collection1/conf/schema.xml to /configs/conf1/schema.xml
[junit4:junit4]   2> 763 T2168 oascc.SolrZkClient.makePath makePath: /configs/conf1/schema.xml
[junit4:junit4]   2> 765 T2168 oasc.AbstractZkTestCase.putConfig put /mnt/ssd/jenkins/workspace/Lucene-Solr-trunk-Linux/solr/build/solr-core/test-files/solr/collection1/conf/stopwords.txt to /configs/conf1/stopwords.txt
[junit4:junit4]   2> 766 T2168 oascc.SolrZkClient.makePath makePath: /configs/conf1/stopwords.txt
[junit4:junit4]   2> 768 T2168 oasc.AbstractZkTestCase.putConfig put /mnt/ssd/jenkins/workspace/Lucene-Solr-trunk-Linux/solr/build/solr-core/test-files/solr/collection1/conf/protwords.txt to /configs/conf1/protwords.txt
[junit4:junit4]   2> 768 T2168 oascc.SolrZkClient.makePath makePath: /configs/conf1/protwords.txt
[junit4:junit4]   2> 770 T2168 oasc.AbstractZkTestCase.putConfig put /mnt/ssd/jenkins/workspace/Lucene-Solr-trunk-Linux/solr/build/solr-core/test-files/solr/collection1/conf/currency.xml to /configs/conf1/currency.xml
[junit4:junit4]   2> 770 T2168 oascc.SolrZkClient.makePath makePath: /configs/conf1/currency.xml
[junit4:junit4]   2> 772 T2168 oasc.AbstractZkTestCase.putConfig put /mnt/ssd/jenkins/workspace/Lucene-Solr-trunk-Linux/solr/build/solr-core/test-files/solr/collection1/conf/open-exchange-rates.json to /configs/conf1/open-exchange-rates.json
[junit4:junit4]   2> 773 T2168 oascc.SolrZkClient.makePath makePath: /configs/conf1/open-exchange-rates.json
[junit4:junit4]   2> 775 T2168 oasc.AbstractZkTestCase.putConfig put /mnt/ssd/jenkins/workspace/Lucene-Solr-trunk-Linux/solr/build/solr-core/test-files/solr/collection1/conf/mapping-ISOLatin1Accent.txt to /configs/conf1/mapping-ISOLatin1Accent.txt
[junit4:junit4]   2> 775 T2168 oascc.SolrZkClient.makePath makePath: /configs/conf1/mapping-ISOLatin1Accent.txt
[junit4:junit4]   2> 777 T2168 oasc.AbstractZkTestCase.putConfig put /mnt/ssd/jenkins/workspace/Lucene-Solr-trunk-Linux/solr/build/solr-core/test-files/solr/collection1/conf/old_synonyms.txt to /configs/conf1/old_synonyms.txt
[junit4:junit4]   2> 778 T2168 oascc.SolrZkClient.makePath makePath: /configs/conf1/old_synonyms.txt
[junit4:junit4]   2> 780 T2168 oasc.AbstractZkTestCase.putConfig put /mnt/ssd/jenkins/workspace/Lucene-Solr-trunk-Linux/solr/build/solr-core/test-files/solr/collection1/conf/synonyms.txt to /configs/conf1/synonyms.txt
[junit4:junit4]   2> 780 T2168 oascc.SolrZkClient.makePath makePath: /configs/conf1/synonyms.txt
[junit4:junit4]   2> 782 T2173 oazs.PrepRequestProcessor.pRequest2Txn Processed session termination for sessionid: 0x13d850b93d10001
[junit4:junit4]   2> 782 T2168 oaz.ZooKeeper.close Session: 0x13d850b93d10001 closed
[junit4:junit4]   2> 783 T2170 oazs.NIOServerCnxn.closeSock Closed socket connection for client /127.0.0.1:37412 which had sessionid 0x13d850b93d10001
[junit4:junit4]   2> 783 T2177 oaz.ClientCnxn$EventThread.run EventThread shut down
[junit4:junit4]   2> 839 T2168 oejs.Server.doStart jetty-8.1.8.v20121106
[junit4:junit4]   2> 845 T2168 oejs.AbstractConnector.doStart Started SelectChannelConnector@127.0.0.1:45848
[junit4:junit4]   2> 846 T2168 oass.SolrDispatchFilter.init SolrDispatchFilter.init()
[junit4:junit4]   2> 846 T2168 oasc.SolrResourceLoader.locateSolrHome JNDI not configured for solr (NoInitialContextEx)
[junit4:junit4]   2> 847 T2168 oasc.SolrResourceLoader.locateSolrHome using system property solr.solr.home: /mnt/ssd/jenkins/workspace/Lucene-Solr-trunk-Linux/solr/build/solr-core/test/J1/./org.apache.solr.cloud.UnloadDistributedZkTest-controljetty-1363736762073
[junit4:junit4]   2> 847 T2168 oasc.CoreContainer$Initializer.initialize looking for solr config file: /mnt/ssd/jenkins/workspace/Lucene-Solr-trunk-Linux/solr/build/solr-core/test/J1/./org.apache.solr.cloud.UnloadDistributedZkTest-controljetty-1363736762073/solr.xml
[junit4:junit4]   2> 847 T2168 oasc.CoreContainer.<init> New CoreContainer 603222335
[junit4:junit4]   2> 848 T2168 oasc.CoreContainer.load Loading CoreContainer using Solr Home: '/mnt/ssd/jenkins/workspace/Lucene-Solr-trunk-Linux/solr/build/solr-core/test/J1/./org.apache.solr.cloud.UnloadDistributedZkTest-controljetty-1363736762073/'
[junit4:junit4]   2> 848 T2168 oasc.SolrResourceLoader.<init> new SolrResourceLoader for directory: '/mnt/ssd/jenkins/workspace/Lucene-Solr-trunk-Linux/solr/build/solr-core/test/J1/./org.apache.solr.cloud.UnloadDistributedZkTest-controljetty-1363736762073/'
[junit4:junit4]   2> 865 T2168 oashc.HttpShardHandlerFactory.getParameter Setting socketTimeout to: 120000
[junit4:junit4]   2> 866 T2168 oashc.HttpShardHandlerFactory.getParameter Setting urlScheme to: http://
[junit4:junit4]   2> 866 T2168 oashc.HttpShardHandlerFactory.getParameter Setting connTimeout to: 15000
[junit4:junit4]   2> 866 T2168 oashc.HttpShardHandlerFactory.getParameter Setting maxConnectionsPerHost to: 20
[junit4:junit4]   2> 866 T2168 oashc.HttpShardHandlerFactory.getParameter Setting corePoolSize to: 0
[junit4:junit4]   2> 867 T2168 oashc.HttpShardHandlerFactory.getParameter Setting maximumPoolSize to: 2147483647
[junit4:junit4]   2> 867 T2168 oashc.HttpShardHandlerFactory.getParameter Setting maxThreadIdleTime to: 5
[junit4:junit4]   2> 867 T2168 oashc.HttpShardHandlerFactory.getParameter Setting sizeOfQueue to: -1
[junit4:junit4]   2> 868 T2168 oashc.HttpShardHandlerFactory.getParameter Setting fairnessPolicy to: false
[junit4:junit4]   2> 868 T2168 oascsi.HttpClientUtil.createClient Creating new http client, config:maxConnectionsPerHost=20&maxConnections=10000&socketTimeout=120000&connTimeout=15000&retry=false
[junit4:junit4]   2> 873 T2168 oasc.CoreContainer.load Registering Log Listener
[junit4:junit4]   2> 882 T2168 oasc.CoreContainer.initZooKeeper Zookeeper client=127.0.0.1:46817/solr
[junit4:junit4]   2> 883 T2168 oasc.ZkController.checkChrootPath zkHost includes chroot
[junit4:junit4]   2> 883 T2168 oaz.ZooKeeper.<init> Initiating client connection, connectString=127.0.0.1:46817 sessionTimeout=60000 watcher=org.apache.solr.common.cloud.ConnectionManager@1e2d7545
[junit4:junit4]   2> 884 T2168 oascc.ConnectionManager.waitForConnected Waiting for client to connect to ZooKeeper
[junit4:junit4]   2> 884 T2187 oaz.ClientCnxn$SendThread.logStartConnect Opening socket connection to server localhost.localdomain/127.0.0.1:46817. Will not attempt to authenticate using SASL (access denied ("javax.security.auth.AuthPermission" "getLoginConfiguration"))
[junit4:junit4]   2> 885 T2187 oaz.ClientCnxn$SendThread.primeConnection Socket connection established to localhost.localdomain/127.0.0.1:46817, initiating session
[junit4:junit4]   2> 885 T2170 oazs.NIOServerCnxnFactory.run Accepted socket connection from /127.0.0.1:37413
[junit4:junit4]   2> 885 T2170 oazs.ZooKeeperServer.processConnectRequest Client attempting to establish new session at /127.0.0.1:37413
[junit4:junit4]   2> 886 T2172 oazs.ZooKeeperServer.finishSessionInit Established session 0x13d850b93d10002 with negotiated timeout 20000 for client /127.0.0.1:37413
[junit4:junit4]   2> 886 T2187 oaz.ClientCnxn$SendThread.onConnected Session establishment complete on server localhost.localdomain/127.0.0.1:46817, sessionid = 0x13d850b93d10002, negotiated timeout = 20000
[junit4:junit4]   2> 886 T2188 oascc.ConnectionManager.process Watcher org.apache.solr.common.cloud.ConnectionManager@1e2d7545 name:ZooKeeperConnection Watcher:127.0.0.1:46817 got event WatchedEvent state:SyncConnected type:None path:null path:null type:None
[junit4:junit4]   2> 887 T2168 oascc.ConnectionManager.waitForConnected Client is connected to ZooKeeper
[junit4:junit4]   2> 888 T2173 oazs.PrepRequestProcessor.pRequest2Txn Processed session termination for sessionid: 0x13d850b93d10002
[junit4:junit4]   2> 889 T2188 oaz.ClientCnxn$EventThread.run EventThread shut down
[junit4:junit4]   2> 889 T2170 oazs.NIOServerCnxn.closeSock Closed socket connection for client /127.0.0.1:37413 which had sessionid 0x13d850b93d10002
[junit4:junit4]   2> 889 T2168 oaz.ZooKeeper.close Session: 0x13d850b93d10002 closed
[junit4:junit4]   2> 889 T2168 oascsi.HttpClientUtil.createClient Creating new http client, config:maxConnections=500&maxConnectionsPerHost=16&socketTimeout=120000&connTimeout=15000
[junit4:junit4]   2> 892 T2168 oaz.ZooKeeper.<init> Initiating client connection, connectString=127.0.0.1:46817/solr sessionTimeout=30000 watcher=org.apache.solr.common.cloud.ConnectionManager@1ba478d6
[junit4:junit4]   2> 892 T2168 oascc.ConnectionManager.waitForConnected Waiting for client to connect to ZooKeeper
[junit4:junit4]   2> 893 T2189 oaz.ClientCnxn$SendThread.logStartConnect Opening socket connection to server localhost.localdomain/127.0.0.1:46817. Will not attempt to authenticate using SASL (access denied ("javax.security.auth.AuthPermission" "getLoginConfiguration"))
[junit4:junit4]   2> 893 T2189 oaz.ClientCnxn$SendThread.primeConnection Socket connection established to localhost.localdomain/127.0.0.1:46817, initiating session
[junit4:junit4]   2> 893 T2170 oazs.NIOServerCnxnFactory.run Accepted socket connection from /127.0.0.1:37414
[junit4:junit4]   2> 893 T2170 oazs.ZooKeeperServer.processConnectRequest Client attempting to establish new session at /127.0.0.1:37414
[junit4:junit4]   2> 894 T2172 oazs.ZooKeeperServer.finishSessionInit Established session 0x13d850b93d10003 with negotiated timeout 20000 for client /127.0.0.1:37414
[junit4:junit4]   2> 894 T2189 oaz.ClientCnxn$SendThread.onConnected Session establishment complete on server localhost.localdomain/127.0.0.1:46817, sessionid = 0x13d850b93d10003, negotiated timeout = 20000
[junit4:junit4]   2> 894 T2190 oascc.ConnectionManager.process Watcher org.apache.solr.common.cloud.ConnectionManager@1ba478d6 name:ZooKeeperConnection Watcher:127.0.0.1:46817/solr got event WatchedEvent state:SyncConnected type:None path:null path:null type:None
[junit4:junit4]   2> 895 T2168 oascc.ConnectionManager.waitForConnected Client is connected to ZooKeeper
[junit4:junit4]   2> 897 T2168 oascc.SolrZkClient.makePath makePath: /overseer/queue
[junit4:junit4]   2> 899 T2173 oazs.PrepRequestProcessor.pRequest Got user-level KeeperException when processing sessionid:0x13d850b93d10003 type:create cxid:0x7 zxid:0x1b txntype:-1 reqpath:n/a Error Path:/solr/overseer Error:KeeperErrorCode = NodeExists for /solr/overseer
[junit4:junit4]   2> 899 T2168 oascc.SolrZkClient.makePath makePath: /overseer/collection-queue-work
[junit4:junit4]   2> 901 T2168 oascc.SolrZkClient.makePath makePath: /live_nodes
[junit4:junit4]   2> 902 T2168 oasc.ZkController.createEphemeralLiveNode Register node as live in ZooKeeper:/live_nodes/127.0.0.1:45848_g%2Fc
[junit4:junit4]   2> 903 T2173 oazs.PrepRequestProcessor.pRequest Got user-level KeeperException when processing sessionid:0x13d850b93d10003 type:delete cxid:0x12 zxid:0x1e txntype:-1 reqpath:n/a Error Path:/solr/live_nodes/127.0.0.1:45848_g%2Fc Error:KeeperErrorCode = NoNode for /solr/live_nodes/127.0.0.1:45848_g%2Fc
[junit4:junit4]   2> 903 T2168 oascc.SolrZkClient.makePath makePath: /live_nodes/127.0.0.1:45848_g%2Fc
[junit4:junit4]   2> 906 T2168 oascc.SolrZkClient.makePath makePath: /overseer_elect/election
[junit4:junit4]   2> 908 T2173 oazs.PrepRequestProcessor.pRequest Got user-level KeeperException when processing sessionid:0x13d850b93d10003 type:delete cxid:0x20 zxid:0x23 txntype:-1 reqpath:n/a Error Path:/solr/overseer_elect/leader Error:KeeperErrorCode = NoNode for /solr/overseer_elect/leader
[junit4:junit4]   2> 909 T2168 oascc.SolrZkClient.makePath makePath: /overseer_elect/leader
[junit4:junit4]   2> 910 T2168 oasc.Overseer.start Overseer (id=89373852388360195-127.0.0.1:45848_g%2Fc-n_0000000000) starting
[junit4:junit4]   2> 911 T2173 oazs.PrepRequestProcessor.pRequest Got user-level KeeperException when processing sessionid:0x13d850b93d10003 type:create cxid:0x25 zxid:0x25 txntype:-1 reqpath:n/a Error Path:/solr/overseer Error:KeeperErrorCode = NodeExists for /solr/overseer
[junit4:junit4]   2> 911 T2173 oazs.PrepRequestProcessor.pRequest Got user-level KeeperException when processing sessionid:0x13d850b93d10003 type:create cxid:0x26 zxid:0x26 txntype:-1 reqpath:n/a Error Path:/solr/overseer Error:KeeperErrorCode = NodeExists for /solr/overseer
[junit4:junit4]   2> 912 T2173 oazs.PrepRequestProcessor.pRequest Got user-level KeeperException when processing sessionid:0x13d850b93d10003 type:create cxid:0x28 zxid:0x27 txntype:-1 reqpath:n/a Error Path:/solr/overseer Error:KeeperErrorCode = NodeExists for /solr/overseer
[junit4:junit4]   2> 913 T2168 oascc.SolrZkClient.makePath makePath: /overseer/queue-work
[junit4:junit4]   2> 914 T2173 oazs.PrepRequestProcessor.pRequest Got user-level KeeperException when processing sessionid:0x13d850b93d10003 type:create cxid:0x2e zxid:0x29 txntype:-1 reqpath:n/a Error Path:/solr/overseer Error:KeeperErrorCode = NodeExists for /solr/overseer
[junit4:junit4]   2> 915 T2192 oasc.OverseerCollectionProcessor.run Process current queue of collection creations
[junit4:junit4]   2> 915 T2168 oascc.SolrZkClient.makePath makePath: /clusterstate.json
[junit4:junit4]   2> 917 T2168 oascc.SolrZkClient.makePath makePath: /aliases.json
[junit4:junit4]   2> 918 T2168 oascc.ZkStateReader.createClusterStateWatchersAndUpdate Updating cluster state from ZooKeeper... 
[junit4:junit4]   2> 920 T2191 oasc.Overseer$ClusterStateUpdater.run Starting to work on the main queue
[junit4:junit4]   2> 921 T2168 oass.SolrDispatchFilter.init user.dir=/mnt/ssd/jenkins/workspace/Lucene-Solr-trunk-Linux/solr/build/solr-core/test/J1
[junit4:junit4]   2> 922 T2168 oass.SolrDispatchFilter.init SolrDispatchFilter.init() done
[junit4:junit4]   2> 922 T2168 oascsi.HttpClientUtil.createClient Creating new http client, config:maxConnections=128&maxConnectionsPerHost=32&followRedirects=false
[junit4:junit4]   2> 924 T2168 oascsi.HttpClientUtil.createClient Creating new http client, config:
[junit4:junit4]   2> 925 T2168 oaz.ZooKeeper.<init> Initiating client connection, connectString=127.0.0.1:46817/solr sessionTimeout=10000 watcher=org.apache.solr.common.cloud.ConnectionManager@2ed891a2
[junit4:junit4]   2> 926 T2168 oascc.ConnectionManager.waitForConnected Waiting for client to connect to ZooKeeper
[junit4:junit4]   2> 926 T2194 oaz.ClientCnxn$SendThread.logStartConnect Opening socket connection to server localhost.localdomain/127.0.0.1:46817. Will not attempt to authenticate using SASL (access denied ("javax.security.auth.AuthPermission" "getLoginConfiguration"))
[junit4:junit4]   2> 926 T2194 oaz.ClientCnxn$SendThread.primeConnection Socket connection established to localhost.localdomain/127.0.0.1:46817, initiating session
[junit4:junit4]   2> 926 T2170 oazs.NIOServerCnxnFactory.run Accepted socket connection from /127.0.0.1:37415
[junit4:junit4]   2> 926 T2170 oazs.ZooKeeperServer.processConnectRequest Client attempting to establish new session at /127.0.0.1:37415
[junit4:junit4]   2> 927 T2172 oazs.ZooKeeperServer.finishSessionInit Established session 0x13d850b93d10004 with negotiated timeout 10000 for client /127.0.0.1:37415
[junit4:junit4]   2> 927 T2194 oaz.ClientCnxn$SendThread.onConnected Session establishment complete on server localhost.localdomain/127.0.0.1:46817, sessionid = 0x13d850b93d10004, negotiated timeout = 10000
[junit4:junit4]   2> 927 T2195 oascc.ConnectionManager.process Watcher org.apache.solr.common.cloud.ConnectionManager@2ed891a2 name:ZooKeeperConnection Watcher:127.0.0.1:46817/solr got event WatchedEvent state:SyncConnected type:None path:null path:null type:None
[junit4:junit4]   2> 928 T2168 oascc.ConnectionManager.waitForConnected Client is connected to ZooKeeper
[junit4:junit4]   2> 929 T2168 oascc.ZkStateReader.createClusterStateWatchersAndUpdate Updating cluster state from ZooKeeper... 
[junit4:junit4]   2> 930 T2168 oasc.ChaosMonkey.monkeyLog monkey: init - expire sessions:true cause connection loss:true
[junit4:junit4]   2> 985 T2168 oejs.Server.doStart jetty-8.1.8.v20121106
[junit4:junit4]   2> 987 T2168 oejs.AbstractConnector.doStart Started SelectChannelConnector@127.0.0.1:49591
[junit4:junit4]   2> 988 T2168 oass.SolrDispatchFilter.init SolrDispatchFilter.init()
[junit4:junit4]   2> 988 T2168 oasc.SolrResourceLoader.locateSolrHome JNDI not configured for solr (NoInitialContextEx)
[junit4:junit4]   2> 988 T2168 oasc.SolrResourceLoader.locateSolrHome using system property solr.solr.home: /mnt/ssd/jenkins/workspace/Lucene-Solr-trunk-Linux/solr/build/solr-core/test/J1/./org.apache.solr.cloud.UnloadDistributedZkTest-jetty1-1363736762220
[junit4:junit4]   2> 989 T2168 oasc.CoreContainer$Initializer.initialize looking for solr config file: /mnt/ssd/jenkins/workspace/Lucene-Solr-trunk-Linux/solr/build/solr-core/test/J1/./org.apache.solr.cloud.UnloadDistributedZkTest-jetty1-1363736762220/solr.xml
[junit4:junit4]   2> 989 T2168 oasc.CoreContainer.<init> New CoreContainer 2033323951
[junit4:junit4]   2> 990 T2168 oasc.CoreContainer.load Loading CoreContainer using Solr Home: '/mnt/ssd/jenkins/workspace/Lucene-Solr-trunk-Linux/solr/build/solr-core/test/J1/./org.apache.solr.cloud.UnloadDistributedZkTest-jetty1-1363736762220/'
[junit4:junit4]   2> 990 T2168 oasc.SolrResourceLoader.<init> new SolrResourceLoader for directory: '/mnt/ssd/jenkins/workspace/Lucene-Solr-trunk-Linux/solr/build/solr-core/test/J1/./org.apache.solr.cloud.UnloadDistributedZkTest-jetty1-1363736762220/'
[junit4:junit4]   2> 1006 T2168 oashc.HttpShardHandlerFactory.getParameter Setting socketTimeout to: 120000
[junit4:junit4]   2> 1007 T2168 oashc.HttpShardHandlerFactory.getParameter Setting urlScheme to: http://
[junit4:junit4]   2> 1007 T2168 oashc.HttpShardHandlerFactory.getParameter Setting connTimeout to: 15000
[junit4:junit4]   2> 1008 T2168 oashc.HttpShardHandlerFactory.getParameter Setting maxConnectionsPerHost to: 20
[junit4:junit4]   2> 1008 T2168 oashc.HttpShardHandlerFactory.getParameter Setting corePoolSize to: 0
[junit4:junit4]   2> 1008 T2168 oashc.HttpShardHandlerFactory.getParameter Setting maximumPoolSize to: 2147483647
[junit4:junit4]   2> 1008 T2168 oashc.HttpShardHandlerFactory.getParameter Setting maxThreadIdleTime to: 5
[junit4:junit4]   2> 1009 T2168 oashc.HttpShardHandlerFactory.getParameter Setting sizeOfQueue to: -1
[junit4:junit4]   2> 1009 T2168 oashc.HttpShardHandlerFactory.getParameter Setting fairnessPolicy to: false
[junit4:junit4]   2> 1009 T2168 oascsi.HttpClientUtil.createClient Creating new http client, config:maxConnectionsPerHost=20&maxConnections=10000&socketTimeout=120000&connTimeout=15000&retry=false
[junit4:junit4]   2> 1015 T2168 oasc.CoreContainer.load Registering Log Listener
[junit4:junit4]   2> 1024 T2168 oasc.CoreContainer.initZooKeeper Zookeeper client=127.0.0.1:46817/solr
[junit4:junit4]   2> 1024 T2168 oasc.ZkController.checkChrootPath zkHost includes chroot
[junit4:junit4]   2> 1025 T2168 oaz.ZooKeeper.<init> Initiating client connection, connectString=127.0.0.1:46817 sessionTimeout=60000 watcher=org.apache.solr.common.cloud.ConnectionManager@37815f1f
[junit4:junit4]   2> 1026 T2168 oascc.ConnectionManager.waitForConnected Waiting for client to connect to ZooKeeper
[junit4:junit4]   2> 1026 T2205 oaz.ClientCnxn$SendThread.logStartConnect Opening socket connection to server localhost.localdomain/127.0.0.1:46817. Will not attempt to authenticate using SASL (access denied ("javax.security.auth.AuthPermission" "getLoginConfiguration"))
[junit4:junit4]   2> 1027 T2205 oaz.ClientCnxn$SendThread.primeConnection Socket connection established to localhost.localdomain/127.0.0.1:46817, initiating session
[junit4:junit4]   2> 1027 T2170 oazs.NIOServerCnxnFactory.run Accepted socket connection from /127.0.0.1:37416
[junit4:junit4]   2> 1027 T2170 oazs.ZooKeeperServer.processConnectRequest Client attempting to establish new session at /127.0.0.1:37416
[junit4:junit4]   2> 1028 T2172 oazs.ZooKeeperServer.finishSessionInit Established session 0x13d850b93d10005 with negotiated timeout 20000 for client /127.0.0.1:37416
[junit4:junit4]   2> 1028 T2205 oaz.ClientCnxn$SendThread.onConnected Session establishment complete on server localhost.localdomain/127.0.0.1:46817, sessionid = 0x13d850b93d10005, negotiated timeout = 20000
[junit4:junit4]   2> 1028 T2206 oascc.ConnectionManager.process Watcher org.apache.solr.common.cloud.ConnectionManager@37815f1f name:ZooKeeperConnection Watcher:127.0.0.1:46817 got event WatchedEvent state:SyncConnected type:None path:null path:null type:None
[junit4:junit4]   2> 1028 T2168 oascc.ConnectionManager.waitForConnected Client is connected to ZooKeeper
[junit4:junit4]   2> 1029 T2173 oazs.PrepRequestProcessor.pRequest2Txn Processed session termination for sessionid: 0x13d850b93d10005
[junit4:junit4]   2> 1031 T2206 oaz.ClientCnxn$EventThread.run EventThread shut down
[junit4:junit4]   2> 1032 T2170 oazs.NIOServerCnxn.closeSock Closed socket connection for client /127.0.0.1:37416 which had sessionid 0x13d850b93d10005
[junit4:junit4]   2> 1031 T2168 oaz.ZooKeeper.close Session: 0x13d850b93d10005 closed
[junit4:junit4]   2> 1032 T2168 oascsi.HttpClientUtil.createClient Creating new http client, config:maxConnections=500&maxConnectionsPerHost=16&socketTimeout=120000&connTimeout=15000
[junit4:junit4]   2> 1035 T2168 oaz.ZooKeeper.<init> Initiating client connection, connectString=127.0.0.1:46817/solr sessionTimeout=30000 watcher=org.apache.solr.common.cloud.ConnectionManager@1bca1fd2
[junit4:junit4]   2> 1035 T2168 oascc.ConnectionManager.waitForConnected Waiting for client to connect to ZooKeeper
[junit4:junit4]   2> 1036 T2207 oaz.ClientCnxn$SendThread.logStartConnect Opening socket connection to server localhost.localdomain/127.0.0.1:46817. Will not attempt to authenticate using SASL (access denied ("javax.security.auth.AuthPermission" "getLoginConfiguration"))
[junit4:junit4]   2> 1036 T2207 oaz.ClientCnxn$SendThread.primeConnection Socket connection established to localhost.localdomain/127.0.0.1:46817, initiating session
[junit4:junit4]   2> 1036 T2170 oazs.NIOServerCnxnFactory.run Accepted socket connection from /127.0.0.1:37417
[junit4:junit4]   2> 1036 T2170 oazs.ZooKeeperServer.processConnectRequest Client attempting to establish new session at /127.0.0.1:37417
[junit4:junit4]   2> 1038 T2172 oazs.ZooKeeperServer.finishSessionInit Established session 0x13d850b93d10006 with negotiated timeout 20000 for client /127.0.0.1:37417
[junit4:junit4]   2> 1038 T2207 oaz.ClientCnxn$SendThread.onConnected Session establishment complete on server localhost.localdomain/127.0.0.1:46817, sessionid = 0x13d850b93d10006, negotiated timeout = 20000
[junit4:junit4]   2> 1038 T2208 oascc.ConnectionManager.process Watcher org.apache.solr.common.cloud.ConnectionManager@1bca1fd2 name:ZooKeeperConnection Watcher:127.0.0.1:46817/solr got event WatchedEvent state:SyncConnected type:None path:null path:null type:None
[junit4:junit4]   2> 1039 T2168 oascc.ConnectionManager.waitForConnected Client is connected to ZooKeeper
[junit4:junit4]   2> 1040 T2173 oazs.PrepRequestProcessor.pRequest Got user-level KeeperException when processing sessionid:0x13d850b93d10006 type:create cxid:0x1 zxid:0x30 txntype:-1 reqpath:n/a Error Path:/solr/overseer Error:KeeperErrorCode = NodeExists for /solr/overseer
[junit4:junit4]   2> 1041 T2173 oazs.PrepRequestProcessor.pRequest Got user-level KeeperException when processing sessionid:0x13d850b93d10006 type:create cxid:0x3 zxid:0x31 txntype:-1 reqpath:n/a Error Path:/solr/overseer Error:KeeperErrorCode = NodeExists for /solr/overseer
[junit4:junit4]   2> 1042 T2168 oascc.ZkStateReader.createClusterStateWatchersAndUpdate Updating cluster state from ZooKeeper... 
[junit4:junit4]   2> 2044 T2168 oasc.ZkController.createEphemeralLiveNode Register node as live in ZooKeeper:/live_nodes/127.0.0.1:49591_g%2Fc
[junit4:junit4]   2> 2045 T2173 oazs.PrepRequestProcessor.pRequest Got user-level KeeperException when processing sessionid:0x13d850b93d10006 type:delete cxid:0xd zxid:0x32 txntype:-1 reqpath:n/a Error Path:/solr/live_nodes/127.0.0.1:49591_g%2Fc Error:KeeperErrorCode = NoNode for /solr/live_nodes/127.0.0.1:49591_g%2Fc
[junit4:junit4]   2> 2046 T2168 oascc.SolrZkClient.makePath makePath: /live_nodes/127.0.0.1:49591_g%2Fc
[junit4:junit4]   2> 2050 T2190 oascc.ZkStateReader$3.process Updating live nodes... (2)
[junit4:junit4]   2> 2050 T2195 oascc.ZkStateReader$3.process Updating live nodes... (2)
[junit4:junit4]   2> 2050 T2208 oascc.ZkStateReader$3.process Updating live nodes... (2)
[junit4:junit4]   2> 2053 T2168 oass.SolrDispatchFilter.init user.dir=/mnt/ssd/jenkins/workspace/Lucene-Solr-trunk-Linux/solr/build/solr-core/test/J1
[junit4:junit4]   2> 2053 T2168 oass.SolrDispatchFilter.init SolrDispatchFilter.init() done
[junit4:junit4]   2> 2054 T2168 oascsi.HttpClientUtil.createClient Creating new http client, config:maxConnections=128&maxConnectionsPerHost=32&followRedirects=false
[junit4:junit4]   2> 2110 T2168 oejs.Server.doStart jetty-8.1.8.v20121106
[junit4:junit4]   2> 2113 T2168 oejs.AbstractConnector.doStart Started SelectChannelConnector@127.0.0.1:49774
[junit4:junit4]   2> 2113 T2168 oass.SolrDispatchFilter.init SolrDispatchFilter.init()
[junit4:junit4]   2> 2114 T2168 oasc.SolrResourceLoader.locateSolrHome JNDI not configured for solr (NoInitialContextEx)
[junit4:junit4]   2> 2114 T2168 oasc.SolrResourceLoader.locateSolrHome using system property solr.solr.home: /mnt/ssd/jenkins/workspace/Lucene-Solr-trunk-Linux/solr/build/solr-core/test/J1/./org.apache.solr.cloud.UnloadDistributedZkTest-jetty2-1363736763346
[junit4:junit4]   2> 2114 T2168 oasc.CoreContainer$Initializer.initialize looking for solr config file: /mnt/ssd/jenkins/workspace/Lucene-Solr-trunk-Linux/solr/build/solr-core/test/J1/./org.apache.solr.cloud.UnloadDistributedZkTest-jetty2-1363736763346/solr.xml
[junit4:junit4]   2> 2115 T2168 oasc.CoreContainer.<init> New CoreContainer 229468774
[junit4:junit4]   2> 2115 T2168 oasc.CoreContainer.load Loading CoreContainer using Solr Home: '/mnt/ssd/jenkins/workspace/Lucene-Solr-trunk-Linux/solr/build/solr-core/test/J1/./org.apache.solr.cloud.UnloadDistributedZkTest-jetty2-1363736763346/'
[junit4:junit4]   2> 2115 T2168 oasc.SolrResourceLoader.<init> new SolrResourceLoader for directory: '/mnt/ssd/jenkins/workspace/Lucene-Solr-trunk-Linux/solr/build/solr-core/test/J1/./org.apache.solr.cloud.UnloadDistributedZkTest-jetty2-1363736763346/'
[junit4:junit4]   2> 2132 T2168 oashc.HttpShardHandlerFactory.getParameter Setting socketTimeout to: 120000
[junit4:junit4]   2> 2133 T2168 oashc.HttpShardHandlerFactory.getParameter Setting urlScheme to: http://
[junit4:junit4]   2> 2133 T2168 oashc.HttpShardHandlerFactory.getParameter Setting connTimeout to: 15000
[junit4:junit4]   2> 2133 T2168 oashc.HttpShardHandlerFactory.getParameter Setting maxConnectionsPerHost to: 20
[junit4:junit4]   2> 2133 T2168 oashc.HttpShardHandlerFactory.getParameter Setting corePoolSize to: 0
[junit4:junit4]   2> 2134 T2168 oashc.HttpShardHandlerFactory.getParameter Setting maximumPoolSize to: 2147483647
[junit4:junit4]   2> 2134 T2168 oashc.HttpShardHandlerFactory.getParameter Setting maxThreadIdleTime to: 5
[junit4:junit4]   2> 2134 T2168 oashc.HttpShardHandlerFactory.getParameter Setting sizeOfQueue to: -1
[junit4:junit4]   2> 2135 T2168 oashc.HttpShardHandlerFactory.getParameter Setting fairnessPolicy to: false
[junit4:junit4]   2> 2135 T2168 oascsi.HttpClientUtil.createClient Creating new http client, config:maxConnectionsPerHost=20&maxConnections=10000&socketTimeout=120000&connTimeout=15000&retry=false
[junit4:junit4]   2> 2140 T2168 oasc.CoreContainer.load Registering Log Listener
[junit4:junit4]   2> 2149 T2168 oasc.CoreContainer.initZooKeeper Zookeeper client=127.0.0.1:46817/solr
[junit4:junit4]   2> 2150 T2168 oasc.ZkController.checkChrootPath zkHost includes chroot
[junit4:junit4]   2> 2150 T2168 oaz.ZooKeeper.<init> Initiating client connection, connectString=127.0.0.1:46817 sessionTimeout=60000 watcher=org.apache.solr.common.cloud.ConnectionManager@6ba3722d
[junit4:junit4]   2> 2151 T2168 oascc.ConnectionManager.waitForConnected Waiting for client to connect to ZooKeeper
[junit4:junit4]   2> 2151 T2219 oaz.ClientCnxn$SendThread.logStartConnect Opening socket connection to server localhost.localdomain/127.0.0.1:46817. Will not attempt to authenticate using SASL (access denied ("javax.security.auth.AuthPermission" "getLoginConfiguration"))
[junit4:junit4]   2> 2152 T2219 oaz.ClientCnxn$SendThread.primeConnection Socket connection established to localhost.localdomain/127.0.0.1:46817, initiating session
[junit4:junit4]   2> 2152 T2170 oazs.NIOServerCnxnFactory.run Accepted socket connection from /127.0.0.1:37418
[junit4:junit4]   2> 2152 T2170 oazs.ZooKeeperServer.processConnectRequest Client attempting to establish new session at /127.0.0.1:37418
[junit4:junit4]   2> 2153 T2172 oazs.ZooKeeperServer.finishSessionInit Established session 0x13d850b93d10007 with negotiated timeout 20000 for client /127.0.0.1:37418
[junit4:junit4]   2> 2153 T2219 oaz.ClientCnxn$SendThread.onConnected Session establishment complete on server localhost.localdomain/127.0.0.1:46817, sessionid = 0x13d850b93d10007, negotiated timeout = 20000
[junit4:junit4]   2> 2153 T2220 oascc.ConnectionManager.process Watcher org.apache.solr.common.cloud.ConnectionManager@6ba3722d name:ZooKeeperConnection Watcher:127.0.0.1:46817 got event WatchedEvent state:SyncConnected type:None path:null path:null type:None
[junit4:junit4]   2> 2153 T2168 oascc.ConnectionManager.waitForConnected Client is connected to ZooKeeper
[junit4:junit4]   2> 2155 T2173 oazs.PrepRequestProcessor.pRequest2Txn Processed session termination for sessionid: 0x13d850b93d10007
[junit4:junit4]   2> 2155 T2220 oaz.ClientCnxn$EventThread.run EventThread shut down
[junit4:junit4]   2> 2155 T2170 oazs.NIOServerCnxn.closeSock Closed socket connection for client /127.0.0.1:37418 which had sessionid 0x13d850b93d10007
[junit4:junit4]   2> 2155 T2168 oaz.ZooKeeper.close Session: 0x13d850b93d10007 closed
[junit4:junit4]   2> 2156 T2168 oascsi.HttpClientUtil.createClient Creating new http client, config:maxConnections=500&maxConnectionsPerHost=16&socketTimeout=120000&connTimeout=15000
[junit4:junit4]   2> 2158 T2168 oaz.ZooKeeper.<init> Initiating client connection, connectString=127.0.0.1:46817/solr sessionTimeout=30000 watcher=org.apache.solr.common.cloud.ConnectionManager@300fa70c
[junit4:junit4]   2> 2159 T2168 oascc.ConnectionManager.waitForConnected Waiting for client to connect to ZooKeeper
[junit4:junit4]   2> 2159 T2221 oaz.ClientCnxn$SendThread.logStartConnect Opening socket connection to server localhost.localdomain/127.0.0.1:46817. Will not attempt to authenticate using SASL (access denied ("javax.security.auth.AuthPermission" "getLoginConfiguration"))
[junit4:junit4]   2> 2160 T2221 oaz.ClientCnxn$SendThread.primeConnection Socket connection established to localhost.localdomain/127.0.0.1:46817, initiating session
[junit4:junit4]   2> 2160 T2170 oazs.NIOServerCnxnFactory.run Accepted socket connection from /127.0.0.1:37419
[junit4:junit4]   2> 2160 T2170 oazs.ZooKeeperServer.processConnectRequest Client attempting to establish new session at /127.0.0.1:37419
[junit4:junit4]   2> 2161 T2172 oazs.ZooKeeperServer.finishSessionInit Established session 0x13d850b93d10008 with negotiated timeout 20000 for client /127.0.0.1:37419
[junit4:junit4]   2> 2161 T2221 oaz.ClientCnxn$SendThread.onConnected Session establishment complete on server localhost.localdomain/127.0.0.1:46817, sessionid = 0x13d850b93d10008, negotiated timeout = 20000
[junit4:junit4]   2> 2161 T2222 oascc.ConnectionManager.process Watcher org.apache.solr.common.cloud.ConnectionManager@300fa70c name:ZooKeeperConnection Watcher:127.0.0.1:46817/solr got event WatchedEvent state:SyncConnected type:None path:null path:null type:None
[junit4:junit4]   2> 2161 T2168 oascc.ConnectionManager.waitForConnected Client is connected to ZooKeeper
[junit4:junit4]   2> 2162 T2173 oazs.PrepRequestProcessor.pRequest Got user-level KeeperException when processing sessionid:0x13d850b93d10008 type:create cxid:0x1 zxid:0x38 txntype:-1 reqpath:n/a Error Path:/solr/overseer Error:KeeperErrorCode = NodeExists for /solr/overseer
[junit4:junit4]   2> 2163 T2173 oazs.PrepRequestProcessor.pRequest Got user-level KeeperException when processing sessionid:0x13d850b93d10008 type:create cxid:0x3 zxid:0x39 txntype:-1 reqpath:n/a Error Path:/solr/overseer Error:KeeperErrorCode = NodeExists for /solr/overseer
[junit4:junit4]   2> 2165 T2168 oascc.ZkStateReader.createClusterStateWatchersAndUpdate Updating cluster state from ZooKeeper... 
[junit4:junit4]   2> 3167 T2168 oasc.ZkController.createEphemeralLiveNode Register node as live in ZooKeeper:/live_nodes/127.0.0.1:49774_g%2Fc
[junit4:junit4]   2> 3168 T2173 oazs.PrepRequestProcessor.pRequest Got user-level KeeperException when processing sessionid:0x13d850b93d10008 type:delete cxid:0xd zxid:0x3a txntype:-1 reqpath:n/a Error Path:/solr/live_nodes/127.0.0.1:49774_g%2Fc Error:KeeperErrorCode = NoNode for /solr/live_nodes/127.0.0.1:49774_g%2Fc
[junit4:junit4]   2> 3169 T2168 oascc.SolrZkClient.makePath makePath: /live_nodes/127.0.0.1:49774_g%2Fc
[junit4:junit4]   2> 3172 T2195 oascc.ZkStateReader$3.process Updating live nodes... (3)
[junit4:junit4]   2> 3172 T2208 oascc.ZkStateReader$3.process Updating live nodes... (3)
[junit4:junit4]   2> 3172 T2190 oascc.ZkStateReader$3.process Updating live nodes... (3)
[junit4:junit4]   2> 3172 T2222 oascc.ZkStateReader$3.process Updating live nodes... (3)
[junit4:junit4]   2> 3177 T2168 oass.SolrDispatchFilter.init user.dir=/mnt/ssd/jenkins/workspace/Lucene-Solr-trunk-Linux/solr/build/solr-core/test/J1
[junit4:junit4]   2> 3177 T2168 oass.SolrDispatchFilter.init SolrDispatchFilter.init() done
[junit4:junit4]   2> 3178 T2168 oascsi.HttpClientUtil.createClient Creating new http client, config:maxConnections=128&maxConnectionsPerHost=32&followRedirects=false
[junit4:junit4]   2> 3242 T2168 oejs.Server.doStart jetty-8.1.8.v20121106
[junit4:junit4]   2> 3245 T2168 oejs.AbstractConnector.doStart Started SelectChannelConnector@127.0.0.1:44738
[junit4:junit4]   2> 3246 T2168 oass.SolrDispatchFilter.init SolrDispatchFilter.init()
[junit4:junit4]   2> 3246 T2168 oasc.SolrResourceLoader.locateSolrHome JNDI not configured for solr (NoInitialContextEx)
[junit4:junit4]   2> 3246 T2168 oasc.SolrResourceLoader.locateSolrHome using system property solr.solr.home: /mnt/ssd/jenkins/workspace/Lucene-Solr-trunk-Linux/solr/build/solr-core/test/J1/./org.apache.solr.cloud.UnloadDistributedZkTest-jetty3-1363736764471
[junit4:junit4]   2> 3247 T2168 oasc.CoreContainer$Initializer.initialize looking for solr config file: /mnt/ssd/jenkins/workspace/Lucene-Solr-trunk-Linux/solr/build/solr-core/test/J1/./org.apache.solr.cloud.UnloadDistributedZkTest-jetty3-1363736764471/solr.xml
[junit4:junit4]   2> 3247 T2168 oasc.CoreContainer.<init> New CoreContainer 700257627
[junit4:junit4]   2> 3247 T2168 oasc.CoreContainer.load Loading CoreContainer using Solr Home: '/mnt/ssd/jenkins/workspace/Lucene-Solr-trunk-Linux/solr/build/solr-core/test/J1/./org.apache.solr.cloud.UnloadDistributedZkTest-jetty3-1363736764471/'
[junit4:junit4]   2> 3248 T2168 oasc.SolrResourceLoader.<init> new SolrResourceLoader for directory: '/mnt/ssd/jenkins/workspace/Lucene-Solr-trunk-Linux/solr/build/solr-core/test/J1/./org.apache.solr.cloud.UnloadDistributedZkTest-jetty3-1363736764471/'
[junit4:junit4]   2> 3266 T2168 oashc.HttpShardHandlerFactory.getParameter Setting socketTimeout to: 120000
[junit4:junit4]   2> 3266 T2168 oashc.HttpShardHandlerFactory.getParameter Setting urlScheme to: http://
[junit4:junit4]   2> 3267 T2168 oashc.HttpShardHandlerFactory.getParameter Setting connTimeout to: 15000
[junit4:junit4]   2> 3267 T2168 oashc.HttpShardHandlerFactory.getParameter Setting maxConnectionsPerHost to: 20
[junit4:junit4]   2> 3267 T2168 oashc.HttpShardHandlerFactory.getParameter Setting corePoolSize to: 0
[junit4:junit4]   2> 3268 T2168 oashc.HttpShardHandlerFactory.getParameter Setting maximumPoolSize to: 2147483647
[junit4:junit4]   2> 3268 T2168 oashc.HttpShardHandlerFactory.getParameter Setting maxThreadIdleTime to: 5
[junit4:junit4]   2> 3268 T2168 oashc.HttpShardHandlerFactory.getParameter Setting sizeOfQueue to: -1
[junit4:junit4]   2> 3269 T2168 oashc.HttpShardHandlerFactory.getParameter Setting fairnessPolicy to: false
[junit4:junit4]   2> 3269 T2168 oascsi.HttpClientUtil.createClient Creating new http client, config:maxConnectionsPerHost=20&maxConnections=10000&socketTimeout=120000&connTimeout=15000&retry=false
[junit4:junit4]   2> 3275 T2168 oasc.CoreContainer.load Registering Log Listener
[junit4:junit4]   2> 3285 T2168 oasc.CoreContainer.initZooKeeper Zookeeper client=127.0.0.1:46817/solr
[junit4:junit4]   2> 3285 T2168 oasc.ZkController.checkChrootPath zkHost includes chroot
[junit4:junit4]   2> 3286 T2168 oaz.ZooKeeper.<init> Initiating client connection, connectString=127.0.0.1:46817 sessionTimeout=60000 watcher=org.apache.solr.common.cloud.ConnectionManager@411a71cb
[junit4:junit4]   2> 3286 T2168 oascc.ConnectionManager.waitForConnected Waiting for client to connect to ZooKeeper
[junit4:junit4]   2> 3287 T2233 oaz.ClientCnxn$SendThread.logStartConnect Opening socket connection to server localhost.localdomain/127.0.0.1:46817. Will not attempt to authenticate using SASL (access denied ("javax.security.auth.AuthPermission" "getLoginConfiguration"))
[junit4:junit4]   2> 3287 T2233 oaz.ClientCnxn$SendThread.primeConnection Socket connection established to localhost.localdomain/127.0.0.1:46817, initiating session
[junit4:junit4]   2> 3287 T2170 oazs.NIOServerCnxnFactory.run Accepted socket connection from /127.0.0.1:37420
[junit4:junit4]   2> 3288 T2170 oazs.ZooKeeperServer.processConnectRequest Client attempting to establish new session at /127.0.0.1:37420
[junit4:junit4]   2> 3288 T2172 oazs.ZooKeeperServer.finishSessionInit Established session 0x13d850b93d10009 with negotiated timeout 20000 for client /127.0.0.1:37420
[junit4:junit4]   2> 3289 T2233 oaz.ClientCnxn$SendThread.onConnected Session establishment complete on server localhost.localdomain/127.0.0.1:46817, sessionid = 0x13d850b93d10009, negotiated timeout = 20000
[junit4:junit4]   2> 3289 T2234 oascc.ConnectionManager.process Watcher org.apache.solr.common.cloud.ConnectionManager@411a71cb name:ZooKeeperConnection Watcher:127.0.0.1:46817 got event WatchedEvent state:SyncConnected type:None path:null path:null type:None
[junit4:junit4]   2> 3289 T2168 oascc.ConnectionManager.waitForConnected Client is connected to ZooKeeper
[junit4:junit4]   2> 3290 T2173 oazs.PrepRequestProcessor.pRequest2Txn Processed session termination for sessionid: 0x13d850b93d10009
[junit4:junit4]   2> 3291 T2234 oaz.ClientCnxn$EventThread.run EventThread shut down
[junit4:junit4]   2> 3291 T2170 oazs.NIOServerCnxn.closeSock Closed socket connection for client /127.0.0.1:37420 which had sessionid 0x13d850b93d10009
[junit4:junit4]   2> 3291 T2168 oaz.ZooKeeper.close Session: 0x13d850b93d10009 closed
[junit4:junit4]   2> 3292 T2168 oascsi.HttpClientUtil.createClient Creating new http client, config:maxConnections=500&maxConnectionsPerHost=16&socketTimeout=120000&connTimeout=15000
[junit4:junit4]   2> 3294 T2168 oaz.ZooKeeper.<init> Initiating client connection, connectString=127.0.0.1:46817/solr sessionTimeout=30000 watcher=org.apache.solr.common.cloud.ConnectionManager@5baf0828
[junit4:junit4]   2> 3295 T2168 oascc.ConnectionManager.waitForConnected Waiting for client to connect to ZooKeeper
[junit4:junit4]   2> 3295 T2235 oaz.ClientCnxn$SendThread.logStartConnect Opening socket connection to server localhost.localdomain/127.0.0.1:46817. Will not attempt to authenticate using SASL (access denied ("javax.security.auth.AuthPermission" "getLoginConfiguration"))
[junit4:junit4]   2> 3296 T2235 oaz.ClientCnxn$SendThread.primeConnection Socket connection established to localhost.localdomain/127.0.0.1:46817, initiating session
[junit4:junit4]   2> 3296 T2170 oazs.NIOServerCnxnFactory.run Accepted socket connection from /127.0.0.1:37421
[junit4:junit4]   2> 3296 T2170 oazs.ZooKeeperServer.processConnectRequest Client attempting to establish new session at /127.0.0.1:37421
[junit4:junit4]   2> 3297 T2172 oazs.ZooKeeperServer.finishSessionInit Established session 0x13d850b93d1000a with negotiated timeout 20000 for client /127.0.0.1:37421
[junit4:junit4]   2> 3297 T2235 oaz.ClientCnxn$SendThread.onConnected Session establishment complete on server localhost.localdomain/127.0.0.1:46817, sessionid = 0x13d850b93d1000a, negotiated timeout = 20000
[junit4:junit4]   2> 3297 T2236 oascc.ConnectionManager.process Watcher org.apache.solr.common.cloud.ConnectionManager@5baf0828 name:ZooKeeperConnection Watcher:127.0.0.1:46817/solr got event WatchedEvent state:SyncConnected type:None path:null path:null type:None
[junit4:junit4]   2> 3297 T2168 oascc.ConnectionManager.waitForConnected Client is connected to ZooKeeper
[junit4:junit4]   2> 3298 T2173 oazs.PrepRequestProcessor.pRequest Got user-level KeeperException when processing sessionid:0x13d850b93d1000a type:create cxid:0x1 zxid:0x40 txntype:-1 reqpath:n/a Error Path:/solr/overseer Error:KeeperErrorCode = NodeExists for /solr/overseer
[junit4:junit4]   2> 3299 T2173 oazs.PrepRequestProcessor.pRequest Got user-level KeeperException when processing sessionid:0x13d850b93d1000a type:create cxid:0x3 zxid:0x41 txntype:-1 reqpath:n/a Error Path:/solr/overseer Error:KeeperErrorCode = NodeExists for /solr/overseer
[junit4:junit4]   2> 3300 T2168 oascc.ZkStateReader.createClusterStateWatchersAndUpdate Updating cluster state from ZooKeeper... 
[junit4:junit4]   2> 4303 T2168 oasc.ZkController.createEphemeralLiveNode Register node as live in ZooKeeper:/live_nodes/127.0.0.1:44738_g%2Fc
[junit4:junit4]   2> 4304 T2173 oazs.PrepRequestProcessor.pRequest Got user-level KeeperException when processing sessionid:0x13d850b93d1000a type:delete cxid:0xd zxid:0x42 txntype:-1 reqpath:n/a Error Path:/solr/live_nodes/127.0.0.1:44738_g%2Fc Error:KeeperErrorCode = NoNode for /solr/live_nodes/127.0.0.1:44738_g%2Fc
[junit4:junit4]   2> 4304 T2168 oascc.SolrZkClient.makePath makePath: /live_nodes/127.0.0.1:44738_g%2Fc
[junit4:junit4]   2> 4308 T2208 oascc.ZkStateReader$3.process Updating live nodes... (4)
[junit4:junit4]   2> 4308 T2195 oascc.ZkStateReader$3.process Updating live nodes... (4)
[junit4:junit4]   2> 4308 T2222 oascc.ZkStateReader$3.process Updating live nodes... (4)
[junit4:junit4]   2> 4308 T2190 oascc.ZkStateReader$3.process Updating live nodes... (4)
[junit4:junit4]   2> 4308 T2236 oascc.ZkStateReader$3.process Updating live nodes... (4)
[junit4:junit4]   2> 4312 T2168 oass.SolrDispatchFilter.init user.dir=/mnt/ssd/jenkins/workspace/Lucene-Solr-trunk-Linux/solr/build/solr-core/test/J1
[junit4:junit4]   2> 4312 T2168 oass.SolrDispatchFilter.init SolrDispatchFilter.init() done
[junit4:junit4]   2> 4313 T2168 oascsi.HttpClientUtil.createClient Creating new http client, config:maxConnections=128&maxConnectionsPerHost=32&followRedirects=false
[junit4:junit4]   2> 4369 T2168 oejs.Server.doStart jetty-8.1.8.v20121106
[junit4:junit4]   2> 4372 T2168 oejs.AbstractConnector.doStart Started SelectChannelConnector@127.0.0.1:50446
[junit4:junit4]   2> 4372 T2168 oass.SolrDispatchFilter.init SolrDispatchFilter.init()
[junit4:junit4]   2> 4373 T2168 oasc.SolrResourceLoader.locateSolrHome JNDI not configured for solr (NoInitialContextEx)
[junit4:junit4]   2> 4373 T2168 oasc.SolrResourceLoader.locateSolrHome using system property solr.solr.home: /mnt/ssd/jenkins/workspace/Lucene-Solr-trunk-Linux/solr/build/solr-core/test/J1/./org.apache.solr.cloud.UnloadDistributedZkTest-jetty4-1363736765605
[junit4:junit4]   2> 4373 T2168 oasc.CoreContainer$Initializer.initialize looking for solr config file: /mnt/ssd/jenkins/workspace/Lucene-Solr-trunk-Linux/solr/build/solr-core/test/J1/./org.apache.solr.cloud.UnloadDistributedZkTest-jetty4-1363736765605/solr.xml
[junit4:junit4]   2> 4373 T2168 oasc.CoreContainer.<init> New CoreContainer 800699554
[junit4:junit4]   2> 4374 T2168 oasc.CoreContainer.load Loading CoreContainer using Solr Home: '/mnt/ssd/jenkins/workspace/Lucene-Solr-trunk-Linux/solr/build/solr-core/test/J1/./org.apache.solr.cloud.UnloadDistributedZkTest-jetty4-1363736765605/'
[junit4:junit4]   2> 4374 T2168 oasc.SolrResourceLoader.<init> new SolrResourceLoader for directory: '/mnt/ssd/jenkins/workspace/Lucene-Solr-trunk-Linux/solr/build/solr-core/test/J1/./org.apache.solr.cloud.UnloadDistributedZkTest-jetty4-1363736765605/'
[junit4:junit4]   2> 4391 T2168 oashc.HttpShardHandlerFactory.getParameter Setting socketTimeout to: 120000
[junit4:junit4]   2> 4392 T2168 oashc.HttpShardHandlerFactory.getParameter Setting urlScheme to: http://
[junit4:junit4]   2> 4392 T2168 oashc.HttpShardHandlerFactory.getParameter Setting connTimeout to: 15000
[junit4:junit4]   2> 4392 T2168 oashc.HttpShardHandlerFactory.getParameter Setting maxConnectionsPerHost to: 20
[junit4:junit4]   2> 4392 T2168 oashc.HttpShardHandlerFactory.getParameter Setting corePoolSize to: 0
[junit4:junit4]   2> 4393 T2168 oashc.HttpShardHandlerFactory.getParameter Setting maximumPoolSize to: 2147483647
[junit4:junit4]   2> 4393 T2168 oashc.HttpShardHandlerFactory.getParameter Setting maxThreadIdleTime to: 5
[junit4:junit4]   2> 4393 T2168 oashc.HttpShardHandlerFactory.getParameter Setting sizeOfQueue to: -1
[junit4:junit4]   2> 4394 T2168 oashc.HttpShardHandlerFactory.getParameter Setting fairnessPolicy to: false
[junit4:junit4]   2> 4394 T2168 oascsi.HttpClientUtil.createClient Creating new http client, config:maxConnectionsPerHost=20&maxConnections=10000&socketTimeout=120000&connTimeout=15000&retry=false
[junit4:junit4]   2> 4399 T2168 oasc.CoreContainer.load Registering Log Listener
[junit4:junit4]   2> 4408 T2168 oasc.CoreContainer.initZooKeeper Zookeeper client=127.0.0.1:46817/solr
[junit4:junit4]   2> 4409 T2168 oasc.ZkController.checkChrootPath zkHost includes chroot
[junit4:junit4]   2> 4409 T2168 oaz.ZooKeeper.<init> Initiating client connection, connectString=127.0.0.1:46817 sessionTimeout=60000 watcher=org.apache.solr.common.cloud.ConnectionManager@220ac40a
[junit4:junit4]   2> 4410 T2168 oascc.ConnectionManager.waitForConnected Waiting for client to connect to ZooKeeper
[junit4:junit4]   2> 4410 T2247 oaz.ClientCnxn$SendThread.logStartConnect Opening socket connection to server localhost.localdomain/127.0.0.1:46817. Will not attempt to authenticate using SASL (access denied ("javax.security.auth.AuthPermission" "getLoginConfiguration"))
[junit4:junit4]   2> 4411 T2247 oaz.ClientCnxn$SendThread.primeConnection Socket connection established to localhost.localdomain/127.0.0.1:46817, initiating session
[junit4:junit4]   2> 4411 T2170 oazs.NIOServerCnxnFactory.run Accepted socket connection from /127.0.0.1:37422
[junit4:junit4]   2> 4411 T2170 oazs.ZooKeeperServer.processConnectRequest Client attempting to establish new session at /127.0.0.1:37422
[junit4:junit4]   2> 4412 T2172 oazs.ZooKeeperServer.finishSessionInit Established session 0x13d850b93d1000b with negotiated timeout 20000 for client /127.0.0.1:37422
[junit4:junit4]   2> 4412 T2247 oaz.ClientCnxn$SendThread.onConnected Session establishment complete on server localhost.localdomain/127.0.0.1:46817, sessionid = 0x13d850b93d1000b, negotiated timeout = 20000
[junit4:junit4]   2> 4412 T2248 oascc.ConnectionManager.process Watcher org.apache.solr.common.cloud.ConnectionManager@220ac40a name:ZooKeeperConnection Watcher:127.0.0.1:46817 got event WatchedEvent state:SyncConnected type:None path:null path:null type:None
[junit4:junit4]   2> 4413 T2168 oascc.ConnectionManager.waitForConnected Client is connected to ZooKeeper
[junit4:junit4]   2> 4414 T2173 oazs.PrepRequestProcessor.pRequest2Txn Processed session termination for sessionid: 0x13d850b93d1000b
[junit4:junit4]   2> 4414 T2248 oaz.ClientCnxn$EventThread.run EventThread shut down
[junit4:junit4]   2> 4414 T2170 oazs.NIOServerCnxn.closeSock Closed socket connection for client /127.0.0.1:37422 which had sessionid 0x13d850b93d1000b
[junit4:junit4]   2> 4414 T2168 oaz.ZooKeeper.close Session: 0x13d850b93d1000b closed
[junit4:junit4]   2> 4415 T2168 oascsi.HttpClientUtil.createClient Creating new http client, config:maxConnections=500&maxConnectionsPerHost=16&socketTimeout=120000&connTimeout=15000
[junit4:junit4]   2> 4417 T2168 oaz.ZooKeeper.<init> Initiating client connection, connectString=127.0.0.1:46817/solr sessionTimeout=30000 watcher=org.apache.solr.common.cloud.ConnectionManager@5b430a23
[junit4:junit4]   2> 4418 T2168 oascc.ConnectionManager.waitForConnected Waiting for client to connect to ZooKeeper
[junit4:junit4]   2> 4418 T2249 oaz.ClientCnxn$SendThread.logStartConnect Opening socket connection to server localhost.localdomain/127.0.0.1:46817. Will not attempt to authenticate using SASL (access denied ("javax.security.auth.AuthPermission" "getLoginConfiguration"))
[junit4:junit4]   2> 4419 T2249 oaz.ClientCnxn$SendThread.primeConnection Socket connection established to localhost.localdomain/127.0.0.1:46817, initiating session
[junit4:junit4]   2> 4419 T2170 oazs.NIOServerCnxnFactory.run Accepted socket connection from /127.0.0.1:37423
[junit4:junit4]   2> 4419 T2170 oazs.ZooKeeperServer.processConnectRequest Client attempting to establish new session at /127.0.0.1:37423
[junit4:junit4]   2> 4420 T2172 oazs.ZooKeeperServer.finishSessionInit Established session 0x13d850b93d1000c with negotiated timeout 20000 for client /127.0.0.1:37423
[junit4:junit4]   2> 4420 T2249 oaz.ClientCnxn$SendThread.onConnected Session establishment complete on server localhost.localdomain/127.0.0.1:46817, sessionid = 0x13d850b93d1000c, negotiated timeout = 20000
[junit4:junit4]   2> 4420 T2250 oascc.ConnectionManager.process Watcher org.apache.solr.common.cloud.ConnectionManager@5b430a23 name:ZooKeeperConnection Watcher:127.0.0.1:46817/solr got event WatchedEvent state:SyncConnected type:None path:null path:null type:None
[junit4:junit4]   2> 4420 T2168 oascc.ConnectionManager.waitForConnected Client is connected to ZooKeeper
[junit4:junit4]   2> 4421 T2173 oazs.PrepRequestProcessor.pRequest Got user-level KeeperException when processing sessionid:0x13d850b93d1000c type:create cxid:0x1 zxid:0x48 txntype:-1 reqpath:n/a Error Path:/solr/overseer Error:KeeperErrorCode = NodeExists for /solr/overseer
[junit4:junit4]   2> 4422 T2173 oazs.PrepRequestProcessor.pRequest Got user-level KeeperException when processing sessionid:0x13d850b93d1000c type:create cxid:0x3 zxid:0x49 txntype:-1 reqpath:n/a Error Path:/solr/overseer Error:KeeperErrorCode = NodeExists for /solr/overseer
[junit4:junit4]   2> 4423 T2168 oascc.ZkStateReader.createClusterStateWatchersAndUpdate Updating cluster state from ZooKeeper... 
[junit4:junit4]   2> 5425 T2168 oasc.ZkController.createEphemeralLiveNode Register node as live in ZooKeeper:/live_nodes/127.0.0.1:50446_g%2Fc
[junit4:junit4]   2> 5426 T2173 oazs.PrepRequestProcessor.pRequest Got user-level KeeperException when processing sessionid:0x13d850b93d1000c type:delete cxid:0xd zxid:0x4a txntype:-1 reqpath:n/a Error Path:/solr/live_nodes/127.0.0.1:50446_g%2Fc Error:KeeperErrorCode = NoNode for /solr/live_nodes/127.0.0.1:50446_g%2Fc
[junit4:junit4]   2> 5427 T2168 oascc.SolrZkClient.makePath makePath: /live_nodes/127.0.0.1:50446_g%2Fc
[junit4:junit4]   2> 5429 T2236 oascc.ZkStateReader$3.process Updating live nodes... (5)
[junit4:junit4]   2> 5429 T2222 oascc.ZkStateReader$3.process Updating live nodes... (5)
[junit4:junit4]   2> 5429 T2208 oascc.ZkStateReader$3.process Updating live nodes... (5)
[junit4:junit4]   2> 5429 T2190 oascc.ZkStateReader$3.process Updating live nodes... (5)
[junit4:junit4]   2> 5430 T2250 oascc.ZkStateReader$3.process Updating live nodes... (5)
[junit4:junit4]   2> 5430 T2195 oascc.ZkStateReader$3.process Updating live nodes... (5)
[junit4:junit4]   2> 5434 T2168 oass.SolrDispatchFilter.init user.dir=/mnt/ssd/jenkins/workspace/Lucene-Solr-trunk-Linux/solr/build/solr-core/test/J1
[junit4:junit4]   2> 5434 T2168 oass.SolrDispatchFilter.init SolrDispatchFilter.init() done
[junit4:junit4]   2> 5434 T2168 oascsi.HttpClientUtil.createClient Creating new http client, config:maxConnections=128&maxConnectionsPerHost=32&followRedirects=false
[junit4:junit4]   2> 5437 T2168 oascsi.HttpClientUtil.createClient Creating new http client, config:maxConnections=128&maxConnectionsPerHost=32&followRedirects=false
[junit4:junit4]   2> 5440 T2201 oasc.CoreContainer.create Creating SolrCore 'unloadcollection1' using instanceDir: /mnt/ssd/jenkins/workspace/Lucene-Solr-trunk-Linux/solr/build/solr-core/test/J1/./org.apache.solr.cloud.UnloadDistributedZkTest-jetty1-1363736762220/unloadcollection1
[junit4:junit4]   2> 5440 T2201 oasc.ZkController.createCollectionZkNode Check for collection zkNode:unloadcollection
[junit4:junit4]   2> 5441 T2201 oasc.ZkController.createCollectionZkNode Creating collection in ZooKeeper:unloadcollection
[junit4:junit4]   2> 5441 T2201 oasc.ZkController.getConfName Looking for collection configName
[junit4:junit4]   2> 5443 T2201 oasc.ZkController.getConfName Only one config set found in zk - using it:conf1
[junit4:junit4]   2> 5443 T2201 oascc.SolrZkClient.makePath makePath: /collections/unloadcollection
[junit4:junit4]   2> 5445 T2201 oasc.ZkController.readConfigName Load collection config from:/collections/unloadcollection
[junit4:junit4]   2> 5446 T2201 oasc.SolrResourceLoader.<init> new SolrResourceLoader for directory: '/mnt/ssd/jenkins/workspace/Lucene-Solr-trunk-Linux/solr/build/solr-core/test/J1/./org.apache.solr.cloud.UnloadDistributedZkTest-jetty1-1363736762220/unloadcollection1/'
[junit4:junit4]   2> 5468 T2201 oasc.SolrConfig.<init> Using Lucene MatchVersion: LUCENE_50
[junit4:junit4]   2> 5495 T2201 oasc.SolrConfig.<init> Loaded SolrConfig: solrconfig.xml
[junit4:junit4]   2> 5496 T2201 oass.IndexSchema.readSchema Reading Solr Schema
[junit4:junit4]   2> 5500 T2201 oass.IndexSchema.readSchema Schema name=test
[junit4:junit4]   2> 5807 T2201 oass.OpenExchangeRatesOrgProvider.init Initialized with rates=open-exchange-rates.json, refreshInterval=1440.
[junit4:junit4]   2> 5812 T2201 oass.IndexSchema.readSchema default search field in schema is text
[junit4:junit4]   2> 5814 T2201 oass.IndexSchema.readSchema unique key field: id
[junit4:junit4]   2> 5826 T2201 oass.FileExchangeRateProvider.reload Reloading exchange rates from file currency.xml
[junit4:junit4]   2> 5829 T2201 oass.FileExchangeRateProvider.reload Reloading exchange rates from file currency.xml
[junit4:junit4]   2> 5832 T2201 oass.OpenExchangeRatesOrgProvider.reload Reloading exchange rates from open-exchange-rates.json
[junit4:junit4]   2> 5833 T2201 oass.OpenExchangeRatesOrgProvider$OpenExchangeRates.<init> WARNING Unknown key IMPORTANT NOTE
[junit4:junit4]   2> 5834 T2201 oass.OpenExchangeRatesOrgProvider$OpenExchangeRates.<init> WARNING Expected key, got STRING
[junit4:junit4]   2> 5834 T2201 oass.OpenExchangeRatesOrgProvider.reload Reloading exchange rates from open-exchange-rates.json
[junit4:junit4]   2> 5835 T2201 oass.OpenExchangeRatesOrgProvider$OpenExchangeRates.<init> WARNING Unknown key IMPORTANT NOTE
[junit4:junit4]   2> 5835 T2201 oass.OpenExchangeRatesOrgProvider$OpenExchangeRates.<init> WARNING Expected key, got STRING
[junit4:junit4]   2> 5836 T2201 oasc.SolrCore.initDirectoryFactory org.apache.solr.core.MockDirectoryFactory
[junit4:junit4]   2> 5836 T2201 oasc.SolrCore.<init> [unloadcollection1] Opening new SolrCore at /mnt/ssd/jenkins/workspace/Lucene-Solr-trunk-Linux/solr/build/solr-core/test/J1/./org.apache.solr.cloud.UnloadDistributedZkTest-jetty1-1363736762220/unloadcollection1/, dataDir=/mnt/ssd/jenkins/workspace/Lucene-Solr-trunk-Linux/solr/build/solr-core/test/J1/./solrtest-UnloadDistributedZkTest-1363736761294/1363736766729unloadcollection1_1n/
[junit4:junit4]   2> 5836 T2201 oasc.JmxMonitoredMap.<init> JMX monitoring is enabled. Adding Solr mbeans to JMX Server: com.sun.jmx.mbeanserver.JmxMBeanServer@60ae7190
[junit4:junit4]   2> 5837 T2201 oasc.SolrCore.initDirectoryFactory org.apache.solr.core.MockDirectoryFactory
[junit4:junit4]   2> 5837 T2201 oasc.CachingDirectoryFactory.get return new directory for /mnt/ssd/jenkins/workspace/Lucene-Solr-trunk-Linux/solr/build/solr-core/test/J1/./solrtest-UnloadDistributedZkTest-1363736761294/1363736766729unloadcollection1_1n forceNew: false
[junit4:junit4]   2> 5838 T2201 oasc.SolrCore.getNewIndexDir New index directory detected: old=null new=/mnt/ssd/jenkins/workspace/Lucene-Solr-trunk-Linux/solr/build/solr-core/test/J1/./solrtest-UnloadDistributedZkTest-1363736761294/1363736766729unloadcollection1_1n/index/
[junit4:junit4]   2> 5838 T2201 oasc.SolrCore.initIndex WARNING [unloadcollection1] Solr index directory '/mnt/ssd/jenkins/workspace/Lucene-Solr-trunk-Linux/solr/build/solr-core/test/J1/./solrtest-UnloadDistributedZkTest-1363736761294/1363736766729unloadcollection1_1n/index' doesn't exist. Creating new index...
[junit4:junit4]   2> 5838 T2201 oasc.CachingDirectoryFactory.get return new directory for /mnt/ssd/jenkins/workspace/Lucene-Solr-trunk-Linux/solr/build/solr-core/test/J1/./solrtest-UnloadDistributedZkTest-1363736761294/1363736766729unloadcollection1_1n/index forceNew: false
[junit4:junit4]   2> 5840 T2201 oasc.SolrDeletionPolicy.onCommit SolrDeletionPolicy.onCommit: commits:num=1
[junit4:junit4]   2> 		commit{dir=MockDirWrapper(org.apache.lucene.store.RAMDirectory@7941fdf5 lockFactory=org.apache.lucene.store.NativeFSLockFactory@7c9ff73e),segFN=segments_1,generation=1,filenames=[segments_1]
[junit4:junit4]   2> 5840 T2201 oasc.SolrDeletionPolicy.updateCommits newest commit = 1[segments_1]
[junit4:junit4]   2> 5841 T2201 oasup.UpdateRequestProcessorChain.init inserting DistributedUpdateProcessorFactory into updateRequestProcessorChain "dedupe"
[junit4:junit4]   2> 5842 T2201 oasup.UpdateRequestProcessorChain.init inserting DistributedUpdateProcessorFactory into updateRequestProcessorChain "stored_sig"
[junit4:junit4]   2> 5842 T2201 oasup.UpdateRequestProcessorChain.init inserting DistributedUpdateProcessorFactory into updateRequestProcessorChain "distrib-dup-test-chain-implicit"
[junit4:junit4]   2> 5843 T2201 oasc.RequestHandlers.initHandlersFromConfig created standard: solr.StandardRequestHandler
[junit4:junit4]   2> 5843 T2201 oasc.RequestHandlers.initHandlersFromConfig created /get: solr.RealTimeGetHandler
[junit4:junit4]   2> 5843 T2201 oasc.RequestHandlers.initHandlersFromConfig adding lazy requestHandler: solr.ReplicationHandler
[junit4:junit4]   2> 5844 T2201 oasc.RequestHandlers.initHandlersFromConfig created /replication: solr.ReplicationHandler
[junit4:junit4]   2> 5844 T2201 oasc.RequestHandlers.initHandlersFromConfig created /update: solr.UpdateRequestHandler
[junit4:junit4]   2> 5844 T2201 oasc.RequestHandlers.initHandlersFromConfig created /admin/: org.apache.solr.handler.admin.AdminHandlers
[junit4:junit4]   2> 5847 T2201 oashl.XMLLoader.init xsltCacheLifetimeSeconds=60
[junit4:junit4]   2> 5849 T2201 oass.SolrIndexSearcher.<init> Opening Searcher@10d522be main
[junit4:junit4]   2> 5849 T2201 oasu.UpdateHandler.clearLog Clearing tlog files, tlogDir=/mnt/ssd/jenkins/workspace/Lucene-Solr-trunk-Linux/solr/build/solr-core/test/J1/./solrtest-UnloadDistributedZkTest-1363736761294/1363736766729unloadcollection1_1n/tlog
[junit4:junit4]   2> 5850 T2201 oasu.CommitTracker.<init> Hard AutoCommit: disabled
[junit4:junit4]   2> 5850 T2201 oasu.CommitTracker.<init> Soft AutoCommit: disabled
[junit4:junit4]   2> 5853 T2252 oasc.SolrCore.registerSearcher [unloadcollection1] Registered new searcher Searcher@10d522be main{StandardDirectoryReader(segments_1:1)}
[junit4:junit4]   2> 5854 T2201 oasc.ZkController.publish publishing core=unloadcollection1 state=down
[junit4:junit4]   2> 6928 T2191 oascc.ZkStateReader.updateClusterState Updating cloud state from ZooKeeper... 
[junit4:junit4]   2> 6928 T2191 oasc.Overseer$ClusterStateUpdater.updateState Update state numShards=1 message={
[junit4:junit4]   2> 	  "core":"unloadcollection1",
[junit4:junit4]   2> 	  "numShards":"1",
[junit4:junit4]   2> 	  "operation":"state",
[junit4:junit4]   2> 	  "collection":"unloadcollection",
[junit4:junit4]   2> 	  "base_url":"http://127.0.0.1:49591/g/c",
[junit4:junit4]   2> 	  "core_node_name":null,
[junit4:junit4]   2> 	  "node_name":"127.0.0.1:49591_g%2Fc",
[junit4:junit4]   2> 	  "roles":null,
[junit4:junit4]   2> 	  "state":"down",
[junit4:junit4]   2> 	  "shard":null}
[junit4:junit4]   2> 6929 T2191 oasc.Overseer$ClusterStateUpdater.createCollection Create collection unloadcollection with numShards 1
[junit4:junit4]   2> 6929 T2191 oasc.Overseer$ClusterStateUpdater.updateState Assigning new node to shard shard=shard1
[junit4:junit4]   2> 6932 T2236 oascc.ZkStateReader$2.process A cluster state change: WatchedEvent state:SyncConnected type:NodeDataChanged path:/clusterstate.json, has occurred - updating... (live nodes size: 5)
[junit4:junit4]   2> 6932 T2195 oascc.ZkStateReader$2.process A cluster state change: WatchedEvent state:SyncConnected type:NodeDataChanged path:/clusterstate.json, has occurred - updating... (live nodes size: 5)
[junit4:junit4]   2> 6932 T2208 oascc.ZkStateReader$2.process A cluster state change: WatchedEvent state:SyncConnected type:NodeDataChanged path:/clusterstate.json, has occurred - updating... (live nodes size: 5)
[junit4:junit4]   2> 6932 T2222 oascc.ZkStateReader$2.process A cluster state change: WatchedEvent state:SyncConnected type:NodeDataChanged path:/clusterstate.json, has occurred - updating... (live nodes size: 5)
[junit4:junit4]   2> 6932 T2190 oascc.ZkStateReader$2.process A cluster state change: WatchedEvent state:SyncConnected type:NodeDataChanged path:/clusterstate.json, has occurred - updating... (live nodes size: 5)
[junit4:junit4]   2> 6932 T2250 oascc.ZkStateReader$2.process A cluster state change: WatchedEvent state:SyncConnected type:NodeDataChanged path:/clusterstate.json, has occurred - updating... (live nodes size: 5)
[junit4:junit4]   2> 7858 T2201 oasc.CoreContainer.registerCore registering core: unloadcollection1
[junit4:junit4]   2> 7859 T2201 oasc.ZkController.register Register replica - core:unloadcollection1 address:http://127.0.0.1:49591/g/c collection:unloadcollection shard:shard1
[junit4:junit4]   2> 7860 T2201 oascc.SolrZkClient.makePath makePath: /collections/unloadcollection/leader_elect/shard1/election
[junit4:junit4]   2> 7866 T2173 oazs.PrepRequestProcessor.pRequest Got user-level KeeperException when processing sessionid:0x13d850b93d10006 type:delete cxid:0x51 zxid:0x57 txntype:-1 reqpath:n/a Error Path:/solr/collections/unloadcollection/leaders Error:KeeperErrorCode = NoNode for /solr/collections/unloadcollection/leaders
[junit4:junit4]   2> 7867 T2201 oasc.ShardLeaderElectionContext.runLeaderProcess Running the leader process.
[junit4:junit4]   2> 7867 T2173 oazs.PrepRequestProcessor.pRequest Got user-level KeeperException when processing sessionid:0x13d850b93d10006 type:create cxid:0x52 zxid:0x58 txntype:-1 reqpath:n/a Error Path:/solr/overseer Error:KeeperErrorCode = NodeExists for /solr/overseer
[junit4:junit4]   2> 7869 T2201 oasc.ShardLeaderElectionContext.waitForReplicasToComeUp Enough replicas found to continue.
[junit4:junit4]   2> 7869 T2201 oasc.ShardLeaderElectionContext.runLeaderProcess I may be the new leader - try and sync
[junit4:junit4]   2> 7869 T2201 oasc.SyncStrategy.sync Sync replicas to http://127.0.0.1:49591/g/c/unloadcollection1/
[junit4:junit4]   2> 7870 T2201 oasc.SyncStrategy.syncReplicas Sync Success - now sync replicas to me
[junit4:junit4]   2> 7870 T2201 oasc.SyncStrategy.syncToMe http://127.0.0.1:49591/g/c/unloadcollection1/ has no replicas
[junit4:junit4]   2> 7870 T2201 oasc.ShardLeaderElectionContext.runLeaderProcess I am the new leader: http://127.0.0.1:49591/g/c/unloadcollection1/
[junit4:junit4]   2> 7870 T2201 oascc.SolrZkClient.makePath makePath: /collections/unloadcollection/leaders/shard1
[junit4:junit4]   2> 7875 T2173 oazs.PrepRequestProcessor.pRequest Got user-level KeeperException when processing sessionid:0x13d850b93d10006 type:create cxid:0x5d zxid:0x5c txntype:-1 reqpath:n/a Error Path:/solr/overseer Error:KeeperErrorCode = NodeExists for /solr/overseer
[junit4:junit4]   2> 8436 T2191 oascc.ZkStateReader.updateClusterState Updating cloud state from ZooKeeper... 
[junit4:junit4]   2> 8444 T2190 oascc.ZkStateReader$2.process A cluster state change: WatchedEvent state:SyncConnected type:NodeDataChanged path:/clusterstate.json, has occurred - updating... (live nodes size: 5)
[junit4:junit4]   2> 8444 T2250 oascc.ZkStateReader$2.process A cluster state change: WatchedEvent state:SyncConnected type:NodeDataChanged path:/clusterstate.json, has occurred - updating... (live nodes size: 5)
[junit4:junit4]   2> 8444 T2195 oascc.ZkStateReader$2.process A cluster state change: WatchedEvent state:SyncConnected type:NodeDataChanged path:/clusterstate.json, has occurred - updating... (live nodes size: 5)
[junit4:junit4]   2> 8444 T2236 oascc.ZkStateReader$2.process A cluster state change: WatchedEvent state:SyncConnected type:NodeDataChanged path:/clusterstate.json, has occurred - updating... (live nodes size: 5)
[junit4:junit4]   2> 8444 T2208 oascc.ZkStateReader$2.process A cluster state change: WatchedEvent state:SyncConnected type:NodeDataChanged path:/clusterstate.json, has occurred - updating... (live nodes size: 5)
[junit4:junit4]   2> 8444 T2222 oascc.ZkStateReader$2.process A cluster state change: WatchedEvent state:SyncConnected type:NodeDataChanged path:/clusterstate.json, has occurred - updating... (live nodes size: 5)
[junit4:junit4]   2> 8478 T2201 oasc.ZkController.register We are http://127.0.0.1:49591/g/c/unloadcollection1/ and leader is http://127.0.0.1:49591/g/c/unloadcollection1/
[junit4:junit4]   2> 8478 T2201 oasc.ZkController.register No LogReplay needed for core=unloadcollection1 baseURL=http://127.0.0.1:49591/g/c
[junit4:junit4]   2> 8479 T2201 oasc.ZkController.checkRecovery I am the leader, no recovery necessary
[junit4:junit4]   2> 8479 T2201 oasc.ZkController.publish publishing core=unloadcollection1 state=active
[junit4:junit4]   2> 8480 T2201 oascc.ZkStateReader.updateClusterState Updating cloud state from ZooKeeper... 
[junit4:junit4]   2> 8481 T2201 oasc.CoreContainer.persistFile Persisting cores config to /mnt/ssd/jenkins/workspace/Lucene-Solr-trunk-Linux/solr/build/solr-core/test/J1/./org.apache.solr.cloud.UnloadDistributedZkTest-jetty1-1363736762220/solr.xml
[junit4:junit4]   2> 8486 T2201 oasc.SolrXMLSerializer.persistFile Persisting cores config to /mnt/ssd/jenkins/workspace/Lucene-Solr-trunk-Linux/solr/build/solr-core/test/J1/./org.apache.solr.cloud.UnloadDistributedZkTest-jetty1-1363736762220/solr.xml
[junit4:junit4]   2> 8487 T2201 oass.SolrDispatchFilter.handleAdminRequest /admin/cores {dataDir=/mnt/ssd/jenkins/workspace/Lucene-Solr-trunk-Linux/solr/build/solr-core/test/J1/./solrtest-UnloadDistributedZkTest-1363736761294/1363736766729unloadcollection1_1n&version=2&name=unloadcollection1&numShards=1&collection=unloadcollection&wt=javabin&action=CREATE} status=0 QTime=3047 
[junit4:junit4]   2> 8487 T2168 oascsi.HttpClientUtil.createClient Creating new http client, config:
[junit4:junit4]   2> 8489 T2168 oaz.ZooKeeper.<init> Initiating client connection, connectString=127.0.0.1:46817/solr sessionTimeout=10000 watcher=org.apache.solr.common.cloud.ConnectionManager@7f474eb2
[junit4:junit4]   2> 8489 T2168 oascc.ConnectionManager.waitForConnected Waiting for client to connect to ZooKeeper
[junit4:junit4]   2> 8490 T2253 oaz.ClientCnxn$SendThread.logStartConnect Opening socket connection to server localhost.localdomain/127.0.0.1:46817. Will not attempt to authenticate using SASL (access denied ("javax.security.auth.AuthPermission" "getLoginConfiguration"))
[junit4:junit4]   2> 8490 T2253 oaz.ClientCnxn$SendThread.primeConnection Socket connection established to localhost.localdomain/127.0.0.1:46817, initiating session
[junit4:junit4]   2> 8490 T2170 oazs.NIOServerCnxnFactory.run Accepted socket connection from /127.0.0.1:37425
[junit4:junit4]   2> 8490 T2170 oazs.ZooKeeperServer.processConnectRequest Client attempting to establish new session at /127.0.0.1:37425
[junit4:junit4]   2> 8491 T2172 oazs.ZooKeeperServer.finishSessionInit Established session 0x13d850b93d1000d with negotiated timeout 10000 for client /127.0.0.1:37425
[junit4:junit4]   2> 8491 T2253 oaz.ClientCnxn$SendThread.onConnected Session establishment complete on server localhost.localdomain/127.0.0.1:46817, sessionid = 0x13d850b93d1000d, negotiated timeout = 10000
[junit4:junit4]   2> 8491 T2254 oascc.ConnectionManager.process Watcher org.apache.solr.common.cloud.ConnectionManager@7f474eb2 name:ZooKeeperConnection Watcher:127.0.0.1:46817/solr got event WatchedEvent state:SyncConnected type:None path:null path:null type:None
[junit4:junit4]   2> 8492 T2168 oascc.ConnectionManager.waitForConnected Client is connected to ZooKeeper
[junit4:junit4]   2> 8493 T2168 oascc.ZkStateReader.createClusterStateWatchersAndUpdate Updating cluster state from ZooKeeper... 
[junit4:junit4]   2> 8495 T2168 oascc.ZkStateReader.updateClusterState Updating cloud state from ZooKeeper... 
[junit4:junit4]   2> 8496 T2168 oascsi.HttpClientUtil.createClient Creating new http client, config:maxConnections=128&maxConnectionsPerHost=32&followRedirects=false
[junit4:junit4]   2> 8499 T2216 oasc.CoreContainer.create Creating SolrCore 'unloadcollection2' using instanceDir: /mnt/ssd/jenkins/workspace/Lucene-Solr-trunk-Linux/solr/build/solr-core/test/J1/./org.apache.solr.cloud.UnloadDistributedZkTest-jetty2-1363736763346/unloadcollection2
[junit4:junit4]   2> 8500 T2216 oasc.ZkController.createCollectionZkNode Check for collection zkNode:unloadcollection
[junit4:junit4]   2> 8500 T2216 oasc.ZkController.createCollectionZkNode Collection zkNode exists
[junit4:junit4]   2> 8500 T2216 oasc.ZkController.readConfigName Load collection config from:/collections/unloadcollection
[junit4:junit4]   2> 8501 T2216 oasc.SolrResourceLoader.<init> new SolrResourceLoader for directory: '/mnt/ssd/jenkins/workspace/Lucene-Solr-trunk-Linux/solr/build/solr-core/test/J1/./org.apache.solr.cloud.UnloadDistributedZkTest-jetty2-1363736763346/unloadcollection2/'
[junit4:junit4]   2> 8526 T2216 oasc.SolrConfig.<init> Using Lucene MatchVersion: LUCENE_50
[junit4:junit4]   2> 8554 T2216 oasc.SolrConfig.<init> Loaded SolrConfig: solrconfig.xml
[junit4:junit4]   2> 8555 T2216 oass.IndexSchema.readSchema Reading Solr Schema
[junit4:junit4]   2> 8558 T2216 oass.IndexSchema.readSchema Schema name=test
[junit4:junit4]   2> 8861 T2216 oass.OpenExchangeRatesOrgProvider.init Initialized with rates=open-exchange-rates.json, refreshInterval=1440.
[junit4:junit4]   2> 8866 T2216 oass.IndexSchema.readSchema default search field in schema is text
[junit4:junit4]   2> 8868 T2216 oass.IndexSchema.readSchema unique key field: id
[junit4:junit4]   2> 8880 T2216 oass.FileExchangeRateProvider.reload Reloading exchange rates from file currency.xml
[junit4:junit4]   2> 8883 T2216 oass.FileExchangeRateProvider.reload Reloading exchange rates from file currency.xml
[junit4:junit4]   2> 8885 T2216 oass.OpenExchangeRatesOrgProvider.reload Reloading exchange rates from open-exchange-rates.json
[junit4:junit4]   2> 8886 T2216 oass.OpenExchangeRatesOrgProvider$OpenExchangeRates.<init> WARNING Unknown key IMPORTANT NOTE
[junit4:junit4]   2> 8887 T2216 oass.OpenExchangeRatesOrgProvider$OpenExchangeRates.<init> WARNING Expected key, got STRING
[junit4:junit4]   2> 8888 T2216 oass.OpenExchangeRatesOrgProvider.reload Reloading exchange rates from open-exchange-rates.json
[junit4:junit4]   2> 8889 T2216 oass.OpenExchangeRatesOrgProvider$OpenExchangeRates.<init> WARNING Unknown key IMPORTANT NOTE
[junit4:junit4]   2> 8889 T2216 oass.OpenExchangeRatesOrgProvider$OpenExchangeRates.<init> WARNING Expected key, got STRING
[junit4:junit4]   2> 8889 T2216 oasc.SolrCore.initDirectoryFactory org.apache.solr.core.MockDirectoryFactory
[junit4:junit4]   2> 8889 T2216 oasc.SolrCore.<init> [unloadcollection2] Opening new SolrCore at /mnt/ssd/jenkins/workspace/Lucene-Solr-trunk-Linux/solr/build/solr-core/test/J1/./org.apache.solr.cloud.UnloadDistributedZkTest-jetty2-1363736763346/unloadcollection2/, dataDir=/mnt/ssd/jenkins/workspace/Lucene-Solr-trunk-Linux/solr/build/solr-core/test/J1/./solrtest-UnloadDistributedZkTest-1363736761294/1363736769788unloadcollection1_2n/
[junit4:junit4]   2> 8890 T2216 oasc.JmxMonitoredMap.<init> JMX monitoring is enabled. Adding Solr mbeans to JMX Server: com.sun.jmx.mbeanserver.JmxMBeanServer@60ae7190
[junit4:junit4]   2> 8890 T2216 oasc.SolrCore.initDirectoryFactory org.apache.solr.core.MockDirectoryFactory
[junit4:junit4]   2> 8891 T2216 oasc.CachingDirectoryFactory.get return new directory for /mnt/ssd/jenkins/workspace/Lucene-Solr-trunk-Linux/solr/build/solr-core/test/J1/./solrtest-UnloadDistributedZkTest-1363736761294/1363736769788unloadcollection1_2n forceNew: false
[junit4:junit4]   2> 8891 T2216 oasc.SolrCore.getNewIndexDir New index directory detected: old=null new=/mnt/ssd/jenkins/workspace/Lucene-Solr-trunk-Linux/solr/build/solr-core/test/J1/./solrtest-UnloadDistributedZkTest-1363736761294/1363736769788unloadcollection1_2n/index/
[junit4:junit4]   2> 8891 T2216 oasc.SolrCore.initIndex WARNING [unloadcollection2] Solr index directory '/mnt/ssd/jenkins/workspace/Lucene-Solr-trunk-Linux/solr/build/solr-core/test/J1/./solrtest-UnloadDistributedZkTest-1363736761294/1363736769788unloadcollection1_2n/index' doesn't exist. Creating new index...
[junit4:junit4]   2> 8892 T2216 oasc.CachingDirectoryFactory.get return new directory for /mnt/ssd/jenkins/workspace/Lucene-Solr-trunk-Linux/solr/build/solr-core/test/J1/./solrtest-UnloadDistributedZkTest-1363736761294/1363736769788unloadcollection1_2n/index forceNew: false
[junit4:junit4]   2> 8894 T2216 oasc.SolrDeletionPolicy.onCommit SolrDeletionPolicy.onCommit: commits:num=1
[junit4:junit4]   2> 		commit{dir=MockDirWrapper(org.apache.lucene.store.RAMDirectory@2f8044e5 lockFactory=org.apache.lucene.store.NativeFSLockFactory@bab9295),segFN=segments_1,generation=1,filenames=[segments_1]
[junit4:junit4]   2> 8894 T2216 oasc.SolrDeletionPolicy.updateCommits newest commit = 1[segments_1]
[junit4:junit4]   2> 8895 T2216 oasup.UpdateRequestProcessorChain.init inserting DistributedUpdateProcessorFactory into updateRequestProcessorChain "dedupe"
[junit4:junit4]   2> 8896 T2216 oasup.UpdateRequestProcessorChain.init inserting DistributedUpdateProcessorFactory into updateRequestProcessorChain "stored_sig"
[junit4:junit4]   2> 8896 T2216 oasup.UpdateRequestProcessorChain.init inserting DistributedUpdateProcessorFactory into updateRequestProcessorChain "distrib-dup-test-chain-implicit"
[junit4:junit4]   2> 8897 T2216 oasc.RequestHandlers.initHandlersFromConfig created standard: solr.StandardRequestHandler
[junit4:junit4]   2> 8897 T2216 oasc.RequestHandlers.initHandlersFromConfig created /get: solr.RealTimeGetHandler
[junit4:junit4]   2> 8897 T2216 oasc.RequestHandlers.initHandlersFromConfig adding lazy requestHandler: solr.ReplicationHandler
[junit4:junit4]   2> 8898 T2216 oasc.RequestHandlers.initHandlersFromConfig created /replication: solr.ReplicationHandler
[junit4:junit4]   2> 8898 T2216 oasc.RequestHandlers.initHandlersFromConfig created /update: solr.UpdateRequestHandler
[junit4:junit4]   2> 8898 T2216 oasc.RequestHandlers.initHandlersFromConfig created /admin/: org.apache.solr.handler.admin.AdminHandlers
[junit4:junit4]   2> 8901 T2216 oashl.XMLLoader.init xsltCacheLifetimeSeconds=60
[junit4:junit4]   2> 8903 T2216 oass.SolrIndexSearcher.<init> Opening Searcher@6603640b main
[junit4:junit4]   2> 8903 T2216 oasu.UpdateHandler.clearLog Clearing tlog files, tlogDir=/mnt/ssd/jenkins/workspace/Lucene-Solr-trunk-Linux/solr/build/solr-core/test/J1/./solrtest-UnloadDistributedZkTest-1363736761294/1363736769788unloadcollection1_2n/tlog
[junit4:junit4]   2> 8904 T2216 oasu.CommitTracker.<init> Hard AutoCommit: disabled
[junit4:junit4]   2> 8904 T2216 oasu.CommitTracker.<init> Soft AutoCommit: disabled
[junit4:junit4]   2> 8907 T2255 oasc.SolrCore.registerSearcher [unloadcollection2] Registered new searcher Searcher@6603640b main{StandardDirectoryReader(segments_1:1)}
[junit4:junit4]   2> 8907 T2216 oasc.ZkController.publish publishing core=unloadcollection2 state=down
[junit4:junit4]   2> 8907 T2216 oasc.ZkController.publish numShards not found on descriptor - reading it from system property
[junit4:junit4]   2> 9949 T2191 oascc.ZkStateReader.updateClusterState Updating cloud state from ZooKeeper... 
[junit4:junit4]   2> 9950 T2191 oasc.Overseer$ClusterStateUpdater.updateState Update state numShards=1 message={
[junit4:junit4]   2> 	  "core":"unloadcollection1",
[junit4:junit4]   2> 	  "numShards":"1",
[junit4:junit4]   2> 	  "operation":"state",
[junit4:junit4]   2> 	  "collection":"unloadcollection",
[junit4:junit4]   2> 	  "base_url":"http://127.0.0.1:49591/g/c",
[junit4:junit4]   2> 	  "core_node_name":"127.0.0.1:49591_g%2Fc_unloadcollection1",
[junit4:junit4]   2> 	  "node_name":"127.0.0.1:49591_g%2Fc",
[junit4:junit4]   2> 	  "roles":null,
[junit4:junit4]   2> 	  "state":"active",
[junit4:junit4]   2> 	  "shard":"shard1"}
[junit4:junit4]   2> 9953 T2191 oasc.Overseer$ClusterStateUpdater.updateState Update state numShards=2 message={
[junit4:junit4]   2> 	  "core":"unloadcollection2",
[junit4:junit4]   2> 	  "numShards":"2",
[junit4:junit4]   2> 	  "operation":"state",
[junit4:junit4]   2> 	  "collection":"unloadcollection",
[junit4:junit4]   2> 	  "base_url":"http://127.0.0.1:49774/g/c",
[junit4:junit4]   2> 	  "core_node_name":null,
[junit4:junit4]   2> 	  "node_name":"127.0.0.1:49774_g%2Fc",
[junit4:junit4]   2> 	  "roles":null,
[junit4:junit4]   2> 	  "state":"down",
[junit4:junit4]   2> 	  "shard":null}
[junit4:junit4]   2> 9953 T2191 oasc.Overseer$ClusterStateUpdater.updateState Collection already exists with numShards=1
[junit4:junit4]   2> 9953 T2191 oasc.Overseer$ClusterStateUpdater.updateState Assigning new node to shard shard=shard1
[junit4:junit4]   2> 9956 T2222 oascc.ZkStateReader$2.process A cluster state change: WatchedEvent state:SyncConnected type:NodeDataChanged path:/clusterstate.json, has occurred - updating... (live nodes size: 5)
[junit4:junit4]   2> 9957 T2236 oascc.ZkStateReader$2.process A cluster state change: WatchedEvent state:SyncConnected type:NodeDataChanged path:/clusterstate.json, has occurred - updating... (live nodes size: 5)
[junit4:junit4]   2> 9957 T2195 oascc.ZkStateReader$2.process A cluster state change: WatchedEvent state:SyncConnected type:NodeDataChanged path:/clusterstate.json, has occurred - updating... (live nodes size: 5)
[junit4:junit4]   2> 9957 T2254 oascc.ZkStateReader$2.process A cluster state change: WatchedEvent state:SyncConnected type:NodeDataChanged path:/clusterstate.json, has occurred - updating... (live nodes size: 5)
[junit4:junit4]   2> 9957 T2208 oascc.ZkStateReader$2.process A cluster state change: WatchedEvent state:SyncConnected type:NodeDataChanged path:/clusterstate.json, has occurred - updating... (live nodes size: 5)
[junit4:junit4]   2> 9956 T2250 oascc.ZkStateReader$2.process A cluster state change: WatchedEvent state:SyncConnected type:NodeDataChanged path:/clusterstate.json, has occurred - updating... (live nodes size: 5)
[junit4:junit4]   2> 9957 T2190 oascc.ZkStateReader$2.process A cluster state change: WatchedEvent state:SyncConnected type:NodeDataChanged path:/clusterstate.json, has occurred - updating... (live nodes size: 5)
[junit4:junit4]   2> 10909 T2216 oasc.CoreContainer.registerCore registering core: unloadcollection2
[junit4:junit4]   2> 10910 T2216 oasc.ZkController.register Register replica - core:unloadcollection2 address:http://127.0.0.1:49774/g/c collection:unloadcollection shard:shard1
[junit4:junit4]   2> 10913 T2216 oasc.ZkController.register We are http://127.0.0.1:49774/g/c/unloadcollection2/ and leader is http://127.0.0.1:49591/g/c/unloadcollection1/
[junit4:junit4]   2> 10913 T2216 oasc.ZkController.register No LogReplay needed for core=unloadcollection2 baseURL=http://127.0.0.1:49774/g/c
[junit4:junit4]   2> 10913 T2216 oasc.ZkController.checkRecovery Core needs to recover:unloadcollection2
[junit4:junit4]   2> 10913 T2216 oasu.DefaultSolrCoreState.doRecovery Running recovery - first canceling any ongoing recovery
[junit4:junit4]   2> ASYNC  NEW_CORE C343 name=unloadcollection2 org.apache.solr.core.SolrCore@47f0e948 url=http://127.0.0.1:49774/g/c/unloadcollection2 node=127.0.0.1:49774_g%2Fc C343_STATE=coll:unloadcollection core:unloadcollection2 props:{core=unloadcollection2, collection=unloadcollection, base_url=http://127.0.0.1:49774/g/c, node_name=127.0.0.1:49774_g%2Fc, state=down}
[junit4:junit4]   2> 10914 T2256 C343 P49774 oasc.RecoveryStrategy.run Starting recovery process.  core=unloadcollection2 recoveringAfterStartup=true
[junit4:junit4]   2> 10915 T2256 C343 P49774 oasc.RecoveryStrategy.doRecovery ###### startupVersions=[]
[junit4:junit4]   2> 10915 T2216 oascc.ZkStateReader.updateClusterState Updating cloud state from ZooKeeper... 
[junit4:junit4]   2> 10915 T2256 C343 P49774 oasc.ZkController.publish publishing core=unloadcollection2 state=recovering
[junit4:junit4]   2> 10915 T2256 C343 P49774 oasc.ZkController.publish numShards not found on descriptor - reading it from system property
[junit4:junit4]   2> 10916 T2216 oasc.CoreContainer.persistFile Persisting cores config to /mnt/ssd/jenkins/workspace/Lucene-Solr-trunk-Linux/solr/build/solr-core/test/J1/./org.apache.solr.cloud.UnloadDistributedZkTest-jetty2-1363736763346/solr.xml
[junit4:junit4]   2> 10916 T2256 C343 P49774 oascsi.HttpClientUtil.createClient Creating new http client, config:maxConnections=128&maxConnectionsPerHost=32&followRedirects=false
[junit4:junit4]   2> 10921 T2216 oasc.SolrXMLSerializer.persistFile Persisting cores config to /mnt/ssd/jenkins/workspace/Lucene-Solr-trunk-Linux/solr/build/solr-core/test/J1/./org.apache.solr.cloud.UnloadDistributedZkTest-jetty2-1363736763346/solr.xml
[junit4:junit4]   2> 10922 T2216 oass.SolrDispatchFilter.handleAdminRequest /admin/cores {dataDir=/mnt/ssd/jenkins/workspace/Lucene-Solr-trunk-Linux/solr/build/solr-core/test/J1/./solrtest-UnloadDistributedZkTest-1363736761294/1363736769788unloadcollection1_2n&version=2&name=unloadcollection2&collection=unloadcollection&wt=javabin&action=CREATE} status=0 QTime=2423 
[junit4:junit4]   2> 10923 T2168 oascc.ZkStateReader.updateClusterState Updating cloud state from ZooKeeper... 
[junit4:junit4]   2> 10924 T2168 oasc.AbstractDistribZkTestBase.waitForRecoveriesToFinish Wait for recoveries to finish - collection: unloadcollection failOnTimeout:true timeout (sec):230
[junit4:junit4]   2> 10925 T2168 oascc.ZkStateReader.updateClusterState Updating cloud state from ZooKeeper... 
[junit4:junit4]   2> 11462 T2191 oascc.ZkStateReader.updateClusterState Updating cloud state from ZooKeeper... 
[junit4:junit4]   2> 11463 T2191 oasc.Overseer$ClusterStateUpdater.updateState Update state numShards=2 message={
[junit4:junit4]   2> 	  "core":"unloadcollection2",
[junit4:junit4]   2> 	  "numShards":"2",
[junit4:junit4]   2> 	  "operation":"state",
[junit4:junit4]   2> 	  "collection":"unloadcollection",
[junit4:junit4]   2> 	  "base_url":"http://127.0.0.1:49774/g/c",
[junit4:junit4]   2> 	  "core_node_name":"127.0.0.1:49774_g%2Fc_unloadcollection2",
[junit4:junit4]   2> 	  "node_name":"127.0.0.1:49774_g%2Fc",
[junit4:junit4]   2> 	  "roles":null,
[junit4:junit4]   2> 	  "state":"recovering",
[junit4:junit4]   2> 	  "shard":"shard1"}
[junit4:junit4]   2> 11481 T2208 oascc.ZkStateReader$2.process A cluster state change: WatchedEvent state:SyncConnected type:NodeDataChanged path:/clusterstate.json, has occurred - updating... (live nodes size: 5)
[junit4:junit4]   2> 11481 T2250 oascc.ZkStateReader$2.process A cluster state change: WatchedEvent state:SyncConnected type:NodeDataChanged path:/clusterstate.json, has occurred - updating... (live nodes size: 5)
[junit4:junit4]   2> 11481 T2190 oascc.ZkStateReader$2.process A cluster state change: WatchedEvent state:SyncConnected type:NodeDataChanged path:/clusterstate.json, has occurred - updating... (live nodes size: 5)
[junit4:junit4]   2> 11481 T2195 oascc.ZkStateReader$2.process A cluster state change: WatchedEvent state:SyncConnected type:NodeDataChanged path:/clusterstate.json, has occurred - updating... (live nodes size: 5)
[junit4:junit4]   2> 11481 T2222 oascc.ZkStateReader$2.process A cluster state change: WatchedEvent state:SyncConnected type:NodeDataChanged path:/clusterstate.json, has occurred - updating... (live nodes size: 5)
[junit4:junit4]   2> 11481 T2236 oascc.ZkStateReader$2.process A cluster state change: WatchedEvent state:SyncConnected type:NodeDataChanged path:/clusterstate.json, has occurred - updating... (live nodes size: 5)
[junit4:junit4]   2> 11482 T2254 oascc.ZkStateReader$2.process A cluster state change: WatchedEvent state:SyncConnected type:NodeDataChanged path:/clusterstate.json, has occurred - updating... (live nodes size: 5)
[junit4:junit4]   2> 11920 T2204 oass.SolrDispatchFilter.handleAdminRequest /admin/cores {version=2&core=unloadcollection1&onlyIfLeader=true&wt=javabin&checkLive=true&nodeName=127.0.0.1:49774_g%252Fc&state=recovering&action=PREPRECOVERY&coreNodeName=127.0.0.1:49774_g%252Fc_unloadcollection2} status=0 QTime=1000 
[junit4:junit4]   2> 11926 T2168 oascc.ZkStateReader.updateClusterState Updating cloud state from ZooKeeper... 
[junit4:junit4]   2> 12928 T2168 oascc.ZkStateReader.updateClusterState Updating cloud state from ZooKeeper... 
[junit4:junit4]   2>  C343_STATE=coll:unloadcollection core:unloadcollection2 props:{core=unloadcollection2, collection=unloadcollection, base_url=http://127.0.0.1:49774/g/c, node_name=127.0.0.1:49774_g%2Fc, state=recovering, shard=shard1}
[junit4:junit4]   2> 13921 T2256 C343 P49774 oasc.RecoveryStrategy.doRecovery Attempting to PeerSync from http://127.0.0.1:49591/g/c/unloadcollection1/ core=unloadcollection2 - recoveringAfterStartup=true
[junit4:junit4]   2> 13922 T2256 C343 P49774 oasu.PeerSync.sync PeerSync: core=unloadcollection2 url=http://127.0.0.1:49774/g/c START replicas=[http://127.0.0.1:49591/g/c/unloadcollection1/] nUpdates=100
[junit4:junit4]   2> 13922 T2256 C343 P49774 oasu.PeerSync.sync WARNING no frame of reference to tell of we've missed updates
[junit4:junit4]   2> 13922 T2256 C343 P49774 oasc.RecoveryStrategy.doRecovery PeerSync Recovery was not successful - trying replication. core=unloadcollection2
[junit4:junit4]   2> 13923 T2256 C343 P49774 oasc.RecoveryStrategy.doRecovery Starting Replication Recovery. core=unloadcollection2
[junit4:junit4]   2> 13923 T2256 C343 P49774 oasc.RecoveryStrategy.doRecovery Begin buffering updates. core=unloadcollection2
[junit4:junit4]   2> 13923 T2256 C343 P49774 oasu.UpdateLog.bufferUpdates Starting to buffer updates. FSUpdateLog{state=ACTIVE, tlog=null}
[junit4:junit4]   2> 13924 T2256 C343 P49774 oasc.RecoveryStrategy.replicate Attempting to replicate from http://127.0.0.1:49591/g/c/unloadcollection1/. core=unloadcollection2
[junit4:junit4]   2> 13924 T2256 C343 P49774 oascsi.HttpClientUtil.createClient Creating new http client, config:maxConnections=128&maxConnectionsPerHost=32&followRedirects=false
[junit4:junit4]   2> 13930 T2168 oascc.ZkStateReader.updateClusterState Updating cloud state from ZooKeeper... 
[junit4:junit4]   2> ASYNC  NEW_CORE C344 name=unloadcollection1 org.apache.solr.core.SolrCore@426ced9d url=http://127.0.0.1:49591/g/c/unloadcollection1 node=127.0.0.1:49591_g%2Fc C344_STATE=coll:unloadcollection core:unloadcollection1 props:{core=unloadcollection1, collection=unloadcollection, base_url=http://127.0.0.1:49591/g/c, node_name=127.0.0.1:49591_g%2Fc, state=active, shard=shard1, leader=true}
[junit4:junit4]   2> 13931 T2202 C344 P49591 REQ /get {version=2&getVersions=100&wt=javabin&distrib=false&qt=/get} status=0 QTime=1 
[junit4:junit4]   2> 13932 T2203 C344 P49591 oasu.DirectUpdateHandler2.commit start commit{,optimize=false,openSearcher=false,waitSearcher=true,expungeDeletes=false,softCommit=false,prepareCommit=false}
[junit4:junit4]   2> 13934 T2203 C344 P49591 oasc.SolrDeletionPolicy.onInit SolrDeletionPolicy.onInit: commits:num=1
[junit4:junit4]   2> 		commit{dir=MockDirWrapper(org.apache.lucene.store.RAMDirectory@7941fdf5 lockFactory=org.apache.lucene.store.NativeFSLockFactory@7c9ff73e),segFN=segments_1,generation=1,filenames=[segments_1]
[junit4:junit4]   2> 13935 T2203 C344 P49591 oasc.SolrDeletionPolicy.updateCommits newest commit = 1[segments_1]
[junit4:junit4]   2> 13936 T2203 C344 P49591 oasc.SolrDeletionPolicy.onCommit SolrDeletionPolicy.onCommit: commits:num=2
[junit4:junit4]   2> 		commit{dir=MockDirWrapper(org.apache.lucene.store.RAMDirectory@7941fdf5 lockFactory=org.apache.lucene.store.NativeFSLockFactory@7c9ff73e),segFN=segments_1,generation=1,filenames=[segments_1]
[junit4:junit4]   2> 		commit{dir=MockDirWrapper(org.apache.lucene.store.RAMDirectory@7941fdf5 lockFactory=org.apache.lucene.store.NativeFSLockFactory@7c9ff73e),segFN=segments_2,generation=2,filenames=[segments_2]
[junit4:junit4]   2> 13937 T2203 C344 P49591 oasc.SolrDeletionPolicy.updateCommits newest commit = 2[segments_2]
[junit4:junit4]   2> 13937 T2203 C344 P49591 oass.SolrIndexSearcher.<init> Opening Searcher@13ae8d0d realtime
[junit4:junit4]   2> 13938 T2203 C344 P49591 oasu.DirectUpdateHandler2.commit end_commit_flush
[junit4:junit4]   2> 13938 T2203 C344 P49591 /update {version=2&waitSearcher=true&commit=true&wt=javabin&commit_end_point=true&softCommit=false&openSearcher=false} {commit=} 0 6
[junit4:junit4]   2> 13939 T2256 C343 P49774 oash.ReplicationHandler.inform Commits will be reserved for  10000
[junit4:junit4]   2> 13939 T2256 C343 P49774 oash.SnapPuller.<init>  No value set for 'pollInterval'. Timer Task not started.
[junit4:junit4]   2> 13942 T2204 C344 P49591 oash.ReplicationHandler.inform Commits will be reserved for  10000
[junit4:junit4]   2> 13943 T2204 C344 P49591 REQ /replication {version=2&wt=javabin&command=indexversion&qt=/replication} status=0 QTime=3 
[junit4:junit4]   2> 13943 T2256 C343 P49774 oash.SnapPuller.fetchLatestIndex Master's generation: 2
[junit4:junit4]   2> 13943 T2256 C343 P49774 oash.SnapPuller.fetchLatestIndex Slave's generation: 1
[junit4:junit4]   2> 13943 T2256 C343 P49774 oash.SnapPuller.fetchLatestIndex Starting replication process
[junit4:junit4]   2> 13945 T2202 C344 P49591 REQ /replication {version=2&wt=javabin&generation=2&command=filelist&qt=/replication} status=0 QTime=0 
[junit4:junit4]   2> 13945 T2256 C343 P49774 oash.SnapPuller.fetchLatestIndex Number of files in latest index in master: 1
[junit4:junit4]   2> 13946 T2256 C343 P49774 oasc.CachingDirectoryFactory.get return new directory for /mnt/ssd/jenkins/workspace/Lucene-Solr-trunk-Linux/solr/build/solr-core/test/J1/./solrtest-UnloadDistributedZkTest-1363736761294/1363736769788unloadcollection1_2n/index.20130319164615236 forceNew: false
[junit4:junit4]   2> 13946 T2256 C343 P49774 oash.SnapPuller.fetchLatestIndex Starting download to MockDirWrapper(org.apache.lucene.store.RAMDirectory@701997fa lockFactory=org.apache.lucene.store.NativeFSLockFactory@767d1036) fullCopy=false
[junit4:junit4]   2> 13949 T2203 C344 P49591 REQ /replication {file=segments_2&checksum=true&wt=filestream&generation=2&command=filecontent&qt=/replication} status=0 QTime=1 
[junit4:junit4]   2> 13950 T2256 C343 P49774 oash.SnapPuller.fetchLatestIndex Total time taken for download : 0 secs
[junit4:junit4]   2> 13950 T2256 C343 P49774 oasu.DefaultSolrCoreState.newIndexWriter Creating new IndexWriter...
[junit4:junit4]   2> 13951 T2256 C343 P49774 oasu.DefaultSolrCoreState.newIndexWriter Waiting until IndexWriter is unused... core=unloadcollection2
[junit4:junit4]   2> 13951 T2256 C343 P49774 oasc.SolrDeletionPolicy.onInit SolrDeletionPolicy.onInit: commits:num=2
[junit4:junit4]   2> 		commit{dir=MockDirWrapper(org.apache.lucene.store.RAMDirectory@2f8044e5 lockFactory=org.apache.lucene.store.NativeFSLockFactory@bab9295),segFN=segments_1,generation=1,filenames=[segments_1]
[junit4:junit4]   2> 		commit{dir=MockDirWrapper(org.apache.lucene.store.RAMDirectory@2f8044e5 lockFactory=org.apache.lucene.store.NativeFSLockFactory@bab9295),segFN=segments_2,generation=2,filenames=[segments_2]
[junit4:junit4]   2> 13952 T2256 C343 P49774 oasc.SolrDeletionPolicy.updateCommits newest commit = 2[segments_2]
[junit4:junit4]   2> 13952 T2256 C343 P49774 oasu.DefaultSolrCoreState.newIndexWriter New IndexWriter is ready to be used.
[junit4:junit4]   2> 13952 T2256 C343 P49774 oass.SolrIndexSearcher.<init> Opening Searcher@3ac99ee4 main
[junit4:junit4]   2> 13953 T2255 oasc.SolrCore.registerSearcher [unloadcollection2] Registered new searcher Searcher@3ac99ee4 main{StandardDirectoryReader(segments_2:1:nrt)}
[junit4:junit4]   2> 13953 T2256 C343 P49774 oasc.RecoveryStrategy.replay No replay needed. core=unloadcollection2
[junit4:junit4]   2> 13953 T2256 C343 P49774 oasc.RecoveryStrategy.doRecovery Replication Recovery was successful - registering as Active. core=unloadcollection2
[junit4:junit4]   2> 13953 T2256 C343 P49774 oasc.ZkController.publish publishing core=unloadcollection2 state=active
[junit4:junit4]   2> 13953 T2256 C343 P49774 oasc.ZkController.publish numShards not found on descriptor - reading it from system property
[junit4:junit4]   2> 13955 T2256 C343 P49774 oasc.RecoveryStrategy.doRecovery Finished recovery process. core=unloadcollection2
[junit4:junit4]   2> 14489 T2191 oascc.ZkStateReader.updateClusterState Updating cloud state from ZooKeeper... 
[junit4:junit4]   2> 14490 T2191 oasc.Overseer$ClusterStateUpdater.updateState Update state numShards=2 message={
[junit4:junit4]   2> 	  "core":"unloadcollection2",
[junit4:junit4]   2> 	  "numShards":"2",
[junit4:junit4]   2> 	  "operation":"state",
[junit4:junit4]   2> 	  "collection":"unloadcollection",
[junit4:junit4]   2> 	  "base_url":"http://127.0.0.1:49774/g/c",
[junit4:junit4]   2> 	  "core_node_name":"127.0.0.1:49774_g%2Fc_unloadcollection2",
[junit4:junit4]   2> 	  "node_name":"127.0.0.1:49774_g%2Fc",
[junit4:junit4]   2> 	  "roles":null,
[junit4:junit4]   2> 	  "state":"active",
[junit4:junit4]   2> 	  "shard":"shard1"}
[junit4:junit4]   2> 14495 T2222 oascc.ZkStateReader$2.process A cluster state change: WatchedEvent state:SyncConnected type:NodeDataChanged path:/clusterstate.json, has occurred - updating... (live nodes size: 5)
[junit4:junit4]   2> 14495 T2250 oascc.ZkStateReader$2.process A cluster state change: WatchedEvent state:SyncConnected type:NodeDataChanged path:/clusterstate.json, has occurred - updating... (live nodes size: 5)
[junit4:junit4]   2> 14495 T2190 oascc.ZkStateReader$2.process A cluster state change: WatchedEvent state:SyncConnected type:NodeDataChanged path:/clusterstate.json, has occurred - updating... (live nodes size: 5)
[junit4:junit4]   2> 14496 T2208 oascc.ZkStateReader$2.process A cluster state change: WatchedEvent state:SyncConnected type:NodeDataChanged path:/clusterstate.json, has occurred - updating... (live nodes size: 5)
[junit4:junit4]   2> 14495 T2195 oascc.ZkStateReader$2.process A cluster state change: WatchedEvent state:SyncConnected type:NodeDataChanged path:/clusterstate.json, has occurred - updating... (live nodes size: 5)
[junit4:junit4]   2> 14495 T2236 oascc.ZkStateReader$2.process A cluster state change: WatchedEvent state:SyncConnected type:NodeDataChanged path:/clusterstate.json, has occurred - updating... (live nodes size: 5)
[junit4:junit4]   2> 14495 T2254 oascc.ZkStateReader$2.process A cluster state change: WatchedEvent state:SyncConnected type:NodeDataChanged path:/clusterstate.json, has occurred - updating... (live nodes size: 5)
[junit4:junit4]   2> 14933 T2168 oascc.ZkStateReader.updateClusterState Updating cloud state from ZooKeeper... 
[junit4:junit4]   2> 14935 T2168 oasc.AbstractDistribZkTestBase.waitForRecoveriesToFinish Recoveries finished - collection: unloadcollection
[junit4:junit4]   2> 14935 T2168 oascsi.HttpClientUtil.createClient Creating new http client, config:maxConnections=128&maxConnectionsPerHost=32&followRedirects=false
[junit4:junit4]   2>  C343_STATE=coll:unloadcollection core:unloadcollection2 props:{core=unloadcollection2, collection=unloadcollection, base_url=http://127.0.0.1:49774/g/c, node_name=127.0.0.1:49774_g%2Fc, state=active, shard=shard1}
[junit4:junit4]   2> 14954 T2218 C343 P49774 /update {version=2&update.distrib=FROMLEADER&wt=javabin&distrib.from=http://127.0.0.1:49591/g/c/unloadcollection1/} {add=[6 (1429981653874245632)]} 0 3
[junit4:junit4]   2> 14955 T2203 C344 P49591 /update {version=2&wt=javabin} {add=[6 (1429981653874245632)]} 0 14
[junit4:junit4]   2> 14961 T2215 C343 P49774 /update {version=2&update.distrib=FROMLEADER&wt=javabin&distrib.from=http://127.0.0.1:49591/g/c/unloadcollection1/} {add=[7 (1429981653889974272)]} 0 1
[junit4:junit4]   2> 14962 T2201 C344 P49591 /update {version=2&wt=javabin} {add=[7 (1429981653889974272)]} 0 5
[junit4:junit4]   2> 14966 T2217 C343 P49774 /update {version=2&update.distrib=FROMLEADER&wt=javabin&distrib.from=http://127.0.0.1:49591/g/c/unloadcollection1/} {add=[8 (1429981653897314304)]} 0 0
[junit4:junit4]   2> 14967 T2204 C344 P49591 /update {version=2&wt=javabin} {add=[8 (1429981653897314304)]} 0 3
[junit4:junit4]   2> 14969 T2202 C344 P49591 oasu.DirectUpdateHandler2.commit start commit{,optimize=false,openSearcher=true,waitSearcher=true,expungeDeletes=false,softCommit=false,prepareCommit=false}
[junit4:junit4]   2> 14976 T2202 C344 P49591 oasc.SolrDeletionPolicy.onCommit SolrDeletionPolicy.onCommit: commits:num=2
[junit4:junit4]   2> 		commit{dir=MockDirWrapper(org.apache.lucene.store.RAMDirectory@7941fdf5 lockFactory=org.apache.lucene.store.NativeFSLockFactory@7c9ff73e),segFN=segments_2,generation=2,filenames=[segments_2]
[junit4:junit4]   2> 		commit{dir=MockDirWrapper(org.apache.lucene.store.RAMDirectory@7941fdf5 lockFactory=org.apache.lucene.store.NativeFSLockFactory@7c9ff73e),segFN=segments_3,generation=3,filenames=[_0_MockFixedIntBlock_0.doc, _0_MockFixedIntBlock_0.tib, _0_MockFixedIntBlock_0.pos, _0_Pulsing41_0.doc, _0_Pulsing41_0.pos, _0_Lucene42_0.dvm, segments_3, _0.fdt, _0_MockFixedIntBlock_0.pyl, _0_MockFixedIntBlock_0.tii, _0.fnm, _0_Memory_0.ram, _0_Memory_1.ram, _0.nvd, _0_Pulsing41_0.tip, _0_MockFixedIntBlock_0.frq, _0_Lucene42_0.dvd, _0.fdx, _0_MockFixedIntBlock_0.skp, _0_Pulsing41_0.tim, _0.si, _0.nvm]
[junit4:junit4]   2> 14976 T2202 C344 P49591 oasc.SolrDeletionPolicy.updateCommits newest commit = 3[_0_MockFixedIntBlock_0.doc, _0_MockFixedIntBlock_0.tib, _0_MockFixedIntBlock_0.pos, _0_Pulsing41_0.doc, _0_Pulsing41_0.pos, _0_Lucene42_0.dvm, segments_3, _0.fdt, _0_MockFixedIntBlock_0.pyl, _0_MockFixedIntBlock_0.tii, _0.fnm, _0_Memory_0.ram, _0_Memory_1.ram, _0.nvd, _0_Pulsing41_0.tip, _0_MockFixedIntBlock_0.frq, _0_Lucene42_0.dvd, _0.fdx, _0_MockFixedIntBlock_0.skp, _0_Pulsing41_0.tim, _0.si, _0.nvm]
[junit4:junit4]   2> 14978 T2202 C344 P49591 oass.SolrIndexSearcher.<init> Opening Searcher@695587df main
[junit4:junit4]   2> 14978 T2202 C344 P49591 oasu.DirectUpdateHandler2.commit end_commit_flush
[junit4:junit4]   2> 14979 T2252 oasc.SolrCore.registerSearcher [unloadcollection1] Registered new searcher Searcher@695587df main{StandardDirectoryReader(segments_3:3:nrt _0(5.0):C3)}
[junit4:junit4]   2> 14979 T2202 C344 P49591 oasu.SolrCmdDistributor.distribCommit Distrib commit to:[StdNode: http://127.0.0.1:49774/g/c/unloadcollection2/] params:commit_end_point=true&commit=true&softCommit=false&waitSearcher=true&expungeDeletes=false
[junit4:junit4]   2> 14981 T2216 C343 P49774 oasu.DirectUpdateHandler2.commit start commit{,optimize=false,openSearcher=true,waitSearcher=true,expungeDeletes=false,softCommit=false,prepareCommit=false}
[junit4:junit4]   2> 14987 T2216 C343 P49774 oasc.SolrDeletionPolicy.onCommit SolrDeletionPolicy.onCommit: commits:num=2
[junit4:junit4]   2> 		commit{dir=MockDirWrapper(org.apache.lucene.store.RAMDirectory@2f8044e5 lockFactory=org.apache.lucene.store.NativeFSLockFactory@bab9295),segFN=segments_2,generation=2,filenames=[segments_2]
[junit4:junit4]   2> 		commit{dir=MockDirWrapper(org.apache.lucene.store.RAMDirectory@2f8044e5 lockFactory=org.apache.lucene.store.NativeFSLockFactory@bab9295),segFN=segments_3,generation=3,filenames=[_0_MockFixedIntBlock_0.doc, _0_MockFixedIntBlock_0.tib, _0_MockFixedIntBlock_0.pos, _0_Pulsing41_0.doc, _0_Pulsing41_0.pos, _0_Lucene42_0.dvm, segments_3, _0.fdt, _0_MockFixedIntBlock_0.pyl, _0_MockFixedIntBlock_0.tii, _0.fnm, _0_Memory_0.ram, _0_Memory_1.ram, _0.nvd, _0_Pulsing41_0.tip, _0_MockFixedIntBlock_0.frq, _0_Lucene42_0.dvd, _0.fdx, _0_MockFixedIntBlock_0.skp, _0_Pulsing41_0.tim, _0.si, _0.nvm]
[junit4:junit4]   2> 14987 T2216 C343 P49774 oasc.SolrDeletionPolicy.updateCommits newest commit = 3[_0_MockFixedIntBlock_0.doc, _0_MockFixedIntBlock_0.tib, _0_MockFixedIntBlock_0.pos, _0_Pulsing41_0.doc, _0_Pulsing41_0.pos, _0_Lucene42_0.dvm, segments_3, _0.fdt, _0_MockFixedIntBlock_0.pyl, _0_MockFixedIntBlock_0.tii, _0.fnm, _0_Memory_0.ram, _0_Memory_1.ram, _0.nvd, _0_Pulsing41_0.tip, _0_MockFixedIntBlock_0.frq, _0_Lucene42_0.dvd, _0.fdx, _0_MockFixedIntBlock_0.skp, _0_Pulsing41_0.tim, _0.si, _0.nvm]
[junit4:junit4]   2> 14989 T2216 C343 P49774 oass.SolrIndexSearcher.<init> Opening Searcher@691d6308 main
[junit4:junit4]   2> 14989 T2216 C343 P49774 oasu.DirectUpdateHandler2.commit end_commit_flush
[junit4:junit4]   2> 14990 T2255 oasc.SolrCore.registerSearcher [unloadcollection2] Registered new searcher Searcher@691d6308 main{StandardDirectoryReader(segments_3:3:nrt _0(5.0):C3)}
[junit4:junit4]   2> 14990 T2216 C343 P49774 /update {version=2&waitSearcher=true&commit=true&wt=javabin&expungeDeletes=false&commit_end_point=true&softCommit=false} {commit=} 0 9
[junit4:junit4]   2> 14990 T2202 C344 P49591 /update {version=2&waitSearcher=true&commit=true&wt=javabin&softCommit=false} {commit=} 0 21
[junit4:junit4]   2> 14991 T2168 oascsi.HttpClientUtil.createClient Creating new http client, config:maxConnections=128&maxConnectionsPerHost=32&followRedirects=false
[junit4:junit4]   2> 14994 T2229 oasc.CoreContainer.create Creating SolrCore 'unloadcollection3' using instanceDir: /mnt/ssd/jenkins/workspace/Lucene-Solr-trunk-Linux/solr/build/solr-core/test/J1/./org.apache.solr.cloud.UnloadDistributedZkTest-jetty3-1363736764471/unloadcollection3
[junit4:junit4]   2> 14994 T2229 oasc.ZkController.createCollectionZkNode Check for collection zkNode:unloadcollection
[junit4:junit4]   2> 14995 T2229 oasc.ZkController.createCollectionZkNode Collection zkNode exists
[junit4:junit4]   2> 14995 T2229 oasc.ZkController.readConfigName Load collection config from:/collections/unloadcollection
[junit4:junit4]   2> 14996 T2229 oasc.SolrResourceLoader.<init> new SolrResourceLoader for directory: '/mnt/ssd/jenkins/workspace/Lucene-Solr-trunk-Linux/solr/build/solr-core/test/J1/./org.apache.solr.cloud.UnloadDistributedZkTest-jetty3-1363736764471/unloadcollection3/'
[junit4:junit4]   2> 15021 T2229 oasc.SolrConfig.<init> Using Lucene MatchVersion: LUCENE_50
[junit4:junit4]   2> 15048 T2229 oasc.SolrConfig.<init> Loaded SolrConfig: solrconfig.xml
[junit4:junit4]   2> 15049 T2229 oass.IndexSchema.readSchema Reading Solr Schema
[junit4:junit4]   2> 15053 T2229 oass.IndexSchema.readSchema Schema name=test
[junit4:junit4]   2> 15347 T2229 oass.OpenExchangeRatesOrgProvider.init Initialized with rates=open-exchange-rates.json, refreshInterval=1440.
[junit4:junit4]   2> 15352 T2229 oass.IndexSchema.readSchema default search field in schema is text
[junit4:junit4]   2> 15355 T2229 oass.IndexSchema.readSchema unique key field: id
[junit4:junit4]   2> 15366 T2229 oass.FileExchangeRateProvider.reload Reloading exchange rates from file currency.xml
[junit4:junit4]   2> 15369 T2229 oass.FileExchangeRateProvider.reload Reloading exchange rates from file currency.xml
[junit4:junit4]   2> 15372 T2229 oass.OpenExchangeRatesOrgProvider.reload Reloading exchange rates from open-exchange-rates.json
[junit4:junit4]   2> 15373 T2229 oass.OpenExchangeRatesOrgProvider$OpenExchangeRates.<init> WARNING Unknown key IMPORTANT NOTE
[junit4:junit4]   2> 15373 T2229 oass.OpenExchangeRatesOrgProvider$OpenExchangeRates.<init> WARNING Expected key, got STRING
[junit4:junit4]   2> 15373 T2229 oass.OpenExchangeRatesOrgProvider.reload Reloading exchange rates from open-exchange-rates.json
[junit4:junit4]   2> 15374 T2229 oass.OpenExchangeRatesOrgProvider$OpenExchangeRates.<init> WARNING Unknown key IMPORTANT NOTE
[junit4:junit4]   2> 15374 T2229 oass.OpenExchangeRatesOrgProvider$OpenExchangeRates.<init> WARNING Expected key, got STRING
[junit4:junit4]   2> 15375 T2229 oasc.SolrCore.initDirectoryFactory org.apache.solr.core.MockDirectoryFactory
[junit4:junit4]   2> 15375 T2229 oasc.SolrCore.<init> [unloadcollection3] Opening new SolrCore at /mnt/ssd/jenkins/workspace/Lucene-Solr-trunk-Linux/solr/build/solr-core/test/J1/./org.apache.solr.cloud.UnloadDistributedZkTest-jetty3-1363736764471/unloadcollection3/, dataDir=/mnt/ssd/jenkins/workspace/Lucene-Solr-trunk-Linux/solr/build/solr-core/test/J1/./solrtest-UnloadDistributedZkTest-1363736761294/1363736776283unloadcollection_3n/
[junit4:junit4]   2> 15375 T2229 oasc.JmxMonitoredMap.<init> JMX monitoring is enabled. Adding Solr mbeans to JMX Server: com.sun.jmx.mbeanserver.JmxMBeanServer@60ae7190
[junit4:junit4]   2> 15376 T2229 oasc.SolrCore.initDirectoryFactory org.apache.solr.core.MockDirectoryFactory
[junit4:junit4]   2> 15376 T2229 oasc.CachingDirectoryFactory.get return new directory for /mnt/ssd/jenkins/workspace/Lucene-Solr-trunk-Linux/solr/build/solr-core/test/J1/./solrtest-UnloadDistributedZkTest-1363736761294/1363736776283unloadcollection_3n forceNew: false
[junit4:junit4]   2> 15377 T2229 oasc.SolrCore.getNewIndexDir New index directory detected: old=null new=/mnt/ssd/jenkins/workspace/Lucene-Solr-trunk-Linux/solr/build/solr-core/test/J1/./solrtest-UnloadDistributedZkTest-1363736761294/1363736776283unloadcollection_3n/index/
[junit4:junit4]   2> 15377 T2229 oasc.SolrCore.initIndex WARNING [unloadcollection3] Solr index directory '/mnt/ssd/jenkins/workspace/Lucene-Solr-trunk-Linux/solr/build/solr-core/test/J1/./solrtest-UnloadDistributedZkTest-1363736761294/1363736776283unloadcollection_3n/index' doesn't exist. Creating new index...
[junit4:junit4]   2> 15377 T2229 oasc.CachingDirectoryFactory.get return new directory for /mnt/ssd/jenkins/workspace/Lucene-Solr-trunk-Linux/solr/build/solr-core/test/J1/./solrtest-UnloadDistributedZkTest-1363736761294/1363736776283unloadcollection_3n/index forceNew: false
[junit4:junit4]   2> 15379 T2229 oasc.SolrDeletionPolicy.onCommit SolrDeletionPolicy.onCommit: commits:num=1
[junit4:junit4]   2> 		commit{dir=MockDirWrapper(org.apache.lucene.store.RAMDirectory@2b0f8142 lockFactory=org.apache.lucene.store.NativeFSLockFactory@34ad77e6),segFN=segments_1,generation=1,filenames=[segments_1]
[junit4:junit4]   2> 15379 T2229 oasc.SolrDeletionPolicy.updateCommits newest commit = 1[segments_1]
[junit4:junit4]   2> 15380 T2229 oasup.UpdateRequestProcessorChain.init inserting DistributedUpdateProcessorFactory into updateRequestProcessorChain "dedupe"
[junit4:junit4]   2> 15381 T2229 oasup.UpdateRequestProcessorChain.init inserting DistributedUpdateProcessorFactory into updateRequestProcessorChain "stored_sig"
[junit4:junit4]   2> 15381 T2229 oasup.UpdateRequestProcessorChain.init inserting DistributedUpdateProcessorFactory into updateRequestProcessorChain "distrib-dup-test-chain-implicit"
[junit4:junit4]   2> 15382 T2229 oasc.RequestHandlers.initHandlersFromConfig created standard: solr.StandardRequestHandler
[junit4:junit4]   2> 15382 T2229 oasc.RequestHandlers.initHandlersFromConfig created /get: solr.RealTimeGetHandler
[junit4:junit4]   2> 15382 T2229 oasc.RequestHandlers.initHandlersFromConfig adding lazy requestHandler: solr.ReplicationHandler
[junit4:junit4]   2> 15383 T2229 oasc.RequestHandlers.initHandlersFromConfig created /replication: solr.ReplicationHandler
[junit4:junit4]   2> 15383 T2229 oasc.RequestHandlers.initHandlersFromConfig created /update: solr.UpdateRequestHandler
[junit4:junit4]   2> 15383 T2229 oasc.RequestHandlers.initHandlersFromConfig created /admin/: org.apache.solr.handler.admin.AdminHandlers
[junit4:junit4]   2> 15386 T2229 oashl.XMLLoader.init xsltCacheLifetimeSeconds=60
[junit4:junit4]   2> 15388 T2229 oass.SolrIndexSearcher.<init> Opening Searcher@2a7aa8b3 main
[junit4:junit4]   2> 15388 T2229 oasu.UpdateHandler.clearLog Clearing tlog files, tlogDir=/mnt/ssd/jenkins/workspace/Lucene-Solr-trunk-Linux/solr/build/solr-core/test/J1/./solrtest-UnloadDistributedZkTest-1363736761294/1363736776283unloadcollection_3n/tlog
[junit4:junit4]   2> 15389 T2229 oasu.CommitTracker.<init> Hard AutoCommit: disabled
[junit4:junit4]   2> 15389 T2229 oasu.CommitTracker.<init> Soft AutoCommit: disabled
[junit4:junit4]   2> 15391 T2260 oasc.SolrCore.registerSearcher [unloadcollection3] Registered new searcher Searcher@2a7aa8b3 main{StandardDirectoryReader(segments_1:1)}
[junit4:junit4]   2> 15392 T2229 oasc.ZkController.publish publishing core=unloadcollection3 state=down
[junit4:junit4]   2> 15392 T2229 oasc.ZkController.publish numShards not found on descriptor - reading it from system property
[junit4:junit4]   2> 16001 T2191 oascc.ZkStateReader.updateClusterState Updating cloud state from ZooKeeper... 
[junit4:junit4]   2> 16001 T2191 oasc.Overseer$ClusterStateUpdater.updateState Update state numShards=2 message={
[junit4:junit4]   2> 	  "core":"unloadcollection3",
[junit4:junit4]   2> 	  "numShards":"2",
[junit4:junit4]   2> 	  "operation":"state",
[junit4:junit4]   2> 	  "collection":"unloadcollection",
[junit4:junit4]   2> 	  "base_url":"http://127.0.0.1:44738/g/c",
[junit4:junit4]   2> 	  "core_node_name":null,
[junit4:junit4]   2> 	  "node_name":"127.0.0.1:44738_g%2Fc",
[junit4:junit4]   2> 	  "roles":null,
[junit4:junit4]   2> 	  "state":"down",
[junit4:junit4]   2> 	  "shard":null}
[junit4:junit4]   2> 16002 T2191 oasc.Overseer$ClusterStateUpdater.updateState Collection already exists with numShards=1
[junit4:junit4]   2> 16002 T2191 oasc.Overseer$ClusterStateUpdater.updateState Assigning new node to shard shard=shard1
[junit4:junit4]   2> 16006 T2190 oascc.ZkStateReader$2.process A cluster state change: WatchedEvent state:SyncConnected type:NodeDataChanged path:/clusterstate.json, has occurred - updating... (live nodes size: 5)
[junit4:junit4]   2> 16006 T2222 oascc.ZkStateReader$2.process A cluster state change: WatchedEvent state:SyncConnected type:NodeDataChanged path:/clusterstate.json, has occurred - updating... (live nodes size: 5)
[junit4:junit4]   2> 16006 T2195 oascc.ZkStateReader$2.process A cluster state change: WatchedEvent state:SyncConnected type:NodeDataChanged path:/clusterstate.json, has occurred - updating... (live nodes size: 5)
[junit4:junit4]   2> 16006 T2250 oascc.ZkStateReader$2.process A cluster state change: WatchedEvent state:SyncConnected type:NodeDataChanged path:/clusterstate.json, has occurred - updating... (live nodes size: 5)
[junit4:junit4]   2> 16006 T2236 oascc.ZkStateReader$2.process A cluster state change: WatchedEvent state:SyncConnected type:NodeDataChanged path:/clusterstate.json, has occurred - updating... (live nodes size: 5)
[junit4:junit4]   2> 16006 T2254 oascc.ZkStateReader$2.process A cluster state change: WatchedEvent state:SyncConnected type:NodeDataChanged path:/clusterstate.json, has occurred - updating... (live nodes size: 5)
[junit4:junit4]   2> 16006 T2208 oascc.ZkStateReader$2.process A cluster state change: WatchedEvent state:SyncConnected type:NodeDataChanged path:/clusterstate.json, has occurred - updating... (live nodes size: 5)
[junit4:junit4]   2> 16394 T2229 oasc.CoreContainer.registerCore registering core: unloadcollection3
[junit4:junit4]   2> 16394 T2229 oasc.ZkController.register Register replica - core:unloadcollection3 address:http://127.0.0.1:44738/g/c collection:unloadcollection shard:shard1
[junit4:junit4]   2> 16397 T2229 oasc.ZkController.register We are http://127.0.0.1:44738/g/c/unloadcollection3/ and leader is http://127.0.0.1:49591/g/c/unloadcollection1/
[junit4:junit4]   2> 16397 T2229 oasc.ZkController.register No LogReplay needed for core=unloadcollection3 baseURL=http://127.0.0.1:44738/g/c
[junit4:junit4]   2> 16397 T2229 oasc.ZkController.checkRecovery Core needs to recover:unloadcollection3
[junit4:junit4]   2> 16398 T2229 oasu.DefaultSolrCoreState.doRecovery Running recovery - first canceling any ongoing recovery
[junit4:junit4]   2> ASYNC  NEW_CORE C345 name=unloadcollection3 org.apache.solr.core.SolrCore@1738d0af url=http://127.0.0.1:44738/g/c/unloadcollection3 node=127.0.0.1:44738_g%2Fc C345_STATE=coll:unloadcollection core:unloadcollection3 props:{core=unloadcollection3, collection=unloadcollection, base_url=http://127.0.0.1:44738/g/c, node_name=127.0.0.1:44738_g%2Fc, state=down}
[junit4:junit4]   2> 16398 T2261 C345 P44738 oasc.RecoveryStrategy.run Starting recovery process.  core=unloadcollection3 recoveringAfterStartup=true
[junit4:junit4]   2> 16399 T2261 C345 P44738 oasc.RecoveryStrategy.doRecovery ###### startupVersions=[]
[junit4:junit4]   2> 16398 T2229 oascc.ZkStateReader.updateClusterState Updating cloud state from ZooKeeper... 
[junit4:junit4]   2> 16399 T2261 C345 P44738 oasc.ZkController.publish publishing core=unloadcollection3 state=recovering
[junit4:junit4]   2> 16399 T2261 C345 P44738 oasc.ZkController.publish numShards not found on descriptor - reading it from system property
[junit4:junit4]   2> 16400 T2229 oasc.CoreContainer.persistFile Persisting cores config to /mnt/ssd/jenkins/workspace/Lucene-Solr-trunk-Linux/solr/build/solr-core/test/J1/./org.apache.solr.cloud.UnloadDistributedZkTest-jetty3-1363736764471/solr.xml
[junit4:junit4]   2> 16402 T2261 C345 P44738 oascsi.HttpClientUtil.createClient Creating new http client, config:maxConnections=128&maxConnectionsPerHost=32&followRedirects=false
[junit4:junit4]   2> 16407 T2229 oasc.SolrXMLSerializer.persistFile Persisting cores config to /mnt/ssd/jenkins/workspace/Lucene-Solr-trunk-Linux/solr/build/solr-core/test/J1/./org.apache.solr.cloud.UnloadDistributedZkTest-jetty3-1363736764471/solr.xml
[junit4:junit4]   2> 16408 T2229 oass.SolrDispatchFilter.handleAdminRequest /admin/cores {dataDir=/mnt/ssd/jenkins/workspace/Lucene-Solr-trunk-Linux/solr/build/solr-core/test/J1/./solrtest-UnloadDistributedZkTest-1363736761294/1363736776283unloadcollection_3n&version=2&name=unloadcollection3&collection=unloadcollection&wt=javabin&action=CREATE} status=0 QTime=1414 
[junit4:junit4]   2> 16408 T2168 oasc.AbstractDistribZkTestBase.waitForRecoveriesToFinish Wait for recoveries to finish - collection: unloadcollection failOnTimeout:true timeout (sec):230
[junit4:junit4]   2> 16409 T2168 oascc.ZkStateReader.updateClusterState Updating cloud state from ZooKeeper... 
[junit4:junit4]   2> 17410 T2168 oascc.ZkStateReader.updateClusterState Updating cloud state from ZooKeeper... 
[junit4:junit4]   2> 17509 T2191 oascc.ZkStateReader.updateClusterState Updating cloud state from ZooKeeper... 
[junit4:junit4]   2> 17510 T2191 oasc.Overseer$ClusterStateUpdater.updateState Update state numShards=2 message={
[junit4:junit4]   2> 	  "core":"unloadcollection3",
[junit4:junit4]   2> 	  "numShards":"2",
[junit4:junit4]   2> 	  "operation":"state",
[junit4:junit4]   2> 	  "collection":"unloadcollection",
[junit4:junit4]   2> 	  "base_url":"http://127.0.0.1:44738/g/c",
[junit4:junit4]   2> 	  "core_node_name":"127.0.0.1:44738_g%2Fc_unloadcollection3",
[junit4:junit4]   2> 	  "node_name":"127.0.0.1:44738_g%2Fc",
[junit4:junit4]   2> 	  "roles":null,
[junit4:junit4]   2> 	  "state":"recovering",
[junit4:junit4]   2> 	  "shard":"shard1"}
[junit4:junit4]   2> 17513 T2254 oascc.ZkStateReader$2.process A cluster state change: WatchedEvent state:SyncConnected type:NodeDataChanged path:/clusterstate.json, has occurred - updating... (live nodes size: 5)
[junit4:junit4]   2> 17513 T2190 oascc.ZkStateReader$2.process A cluster state change: WatchedEvent state:SyncConnected type:NodeDataChanged path:/clusterstate.json, has occurred - updating... (live nodes size: 5)
[junit4:junit4]   2> 17513 T2236 oascc.ZkStateReader$2.process A cluster state change: WatchedEvent state:SyncConnected type:NodeDataChanged path:/clusterstate.json, has occurred - updating... (live nodes size: 5)
[junit4:junit4]   2> 17513 T2195 oascc.ZkStateReader$2.process A cluster state change: WatchedEvent state:SyncConnected type:NodeDataChanged path:/clusterstate.json, has occurred - updating... (live nodes size: 5)
[junit4:junit4]   2> 17513 T2222 oascc.ZkStateReader$2.process A cluster state change: WatchedEvent state:SyncConnected type:NodeDataChanged path:/clusterstate.json, has occurred - updating... (live nodes size: 5)
[junit4:junit4]   2> 17513 T2250 oascc.ZkStateReader$2.process A cluster state change: WatchedEvent state:SyncConnected type:NodeDataChanged path:/clusterstate.json, has occurred - updating... (live nodes size: 5)
[junit4:junit4]   2> 17513 T2208 oascc.ZkStateReader$2.process A cluster state change: WatchedEvent state:SyncConnected type:NodeDataChanged path:/clusterstate.json, has occurred - updating... (live nodes size: 5)
[junit4:junit4]   2> 18405 T2201 oass.SolrDispatchFilter.handleAdminRequest /admin/cores {version=2&core=unloadcollection1&onlyIfLeader=true&wt=javabin&checkLive=true&nodeName=127.0.0.1:44738_g%252Fc&state=recovering&action=PREPRECOVERY&coreNodeName=127.0.0.1:44738_g%252Fc_unloadcollection3} status=0 QTime=2000 
[junit4:junit4]   2> 18412 T2168 oascc.ZkStateReader.updateClusterState Updating cloud state from ZooKeeper... 
[junit4:junit4]   2> 19413 T2168 oascc.ZkStateReader.updateClusterState Updating cloud state from ZooKeeper... 
[junit4:junit4]   2>  C345_STATE=coll:unloadcollection core:unloadcollection3 props:{core=unloadcollection3, collection=unloadcollection, base_url=http://127.0.0.1:44738/g/c, node_name=127.0.0.1:44738_g%2Fc, state=recovering, shard=shard1}
[junit4:junit4]   2> 20406 T2261 C345 P44738 oasc.RecoveryStrategy.doRecovery Attempting to PeerSync from http://127.0.0.1:49591/g/c/unloadcollection1/ core=unloadcollection3 - recoveringAfterStartup=true
[junit4:junit4]   2> 20407 T2261 C345 P44738 oasu.PeerSync.sync PeerSync: core=unloadcollection3 url=http://127.0.0.1:44738/g/c START replicas=[http://127.0.0.1:49591/g/c/unloadcollection1/] nUpdates=100
[junit4:junit4]   2> 20407 T2261 C345 P44738 oasu.PeerSync.sync WARNING no frame of reference to tell of we've missed updates
[junit4:junit4]   2> 20407 T2261 C345 P44738 oasc.RecoveryStrategy.doRecovery PeerSync Recovery was not successful - trying replication. core=unloadcollection3
[junit4:junit4]   2> 20407 T2261 C345 P44738 oasc.RecoveryStrategy.doRecovery Starting Replication Recovery. core=unloadcollection3
[junit4:junit4]   2> 20407 T2261 C345 P44738 oasc.RecoveryStrategy.doRecovery Begin buffering updates. core=unloadcollection3
[junit4:junit4]   2> 20407 T2261 C345 P44738 oasu.UpdateLog.bufferUpdates Starting to buffer updates. FSUpdateLog{state=ACTIVE, tlog=null}
[junit4:junit4]   2> 20407 T2261 C345 P44738 oasc.RecoveryStrategy.replicate Attempting to replicate from http://127.0.0.1:49591/g/c/unloadcollection1/. core=unloadcollection3
[junit4:junit4]   2> 20408 T2261 C345 P44738 oascsi.HttpClientUtil.createClient Creating new http client, config:maxConnections=128&maxConnectionsPerHost=32&followRedirects=false
[junit4:junit4]   2> 20409 T2203 C344 P49591 REQ /get {version=2&getVersions=100&wt=javabin&distrib=false&qt=/get} status=0 QTime=0 
[junit4:junit4]   2> 20411 T2202 C344 P49591 oasu.DirectUpdateHandler2.commit start commit{,optimize=false,openSearcher=false,waitSearcher=true,expungeDeletes=false,softCommit=false,prepareCommit=false}
[junit4:junit4]   2> 20412 T2202 C344 P49591 oasc.SolrDeletionPolicy.onCommit SolrDeletionPolicy.onCommit: commits:num=3
[junit4:junit4]   2> 		commit{dir=MockDirWrapper(org.apache.lucene.store.RAMDirectory@7941fdf5 lockFactory=org.apache.lucene.store.NativeFSLockFactory@7c9ff73e),segFN=segments_2,generation=2,filenames=[segments_2]
[junit4:junit4]   2> 		commit{dir=MockDirWrapper(org.apache.lucene.store.RAMDirectory@7941fdf5 lockFactory=org.apache.lucene.store.NativeFSLockFactory@7c9ff73e),segFN=segments_3,generation=3,filenames=[_0_MockFixedIntBlock_0.doc, _0_MockFixedIntBlock_0.tib, _0_MockFixedIntBlock_0.pos, _0_Pulsing41_0.doc, _0_Pulsing41_0.pos, _0_Lucene42_0.dvm, segments_3, _0.fdt, _0_MockFixedIntBlock_0.pyl, _0_MockFixedIntBlock_0.tii, _0.fnm, _0_Memory_0.ram, _0_Memory_1.ram, _0.nvd, _0_Pulsing41_0.tip, _0_MockFixedIntBlock_0.frq, _0_Lucene42_0.dvd, _0.fdx, _0_MockFixedIntBlock_0.skp, _0_Pulsing41_0.tim, _0.si, _0.nvm]
[junit4:junit4]   2> 		commit{dir=MockDirWrapper(org.apache.lucene.store.RAMDirectory@7941fdf5 lockFactory=org.apache.lucene.store.NativeFSLockFactory@7c9ff73e),segFN=segments_4,generation=4,filenames=[_0_MockFixedIntBlock_0.doc, _0_MockFixedIntBlock_0.tib, _0_MockFixedIntBlock_0.pos, _0_Pulsing41_0.doc, _0_Pulsing41_0.pos, _0_Lucene42_0.dvm, _0.fdt, _0_MockFixedIntBlock_0.pyl, _0_MockFixedIntBlock_0.tii, _0.fnm, segments_4, _0_Memory_0.ram, _0_Memory_1.ram, _0.nvd, _0_Pulsing41_0.tip, _0_MockFixedIntBlock_0.frq, _0_Lucene42_0.dvd, _0.fdx, _0_MockFixedIntBlock_0.skp, _0_Pulsing41_0.tim, _0.si, _0.nvm]
[junit4:junit4]   2> 20412 T2202 C344 P49591 oasc.SolrDeletionPolicy.updateCommits newest commit = 4[_0_MockFixedIntBlock_0.doc, _0_MockFixedIntBlock_0.tib, _0_MockFixedIntBlock_0.pos, _0_Pulsing41_0.doc, _0_Pulsing41_0.pos, _0_Lucene42_0.dvm, _0.fdt, _0_MockFixedIntBlock_0.pyl, _0_MockFixedIntBlock_0.tii, _0.fnm, segments_4, _0_Memory_0.ram, _0_Memory_1.ram, _0.nvd, _0_Pulsing41_0.tip, _0_MockFixedIntBlock_0.frq, _0_Lucene42_0.dvd, _0.fdx, _0_MockFixedIntBlock_0.skp, _0_Pulsing41_0.tim, _0.si, _0.nvm]
[junit4:junit4]   2> 20413 T2202 C344 P49591 oasu.DirectUpdateHandler2.commit end_commit_flush
[junit4:junit4]   2> 20413 T2202 C344 P49591 /update {version=2&waitSearcher=true&commit=true&wt=javabin&commit_end_point=true&softCommit=false&openSearcher=false} {commit=} 0 2
[junit4:junit4]   2> 20414 T2261 C345 P44738 oash.ReplicationHandler.inform Commits will be reserved for  10000
[junit4:junit4]   2> 20414 T2261 C345 P44738 oash.SnapPuller.<init>  No value set for 'pollInterval'. Timer Task not started.
[junit4:junit4]   2> 20415 T2168 oascc.ZkStateReader.updateClusterState Updating cloud state from ZooKeeper... 
[junit4:junit4]   2> 20416 T2203 C344 P49591 REQ /replication {version=2&wt=javabin&command=indexversion&qt=/replication} status=0 QTime=1 
[junit4:junit4]   2> 20416 T2261 C345 P44738 oash.SnapPuller.fetchLatestIndex Master's generation: 4
[junit4:junit4]   2> 20416 T2261 C345 P44738 oash.SnapPuller.fetchLatestIndex Slave's generation: 1
[junit4:junit4]   2> 20416 T2261 C345 P44738 oash.SnapPuller.fetchLatestIndex Starting replication process
[junit4:junit4]   2> 20418 T2204 C344 P49591 REQ /replication {version=2&wt=javabin&generation=4&command=filelist&qt=/replication} status=0 QTime=0 
[junit4:junit4]   2> 20418 T2261 C345 P44738 oash.SnapPuller.fetchLatestIndex Number of files in latest index in master: 22
[junit4:junit4]   2> 20420 T2261 C345 P44738 oasc.CachingDirectoryFactory.get return new directory for /mnt/ssd/jenkins/workspace/Lucene-Solr-trunk-Linux/solr/build/solr-core/test/J1/./solrtest-UnloadDistributedZkTest-1363736761294/1363736776283unloadcollection_3n/index.20130319164621709 forceNew: false
[junit4:junit4]   2> 20420 T2261 C345 P44738 oash.SnapPuller.fetchLatestIndex Starting download to MockDirWrapper(org.apache.lucene.store.RAMDirectory@3443503f lockFactory=org.apache.lucene.store.NativeFSLockFactory@62619df4) fullCopy=false
[junit4:junit4]   2> 20422 T2202 C344 P49591 REQ /replication {file=_0_MockFixedIntBlock_0.doc&checksum=true&wt=filestream&generation=4&command=filecontent&qt=/replication} status=0 QTime=0 
[junit4:junit4]   2> 20426 T2201 C344 P49591 REQ /replication {file=_0_MockFixedIntBlock_0.tib&checksum=true&wt=filestream&generation=4&command=filecontent&qt=/replication} status=0 QTime=1 
[junit4:junit4]   2> 20429 T2203 C344 P49591 REQ /replication {file=_0_MockFixedIntBlock_0.pos&checksum=true&wt=filestream&generation=4&command=filecontent&qt=/replication} status=0 QTime=0 
[junit4:junit4]   2> 20432 T2204 C344 P49591 REQ /replication {file=_0_Pulsing41_0.doc&checksum=true&wt=filestream&generation=4&command=filecontent&qt=/replication} status=0 QTime=0 
[junit4:junit4]   2> 20436 T2202 C344 P49591 REQ /replication {file=_0_Lucene42_0.dvm&checksum=true&wt=filestream&generation=4&command=filecontent&qt=/replication} status=0 QTime=1 
[junit4:junit4]   2> 20439 T2201 C344 P49591 REQ /replication {file=_0_Pulsing41_0.pos&checksum=true&wt=filestream&generation=4&command=filecontent&qt=/replication} status=0 QTime=0 
[junit4:junit4]   2> 20442 T2203 C344 P49591 REQ /replication {file=_0_MockFixedIntBlock_0.tii&checksum=true&wt=filestream&generation=4&command=filecontent&qt=/replication} status=0 QTime=0 
[junit4:junit4]   2> 20446 T2204 C344 P49591 REQ /replication {file=_0_MockFixedIntBlock_0.pyl&checksum=true&wt=filestream&generation=4&command=filecontent&qt=/replication} status=0 QTime=1 
[junit4:junit4]   2> 20447 T2261 C345 P44738 oash.SnapPuller$DirectoryFileFetcher.fetchPackets WARNING No content recieved for file: {name=_0_MockFixedIntBlock_0.pyl, size=0}
[junit4:junit4]   2> 20499 T2202 C344 P49591 REQ /replication {file=_0.fdt&checksum=true&wt=filestream&generation=4&command=filecontent&qt=/replication} status=0 QTime=0 
[junit4:junit4]   2> 20503 T2201 C344 P49591 REQ /replication {file=_0.fnm&checksum=true&wt=filestream&generation=4&command=filecontent&qt=/replication} status=0 QTime=0 
[junit4:junit4]   2> 20506 T2203 C344 P49591 REQ /replication {file=segments_4&checksum=true&wt=filestream&generation=4&command=filecontent&qt=/replication} status=0 QTime=0 
[junit4:junit4]   2> 20509 T2204 C344 P49591 REQ /replication {file=_0_Memory_0.ram&checksum=true&wt=filestream&generation=4&command=filecontent&qt=/replication} status=0 QTime=0 
[junit4:junit4]   2> 20513 T2202 C344 P49591 REQ /replication {file=_0.nvd&checksum=true&wt=filestream&generation=4&command=filecontent&qt=/replication} status=0 QTime=1 
[junit4:junit4]   2> 20516 T2201 C344 P49591 REQ /replication {file=_0_Memory_1.ram&checksum=true&wt=filestream&generation=4&command=filecontent&qt=/replication} status=0 QTime=0 
[junit4:junit4]   2> 20519 T2203 C344 P49591 REQ /replication {file=_0_Pulsing41_0.tip&checksum=true&wt=filestream&generation=4&command=filecontent&qt=/replication} status=0 QTime=0 
[junit4:junit4]   2> 20522 T2204 C344 P49591 REQ /replication {file=_0_MockFixedIntBlock_0.frq&checksum=true&wt=filestream&generation=4&command=filecontent&qt=/replication} status=0 QTime=0 
[junit4:junit4]   2> 20526 T2202 C344 P49591 REQ /replication {file=_0.fdx&checksum=true&wt=filestream&generation=4&command=filecontent&qt=/replication} status=0 QTime=1 
[junit4:junit4]   2> 20529 T2201 C344 P49591 REQ /replication {file=_0_Lucene42_0.dvd&checksum=true&wt=filestream&generation=4&command=filecontent&qt=/replication} status=0 QTime=0 
[junit4:junit4]   2> 20533 T2203 C344 P49591 REQ /replication {file=_0_Pulsing41_0.tim&checksum=true&wt=filestream&generation=4&command=filecontent&qt=/replication} status=0 QTime=0 
[junit4:junit4]   2> 20536 T2204 C344 P49591 REQ /replication {file=_0_MockFixedIntBlock_0.skp&checksum=true&wt=filestream&generation=4&command=filecontent&qt=/replication} status=0 QTime=0 
[junit4:junit4]   2> 20538 T2261 C345 P44738 oash.SnapPuller$DirectoryFileFetcher.fetchPackets WARNING No content recieved for file: {name=_0_MockFixedIntBlock_0.skp, size=0}
[junit4:junit4]   2> 20540 T2202 C344 P49591 REQ /replication {file=_0.si&checksum=true&wt=filestream&generation=4&command=filecontent&qt=/replication} status=0 QTime=0 
[junit4:junit4]   2> 20543 T2201 C344 P49591 REQ /replication {file=_0.nvm&checksum=true&wt=filestream&generation=4&command=filecontent&qt=/replication} status=0 QTime=0 
[junit4:junit4]   2> 20545 T2261 C345 P44738 oash.SnapPuller.fetchLatestIndex Total time taken for download : 0 secs
[junit4:junit4]   2> 20546 T2261 C345 P44738 oasu.DefaultSolrCoreState.newIndexWriter Creating new IndexWriter...
[junit4:junit4]   2> 20546 T2261 C345 P44738 oasu.DefaultSolrCoreState.newIndexWriter Waiting until IndexWriter is unused... core=unloadcollection3
[junit4:junit4]   2> 20547 T2261 C345 P44738 oasc.SolrDeletionPolicy.onInit SolrDeletionPolicy.onInit: commits:num=2
[junit4:junit4]   2> 		commit{dir=MockDirWrapper(org.apache.lucene.store.RAMDirectory@2b0f8142 lockFactory=org.apache.lucene.store.NativeFSLockFactory@34ad77e6),segFN=segments_1,generation=1,filenames=[segments_1]
[junit4:junit4]   2> 		commit{dir=MockDirWrapper(org.apache.lucene.store.RAMDirectory@2b0f8142 lockFactory=org.apache.lucene.store.NativeFSLockFactory@34ad77e6),segFN=segments_4,generation=4,filenames=[_0_MockFixedIntBlock_0.doc, _0_MockFixedIntBlock_0.tib, _0_MockFixedIntBlock_0.pos, _0_Pulsing41_0.doc, _0_Pulsing41_0.pos, _0_Lucene42_0.dvm, _0.fdt, _0_MockFixedIntBlock_0.pyl, _0_MockFixedIntBlock_0.tii, _0.fnm, segments_4, _0_Memory_0.ram, _0.nvd, _0_Memory_1.ram, _0_Pulsing41_0.tip, _0_MockFixedIntBlock_0.frq, _0.fdx, _0_Lucene42_0.dvd, _0_Pulsing41_0.tim, _0_MockFixedIntBlock_0.skp, _0.si, _0.nvm]
[junit4:junit4]   2> 20547 T2261 C345 P44738 oasc.SolrDeletionPolicy.updateCommits newest commit = 4[_0_MockFixedIntBlock_0.doc, _0_MockFixedIntBlock_0.tib, _0_MockFixedIntBlock_0.pos, _0_Pulsing41_0.doc, _0_Pulsing41_0.pos, _0_Lucene42_0.dvm, _0.fdt, _0_MockFixedIntBlock_0.pyl, _0_MockFixedIntBlock_0.tii, _0.fnm, segments_4, _0_Memory_0.ram, _0.nvd, _0_Memory_1.ram, _0_Pulsing41_0.tip, _0_MockFixedIntBlock_0.frq, _0.fdx, _0_Lucene42_0.dvd, _0_Pulsing41_0.tim, _0_MockFixedIntBlock_0.skp, _0.si, _0.nvm]
[junit4:junit4]   2> 20548 T2261 C345 P44738 oasu.DefaultSolrCoreState.newIndexWriter New IndexWriter is ready to be used.
[junit4:junit4]   2> 20548 T2261 C345 P44738 oass.SolrIndexSearcher.<init> Opening Searcher@596d20a9 main
[junit4:junit4]   2> 20549 T2260 oasc.SolrCore.registerSearcher [unloadcollection3] Registered new searcher Searcher@596d20a9 main{StandardDirectoryReader(segments_4:3:nrt _0(5.0):C3)}
[junit4:junit4]   2> 20550 T2261 C345 P44738 oasc.RecoveryStrategy.replay No replay needed. core=unloadcollection3
[junit4:junit4]   2> 20550 T2261 C345 P44738 oasc.RecoveryStrategy.doRecovery Replication Recovery was successful - registering as Active. core=unloadcollection3
[junit4:junit4]   2> 20550 T2261 C345 P44738 oasc.ZkController.publish publishing core=unloadcollection3 state=active
[junit4:junit4]   2> 20550 T2261 C345 P44738 oasc.ZkController.publish numShards not found on descriptor - reading it from system property
[junit4:junit4]   2> 20551 T2261 C345 P44738 oasc.RecoveryStrategy.doRecovery Finished recovery process. core=unloadcollection3
[junit4:junit4]   2> 21417 T2168 oascc.ZkStateReader.updateClusterState Updating cloud state from ZooKeeper... 
[junit4:junit4]   2> 22021 T2191 oascc.ZkStateReader.updateClusterState Updating cloud state from ZooKeeper... 
[junit4:junit4]   2> 22021 T2191 oasc.Overseer$ClusterStateUpdater.updateState Update state numShards=2 message={
[junit4:junit4]   2> 	  "core":"unloadcollection3",
[junit4:junit4]   2> 	  "numShards":"2",
[junit4:junit4]   2> 	  "operation":"state",
[junit4:junit4]   2> 	  "collection":"unloadcollection",
[junit4:junit4]   2> 	  "base_url":"http://127.0.0.1:44738/g/c",
[junit4:junit4]   2> 	  "core_node_name":"127.0.0.1:44738_g%2Fc_unloadcollection3",
[junit4:junit4]   2> 	  "node_name":"127.0.0.1:44738_g%2Fc",
[junit4:junit4]   2> 	  "roles":null,
[junit4:junit4]   2> 	  "state":"active",
[junit4:junit4]   2> 	  "shard":"shard1"}
[junit4:junit4]   2> 22026 T2250 oascc.ZkStateReader$2.process A cluster state change: WatchedEvent state:SyncConnected type:NodeDataChanged path:/clusterstate.json, has occurred - updating... (live nodes size: 5)
[junit4:junit4]   2> 22026 T2195 oascc.ZkStateReader$2.process A cluster state change: WatchedEvent state:SyncConnected type:NodeDataChanged path:/clusterstate.json, has occurred - updating... (live nodes size: 5)
[junit4:junit4]   2> 22026 T2222 oascc.ZkStateReader$2.process A cluster state change: WatchedEvent state:SyncConnected type:NodeDataChanged path:/clusterstate.json, has occurred - updating... (live nodes size: 5)
[junit4:junit4]   2> 22027 T2208 oascc.ZkStateReader$2.process A cluster state change: WatchedEvent state:SyncConnected type:NodeDataChanged path:/clusterstate.json, has occurred - updating... (live nodes size: 5)
[junit4:junit4]   2> 22027 T2254 oascc.ZkStateReader$2.process A cluster state change: WatchedEvent state:SyncConnected type:NodeDataChanged path:/clusterstate.json, has occurred - updating... (live nodes size: 5)
[junit4:junit4]   2> 22027 T2236 oascc.ZkStateReader$2.process A cluster state change: WatchedEvent state:SyncConnected type:NodeDataChanged path:/clusterstate.json, has occurred - updating... (live nodes size: 5)
[junit4:junit4]   2> 22027 T2190 oascc.ZkStateReader$2.process A cluster state change: WatchedEvent state:SyncConnected type:NodeDataChanged path:/clusterstate.json, has occurred - updating... (live nodes size: 5)
[junit4:junit4]   2> 22419 T2168 oascc.ZkStateReader.updateClusterState Updating cloud state from ZooKeeper... 
[junit4:junit4]   2> 22420 T2168 oasc.AbstractDistribZkTestBase.waitForRecoveriesToFinish Recoveries finished - collection: unloadcollection
[junit4:junit4]   2> 22420 T2168 oascsi.HttpClientUtil.createClient Creating new http client, config:maxConnections=128&maxConnectionsPerHost=32&followRedirects=false
[junit4:junit4]   2>  C345_STATE=coll:unloadcollection core:unloadcollection3 props:{core=unloadcollection3, collection=unloadcollection, base_url=http://127.0.0.1:44738/g/c, node_name=127.0.0.1:44738_g%2Fc, state=active, shard=shard1}
[junit4:junit4]   2> 22433 T2229 C345 P44738 /update {version=2&update.distrib=FROMLEADER&wt=javabin&distrib.from=http://127.0.0.1:49591/g/c/unloadcollection1/} {add=[20 (1429981661724934144)]} 0 2
[junit4:junit4]   2> 22434 T2216 C343 P49774 /update {version=2&update.distrib=FROMLEADER&wt=javabin&distrib.from=http://127.0.0.1:49591/g/c/unloadcollection1/} {add=[20 (1429981661724934144)]} 0 2
[junit4:junit4]   2> 22434 T2202 C344 P49591 /update {version=2&update.distrib=TOLEADER&wt=javabin&distrib.from=http://127.0.0.1:44738/g/c/unloadcollection3/} {add=[20 (1429981661724934144)]} 0 5
[junit4:junit4]   2> 22434 T2232 C345 P44738 /update {version=2&wt=javabin} {add=[20]} 0 7
[junit4:junit4]   2> 22441 T2218 C343 P49774 /update {version=2&update.distrib=FROMLEADER&wt=javabin&distrib.from=http://127.0.0.1:49591/g/c/unloadcollection1/} {add=[21 (1429981661734371328)]} 0 1
[junit4:junit4]   2> 22442 T2230 C345 P44738 /update {version=2&update.distrib=FROMLEADER&wt=javabin&distrib.from=http://127.0.0.1:49591/g/c/unloadcollection1/} {add=[21 (1429981661734371328)]} 0 2
[junit4:junit4]   2> 22442 T2201 C344 P49591 /update {version=2&update.distrib=TOLEADER&wt=javabin&distrib.from=http://127.0.0.1:44738/g/c/unloadcollection3/} {add=[21 (1429981661734371328)]} 0 4
[junit4:junit4]   2> 22442 T2231 C345 P44738 /update {version=2&wt=javabin} {add=[21]} 0 6
[junit4:junit4]   2> 22449 T2215 C343 P49774 /update {version=2&update.distrib=FROMLEADER&wt=javabin&distrib.from=http://127.0.0.1:49591/g/c/unloadcollection1/} {add=[22 (1429981661742759936)]} 0 1
[junit4:junit4]   2> 22449 T2232 C345 P44738 /update {version=2&update.distrib=FROMLEADER&wt=javabin&distrib.from=http://127.0.0.1:49591/g/c/unloadcollection1/} {add=[22 (1429981661742759936)]} 0 1
[junit4:junit4]   2> 22450 T2203 C344 P49591 /update {version=2&update.distrib=TOLEADER&wt=javabin&distrib.from=http://127.0.0.1:44738/g/c/unloadcollection3/} {add=[22 (1429981661742759936)]} 0 4
[junit4:junit4]   2> 22450 T2229 C345 P44738 /update {version=2&wt=javabin} {add=[22]} 0 6
[junit4:junit4]   2> 22457 T2217 C343 P49774 /update {version=2&update.distrib=FROMLEADER&wt=javabin&distrib.from=http://127.0.0.1:49591/g/c/unloadcollection1/} {add=[23 (1429981661751148544)]} 0 1
[junit4:junit4]   2> 22457 T2231 C345 P44738 /update {version=2&update.distrib=FROMLEADER&wt=javabin&distrib.from=http://127.0.0.1:49591/g/c/unloadcollection1/} {add=[23 (1429981661751148544)]} 0 1
[junit4:junit4]   2> 22457 T2204 C344 P49591 /update {version=2&update.distrib=TOLEADER&wt=javabin&distrib.from=http://127.0.0.1:44738/g/c/unloadcollection3/} {add=[23 (1429981661751148544)]} 0 3
[junit4:junit4]   2> 22458 T2230 C345 P44738 /update {version=2&wt=javabin} {add=[23]} 0 6
[junit4:junit4]   2> 22464 T2216 C343 P49774 /update {version=2&update.distrib=FROMLEADER&wt=javabin&distrib.from=http://127.0.0.1:49591/g/c/unloadcollection1/} {add=[24 (1429981661758488576)]} 0 1
[junit4:junit4]   2> 22464 T2229 C345 P44738 /update {version=2&update.distrib=FROMLEADER&wt=javabin&distrib.from=http://127.0.0.1:49591/g/c/unloadcollection1/} {add=[24 (1429981661758488576)]} 0 1
[junit4:junit4]   2> 22464 T2202 C344 P49591 /update {version=2&update.distrib=TOLEADER&wt=javabin&distrib.from=http://127.0.0.1:44738/g/c/unloadcollection3/} {add=[24 (1429981661758488576)]} 0 3
[junit4:junit4]   2> 22465 T2232 C345 P44738 /update {version=2&wt=javabin} {add=[24]} 0 5
[junit4:junit4]   2> 22471 T2218 C343 P49774 /update {version=2&update.distrib=FROMLEADER&wt=javabin&distrib.from=http://127.0.0.1:49591/g/c/unloadcollection1/} {add=[25 (1429981661765828608)]} 0 1
[junit4:junit4]   2> 22471 T2230 C345 P44738 /update {version=2&update.distrib=FROMLEADER&wt=javabin&distrib.from=http://127.0.0.1:49591/g/c/unloadcollection1/} {add=[25 (1429981661765828608)]} 0 1
[junit4:junit4]   2> 22471 T2201 C344 P49591 /update {version=2&update.distrib=TOLEADER&wt=javabin&distrib.from=http://127.0.0.1:44738/g/c/unloadcollection3/} {add=[25 (1429981661765828608)]} 0 3
[junit4:junit4]   2> 22472 T2231 C345 P44738 /update {version=2&wt=javabin} {add=[25]} 0 5
[junit4:junit4]   2> 22478 T2232 C345 P44738 /update {version=2&update.distrib=FROMLEADER&wt=javabin&distrib.from=http://127.0.0.1:49591/g/c/unloadcollection1/} {add=[26 (1429981661774217216)]} 0 0
[junit4:junit4]   2> 22478 T2215 C343 P49774 /update {version=2&update.distrib=FROMLEADER&wt=javabin&distrib.from=http://127.0.0.1:49591/g/c/unloadcollection1/} {add=[26 (1429981661774217216)]} 0 1
[junit4:junit4]   2> 22478 T2203 C344 P49591 /update {version=2&update.distrib=TOLEADER&wt=javabin&distrib.from=http://127.0.0.1:44738/g/c/unloadcollection3/} {add=[26 (1429981661774217216)]} 0 3
[junit4:junit4]   2> 22479 T2229 C345 P44738 /update {version=2&wt=javabin} {add=[26]} 0 5
[junit4:junit4]   2> 22485 T2217 C343 P49774 /update {version=2&update.distrib=FROMLEADER&wt=javabin&distrib.from=http://127.0.0.1:49591/g/c/unloadcollection1/} {add=[27 (1429981661780508672)]} 0 1
[junit4:junit4]   2> 22485 T2232 C345 P44738 /update {version=2&update.distrib=FROMLEADER&wt=javabin&distrib.from=http://127.0.0.1:49591/g/c/unloadcollection1/} {add=[27 (1429981661780508672)]} 0 1
[junit4:junit4]   2> 22486 T2204 C344 P49591 /update {version=2&update.distrib=TOLEADER&wt=javabin&distrib.from=http://127.0.0.1:44738/g/c/unloadcollection3/} {add=[27 (1429981661780508672)]} 0 4
[junit4:junit4]   2> 22486 T2231 C345 P44738 /update {version=2&wt=javabin} {add=[27]} 0 5
[junit4:junit4]   2> 22492 T2230 C345 P44738 /update {version=2&update.distrib=FROMLEADER&wt=javabin&distrib.from=http://127.0.0.1:49591/g/c/unloadcollection1/} {add=[28 (1429981661787848704)]} 0 1
[junit4:junit4]   2> 22492 T2216 C343 P49774 /update {version=2&update.distrib=FROMLEADER&wt=javabin&distrib.from=http://127.0.0.1:49591/g/c/unloadcollection1/} {add=[28 (1429981661787848704)]} 0 1
[junit4:junit4]   2> 22492 T2202 C344 P49591 /update {version=2&update.distrib=TOLEADER&wt=javabin&distrib.from=http://127.0.0.1:44738/g/c/unloadcollection3/} {add=[28 (1429981661787848704)]} 0 3
[junit4:junit4]   2> 22493 T2229 C345 P44738 /update {version=2&wt=javabin} {add=[28]} 0 5
[junit4:junit4]   2> 22499 T2231 C345 P44738 /update {version=2&update.distrib=FROMLEADER&wt=javabin&distrib.from=http://127.0.0.1:49591/g/c/unloadcollection1/} {add=[29 (1429981661795188736)]} 0 1
[junit4:junit4]   2> 22499 T2218 C343 P49774 /update {version=2&update.distrib=FROMLEADER&wt=javabin&distrib.from=http://127.0.0.1:49591/g/c/unloadcollection1/} {add=[29 (1429981661795188736)]} 0 1
[junit4:junit4]   2> 22500 T2201 C344 P49591 /update {version=2&update.distrib=TOLEADER&wt=javabin&distrib.from=http://127.0.0.1:44738/g/c/unloadcollection3/} {add=[29 (1429981661795188736)]} 0 4
[junit4:junit4]   2> 22500 T2232 C345 P44738 /update {version=2&wt=javabin} {add=[29]} 0 5
[junit4:junit4]   2> 22506 T2229 C345 P44738 /update {version=2&update.distrib=FROMLEADER&wt=javabin&distrib.from=http://127.0.0.1:49591/g/c/unloadcollection1/} {add=[30 (1429981661803577344)]} 0 0
[junit4:junit4]   2> 22506 T2215 C343 P49774 /update {version=2&update.distrib=FROMLEADER&wt=javabin&distrib.from=http://127.0.0.1:49591/g/c/unloadcollection1/} {add=[30 (1429981661803577344)]} 0 0
[junit4:junit4]   2> 22507 T2203 C344 P49591 /update {version=2&update.distrib=TOLEADER&wt=javabin&distrib.from=http://127.0.0.1:44738/g/c/unloadcollection3/} {add=[30 (1429981661803577344)]} 0 4
[junit4:junit4]   2> 22507 T2230 C345 P44738 /update {version=2&wt=javabin} {add=[30]} 0 5
[junit4:junit4]   2> 22513 T2232 C345 P44738 /update {version=2&update.distrib=FROMLEADER&wt=javabin&distrib.from=http://127.0.0.1:49591/g/c/unloadcollection1/} {add=[31 (1429981661810917376)]} 0 0
[junit4:junit4]   2> 22513 T2217 C343 P49774 /update {version=2&update.distrib=FROMLEADER&wt=javabin&distrib.from=http://127.0.0.1:49591/g/c/unloadcollection1/} {add=[31 (1429981661810917376)]} 0 0
[junit4:junit4]   2> 22514 T2204 C344 P49591 /update {version=2&update.distrib=TOLEADER&wt=javabin&distrib.from=http://127.0.0.1:44738/g/c/unloadcollection3/} {add=[31 (1429981661810917376)]} 0 3
[junit4:junit4]   2> 22514 T2231 C345 P44738 /update {version=2&wt=javabin} {add=[31]} 0 5
[junit4:junit4]   2> 22520 T2230 C345 P44738 /update {version=2&update.distrib=FROMLEADER&wt=javabin&distrib.from=http://127.0.0.1:49591/g/c/unloadcollection1/} {add=[32 (1429981661818257408)]} 0 0
[junit4:junit4]   2> 22520 T2216 C343 P49774 /update {version=2&update.distrib=FROMLEADER&wt=javabin&distrib.from=http://127.0.0.1:49591/g/c/unloadcollection1/} {add=[32 (1429981661818257408)]} 0 0
[junit4:junit4]   2> 22521 T2202 C344 P49591 /update {version=2&update.distrib=TOLEADER&wt=javabin&distrib.from=http://127.0.0.1:44738/g/c/unloadcollection3/} {add=[32 (1429981661818257408)]} 0 3
[junit4:junit4]   2> 22522 T2229 C345 P44738 /update {version=2&wt=javabin} {add=[32]} 0 6
[junit4:junit4]   2> 22528 T2218 C343 P49774 /update {version=2&update.distrib=FROMLEADER&wt=javabin&distrib.from=http://127.0.0.1:49591/g/c/unloadcollection1/} {add=[33 (1429981661825597440)]} 0 1
[junit4:junit4]   2> 22528 T2231 C345 P44738 /update {version=2&update.distrib=FROMLEADER&wt=javabin&distrib.from=http://127.0.0.1:49591/g/c/unloadcollection1/} {add=[33 (1429981661825597440)]} 0 1
[junit4:junit4]   2> 22528 T2201 C344 P49591 /update {version=2&update.distrib=TOLEADER&wt=javabin&distrib.from=http://127.0.0.1:44738/g/c/unloadcollection3/} {add=[33 (1429981661825597440)]} 0 3
[junit4:junit4]   2> 22529 T2232 C345 P44738 /update {version=2&wt=javabin} {add=[33]} 0 6
[junit4:junit4]   2> 22535 T2229 C345 P44738 /update {version=2&update.distrib=FROMLEADER&wt=javabin&distrib.from=http://127.0.0.1:49591/g/c/unloadcollection1/} {add=[34 (1429981661833986048)]} 0 0
[junit4:junit4]   2> 22535 T2215 C343 P49774 /update {version=2&update.distrib=FROMLEADER&wt=javabin&distrib.from=http://127.0.0.1:49591/g/c/unloadcollection1/} {add=[34 (1429981661833986048)]} 0 0
[junit4:junit4]   2> 22536 T2203 C344 P49591 /update {version=2&update.distrib=TOLEADER&wt=javabin&distrib.from=http://127.0.0.1:44738/g/c/unloadcollection3/} {add=[34 (1429981661833986048)]} 0 3
[junit4:junit4]   2> 22536 T2230 C345 P44738 /update {version=2&wt=javabin} {add=[34]} 0 5
[junit4:junit4]   2> 22542 T2217 C343 P49774 /update {version=2&update.distrib=FROMLEADER&wt=javabin&distrib.from=http://127.0.0.1:49591/g/c/unloadcollection1/} {add=[35 (1429981661841326080)]} 0 0
[junit4:junit4]   2> 22542 T2232 C345 P44738 /update {version=2&update.distrib=FROMLEADER&wt=javabin&distrib.from=http://127.0.0.1:49591/g/c/unloadcollection1/} {add=[35 (1429981661841326080)]} 0 0
[junit4:junit4]   2> 22543 T2204 C344 P49591 /update {version=2&update.distrib=TOLEADER&wt=javabin&distrib.from=http://127.0.0.1:44738/g/c/unloadcollection3/} {add=[35 (1429981661841326080)]} 0 3
[junit4:junit4]   2> 22543 T2231 C345 P44738 /update {version=2&wt=javabin} {add=[35]} 0 5
[junit4:junit4]   2> 22549 T2230 C345 P44738 /update {version=2&update.distrib=FROMLEADER&wt=javabin&distrib.from=http://127.0.0.1:49591/g/c/unloadcollection1/} {add=[36 (1429981661848666112)]} 0 0
[junit4:junit4]   2> 22549 T2216 C343 P49774 /update {version=2&update.distrib=FROMLEADER&wt=javabin&distrib.from=http://127.0.0.1:49591/g/c/unloadcollection1/} {add=[36 (1429981661848666112)]} 0 0
[junit4:junit4]   2> 22550 T2202 C344 P49591 /update {version=2&update.distrib=TOLEADER&wt=javabin&distrib.from=http://127.0.0.1:44738/g/c/unloadcollection3/} {add=[36 (1429981661848666112)]} 0 3
[junit4:junit4]   2> 22550 T2229 C345 P44738 /update {version=2&wt=javabin} {add=[36]} 0 5
[junit4:junit4]   2> 22556 T2218 C343 P49774 /update {version=2&update.distrib=FROMLEADER&wt=javabin&distrib.from=http://127.0.0.1:49591/g/c/unloadcollection1/} {add=[37 (1429981661856006144)]} 0 0
[junit4:junit4]   2> 22556 T2231 C345 P44738 /update {version=2&update.distrib=FROMLEADER&wt=javabin&distrib.from=http://127.0.0.1:49591/g/c/unloadcollection1/} {add=[37 (1429981661856006144)]} 0 0
[junit4:junit4]   2> 22557 T2203 C344 P49591 /update {version=2&update.distrib=TOLEADER&wt=javabin&distrib.from=http://127.0.0.1:44738/g/c/unloadcollection3/} {add=[37 (1429981661856006144)]} 0 3
[junit4:junit4]   2> 22557 T2232 C345 P44738 /update {version=2&wt=javabin} {add=[37]} 0 5
[junit4:junit4]   2> 22564 T2215 C343 P49774 /update {version=2&update.distrib=FROMLEADER&wt=javabin&distrib.from=http://127.0.0.1:49591/g/c/unloadcollection1/} {add=[38 (1429981661863346176)]} 0 1
[junit4:junit4]   2> 22564 T2229 C345 P44738 /update {version=2&update.distrib=FROMLEADER&wt=javabin&distrib.from=http://127.0.0.1:49591/g/c/unloadcollection1/} {add=[38 (1429981661863346176)]} 0 1
[junit4:junit4]   2> 22564 T2204 C344 P49591 /update {version=2&update.distrib=TOLEADER&wt=javabin&distrib.from=http://127.0.0.1:44738/g/c/unloadcollection3/} {add=[38 (1429981661863346176)]} 0 3
[junit4:junit4]   2> 22564 T2230 C345 P44738 /update {version=2&wt=javabin} {add=[38]} 0 5
[junit4:junit4]   2> 22570 T2232 C345 P44738 /update {version=2&update.distrib=FROMLEADER&wt=javabin&distrib.from=http://127.0.0.1:49591/g/c/unloadcollection1/} {add=[39 (1429981661870686208)]} 0 0
[junit4:junit4]   2> 22570 T2217 C343 P49774 /update {version=2&update.distrib=FROMLEADER&wt=javabin&distrib.from=http://127.0.0.1:49591/g/c/unloadcollection1/} {add=[39 (1429981661870686208)]} 0 0
[junit4:junit4]   2> 22571 T2202 C344 P49591 /update {version=2&update.distrib=TOLEADER&wt=javabin&distrib.from=http://127.0.0.1:44738/g/c/unloadcollection3/} {add=[39 (1429981661870686208)]} 0 3
[junit4:junit4]   2> 22571 T2231 C345 P44738 /update {version=2&wt=javabin} {add=[39]} 0 5
[junit4:junit4]   2> 22577 T2216 C343 P49774 /update {version=2&update.distrib=FROMLEADER&wt=javabin&distrib.from=http://127.0.0.1:49591/g/c/unloadcollection1/} {add=[40 (1429981661878026240)]} 0 0
[junit4:junit4]   2> 22577 T2230 C345 P44738 /update {version=2&update.distrib=FROMLEADER&wt=javabin&distrib.from=http://127.0.0.1:49591/g/c/unloadcollection1/} {add=[40 (1429981661878026240)]} 0 0
[junit4:junit4]   2> 22578 T2201 C344 P49591 /update {version=2&update.distrib=TOLEADER&wt=javabin&distrib.from=http://127.0.0.1:44738/g/c/unloadcollection3/} {add=[40 (1429981661878026240)]} 0 3
[junit4:junit4]   2> 22578 T2229 C345 P44738 /update {version=2&wt=javabin} {add=[40]} 0 5
[junit4:junit4]   2> 22584 T2231 C345 P44738 /update {version=2&update.distrib=FROMLEADER&wt=javabin&distrib.from=http://127.0.0.1:49591/g/c/unloadcollection1/} {add=[41 (1429981661885366272)]} 0 0
[junit4:junit4]   2> 22584 T2218 C343 P49774 /update {version=2&update.distrib=FROMLEADER&wt=javabin&distrib.from=http://127.0.0.1:49591/g/c/unloadcollection1/} {add=[41 (1429981661885366272)]} 0 0
[junit4:junit4]   2> 22585 T2203 C344 P49591 /update {version=2&update.distrib=TOLEADER&wt=javabin&distrib.from=http://127.0.0.1:44738/g/c/unloadcollection3/} {add=[41 (1429981661885366272)]} 0 4
[junit4:junit4]   2> 22585 T2232 C345 P44738 /update {version=2&wt=javabin} {add=[41]} 0 5
[junit4:junit4]   2> 22591 T2229 C345 P44738 /update {version=2&update.distrib=FROMLEADER&wt=javabin&distrib.from=http://127.0.0.1:49591/g/c/unloadcollection1/} {add=[42 (1429981661891657728)]} 0 1
[junit4:junit4]   2> 22591 T2215 C343 P49774 /update {version=2&update.distrib=FROMLEADER&wt=javabin&distrib.from=http://127.0.0.1:49591/g/c/unloadcollection1/} {add=[42 (1429981661891657728)]} 0 1
[junit4:junit4]   2> 22591 T2204 C344 P49591 /update {version=2&update.distrib=TOLEADER&wt=javabin&distrib.from=http://127.0.0.1:44738/g/c/unloadcollection3/} {add=[42 (1429981661891657728)]} 0 3
[junit4:junit4]   2> 22592 T2230 C345 P44738 /update {version=2&wt=javabin} {add=[42]} 0 5
[junit4:junit4]   2> 22598 T2217 C343 P49774 /update {version=2&update.distrib=FROMLEADER&wt=javabin&distrib.from=http://127.0.0.1:49591/g/c/unloadcollection1/} {add=[43 (1429981661898997760)]} 0 1
[junit4:junit4]   2> 22598 T2232 C345 P44738 /update {version=2&update.distrib=FROMLEADER&wt=javabin&distrib.from=http://127.0.0.1:49591/g/c/unloadcollection1/} {add=[43 (1429981661898997760)]} 0 1
[junit4:junit4]   2> 22598 T2202 C344 P49591 /update {version=2&update.distrib=TOLEADER&wt=javabin&distrib.from=http://127.0.0.1:44738/g/c/unloadcollection3/} {add=[43 (1429981661898997760)]} 0 3
[junit4:junit4]   2> 22599 T2231 C345 P44738 /update {version=2&wt=javabin} {add=[43]} 0 5
[junit4:junit4]   2> 22605 T2230 C345 P44738 /update {version=2&update.distrib=FROMLEADER&wt=javabin&distrib.from=http://127.0.0.1:49591/g/c/unloadcollection1/} {add=[44 (1429981661906337792)]} 0 1
[junit4:junit4]   2> 22605 T2216 C343 P49774 /update {version=2&update.distrib=FROMLEADER&wt=javabin&distrib.from=http://127.0.0.1:49591/g/c/unloadcollection1/} {add=[44 (1429981661906337792)]} 0 1
[junit4:junit4]   2> 22606 T2201 C344 P49591 /update {version=2&update.distrib=TOLEADER&wt=javabin&distrib.from=http://127.0.0.1:44738/g/c/unloadcollection3/} {add=[44 (1429981661906337792)]} 0 4
[junit4:junit4]   2> 22606 T2229 C345 P44738 /update {version=2&wt=javabin} {add=[44]} 0 6
[junit4:junit4]   2> 22612 T2231 C345 P44738 /update {version=2&update.distrib=FROMLEADER&wt=javabin&distrib.from=http://127.0.0.1:49591/g/c/unloadcollection1/} {add=[45 (1429981661914726400)]} 0 0
[junit4:junit4]   2> 22612 T2215 C343 P49774 /update {version=2&update.distrib=FROMLEADER&wt=javabin&distrib.from=http://127.0.0.1:49591/g/c/unloadcollection1/} {add=[45 (1429981661914726400)]} 0 0
[junit4:junit4]   2> 22613 T2203 C344 P49591 /update {version=2&update.distrib=TOLEADER&wt=javabin&distrib.from=http://127.0.0.1:44738/g/c/unloadcollection3/} {add=[45 (1429981661914726400)]} 0 3
[junit4:junit4]   2> 22613 T2232 C345 P44738 /update {version=2&wt=javabin} {add=[45]} 0 5
[junit4:junit4]   2> 22620 T2229 C345 P44738 /update {version=2&update.distrib=FROMLEADER&wt=javabin&distrib.from=http://127.0.0.1:49591/g/c/unloadcollection1/} {add=[46 (1429981661922066432)]} 0 1
[junit4:junit4]   2> 22620 T2217 C343 P49774 /update {version=2&update.distrib=FROMLEADER&wt=javabin&distrib.from=http://127.0.0.1:49591/g/c/unloadcollection1/} {add=[46 (1429981661922066432)]} 0 1
[junit4:junit4]   2> 22621 T2204 C344 P49591 /update {version=2&update.distrib=TOLEADER&wt=javabin&distrib.from=http://127.0.0.1:44738/g/c/unloadcollection3/} {add=[46 (1429981661922066432)]} 0 4
[junit4:junit4]   2> 22621 T2230 C345 P44738 /update {version=2&wt=javabin} {add=[46]} 0 6
[junit4:junit4]   2> 22627 T2218 C343 P49774 /update {version=2&update.distrib=FROMLEADER&wt=javabin&distrib.from=http://127.0.0.1:49591/g/c/unloadcollection1/} {add=[47 (1429981661930455040)]} 0 0
[junit4:junit4]   2> 22627 T2232 C345 P44738 /update {version=2&update.distrib=FROMLEADER&wt=javabin&distrib.from=http://127.0.0.1:49591/g/c/unloadcollection1/} {add=[47 (1429981661930455040)]} 0 0
[junit4:junit4]   2> 22628 T2202 C344 P49591 /update {version=2&update.distrib=TOLEADER&wt=javabin&distrib.from=http://127.0.0.1:44738/g/c/unloadcollection3/} {add=[47 (1429981661930455040)]} 0 3
[junit4:junit4]   2> 22628 T2231 C345 P44738 /update {version=2&wt=javabin} {add=[47]} 0 5
[junit4:junit4]   2> 22634 T2230 C345 P44738 /update {version=2&update.distrib=FROMLEADER&wt=javabin&distrib.from=http://127.0.0.1:49591/g/c/unloadcollection1/} {add=[48 (1429981661937795072)]} 0 0
[junit4:junit4]   2> 22634 T2216 C343 P49774 /update {version=2&update.distrib=FROMLEADER&wt=javabin&distrib.from=http://127.0.0.1:49591/g/c/unloadcollection1/} {add=[48 (1429981661937795072)]} 0 0
[junit4:junit4]   2> 22635 T2201 C344 P49591 /update {version=2&update.distrib=TOLEADER&wt=javabin&distrib.from=http://127.0.0.1:44738/g/c/unloadcollection3/} {add=[48 (1429981661937795072)]} 0 3
[junit4:junit4]   2> 22635 T2229 C345 P44738 /update {version=2&wt=javabin} {add=[48]} 0 5
[junit4:junit4]   2> 22641 T2215 C343 P49774 /update {version=2&update.distrib=FROMLEADER&wt=javabin&distrib.from=http://127.0.0.1:49591/g/c/unloadcollection1/} {add=[49 (1429981661945135104)]} 0 0
[junit4:junit4]   2> 22641 T2231 C345 P44738 /update {version=2&update.distrib=FROMLEADER&wt=javabin&distrib.from=http://127.0.0.1:49591/g/c/unloadcollection1/} {add=[49 (1429981661945135104)]} 0 0
[junit4:junit4]   2> 22642 T2203 C344 P49591 /update {version=2&update.distrib=TOLEADER&wt=javabin&distrib.from=http://127.0.0.1:44738/g/c/unloadcollection3/} {add=[49 (1429981661945135104)]} 0 3
[junit4:junit4]   2> 22642 T2232 C345 P44738 /update {version=2&wt=javabin} {add=[49]} 0 5
[junit4:junit4]   2> 22649 T2217 C343 P49774 /update {version=2&update.distrib=FROMLEADER&wt=javabin&distrib.from=http://127.0.0.1:49591/g/c/unloadcollection1/} {add=[50 (1429981661952475136)]} 0 1
[junit4:junit4]   2> 22650 T2229 C345 P44738 /update {version=2&update.distrib=FROMLEADER&wt=javabin&distrib.from=http://127.0.0.1:49591/g/c/unloadcollection1/} {add=[50 (1429981661952475136)]} 0 1
[junit4:junit4]   2> 22650 T2204 C344 P49591 /update {version=2&update.distrib=TOLEADER&wt=javabin&distrib.from=http://127.0.0.1:44738/g/c/unloadcollection3/} {add=[50 (1429981661952475136)]} 0 4
[junit4:junit4]   2> 22651 T2230 C345 P44738 /update {version=2&wt=javabin} {add=[50]} 0 7
[junit4:junit4]   2> 22657 T2218 C343 P49774 /update {version=2&update.distrib=FROMLEADER&wt=javabin&distrib.from=http://127.0.0.1:49591/g/c/unloadcollection1/} {add=[51 (1429981661961912320)]} 0 0
[junit4:junit4]   2> 22657 T2232 C345 P44738 /update {version=2&update.distrib=FROMLEADER&wt=javabin&distrib.from=http://127.0.0.1:49591/g/c/unloadcollection1/} {add=[51 (1429981661961912320)]} 0 0
[junit4:junit4]   2> 22658 T2202 C344 P49591 /update {version=2&update.distrib=TOLEADER&wt=javabin&distrib.from=http://127.0.0.1:44738/g/c/unloadcollection3/} {add=[51 (1429981661961912320)]} 0 4
[junit4:junit4]   2> 22658 T2231 C345 P44738 /update {version=2&wt=javabin} {add=[51]} 0 5
[junit4:junit4]   2> 22664 T2216 C343 P49774 /update {version=2&update.distrib=FROMLEADER&wt=javabin&distrib.from=http://127.0.0.1:49591/g/c/unloadcollection1/} {add=[52 (1429981661969252352)]} 0 0
[junit4:junit4]   2> 22664 T2230 C345 P44738 /update {version=2&update.distrib=FROMLEADER&wt=javabin&distrib.from=http://127.0.0.1:49591/g/c/unloadcollection1/} {add=[52 (1429981661969252352)]} 0 0
[junit4:junit4]   2> 22665 T2201 C344 P49591 /update {version=2&update.distrib=TOLEADER&wt=javabin&distrib.from=http://127.0.0.1:44738/g/c/unloadcollection3/} {add=[52 (1429981661969252352)]} 0 3
[junit4:junit4]   2> 22665 T2229 C345 P44738 /update {version=2&wt=javabin} {add=[52]} 0 5
[junit4:junit4]   2> 22672 T2231 C345 P44738 /update {version=2&update.distrib=FROMLEADER&wt=javabin&distrib.from=http://127.0.0.1:49591/g/c/unloadcollection1/} {add=[53 (1429981661976592384)]} 0 1
[junit4:junit4]   2> 22672 T2215 C343 P49774 /update {version=2&update.distrib=FROMLEADER&wt=javabin&distrib.from=http://127.0.0.1:49591/g/c/unloadcollection1/} {add=[53 (1429981661976592384)]} 0 1
[junit4:junit4]   2> 22672 T2203 C344 P49591 /update {version=2&update.distrib=TOLEADER&wt=javabin&distrib.from=http://127.0.0.1:44738/g/c/unloadcollection3/} {add=[53 (1429981661976592384)]} 0 3
[junit4:junit4]   2> 22673 T2232 C345 P44738 /update {version=2&wt=javabin} {add=[53]} 0 6
[junit4:junit4]   2> 22679 T2217 C343 P49774 /update {version=2&update.distrib=FROMLEADER&wt=javabin&distrib.from=http://127.0.0.1:49591/g/c/unloadcollection1/} {add=[54 (1429981661984980992)]} 0 0
[junit4:junit4]   2> 22680 T2229 C345 P44738 /update {version=2&update.distrib=FROMLEADER&wt=javabin&distrib.from=http://127.0.0.1:49591/g/c/unloadcollection1/} {add=[54 (1429981661984980992)]} 0 1
[junit4:junit4]   2> 22680 T2204 C344 P49591 /update {version=2&update.distrib=TOLEADER&wt=javabin&distrib.from=http://127.0.0.1:44738/g/c/unloadcollection3/} {add=[54 (1429981661984980992)]} 0 3
[junit4:junit4]   2> 22681 T2230 C345 P44738 /update {version=2&wt=javabin} {add=[54]} 0 6
[junit4:junit4]   2> 22687 T2218 C343 P49774 /update {version=2&update.distrib=FROMLEADER&wt=javabin&distrib.from=http://127.0.0.1:49591/g/c/unloadcollection1/} {add=[55 (1429981661992321024)]} 0 0
[junit4:junit4]   2> 22687 T2232 C345 P44738 /update {version=2&update.distrib=FROMLEADER&wt=javabin&distrib.from=http://127.0.0.1:49591/g/c/unloadcollection1/} {add=[55 (1429981661992321024)]} 0 0
[junit4:junit4]   2> 22688 T2202 C344 P49591 /update {version=2&update.distrib=TOLEADER&wt=javabin&distrib.from=http://127.0.0.1:44738/g/c/unloadcollection3/} {add=[55 (1429981661992321024)]} 0 4
[junit4:junit4]   2> 22688 T2231 C345 P44738 /update {version=2&wt=javabin} {add=[55]} 0 6
[junit4:junit4]   2> 22695 T2230 C345 P44738 /update {version=2&update.distrib=FROMLEADER&wt=javabin&distrib.from=http://127.0.0.1:49591/g/c/unloadcollection1/} {add=[56 (1429981662000709632)]} 0 1
[junit4:junit4]   2> 22695 T2216 C343 P49774 /update {version=2&update.distrib=FROMLEADER&wt=javabin&distrib.from=http://127.0.0.1:49591/g/c/unloadcollection1/} {add=[56 (1429981662000709632)]} 0 1
[junit4:junit4]   2> 22695 T2201 C344 P49591 /update {version=2&update.distrib=TOLEADER&wt=javabin&distrib.from=http://127.0.0.1:44738/g/c/unloadcollection3/} {add=[56 (1429981662000709632)]} 0 3
[junit4:junit4]   2> 22696 T2229 C345 P44738 /update {version=2&wt=javabin} {add=[56]} 0 6
[junit4:junit4]   2> 22702 T2231 C345 P44738 /update {version=2&update.distrib=FROMLEADER&wt=javabin&distrib.from=http://127.0.0.1:49591/g/c/unloadcollection1/} {add=[57 (1429981662009098240)]} 0 0
[junit4:junit4]   2> 22702 T2215 C343 P49774 /update {version=2&update.distrib=FROMLEADER&wt=javabin&distrib.from=http://127.0.0.1:49591/g/c/unloadcollection1/} {add=[57 (1429981662009098240)]} 0 0
[junit4:junit4]   2> 22703 T2203 C344 P49591 /update {version=2&update.distrib=TOLEADER&wt=javabin&distrib.from=http://127.0.0.1:44738/g/c/unloadcollection3/} {add=[57 (1429981662009098240)]} 0 4
[junit4:junit4]   2> 22703 T2232 C345 P44738 /update {version=2&wt=javabin} {add=[57]} 0 5
[junit4:junit4]   2> 22710 T2217 C343 P49774 /update {version=2&update.distrib=FROMLEADER&wt=javabin&distrib.from=http://127.0.0.1:49591/g/c/unloadcollection1/} {add=[58 (1429981662016438272)]} 0 1
[junit4:junit4]   2> 22710 T2229 C345 P44738 /update {version=2&update.distrib=FROMLEADER&wt=javabin&distrib.from=http://127.0.0.1:49591/g/c/unloadcollection1/} {add=[58 (1429981662016438272)]} 0 1
[junit4:junit4]   2> 22710 T2204 C344 P49591 /update {version=2&update.distrib=TOLEADER&wt=javabin&distrib.from=http://127.0.0.1:44738/g/c/unloadcollection3/} {add=[58 (1429981662016438272)]} 0 3
[junit4:junit4]   2> 22711 T2230 C345 P44738 /update {version=2&wt=javabin} {add=[58]} 0 6
[junit4:junit4]   2> 22717 T2232 C345 P44738 /update {version=2&update.distrib=FROMLEADER&wt=javabin&distrib.from=http://127.0.0.1:49591/g/c/unloadcollection1/} {add=[59 (1429981662024826880)]} 0 0
[junit4:junit4]   2> 22717 T2218 C343 P49774 /update {version=2&update.distrib=FROMLEADER&wt=javabin&distrib.from=http://127.0.0.1:49591/g/c/unloadcollection1/} {add=[59 (1429981662024826880)]} 0 0
[junit4:junit4]   2> 22718 T2202 C344 P49591 /update {version=2&update.distrib=TOLEADER&wt=javabin&distrib.from=http://127.0.0.1:44738/g/c/unloadcollection3/} {add=[59 (1429981662024826880)]} 0 4
[junit4:junit4]   2> 22718 T2231 C345 P44738 /update {version=2&wt=javabin} {add=[59]} 0 5
[junit4:junit4]   2> 22724 T2216 C343 P49774 /update {version=2&update.distrib=FROMLEADER&wt=javabin&distrib.from=http://127.0.0.1:49591/g/c/unloadcollection1/} {add=[60 (1429981662032166912)]} 0 0
[junit4:junit4]   2> 22724 T2230 C345 P44738 /update {version=2&update.distrib=FROMLEADER&wt=javabin&distrib.from=http://127.0.0.1:49591/g/c/unloadcollection1/} {add=[60 (1429981662032166912)]} 0 0
[junit4:junit4]   2> 22725 T2201 C344 P49591 /update {version=2&update.distrib=TOLEADER&wt=javabin&distrib.from=http://127.0.0.1:44738/g/c/unloadcollection3/} {add=[60 (1429981662032166912)]} 0 3
[junit4:junit4]   2> 22725 T2229 C345 P44738 /update {version=2&wt=javabin} {add=[60]} 0 5
[junit4:junit4]   2> 22732 T2215 C343 P49774 /update {version=2&update.distrib=FROMLEADER&wt=javabin&distrib.from=http://127.0.0.1:49591/g/c/unloadcollection1/} {add=[61 (1429981662039506944)]} 0 1
[junit4:junit4]   2> 22732 T2231 C345 P44738 /update {version=2&update.distrib=FROMLEADER&wt=javabin&distrib.from=http://127.0.0.1:49591/g/c/unloadcollection1/} {add=[61 (1429981662039506944)]} 0 1
[junit4:junit4]   2> 22733 T2203 C344 P49591 /update {version=2&update.distrib=TOLEADER&wt=javabin&distrib.from=http://127.0.0.1:44738/g/c/unloadcollection3/} {add=[61 (1429981662039506944)]} 0 4
[junit4:junit4]   2> 22733 T2232 C345 P44738 /update {version=2&wt=javabin} {add=[61]} 0 6
[junit4:junit4]   2> 22739 T2217 C343 P49774 /update {version=2&update.distrib=FROMLEADER&wt=javabin&distrib.from=http://127.0.0.1:49591/g/c/unloadcollection1/} {add=[62 (1429981662047895552)]} 0 0
[junit4:junit4]   2> 22740 T2229 C345 P44738 /update {version=2&update.distrib=FROMLEADER&wt=javabin&distrib.from=http://127.0.0.1:49591/g/c/unloadcollection1/} {add=[62 (1429981662047895552)]} 0 1
[junit4:junit4]   2> 22740 T2204 C344 P49591 /update {version=2&update.distrib=TOLEADER&wt=javabin&distrib.from=http://127.0.0.1:44738/g/c/unloadcollection3/} {add=[62 (1429981662047895552)]} 0 3
[junit4:junit4]   2> 22741 T2230 C345 P44738 /update {version=2&wt=javabin} {add=[62]} 0 6
[junit4:junit4]   2> 22747 T2218 C343 P49774 /update {version=2&update.distrib=FROMLEADER&wt=javabin&distrib.from=http://127.0.0.1:49591/g/c/unloadcollection1/} {add=[63 (1429981662055235584)]} 0 1
[junit4:junit4]   2> 22747 T2232 C345 P44738 /update {version=2&update.distrib=FROMLEADER&wt=javabin&distrib.from=http://127.0.0.1:49591/g/c/unloadcollection1/} {add=[63 (1429981662055235584)]} 0 1
[junit4:junit4]   2> 22747 T2202 C344 P49591 /update {version=2&update.distrib=TOLEADER&wt=javabin&distrib.from=http://127.0.0.1:44738/g/c/unloadcollection3/} {add=[63 (1429981662055235584)]} 0 3
[junit4:junit4]   2> 22748 T2231 C345 P44738 /update {version=2&wt=javabin} {add=[63]} 0 6
[junit4:junit4]   2> 22754 T2230 C345 P44738 /update {version=2&update.distrib=FROMLEADER&wt=javabin&distrib.from=http://127.0.0.1:49591/g/c/unloadcollection1/} {add=[64 (1429981662063624192)]} 0 0
[junit4:junit4]   2> 22754 T2216 C343 P49774 /update {version=2&update.distrib=FROMLEADER&wt=javabin&distrib.from=http://127.0.0.1:49591/g/c/unloadcollection1/} {add=[64 (1429981662063624192)]} 0 0
[junit4:junit4]   2> 22755 T2201 C344 P49591 /update {version=2&update.distrib=TOLEADER&wt=javabin&distrib.from=http://127.0.0.1:44738/g/c/unloadcollection3/} {add=[64 (1429981662063624192)]} 0 3
[junit4:junit4]   2> 22755 T2229 C345 P44738 /update {version=2&wt=javabin} {add=[64]} 0 5
[junit4:junit4]   2> 22761 T2215 C343 P49774 /update {version=2&update.distrib=FROMLEADER&wt=javabin&distrib.from=http://127.0.0.1:49591/g/c/unloadcollection1/} {add=[65 (1429981662070964224)]} 0 0
[junit4:junit4]   2> 22762 T2231 C345 P44738 /update {version=2&update.distrib=FROMLEADER&wt=javabin&distrib.from=http://127.0.0.1:49591/g/c/unloadcollection1/} {add=[65 (1429981662070964224)]} 0 1
[junit4:junit4]   2> 22762 T2203 C344 P49591 /update {version=2&update.distrib=TOLEADER&wt=javabin&distrib.from=http://127.0.0.1:44738/g/c/unloadcollection3/} {add=[65 (1429981662070964224)]} 0 3
[junit4:junit4]   2> 22763 T2232 C345 P44738 /update {version=2&wt=javabin} {add=[65]} 0 6
[junit4:junit4]   2> 22769 T2217 C343 P49774 /update {version=2&update.distrib=FROMLEADER&wt=javabin&distrib.from=http://127.0.0.1:49591/g/c/unloadcollection1/} {add=[66 (1429981662078304256)]} 0 1
[junit4:junit4]   2> 22769 T2229 C345 P44738 /update {version=2&update.distrib=FROMLEADER&wt=javabin&distrib.from=http://127.0.0.1:49591/g/c/unloadcollection1/} {add=[66 (1429981662078304256)]} 0 1
[junit4:junit4]   2> 22770 T2204 C344 P49591 /update {version=2&update.distrib=TOLEADER&wt=javabin&distrib.from=http://127.0.0.1:44738/g/c/unloadcollection3/} {add=[66 (1429981662078304256)]} 0 4
[junit4:junit4]   2> 22770 T2230 C345 P44738 /update {version=2&wt=javabin} {add=[66]} 0 5
[junit4:junit4]   2> 22777 T2232 C345 P44738 /update {version=2&update.distrib=FROMLEADER&wt=javabin&distrib.from=http://127.0.0.1:49591/g/c/unloadcollection1/} {add=[67 (1429981662086692864)]} 0 1
[junit4:junit4]   2> 22777 T2218 C343 P49774 /update {version=2&update.distrib=FROMLEADER&wt=javabin&distrib.from=http://127.0.0.1:49591/g/c/unloadcollection1/} {add=[67 (1429981662086692864)]} 0 1
[junit4:junit4]   2> 22777 T2202 C344 P49591 /update {version=2&update.distrib=TOLEADER&wt=javabin&distrib.from=http://127.0.0.1:44738/g/c/unloadcollection3/} {add=[67 (1429981662086692864)]} 0 3
[junit4:junit4]   2> 22777 T2231 C345 P44738 /update {version=2&wt=javabin} {add=[67]} 0 5
[junit4:junit4]   2> 22784 T2216 C343 P49774 /update {version=2&update.distrib=FROMLEADER&wt=javabin&distrib.from=http://127.0.0.1:49591/g/c/unloadcollection1/} {add=[68 (1429981662094032896)]} 0 1
[junit4:junit4]   2> 22784 T2230 C345 P44738 /update {version=2&update.distrib=FROMLEADER&wt=javabin&distrib.from=http://127.0.0.1:49591/g/c/unloadcollection1/} {add=[68 (1429981662094032896)]} 0 1
[junit4:junit4]   2> 22784 T2201 C344 P49591 /update {version=2&update.distrib=TOLEADER&wt=javabin&distrib.from=http://127.0.0.1:44738/g/c/unloadcollection3/} {add=[68 (1429981662094032896)]} 0 3
[junit4:junit4]   2> 22785 T2229 C345 P44738 /update {version=2&wt=javabin} {add=[68]} 0 6
[junit4:junit4]   2> 22791 T2215 C343 P49774 /update {version=2&update.distrib=FROMLEADER&wt=javabin&distrib.from=http://127.0.0.1:49591/g/c/unloadcollection1/} {add=[69 (1429981662101372928)]} 0 1
[junit4:junit4]   2> 22791 T2231 C345 P44738 /update {version=2&update.distrib=FROMLEADER&wt=javabin&distrib.from=http://127.0.0.1:49591/g/c/unloadcollection1/} {add=[69 (1429981662101372928)]} 0 1
[junit4:junit4]   2> 22791 T2203 C344 P49591 /update {version=2&update.distrib=TOLEADER&wt=javabin&distrib.from=http://127.0.0.1:44738/g/c/unloadcollection3/} {add=[69 (1429981662101372928)]} 0 3
[junit4:junit4]   2> 22792 T2232 C345 P44738 /update {version=2&wt=javabin} {add=[69]} 0 5
[junit4:junit4]   2> 22798 T2217 C343 P49774 /update {version=2&update.distrib=FROMLEADER&wt=javabin&distrib.from=http://127.0.0.1:49591/g/c/unloadcollection1/} {add=[70 (1429981662108712960)]} 0 1
[junit4:junit4]   2> 22798 T2229 C345 P44738 /update {version=2&update.distrib=FROMLEADER&wt=javabin&distrib.from=http://127.0.0.1:49591/g/c/unloadcollection1/} {add=[70 (1429981662108712960)]} 0 1
[junit4:junit4]   2> 22799 T2204 C344 P49591 /update {version=2&update.distrib=TOLEADER&wt=javabin&distrib.from=http://127.0.0.1:44738/g/c/unloadcollection3/} {add=[70 (1429981662108712960)]} 0 4
[junit4:junit4]   2> 22799 T2230 C345 P44738 /update {version=2&wt=javabin} {add=[70]} 0 5
[junit4:junit4]   2> 22805 T2232 C345 P44738 /update {version=2&update.distrib=FROMLEADER&wt=javabin&distrib.from=http://127.0.0.1:49591/g/c/unloadcollection1/} {add=[71 (1429981662117101568)]} 0 0
[junit4:junit4]   2> 22805 T2218 C343 P49774 /update {version=2&update.distrib=FROMLEADER&wt=javabin&distrib.from=http://127.0.0.1:49591/g/c/unloadcollection1/} {add=[71 (1429981662117101568)]} 0 0
[junit4:junit4]   2> 22806 T2202 C344 P49591 /update {version=2&update.distrib=TOLEADER&wt=javabin&distrib.from=http://127.0.0.1:44738/g/c/unloadcollection3/} {add=[71 (1429981662117101568)]} 0 3
[junit4:junit4]   2> 22806 T2231 C345 P44738 /update {version=2&wt=javabin} {add=[71]} 0 5
[junit4:junit4]   2> 22812 T2216 C343 P49774 /update {version=2&update.distrib=FROMLEADER&wt=javabin&distrib.from=http://127.0.0.1:49591/g/c/unloadcollection1/} {add=[72 (1429981662124441600)]} 0 0
[junit4:junit4]   2> 22812 T2230 C345 P44738 /update {version=2&update.distrib=FROMLEADER&wt=javabin&distrib.from=http://127.0.0.1:49591/g/c/unloadcollection1/} {add=[72 (1429981662124441600)]} 0 0
[junit4:junit4]   2> 22813 T2201 C344 P49591 /update {version=2&update.distrib=TOLEADER&wt=javabin&distrib.from=http://127.0.0.1:44738/g/c/unloadcollection3/} {add=[72 (1429981662124441600)]} 0 3
[junit4:junit4]   2> 22813 T2229 C345 P44738 /update {version=2&wt=javabin} {add=[72]} 0 5
[junit4:junit4]   2> 22819 T2215 C343 P49774 /update {version=2&update.distrib=FROMLEADER&wt=javabin&distrib.from=http://127.0.0.1:49591/g/c/unloadcollection1/} {add=[73 (1429981662131781632)]} 0 0
[junit4:junit4]   2> 22819 T2231 C345 P44738 /update {version=2&update.distrib=FROMLEADER&wt=javabin&distrib.from=http://127.0.0.1:49591/g/c/unloadcollection1/} {add=[73 (1429981662131781632)]} 0 0
[junit4:junit4]   2> 22820 T2203 C344 P49591 /update {version=2&update.distrib=TOLEADER&wt=javabin&distrib.from=http://127.0.0.1:44738/g/c/unloadcollection3/} {add=[73 (1429981662131781632)]} 0 3
[junit4:junit4]   2> 22820 T2232 C345 P44738 /update {version=2&wt=javabin} {add=[73]} 0 5
[junit4:junit4]   2> 22827 T2217 C343 P49774 /update {version=2&update.distrib=FROMLEADER&wt=javabin&distrib.from=http://127.0.0.1:49591/g/c/unloadcollection1/} {add=[74 (1429981662139121664)]} 0 1
[junit4:junit4]   2> 22827 T2229 C345 P44738 /update {version=2&update.distrib=FROMLEADER&wt=javabin&distrib.from=http://127.0.0.1:49591/g/c/unloadcollection1/} {add=[74 (1429981662139121664)]} 0 1
[junit4:junit4]   2> 22827 T2202 C344 P49591 /update {version=2&update.distrib=TOLEADER&wt=javabin&distrib.from=http://127.0.0.1:44738/g/c/unloadcollection3/} {add=[74 (1429981662139121664)]} 0 3
[junit4:junit4]   2> 22828 T2230 C345 P44738 /update {version=2&wt=javabin} {add=[74]} 0 6
[junit4:junit4]   2> 22834 T2218 C343 P49774 /update {version=2&update.distrib=FROMLEADER&wt=javabin&distrib.from=http://127.0.0.1:49591/g/c/unloadcollection1/} {add=[75 (1429981662147510272)]} 0 1
[junit4:junit4]   2> 22834 T2232 C345 P44738 /update {version=2&update.distrib=FROMLEADER&wt=javabin&distrib.from=http://127.0.0.1:49591/g/c/unloadcollection1/} {add=[75 (1429981662147510272)]} 0 1
[junit4:junit4]   2> 22835 T2201 C344 P49591 /update {version=2&update.distrib=TOLEADER&wt=javabin&distrib.from=http://127.0.0.1:44738/g/c/unloadcollection3/} {add=[75 (1429981662147510272)]} 0 4
[junit4:junit4]   2> 22835 T2231 C345 P44738 /update {version=2&wt=javabin} {add=[75]} 0 5
[junit4:junit4]   2> 22841 T2216 C343 P49774 /update {version=2&update.distrib=FROMLEADER&wt=javabin&distrib.from=http://127.0.0.1:49591/g/c/unloadcollection1/} {add=[76 (1429981662154850304)]} 0 0
[junit4:junit4]   2> 22841 T2229 C345 P44738 /update {version=2&update.distrib=FROMLEADER&wt=javabin&distrib.from=http://127.0.0.1:49591/g/c/unloadcollection1/} {add=[76 (1429981662154850304)]} 0 0
[junit4:junit4]   2> 22842 T2204 C344 P49591 /update {version=2&update.distrib=TOLEADER&wt=javabin&distrib.from=http://127.0.0.1:44738/g/c/unloadcollection3/} {add=[76 (1429981662154850304)]} 0 3
[junit4:junit4]   2> 22842 T2230 C345 P44738 /update {version=2&wt=javabin} {add=[76]} 0 5
[junit4:junit4]   2> 22848 T2215 C343 P49774 /update {version=2&update.distrib=FROMLEADER&wt=javabin&distrib.from=http://127.0.0.1:49591/g/c/unloadcollection1/} {add=[77 (1429981662162190336)]} 0 0
[junit4:junit4]   2> 22849 T2231 C345 P44738 /update {version=2&update.distrib=FROMLEADER&wt=javabin&distrib.from=http://127.0.0.1:49591/g/c/unloadcollection1/} {add=[77 (1429981662162190336)]} 0 1
[junit4:junit4]   2> 22849 T2203 C344 P49591 /update {version=2&update.distrib=TOLEADER&wt=javabin&distrib.from=http://127.0.0.1:44738/g/c/unloadcollection3/} {add=[77 (1429981662162190336)]} 0 3
[junit4:junit4]   2> 22850 T2232 C345 P44738 /update {version=2&wt=javabin} {add=[77]} 0 6
[junit4:junit4]   2> 22856 T2217 C343 P49774 /update {version=2&update.distrib=FROMLEADER&wt=javabin&distrib.from=http://127.0.0.1:49591/g/c/unloadcollection1/} {add=[78 (1429981662170578944)]} 0 0
[junit4:junit4]   2> 22856 T2230 C345 P44738 /update {version=2&update.distrib=FROMLEADER&wt=javabin&distrib.from=http://127.0.0.1:49591/g/c/unloadcollection1/} {add=[78 (1429981662170578944)]} 0 0
[junit4:junit4]   2> 22857 T2202 C344 P49591 /update {version=2&update.distrib=TOLEADER&wt=javabin&distrib.from=http://127.0.0.1:44738/g/c/unloadcollection3/} {add=[78 (1429981662170578944)]} 0 4
[junit4:junit4]   2> 22857 T2229 C345 P44738 /update {version=2&wt=javabin} {add=[78]} 0 5
[junit4:junit4]   2> 22864 T2232 C345 P44738 /update {version=2&update.distrib=FROMLEADER&wt=javabin&distrib.from=http://127.0.0.1:49591/g/c/unloadcollection1/} {add=[79 (1429981662177918976)]} 0 1
[junit4:junit4]   2> 22864 T2218 C343 P49774 /update {version=2&update.distrib=FROMLEADER&wt=javabin&distrib.from=http://127.0.0.1:49591/g/c/unloadcollection1/} {add=[79 (1429981662177918976)]} 0 1
[junit4:junit4]   2> 22864 T2201 C344 P49591 /update {version=2&update.distrib=TOLEADER&wt=javabin&distrib.from=http://127.0.0.1:44738/g/c/unloadcollection3/} {add=[79 (1429981662177918976)]} 0 3
[junit4:junit4]   2> 22865 T2231 C345 P44738 /update {version=2&wt=javabin} {add=[79]} 0 6
[junit4:junit4]   2> 22871 T2216 C343 P49774 /update {version=2&update.distrib=FROMLEADER&wt=javabin&distrib.from=http://127.0.0.1:49591/g/c/unloadcollection1/} {add=[80 (1429981662186307584)]} 0 0
[junit4:junit4]   2> 22872 T2229 C345 P44738 /update {version=2&update.distrib=FROMLEADER&wt=javabin&distrib.from=http://127.0.0.1:49591/g/c/unloadcollection1/} {add=[80 (1429981662186307584)]} 0 1
[junit4:junit4]   2> 22872 T2204 C344 P49591 /update {version=2&update.distrib=TOLEADER&wt=javabin&distrib.from=http://127.0.0.1:44738/g/c/unloadcollection3/} {add=[80 (1429981662186307584)]} 0 3
[junit4:junit4]   2> 22873 T2230 C345 P44738 /update {version=2&wt=javabin} {add=[80]} 0 6
[junit4:junit4]   2> 22879 T2215 C343 P49774 /update {version=2&update.distrib=FROMLEADER&wt=javabin&distrib.from=http://127.0.0.1:49591/g/c/unloadcollection1/} {add=[81 (1429981662194696192)]} 0 0
[junit4:junit4]   2> 22879 T2231 C345 P44738 /update {version=2&update.distrib=FROMLEADER&wt=javabin&distrib.from=http://127.0.0.1:49591/g/c/unloadcollection1/} {add=[81 (1429981662194696192)]} 0 0
[junit4:junit4]   2> 22880 T2203 C344 P49591 /update {version=2&update.distrib=TOLEADER&wt=javabin&distrib.from=http://127.0.0.1:44738/g/c/unloadcollection3/} {add=[81 (1429981662194696192)]} 0 4
[junit4:junit4]   2> 22880 T2232 C345 P44738 /update {version=2&wt=javabin} {add=[81]} 0 5
[junit4:junit4]   2> 22886 T2217 C343 P49774 /update {version=2&update.distrib=FROMLEADER&wt=javabin&distrib.from=http://127.0.0.1:49591/g/c/unloadcollection1/} {add=[82 (1429981662202036224)]} 0 0
[junit4:junit4]   2> 22887 T2231 C345 P44738 /update {version=2&update.distrib=FROMLEADER&wt=javabin&distrib.from=http://127.0.0.1:49591/g/c/unloadcollection1/} {add=[82 (1429981662202036224)]} 0 1
[junit4:junit4]   2> 22887 T2202 C344 P49591 /update {version=2&update.distrib=TOLEADER&wt=javabin&distrib.from=http://127.0.0.1:44738/g/c/unloadcollection3/} {add=[82 (1429981662202036224)]} 0 3
[junit4:junit4]   2> 22888 T2230 C345 P44738 /update {version=2&wt=javabin} {add=[82]} 0 6
[junit4:junit4]   2> 22894 T2218 C343 P49774 /update {version=2&update.distrib=FROMLEADER&wt=javabin&distrib.from=http://127.0.0.1:49591/g/c/unloadcollection1/} {add=[83 (1429981662209376256)]} 0 1
[junit4:junit4]   2> 22894 T2229 C345 P44738 /update {version=2&update.distrib=FROMLEADER&wt=javabin&distrib.from=http://127.0.0.1:49591/g/c/unloadcollection1/} {add=[83 (1429981662209376256)]} 0 1
[junit4:junit4]   2> 22895 T2201 C344 P49591 /update {version=2&update.distrib=TOLEADER&wt=javabin&distrib.from=http://127.0.0.1:44738/g/c/unloadcollection3/} {add=[83 (1429981662209376256)]} 0 4
[junit4:junit4]   2> 22895 T2232 C345 P44738 /update {version=2&wt=javabin} {add=[83]} 0 6
[junit4:junit4]   2> 22901 T2230 C345 P44738 /update {version=2&update.distrib=FROMLEADER&wt=javabin&distrib.from=http://127.0.0.1:49591/g/c/unloadcollection1/} {add=[84 (1429981662217764864)]} 0 0
[junit4:junit4]   2> 22901 T2216 C343 P49774 /update {version=2&update.distrib=FROMLEADER&wt=javabin&distrib.from=http://127.0.0.1:49591/g/c/unloadcollection1/} {add=[84 (1429981662217764864)]} 0 0
[junit4:junit4]   2> 22902 T2204 C344 P49591 /update {version=2&update.distrib=TOLEADER&wt=javabin&distrib.from=http://127.0.0.1:44738/g/c/unloadcollection3/} {add=[84 (1429981662217764864)]} 0 3
[junit4:junit4]   2> 22902 T2231 C345 P44738 /update {version=2&wt=javabin} {add=[84]} 0 5
[junit4:junit4]   2> 22909 T2215 C343 P49774 /update {version=2&update.distrib=FROMLEADER&wt=javabin&distrib.from=http://

[...truncated too long message...]

t4]    > 	at __randomizedtesting.SeedInfo.seed([B71B11FD52BC8086:36FD9FE525E3E0BA]:0)
[junit4:junit4]    > 	at org.junit.Assert.fail(Assert.java:93)
[junit4:junit4]    > 	at org.apache.solr.cloud.UnloadDistributedZkTest.testUnloadShardAndCollection(UnloadDistributedZkTest.java:124)
[junit4:junit4]    > 	at org.apache.solr.cloud.UnloadDistributedZkTest.doTest(UnloadDistributedZkTest.java:77)
[junit4:junit4]    > 	at org.apache.solr.BaseDistributedSearchTestCase.testDistribSearch(BaseDistributedSearchTestCase.java:806)
[junit4:junit4]    > 	at sun.reflect.NativeMethodAccessorImpl.invoke0(Native Method)
[junit4:junit4]    > 	at sun.reflect.NativeMethodAccessorImpl.invoke(NativeMethodAccessorImpl.java:57)
[junit4:junit4]    > 	at sun.reflect.DelegatingMethodAccessorImpl.invoke(DelegatingMethodAccessorImpl.java:43)
[junit4:junit4]    > 	at java.lang.reflect.Method.invoke(Method.java:487)
[junit4:junit4]    > 	at com.carrotsearch.randomizedtesting.RandomizedRunner.invoke(RandomizedRunner.java:1559)
[junit4:junit4]    > 	at com.carrotsearch.randomizedtesting.RandomizedRunner.access$600(RandomizedRunner.java:79)
[junit4:junit4]    > 	at com.carrotsearch.randomizedtesting.RandomizedRunner$6.evaluate(RandomizedRunner.java:737)
[junit4:junit4]    > 	at com.carrotsearch.randomizedtesting.RandomizedRunner$7.evaluate(RandomizedRunner.java:773)
[junit4:junit4]    > 	at com.carrotsearch.randomizedtesting.RandomizedRunner$8.evaluate(RandomizedRunner.java:787)
[junit4:junit4]    > 	at com.carrotsearch.randomizedtesting.rules.SystemPropertiesRestoreRule$1.evaluate(SystemPropertiesRestoreRule.java:53)
[junit4:junit4]    > 	at org.apache.lucene.util.TestRuleSetupTeardownChained$1.evaluate(TestRuleSetupTeardownChained.java:50)
[junit4:junit4]    > 	at org.apache.lucene.util.TestRuleFieldCacheSanity$1.evaluate(TestRuleFieldCacheSanity.java:51)
[junit4:junit4]    > 	at org.apache.lucene.util.AbstractBeforeAfterRule$1.evaluate(AbstractBeforeAfterRule.java:46)
[junit4:junit4]    > 	at com.carrotsearch.randomizedtesting.rules.SystemPropertiesInvariantRule$1.evaluate(SystemPropertiesInvariantRule.java:55)
[junit4:junit4]    > 	at org.apache.lucene.util.TestRuleThreadAndTestName$1.evaluate(TestRuleThreadAndTestName.java:49)
[junit4:junit4]    > 	at org.apache.lucene.util.TestRuleIgnoreAfterMaxFailures$1.evaluate(TestRuleIgnoreAfterMaxFailures.java:70)
[junit4:junit4]    > 	at org.apache.lucene.util.TestRuleMarkFailure$1.evaluate(TestRuleMarkFailure.java:48)
[junit4:junit4]    > 	at com.carrotsearch.randomizedtesting.rules.StatementAdapter.evaluate(StatementAdapter.java:36)
[junit4:junit4]    > 	at com.carrotsearch.randomizedtesting.ThreadLeakControl$StatementRunner.run(ThreadLeakControl.java:358)
[junit4:junit4]    > 	at com.carrotsearch.randomizedtesting.ThreadLeakControl.forkTimeoutingTask(ThreadLeakControl.java:782)
[junit4:junit4]    > 	at com.carrotsearch.randomizedtesting.ThreadLeakControl$3.evaluate(ThreadLeakControl.java:442)
[junit4:junit4]    > 	at com.carrotsearch.randomizedtesting.RandomizedRunner.runSingleTest(RandomizedRunner.java:746)
[junit4:junit4]    > 	at com.carrotsearch.randomizedtesting.RandomizedRunner$3.evaluate(RandomizedRunner.java:648)
[junit4:junit4]    > 	at com.carrotsearch.randomizedtesting.RandomizedRunner$4.evaluate(RandomizedRunner.java:682)
[junit4:junit4]    > 	at com.carrotsearch.randomizedtesting.RandomizedRunner$5.evaluate(RandomizedRunner.java:693)
[junit4:junit4]    > 	at com.carrotsearch.randomizedtesting.rules.StatementAdapter.evaluate(StatementAdapter.java:36)
[junit4:junit4]    > 	at com.carrotsearch.randomizedtesting.rules.SystemPropertiesRestoreRule$1.evaluate(SystemPropertiesRestoreRule.java:53)
[junit4:junit4]    > 	at org.apache.lucene.util.AbstractBeforeAfterRule$1.evaluate(AbstractBeforeAfterRule.java:46)
[junit4:junit4]    > 	at org.apache.lucene.util.TestRuleStoreClassName$1.evaluate(TestRuleStoreClassName.java:42)
[junit4:junit4]    > 	at com.carrotsearch.randomizedtesting.rules.SystemPropertiesInvariantRule$1.evaluate(SystemPropertiesInvariantRule.java:55)
[junit4:junit4]    > 	at com.carrotsearch.randomizedtesting.rules.NoShadowingOrOverridesOnMethodsRule$1.evaluate(NoShadowingOrOverridesOnMethodsRule.java:39)
[junit4:junit4]    > 	at com.carrotsearch.randomizedtesting.rules.NoShadowingOrOverridesOnMethodsRule$1.evaluate(NoShadowingOrOverridesOnMethodsRule.java:39)
[junit4:junit4]    > 	at com.carrotsearch.randomizedtesting.rules.StatementAdapter.evaluate(StatementAdapter.java:36)
[junit4:junit4]    > 	at org.apache.lucene.util.TestRuleAssertionsRequired$1.evaluate(TestRuleAssertionsRequired.java:43)
[junit4:junit4]    > 	at org.apache.lucene.util.TestRuleMarkFailure$1.evaluate(TestRuleMarkFailure.java:48)
[junit4:junit4]    > 	at org.apache.lucene.util.TestRuleIgnoreAfterMaxFailures$1.evaluate(TestRuleIgnoreAfterMaxFailures.java:70)
[junit4:junit4]    > 	at org.apache.lucene.util.TestRuleIgnoreTestSuites$1.evaluate(TestRuleIgnoreTestSuites.java:55)
[junit4:junit4]    > 	at com.carrotsearch.randomizedtesting.rules.StatementAdapter.evaluate(StatementAdapter.java:36)
[junit4:junit4]    > 	at com.carrotsearch.randomizedtesting.ThreadLeakControl$StatementRunner.run(ThreadLeakControl.java:358)
[junit4:junit4]    > 	at java.lang.Thread.run(Thread.java:722)
[junit4:junit4]   2> 138590 T2168 oas.SolrTestCaseJ4.deleteCore ###deleteCore
[junit4:junit4]   2> 138598 T2167 ccr.ThreadLeakControl.checkThreadLeaks WARNING Will linger awaiting termination of 3 leaked thread(s).
[junit4:junit4]   2> 138711 T2171 oazs.SessionTrackerImpl.run SessionTrackerImpl exited loop!
[junit4:junit4]   2> 139701 T2250 oascc.ZkStateReader$3.process WARNING ZooKeeper watch triggered, but Solr cannot talk to ZK
[junit4:junit4]   2> 139701 T2250 oascc.ZkStateReader$2.process A cluster state change: WatchedEvent state:SyncConnected type:NodeChildrenChanged path:/live_nodes, has occurred - updating... (live nodes size: 1)
[junit4:junit4]   2> 139701 T2250 oascc.ZkStateReader$2.process WARNING ZooKeeper watch triggered, but Solr cannot talk to ZK
[junit4:junit4]   2> 139701 T2250 oaz.ClientCnxn$EventThread.run EventThread shut down
[junit4:junit4]   2> NOTE: test params are: codec=Lucene42: {a_t=PostingsFormat(name=Memory doPackFST= true), text=Pulsing41(freqCutoff=6 minBlockSize=2 maxBlockSize=71), range_facet_l=PostingsFormat(name=Memory doPackFST= true), multiDefault=PostingsFormat(name=Memory doPackFST= true), range_facet_si=PostingsFormat(name=Memory doPackFST= true), intDefault=MockFixedIntBlock(blockSize=1739), a_si=MockFixedIntBlock(blockSize=1739), range_facet_sl=PostingsFormat(name=Memory doPackFST= false), id=PostingsFormat(name=Memory doPackFST= false), other_tl1=MockFixedIntBlock(blockSize=1739), _version_=MockFixedIntBlock(blockSize=1739), timestamp=PostingsFormat(name=Memory doPackFST= true)}, docValues:{timestamp=DocValuesFormat(name=Lucene42)}, sim=RandomSimilarityProvider(queryNorm=true,coord=no): {}, locale=et_EE, timezone=PST8PDT
[junit4:junit4]   2> NOTE: Linux 3.2.0-39-generic amd64/Oracle Corporation 1.8.0-ea (64-bit)/cpus=8,threads=1,free=231595256,total=473956352
[junit4:junit4]   2> NOTE: All tests run in this JVM: [TestNumberUtils, TestShardHandlerFactory, CollectionsAPIDistributedZkTest, TestFoldingMultitermQuery, DistanceFunctionTest, PathHierarchyTokenizerFactoryTest, OpenCloseCoreStressTest, DisMaxRequestHandlerTest, SpellCheckComponentTest, LeaderElectionIntegrationTest, IndexSchemaRuntimeFieldTest, EchoParamsTest, FieldAnalysisRequestHandlerTest, XsltUpdateRequestHandlerTest, TermVectorComponentDistributedTest, TestZkChroot, NotRequiredUniqueKeyTest, TestCodecSupport, TestFastOutputStream, TestSolr4Spatial, TestArbitraryIndexDir, TestLMJelinekMercerSimilarityFactory, SignatureUpdateProcessorFactoryTest, ZkNodePropsTest, TestCSVResponseWriter, NoCacheHeaderTest, TestQuerySenderNoQuery, SpellPossibilityIteratorTest, HardAutoCommitTest, SolrRequestParserTest, CopyFieldTest, HighlighterTest, TestElisionMultitermQuery, TestLuceneMatchVersion, CoreContainerCoreInitFailuresTest, BasicDistributedZk2Test, DOMUtilTest, TestBM25SimilarityFactory, SampleTest, DefaultValueUpdateProcessorTest, TestUpdate, PingRequestHandlerTest, TestRecovery, TestSuggestSpellingConverter, TestJmxMonitoredMap, TestFieldTypeResource, TestIndexingPerformance, OutputWriterTest, TestQueryTypes, TestFiltering, TestSolrDiscoveryProperties, TestPropInject, SuggesterTSTTest, FullSolrCloudDistribCmdsTest, StatsComponentTest, ConvertedLegacyTest, TestPartialUpdateDeduplication, TestCollationField, TestJmxIntegration, HighlighterConfigTest, DocumentAnalysisRequestHandlerTest, TestDFRSimilarityFactory, ChaosMonkeySafeLeaderTest, UnloadDistributedZkTest]
[junit4:junit4] Completed on J1 in 139.87s, 1 test, 1 failure <<< FAILURES!

[...truncated 406 lines...]
BUILD FAILED
/mnt/ssd/jenkins/workspace/Lucene-Solr-trunk-Linux/build.xml:375: The following error occurred while executing this line:
/mnt/ssd/jenkins/workspace/Lucene-Solr-trunk-Linux/build.xml:355: The following error occurred while executing this line:
/mnt/ssd/jenkins/workspace/Lucene-Solr-trunk-Linux/build.xml:39: The following error occurred while executing this line:
/mnt/ssd/jenkins/workspace/Lucene-Solr-trunk-Linux/solr/build.xml:183: The following error occurred while executing this line:
/mnt/ssd/jenkins/workspace/Lucene-Solr-trunk-Linux/solr/common-build.xml:449: The following error occurred while executing this line:
/mnt/ssd/jenkins/workspace/Lucene-Solr-trunk-Linux/lucene/common-build.xml:1210: The following error occurred while executing this line:
/mnt/ssd/jenkins/workspace/Lucene-Solr-trunk-Linux/lucene/common-build.xml:874: There were test failures: 272 suites, 1144 tests, 1 failure, 13 ignored (7 assumptions)

Total time: 38 minutes 49 seconds
Build step 'Invoke Ant' marked build as failure
Archiving artifacts
Recording test results
Description set: Java: 64bit/jdk1.8.0-ea-b79 -XX:+UseG1GC
Email was triggered for: Failure
Sending email for trigger: Failure



Mime
View raw message