lucene-dev mailing list archives

Site index · List index
Message view « Date » · « Thread »
Top « Date » · « Thread »
From Apache Jenkins Server <jenk...@builds.apache.org>
Subject [JENKINS-MAVEN] Lucene-Solr-Maven-trunk #802: POMs out of sync
Date Sun, 17 Mar 2013 00:38:15 GMT
Build: https://builds.apache.org/job/Lucene-Solr-Maven-trunk/802/

3 tests failed.
REGRESSION:  org.apache.lucene.benchmark.byTask.TestPerfTasksParse.testParseExamples

Error Message:
Could not parse sample file: /usr/home/hudson/hudson-slave/workspace/Lucene-Solr-Maven-trunk/maven-build/lucene/benchmark/target/test-classes/conf/english-porter-comparison.alg
reason:class java.lang.RuntimeException:Line #4: 

Stack Trace:
java.lang.AssertionError: Could not parse sample file: /usr/home/hudson/hudson-slave/workspace/Lucene-Solr-Maven-trunk/maven-build/lucene/benchmark/target/test-classes/conf/english-porter-comparison.alg
reason:class java.lang.RuntimeException:Line #4: 
	at __randomizedtesting.SeedInfo.seed([60D88F2103281099:42BDF5B2EDBE7374]:0)
	at org.junit.Assert.fail(Assert.java:93)
	at org.apache.lucene.benchmark.byTask.TestPerfTasksParse.testParseExamples(TestPerfTasksParse.java:142)


FAILED:  org.apache.solr.cloud.RecoveryZkTest.org.apache.solr.cloud.RecoveryZkTest

Error Message:
Resource in scope SUITE failed to close. Resource was registered from thread Thread[id=424,
name=coreLoadExecutor-146-thread-1, state=RUNNABLE, group=TGRP-RecoveryZkTest], registration
stack trace below.

Stack Trace:
com.carrotsearch.randomizedtesting.ResourceDisposalError: Resource in scope SUITE failed to
close. Resource was registered from thread Thread[id=424, name=coreLoadExecutor-146-thread-1,
state=RUNNABLE, group=TGRP-RecoveryZkTest], registration stack trace below.
	at org.junit.Assert.fail(Assert.java:93)
	at org.apache.lucene.util.CloseableDirectory.close(CloseableDirectory.java:47)
	at com.carrotsearch.randomizedtesting.RandomizedRunner$2$1.apply(RandomizedRunner.java:602)
	at com.carrotsearch.randomizedtesting.RandomizedRunner$2$1.apply(RandomizedRunner.java:599)
	at com.carrotsearch.randomizedtesting.RandomizedContext.closeResources(RandomizedContext.java:167)
	at com.carrotsearch.randomizedtesting.RandomizedRunner$2.afterAlways(RandomizedRunner.java:615)
	at com.carrotsearch.randomizedtesting.rules.StatementAdapter.evaluate(StatementAdapter.java:43)
	at com.carrotsearch.randomizedtesting.ThreadLeakControl$StatementRunner.run(ThreadLeakControl.java:358)
	at java.lang.Thread.run(Thread.java:679)


FAILED:  org.apache.solr.cloud.RecoveryZkTest.org.apache.solr.cloud.RecoveryZkTest

Error Message:
Resource in scope SUITE failed to close. Resource was registered from thread Thread[id=426,
name=RecoveryThread, state=RUNNABLE, group=TGRP-RecoveryZkTest], registration stack trace
below.

Stack Trace:
com.carrotsearch.randomizedtesting.ResourceDisposalError: Resource in scope SUITE failed to
close. Resource was registered from thread Thread[id=426, name=RecoveryThread, state=RUNNABLE,
group=TGRP-RecoveryZkTest], registration stack trace below.
	at org.junit.Assert.fail(Assert.java:93)
	at org.apache.lucene.util.CloseableDirectory.close(CloseableDirectory.java:47)
	at com.carrotsearch.randomizedtesting.RandomizedRunner$2$1.apply(RandomizedRunner.java:602)
	at com.carrotsearch.randomizedtesting.RandomizedRunner$2$1.apply(RandomizedRunner.java:599)
	at com.carrotsearch.randomizedtesting.RandomizedContext.closeResources(RandomizedContext.java:167)
	at com.carrotsearch.randomizedtesting.RandomizedRunner$2.afterAlways(RandomizedRunner.java:615)
	at com.carrotsearch.randomizedtesting.rules.StatementAdapter.evaluate(StatementAdapter.java:43)
	at com.carrotsearch.randomizedtesting.ThreadLeakControl$StatementRunner.run(ThreadLeakControl.java:358)
	at java.lang.Thread.run(Thread.java:679)




Build Log:
[...truncated 22818 lines...]



Mime
View raw message