lucene-dev mailing list archives

Site index · List index
Message view « Date » · « Thread »
Top « Date » · « Thread »
From Apache Jenkins Server <jenk...@builds.apache.org>
Subject [JENKINS] Lucene-Solr-Tests-4.x-Java6 - Build # 1397 - Still Failing
Date Wed, 06 Mar 2013 17:34:12 GMT
Build: https://builds.apache.org/job/Lucene-Solr-Tests-4.x-Java6/1397/

1 tests failed.
FAILED:  org.apache.solr.cloud.SyncSliceTest.testDistribSearch

Error Message:
Test Setup Failure: shard1 should have just been set up to be inconsistent - but it's still consistent. Leader:http://127.0.0.1:58450/collection1skip list:[CloudJettyRunner [url=http://127.0.0.1:48702/collection1], CloudJettyRunner [url=http://127.0.0.1:56856/collection1]]

Stack Trace:
java.lang.AssertionError: Test Setup Failure: shard1 should have just been set up to be inconsistent - but it's still consistent. Leader:http://127.0.0.1:58450/collection1skip list:[CloudJettyRunner [url=http://127.0.0.1:48702/collection1], CloudJettyRunner [url=http://127.0.0.1:56856/collection1]]
	at __randomizedtesting.SeedInfo.seed([271DF2824711AFFC:A6FB7C9A304ECFC0]:0)
	at org.junit.Assert.fail(Assert.java:93)
	at org.junit.Assert.assertTrue(Assert.java:43)
	at org.junit.Assert.assertNotNull(Assert.java:526)
	at org.apache.solr.cloud.SyncSliceTest.doTest(SyncSliceTest.java:212)
	at org.apache.solr.BaseDistributedSearchTestCase.testDistribSearch(BaseDistributedSearchTestCase.java:806)
	at sun.reflect.NativeMethodAccessorImpl.invoke0(Native Method)
	at sun.reflect.NativeMethodAccessorImpl.invoke(NativeMethodAccessorImpl.java:57)
	at sun.reflect.DelegatingMethodAccessorImpl.invoke(DelegatingMethodAccessorImpl.java:43)
	at java.lang.reflect.Method.invoke(Method.java:616)
	at com.carrotsearch.randomizedtesting.RandomizedRunner.invoke(RandomizedRunner.java:1559)
	at com.carrotsearch.randomizedtesting.RandomizedRunner.access$600(RandomizedRunner.java:79)
	at com.carrotsearch.randomizedtesting.RandomizedRunner$6.evaluate(RandomizedRunner.java:737)
	at com.carrotsearch.randomizedtesting.RandomizedRunner$7.evaluate(RandomizedRunner.java:773)
	at com.carrotsearch.randomizedtesting.RandomizedRunner$8.evaluate(RandomizedRunner.java:787)
	at com.carrotsearch.randomizedtesting.rules.SystemPropertiesRestoreRule$1.evaluate(SystemPropertiesRestoreRule.java:53)
	at org.apache.lucene.util.TestRuleSetupTeardownChained$1.evaluate(TestRuleSetupTeardownChained.java:50)
	at org.apache.lucene.util.TestRuleFieldCacheSanity$1.evaluate(TestRuleFieldCacheSanity.java:51)
	at org.apache.lucene.util.AbstractBeforeAfterRule$1.evaluate(AbstractBeforeAfterRule.java:46)
	at com.carrotsearch.randomizedtesting.rules.SystemPropertiesInvariantRule$1.evaluate(SystemPropertiesInvariantRule.java:55)
	at org.apache.lucene.util.TestRuleThreadAndTestName$1.evaluate(TestRuleThreadAndTestName.java:49)
	at org.apache.lucene.util.TestRuleIgnoreAfterMaxFailures$1.evaluate(TestRuleIgnoreAfterMaxFailures.java:70)
	at org.apache.lucene.util.TestRuleMarkFailure$1.evaluate(TestRuleMarkFailure.java:48)
	at com.carrotsearch.randomizedtesting.rules.StatementAdapter.evaluate(StatementAdapter.java:36)
	at com.carrotsearch.randomizedtesting.ThreadLeakControl$StatementRunner.run(ThreadLeakControl.java:358)
	at com.carrotsearch.randomizedtesting.ThreadLeakControl.forkTimeoutingTask(ThreadLeakControl.java:782)
	at com.carrotsearch.randomizedtesting.ThreadLeakControl$3.evaluate(ThreadLeakControl.java:442)
	at com.carrotsearch.randomizedtesting.RandomizedRunner.runSingleTest(RandomizedRunner.java:746)
	at com.carrotsearch.randomizedtesting.RandomizedRunner$3.evaluate(RandomizedRunner.java:648)
	at com.carrotsearch.randomizedtesting.RandomizedRunner$4.evaluate(RandomizedRunner.java:682)
	at com.carrotsearch.randomizedtesting.RandomizedRunner$5.evaluate(RandomizedRunner.java:693)
	at com.carrotsearch.randomizedtesting.rules.StatementAdapter.evaluate(StatementAdapter.java:36)
	at com.carrotsearch.randomizedtesting.rules.SystemPropertiesRestoreRule$1.evaluate(SystemPropertiesRestoreRule.java:53)
	at org.apache.lucene.util.AbstractBeforeAfterRule$1.evaluate(AbstractBeforeAfterRule.java:46)
	at org.apache.lucene.util.TestRuleStoreClassName$1.evaluate(TestRuleStoreClassName.java:42)
	at com.carrotsearch.randomizedtesting.rules.SystemPropertiesInvariantRule$1.evaluate(SystemPropertiesInvariantRule.java:55)
	at com.carrotsearch.randomizedtesting.rules.NoShadowingOrOverridesOnMethodsRule$1.evaluate(NoShadowingOrOverridesOnMethodsRule.java:39)
	at com.carrotsearch.randomizedtesting.rules.NoShadowingOrOverridesOnMethodsRule$1.evaluate(NoShadowingOrOverridesOnMethodsRule.java:39)
	at com.carrotsearch.randomizedtesting.rules.StatementAdapter.evaluate(StatementAdapter.java:36)
	at org.apache.lucene.util.TestRuleAssertionsRequired$1.evaluate(TestRuleAssertionsRequired.java:43)
	at org.apache.lucene.util.TestRuleMarkFailure$1.evaluate(TestRuleMarkFailure.java:48)
	at org.apache.lucene.util.TestRuleIgnoreAfterMaxFailures$1.evaluate(TestRuleIgnoreAfterMaxFailures.java:70)
	at org.apache.lucene.util.TestRuleIgnoreTestSuites$1.evaluate(TestRuleIgnoreTestSuites.java:55)
	at com.carrotsearch.randomizedtesting.rules.StatementAdapter.evaluate(StatementAdapter.java:36)
	at com.carrotsearch.randomizedtesting.ThreadLeakControl$StatementRunner.run(ThreadLeakControl.java:358)
	at java.lang.Thread.run(Thread.java:679)




Build Log:
[...truncated 8599 lines...]
[junit4:junit4] Suite: org.apache.solr.cloud.SyncSliceTest
[junit4:junit4]   2> 0 T1671 oas.BaseDistributedSearchTestCase.initHostContext Setting hostContext system property: /
[junit4:junit4]   2> 5 T1671 oas.SolrTestCaseJ4.setUp ###Starting testDistribSearch
[junit4:junit4]   2> Creating dataDir: /usr/home/hudson/hudson-slave/workspace/Lucene-Solr-Tests-4.x-Java6/solr/build/solr-core/test/J0/./solrtest-SyncSliceTest-1362590698293
[junit4:junit4]   2> 7 T1671 oasc.ZkTestServer.run STARTING ZK TEST SERVER
[junit4:junit4]   2> 7 T1672 oasc.ZkTestServer$ZKServerMain.runFromConfig Starting server
[junit4:junit4]   2> 10 T1672 oazs.ZooKeeperServer.setTickTime tickTime set to 1000
[junit4:junit4]   2> 11 T1672 oazs.ZooKeeperServer.setMinSessionTimeout minSessionTimeout set to -1
[junit4:junit4]   2> 11 T1672 oazs.ZooKeeperServer.setMaxSessionTimeout maxSessionTimeout set to -1
[junit4:junit4]   2> 11 T1672 oazs.NIOServerCnxnFactory.configure binding to port 0.0.0.0/0.0.0.0:0
[junit4:junit4]   2> 12 T1672 oazsp.FileTxnSnapLog.save Snapshotting: 0x0 to /usr/home/hudson/hudson-slave/workspace/Lucene-Solr-Tests-4.x-Java6/solr/build/solr-core/test/J0/./org.apache.solr.cloud.SyncSliceTest-1362590698293/zookeeper/server1/data/version-2/snapshot.0
[junit4:junit4]   2> 108 T1671 oasc.ZkTestServer.run start zk server on port:33863
[junit4:junit4]   2> 108 T1671 oaz.ZooKeeper.<init> Initiating client connection, connectString=127.0.0.1:33863 sessionTimeout=10000 watcher=org.apache.solr.common.cloud.ConnectionManager@25480b03
[junit4:junit4]   2> 109 T1671 oascc.ConnectionManager.waitForConnected Waiting for client to connect to ZooKeeper
[junit4:junit4]   2> 116 T1677 oaz.ClientCnxn$SendThread.logStartConnect Opening socket connection to server localhost/127.0.0.1:33863. Will not attempt to authenticate using SASL (access denied (javax.security.auth.AuthPermission getLoginConfiguration))
[junit4:junit4]   2> 117 T1677 oaz.ClientCnxn$SendThread.primeConnection Socket connection established to localhost/127.0.0.1:33863, initiating session
[junit4:junit4]   2> 117 T1673 oazs.NIOServerCnxnFactory.run Accepted socket connection from /140.211.11.196:41641
[junit4:junit4]   2> 117 T1673 oazs.ZooKeeperServer.processConnectRequest Client attempting to establish new session at /140.211.11.196:41641
[junit4:junit4]   2> 118 T1675 oazsp.FileTxnLog.append Creating new log file: log.1
[junit4:junit4]   2> 126 T1675 oazs.ZooKeeperServer.finishSessionInit Established session 0x13d40bc0b3c0000 with negotiated timeout 10000 for client /140.211.11.196:41641
[junit4:junit4]   2> 126 T1677 oaz.ClientCnxn$SendThread.onConnected Session establishment complete on server localhost/127.0.0.1:33863, sessionid = 0x13d40bc0b3c0000, negotiated timeout = 10000
[junit4:junit4]   2> 126 T1678 oascc.ConnectionManager.process Watcher org.apache.solr.common.cloud.ConnectionManager@25480b03 name:ZooKeeperConnection Watcher:127.0.0.1:33863 got event WatchedEvent state:SyncConnected type:None path:null path:null type:None
[junit4:junit4]   2> 127 T1671 oascc.ConnectionManager.waitForConnected Client is connected to ZooKeeper
[junit4:junit4]   2> 127 T1671 oascc.SolrZkClient.makePath makePath: /solr
[junit4:junit4]   2> 130 T1676 oazs.PrepRequestProcessor.pRequest2Txn Processed session termination for sessionid: 0x13d40bc0b3c0000
[junit4:junit4]   2> 137 T1678 oaz.ClientCnxn$EventThread.run EventThread shut down
[junit4:junit4]   2> 137 T1673 oazs.NIOServerCnxn.closeSock Closed socket connection for client /140.211.11.196:41641 which had sessionid 0x13d40bc0b3c0000
[junit4:junit4]   2> 137 T1671 oaz.ZooKeeper.close Session: 0x13d40bc0b3c0000 closed
[junit4:junit4]   2> 138 T1671 oaz.ZooKeeper.<init> Initiating client connection, connectString=127.0.0.1:33863/solr sessionTimeout=10000 watcher=org.apache.solr.common.cloud.ConnectionManager@1dd42575
[junit4:junit4]   2> 139 T1671 oascc.ConnectionManager.waitForConnected Waiting for client to connect to ZooKeeper
[junit4:junit4]   2> 139 T1679 oaz.ClientCnxn$SendThread.logStartConnect Opening socket connection to server localhost/127.0.0.1:33863. Will not attempt to authenticate using SASL (access denied (javax.security.auth.AuthPermission getLoginConfiguration))
[junit4:junit4]   2> 140 T1679 oaz.ClientCnxn$SendThread.primeConnection Socket connection established to localhost/127.0.0.1:33863, initiating session
[junit4:junit4]   2> 140 T1673 oazs.NIOServerCnxnFactory.run Accepted socket connection from /140.211.11.196:49264
[junit4:junit4]   2> 140 T1673 oazs.ZooKeeperServer.processConnectRequest Client attempting to establish new session at /140.211.11.196:49264
[junit4:junit4]   2> 141 T1675 oazs.ZooKeeperServer.finishSessionInit Established session 0x13d40bc0b3c0001 with negotiated timeout 10000 for client /140.211.11.196:49264
[junit4:junit4]   2> 141 T1679 oaz.ClientCnxn$SendThread.onConnected Session establishment complete on server localhost/127.0.0.1:33863, sessionid = 0x13d40bc0b3c0001, negotiated timeout = 10000
[junit4:junit4]   2> 142 T1680 oascc.ConnectionManager.process Watcher org.apache.solr.common.cloud.ConnectionManager@1dd42575 name:ZooKeeperConnection Watcher:127.0.0.1:33863/solr got event WatchedEvent state:SyncConnected type:None path:null path:null type:None
[junit4:junit4]   2> 142 T1671 oascc.ConnectionManager.waitForConnected Client is connected to ZooKeeper
[junit4:junit4]   2> 142 T1671 oascc.SolrZkClient.makePath makePath: /collections/collection1
[junit4:junit4]   2> 152 T1671 oascc.SolrZkClient.makePath makePath: /collections/collection1/shards
[junit4:junit4]   2> 154 T1671 oascc.SolrZkClient.makePath makePath: /collections/control_collection
[junit4:junit4]   2> 157 T1671 oascc.SolrZkClient.makePath makePath: /collections/control_collection/shards
[junit4:junit4]   2> 166 T1671 oasc.AbstractZkTestCase.putConfig put /usr/home/hudson/hudson-slave/workspace/Lucene-Solr-Tests-4.x-Java6/solr/build/solr-core/test-files/solr/collection1/conf/solrconfig-tlog.xml to /configs/conf1/solrconfig.xml
[junit4:junit4]   2> 167 T1671 oascc.SolrZkClient.makePath makePath: /configs/conf1/solrconfig.xml
[junit4:junit4]   2> 180 T1671 oasc.AbstractZkTestCase.putConfig put /usr/home/hudson/hudson-slave/workspace/Lucene-Solr-Tests-4.x-Java6/solr/build/solr-core/test-files/solr/collection1/conf/schema.xml to /configs/conf1/schema.xml
[junit4:junit4]   2> 181 T1671 oascc.SolrZkClient.makePath makePath: /configs/conf1/schema.xml
[junit4:junit4]   2> 285 T1671 oasc.AbstractZkTestCase.putConfig put /usr/home/hudson/hudson-slave/workspace/Lucene-Solr-Tests-4.x-Java6/solr/build/solr-core/test-files/solr/collection1/conf/stopwords.txt to /configs/conf1/stopwords.txt
[junit4:junit4]   2> 286 T1671 oascc.SolrZkClient.makePath makePath: /configs/conf1/stopwords.txt
[junit4:junit4]   2> 289 T1671 oasc.AbstractZkTestCase.putConfig put /usr/home/hudson/hudson-slave/workspace/Lucene-Solr-Tests-4.x-Java6/solr/build/solr-core/test-files/solr/collection1/conf/protwords.txt to /configs/conf1/protwords.txt
[junit4:junit4]   2> 290 T1671 oascc.SolrZkClient.makePath makePath: /configs/conf1/protwords.txt
[junit4:junit4]   2> 300 T1671 oasc.AbstractZkTestCase.putConfig put /usr/home/hudson/hudson-slave/workspace/Lucene-Solr-Tests-4.x-Java6/solr/build/solr-core/test-files/solr/collection1/conf/currency.xml to /configs/conf1/currency.xml
[junit4:junit4]   2> 300 T1671 oascc.SolrZkClient.makePath makePath: /configs/conf1/currency.xml
[junit4:junit4]   2> 303 T1671 oasc.AbstractZkTestCase.putConfig put /usr/home/hudson/hudson-slave/workspace/Lucene-Solr-Tests-4.x-Java6/solr/build/solr-core/test-files/solr/collection1/conf/open-exchange-rates.json to /configs/conf1/open-exchange-rates.json
[junit4:junit4]   2> 304 T1671 oascc.SolrZkClient.makePath makePath: /configs/conf1/open-exchange-rates.json
[junit4:junit4]   2> 307 T1671 oasc.AbstractZkTestCase.putConfig put /usr/home/hudson/hudson-slave/workspace/Lucene-Solr-Tests-4.x-Java6/solr/build/solr-core/test-files/solr/collection1/conf/mapping-ISOLatin1Accent.txt to /configs/conf1/mapping-ISOLatin1Accent.txt
[junit4:junit4]   2> 308 T1671 oascc.SolrZkClient.makePath makePath: /configs/conf1/mapping-ISOLatin1Accent.txt
[junit4:junit4]   2> 311 T1671 oasc.AbstractZkTestCase.putConfig put /usr/home/hudson/hudson-slave/workspace/Lucene-Solr-Tests-4.x-Java6/solr/build/solr-core/test-files/solr/collection1/conf/old_synonyms.txt to /configs/conf1/old_synonyms.txt
[junit4:junit4]   2> 311 T1671 oascc.SolrZkClient.makePath makePath: /configs/conf1/old_synonyms.txt
[junit4:junit4]   2> 314 T1671 oasc.AbstractZkTestCase.putConfig put /usr/home/hudson/hudson-slave/workspace/Lucene-Solr-Tests-4.x-Java6/solr/build/solr-core/test-files/solr/collection1/conf/synonyms.txt to /configs/conf1/synonyms.txt
[junit4:junit4]   2> 315 T1671 oascc.SolrZkClient.makePath makePath: /configs/conf1/synonyms.txt
[junit4:junit4]   2> 322 T1676 oazs.PrepRequestProcessor.pRequest2Txn Processed session termination for sessionid: 0x13d40bc0b3c0001
[junit4:junit4]   2> 323 T1680 oaz.ClientCnxn$EventThread.run EventThread shut down
[junit4:junit4]   2> 323 T1673 oazs.NIOServerCnxn.closeSock Closed socket connection for client /140.211.11.196:49264 which had sessionid 0x13d40bc0b3c0001
[junit4:junit4]   2> 323 T1671 oaz.ZooKeeper.close Session: 0x13d40bc0b3c0001 closed
[junit4:junit4]   2> 500 T1671 oejs.Server.doStart jetty-8.1.8.v20121106
[junit4:junit4]   2> 505 T1671 oejs.AbstractConnector.doStart Started SocketConnector@127.0.0.1:14233
[junit4:junit4]   2> 506 T1671 oass.SolrDispatchFilter.init SolrDispatchFilter.init()
[junit4:junit4]   2> 506 T1671 oasc.SolrResourceLoader.locateSolrHome JNDI not configured for solr (NoInitialContextEx)
[junit4:junit4]   2> 507 T1671 oasc.SolrResourceLoader.locateSolrHome using system property solr.solr.home: /usr/home/hudson/hudson-slave/workspace/Lucene-Solr-Tests-4.x-Java6/solr/build/solr-core/test/J0/./org.apache.solr.cloud.SyncSliceTest-controljetty-1362590698611
[junit4:junit4]   2> 507 T1671 oasc.CoreContainer$Initializer.initialize looking for solr.xml: /usr/home/hudson/hudson-slave/workspace/Lucene-Solr-Tests-4.x-Java6/solr/build/solr-core/test/J0/./org.apache.solr.cloud.SyncSliceTest-controljetty-1362590698611/solr.xml
[junit4:junit4]   2> 508 T1671 oasc.CoreContainer.<init> New CoreContainer 43988416
[junit4:junit4]   2> 508 T1671 oasc.CoreContainer.load Loading CoreContainer using Solr Home: '/usr/home/hudson/hudson-slave/workspace/Lucene-Solr-Tests-4.x-Java6/solr/build/solr-core/test/J0/./org.apache.solr.cloud.SyncSliceTest-controljetty-1362590698611/'
[junit4:junit4]   2> 509 T1671 oasc.SolrResourceLoader.<init> new SolrResourceLoader for directory: '/usr/home/hudson/hudson-slave/workspace/Lucene-Solr-Tests-4.x-Java6/solr/build/solr-core/test/J0/./org.apache.solr.cloud.SyncSliceTest-controljetty-1362590698611/'
[junit4:junit4]   2> 557 T1671 oashc.HttpShardHandlerFactory.getParameter Setting socketTimeout to: 120000
[junit4:junit4]   2> 557 T1671 oashc.HttpShardHandlerFactory.getParameter Setting urlScheme to: http://
[junit4:junit4]   2> 558 T1671 oashc.HttpShardHandlerFactory.getParameter Setting connTimeout to: 15000
[junit4:junit4]   2> 558 T1671 oashc.HttpShardHandlerFactory.getParameter Setting maxConnectionsPerHost to: 20
[junit4:junit4]   2> 559 T1671 oashc.HttpShardHandlerFactory.getParameter Setting corePoolSize to: 0
[junit4:junit4]   2> 559 T1671 oashc.HttpShardHandlerFactory.getParameter Setting maximumPoolSize to: 2147483647
[junit4:junit4]   2> 559 T1671 oashc.HttpShardHandlerFactory.getParameter Setting maxThreadIdleTime to: 5
[junit4:junit4]   2> 560 T1671 oashc.HttpShardHandlerFactory.getParameter Setting sizeOfQueue to: -1
[junit4:junit4]   2> 560 T1671 oashc.HttpShardHandlerFactory.getParameter Setting fairnessPolicy to: false
[junit4:junit4]   2> 561 T1671 oascsi.HttpClientUtil.createClient Creating new http client, config:maxConnectionsPerHost=20&maxConnections=10000&socketTimeout=120000&connTimeout=15000&retry=false
[junit4:junit4]   2> 581 T1671 oasc.CoreContainer.load Registering Log Listener
[junit4:junit4]   2> 608 T1671 oasc.CoreContainer.initZooKeeper Zookeeper client=127.0.0.1:33863/solr
[junit4:junit4]   2> 609 T1671 oasc.ZkController.checkChrootPath zkHost includes chroot
[junit4:junit4]   2> 610 T1671 oaz.ZooKeeper.<init> Initiating client connection, connectString=127.0.0.1:33863 sessionTimeout=60000 watcher=org.apache.solr.common.cloud.ConnectionManager@78e763da
[junit4:junit4]   2> 611 T1671 oascc.ConnectionManager.waitForConnected Waiting for client to connect to ZooKeeper
[junit4:junit4]   2> 612 T1690 oaz.ClientCnxn$SendThread.logStartConnect Opening socket connection to server localhost/127.0.0.1:33863. Will not attempt to authenticate using SASL (access denied (javax.security.auth.AuthPermission getLoginConfiguration))
[junit4:junit4]   2> 613 T1690 oaz.ClientCnxn$SendThread.primeConnection Socket connection established to localhost/127.0.0.1:33863, initiating session
[junit4:junit4]   2> 613 T1673 oazs.NIOServerCnxnFactory.run Accepted socket connection from /140.211.11.196:25802
[junit4:junit4]   2> 614 T1673 oazs.ZooKeeperServer.processConnectRequest Client attempting to establish new session at /140.211.11.196:25802
[junit4:junit4]   2> 622 T1675 oazs.ZooKeeperServer.finishSessionInit Established session 0x13d40bc0b3c0002 with negotiated timeout 20000 for client /140.211.11.196:25802
[junit4:junit4]   2> 622 T1690 oaz.ClientCnxn$SendThread.onConnected Session establishment complete on server localhost/127.0.0.1:33863, sessionid = 0x13d40bc0b3c0002, negotiated timeout = 20000
[junit4:junit4]   2> 622 T1691 oascc.ConnectionManager.process Watcher org.apache.solr.common.cloud.ConnectionManager@78e763da name:ZooKeeperConnection Watcher:127.0.0.1:33863 got event WatchedEvent state:SyncConnected type:None path:null path:null type:None
[junit4:junit4]   2> 622 T1671 oascc.ConnectionManager.waitForConnected Client is connected to ZooKeeper
[junit4:junit4]   2> 624 T1676 oazs.PrepRequestProcessor.pRequest2Txn Processed session termination for sessionid: 0x13d40bc0b3c0002
[junit4:junit4]   2> 742 T1691 oaz.ClientCnxn$EventThread.run EventThread shut down
[junit4:junit4]   2> 742 T1673 oazs.NIOServerCnxn.closeSock Closed socket connection for client /140.211.11.196:25802 which had sessionid 0x13d40bc0b3c0002
[junit4:junit4]   2> 742 T1671 oaz.ZooKeeper.close Session: 0x13d40bc0b3c0002 closed
[junit4:junit4]   2> 743 T1671 oascsi.HttpClientUtil.createClient Creating new http client, config:maxConnections=500&maxConnectionsPerHost=16&socketTimeout=120000&connTimeout=15000
[junit4:junit4]   2> 754 T1671 oaz.ZooKeeper.<init> Initiating client connection, connectString=127.0.0.1:33863/solr sessionTimeout=30000 watcher=org.apache.solr.common.cloud.ConnectionManager@309fe804
[junit4:junit4]   2> 755 T1671 oascc.ConnectionManager.waitForConnected Waiting for client to connect to ZooKeeper
[junit4:junit4]   2> 756 T1692 oaz.ClientCnxn$SendThread.logStartConnect Opening socket connection to server localhost/127.0.0.1:33863. Will not attempt to authenticate using SASL (access denied (javax.security.auth.AuthPermission getLoginConfiguration))
[junit4:junit4]   2> 756 T1692 oaz.ClientCnxn$SendThread.primeConnection Socket connection established to localhost/127.0.0.1:33863, initiating session
[junit4:junit4]   2> 756 T1673 oazs.NIOServerCnxnFactory.run Accepted socket connection from /140.211.11.196:64848
[junit4:junit4]   2> 757 T1673 oazs.ZooKeeperServer.processConnectRequest Client attempting to establish new session at /140.211.11.196:64848
[junit4:junit4]   2> 758 T1675 oazs.ZooKeeperServer.finishSessionInit Established session 0x13d40bc0b3c0003 with negotiated timeout 20000 for client /140.211.11.196:64848
[junit4:junit4]   2> 758 T1692 oaz.ClientCnxn$SendThread.onConnected Session establishment complete on server localhost/127.0.0.1:33863, sessionid = 0x13d40bc0b3c0003, negotiated timeout = 20000
[junit4:junit4]   2> 758 T1693 oascc.ConnectionManager.process Watcher org.apache.solr.common.cloud.ConnectionManager@309fe804 name:ZooKeeperConnection Watcher:127.0.0.1:33863/solr got event WatchedEvent state:SyncConnected type:None path:null path:null type:None
[junit4:junit4]   2> 759 T1671 oascc.ConnectionManager.waitForConnected Client is connected to ZooKeeper
[junit4:junit4]   2> 795 T1676 oazs.PrepRequestProcessor.pRequest Got user-level KeeperException when processing sessionid:0x13d40bc0b3c0003 type:create cxid:0x2 zxid:0x1a txntype:-1 reqpath:n/a Error Path:/solr/overseer Error:KeeperErrorCode = NodeExists for /solr/overseer
[junit4:junit4]   2> 797 T1671 oascc.SolrZkClient.makePath makePath: /live_nodes
[junit4:junit4]   2> 832 T1671 oasc.ZkController.createEphemeralLiveNode Register node as live in ZooKeeper:/live_nodes/127.0.0.1:14233_
[junit4:junit4]   2> 833 T1676 oazs.PrepRequestProcessor.pRequest Got user-level KeeperException when processing sessionid:0x13d40bc0b3c0003 type:delete cxid:0x8 zxid:0x1c txntype:-1 reqpath:n/a Error Path:/solr/live_nodes/127.0.0.1:14233_ Error:KeeperErrorCode = NoNode for /solr/live_nodes/127.0.0.1:14233_
[junit4:junit4]   2> 836 T1671 oascc.SolrZkClient.makePath makePath: /live_nodes/127.0.0.1:14233_
[junit4:junit4]   2> 860 T1671 oascc.SolrZkClient.makePath makePath: /overseer_elect/election
[junit4:junit4]   2> 907 T1676 oazs.PrepRequestProcessor.pRequest Got user-level KeeperException when processing sessionid:0x13d40bc0b3c0003 type:delete cxid:0x16 zxid:0x21 txntype:-1 reqpath:n/a Error Path:/solr/overseer_elect/leader Error:KeeperErrorCode = NoNode for /solr/overseer_elect/leader
[junit4:junit4]   2> 943 T1671 oascc.SolrZkClient.makePath makePath: /overseer_elect/leader
[junit4:junit4]   2> 946 T1671 oasc.Overseer.start Overseer (id=89298744003788803-127.0.0.1:14233_-n_0000000000) starting
[junit4:junit4]   2> 947 T1676 oazs.PrepRequestProcessor.pRequest Got user-level KeeperException when processing sessionid:0x13d40bc0b3c0003 type:create cxid:0x1b zxid:0x23 txntype:-1 reqpath:n/a Error Path:/solr/overseer Error:KeeperErrorCode = NodeExists for /solr/overseer
[junit4:junit4]   2> 948 T1676 oazs.PrepRequestProcessor.pRequest Got user-level KeeperException when processing sessionid:0x13d40bc0b3c0003 type:create cxid:0x1c zxid:0x24 txntype:-1 reqpath:n/a Error Path:/solr/overseer Error:KeeperErrorCode = NodeExists for /solr/overseer
[junit4:junit4]   2> 963 T1676 oazs.PrepRequestProcessor.pRequest Got user-level KeeperException when processing sessionid:0x13d40bc0b3c0003 type:create cxid:0x1d zxid:0x25 txntype:-1 reqpath:n/a Error Path:/solr/overseer Error:KeeperErrorCode = NodeExists for /solr/overseer
[junit4:junit4]   2> 965 T1676 oazs.PrepRequestProcessor.pRequest Got user-level KeeperException when processing sessionid:0x13d40bc0b3c0003 type:create cxid:0x1e zxid:0x26 txntype:-1 reqpath:n/a Error Path:/solr/overseer Error:KeeperErrorCode = NodeExists for /solr/overseer
[junit4:junit4]   2> 970 T1695 oasc.OverseerCollectionProcessor.run Process current queue of collection creations
[junit4:junit4]   2> 971 T1671 oascc.SolrZkClient.makePath makePath: /clusterstate.json
[junit4:junit4]   2> 979 T1671 oascc.ZkStateReader.createClusterStateWatchersAndUpdate Updating cluster state from ZooKeeper... 
[junit4:junit4]   2> 981 T1694 oasc.Overseer$ClusterStateUpdater.run Starting to work on the main queue
[junit4:junit4]   2> 986 T1696 oasc.CoreContainer.create Creating SolrCore 'collection1' using instanceDir: /usr/home/hudson/hudson-slave/workspace/Lucene-Solr-Tests-4.x-Java6/solr/build/solr-core/test/J0/./org.apache.solr.cloud.SyncSliceTest-controljetty-1362590698611/collection1
[junit4:junit4]   2> 986 T1696 oasc.ZkController.createCollectionZkNode Check for collection zkNode:control_collection
[junit4:junit4]   2> 987 T1696 oasc.ZkController.createCollectionZkNode Collection zkNode exists
[junit4:junit4]   2> 987 T1696 oasc.ZkController.readConfigName Load collection config from:/collections/control_collection
[junit4:junit4]   2> 988 T1696 oasc.SolrResourceLoader.<init> new SolrResourceLoader for directory: '/usr/home/hudson/hudson-slave/workspace/Lucene-Solr-Tests-4.x-Java6/solr/build/solr-core/test/J0/./org.apache.solr.cloud.SyncSliceTest-controljetty-1362590698611/collection1/'
[junit4:junit4]   2> 989 T1696 oasc.SolrResourceLoader.replaceClassLoader Adding 'file:/usr/home/hudson/hudson-slave/workspace/Lucene-Solr-Tests-4.x-Java6/solr/build/solr-core/test/J0/org.apache.solr.cloud.SyncSliceTest-controljetty-1362590698611/collection1/lib/README' to classloader
[junit4:junit4]   2> 990 T1696 oasc.SolrResourceLoader.replaceClassLoader Adding 'file:/usr/home/hudson/hudson-slave/workspace/Lucene-Solr-Tests-4.x-Java6/solr/build/solr-core/test/J0/org.apache.solr.cloud.SyncSliceTest-controljetty-1362590698611/collection1/lib/classes/' to classloader
[junit4:junit4]   2> 1038 T1696 oasc.SolrConfig.<init> Using Lucene MatchVersion: LUCENE_42
[junit4:junit4]   2> 1096 T1696 oasc.SolrConfig.<init> Loaded SolrConfig: solrconfig.xml
[junit4:junit4]   2> 1197 T1696 oass.IndexSchema.readSchema Reading Solr Schema
[junit4:junit4]   2> 1203 T1696 oass.IndexSchema.readSchema Schema name=test
[junit4:junit4]   2> 1802 T1696 oass.OpenExchangeRatesOrgProvider.init Initialized with rates=open-exchange-rates.json, refreshInterval=1440.
[junit4:junit4]   2> 1813 T1696 oass.IndexSchema.readSchema default search field in schema is text
[junit4:junit4]   2> 1817 T1696 oass.IndexSchema.readSchema unique key field: id
[junit4:junit4]   2> 1830 T1696 oass.FileExchangeRateProvider.reload Reloading exchange rates from file currency.xml
[junit4:junit4]   2> 1835 T1696 oass.FileExchangeRateProvider.reload Reloading exchange rates from file currency.xml
[junit4:junit4]   2> 1839 T1696 oass.OpenExchangeRatesOrgProvider.reload Reloading exchange rates from open-exchange-rates.json
[junit4:junit4]   2> 1840 T1696 oass.OpenExchangeRatesOrgProvider$OpenExchangeRates.<init> WARNING Unknown key IMPORTANT NOTE
[junit4:junit4]   2> 1840 T1696 oass.OpenExchangeRatesOrgProvider$OpenExchangeRates.<init> WARNING Expected key, got STRING
[junit4:junit4]   2> 1840 T1696 oass.OpenExchangeRatesOrgProvider.reload Reloading exchange rates from open-exchange-rates.json
[junit4:junit4]   2> 1841 T1696 oass.OpenExchangeRatesOrgProvider$OpenExchangeRates.<init> WARNING Unknown key IMPORTANT NOTE
[junit4:junit4]   2> 1841 T1696 oass.OpenExchangeRatesOrgProvider$OpenExchangeRates.<init> WARNING Expected key, got STRING
[junit4:junit4]   2> 1842 T1696 oasc.SolrCore.<init> [collection1] Opening new SolrCore at /usr/home/hudson/hudson-slave/workspace/Lucene-Solr-Tests-4.x-Java6/solr/build/solr-core/test/J0/./org.apache.solr.cloud.SyncSliceTest-controljetty-1362590698611/collection1/, dataDir=./org.apache.solr.cloud.SyncSliceTest-1362590698293/control/data/
[junit4:junit4]   2> 1842 T1696 oasc.JmxMonitoredMap.<init> JMX monitoring is enabled. Adding Solr mbeans to JMX Server: com.sun.jmx.mbeanserver.JmxMBeanServer@35f38fc6
[junit4:junit4]   2> 1842 T1696 oasc.SolrCore.initDirectoryFactory org.apache.solr.core.MockDirectoryFactory
[junit4:junit4]   2> 1843 T1696 oasc.CachingDirectoryFactory.get return new directory for /usr/home/hudson/hudson-slave/workspace/Lucene-Solr-Tests-4.x-Java6/solr/build/solr-core/test/J0/./org.apache.solr.cloud.SyncSliceTest-1362590698293/control/data forceNew:false
[junit4:junit4]   2> 1843 T1696 oasc.CachingDirectoryFactory.close Releasing directory:/usr/home/hudson/hudson-slave/workspace/Lucene-Solr-Tests-4.x-Java6/solr/build/solr-core/test/J0/./org.apache.solr.cloud.SyncSliceTest-1362590698293/control/data
[junit4:junit4]   2> 1844 T1696 oasc.SolrCore.getNewIndexDir New index directory detected: old=null new=./org.apache.solr.cloud.SyncSliceTest-1362590698293/control/data/index/
[junit4:junit4]   2> 1844 T1696 oasc.SolrCore.initIndex WARNING [collection1] Solr index directory './org.apache.solr.cloud.SyncSliceTest-1362590698293/control/data/index' doesn't exist. Creating new index...
[junit4:junit4]   2> 1845 T1696 oasc.CachingDirectoryFactory.get return new directory for /usr/home/hudson/hudson-slave/workspace/Lucene-Solr-Tests-4.x-Java6/solr/build/solr-core/test/J0/./org.apache.solr.cloud.SyncSliceTest-1362590698293/control/data/index forceNew:false
[junit4:junit4]   2> 1848 T1696 oasc.SolrDeletionPolicy.onCommit SolrDeletionPolicy.onCommit: commits:num=1
[junit4:junit4]   2> 		commit{dir=MockDirWrapper(org.apache.lucene.store.RAMDirectory@3b91372f lockFactory=org.apache.lucene.store.NativeFSLockFactory@1355725b),segFN=segments_1,generation=1,filenames=[segments_1]
[junit4:junit4]   2> 1848 T1696 oasc.SolrDeletionPolicy.updateCommits newest commit = 1[segments_1]
[junit4:junit4]   2> 1849 T1696 oasc.CachingDirectoryFactory.close Releasing directory:/usr/home/hudson/hudson-slave/workspace/Lucene-Solr-Tests-4.x-Java6/solr/build/solr-core/test/J0/./org.apache.solr.cloud.SyncSliceTest-1362590698293/control/data/index
[junit4:junit4]   2> 1850 T1696 oasup.UpdateRequestProcessorChain.init inserting DistributedUpdateProcessorFactory into updateRequestProcessorChain "dedupe"
[junit4:junit4]   2> 1851 T1696 oasup.UpdateRequestProcessorChain.init inserting DistributedUpdateProcessorFactory into updateRequestProcessorChain "stored_sig"
[junit4:junit4]   2> 1851 T1696 oasup.UpdateRequestProcessorChain.init inserting DistributedUpdateProcessorFactory into updateRequestProcessorChain "distrib-dup-test-chain-implicit"
[junit4:junit4]   2> 1852 T1696 oasc.RequestHandlers.initHandlersFromConfig created standard: solr.StandardRequestHandler
[junit4:junit4]   2> 1852 T1696 oasc.RequestHandlers.initHandlersFromConfig created /get: solr.RealTimeGetHandler
[junit4:junit4]   2> 1852 T1696 oasc.RequestHandlers.initHandlersFromConfig adding lazy requestHandler: solr.ReplicationHandler
[junit4:junit4]   2> 1853 T1696 oasc.RequestHandlers.initHandlersFromConfig created /replication: solr.ReplicationHandler
[junit4:junit4]   2> 1853 T1696 oasc.RequestHandlers.initHandlersFromConfig created /update: solr.UpdateRequestHandler
[junit4:junit4]   2> 1854 T1696 oasc.RequestHandlers.initHandlersFromConfig created /admin/: org.apache.solr.handler.admin.AdminHandlers
[junit4:junit4]   2> 1861 T1696 oashl.XMLLoader.init xsltCacheLifetimeSeconds=60
[junit4:junit4]   2> 1866 T1696 oasc.CachingDirectoryFactory.close Releasing directory:/usr/home/hudson/hudson-slave/workspace/Lucene-Solr-Tests-4.x-Java6/solr/build/solr-core/test/J0/./org.apache.solr.cloud.SyncSliceTest-1362590698293/control/data
[junit4:junit4]   2> 1866 T1696 oass.SolrIndexSearcher.<init> Opening Searcher@74e7eca3 main
[junit4:junit4]   2> 1867 T1696 oasu.UpdateHandler.clearLog Clearing tlog files, tlogDir=./org.apache.solr.cloud.SyncSliceTest-1362590698293/control/data/tlog
[junit4:junit4]   2> 1868 T1696 oasu.CommitTracker.<init> Hard AutoCommit: disabled
[junit4:junit4]   2> 1868 T1696 oasu.CommitTracker.<init> Soft AutoCommit: disabled
[junit4:junit4]   2> 1871 T1697 oasc.SolrCore.registerSearcher [collection1] Registered new searcher Searcher@74e7eca3 main{StandardDirectoryReader(segments_1:1)}
[junit4:junit4]   2> 1873 T1696 oasc.ZkController.publish publishing core=collection1 state=down
[junit4:junit4]   2> 1873 T1696 oasc.ZkController.publish numShards not found on descriptor - reading it from system property
[junit4:junit4]   2> 1873 T1676 oazs.PrepRequestProcessor.pRequest Got user-level KeeperException when processing sessionid:0x13d40bc0b3c0003 type:create cxid:0x50 zxid:0x29 txntype:-1 reqpath:n/a Error Path:/solr/overseer/queue Error:KeeperErrorCode = NoNode for /solr/overseer/queue
[junit4:junit4]   2> 2484 T1694 oascc.ZkStateReader.updateClusterState Updating cloud state from ZooKeeper... 
[junit4:junit4]   2> 2485 T1694 oasc.Overseer$ClusterStateUpdater.updateState Update state numShards=1 message={
[junit4:junit4]   2> 	  "operation":"state",
[junit4:junit4]   2> 	  "core_node_name":null,
[junit4:junit4]   2> 	  "numShards":"1",
[junit4:junit4]   2> 	  "shard":null,
[junit4:junit4]   2> 	  "roles":null,
[junit4:junit4]   2> 	  "state":"down",
[junit4:junit4]   2> 	  "core":"collection1",
[junit4:junit4]   2> 	  "collection":"control_collection",
[junit4:junit4]   2> 	  "node_name":"127.0.0.1:14233_",
[junit4:junit4]   2> 	  "base_url":"http://127.0.0.1:14233"}
[junit4:junit4]   2> 2485 T1694 oasc.Overseer$ClusterStateUpdater.createCollection Create collection control_collection with numShards 1
[junit4:junit4]   2> 2485 T1694 oasc.Overseer$ClusterStateUpdater.updateState Assigning new node to shard shard=shard1
[junit4:junit4]   2> 2486 T1676 oazs.PrepRequestProcessor.pRequest Got user-level KeeperException when processing sessionid:0x13d40bc0b3c0003 type:create cxid:0x58 zxid:0x2c txntype:-1 reqpath:n/a Error Path:/solr/overseer/queue-work Error:KeeperErrorCode = NoNode for /solr/overseer/queue-work
[junit4:junit4]   2> 2503 T1693 oascc.ZkStateReader$2.process A cluster state change: WatchedEvent state:SyncConnected type:NodeDataChanged path:/clusterstate.json, has occurred - updating... (live nodes size: 1)
[junit4:junit4]   2> 2891 T1696 oasc.CoreContainer.registerCore registering core: collection1
[junit4:junit4]   2> 2891 T1696 oasc.ZkController.register Register replica - core:collection1 address:http://127.0.0.1:14233 collection:control_collection shard:shard1
[junit4:junit4]   2> 2892 T1696 oascc.SolrZkClient.makePath makePath: /collections/control_collection/leader_elect/shard1/election
[junit4:junit4]   2> 2906 T1676 oazs.PrepRequestProcessor.pRequest Got user-level KeeperException when processing sessionid:0x13d40bc0b3c0003 type:delete cxid:0x72 zxid:0x36 txntype:-1 reqpath:n/a Error Path:/solr/collections/control_collection/leaders Error:KeeperErrorCode = NoNode for /solr/collections/control_collection/leaders
[junit4:junit4]   2> 2907 T1696 oasc.ShardLeaderElectionContext.runLeaderProcess Running the leader process.
[junit4:junit4]   2> 2908 T1676 oazs.PrepRequestProcessor.pRequest Got user-level KeeperException when processing sessionid:0x13d40bc0b3c0003 type:create cxid:0x73 zxid:0x37 txntype:-1 reqpath:n/a Error Path:/solr/overseer Error:KeeperErrorCode = NodeExists for /solr/overseer
[junit4:junit4]   2> 2910 T1696 oasc.ShardLeaderElectionContext.waitForReplicasToComeUp Enough replicas found to continue.
[junit4:junit4]   2> 2910 T1696 oasc.ShardLeaderElectionContext.runLeaderProcess I may be the new leader - try and sync
[junit4:junit4]   2> 2910 T1696 oasc.SyncStrategy.sync Sync replicas to http://127.0.0.1:14233/collection1/
[junit4:junit4]   2> 2910 T1696 oasc.SyncStrategy.syncReplicas Sync Success - now sync replicas to me
[junit4:junit4]   2> 2910 T1696 oasc.SyncStrategy.syncToMe http://127.0.0.1:14233/collection1/ has no replicas
[junit4:junit4]   2> 2911 T1696 oasc.ShardLeaderElectionContext.runLeaderProcess I am the new leader: http://127.0.0.1:14233/collection1/
[junit4:junit4]   2> 2911 T1696 oascc.SolrZkClient.makePath makePath: /collections/control_collection/leaders/shard1
[junit4:junit4]   2> 2914 T1676 oazs.PrepRequestProcessor.pRequest Got user-level KeeperException when processing sessionid:0x13d40bc0b3c0003 type:create cxid:0x7d zxid:0x3b txntype:-1 reqpath:n/a Error Path:/solr/overseer Error:KeeperErrorCode = NodeExists for /solr/overseer
[junit4:junit4]   2> 4006 T1694 oascc.ZkStateReader.updateClusterState Updating cloud state from ZooKeeper... 
[junit4:junit4]   2> 4026 T1693 oascc.ZkStateReader$2.process A cluster state change: WatchedEvent state:SyncConnected type:NodeDataChanged path:/clusterstate.json, has occurred - updating... (live nodes size: 1)
[junit4:junit4]   2> 4089 T1696 oasc.ZkController.register We are http://127.0.0.1:14233/collection1/ and leader is http://127.0.0.1:14233/collection1/
[junit4:junit4]   2> 4089 T1696 oasc.ZkController.register No LogReplay needed for core=collection1 baseURL=http://127.0.0.1:14233
[junit4:junit4]   2> 4089 T1696 oasc.ZkController.checkRecovery I am the leader, no recovery necessary
[junit4:junit4]   2> 4089 T1696 oasc.ZkController.publish publishing core=collection1 state=active
[junit4:junit4]   2> 4089 T1696 oasc.ZkController.publish numShards not found on descriptor - reading it from system property
[junit4:junit4]   2> 4091 T1696 oascc.ZkStateReader.updateClusterState Updating cloud state from ZooKeeper... 
[junit4:junit4]   2> 4092 T1671 oass.SolrDispatchFilter.init user.dir=/usr/home/hudson/hudson-slave/workspace/Lucene-Solr-Tests-4.x-Java6/solr/build/solr-core/test/J0
[junit4:junit4]   2> 4093 T1671 oass.SolrDispatchFilter.init SolrDispatchFilter.init() done
[junit4:junit4]   2> 4093 T1671 oascsi.HttpClientUtil.createClient Creating new http client, config:maxConnections=128&maxConnectionsPerHost=32&followRedirects=false
[junit4:junit4]   2> 4106 T1671 oascsi.HttpClientUtil.createClient Creating new http client, config:
[junit4:junit4]   2> 4107 T1671 oaz.ZooKeeper.<init> Initiating client connection, connectString=127.0.0.1:33863/solr sessionTimeout=10000 watcher=org.apache.solr.common.cloud.ConnectionManager@5d47ca1c
[junit4:junit4]   2> 4108 T1671 oascc.ConnectionManager.waitForConnected Waiting for client to connect to ZooKeeper
[junit4:junit4]   2> 4109 T1698 oaz.ClientCnxn$SendThread.logStartConnect Opening socket connection to server localhost/127.0.0.1:33863. Will not attempt to authenticate using SASL (access denied (javax.security.auth.AuthPermission getLoginConfiguration))
[junit4:junit4]   2> 4109 T1698 oaz.ClientCnxn$SendThread.primeConnection Socket connection established to localhost/127.0.0.1:33863, initiating session
[junit4:junit4]   2> 4109 T1673 oazs.NIOServerCnxnFactory.run Accepted socket connection from /140.211.11.196:46251
[junit4:junit4]   2> 4110 T1673 oazs.ZooKeeperServer.processConnectRequest Client attempting to establish new session at /140.211.11.196:46251
[junit4:junit4]   2> 4111 T1675 oazs.ZooKeeperServer.finishSessionInit Established session 0x13d40bc0b3c0004 with negotiated timeout 10000 for client /140.211.11.196:46251
[junit4:junit4]   2> 4111 T1698 oaz.ClientCnxn$SendThread.onConnected Session establishment complete on server localhost/127.0.0.1:33863, sessionid = 0x13d40bc0b3c0004, negotiated timeout = 10000
[junit4:junit4]   2> 4111 T1699 oascc.ConnectionManager.process Watcher org.apache.solr.common.cloud.ConnectionManager@5d47ca1c name:ZooKeeperConnection Watcher:127.0.0.1:33863/solr got event WatchedEvent state:SyncConnected type:None path:null path:null type:None
[junit4:junit4]   2> 4111 T1671 oascc.ConnectionManager.waitForConnected Client is connected to ZooKeeper
[junit4:junit4]   2> 4112 T1671 oascc.ZkStateReader.createClusterStateWatchersAndUpdate Updating cluster state from ZooKeeper... 
[junit4:junit4]   2> 4113 T1671 oasc.ChaosMonkey.monkeyLog monkey: init - expire sessions:true cause connection loss:true
[junit4:junit4]   2> 4292 T1671 oejs.Server.doStart jetty-8.1.8.v20121106
[junit4:junit4]   2> 4295 T1671 oejs.AbstractConnector.doStart Started SocketConnector@127.0.0.1:58324
[junit4:junit4]   2> 4296 T1671 oass.SolrDispatchFilter.init SolrDispatchFilter.init()
[junit4:junit4]   2> 4296 T1671 oasc.SolrResourceLoader.locateSolrHome JNDI not configured for solr (NoInitialContextEx)
[junit4:junit4]   2> 4297 T1671 oasc.SolrResourceLoader.locateSolrHome using system property solr.solr.home: /usr/home/hudson/hudson-slave/workspace/Lucene-Solr-Tests-4.x-Java6/solr/build/solr-core/test/J0/./org.apache.solr.cloud.SyncSliceTest-jetty1-1362590702401
[junit4:junit4]   2> 4297 T1671 oasc.CoreContainer$Initializer.initialize looking for solr.xml: /usr/home/hudson/hudson-slave/workspace/Lucene-Solr-Tests-4.x-Java6/solr/build/solr-core/test/J0/./org.apache.solr.cloud.SyncSliceTest-jetty1-1362590702401/solr.xml
[junit4:junit4]   2> 4298 T1671 oasc.CoreContainer.<init> New CoreContainer 482893057
[junit4:junit4]   2> 4298 T1671 oasc.CoreContainer.load Loading CoreContainer using Solr Home: '/usr/home/hudson/hudson-slave/workspace/Lucene-Solr-Tests-4.x-Java6/solr/build/solr-core/test/J0/./org.apache.solr.cloud.SyncSliceTest-jetty1-1362590702401/'
[junit4:junit4]   2> 4299 T1671 oasc.SolrResourceLoader.<init> new SolrResourceLoader for directory: '/usr/home/hudson/hudson-slave/workspace/Lucene-Solr-Tests-4.x-Java6/solr/build/solr-core/test/J0/./org.apache.solr.cloud.SyncSliceTest-jetty1-1362590702401/'
[junit4:junit4]   2> 4346 T1671 oashc.HttpShardHandlerFactory.getParameter Setting socketTimeout to: 120000
[junit4:junit4]   2> 4347 T1671 oashc.HttpShardHandlerFactory.getParameter Setting urlScheme to: http://
[junit4:junit4]   2> 4347 T1671 oashc.HttpShardHandlerFactory.getParameter Setting connTimeout to: 15000
[junit4:junit4]   2> 4348 T1671 oashc.HttpShardHandlerFactory.getParameter Setting maxConnectionsPerHost to: 20
[junit4:junit4]   2> 4348 T1671 oashc.HttpShardHandlerFactory.getParameter Setting corePoolSize to: 0
[junit4:junit4]   2> 4349 T1671 oashc.HttpShardHandlerFactory.getParameter Setting maximumPoolSize to: 2147483647
[junit4:junit4]   2> 4349 T1671 oashc.HttpShardHandlerFactory.getParameter Setting maxThreadIdleTime to: 5
[junit4:junit4]   2> 4349 T1671 oashc.HttpShardHandlerFactory.getParameter Setting sizeOfQueue to: -1
[junit4:junit4]   2> 4350 T1671 oashc.HttpShardHandlerFactory.getParameter Setting fairnessPolicy to: false
[junit4:junit4]   2> 4350 T1671 oascsi.HttpClientUtil.createClient Creating new http client, config:maxConnectionsPerHost=20&maxConnections=10000&socketTimeout=120000&connTimeout=15000&retry=false
[junit4:junit4]   2> 4369 T1671 oasc.CoreContainer.load Registering Log Listener
[junit4:junit4]   2> 4387 T1671 oasc.CoreContainer.initZooKeeper Zookeeper client=127.0.0.1:33863/solr
[junit4:junit4]   2> 4387 T1671 oasc.ZkController.checkChrootPath zkHost includes chroot
[junit4:junit4]   2> 4388 T1671 oaz.ZooKeeper.<init> Initiating client connection, connectString=127.0.0.1:33863 sessionTimeout=60000 watcher=org.apache.solr.common.cloud.ConnectionManager@5050ffcd
[junit4:junit4]   2> 4389 T1671 oascc.ConnectionManager.waitForConnected Waiting for client to connect to ZooKeeper
[junit4:junit4]   2> 4389 T1709 oaz.ClientCnxn$SendThread.logStartConnect Opening socket connection to server localhost/127.0.0.1:33863. Will not attempt to authenticate using SASL (access denied (javax.security.auth.AuthPermission getLoginConfiguration))
[junit4:junit4]   2> 4390 T1709 oaz.ClientCnxn$SendThread.primeConnection Socket connection established to localhost/127.0.0.1:33863, initiating session
[junit4:junit4]   2> 4390 T1673 oazs.NIOServerCnxnFactory.run Accepted socket connection from /140.211.11.196:44834
[junit4:junit4]   2> 4391 T1673 oazs.ZooKeeperServer.processConnectRequest Client attempting to establish new session at /140.211.11.196:44834
[junit4:junit4]   2> 4393 T1675 oazs.ZooKeeperServer.finishSessionInit Established session 0x13d40bc0b3c0005 with negotiated timeout 20000 for client /140.211.11.196:44834
[junit4:junit4]   2> 4393 T1709 oaz.ClientCnxn$SendThread.onConnected Session establishment complete on server localhost/127.0.0.1:33863, sessionid = 0x13d40bc0b3c0005, negotiated timeout = 20000
[junit4:junit4]   2> 4393 T1710 oascc.ConnectionManager.process Watcher org.apache.solr.common.cloud.ConnectionManager@5050ffcd name:ZooKeeperConnection Watcher:127.0.0.1:33863 got event WatchedEvent state:SyncConnected type:None path:null path:null type:None
[junit4:junit4]   2> 4393 T1671 oascc.ConnectionManager.waitForConnected Client is connected to ZooKeeper
[junit4:junit4]   2> 4394 T1676 oazs.PrepRequestProcessor.pRequest2Txn Processed session termination for sessionid: 0x13d40bc0b3c0005
[junit4:junit4]   2> 4405 T1710 oaz.ClientCnxn$EventThread.run EventThread shut down
[junit4:junit4]   2> 4405 T1673 oazs.NIOServerCnxn.closeSock Closed socket connection for client /140.211.11.196:44834 which had sessionid 0x13d40bc0b3c0005
[junit4:junit4]   2> 4405 T1671 oaz.ZooKeeper.close Session: 0x13d40bc0b3c0005 closed
[junit4:junit4]   2> 4405 T1671 oascsi.HttpClientUtil.createClient Creating new http client, config:maxConnections=500&maxConnectionsPerHost=16&socketTimeout=120000&connTimeout=15000
[junit4:junit4]   2> 4414 T1671 oaz.ZooKeeper.<init> Initiating client connection, connectString=127.0.0.1:33863/solr sessionTimeout=30000 watcher=org.apache.solr.common.cloud.ConnectionManager@11dcb34a
[junit4:junit4]   2> 4415 T1671 oascc.ConnectionManager.waitForConnected Waiting for client to connect to ZooKeeper
[junit4:junit4]   2> 4416 T1711 oaz.ClientCnxn$SendThread.logStartConnect Opening socket connection to server localhost/127.0.0.1:33863. Will not attempt to authenticate using SASL (access denied (javax.security.auth.AuthPermission getLoginConfiguration))
[junit4:junit4]   2> 4416 T1711 oaz.ClientCnxn$SendThread.primeConnection Socket connection established to localhost/127.0.0.1:33863, initiating session
[junit4:junit4]   2> 4416 T1673 oazs.NIOServerCnxnFactory.run Accepted socket connection from /140.211.11.196:54492
[junit4:junit4]   2> 4417 T1673 oazs.ZooKeeperServer.processConnectRequest Client attempting to establish new session at /140.211.11.196:54492
[junit4:junit4]   2> 4418 T1675 oazs.ZooKeeperServer.finishSessionInit Established session 0x13d40bc0b3c0006 with negotiated timeout 20000 for client /140.211.11.196:54492
[junit4:junit4]   2> 4418 T1711 oaz.ClientCnxn$SendThread.onConnected Session establishment complete on server localhost/127.0.0.1:33863, sessionid = 0x13d40bc0b3c0006, negotiated timeout = 20000
[junit4:junit4]   2> 4418 T1712 oascc.ConnectionManager.process Watcher org.apache.solr.common.cloud.ConnectionManager@11dcb34a name:ZooKeeperConnection Watcher:127.0.0.1:33863/solr got event WatchedEvent state:SyncConnected type:None path:null path:null type:None
[junit4:junit4]   2> 4418 T1671 oascc.ConnectionManager.waitForConnected Client is connected to ZooKeeper
[junit4:junit4]   2> 4419 T1676 oazs.PrepRequestProcessor.pRequest Got user-level KeeperException when processing sessionid:0x13d40bc0b3c0006 type:create cxid:0x1 zxid:0x49 txntype:-1 reqpath:n/a Error Path:/solr/overseer Error:KeeperErrorCode = NodeExists for /solr/overseer
[junit4:junit4]   2> 4421 T1676 oazs.PrepRequestProcessor.pRequest Got user-level KeeperException when processing sessionid:0x13d40bc0b3c0006 type:create cxid:0x2 zxid:0x4a txntype:-1 reqpath:n/a Error Path:/solr/overseer Error:KeeperErrorCode = NodeExists for /solr/overseer
[junit4:junit4]   2> 4429 T1671 oascc.ZkStateReader.createClusterStateWatchersAndUpdate Updating cluster state from ZooKeeper... 
[junit4:junit4]   2> 5431 T1671 oasc.ZkController.createEphemeralLiveNode Register node as live in ZooKeeper:/live_nodes/127.0.0.1:58324_
[junit4:junit4]   2> 5432 T1676 oazs.PrepRequestProcessor.pRequest Got user-level KeeperException when processing sessionid:0x13d40bc0b3c0006 type:delete cxid:0x9 zxid:0x4b txntype:-1 reqpath:n/a Error Path:/solr/live_nodes/127.0.0.1:58324_ Error:KeeperErrorCode = NoNode for /solr/live_nodes/127.0.0.1:58324_
[junit4:junit4]   2> 5434 T1671 oascc.SolrZkClient.makePath makePath: /live_nodes/127.0.0.1:58324_
[junit4:junit4]   2> 5437 T1699 oascc.ZkStateReader$3.process Updating live nodes... (2)
[junit4:junit4]   2> 5437 T1693 oascc.ZkStateReader$3.process Updating live nodes... (2)
[junit4:junit4]   2> 5437 T1712 oascc.ZkStateReader$3.process Updating live nodes... (2)
[junit4:junit4]   2> 5438 T1693 oascc.ZkStateReader$2.process A cluster state change: WatchedEvent state:SyncConnected type:NodeChildrenChanged path:/live_nodes, has occurred - updating... (live nodes size: 2)
[junit4:junit4]   2> 5452 T1713 oasc.CoreContainer.create Creating SolrCore 'collection1' using instanceDir: /usr/home/hudson/hudson-slave/workspace/Lucene-Solr-Tests-4.x-Java6/solr/build/solr-core/test/J0/./org.apache.solr.cloud.SyncSliceTest-jetty1-1362590702401/collection1
[junit4:junit4]   2> 5453 T1713 oasc.ZkController.createCollectionZkNode Check for collection zkNode:collection1
[junit4:junit4]   2> 5453 T1713 oasc.ZkController.createCollectionZkNode Collection zkNode exists
[junit4:junit4]   2> 5453 T1713 oasc.ZkController.readConfigName Load collection config from:/collections/collection1
[junit4:junit4]   2> 5455 T1713 oasc.SolrResourceLoader.<init> new SolrResourceLoader for directory: '/usr/home/hudson/hudson-slave/workspace/Lucene-Solr-Tests-4.x-Java6/solr/build/solr-core/test/J0/./org.apache.solr.cloud.SyncSliceTest-jetty1-1362590702401/collection1/'
[junit4:junit4]   2> 5456 T1713 oasc.SolrResourceLoader.replaceClassLoader Adding 'file:/usr/home/hudson/hudson-slave/workspace/Lucene-Solr-Tests-4.x-Java6/solr/build/solr-core/test/J0/org.apache.solr.cloud.SyncSliceTest-jetty1-1362590702401/collection1/lib/classes/' to classloader
[junit4:junit4]   2> 5456 T1713 oasc.SolrResourceLoader.replaceClassLoader Adding 'file:/usr/home/hudson/hudson-slave/workspace/Lucene-Solr-Tests-4.x-Java6/solr/build/solr-core/test/J0/org.apache.solr.cloud.SyncSliceTest-jetty1-1362590702401/collection1/lib/README' to classloader
[junit4:junit4]   2> 5504 T1713 oasc.SolrConfig.<init> Using Lucene MatchVersion: LUCENE_42
[junit4:junit4]   2> 5540 T1694 oascc.ZkStateReader.updateClusterState Updating cloud state from ZooKeeper... 
[junit4:junit4]   2> 5541 T1694 oasc.Overseer$ClusterStateUpdater.updateState Update state numShards=1 message={
[junit4:junit4]   2> 	  "operation":"state",
[junit4:junit4]   2> 	  "core_node_name":null,
[junit4:junit4]   2> 	  "numShards":"1",
[junit4:junit4]   2> 	  "shard":"shard1",
[junit4:junit4]   2> 	  "roles":null,
[junit4:junit4]   2> 	  "state":"active",
[junit4:junit4]   2> 	  "core":"collection1",
[junit4:junit4]   2> 	  "collection":"control_collection",
[junit4:junit4]   2> 	  "node_name":"127.0.0.1:14233_",
[junit4:junit4]   2> 	  "base_url":"http://127.0.0.1:14233"}
[junit4:junit4]   2> 5554 T1699 oascc.ZkStateReader$2.process A cluster state change: WatchedEvent state:SyncConnected type:NodeDataChanged path:/clusterstate.json, has occurred - updating... (live nodes size: 2)
[junit4:junit4]   2> 5554 T1712 oascc.ZkStateReader$2.process A cluster state change: WatchedEvent state:SyncConnected type:NodeDataChanged path:/clusterstate.json, has occurred - updating... (live nodes size: 2)
[junit4:junit4]   2> 5554 T1693 oascc.ZkStateReader$2.process A cluster state change: WatchedEvent state:SyncConnected type:NodeDataChanged path:/clusterstate.json, has occurred - updating... (live nodes size: 2)
[junit4:junit4]   2> 5561 T1713 oasc.SolrConfig.<init> Loaded SolrConfig: solrconfig.xml
[junit4:junit4]   2> 5661 T1713 oass.IndexSchema.readSchema Reading Solr Schema
[junit4:junit4]   2> 5668 T1713 oass.IndexSchema.readSchema Schema name=test
[junit4:junit4]   2> 6272 T1713 oass.OpenExchangeRatesOrgProvider.init Initialized with rates=open-exchange-rates.json, refreshInterval=1440.
[junit4:junit4]   2> 6283 T1713 oass.IndexSchema.readSchema default search field in schema is text
[junit4:junit4]   2> 6288 T1713 oass.IndexSchema.readSchema unique key field: id
[junit4:junit4]   2> 6301 T1713 oass.FileExchangeRateProvider.reload Reloading exchange rates from file currency.xml
[junit4:junit4]   2> 6305 T1713 oass.FileExchangeRateProvider.reload Reloading exchange rates from file currency.xml
[junit4:junit4]   2> 6310 T1713 oass.OpenExchangeRatesOrgProvider.reload Reloading exchange rates from open-exchange-rates.json
[junit4:junit4]   2> 6311 T1713 oass.OpenExchangeRatesOrgProvider$OpenExchangeRates.<init> WARNING Unknown key IMPORTANT NOTE
[junit4:junit4]   2> 6312 T1713 oass.OpenExchangeRatesOrgProvider$OpenExchangeRates.<init> WARNING Expected key, got STRING
[junit4:junit4]   2> 6312 T1713 oass.OpenExchangeRatesOrgProvider.reload Reloading exchange rates from open-exchange-rates.json
[junit4:junit4]   2> 6313 T1713 oass.OpenExchangeRatesOrgProvider$OpenExchangeRates.<init> WARNING Unknown key IMPORTANT NOTE
[junit4:junit4]   2> 6313 T1713 oass.OpenExchangeRatesOrgProvider$OpenExchangeRates.<init> WARNING Expected key, got STRING
[junit4:junit4]   2> 6313 T1713 oasc.SolrCore.<init> [collection1] Opening new SolrCore at /usr/home/hudson/hudson-slave/workspace/Lucene-Solr-Tests-4.x-Java6/solr/build/solr-core/test/J0/./org.apache.solr.cloud.SyncSliceTest-jetty1-1362590702401/collection1/, dataDir=./org.apache.solr.cloud.SyncSliceTest-1362590698293/jetty1/
[junit4:junit4]   2> 6313 T1713 oasc.JmxMonitoredMap.<init> JMX monitoring is enabled. Adding Solr mbeans to JMX Server: com.sun.jmx.mbeanserver.JmxMBeanServer@35f38fc6
[junit4:junit4]   2> 6314 T1713 oasc.SolrCore.initDirectoryFactory org.apache.solr.core.MockDirectoryFactory
[junit4:junit4]   2> 6315 T1713 oasc.CachingDirectoryFactory.get return new directory for /usr/home/hudson/hudson-slave/workspace/Lucene-Solr-Tests-4.x-Java6/solr/build/solr-core/test/J0/./org.apache.solr.cloud.SyncSliceTest-1362590698293/jetty1 forceNew:false
[junit4:junit4]   2> 6315 T1713 oasc.CachingDirectoryFactory.close Releasing directory:/usr/home/hudson/hudson-slave/workspace/Lucene-Solr-Tests-4.x-Java6/solr/build/solr-core/test/J0/./org.apache.solr.cloud.SyncSliceTest-1362590698293/jetty1
[junit4:junit4]   2> 6315 T1713 oasc.SolrCore.getNewIndexDir New index directory detected: old=null new=./org.apache.solr.cloud.SyncSliceTest-1362590698293/jetty1/index/
[junit4:junit4]   2> 6316 T1713 oasc.SolrCore.initIndex WARNING [collection1] Solr index directory './org.apache.solr.cloud.SyncSliceTest-1362590698293/jetty1/index' doesn't exist. Creating new index...
[junit4:junit4]   2> 6316 T1713 oasc.CachingDirectoryFactory.get return new directory for /usr/home/hudson/hudson-slave/workspace/Lucene-Solr-Tests-4.x-Java6/solr/build/solr-core/test/J0/./org.apache.solr.cloud.SyncSliceTest-1362590698293/jetty1/index forceNew:false
[junit4:junit4]   2> 6319 T1713 oasc.SolrDeletionPolicy.onCommit SolrDeletionPolicy.onCommit: commits:num=1
[junit4:junit4]   2> 		commit{dir=MockDirWrapper(org.apache.lucene.store.RAMDirectory@2cac0ca8 lockFactory=org.apache.lucene.store.NativeFSLockFactory@23263ff4),segFN=segments_1,generation=1,filenames=[segments_1]
[junit4:junit4]   2> 6319 T1713 oasc.SolrDeletionPolicy.updateCommits newest commit = 1[segments_1]
[junit4:junit4]   2> 6320 T1713 oasc.CachingDirectoryFactory.close Releasing directory:/usr/home/hudson/hudson-slave/workspace/Lucene-Solr-Tests-4.x-Java6/solr/build/solr-core/test/J0/./org.apache.solr.cloud.SyncSliceTest-1362590698293/jetty1/index
[junit4:junit4]   2> 6322 T1713 oasup.UpdateRequestProcessorChain.init inserting DistributedUpdateProcessorFactory into updateRequestProcessorChain "dedupe"
[junit4:junit4]   2> 6322 T1713 oasup.UpdateRequestProcessorChain.init inserting DistributedUpdateProcessorFactory into updateRequestProcessorChain "stored_sig"
[junit4:junit4]   2> 6322 T1713 oasup.UpdateRequestProcessorChain.init inserting DistributedUpdateProcessorFactory into updateRequestProcessorChain "distrib-dup-test-chain-implicit"
[junit4:junit4]   2> 6323 T1713 oasc.RequestHandlers.initHandlersFromConfig created standard: solr.StandardRequestHandler
[junit4:junit4]   2> 6324 T1713 oasc.RequestHandlers.initHandlersFromConfig created /get: solr.RealTimeGetHandler
[junit4:junit4]   2> 6324 T1713 oasc.RequestHandlers.initHandlersFromConfig adding lazy requestHandler: solr.ReplicationHandler
[junit4:junit4]   2> 6324 T1713 oasc.RequestHandlers.initHandlersFromConfig created /replication: solr.ReplicationHandler
[junit4:junit4]   2> 6325 T1713 oasc.RequestHandlers.initHandlersFromConfig created /update: solr.UpdateRequestHandler
[junit4:junit4]   2> 6325 T1713 oasc.RequestHandlers.initHandlersFromConfig created /admin/: org.apache.solr.handler.admin.AdminHandlers
[junit4:junit4]   2> 6332 T1713 oashl.XMLLoader.init xsltCacheLifetimeSeconds=60
[junit4:junit4]   2> 6338 T1713 oasc.CachingDirectoryFactory.close Releasing directory:/usr/home/hudson/hudson-slave/workspace/Lucene-Solr-Tests-4.x-Java6/solr/build/solr-core/test/J0/./org.apache.solr.cloud.SyncSliceTest-1362590698293/jetty1
[junit4:junit4]   2> 6338 T1713 oass.SolrIndexSearcher.<init> Opening Searcher@3081d743 main
[junit4:junit4]   2> 6338 T1713 oasu.UpdateHandler.clearLog Clearing tlog files, tlogDir=./org.apache.solr.cloud.SyncSliceTest-1362590698293/jetty1/tlog
[junit4:junit4]   2> 6339 T1713 oasu.CommitTracker.<init> Hard AutoCommit: disabled
[junit4:junit4]   2> 6339 T1713 oasu.CommitTracker.<init> Soft AutoCommit: disabled
[junit4:junit4]   2> 6343 T1714 oasc.SolrCore.registerSearcher [collection1] Registered new searcher Searcher@3081d743 main{StandardDirectoryReader(segments_1:1)}
[junit4:junit4]   2> 6345 T1713 oasc.ZkController.publish publishing core=collection1 state=down
[junit4:junit4]   2> 6345 T1713 oasc.ZkController.publish numShards not found on descriptor - reading it from system property
[junit4:junit4]   2> 7059 T1694 oascc.ZkStateReader.updateClusterState Updating cloud state from ZooKeeper... 
[junit4:junit4]   2> 7060 T1694 oasc.Overseer$ClusterStateUpdater.updateState Update state numShards=1 message={
[junit4:junit4]   2> 	  "operation":"state",
[junit4:junit4]   2> 	  "core_node_name":null,
[junit4:junit4]   2> 	  "numShards":"1",
[junit4:junit4]   2> 	  "shard":null,
[junit4:junit4]   2> 	  "roles":null,
[junit4:junit4]   2> 	  "state":"down",
[junit4:junit4]   2> 	  "core":"collection1",
[junit4:junit4]   2> 	  "collection":"collection1",
[junit4:junit4]   2> 	  "node_name":"127.0.0.1:58324_",
[junit4:junit4]   2> 	  "base_url":"http://127.0.0.1:58324"}
[junit4:junit4]   2> 7060 T1694 oasc.Overseer$ClusterStateUpdater.createCollection Create collection collection1 with numShards 1
[junit4:junit4]   2> 7060 T1694 oasc.Overseer$ClusterStateUpdater.updateState Assigning new node to shard shard=shard1
[junit4:junit4]   2> 7098 T1693 oascc.ZkStateReader$2.process A cluster state change: WatchedEvent state:SyncConnected type:NodeDataChanged path:/clusterstate.json, has occurred - updating... (live nodes size: 2)
[junit4:junit4]   2> 7098 T1712 oascc.ZkStateReader$2.process A cluster state change: WatchedEvent state:SyncConnected type:NodeDataChanged path:/clusterstate.json, has occurred - updating... (live nodes size: 2)
[junit4:junit4]   2> 7098 T1699 oascc.ZkStateReader$2.process A cluster state change: WatchedEvent state:SyncConnected type:NodeDataChanged path:/clusterstate.json, has occurred - updating... (live nodes size: 2)
[junit4:junit4]   2> 7373 T1713 oasc.CoreContainer.registerCore registering core: collection1
[junit4:junit4]   2> 7373 T1713 oasc.ZkController.register Register replica - core:collection1 address:http://127.0.0.1:58324 collection:collection1 shard:shard1
[junit4:junit4]   2> 7374 T1713 oascc.SolrZkClient.makePath makePath: /collections/collection1/leader_elect/shard1/election
[junit4:junit4]   2> 7391 T1676 oazs.PrepRequestProcessor.pRequest Got user-level KeeperException when processing sessionid:0x13d40bc0b3c0006 type:delete cxid:0x46 zxid:0x5b txntype:-1 reqpath:n/a Error Path:/solr/collections/collection1/leaders Error:KeeperErrorCode = NoNode for /solr/collections/collection1/leaders
[junit4:junit4]   2> 7392 T1713 oasc.ShardLeaderElectionContext.runLeaderProcess Running the leader process.
[junit4:junit4]   2> 7392 T1676 oazs.PrepRequestProcessor.pRequest Got user-level KeeperException when processing sessionid:0x13d40bc0b3c0006 type:create cxid:0x47 zxid:0x5c txntype:-1 reqpath:n/a Error Path:/solr/overseer Error:KeeperErrorCode = NodeExists for /solr/overseer
[junit4:junit4]   2> 7394 T1713 oasc.ShardLeaderElectionContext.waitForReplicasToComeUp Enough replicas found to continue.
[junit4:junit4]   2> 7394 T1713 oasc.ShardLeaderElectionContext.runLeaderProcess I may be the new leader - try and sync
[junit4:junit4]   2> 7395 T1713 oasc.SyncStrategy.sync Sync replicas to http://127.0.0.1:58324/collection1/
[junit4:junit4]   2> 7395 T1713 oasc.SyncStrategy.syncReplicas Sync Success - now sync replicas to me
[junit4:junit4]   2> 7395 T1713 oasc.SyncStrategy.syncToMe http://127.0.0.1:58324/collection1/ has no replicas
[junit4:junit4]   2> 7395 T1713 oasc.ShardLeaderElectionContext.runLeaderProcess I am the new leader: http://127.0.0.1:58324/collection1/
[junit4:junit4]   2> 7395 T1713 oascc.SolrZkClient.makePath makePath: /collections/collection1/leaders/shard1
[junit4:junit4]   2> 7399 T1676 oazs.PrepRequestProcessor.pRequest Got user-level KeeperException when processing sessionid:0x13d40bc0b3c0006 type:create cxid:0x51 zxid:0x60 txntype:-1 reqpath:n/a Error Path:/solr/overseer Error:KeeperErrorCode = NodeExists for /solr/overseer
[junit4:junit4]   2> 8602 T1694 oascc.ZkStateReader.updateClusterState Updating cloud state from ZooKeeper... 
[junit4:junit4]   2> 8621 T1693 oascc.ZkStateReader$2.process A cluster state change: WatchedEvent state:SyncConnected type:NodeDataChanged path:/clusterstate.json, has occurred - updating... (live nodes size: 2)
[junit4:junit4]   2> 8621 T1699 oascc.ZkStateReader$2.process A cluster state change: WatchedEvent state:SyncConnected type:NodeDataChanged path:/clusterstate.json, has occurred - updating... (live nodes size: 2)
[junit4:junit4]   2> 8621 T1712 oascc.ZkStateReader$2.process A cluster state change: WatchedEvent state:SyncConnected type:NodeDataChanged path:/clusterstate.json, has occurred - updating... (live nodes size: 2)
[junit4:junit4]   2> 8676 T1713 oasc.ZkController.register We are http://127.0.0.1:58324/collection1/ and leader is http://127.0.0.1:58324/collection1/
[junit4:junit4]   2> 8676 T1713 oasc.ZkController.register No LogReplay needed for core=collection1 baseURL=http://127.0.0.1:58324
[junit4:junit4]   2> 8676 T1713 oasc.ZkController.checkRecovery I am the leader, no recovery necessary
[junit4:junit4]   2> 8676 T1713 oasc.ZkController.publish publishing core=collection1 state=active
[junit4:junit4]   2> 8676 T1713 oasc.ZkController.publish numShards not found on descriptor - reading it from system property
[junit4:junit4]   2> 8679 T1713 oascc.ZkStateReader.updateClusterState Updating cloud state from ZooKeeper... 
[junit4:junit4]   2> 8680 T1671 oass.SolrDispatchFilter.init user.dir=/usr/home/hudson/hudson-slave/workspace/Lucene-Solr-Tests-4.x-Java6/solr/build/solr-core/test/J0
[junit4:junit4]   2> 8680 T1671 oass.SolrDispatchFilter.init SolrDispatchFilter.init() done
[junit4:junit4]   2> 8681 T1671 oascsi.HttpClientUtil.createClient Creating new http client, config:maxConnections=128&maxConnectionsPerHost=32&followRedirects=false
[junit4:junit4]   2> 8880 T1671 oejs.Server.doStart jetty-8.1.8.v20121106
[junit4:junit4]   2> 8883 T1671 oejs.AbstractConnector.doStart Started SocketConnector@127.0.0.1:58450
[junit4:junit4]   2> 8884 T1671 oass.SolrDispatchFilter.init SolrDispatchFilter.init()
[junit4:junit4]   2> 8884 T1671 oasc.SolrResourceLoader.locateSolrHome JNDI not configured for solr (NoInitialContextEx)
[junit4:junit4]   2> 8885 T1671 oasc.SolrResourceLoader.locateSolrHome using system property solr.solr.home: /usr/home/hudson/hudson-slave/workspace/Lucene-Solr-Tests-4.x-Java6/solr/build/solr-core/test/J0/./org.apache.solr.cloud.SyncSliceTest-jetty2-1362590706981
[junit4:junit4]   2> 8885 T1671 oasc.CoreContainer$Initializer.initialize looking for solr.xml: /usr/home/hudson/hudson-slave/workspace/Lucene-Solr-Tests-4.x-Java6/solr/build/solr-core/test/J0/./org.apache.solr.cloud.SyncSliceTest-jetty2-1362590706981/solr.xml
[junit4:junit4]   2> 8886 T1671 oasc.CoreContainer.<init> New CoreContainer 1003338451
[junit4:junit4]   2> 8886 T1671 oasc.CoreContainer.load Loading CoreContainer using Solr Home: '/usr/home/hudson/hudson-slave/workspace/Lucene-Solr-Tests-4.x-Java6/solr/build/solr-core/test/J0/./org.apache.solr.cloud.SyncSliceTest-jetty2-1362590706981/'
[junit4:junit4]   2> 8887 T1671 oasc.SolrResourceLoader.<init> new SolrResourceLoader for directory: '/usr/home/hudson/hudson-slave/workspace/Lucene-Solr-Tests-4.x-Java6/solr/build/solr-core/test/J0/./org.apache.solr.cloud.SyncSliceTest-jetty2-1362590706981/'
[junit4:junit4]   2> 8934 T1671 oashc.HttpShardHandlerFactory.getParameter Setting socketTimeout to: 120000
[junit4:junit4]   2> 8935 T1671 oashc.HttpShardHandlerFactory.getParameter Setting urlScheme to: http://
[junit4:junit4]   2> 8935 T1671 oashc.HttpShardHandlerFactory.getParameter Setting connTimeout to: 15000
[junit4:junit4]   2> 8936 T1671 oashc.HttpShardHandlerFactory.getParameter Setting maxConnectionsPerHost to: 20
[junit4:junit4]   2> 8936 T1671 oashc.HttpShardHandlerFactory.getParameter Setting corePoolSize to: 0
[junit4:junit4]   2> 8936 T1671 oashc.HttpShardHandlerFactory.getParameter Setting maximumPoolSize to: 2147483647
[junit4:junit4]   2> 8937 T1671 oashc.HttpShardHandlerFactory.getParameter Setting maxThreadIdleTime to: 5
[junit4:junit4]   2> 8937 T1671 oashc.HttpShardHandlerFactory.getParameter Setting sizeOfQueue to: -1
[junit4:junit4]   2> 8938 T1671 oashc.HttpShardHandlerFactory.getParameter Setting fairnessPolicy to: false
[junit4:junit4]   2> 8938 T1671 oascsi.HttpClientUtil.createClient Creating new http client, config:maxConnectionsPerHost=20&maxConnections=10000&socketTimeout=120000&connTimeout=15000&retry=false
[junit4:junit4]   2> 8958 T1671 oasc.CoreContainer.load Registering Log Listener
[junit4:junit4]   2> 8977 T1671 oasc.CoreContainer.initZooKeeper Zookeeper client=127.0.0.1:33863/solr
[junit4:junit4]   2> 8977 T1671 oasc.ZkController.checkChrootPath zkHost includes chroot
[junit4:junit4]   2> 8978 T1671 oaz.ZooKeeper.<init> Initiating client connection, connectString=127.0.0.1:33863 sessionTimeout=60000 watcher=org.apache.solr.common.cloud.ConnectionManager@4d407d7b
[junit4:junit4]   2> 8979 T1671 oascc.ConnectionManager.waitForConnected Waiting for client to connect to ZooKeeper
[junit4:junit4]   2> 8979 T1724 oaz.ClientCnxn$SendThread.logStartConnect Opening socket connection to server localhost/127.0.0.1:33863. Will not attempt to authenticate using SASL (access denied (javax.security.auth.AuthPermission getLoginConfiguration))
[junit4:junit4]   2> 8980 T1724 oaz.ClientCnxn$SendThread.primeConnection Socket connection established to localhost/127.0.0.1:33863, initiating session
[junit4:junit4]   2> 8980 T1673 oazs.NIOServerCnxnFactory.run Accepted socket connection from /140.211.11.196:58683
[junit4:junit4]   2> 8980 T1673 oazs.ZooKeeperServer.processConnectRequest Client attempting to establish new session at /140.211.11.196:58683
[junit4:junit4]   2> 8982 T1675 oazs.ZooKeeperServer.finishSessionInit Established session 0x13d40bc0b3c0007 with negotiated timeout 20000 for client /140.211.11.196:58683
[junit4:junit4]   2> 8982 T1724 oaz.ClientCnxn$SendThread.onConnected Session establishment complete on server localhost/127.0.0.1:33863, sessionid = 0x13d40bc0b3c0007, negotiated timeout = 20000
[junit4:junit4]   2> 8982 T1725 oascc.ConnectionManager.process Watcher org.apache.solr.common.cloud.ConnectionManager@4d407d7b name:ZooKeeperConnection Watcher:127.0.0.1:33863 got event WatchedEvent state:SyncConnected type:None path:null path:null type:None
[junit4:junit4]   2> 8983 T1671 oascc.ConnectionManager.waitForConnected Client is connected to ZooKeeper
[junit4:junit4]   2> 8984 T1676 oazs.PrepRequestProcessor.pRequest2Txn Processed session termination for sessionid: 0x13d40bc0b3c0007
[junit4:junit4]   2> 8991 T1725 oaz.ClientCnxn$EventThread.run EventThread shut down
[junit4:junit4]   2> 8991 T1673 oazs.NIOServerCnxn.closeSock Closed socket connection for client /140.211.11.196:58683 which had sessionid 0x13d40bc0b3c0007
[junit4:junit4]   2> 8991 T1671 oaz.ZooKeeper.close Session: 0x13d40bc0b3c0007 closed
[junit4:junit4]   2> 8992 T1671 oascsi.HttpClientUtil.createClient Creating new http client, config:maxConnections=500&maxConnectionsPerHost=16&socketTimeout=120000&connTimeout=15000
[junit4:junit4]   2> 9003 T1671 oaz.ZooKeeper.<init> Initiating client connection, connectString=127.0.0.1:33863/solr sessionTimeout=30000 watcher=org.apache.solr.common.cloud.ConnectionManager@6986b96d
[junit4:junit4]   2> 9004 T1671 oascc.ConnectionManager.waitForConnected Waiting for client to connect to ZooKeeper
[junit4:junit4]   2> 9004 T1726 oaz.ClientCnxn$SendThread.logStartConnect Opening socket connection to server localhost/127.0.0.1:33863. Will not attempt to authenticate using SASL (access denied (javax.security.auth.AuthPermission getLoginConfiguration))
[junit4:junit4]   2> 9005 T1726 oaz.ClientCnxn$SendThread.primeConnection Socket connection established to localhost/127.0.0.1:33863, initiating session
[junit4:junit4]   2> 9005 T1673 oazs.NIOServerCnxnFactory.run Accepted socket connection from /140.211.11.196:23178
[junit4:junit4]   2> 9005 T1673 oazs.ZooKeeperServer.processConnectRequest Client attempting to establish new session at /140.211.11.196:23178
[junit4:junit4]   2> 9006 T1675 oazs.ZooKeeperServer.finishSessionInit Established session 0x13d40bc0b3c0008 with negotiated timeout 20000 for client /140.211.11.196:23178
[junit4:junit4]   2> 9006 T1726 oaz.ClientCnxn$SendThread.onConnected Session establishment complete on server localhost/127.0.0.1:33863, sessionid = 0x13d40bc0b3c0008, negotiated timeout = 20000
[junit4:junit4]   2> 9007 T1727 oascc.ConnectionManager.process Watcher org.apache.solr.common.cloud.ConnectionManager@6986b96d name:ZooKeeperConnection Watcher:127.0.0.1:33863/solr got event WatchedEvent state:SyncConnected type:None path:null path:null type:None
[junit4:junit4]   2> 9007 T1671 oascc.ConnectionManager.waitForConnected Client is connected to ZooKeeper
[junit4:junit4]   2> 9008 T1676 oazs.PrepRequestProcessor.pRequest Got user-level KeeperException when processing sessionid:0x13d40bc0b3c0008 type:create cxid:0x1 zxid:0x6d txntype:-1 reqpath:n/a Error Path:/solr/overseer Error:KeeperErrorCode = NodeExists for /solr/overseer
[junit4:junit4]   2> 9009 T1676 oazs.PrepRequestProcessor.pRequest Got user-level KeeperException when processing sessionid:0x13d40bc0b3c0008 type:create cxid:0x2 zxid:0x6e txntype:-1 reqpath:n/a Error Path:/solr/overseer Error:KeeperErrorCode = NodeExists for /solr/overseer
[junit4:junit4]   2> 9017 T1671 oascc.ZkStateReader.createClusterStateWatchersAndUpdate Updating cluster state from ZooKeeper... 
[junit4:junit4]   2> 10020 T1671 oasc.ZkController.createEphemeralLiveNode Register node as live in ZooKeeper:/live_nodes/127.0.0.1:58450_
[junit4:junit4]   2> 10021 T1676 oazs.PrepRequestProcessor.pRequest Got user-level KeeperException when processing sessionid:0x13d40bc0b3c0008 type:delete cxid:0x9 zxid:0x6f txntype:-1 reqpath:n/a Error Path:/solr/live_nodes/127.0.0.1:58450_ Error:KeeperErrorCode = NoNode for /solr/live_nodes/127.0.0.1:58450_
[junit4:junit4]   2> 10022 T1671 oascc.SolrZkClient.makePath makePath: /live_nodes/127.0.0.1:58450_
[junit4:junit4]   2> 10025 T1712 oascc.ZkStateReader$2.process A cluster state change: WatchedEvent state:SyncConnected type:NodeChildrenChanged path:/live_nodes, has occurred - updating... (live nodes size: 2)
[junit4:junit4]   2> 10025 T1699 oascc.ZkStateReader$2.process A cluster state change: WatchedEvent state:SyncConnected type:NodeChildrenChanged path:/live_nodes, has occurred - updating... (live nodes size: 2)
[junit4:junit4]   2> 10026 T1693 oascc.ZkStateReader$3.process Updating live nodes... (3)
[junit4:junit4]   2> 10026 T1727 oascc.ZkStateReader$3.process Updating live nodes... (3)
[junit4:junit4]   2> 10026 T1693 oascc.ZkStateReader$2.process A cluster state change: WatchedEvent state:SyncConnected type:NodeChildrenChanged path:/live_nodes, has occurred - updating... (live nodes size: 3)
[junit4:junit4]   2> 10027 T1699 oascc.ZkStateReader$3.process Updating live nodes... (3)
[junit4:junit4]   2> 10027 T1712 oascc.ZkStateReader$3.process Updating live nodes... (3)
[junit4:junit4]   2> 10042 T1728 oasc.CoreContainer.create Creating SolrCore 'collection1' using instanceDir: /usr/home/hudson/hudson-slave/workspace/Lucene-Solr-Tests-4.x-Java6/solr/build/solr-core/test/J0/./org.apache.solr.cloud.SyncSliceTest-jetty2-1362590706981/collection1
[junit4:junit4]   2> 10042 T1728 oasc.ZkController.createCollectionZkNode Check for collection zkNode:collection1
[junit4:junit4]   2> 10043 T1728 oasc.ZkController.createCollectionZkNode Collection zkNode exists
[junit4:junit4]   2> 10043 T1728 oasc.ZkController.readConfigName Load collection config from:/collections/collection1
[junit4:junit4]   2> 10044 T1728 oasc.SolrResourceLoader.<init> new SolrResourceLoader for directory: '/usr/home/hudson/hudson-slave/workspace/Lucene-Solr-Tests-4.x-Java6/solr/build/solr-core/test/J0/./org.apache.solr.cloud.SyncSliceTest-jetty2-1362590706981/collection1/'
[junit4:junit4]   2> 10045 T1728 oasc.SolrResourceLoader.replaceClassLoader Adding 'file:/usr/home/hudson/hudson-slave/workspace/Lucene-Solr-Tests-4.x-Java6/solr/build/solr-core/test/J0/org.apache.solr.cloud.SyncSliceTest-jetty2-1362590706981/collection1/lib/classes/' to classloader
[junit4:junit4]   2> 10046 T1728 oasc.SolrResourceLoader.replaceClassLoader Adding 'file:/usr/home/hudson/hudson-slave/workspace/Lucene-Solr-Tests-4.x-Java6/solr/build/solr-core/test/J0/org.apache.solr.cloud.SyncSliceTest-jetty2-1362590706981/collection1/lib/README' to classloader
[junit4:junit4]   2> 10100 T1728 oasc.SolrConfig.<init> Using Lucene MatchVersion: LUCENE_42
[junit4:junit4]   2> 10134 T1694 oascc.ZkStateReader.updateClusterState Updating cloud state from ZooKeeper... 
[junit4:junit4]   2> 10135 T1694 oasc.Overseer$ClusterStateUpdater.updateState Update state numShards=1 message={
[junit4:junit4]   2> 	  "operation":"state",
[junit4:junit4]   2> 	  "core_node_name":null,
[junit4:junit4]   2> 	  "numShards":"1",
[junit4:junit4]   2> 	  "shard":"shard1",
[junit4:junit4]   2> 	  "roles":null,
[junit4:junit4]   2> 	  "state":"active",
[junit4:junit4]   2> 	  "core":"collection1",
[junit4:junit4]   2> 	  "collection":"collection1",
[junit4:junit4]   2> 	  "node_name":"127.0.0.1:58324_",
[junit4:junit4]   2> 	  "base_url":"http://127.0.0.1:58324"}
[junit4:junit4]   2> 10148 T1693 oascc.ZkStateReader$2.process A cluster state change: WatchedEvent state:SyncConnected type:NodeDataChanged path:/clusterstate.json, has occurred - updating... (live nodes size: 3)
[junit4:junit4]   2> 10148 T1699 oascc.ZkStateReader$2.process A cluster state change: WatchedEvent state:SyncConnected type:NodeDataChanged path:/clusterstate.json, has occurred - updating... (live nodes size: 3)
[junit4:junit4]   2> 10148 T1712 oascc.ZkStateReader$2.process A cluster state change: WatchedEvent state:SyncConnected type:NodeDataChanged path:/clusterstate.json, has occurred - updating... (live nodes size: 3)
[junit4:junit4]   2> 10148 T1727 oascc.ZkStateReader$2.process A cluster state change: WatchedEvent state:SyncConnected type:NodeDataChanged path:/clusterstate.json, has occurred - updating... (live nodes size: 3)
[junit4:junit4]   2> 10156 T1728 oasc.SolrConfig.<init> Loaded SolrConfig: solrconfig.xml
[junit4:junit4]   2> 10257 T1728 oass.IndexSchema.readSchema Reading Solr Schema
[junit4:junit4]   2> 10263 T1728 oass.IndexSchema.readSchema Schema name=test
[junit4:junit4]   2> 10867 T1728 oass.OpenExchangeRatesOrgProvider.init Initialized with rates=open-exchange-rates.json, refreshInterval=1440.
[junit4:junit4]   2> 10878 T1728 oass.IndexSchema.readSchema default search field in schema is text
[junit4:junit4]   2> 10882 T1728 oass.IndexSchema.readSchema unique key field: id
[junit4:junit4]   2> 10895 T1728 oass.FileExchangeRateProvider.reload Reloading exchange rates from file currency.xml
[junit4:junit4]   2> 10900 T1728 oass.FileExchangeRateProvider.reload Reloading exchange rates from file currency.xml
[junit4:junit4]   2> 10904 T1728 oass.OpenExchangeRatesOrgProvider.reload Reloading exchange rates from open-exchange-rates.json
[junit4:junit4]   2> 10905 T1728 oass.OpenExchangeRatesOrgProvider$OpenExchangeRates.<init> WARNING Unknown key IMPORTANT NOTE
[junit4:junit4]   2> 10906 T1728 oass.OpenExchangeRatesOrgProvider$OpenExchangeRates.<init> WARNING Expected key, got STRING
[junit4:junit4]   2> 10906 T1728 oass.OpenExchangeRatesOrgProvider.reload Reloading exchange rates from open-exchange-rates.json
[junit4:junit4]   2> 10907 T1728 oass.OpenExchangeRatesOrgProvider$OpenExchangeRates.<init> WARNING Unknown key IMPORTANT NOTE
[junit4:junit4]   2> 10907 T1728 oass.OpenExchangeRatesOrgProvider$OpenExchangeRates.<init> WARNING Expected key, got STRING
[junit4:junit4]   2> 10907 T1728 oasc.SolrCore.<init> [collection1] Opening new SolrCore at /usr/home/hudson/hudson-slave/workspace/Lucene-Solr-Tests-4.x-Java6/solr/build/solr-core/test/J0/./org.apache.solr.cloud.SyncSliceTest-jetty2-1362590706981/collection1/, dataDir=./org.apache.solr.cloud.SyncSliceTest-1362590698293/jetty2/
[junit4:junit4]   2> 10908 T1728 oasc.JmxMonitoredMap.<init> JMX monitoring is enabled. Adding Solr mbeans to JMX Server: com.sun.jmx.mbeanserver.JmxMBeanServer@35f38fc6
[junit4:junit4]   2> 10908 T1728 oasc.SolrCore.initDirectoryFactory org.apache.solr.core.MockDirectoryFactory
[junit4:junit4]   2> 10909 T1728 oasc.CachingDirectoryFactory.get return new directory for /usr/home/hudson/hudson-slave/workspace/Lucene-Solr-Tests-4.x-Java6/solr/build/solr-core/test/J0/./org.apache.solr.cloud.SyncSliceTest-1362590698293/jetty2 forceNew:false
[junit4:junit4]   2> 10909 T1728 oasc.CachingDirectoryFactory.close Releasing directory:/usr/home/hudson/hudson-slave/workspace/Lucene-Solr-Tests-4.x-Java6/solr/build/solr-core/test/J0/./org.apache.solr.cloud.SyncSliceTest-1362590698293/jetty2
[junit4:junit4]   2> 10909 T1728 oasc.SolrCore.getNewIndexDir New index directory detected: old=null new=./org.apache.solr.cloud.SyncSliceTest-1362590698293/jetty2/index/
[junit4:junit4]   2> 10910 T1728 oasc.SolrCore.initIndex WARNING [collection1] Solr index directory './org.apache.solr.cloud.SyncSliceTest-1362590698293/jetty2/index' doesn't exist. Creating new index...
[junit4:junit4]   2> 10910 T1728 oasc.CachingDirectoryFactory.get return new directory for /usr/home/hudson/hudson-slave/workspace/Lucene-Solr-Tests-4.x-Java6/solr/build/solr-core/test/J0/./org.apache.solr.cloud.SyncSliceTest-1362590698293/jetty2/index forceNew:false
[junit4:junit4]   2> 10913 T1728 oasc.SolrDeletionPolicy.onCommit SolrDeletionPolicy.onCommit: commits:num=1
[junit4:junit4]   2> 		commit{dir=MockDirWrapper(org.apache.lucene.store.RAMDirectory@61ac14b7 lockFactory=org.apache.lucene.store.NativeFSLockFactory@3d83f18a),segFN=segments_1,generation=1,filenames=[segments_1]
[junit4:junit4]   2> 10913 T1728 oasc.SolrDeletionPolicy.updateCommits newest commit = 1[segments_1]
[junit4:junit4]   2> 10914 T1728 oasc.CachingDirectoryFactory.close Releasing directory:/usr/home/hudson/hudson-slave/workspace/Lucene-Solr-Tests-4.x-Java6/solr/build/solr-core/test/J0/./org.apache.solr.cloud.SyncSliceTest-1362590698293/jetty2/index
[junit4:junit4]   2> 10916 T1728 oasup.UpdateRequestProcessorChain.init inserting DistributedUpdateProcessorFactory into updateRequestProcessorChain "dedupe"
[junit4:junit4]   2> 10916 T1728 oasup.UpdateRequestProcessorChain.init inserting DistributedUpdateProcessorFactory into updateRequestProcessorChain "stored_sig"
[junit4:junit4]   2> 10917 T1728 oasup.UpdateRequestProcessorChain.init inserting DistributedUpdateProcessorFactory into updateRequestProcessorChain "distrib-dup-test-chain-implicit"
[junit4:junit4]   2> 10917 T1728 oasc.RequestHandlers.initHandlersFromConfig created standard: solr.StandardRequestHandler
[junit4:junit4]   2> 10918 T1728 oasc.RequestHandlers.initHandlersFromConfig created /get: solr.RealTimeGetHandler
[junit4:junit4]   2> 10918 T1728 oasc.RequestHandlers.initHandlersFromConfig adding lazy requestHandler: solr.ReplicationHandler
[junit4:junit4]   2> 10918 T1728 oasc.RequestHandlers.initHandlersFromConfig created /replication: solr.ReplicationHandler
[junit4:junit4]   2> 10919 T1728 oasc.RequestHandlers.initHandlersFromConfig created /update: solr.UpdateRequestHandler
[junit4:junit4]   2> 10919 T1728 oasc.RequestHandlers.initHandlersFromConfig created /admin/: org.apache.solr.handler.admin.AdminHandlers
[junit4:junit4]   2> 10926 T1728 oashl.XMLLoader.init xsltCacheLifetimeSeconds=60
[junit4:junit4]   2> 10932 T1728 oasc.CachingDirectoryFactory.close Releasing directory:/usr/home/hudson/hudson-slave/workspace/Lucene-Solr-Tests-4.x-Java6/solr/build/solr-core/test/J0/./org.apache.solr.cloud.SyncSliceTest-1362590698293/jetty2
[junit4:junit4]   2> 10932 T1728 oass.SolrIndexSearcher.<init> Opening Searcher@617814a8 main
[junit4:junit4]   2> 10932 T1728 oasu.UpdateHandler.clearLog Clearing tlog files, tlogDir=./org.apache.solr.cloud.SyncSliceTest-1362590698293/jetty2/tlog
[junit4:junit4]   2> 10933 T1728 oasu.CommitTracker.<init> Hard AutoCommit: disabled
[junit4:junit4]   2> 10933 T1728 oasu.CommitTracker.<init> Soft AutoCommit: disabled
[junit4:junit4]   2> 10938 T1729 oasc.SolrCore.registerSearcher [collection1] Registered new searcher Searcher@617814a8 main{StandardDirectoryReader(segments_1:1)}
[junit4:junit4]   2> 10939 T1728 oasc.ZkController.publish publishing core=collection1 state=down
[junit4:junit4]   2> 10940 T1728 oasc.ZkController.publish numShards not found on descriptor - reading it from system property
[junit4:junit4]   2> 11652 T1694 oascc.ZkStateReader.updateClusterState Updating cloud state from ZooKeeper... 
[junit4:junit4]   2> 11653 T1694 oasc.Overseer$ClusterStateUpdater.updateState Update state numShards=1 message={
[junit4:junit4]   2> 	  "operation":"state",
[junit4:junit4]   2> 	  "core_node_name":null,
[junit4:junit4]   2> 	  "numShards":"1",
[junit4:junit4]   2> 	  "shard":null,
[junit4:junit4]   2> 	  "roles":null,
[junit4:junit4]   2> 	  "state":"down",
[junit4:junit4]   2> 	  "core":"collection1",
[junit4:junit4]   2> 	  "collection":"collection1",
[junit4:junit4]   2> 	  "node_name":"127.0.0.1:58450_",
[junit4:junit4]   2> 	  "base_url":"http://127.0.0.1:58450"}
[junit4:junit4]   2> 11653 T1694 oasc.Overseer$ClusterStateUpdater.updateState Collection already exists with numShards=1
[junit4:junit4]   2> 11653 T1694 oasc.Overseer$ClusterStateUpdater.updateState Assigning new node to shard shard=shard1
[junit4:junit4]   2> 11697 T1693 oascc.ZkStateReader$2.process A cluster state change: WatchedEvent state:SyncConnected type:NodeDataChanged path:/clusterstate.json, has occurred - updating... (live nodes size: 3)
[junit4:junit4]   2> 11697 T1712 oascc.ZkStateReader$2.process A cluster state change: WatchedEvent state:SyncConnected type:NodeDataChanged path:/clusterstate.json, has occurred - updating... (live nodes size: 3)
[junit4:junit4]   2> 11697 T1727 oascc.ZkStateReader$2.process A cluster state change: WatchedEvent state:SyncConnected type:NodeDataChanged path:/clusterstate.json, has occurred - updating... (live nodes size: 3)
[junit4:junit4]   2> 11697 T1699 oascc.ZkStateReader$2.process A cluster state change: WatchedEvent state:SyncConnected type:NodeDataChanged path:/clusterstate.json, has occurred - updating... (live nodes size: 3)
[junit4:junit4]   2> 11942 T1728 oasc.CoreContainer.registerCore registering core: collection1
[junit4:junit4]   2> 11942 T1728 oasc.ZkController.register Register replica - core:collection1 address:http://127.0.0.1:58450 collection:collection1 shard:shard1
[junit4:junit4]   2> 11945 T1728 oasc.ZkController.register We are http://127.0.0.1:58450/collection1/ and leader is http://127.0.0.1:58324/collection1/
[junit4:junit4]   2> 11945 T1728 oasc.ZkController.register No LogReplay needed for core=collection1 baseURL=http://127.0.0.1:58450
[junit4:junit4]   2> 11945 T1728 oasc.ZkController.checkRecovery Core needs to recover:collection1
[junit4:junit4]   2> 11945 T1728 oasu.DefaultSolrCoreState.doRecovery Running recovery - first canceling any ongoing recovery
[junit4:junit4]   2> ASYNC  NEW_CORE C117 name=collection1 org.apache.solr.core.SolrCore@4a3a0004 url=http://127.0.0.1:58450/collection1 node=127.0.0.1:58450_ C117_STATE=coll:collection1 core:collection1 props:{state=down, core=collection1, collection=collection1, node_name=127.0.0.1:58450_, base_url=http://127.0.0.1:58450}
[junit4:junit4]   2> 11947 T1730 C117 P58450 oasc.RecoveryStrategy.run Starting recovery process.  core=collection1 recoveringAfterStartup=true
[junit4:junit4]   2> 11947 T1730 C117 P58450 oasc.RecoveryStrategy.doRecovery ###### startupVersions=[]
[junit4:junit4]   2> 11947 T1728 oascc.ZkStateReader.updateClusterState Updating cloud state from ZooKeeper... 
[junit4:junit4]   2> 11947 T1730 C117 P58450 oasc.ZkController.publish publishing core=collection1 state=recovering
[junit4:junit4]   2> 11947 T1730 C117 P58450 oasc.ZkController.publish numShards not found on descriptor - reading it from system property
[junit4:junit4]   2> 11948 T1671 oass.SolrDispatchFilter.init user.dir=/usr/home/hudson/hudson-slave/workspace/Lucene-Solr-Tests-4.x-Java6/solr/build/solr-core/test/J0
[junit4:junit4]   2> 11948 T1671 oass.SolrDispatchFilter.init SolrDispatchFilter.init() done
[junit4:junit4]   2> 11949 T1730 C117 P58450 oascsi.HttpClientUtil.createClient Creating new http client, config:maxConnections=128&maxConnectionsPerHost=32&followRedirects=false
[junit4:junit4]   2> 11949 T1671 oascsi.HttpClientUtil.createClient Creating new http client, config:maxConnections=128&maxConnectionsPerHost=32&followRedirects=false
[junit4:junit4]   2> 12157 T1671 oejs.Server.doStart jetty-8.1.8.v20121106
[junit4:junit4]   2> 12161 T1671 oejs.AbstractConnector.doStart Started SocketConnector@127.0.0.1:56856
[junit4:junit4]   2> 12161 T1671 oass.SolrDispatchFilter.init SolrDispatchFilter.init()
[junit4:junit4]   2> 12162 T1671 oasc.SolrResourceLoader.locateSolrHome JNDI not configured for solr (NoInitialContextEx)
[junit4:junit4]   2> 12162 T1671 oasc.SolrResourceLoader.locateSolrHome using system property solr.solr.home: /usr/home/hudson/hudson-slave/workspace/Lucene-Solr-Tests-4.x-Java6/solr/build/solr-core/test/J0/./org.apache.solr.cloud.SyncSliceTest-jetty3-1362590710256
[junit4:junit4]   2> 12163 T1671 oasc.CoreContainer$Initializer.initialize looking for solr.xml: /usr/home/hudson/hudson-slave/workspace/Lucene-Solr-Tests-4.x-Java6/solr/build/solr-core/test/J0/./org.apache.solr.cloud.SyncSliceTest-jetty3-1362590710256/solr.xml
[junit4:junit4]   2> 12163 T1671 oasc.CoreContainer.<init> New CoreContainer 936962174
[junit4:junit4]   2> 12164 T1671 oasc.CoreContainer.load Loading CoreContainer using Solr Home: '/usr/home/hudson/hudson-slave/workspace/Lucene-Solr-Tests-4.x-Java6/solr/build/solr-core/test/J0/./org.apache.solr.cloud.SyncSliceTest-jetty3-1362590710256/'
[junit4:junit4]   2> 12164 T1671 oasc.SolrResourceLoader.<init> new SolrResourceLoader for directory: '/usr/home/hudson/hudson-slave/workspace/Lucene-Solr-Tests-4.x-Java6/solr/build/solr-core/test/J0/./org.apache.solr.cloud.SyncSliceTest-jetty3-1362590710256/'
[junit4:junit4]   2> 12212 T1671 oashc.HttpShardHandlerFactory.getParameter Setting socketTimeout to: 120000
[junit4:junit4]   2> 12212 T1671 oashc.HttpShardHandlerFactory.getParameter Setting urlScheme to: http://
[junit4:junit4]   2> 12213 T1671 oashc.HttpShardHandlerFactory.getParameter Setting connTimeout to: 15000
[junit4:junit4]   2> 12213 T1671 oashc.HttpShardHandlerFactory.getParameter Setting maxConnectionsPerHost to: 20
[junit4:junit4]   2> 12213 T1671 oashc.HttpShardHandlerFactory.getParameter Setting corePoolSize to: 0
[junit4:junit4]   2> 12214 T1671 oashc.HttpShardHandlerFactory.getParameter Setting maximumPoolSize to: 2147483647
[junit4:junit4]   2> 12214 T1671 oashc.HttpShardHandlerFactory.getParameter Setting maxThreadIdleTime to: 5
[junit4:junit4]   2> 12215 T1671 oashc.HttpShardHandlerFactory.getParameter Setting sizeOfQueue to: -1
[junit4:junit4]   2> 12215 T1671 oashc.HttpShardHandlerFactory.getParameter Setting fairnessPolicy to: false
[junit4:junit4]   2> 12216 T1671 oascsi.HttpClientUtil.createClient Creating new http client, config:maxConnectionsPerHost=20&maxConnections=10000&socketTimeout=120000&connTimeout=15000&retry=false
[junit4:junit4]   2> 12234 T1671 oasc.CoreContainer.load Registering Log Listener
[junit4:junit4]   2> 12252 T1671 oasc.CoreContainer.initZooKeeper Zookeeper client=127.0.0.1:33863/solr
[junit4:junit4]   2> 12253 T1671 oasc.ZkController.checkChrootPath zkHost includes chroot
[junit4:junit4]   2> 12253 T1671 oaz.ZooKeeper.<init> Initiating client connection, connectString=127.0.0.1:33863 sessionTimeout=60000 watcher=org.apache.solr.common.cloud.ConnectionManager@788c0009
[junit4:junit4]   2> 12254 T1671 oascc.ConnectionManager.waitForConnected Waiting for client to connect to ZooKeeper
[junit4:junit4]   2> 12254 T1740 oaz.ClientCnxn$SendThread.logStartConnect Opening socket connection to server localhost/127.0.0.1:33863. Will not attempt to authenticate using SASL (access denied (javax.security.auth.AuthPermission getLoginConfiguration))
[junit4:junit4]   2> 12255 T1740 oaz.ClientCnxn$SendThread.primeConnection Socket connection established to localhost/127.0.0.1:33863, initiating session
[junit4:junit4]   2> 12255 T1673 oazs.NIOServerCnxnFactory.run Accepted socket connection from /140.211.11.196:31102
[junit4:junit4]   2> 12256 T1673 oazs.ZooKeeperServer.processConnectRequest Client attempting to establish new session at /140.211.11.196:31102
[junit4:junit4]   2> 12258 T1675 oazs.ZooKeeperServer.finishSessionInit Established session 0x13d40bc0b3c0009 with negotiated timeout 20000 for client /140.211.11.196:31102
[junit4:junit4]   2> 12258 T1740 oaz.ClientCnxn$SendThread.onConnected Session establishment complete on server localhost/127.0.0.1:33863, sessionid = 0x13d40bc0b3c0009, negotiated timeout = 20000
[junit4:junit4]   2> 12258 T1741 oascc.ConnectionManager.process Watcher org.apache.solr.common.cloud.ConnectionManager@788c0009 name:ZooKeeperConnection Watcher:127.0.0.1:33863 got event WatchedEvent state:SyncConnected type:None path:null path:null type:None
[junit4:junit4]   2> 12258 T1671 oascc.ConnectionManager.waitForConnected Client is connected to ZooKeeper
[junit4:junit4]   2> 12259 T1676 oazs.PrepRequestProcessor.pRequest2Txn Processed session termination for sessionid: 0x13d40bc0b3c0009
[junit4:junit4]   2> 12272 T1741 oaz.ClientCnxn$EventThread.run EventThread shut down
[junit4:junit4]   2> 12272 T1673 oazs.NIOServerCnxn.closeSock Closed socket connection for client /140.211.11.196:31102 which had sessionid 0x13d40bc0b3c0009
[junit4:junit4]   2> 12272 T1671 oaz.ZooKeeper.close Session: 0x13d40bc0b3c0009 closed
[junit4:junit4]   2> 12273 T1671 oascsi.HttpClientUtil.createClient Creating new http client, config:maxConnections=500&maxConnectionsPerHost=16&socketTimeout=120000&connTimeout=15000
[junit4:junit4]   2> 12282 T1671 oaz.ZooKeeper.<init> Initiating client connection, connectString=127.0.0.1:33863/solr sessionTimeout=30000 watcher=org.apache.solr.common.cloud.ConnectionManager@178cc62b
[junit4:junit4]   2> 12283 T1671 oascc.ConnectionManager.waitForConnected Waiting for client to connect to ZooKeeper
[junit4:junit4]   2> 12283 T1742 oaz.ClientCnxn$SendThread.logStartConnect Opening socket connection to server localhost/127.0.0.1:33863. Will not attempt to authenticate using SASL (access denied (javax.security.auth.AuthPermission getLoginConfiguration))
[junit4:junit4]   2> 12283 T1742 oaz.ClientCnxn$SendThread.primeConnection Socket connection established to localhost/127.0.0.1:33863, initiating session
[junit4:junit4]   2> 12284 T1673 oazs.NIOServerCnxnFactory.run Accepted socket connection from /140.211.11.196:30175
[junit4:junit4]   2> 12284 T1673 oazs.ZooKeeperServer.processConnectRequest Client attempting to establish new session at /140.211.11.196:30175
[junit4:junit4]   2> 12285 T1675 oazs.ZooKeeperServer.finishSessionInit Established session 0x13d40bc0b3c000a with negotiated timeout 20000 for client /140.211.11.196:30175
[junit4:junit4]   2> 12285 T1742 oaz.ClientCnxn$SendThread.onConnected Session establishment complete on server localhost/127.0.0.1:33863, sessionid = 0x13d40bc0b3c000a, negotiated timeout = 20000
[junit4:junit4]   2> 12285 T1743 oascc.ConnectionManager.process Watcher org.apache.solr.common.cloud.ConnectionManager@178cc62b name:ZooKeeperConnection Watcher:127.0.0.1:33863/solr got event WatchedEvent state:SyncConnected type:None path:null path:null type:None
[junit4:junit4]   2> 12286 T1671 oascc.ConnectionManager.waitForConnected Client is connected to ZooKeeper
[junit4:junit4]   2> 12286 T1676 oazs.PrepRequestProcessor.pRequest Got user-level KeeperException when processing sessionid:0x13d40bc0b3c000a type:create cxid:0x1 zxid:0x80 txntype:-1 reqpath:n/a Error Path:/solr/overseer Error:KeeperErrorCode = NodeExists for /solr/overseer
[junit4:junit4]   2> 12288 T1676 oazs.PrepRequestProcessor.pRequest Got user-level KeeperException when processing sessionid:0x13d40bc0b3c000a type:create cxid:0x2 zxid:0x81 txntype:-1 reqpath:n/a Error Path:/solr/overseer Error:KeeperErrorCode = NodeExists for /solr/overseer
[junit4:junit4]   2> 12296 T1671 oascc.ZkStateReader.createClusterStateWatchersAndUpdate Updating cluster state from ZooKeeper... 
[junit4:junit4]   2> 13201 T1694 oascc.ZkStateReader.updateClusterState Updating cloud state from ZooKeeper... 
[junit4:junit4]   2> 13202 T1694 oasc.Overseer$ClusterStateUpdater.updateState Update state numShards=1 message={
[junit4:junit4]   2> 	  "operation":"state",
[junit4:junit4]   2> 	  "core_node_name":null,
[junit4:junit4]   2> 	  "numShards":"1",
[junit4:junit4]   2> 	  "shard":"shard1",
[junit4:junit4]   2> 	  "roles":null,
[junit4:junit4]   2> 	  "state":"recovering",
[junit4:junit4]   2> 	  "core":"collection1",
[junit4:junit4]   2> 	  "collection":"collection1",
[junit4:junit4]   2> 	  "node_name":"127.0.0.1:58450_",
[junit4:junit4]   2> 	  "base_url":"http://127.0.0.1:58450"}
[junit4:junit4]   2> 13222 T1693 oascc.ZkStateReader$2.process A cluster state change: WatchedEvent state:SyncConnected type:NodeDataChanged path:/clusterstate.json, has occurred - updating... (live nodes size: 3)
[junit4:junit4]   2> 13222 T1727 oascc.ZkStateReader$2.process A cluster state change: WatchedEvent state:SyncConnected type:NodeDataChanged path:/clusterstate.json, has occurred - updating... (live nodes size: 3)
[junit4:junit4]   2> 13222 T1699 oascc.ZkStateReader$2.process A cluster state change: WatchedEvent state:SyncConnected type:NodeDataChanged path:/clusterstate.json, has occurred - updating... (live nodes size: 3)
[junit4:junit4]   2> 13222 T1712 oascc.ZkStateReader$2.process A cluster state change: WatchedEvent state:SyncConnected type:NodeDataChanged path:/clusterstate.json, has occurred - updating... (live nodes size: 3)
[junit4:junit4]   2> 13222 T1743 oascc.ZkStateReader$2.process A cluster state change: WatchedEvent state:SyncConnected type:NodeDataChanged path:/clusterstate.json, has occurred - updating... (live nodes size: 3)
[junit4:junit4]   2> 13298 T1671 oasc.ZkController.createEphemeralLiveNode Register node as live in ZooKeeper:/live_nodes/127.0.0.1:56856_
[junit4:junit4]   2> 13299 T1676 oazs.PrepRequestProcessor.pRequest Got user-level KeeperException when processing sessionid:0x13d40bc0b3c000a type:delete cxid:0xb zxid:0x86 txntype:-1 reqpath:n/a Error Path:/solr/live_nodes/127.0.0.1:56856_ Error:KeeperErrorCode = NoNode for /solr/live_nodes/127.0.0.1:56856_
[junit4:junit4]   2> 13300 T1671 oascc.SolrZkClient.makePath makePath: /live_nodes/127.0.0.1:56856_
[junit4:junit4]   2> 13302 T1727 oascc.ZkStateReader$2.process A cluster state change: WatchedEvent state:SyncConnected type:NodeChildrenChanged path:/live_nodes, has occurred - updating... (live nodes size: 3)
[junit4:junit4]   2> 13302 T1712 oascc.ZkStateReader$2.process A cluster state change: WatchedEvent state:SyncConnected type:NodeChildrenChanged path:/live_nodes, has occurred - updating... (live nodes size: 3)
[junit4:junit4]   2> 13302 T1699 oascc.ZkStateReader$2.process A cluster state change: WatchedEvent state:SyncConnected type:NodeChildrenChanged path:/live_nodes, has occurred - updating... (live nodes size: 3)
[junit4:junit4]   2> 13303 T1693 oascc.ZkStateReader$3.process Updating live nodes... (4)
[junit4:junit4]   2> 13303 T1743 oascc.ZkStateReader$3.process Updating live nodes... (4)
[junit4:junit4]   2> 13303 T1693 oascc.ZkStateReader$2.process A cluster state change: WatchedEvent state:SyncConnected type:NodeChildrenChanged path:/live_nodes, has occurred - updating... (live nodes size: 4)
[junit4:junit4]   2> 13303 T1743 oascc.ZkStateReader$2.process A cluster state change: WatchedEvent state:SyncConnected type:NodeChildrenChanged path:/live_nodes, has occurred - updating... (live nodes size: 4)
[junit4:junit4]   2> 13304 T1727 oascc.ZkStateReader$3.process Updating live nodes... (4)
[junit4:junit4]   2> 13304 T1712 oascc.ZkStateReader$3.process Updating live nodes... (4)
[junit4:junit4]   2> 13304 T1699 oascc.ZkStateReader$3.process Updating live nodes... (4)
[junit4:junit4]   2> 13311 T1744 oasc.CoreContainer.create Creating SolrCore 'collection1' using instanceDir: /usr/home/hudson/hudson-slave/workspace/Lucene-Solr-Tests-4.x-Java6/solr/build/solr-core/test/J0/./org.apache.solr.cloud.SyncSliceTest-jetty3-1362590710256/collection1
[junit4:junit4]   2> 13311 T1744 oasc.ZkController.createCollectionZkNode Check for collection zkNode:collection1
[junit4:junit4]   2> 13312 T1744 oasc.ZkController.createCollectionZkNode Collection zkNode exists
[junit4:junit4]   2> 13312 T1744 oasc.ZkController.readConfigName Load collection config from:/collections/collection1
[junit4:junit4]   2> 13313 T1744 oasc.SolrResourceLoader.<init> new SolrResourceLoader for directory: '/usr/home/hudson/hudson-slave/workspace/Lucene-Solr-Tests-4.x-Java6/solr/build/solr-core/test/J0/./org.apache.solr.cloud.SyncSliceTest-jetty3-1362590710256/collection1/'
[junit4:junit4]   2> 13314 T1744 oasc.SolrResourceLoader.replaceClassLoader Adding 'file:/usr/home/hudson/hudson-slave/workspace/Lucene-Solr-Tests-4.x-Java6/solr/build/solr-core/test/J0/org.apache.solr.cloud.SyncSliceTest-jetty3-1362590710256/collection1/lib/README' to classloader
[junit4:junit4]   2> 13315 T1744 oasc.SolrResourceLoader.replaceClassLoader Adding 'file:/usr/home/hudson/hudson-slave/workspace/Lucene-Solr-Tests-4.x-Java6/solr/build/solr-core/test/J0/org.apache.solr.cloud.SyncSliceTest-jetty3-1362590710256/collection1/lib/classes/' to classloader
[junit4:junit4]   2> 13362 T1744 oasc.SolrConfig.<init> Using Lucene MatchVersion: LUCENE_42
[junit4:junit4]   2> 13419 T1744 oasc.SolrConfig.<init> Loaded SolrConfig: solrconfig.xml
[junit4:junit4]   2> 13519 T1744 oass.IndexSchema.readSchema Reading Solr Schema
[junit4:junit4]   2> 13524 T1744 oass.IndexSchema.readSchema Schema name=test
[junit4:junit4]   2> 13973 T1702 oass.SolrDispatchFilter.handleAdminRequest /admin/cores {coreNodeName=127.0.0.1:58450__collection1&state=recovering&nodeName=127.0.0.1:58450_&action=PREPRECOVERY&checkLive=true&core=collection1&wt=javabin&onlyIfLeader=true&version=2} status=0 QTime=2002 
[junit4:junit4]   2> 14123 T1744 oass.OpenExchangeRatesOrgProvider.init Initialized with rates=open-exchange-rates.json, refreshInterval=1440.
[junit4:junit4]   2> 14135 T1744 oass.IndexSchema.readSchema default search field in schema is text
[junit4:junit4]   2> 14139 T1744 oass.IndexSchema.readSchema unique key field: id
[junit4:junit4]   2> 14151 T1744 oass.FileExchangeRateProvider.reload Reloading exchange rates from file currency.xml
[junit4:junit4]   2> 14155 T1744 oass.FileExchangeRateProvider.reload Reloading exchange rates from file currency.xml
[junit4:junit4]   2> 14158 T1744 oass.OpenExchangeRatesOrgProvider.reload Reloading exchange rates from open-exchange-rates.json
[junit4:junit4]   2> 14158 T1744 oass.OpenExchangeRatesOrgProvider$OpenExchangeRates.<init> WARNING Unknown key IMPORTANT NOTE
[junit4:junit4]   2> 14159 T1744 oass.OpenExchangeRatesOrgProvider$OpenExchangeRates.<init> WARNING Expected key, got STRING
[junit4:junit4]   2> 14159 T1744 oass.OpenExchangeRatesOrgProvider.reload Reloading exchange rates from open-exchange-rates.json
[junit4:junit4]   2> 14160 T1744 oass.OpenExchangeRatesOrgProvider$OpenExchangeRates.<init> WARNING Unknown key IMPORTANT NOTE
[junit4:junit4]   2> 14160 T1744 oass.OpenExchangeRatesOrgProvider$OpenExchangeRates.<init> WARNING Expected key, got STRING
[junit4:junit4]   2> 14160 T1744 oasc.SolrCore.<init> [collection1] Opening new SolrCore at /usr/home/hudson/hudson-slave/workspace/Lucene-Solr-Tests-4.x-Java6/solr/build/solr-core/test/J0/./org.apache.solr.cloud.SyncSliceTest-jetty3-1362590710256/collection1/, dataDir=./org.apache.solr.cloud.SyncSliceTest-1362590698293/jetty3/
[junit4:junit4]   2> 14161 T1744 oasc.JmxMonitoredMap.<init> JMX monitoring is enabled. Adding Solr mbeans to JMX Server: com.sun.jmx.mbeanserver.JmxMBeanServer@35f38fc6
[junit4:junit4]   2> 14161 T1744 oasc.SolrCore.initDirectoryFactory org.apache.solr.core.MockDirectoryFactory
[junit4:junit4]   2> 14161 T1744 oasc.CachingDirectoryFactory.get return new directory for /usr/home/hudson/hudson-slave/workspace/Lucene-Solr-Tests-4.x-Java6/solr/build/solr-core/test/J0/./org.apache.solr.cloud.SyncSliceTest-1362590698293/jetty3 forceNew:false
[junit4:junit4]   2> 14162 T1744 oasc.CachingDirectoryFactory.close Releasing directory:/usr/home/hudson/hudson-slave/workspace/Lucene-Solr-Tests-4.x-Java6/solr/build/solr-core/test/J0/./org.apache.solr.cloud.SyncSliceTest-1362590698293/jetty3
[junit4:junit4]   2> 14162 T1744 oasc.SolrCore.getNewIndexDir New index directory detected: old=null new=./org.apache.solr.cloud.SyncSliceTest-1362590698293/jetty3/index/
[junit4:junit4]   2> 14162 T1744 oasc.SolrCore.initIndex WARNING [collection1] Solr index directory './org.apache.solr.cloud.SyncSliceTest-1362590698293/jetty3/index' doesn't exist. Creating new index...
[junit4:junit4]   2> 14162 T1744 oasc.CachingDirectoryFactory.get return new directory for /usr/home/hudson/hudson-slave/workspace/Lucene-Solr-Tests-4.x-Java6/solr/build/solr-core/test/J0/./org.apache.solr.cloud.SyncSliceTest-1362590698293/jetty3/index forceNew:false
[junit4:junit4]   2> 14164 T1744 oasc.SolrDeletionPolicy.onCommit SolrDeletionPolicy.onCommit: commits:num=1
[junit4:junit4]   2> 		commit{dir=MockDirWrapper(org.apache.lucene.store.RAMDirectory@6c440b8 lockFactory=org.apache.lucene.store.NativeFSLockFactory@701e7888),segFN=segments_1,generation=1,filenames=[segments_1]
[junit4:junit4]   2> 14165 T1744 oasc.SolrDeletionPolicy.updateCommits newest commit = 1[segments_1]
[junit4:junit4]   2> 14165 T1744 oasc.CachingDirectoryFactory.close Releasing directory:/usr/home/hudson/hudson-slave/workspace/Lucene-Solr-Tests-4.x-Java6/solr/build/solr-core/test/J0/./org.apache.solr.cloud.SyncSliceTest-1362590698293/jetty3/index
[junit4:junit4]   2> 14166 T1744 oasup.UpdateRequestProcessorChain.init inserting DistributedUpdateProcessorFactory into updateRequestProcessorChain "dedupe"
[junit4:junit4]   2> 14167 T1744 oasup.UpdateRequestProcessorChain.init inserting DistributedUpdateProcessorFactory into updateRequestProcessorChain "stored_sig"
[junit4:junit4]   2> 14167 T1744 oasup.UpdateRequestProcessorChain.init inserting DistributedUpdateProcessorFactory into updateRequestProcessorChain "distrib-dup-test-chain-implicit"
[junit4:junit4]   2> 14168 T1744 oasc.RequestHandlers.initHandlersFromConfig created standard: solr.StandardRequestHandler
[junit4:junit4]   2> 14168 T1744 oasc.RequestHandlers.initHandlersFromConfig created /get: solr.RealTimeGetHandler
[junit4:junit4]   2> 14168 T1744 oasc.RequestHandlers.initHandlersFromConfig adding lazy requestHandler: solr.ReplicationHandler
[junit4:junit4]   2> 14168 T1744 oasc.RequestHandlers.initHandlersFromConfig created /replication: solr.ReplicationHandler
[junit4:junit4]   2> 14169 T1744 oasc.RequestHandlers.initHandlersFromConfig created /update: solr.UpdateRequestHandler
[junit4:junit4]   2> 14169 T1744 oasc.RequestHandlers.initHandlersFromConfig created /admin/: org.apache.solr.handler.admin.AdminHandlers
[junit4:junit4]   2> 14173 T1744 oashl.XMLLoader.init xsltCacheLifetimeSeconds=60
[junit4:junit4]   2> 14177 T1744 oasc.CachingDirectoryFactory.close Releasing directory:/usr/home/hudson/hudson-slave/workspace/Lucene-Solr-Tests-4.x-Java6/solr/build/solr-core/test/J0/./org.apache.solr.cloud.SyncSliceTest-1362590698293/jetty3
[junit4:junit4]   2> 14178 T1744 oass.SolrIndexSearcher.<init> Opening Searcher@1155623c main
[junit4:junit4]   2> 14178 T1744 oasu.UpdateHandler.clearLog Clearing tlog files, tlogDir=./org.apache.solr.cloud.SyncSliceTest-1362590698293/jetty3/tlog
[junit4:junit4]   2> 14178 T1744 oasu.CommitTracker.<init> Hard AutoCommit: disabled
[junit4:junit4]   2> 14179 T1744 oasu.CommitTracker.<init> Soft AutoCommit: disabled
[junit4:junit4]   2> 14182 T1745 oasc.SolrCore.registerSearcher [collection1] Registered new searcher Searcher@1155623c main{StandardDirectoryReader(segments_1:1)}
[junit4:junit4]   2> 14183 T1744 oasc.ZkController.publish publishing core=collection1 state=down
[junit4:junit4]   2> 14183 T1744 oasc.ZkController.publish numShards not found on descriptor - reading it from system property
[junit4:junit4]   2> 14727 T1694 oascc.ZkStateReader.updateClusterState Updating cloud state from ZooKeeper... 
[junit4:junit4]   2> 14728 T1694 oasc.Overseer$ClusterStateUpdater.updateState Update state numShards=1 message={
[junit4:junit4]   2> 	  "operation":"state",
[junit4:junit4]   2> 	  "core_node_name":null,
[junit4:junit4]   2> 	  "numShards":"1",
[junit4:junit4]   2> 	  "shard":null,
[junit4:junit4]   2> 	  "roles":null,
[junit4:junit4]   2> 	  "state":"down",
[junit4:junit4]   2> 	  "core":"collection1",
[junit4:junit4]   2> 	  "collection":"collection1",
[junit4:junit4]   2> 	  "node_name":"127.0.0.1:56856_",
[junit4:junit4]   2> 	  "base_url":"http://127.0.0.1:56856"}
[junit4:junit4]   2> 14728 T1694 oasc.Overseer$ClusterStateUpdater.updateState Collection already exists with numShards=1
[junit4:junit4]   2> 14728 T1694 oasc.Overseer$ClusterStateUpdater.updateState Assigning new node to shard shard=shard1
[junit4:junit4]   2> 14741 T1693 oascc.ZkStateReader$2.process A cluster state change: WatchedEvent state:SyncConnected type:NodeDataChanged path:/clusterstate.json, has occurred - updating... (live nodes size: 4)
[junit4:junit4]   2> 14741 T1743 oascc.ZkStateReader$2.process A cluster state change: WatchedEvent state:SyncConnected type:NodeDataChanged path:/clusterstate.json, has occurred - updating... (live nodes size: 4)
[junit4:junit4]   2> 14741 T1699 oascc.ZkStateReader$2.process A cluster state change: WatchedEvent state:SyncConnected type:NodeDataChanged path:/clusterstate.json, has occurred - updating... (live nodes size: 4)
[junit4:junit4]   2> 14741 T1712 oascc.ZkStateReader$2.process A cluster state change: WatchedEvent state:SyncConnected type:NodeDataChanged path:/clusterstate.json, has occurred - updating... (live nodes size: 4)
[junit4:junit4]   2> 14741 T1727 oascc.ZkStateReader$2.process A cluster state change: WatchedEvent state:SyncConnected type:NodeDataChanged path:/clusterstate.json, has occurred - updating... (live nodes size: 4)
[junit4:junit4]   2> 15185 T1744 oasc.CoreContainer.registerCore registering core: collection1
[junit4:junit4]   2> 15185 T1744 oasc.ZkController.register Register replica - core:collection1 address:http://127.0.0.1:56856 collection:collection1 shard:shard1
[junit4:junit4]   2> 15188 T1744 oasc.ZkController.register We are http://127.0.0.1:56856/collection1/ and leader is http://127.0.0.1:58324/collection1/
[junit4:junit4]   2> 15188 T1744 oasc.ZkController.register No LogReplay needed for core=collection1 baseURL=http://127.0.0.1:56856
[junit4:junit4]   2> 15189 T1744 oasc.ZkController.checkRecovery Core needs to recover:collection1
[junit4:junit4]   2> 15189 T1744 oasu.DefaultSolrCoreState.doRecovery Running recovery - first canceling any ongoing recovery
[junit4:junit4]   2> ASYNC  NEW_CORE C118 name=collection1 org.apache.solr.core.SolrCore@32d8cf89 url=http://127.0.0.1:56856/collection1 node=127.0.0.1:56856_ C118_STATE=coll:collection1 core:collection1 props:{state=down, core=collection1, collection=collection1, node_name=127.0.0.1:56856_, base_url=http://127.0.0.1:56856}
[junit4:junit4]   2> 15190 T1746 C118 P56856 oasc.RecoveryStrategy.run Starting recovery process.  core=collection1 recoveringAfterStartup=true
[junit4:junit4]   2> 15190 T1744 oascc.ZkStateReader.updateClusterState Updating cloud state from ZooKeeper... 
[junit4:junit4]   2> 15190 T1746 C118 P56856 oasc.RecoveryStrategy.doRecovery ###### startupVersions=[]
[junit4:junit4]   2> 15191 T1746 C118 P56856 oasc.ZkController.publish publishing core=collection1 state=recovering
[junit4:junit4]   2> 15191 T1746 C118 P56856 oasc.ZkController.publish numShards not found on descriptor - reading it from system property
[junit4:junit4]   2> 15191 T1671 oass.SolrDispatchFilter.init user.dir=/usr/home/hudson/hudson-slave/workspace/Lucene-Solr-Tests-4.x-Java6/solr/build/solr-core/test/J0
[junit4:junit4]   2> 15192 T1671 oass.SolrDispatchFilter.init SolrDispatchFilter.init() done
[junit4:junit4]   2> 15193 T1746 C118 P56856 oascsi.HttpClientUtil.createClient Creating new http client, config:maxConnections=128&maxConnectionsPerHost=32&followRedirects=false
[junit4:junit4]   2> 15193 T1671 oascsi.HttpClientUtil.createClient Creating new http client, config:maxConnections=128&maxConnectionsPerHost=32&followRedirects=false
[junit4:junit4]   2> 15389 T1671 oejs.Server.doStart jetty-8.1.8.v20121106
[junit4:junit4]   2> 15392 T1671 oejs.AbstractConnector.doStart Started SocketConnector@127.0.0.1:48702
[junit4:junit4]   2> 15393 T1671 oass.SolrDispatchFilter.init SolrDispatchFilter.init()
[junit4:junit4]   2> 15393 T1671 oasc.SolrResourceLoader.locateSolrHome JNDI not configured for solr (NoInitialContextEx)
[junit4:junit4]   2> 15394 T1671 oasc.SolrResourceLoader.locateSolrHome using system property solr.solr.home: /usr/home/hudson/hudson-slave/workspace/Lucene-Solr-Tests-4.x-Java6/solr/build/solr-core/test/J0/./org.apache.solr.cloud.SyncSliceTest-jetty4-1362590713495
[junit4:junit4]   2> 15394 T1671 oasc.CoreContainer$Initializer.initialize looking for solr.xml: /usr/home/hudson/hudson-slave/workspace/Lucene-Solr-Tests-4.x-Java6/solr/build/solr-core/test/J0/./org.apache.solr.cloud.SyncSliceTest-jetty4-1362590713495/solr.xml
[junit4:junit4]   2> 15395 T1671 oasc.CoreContainer.<init> New CoreContainer 1205674379
[junit4:junit4]   2> 15395 T1671 oasc.CoreContainer.load Loading CoreContainer using Solr Home: '/usr/home/hudson/hudson-slave/workspace/Lucene-Solr-Tests-4.x-Java6/solr/build/solr-core/test/J0/./org.apache.solr.cloud.SyncSliceTest-jetty4-1362590713495/'
[junit4:junit4]   2> 15396 T1671 oasc.SolrResourceLoader.<init> new SolrResourceLoader for directory: '/usr/home/hudson/hudson-slave/workspace/Lucene-Solr-Tests-4.x-Java6/solr/build/solr-core/test/J0/./org.apache.solr.cloud.SyncSliceTest-jetty4-1362590713495/'
[junit4:junit4]   2> 15443 T1671 oashc.HttpShardHandlerFactory.getParameter Setting socketTimeout to: 120000
[junit4:junit4]   2> 15444 T1671 oashc.HttpShardHandlerFactory.getParameter Setting urlScheme to: http://
[junit4:junit4]   2> 15444 T1671 oashc.HttpShardHandlerFactory.getParameter Setting connTimeout to: 15000
[junit4:junit4]   2> 15445 T1671 oashc.HttpShardHandlerFactory.getParameter Setting maxConnectionsPerHost to: 20
[junit4:junit4]   2> 15445 T1671 oashc.HttpShardHandlerFactory.getParameter Setting corePoolSize to: 0
[junit4:junit4]   2> 15446 T1671 oashc.HttpShardHandlerFactory.getParameter Setting maximumPoolSize to: 2147483647
[junit4:junit4]   2> 15446 T1671 oashc.HttpShardHandlerFactory.getParameter Setting maxThreadIdleTime to: 5
[junit4:junit4]   2> 15446 T1671 oashc.HttpShardHandlerFactory.getParameter Setting sizeOfQueue to: -1
[junit4:junit4]   2> 15447 T1671 oashc.HttpShardHandlerFactory.getParameter Setting fairnessPolicy to: false
[junit4:junit4]   2> 15447 T1671 oascsi.HttpClientUtil.createClient Creating new http client, config:maxConnectionsPerHost=20&maxConnections=10000&socketTimeout=120000&connTimeout=15000&retry=false
[junit4:junit4]   2> 15468 T1671 oasc.CoreContainer.load Registering Log Listener
[junit4:junit4]   2> 15486 T1671 oasc.CoreContainer.initZooKeeper Zookeeper client=127.0.0.1:33863/solr
[junit4:junit4]   2> 15486 T1671 oasc.ZkController.checkChrootPath zkHost includes chroot
[junit4:junit4]   2> 15487 T1671 oaz.ZooKeeper.<init> Initiating client connection, connectString=127.0.0.1:33863 sessionTimeout=60000 watcher=org.apache.solr.common.cloud.ConnectionManager@46bfcd8
[junit4:junit4]   2> 15488 T1671 oascc.ConnectionManager.waitForConnected Waiting for client to connect to ZooKeeper
[junit4:junit4]   2> 15488 T1756 oaz.ClientCnxn$SendThread.logStartConnect Opening socket connection to server localhost/127.0.0.1:33863. Will not attempt to authenticate using SASL (access denied (javax.security.auth.AuthPermission getLoginConfiguration))
[junit4:junit4]   2> 15489 T1756 oaz.ClientCnxn$SendThread.primeConnection Socket connection established to localhost/127.0.0.1:33863, initiating session
[junit4:junit4]   2> 15489 T1673 oazs.NIOServerCnxnFactory.run Accepted socket connection from /140.211.11.196:37867
[junit4:junit4]   2> 15489 T1673 oazs.ZooKeeperServer.processConnectRequest Client attempting to establish new session at /140.211.11.196:37867
[junit4:junit4]   2> 15491 T1675 oazs.ZooKeeperServer.finishSessionInit Established session 0x13d40bc0b3c000b with negotiated timeout 20000 for client /140.211.11.196:37867
[junit4:junit4]   2> 15491 T1756 oaz.ClientCnxn$SendThread.onConnected Session establishment complete on server localhost/127.0.0.1:33863, sessionid = 0x13d40bc0b3c000b, negotiated timeout = 20000
[junit4:junit4]   2> 15492 T1757 oascc.ConnectionManager.process Watcher org.apache.solr.common.cloud.ConnectionManager@46bfcd8 name:ZooKeeperConnection Watcher:127.0.0.1:33863 got event WatchedEvent state:SyncConnected type:None path:null path:null type:None
[junit4:junit4]   2> 15492 T1671 oascc.ConnectionManager.waitForConnected Client is connected to ZooKeeper
[junit4:junit4]   2> 15493 T1676 oazs.PrepRequestProcessor.pRequest2Txn Processed session termination for sessionid: 0x13d40bc0b3c000b
[junit4:junit4]   2> 15503 T1757 oaz.ClientCnxn$EventThread.run EventThread shut down
[junit4:junit4]   2> 15503 T1673 oazs.NIOServerCnxn.closeSock Closed socket connection for client /140.211.11.196:37867 which had sessionid 0x13d40bc0b3c000b
[junit4:junit4]   2> 15503 T1671 oaz.ZooKeeper.close Session: 0x13d40bc0b3c000b closed
[junit4:junit4]   2> 15504 T1671 oascsi.HttpClientUtil.createClient Creating new http client, config:maxConnections=500&maxConnectionsPerHost=16&socketTimeout=120000&connTimeout=15000
[junit4:junit4]   2> 15515 T1671 oaz.ZooKeeper.<init> Initiating client connection, connectString=127.0.0.1:33863/solr sessionTimeout=30000 watcher=org.apache.solr.common.cloud.ConnectionManager@6af07c8a
[junit4:junit4]   2> 15516 T1671 oascc.ConnectionManager.waitForConnected Waiting for client to connect to ZooKeeper
[junit4:junit4]   2> 15516 T1758 oaz.ClientCnxn$SendThread.logStartConnect Opening socket connection to server localhost/127.0.0.1:33863. Will not attempt to authenticate using SASL (access denied (javax.security.auth.AuthPermission getLoginConfiguration))
[junit4:junit4]   2> 15516 T1758 oaz.ClientCnxn$SendThread.primeConnection Socket connection established to localhost/127.0.0.1:33863, initiating session
[junit4:junit4]   2> 15517 T1673 oazs.NIOServerCnxnFactory.run Accepted socket connection from /140.211.11.196:25530
[junit4:junit4]   2> 15517 T1673 oazs.ZooKeeperServer.processConnectRequest Client attempting to establish new session at /140.211.11.196:25530
[junit4:junit4]   2> 15518 T1675 oazs.ZooKeeperServer.finishSessionInit Established session 0x13d40bc0b3c000c with negotiated timeout 20000 for client /140.211.11.196:25530
[junit4:junit4]   2> 15518 T1758 oaz.ClientCnxn$SendThread.onConnected Session establishment complete on server localhost/127.0.0.1:33863, sessionid = 0x13d40bc0b3c000c, negotiated timeout = 20000
[junit4:junit4]   2> 15518 T1759 oascc.ConnectionManager.process Watcher org.apache.solr.common.cloud.ConnectionManager@6af07c8a name:ZooKeeperConnection Watcher:127.0.0.1:33863/solr got event WatchedEvent state:SyncConnected type:None path:null path:null type:None
[junit4:junit4]   2> 15519 T1671 oascc.ConnectionManager.waitForConnected Client is connected to ZooKeeper
[junit4:junit4]   2> 15519 T1676 oazs.PrepRequestProcessor.pRequest Got user-level KeeperException when processing sessionid:0x13d40bc0b3c000c type:create cxid:0x1 zxid:0x93 txntype:-1 reqpath:n/a Error Path:/solr/overseer Error:KeeperErrorCode = NodeExists for /solr/overseer
[junit4:junit4]   2> 15521 T1676 oazs.PrepRequestProcessor.pRequest Got user-level KeeperException when processing sessionid:0x13d40bc0b3c000c type:create cxid:0x2 zxid:0x94 txntype:-1 reqpath:n/a Error Path:/solr/overseer Error:KeeperErrorCode = NodeExists for /solr/overseer
[junit4:junit4]   2> 15529 T1671 oascc.ZkStateReader.createClusterStateWatchersAndUpdate Updating cluster state from ZooKeeper... 
[junit4:junit4]   2>  C117_STATE=coll:collection1 core:collection1 props:{shard=shard1, state=recovering, core=collection1, collection=collection1, node_name=127.0.0.1:58450_, base_url=http://127.0.0.1:58450}
[junit4:junit4]   2> 15975 T1730 C117 P58450 oasc.RecoveryStrategy.doRecovery Attempting to PeerSync from http://127.0.0.1:58324/collection1/ core=collection1 - recoveringAfterStartup=true
[junit4:junit4]   2> 15975 T1730 C117 P58450 oasu.PeerSync.sync PeerSync: core=collection1 url=http://127.0.0.1:58450 START replicas=[http://127.0.0.1:58324/collection1/] nUpdates=100
[junit4:junit4]   2> 15976 T1730 C117 P58450 oasu.PeerSync.sync WARNING no frame of reference to tell of we've missed updates
[junit4:junit4]   2> 15976 T1730 C117 P58450 oasc.RecoveryStrategy.doRecovery PeerSync Recovery was not successful - trying replication. core=collection1
[junit4:junit4]   2> 15977 T1730 C117 P58450 oasc.RecoveryStrategy.doRecovery Starting Replication Recovery. core=collection1
[junit4:junit4]   2> 15977 T1730 C117 P58450 oasc.RecoveryStrategy.doRecovery Begin buffering updates. core=collection1
[junit4:junit4]   2> 15977 T1730 C117 P58450 oasu.UpdateLog.bufferUpdates Starting to buffer updates. FSUpdateLog{state=ACTIVE, tlog=null}
[junit4:junit4]   2> 15977 T1730 C117 P58450 oasc.RecoveryStrategy.replicate Attempting to replicate from http://127.0.0.1:58324/collection1/. core=collection1
[junit4:junit4]   2> 15977 T1730 C117 P58450 oascsi.HttpClientUtil.createClient Creating new http client, config:maxConnections=128&maxConnectionsPerHost=32&followRedirects=false
[junit4:junit4]   2> ASYNC  NEW_CORE C119 name=collection1 org.apache.solr.core.SolrCore@13eb5aab url=http://127.0.0.1:58324/collection1 node=127.0.0.1:58324_ C119_STATE=coll:collection1 core:collection1 props:{shard=shard1, state=active, core=collection1, collection=collection1, node_name=127.0.0.1:58324_, base_url=http://127.0.0.1:58324, leader=true}
[junit4:junit4]   2> 15983 T1704 C119 P58324 REQ /get {getVersions=100&distrib=false&wt=javabin&qt=/get&version=2} status=0 QTime=0 
[junit4:junit4]   2> 15989 T1705 C119 P58324 oasu.DirectUpdateHandler2.commit start commit{,optimize=false,openSearcher=false,waitSearcher=true,expungeDeletes=false,softCommit=false,prepareCommit=false}
[junit4:junit4]   2> 15990 T1705 C119 P58324 oasc.CachingDirectoryFactory.close Releasing directory:/usr/home/hudson/hudson-slave/workspace/Lucene-Solr-Tests-4.x-Java6/solr/build/solr-core/test/J0/./org.apache.solr.cloud.SyncSliceTest-1362590698293/jetty1
[junit4:junit4]   2> 15998 T1705 C119 P58324 oasc.SolrDeletionPolicy.onInit SolrDeletionPolicy.onInit: commits:num=1
[junit4:junit4]   2> 		commit{dir=MockDirWrapper(org.apache.lucene.store.RAMDirectory@2cac0ca8 lockFactory=org.apache.lucene.store.NativeFSLockFactory@23263ff4),segFN=segments_1,generation=1,filenames=[segments_1]
[junit4:junit4]   2> 15998 T1705 C119 P58324 oasc.SolrDeletionPolicy.updateCommits newest commit = 1[segments_1]
[junit4:junit4]   2> 15999 T1705 C119 P58324 oasc.SolrDeletionPolicy.onCommit SolrDeletionPolicy.onCommit: commits:num=2
[junit4:junit4]   2> 		commit{dir=MockDirWrapper(org.apache.lucene.store.RAMDirectory@2cac0ca8 lockFactory=org.apache.lucene.store.NativeFSLockFactory@23263ff4),segFN=segments_1,generation=1,filenames=[segments_1]
[junit4:junit4]   2> 		commit{dir=MockDirWrapper(org.apache.lucene.store.RAMDirectory@2cac0ca8 lockFactory=org.apache.lucene.store.NativeFSLockFactory@23263ff4),segFN=segments_2,generation=2,filenames=[segments_2]
[junit4:junit4]   2> 15999 T1705 C119 P58324 oasc.SolrDeletionPolicy.updateCommits newest commit = 2[segments_2]
[junit4:junit4]   2> 16000 T1705 C119 P58324 oasc.CachingDirectoryFactory.close Releasing directory:/usr/home/hudson/hudson-slave/workspace/Lucene-Solr-Tests-4.x-Java6/solr/build/solr-core/test/J0/./org.apache.solr.cloud.SyncSliceTest-1362590698293/jetty1
[junit4:junit4]   2> 16000 T1705 C119 P58324 oass.SolrIndexSearcher.<init> Opening Searcher@ce03be0 realtime
[junit4:junit4]   2> 16000 T1705 C119 P58324 oasu.DirectUpdateHandler2.commit end_commit_flush
[junit4:junit4]   2> 16001 T1705 C119 P58324 /update {waitSearcher=true&openSearcher=false&commit=true&wt=javabin&commit_end_point=true&version=2&softCommit=false} {commit=} 0 12
[junit4:junit4]   2> 16002 T1730 C117 P58450 oash.ReplicationHandler.inform Commits will be reserved for  10000
[junit4:junit4]   2> 16002 T1730 C117 P58450 oash.SnapPuller.<init>  No value set for 'pollInterval'. Timer Task not started.
[junit4:junit4]   2> 16004 T1706 C119 P58324 oash.ReplicationHandler.inform Commits will be reserved for  10000
[junit4:junit4]   2> 16004 T1706 C119 P58324 REQ /replication {command=indexversion&qt=/replication&wt=javabin&version=2} status=0 QTime=1 
[junit4:junit4]   2> 16005 T1730 C117 P58450 oash.SnapPuller.fetchLatestIndex Master's generation: 2
[junit4:junit4]   2> 16005 T1730 C117 P58450 oash.SnapPuller.fetchLatestIndex Slave's generation: 1
[junit4:junit4]   2> 16005 T1730 C117 P58450 oash.SnapPuller.fetchLatestIndex Starting replication process
[junit4:junit4]   2> 16008 T1706 C119 P58324 oasc.CachingDirectoryFactory.close Releasing directory:/usr/home/hudson/hudson-slave/workspace/Lucene-Solr-Tests-4.x-Java6/solr/build/solr-core/test/J0/./org.apache.solr.cloud.SyncSliceTest-1362590698293/jetty1
[junit4:junit4]   2> 16009 T1706 C119 P58324 oasc.CachingDirectoryFactory.close Releasing directory:/usr/home/hudson/hudson-slave/workspace/Lucene-Solr-Tests-4.x-Java6/solr/build/solr-core/test/J0/./org.apache.solr.cloud.SyncSliceTest-1362590698293/jetty1/index
[junit4:junit4]   2> 16009 T1706 C119 P58324 REQ /replication {command=filelist&qt=/replication&wt=javabin&generation=2&version=2} status=0 QTime=1 
[junit4:junit4]   2> 16009 T1730 C117 P58450 oash.SnapPuller.fetchLatestIndex Number of files in latest index in master: 1
[junit4:junit4]   2> 16010 T1730 C117 P58450 oasc.CachingDirectoryFactory.get return new directory for /usr/home/hudson/hudson-slave/workspace/Lucene-Solr-Tests-4.x-Java6/solr/build/solr-core/test/J0/./org.apache.solr.cloud.SyncSliceTest-1362590698293/jetty2/index.20130306142514297 forceNew:false
[junit4:junit4]   2> 16011 T1730 C117 P58450 oasc.CachingDirectoryFactory.close Releasing directory:/usr/home/hudson/hudson-slave/workspace/Lucene-Solr-Tests-4.x-Java6/solr/build/solr-core/test/J0/./org.apache.solr.cloud.SyncSliceTest-1362590698293/jetty2
[junit4:junit4]   2> 16011 T1730 C117 P58450 oash.SnapPuller.fetchLatestIndex Starting download to MockDirWrapper(org.apache.lucene.store.RAMDirectory@2a63d6ef lockFactory=org.apache.lucene.store.NativeFSLockFactory@280cea4d) fullCopy=false
[junit4:junit4]   2> 16013 T1706 C119 P58324 REQ /replication {file=segments_2&command=filecontent&checksum=true&wt=filestream&qt=/replication&generation=2} status=0 QTime=0 
[junit4:junit4]   2> 16014 T1730 C117 P58450 oasc.CachingDirectoryFactory.close Releasing directory:/usr/home/hudson/hudson-slave/workspace/Lucene-Solr-Tests-4.x-Java6/solr/build/solr-core/test/J0/./org.apache.solr.cloud.SyncSliceTest-1362590698293/jetty2/index
[junit4:junit4]   2> 16014 T1730 C117 P58450 oash.SnapPuller.fetchLatestIndex Total time taken for download : 0 secs
[junit4:junit4]   2> 16015 T1730 C117 P58450 oasc.CachingDirectoryFactory.close Releasing directory:/usr/home/hudson/hudson-slave/workspace/Lucene-Solr-Tests-4.x-Java6/solr/build/solr-core/test/J0/./org.apache.solr.cloud.SyncSliceTest-1362590698293/jetty2
[junit4:junit4]   2> 16015 T1730 C117 P58450 oasc.CachingDirectoryFactory.close Releasing directory:/usr/home/hudson/hudson-slave/workspace/Lucene-Solr-Tests-4.x-Java6/solr/build/solr-core/test/J0/./org.apache.solr.cloud.SyncSliceTest-1362590698293/jetty2
[junit4:junit4]   2> 16016 T1730 C117 P58450 oasu.DefaultSolrCoreState.newIndexWriter Creating new IndexWriter...
[junit4:junit4]   2> 16016 T1730 C117 P58450 oasu.DefaultSolrCoreState.newIndexWriter Waiting until IndexWriter is unused... core=collection1
[junit4:junit4]   2> 16016 T1730 C117 P58450 oasc.CachingDirectoryFactory.close Releasing directory:/usr/home/hudson/hudson-slave/workspace/Lucene-Solr-Tests-4.x-Java6/solr/build/solr-core/test/J0/./org.apache.solr.cloud.SyncSliceTest-1362590698293/jetty2
[junit4:junit4]   2> 16018 T1730 C117 P58450 oasc.SolrDeletionPolicy.onInit SolrDeletionPolicy.onInit: commits:num=2
[junit4:junit4]   2> 		commit{dir=MockDirWrapper(org.apache.lucene.store.RAMDirectory@61ac14b7 lockFactory=org.apache.lucene.store.NativeFSLockFactory@3d83f18a),segFN=segments_1,generation=1,filenames=[segments_1]
[junit4:junit4]   2> 		commit{dir=MockDirWrapper(org.apache.lucene.store.RAMDirectory@61ac14b7 lockFactory=org.apache.lucene.store.NativeFSLockFactory@3d83f18a),segFN=segments_2,generation=2,filenames=[segments_2]
[junit4:junit4]   2> 16018 T1730 C117 P58450 oasc.SolrDeletionPolicy.updateCommits newest commit = 2[segments_2]
[junit4:junit4]   2> 16018 T1730 C117 P58450 oasu.DefaultSolrCoreState.newIndexWriter New IndexWriter is ready to be used.
[junit4:junit4]   2> 16018 T1730 C117 P58450 oasc.CachingDirectoryFactory.close Releasing directory:/usr/home/hudson/hudson-slave/workspace/Lucene-Solr-Tests-4.x-Java6/solr/build/solr-core/test/J0/./org.apache.solr.cloud.SyncSliceTest-1362590698293/jetty2
[junit4:junit4]   2> 16019 T1730 C117 P58450 oass.SolrIndexSearcher.<init> Opening Searcher@49debb11 main
[junit4:junit4]   2> 16020 T1729 oasc.SolrCore.registerSearcher [collection1] Registered new searcher Searcher@49debb11 main{StandardDirectoryReader(segments_2:1:nrt)}
[junit4:junit4]   2> 16020 T1729 oasc.CachingDirectoryFactory.close Releasing directory:/usr/home/hudson/hudson-slave/workspace/Lucene-Solr-Tests-4.x-Java6/solr/build/solr-core/test/J0/./org.apache.solr.cloud.SyncSliceTest-1362590698293/jetty2/index
[junit4:junit4]   2> 16020 T1730 C117 P58450 oash.SnapPuller.fetchLatestIndex removing temporary index download directory files MockDirWrapper(org.apache.lucene.store.RAMDirectory@2a63d6ef lockFactory=org.apache.lucene.store.NativeFSLockFactory@280cea4d)
[junit4:junit4]   2> 16020 T1730 C117 P58450 oasc.CachingDirectoryFactory.close Releasing directory:/usr/home/hudson/hudson-slave/workspace/Lucene-Solr-Tests-4.x-Java6/solr/build/solr-core/test/J0/./org.apache.solr.cloud.SyncSliceTest-1362590698293/jetty2/index.20130306142514297
[junit4:junit4]   2> 16021 T1730 C117 P58450 oasc.CachingDirectoryFactory.close Releasing directory:/usr/home/hudson/hudson-slave/workspace/Lucene-Solr-Tests-4.x-Java6/solr/build/solr-core/test/J0/./org.apache.solr.cloud.SyncSliceTest-1362590698293/jetty2/index
[junit4:junit4]   2> 16021 T1730 C117 P58450 oasc.RecoveryStrategy.replay No replay needed. core=collection1
[junit4:junit4]   2> 16021 T1730 C117 P58450 oasc.RecoveryStrategy.doRecovery Replication Recovery was successful - registering as Active. core=collection1
[junit4:junit4]   2> 16021 T1730 C117 P58450 oasc.ZkController.publish publishing core=collection1 state=active
[junit4:junit4]   2> 16022 T1730 C117 P58450 oasc.ZkController.publish numShards not found on descriptor - reading it from system property
[junit4:junit4]   2> 16029 T1730 C117 P58450 oasc.RecoveryStrategy.doRecovery Finished recovery process. core=collection1
[junit4:junit4]   2> 16245 T1694 oascc.ZkStateReader.updateClusterState Updating cloud state from ZooKeeper... 
[junit4:junit4]   2> 16246 T1694 oasc.Overseer$ClusterStateUpdater.updateState Update state numShards=1 message={
[junit4:junit4]   2> 	  "operation":"state",
[junit4:junit4]   2> 	  "core_node_name":null,
[junit4:junit4]   2> 	  "numShards":"1",
[junit4:junit4]   2> 	  "shard":"shard1",
[junit4:junit4]   2> 	  "roles":null,
[junit4:junit4]   2> 	  "state":"recovering",
[junit4:junit4]   2> 	  "core":"collection1",
[junit4:junit4]   2> 	  "collection":"collection1",
[junit4:junit4]   2> 	  "node_name":"127.0.0.1:56856_",
[junit4:junit4]   2> 	  "base_url":"http://127.0.0.1:56856"}
[junit4:junit4]   2> 16250 T1694 oasc.Overseer$ClusterStateUpdater.updateState Update state numShards=1 message={
[junit4:junit4]   2> 	  "operation":"state",
[junit4:junit4]   2> 	  "core_node_name":null,
[junit4:junit4]   2> 	  "numShards":"1",
[junit4:junit4]   2> 	  "shard":"shard1",
[junit4:junit4]   2> 	  "roles":null,
[junit4:junit4]   2> 	  "state":"active",
[junit4:junit4]   2> 	  "core":"collection1",
[junit4:junit4]   2> 	  "collection":"collection1",
[junit4:junit4]   2> 	  "node_name":"127.0.0.1:58450_",
[junit4:junit4]   2> 	  "base_url":"http://127.0.0.1:58450"}
[junit4:junit4]   2> 16267 T1693 oascc.ZkStateReader$2.process A cluster state change: WatchedEvent state:SyncConnected type:NodeDataChanged path:/clusterstate.json, has occurred - updating... (live nodes size: 4)
[junit4:junit4]   2> 16267 T1759 oascc.ZkStateReader$2.process A cluster state change: WatchedEvent state:SyncConnected type:NodeDataChanged path:/clusterstate.json, has occurred - updating... (live nodes size: 4)
[junit4:junit4]   2> 16267 T1699 oascc.ZkStateReader$2.process A cluster state change: WatchedEvent state:SyncConnected type:NodeDataChanged path:/clusterstate.json, has occurred - updating... (live nodes size: 4)
[junit4:junit4]   2> 16267 T1743 oascc.ZkStateReader$2.process A cluster state change: WatchedEvent state:SyncConnected type:NodeDataChanged path:/clusterstate.json, has occurred - updating... (live nodes size: 4)
[junit4:junit4]   2> 16267 T1727 oascc.ZkStateReader$2.process A cluster state change: WatchedEvent state:SyncConnected type:NodeDataChanged path:/clusterstate.json, has occurred - updating... (live nodes size: 4)
[junit4:junit4]   2> 16267 T1712 oascc.ZkStateReader$2.process A cluster state change: WatchedEvent state:SyncConnected type:NodeDataChanged path:/clusterstate.json, has occurred - updating... (live nodes size: 4)
[junit4:junit4]   2> 16531 T1671 oasc.ZkController.createEphemeralLiveNode Register node as live in ZooKeeper:/live_nodes/127.0.0.1:48702_
[junit4:junit4]   2> 16532 T1676 oazs.PrepRequestProcessor.pRequest Got user-level KeeperException when processing sessionid:0x13d40bc0b3c000c type:delete cxid:0xb zxid:0x9d txntype:-1 reqpath:n/a Error Path:/solr/live_nodes/127.0.0.1:48702_ Error:KeeperErrorCode = NoNode for /solr/live_nodes/127.0.0.1:48702_
[junit4:junit4]   2> 16533 T1671 oascc.SolrZkClient.makePath makePath: /live_nodes/127.0.0.1:48702_
[junit4:junit4]   2> 16535 T1727 oascc.ZkStateReader$2.process A cluster state change: WatchedEvent state:SyncConnected type:NodeChildrenChanged path:/live_nodes, has occurred - updating... (live nodes size: 4)
[junit4:junit4]   2> 16535 T1699 oascc.ZkStateReader$2.process A cluster state change: WatchedEvent state:SyncConnected type:NodeChildrenChanged path:/live_nodes, has occurred - updating... (live nodes size: 4)
[junit4:junit4]   2> 16535 T1712 oascc.ZkStateReader$2.process A cluster state change: WatchedEvent state:SyncConnected type:NodeChildrenChanged path:/live_nodes, has occurred - updating... (live nodes size: 4)
[junit4:junit4]   2> 16536 T1759 oascc.ZkStateReader$3.process Updating live nodes... (5)
[junit4:junit4]   2> 16536 T1693 oascc.ZkStateReader$3.process Updating live nodes... (5)
[junit4:junit4]   2> 16536 T1743 oascc.ZkStateReader$3.process Updating live nodes... (5)
[junit4:junit4]   2> 16536 T1693 oascc.ZkStateReader$2.process A cluster state change: WatchedEvent state:SyncConnected type:NodeChildrenChanged path:/live_nodes, has occurred - updating... (live nodes size: 5)
[junit4:junit4]   2> 16536 T1759 oascc.ZkStateReader$2.process A cluster state change: WatchedEvent state:SyncConnected type:NodeChildrenChanged path:/live_nodes, has occurred - updating... (live nodes size: 5)
[junit4:junit4]   2> 16536 T1743 oascc.ZkStateReader$2.process A cluster state change: WatchedEvent state:SyncConnected type:NodeChildrenChanged path:/live_nodes, has occurred - updating... (live nodes size: 5)
[junit4:junit4]   2> 16537 T1699 oascc.ZkStateReader$3.process Updating live nodes... (5)
[junit4:junit4]   2> 16544 T1727 oascc.ZkStateReader$3.process Updating live nodes... (5)
[junit4:junit4]   2> 16544 T1712 oascc.ZkStateReader$3.process Updating live nodes... (5)
[junit4:junit4]   2> 16550 T1762 oasc.CoreContainer.create Creating SolrCore 'collection1' using instanceDir: /usr/home/hudson/hudson-slave/workspace/Lucene-Solr-Tests-4.x-Java6/solr/build/solr-core/test/J0/./org.apache.solr.cloud.SyncSliceTest-jetty4-1362590713495/collection1
[junit4:junit4]   2> 16551 T1762 oasc.ZkController.createCollectionZkNode Check for collection zkNode:collection1
[junit4:junit4]   2> 16551 T1762 oasc.ZkController.createCollectionZkNode Collection zkNode exists
[junit4:junit4]   2> 16551 T1762 oasc.ZkController.readConfigName Load collection config from:/collections/collection1
[junit4:junit4]   2> 16553 T1762 oasc.SolrResourceLoader.<init> new SolrResourceLoader for directory: '/usr/home/hudson/hudson-slave/workspace/Lucene-Solr-Tests-4.x-Java6/solr/build/solr-core/test/J0/./org.apache.solr.cloud.SyncSliceTest-jetty4-1362590713495/collection1/'
[junit4:junit4]   2> 16554 T1762 oasc.SolrResourceLoader.replaceClassLoader Adding 'file:/usr/home/hudson/hudson-slave/workspace/Lucene-Solr-Tests-4.x-Java6/solr/build/solr-core/test/J0/org.apache.solr.cloud.SyncSliceTest-jetty4-1362590713495/collection1/lib/classes/' to classloader
[junit4:junit4]   2> 16554 T1762 oasc.SolrResourceLoader.replaceClassLoader Adding 'file:/usr/home/hudson/hudson-slave/workspace/Lucene-Solr-Tests-4.x-Java6/solr/build/solr-core/test/J0/org.apache.solr.cloud.SyncSliceTest-jetty4-1362590713495/collection1/lib/README' to classloader
[junit4:junit4]   2> 16602 T1762 oasc.SolrConfig.<init> Using Lucene MatchVersion: LUCENE_42
[junit4:junit4]   2> 16658 T1762 oasc.SolrConfig.<init> Loaded SolrConfig: solrconfig.xml
[junit4:junit4]   2> 16758 T1762 oass.IndexSchema.readSchema Reading Solr Schema
[junit4:junit4]   2> 16763 T1762 oass.IndexSchema.readSchema Schema name=test
[junit4:junit4]   2> 17211 T1703 oass.SolrDispatchFilter.handleAdminRequest /admin/cores {coreNodeName=127.0.0.1:56856__collection1&state=recovering&nodeName=127.0.0.1:56856_&action=PREPRECOVERY&checkLive=true&core=collection1&wt=javabin&onlyIfLeader=true&version=2} status=0 QTime=2002 
[junit4:junit4]   2> 17359 T1762 oass.OpenExchangeRatesOrgProvider.init Initialized with rates=open-exchange-rates.json, refreshInterval=1440.
[junit4:junit4]   2> 17371 T1762 oass.IndexSchema.readSchema default search field in schema is text
[junit4:junit4]   2> 17375 T1762 oass.IndexSchema.readSchema unique key field: id
[junit4:junit4]   2> 17388 T1762 oass.FileExchangeRateProvider.reload Reloading exchange rates from file currency.xml
[junit4:junit4]   2> 17393 T1762 oass.FileExchangeRateProvider.reload Reloading exchange rates from file currency.xml
[junit4:junit4]   2> 17397 T1762 oass.OpenExchangeRatesOrgProvider.reload Reloading exchange rates from open-exchange-rates.json
[junit4:junit4]   2> 17398 T1762 oass.OpenExchangeRatesOrgProvider$OpenExchangeRates.<init> WARNING Unknown key IMPORTANT NOTE
[junit4:junit4]   2> 17399 T1762 oass.OpenExchangeRatesOrgProvider$OpenExchangeRates.<init> WARNING Expected key, got STRING
[junit4:junit4]   2> 17399 T1762 oass.OpenExchangeRatesOrgProvider.reload Reloading exchange rates from open-exchange-rates.json
[junit4:junit4]   2> 17400 T1762 oass.OpenExchangeRatesOrgProvider$OpenExchangeRates.<init> WARNING Unknown key IMPORTANT NOTE
[junit4:junit4]   2> 17400 T1762 oass.OpenExchangeRatesOrgProvider$OpenExchangeRates.<init> WARNING Expected key, got STRING
[junit4:junit4]   2> 17401 T1762 oasc.SolrCore.<init> [collection1] Opening new SolrCore at /usr/home/hudson/hudson-slave/workspace/Lucene-Solr-Tests-4.x-Java6/solr/build/solr-core/test/J0/./org.apache.solr.cloud.SyncSliceTest-jetty4-1362590713495/collection1/, dataDir=./org.apache.solr.cloud.SyncSliceTest-1362590698293/jetty4/
[junit4:junit4]   2> 17401 T1762 oasc.JmxMonitoredMap.<init> JMX monitoring is enabled. Adding Solr mbeans to JMX Server: com.sun.jmx.mbeanserver.JmxMBeanServer@35f38fc6
[junit4:junit4]   2> 17401 T1762 oasc.SolrCore.initDirectoryFactory org.apache.solr.core.MockDirectoryFactory
[junit4:junit4]   2> 17402 T1762 oasc.CachingDirectoryFactory.get return new directory for /usr/home/hudson/hudson-slave/workspace/Lucene-Solr-Tests-4.x-Java6/solr/build/solr-core/test/J0/./org.apache.solr.cloud.SyncSliceTest-1362590698293/jetty4 forceNew:false
[junit4:junit4]   2> 17402 T1762 oasc.CachingDirectoryFactory.close Releasing directory:/usr/home/hudson/hudson-slave/workspace/Lucene-Solr-Tests-4.x-Java6/solr/build/solr-core/test/J0/./org.apache.solr.cloud.SyncSliceTest-1362590698293/jetty4
[junit4:junit4]   2> 17403 T1762 oasc.SolrCore.getNewIndexDir New index directory detected: old=null new=./org.apache.solr.cloud.SyncSliceTest-1362590698293/jetty4/index/
[junit4:junit4]   2> 17403 T1762 oasc.SolrCore.initIndex WARNING [collection1] Solr index directory './org.apache.solr.cloud.SyncSliceTest-1362590698293/jetty4/index' doesn't exist. Creating new index...
[junit4:junit4]   2> 17404 T1762 oasc.CachingDirectoryFactory.get return new directory for /usr/home/hudson/hudson-slave/workspace/Lucene-Solr-Tests-4.x-Java6/solr/build/solr-core/test/J0/./org.apache.solr.cloud.SyncSliceTest-1362590698293/jetty4/index forceNew:false
[junit4:junit4]   2> 17406 T1762 oasc.SolrDeletionPolicy.onCommit SolrDeletionPolicy.onCommit: commits:num=1
[junit4:junit4]   2> 		commit{dir=MockDirWrapper(org.apache.lucene.store.RAMDirectory@4e44462d lockFactory=org.apache.lucene.store.NativeFSLockFactory@2a15c952),segFN=segments_1,generation=1,filenames=[segments_1]
[junit4:junit4]   2> 17406 T1762 oasc.SolrDeletionPolicy.updateCommits newest commit = 1[segments_1]
[junit4:junit4]   2> 17407 T1762 oasc.CachingDirectoryFactory.close Releasing directory:/usr/home/hudson/hudson-slave/workspace/Lucene-Solr-Tests-4.x-Java6/solr/build/solr-core/test/J0/./org.apache.solr.cloud.SyncSliceTest-1362590698293/jetty4/index
[junit4:junit4]   2> 17409 T1762 oasup.UpdateRequestProcessorChain.init inserting DistributedUpdateProcessorFactory into updateRequestProcessorChain "dedupe"
[junit4:junit4]   2> 17409 T1762 oasup.UpdateRequestProcessorChain.init inserting DistributedUpdateProcessorFactory into updateRequestProcessorChain "stored_sig"
[junit4:junit4]   2> 17410 T1762 oasup.UpdateRequestProcessorChain.init inserting DistributedUpdateProcessorFactory into updateRequestProcessorChain "distrib-dup-test-chain-implicit"
[junit4:junit4]   2> 17411 T1762 oasc.RequestHandlers.initHandlersFromConfig created standard: solr.StandardRequestHandler
[junit4:junit4]   2> 17411 T1762 oasc.RequestHandlers.initHandlersFromConfig created /get: solr.RealTimeGetHandler
[junit4:junit4]   2> 17411 T1762 oasc.RequestHandlers.initHandlersFromConfig adding lazy requestHandler: solr.ReplicationHandler
[junit4:junit4]   2> 17412 T1762 oasc.RequestHandlers.initHandlersFromConfig created /replication: solr.ReplicationHandler
[junit4:junit4]   2> 17412 T1762 oasc.RequestHandlers.initHandlersFromConfig created /update: solr.UpdateRequestHandler
[junit4:junit4]   2> 17413 T1762 oasc.RequestHandlers.initHandlersFromConfig created /admin/: org.apache.solr.handler.admin.AdminHandlers
[junit4:junit4]   2> 17420 T1762 oashl.XMLLoader.init xsltCacheLifetimeSeconds=60
[junit4:junit4]   2> 17426 T1762 oasc.CachingDirectoryFactory.close Releasing directory:/usr/home/hudson/hudson-slave/workspace/Lucene-Solr-Tests-4.x-Java6/solr/build/solr-core/test/J0/./org.apache.solr.cloud.SyncSliceTest-1362590698293/jetty4
[junit4:junit4]   2> 17426 T1762 oass.SolrIndexSearcher.<init> Opening Searcher@7a11a84c main
[junit4:junit4]   2> 17427 T1762 oasu.UpdateHandler.clearLog Clearing tlog files, tlogDir=./org.apache.solr.cloud.SyncSliceTest-1362590698293/jetty4/tlog
[junit4:junit4]   2> 17427 T1762 oasu.CommitTracker.<init> Hard AutoCommit: disabled
[junit4:junit4]   2> 17428 T1762 oasu.CommitTracker.<init> Soft AutoCommit: disabled
[junit4:junit4]   2> 17432 T1763 oasc.SolrCore.registerSearcher [collection1] Registered new searcher Searcher@7a11a84c main{StandardDirectoryReader(segments_1:1)}
[junit4:junit4]   2> 17434 T1762 oasc.ZkController.publish publishing core=collection1 state=down
[junit4:junit4]   2> 17434 T1762 oasc.ZkController.publish numShards not found on descriptor - reading it from system property
[junit4:junit4]   2> 17774 T1694 oascc.ZkStateReader.updateClusterState Updating cloud state from ZooKeeper... 
[junit4:junit4]   2> 17775 T1694 oasc.Overseer$ClusterStateUpdater.updateState Update state numShards=1 message={
[junit4:junit4]   2> 	  "operation":"state",
[junit4:junit4]   2> 	  "core_node_name":null,
[junit4:junit4]   2> 	  "numShards":"1",
[junit4:junit4]   2> 	  "shard":null,
[junit4:junit4]   2> 	  "roles":null,
[junit4:junit4]   2> 	  "state":"down",
[junit4:junit4]   2> 	  "core":"collection1",
[junit4:junit4]   2> 	  "collection":"collection1",
[junit4:junit4]   2> 	  "node_name":"127.0.0.1:48702_",
[junit4:junit4]   2> 	  "base_url":"http://127.0.0.1:48702"}
[junit4:junit4]   2> 17775 T1694 oasc.Overseer$ClusterStateUpdater.updateState Collection already exists with numShards=1
[junit4:junit4]   2> 17775 T1694 oasc.Overseer$ClusterStateUpdater.updateState Assigning new node to shard shard=shard1
[junit4:junit4]   2> 17788 T1693 oascc.ZkStateReader$2.process A cluster state change: WatchedEvent state:SyncConnected type:NodeDataChanged path:/clusterstate.json, has occurred - updating... (live nodes size: 5)
[junit4:junit4]   2> 17788 T1759 oascc.ZkStateReader$2.process A cluster state change: WatchedEvent state:SyncConnected type:NodeDataChanged path:/clusterstate.json, has occurred - updating... (live nodes size: 5)
[junit4:junit4]   2> 17788 T1699 oascc.ZkStateReader$2.process A cluster state change: WatchedEvent state:SyncConnected type:NodeDataChanged path:/clusterstate.json, has occurred - updating... (live nodes size: 5)
[junit4:junit4]   2> 17788 T1743 oascc.ZkStateReader$2.process A cluster state change: WatchedEvent state:SyncConnected type:NodeDataChanged path:/clusterstate.json, has occurred - updating... (live nodes size: 5)
[junit4:junit4]   2> 17788 T1712 oascc.ZkStateReader$2.process A cluster state change: WatchedEvent state:SyncConnected type:NodeDataChanged path:/clusterstate.json, has occurred - updating... (live nodes size: 5)
[junit4:junit4]   2> 17788 T1727 oascc.ZkStateReader$2.process A cluster state change: WatchedEvent state:SyncConnected type:NodeDataChanged path:/clusterstate.json, has occurred - updating... (live nodes size: 5)
[junit4:junit4]   2> 18436 T1762 oasc.CoreContainer.registerCore registering core: collection1
[junit4:junit4]   2> 18436 T1762 oasc.ZkController.register Register replica - core:collection1 address:http://127.0.0.1:48702 collection:collection1 shard:shard1
[junit4:junit4]   2> 18439 T1762 oasc.ZkController.register We are http://127.0.0.1:48702/collection1/ and leader is http://127.0.0.1:58324/collection1/
[junit4:junit4]   2> 18439 T1762 oasc.ZkController.register No LogReplay needed for core=collection1 baseURL=http://127.0.0.1:48702
[junit4:junit4]   2> 18440 T1762 oasc.ZkController.checkRecovery Core needs to recover:collection1
[junit4:junit4]   2> 18440 T1762 oasu.DefaultSolrCoreState.doRecovery Running recovery - first canceling any ongoing recovery
[junit4:junit4]   2> ASYNC  NEW_CORE C120 name=collection1 org.apache.solr.core.SolrCore@583068f9 url=http://127.0.0.1:48702/collection1 node=127.0.0.1:48702_ C120_STATE=coll:collection1 core:collection1 props:{state=down, core=collection1, collection=collection1, node_name=127.0.0.1:48702_, base_url=http://127.0.0.1:48702}
[junit4:junit4]   2> 18441 T1764 C120 P48702 oasc.RecoveryStrategy.run Starting recovery process.  core=collection1 recoveringAfterStartup=true
[junit4:junit4]   2> 18441 T1762 oascc.ZkStateReader.updateClusterState Updating cloud state from ZooKeeper... 
[junit4:junit4]   2> 18442 T1764 C120 P48702 oasc.RecoveryStrategy.doRecovery ###### startupVersions=[]
[junit4:junit4]   2> 18442 T1764 C120 P48702 oasc.ZkController.publish publishing core=collection1 state=recovering
[junit4:junit4]   2> 18442 T1764 C120 P48702 oasc.ZkController.publish numShards not found on descriptor - reading it from system property
[junit4:junit4]   2> 18442 T1671 oass.SolrDispatchFilter.init user.dir=/usr/home/hudson/hudson-slave/workspace/Lucene-Solr-Tests-4.x-Java6/solr/build/solr-core/test/J0
[junit4:junit4]   2> 18443 T1671 oass.SolrDispatchFilter.init SolrDispatchFilter.init() done
[junit4:junit4]   2> 18444 T1764 C120 P48702 oascsi.HttpClientUtil.createClient Creating new http client, config:maxConnections=128&maxConnectionsPerHost=32&followRedirects=false
[junit4:junit4]   2> 18444 T1671 oascsi.HttpClientUtil.createClient Creating new http client, config:maxConnections=128&maxConnectionsPerHost=32&followRedirects=false
[junit4:junit4]   2> 18463 T1671 oascc.ZkStateReader.updateClusterState Updating cloud state from ZooKeeper... 
[junit4:junit4]   2> 18464 T1671 oasc.AbstractFullDistribZkTestBase.waitForThingsToLevelOut Wait for recoveries to finish - wait 15 for each attempt
[junit4:junit4]   2> 18464 T1671 oasc.AbstractDistribZkTestBase.waitForRecoveriesToFinish Wait for recoveries to finish - collection: collection1 failOnTimeout:true timeout (sec):15
[junit4:junit4]   2> 18465 T1671 oascc.ZkStateReader.updateClusterState Updating cloud state from ZooKeeper... 
[junit4:junit4]   2>  C118_STATE=coll:collection1 core:collection1 props:{shard=shard1, state=recovering, core=collection1, collection=collection1, node_name=127.0.0.1:56856_, base_url=http://127.0.0.1:56856}
[junit4:junit4]   2> 19213 T1746 C118 P56856 oasc.RecoveryStrategy.doRecovery Attempting to PeerSync from http://127.0.0.1:58324/collection1/ core=collection1 - recoveringAfterStartup=true
[junit4:junit4]   2> 19213 T1746 C118 P56856 oasu.PeerSync.sync PeerSync: core=collection1 url=http://127.0.0.1:56856 START replicas=[http://127.0.0.1:58324/collection1/] nUpdates=100
[junit4:junit4]   2> 19213 T1746 C118 P56856 oasu.PeerSync.sync WARNING no frame of reference to tell of we've missed updates
[junit4:junit4]   2> 19214 T1746 C118 P56856 oasc.RecoveryStrategy.doRecovery PeerSync Recovery was not successful - trying replication. core=collection1
[junit4:junit4]   2> 19214 T1746 C118 P56856 oasc.RecoveryStrategy.doRecovery Starting Replication Recovery. core=collection1
[junit4:junit4]   2> 19214 T1746 C118 P56856 oasc.RecoveryStrategy.doRecovery Begin buffering updates. core=collection1
[junit4:junit4]   2> 19214 T1746 C118 P56856 oasu.UpdateLog.bufferUpdates Starting to buffer updates. FSUpdateLog{state=ACTIVE, tlog=null}
[junit4:junit4]   2> 19214 T1746 C118 P56856 oasc.RecoveryStrategy.replicate Attempting to replicate from http://127.0.0.1:58324/collection1/. core=collection1
[junit4:junit4]   2> 19214 T1746 C118 P56856 oascsi.HttpClientUtil.createClient Creating new http client, config:maxConnections=128&maxConnectionsPerHost=32&followRedirects=false
[junit4:junit4]   2> 19216 T1704 C119 P58324 REQ /get {getVersions=100&distrib=false&wt=javabin&qt=/get&version=2} status=0 QTime=0 
[junit4:junit4]   2> 19225 T1708 C119 P58324 oasu.DirectUpdateHandler2.commit start commit{,optimize=false,openSearcher=false,waitSearcher=true,expungeDeletes=false,softCommit=false,prepareCommit=false}
[junit4:junit4]   2> 19226 T1708 C119 P58324 oasc.SolrDeletionPolicy.onCommit SolrDeletionPolicy.onCommit: commits:num=2
[junit4:junit4]   2> 		commit{dir=MockDirWrapper(org.apache.lucene.store.RAMDirectory@2cac0ca8 lockFactory=org.apache.lucene.store.NativeFSLockFactory@23263ff4),segFN=segments_2,generation=2,filenames=[segments_2]
[junit4:junit4]   2> 		commit{dir=MockDirWrapper(org.apache.lucene.store.RAMDirectory@2cac0ca8 lockFactory=org.apache.lucene.store.NativeFSLockFactory@23263ff4),segFN=segments_3,generation=3,filenames=[segments_3]
[junit4:junit4]   2> 19227 T1708 C119 P58324 oasc.SolrDeletionPolicy.updateCommits newest commit = 3[segments_3]
[junit4:junit4]   2> 19227 T1708 C119 P58324 oasc.CachingDirectoryFactory.close Releasing directory:/usr/home/hudson/hudson-slave/workspace/Lucene-Solr-Tests-4.x-Java6/solr/build/solr-core/test/J0/./org.apache.solr.cloud.SyncSliceTest-1362590698293/jetty1
[junit4:junit4]   2> 19227 T1708 C119 P58324 oasu.DirectUpdateHandler2.commit end_commit_flush
[junit4:junit4]   2> 19228 T1708 C119 P58324 /update {waitSearcher=true&openSearcher=false&commit=true&wt=javabin&commit_end_point=true&version=2&softCommit=false} {commit=} 0 4
[junit4:junit4]   2> 19229 T1746 C118 P56856 oash.ReplicationHandler.inform Commits will be reserved for  10000
[junit4:junit4]   2> 19229 T1746 C118 P56856 oash.SnapPuller.<init>  No value set for 'pollInterval'. Timer Task not started.
[junit4:junit4]   2> 19231 T1706 C119 P58324 REQ /replication {command=indexversion&qt=/replication&wt=javabin&version=2} status=0 QTime=0 
[junit4:junit4]   2> 19232 T1746 C118 P56856 oash.SnapPuller.fetchLatestIndex Master's generation: 3
[junit4:junit4]   2> 19232 T1746 C118 P56856 oash.SnapPuller.fetchLatestIndex Slave's generation: 1
[junit4:junit4]   2> 19232 T1746 C118 P56856 oash.SnapPuller.fetchLatestIndex Starting replication process
[junit4:junit4]   2> 19234 T1706 C119 P58324 oasc.CachingDirectoryFactory.close Releasing directory:/usr/home/hudson/hudson-slave/workspace/Lucene-Solr-Tests-4.x-Java6/solr/build/solr-core/test/J0/./org.apache.solr.cloud.SyncSliceTest-1362590698293/jetty1
[junit4:junit4]   2> 19234 T1706 C119 P58324 oasc.CachingDirectoryFactory.close Releasing directory:/usr/home/hudson/hudson-slave/workspace/Lucene-Solr-Tests-4.x-Java6/solr/build/solr-core/test/J0/./org.apache.solr.cloud.SyncSliceTest-1362590698293/jetty1/index
[junit4:junit4]   2> 19235 T1706 C119 P58324 REQ /replication {command=filelist&qt=/replication&wt=javabin&generation=3&version=2} status=0 QTime=1 
[junit4:junit4]   2> 19235 T1746 C118 P56856 oash.SnapPuller.fetchLatestIndex Number of files in latest index in master: 1
[junit4:junit4]   2> 19236 T1746 C118 P56856 oasc.CachingDirectoryFactory.get return new directory for /usr/home/hudson/hudson-slave/workspace/Lucene-Solr-Tests-4.x-Java6/solr/build/solr-core/test/J0/./org.apache.solr.cloud.SyncSliceTest-1362590698293/jetty3/index.20130306142517523 forceNew:false
[junit4:junit4]   2> 19237 T1746 C118 P56856 oasc.CachingDirectoryFactory.close Releasing directory:/usr/home/hudson/hudson-slave/workspace/Lucene-Solr-Tests-4.x-Java6/solr/build/solr-core/test/J0/./org.apache.solr.cloud.SyncSliceTest-1362590698293/jetty3
[junit4:junit4]   2> 19237 T1746 C118 P56856 oash.SnapPuller.fetchLatestIndex Starting download to MockDirWrapper(org.apache.lucene.store.RAMDirectory@33e5d8d0 lockFactory=org.apache.lucene.store.NativeFSLockFactory@3333d316) fullCopy=false
[junit4:junit4]   2> 19239 T1706 C119 P58324 REQ /replication {file=segments_3&command=filecontent&checksum=true&wt=filestream&qt=/replication&generation=3} status=0 QTime=0 
[junit4:junit4]   2> 19240 T1746 C118 P56856 oasc.CachingDirectoryFactory.close Releasing directory:/usr/home/hudson/hudson-slave/workspace/Lucene-Solr-Tests-4.x-Java6/solr/build/solr-core/test/J0/./org.apache.solr.cloud.SyncSliceTest-1362590698293/jetty3/index
[junit4:junit4]   2> 19240 T1746 C118 P56856 oash.SnapPuller.fetchLatestIndex Total time taken for download : 0 secs
[junit4:junit4]   2> 19241 T1746 C118 P56856 oasc.CachingDirectoryFactory.close Releasing directory:/usr/home/hudson/hudson-slave/workspace/Lucene-Solr-Tests-4.x-Java6/solr/build/solr-core/test/J0/./org.apache.solr.cloud.SyncSliceTest-1362590698293/jetty3
[junit4:junit4]   2> 19241 T1746 C118 P56856 oasc.CachingDirectoryFactory.close Releasing directory:/usr/home/hudson/hudson-slave/workspace/Lucene-Solr-Tests-4.x-Java6/solr/build/solr-core/test/J0/./org.apache.solr.cloud.SyncSliceTest-1362590698293/jetty3
[junit4:junit4]   2> 19241 T1746 C118 P56856 oasu.DefaultSolrCoreState.newIndexWriter Creating new IndexWriter...
[junit4:junit4]   2> 19242 T1746 C118 P56856 oasu.DefaultSolrCoreState.newIndexWriter Waiting until IndexWriter is unused... core=collection1
[junit4:junit4]   2> 19242 T1746 C118 P56856 oasc.CachingDirectoryFactory.close Releasing directory:/usr/home/hudson/hudson-slave/workspace/Lucene-Solr-Tests-4.x-Java6/solr/build/solr-core/test/J0/./org.apache.solr.cloud.SyncSliceTest-1362590698293/jetty3
[junit4:junit4]   2> 19244 T1746 C118 P56856 oasc.SolrDeletionPolicy.onInit SolrDeletionPolicy.onInit: commits:num=2
[junit4:junit4]   2> 		commit{dir=MockDirWrapper(org.apache.lucene.store.RAMDirectory@6c440b8 lockFactory=org.apache.lucene.store.NativeFSLockFactory@701e7888),segFN=segments_1,generation=1,filenames=[segments_1]
[junit4:junit4]   2> 		commit{dir=MockDirWrapper(org.apache.lucene.store.RAMDirectory@6c440b8 lockFactory=org.apache.lucene.store.NativeFSLockFactory@701e7888),segFN=segments_3,generation=3,filenames=[segments_3]
[junit4:junit4]   2> 19244 T1746 C118 P56856 oasc.SolrDeletionPolicy.updateCommits newest commit = 3[segments_3]
[junit4:junit4]   2> 19244 T1746 C118 P56856 oasu.DefaultSolrCoreState.newIndexWriter New IndexWriter is ready to be used.
[junit4:junit4]   2> 19244 T1746 C118 P56856 oasc.CachingDirectoryFactory.close Releasing directory:/usr/home/hudson/hudson-slave/workspace/Lucene-Solr-Tests-4.x-Java6/solr/build/solr-core/test/J0/./org.apache.solr.cloud.SyncSliceTest-1362590698293/jetty3
[junit4:junit4]   2> 19245 T1746 C118 P56856 oass.SolrIndexSearcher.<init> Opening Searcher@6419469 main
[junit4:junit4]   2> 19246 T1745 oasc.SolrCore.registerSearcher [collection1] Registered new searcher Searcher@6419469 main{StandardDirectoryReader(segments_3:1:nrt)}
[junit4:junit4]   2> 19246 T1745 oasc.CachingDirectoryFactory.close Releasing directory:/usr/home/hudson/hudson-slave/workspace/Lucene-Solr-Tests-4.x-Java6/solr/build/solr-core/test/J0/./org.apache.solr.cloud.SyncSliceTest-1362590698293/jetty3/index
[junit4:junit4]   2> 19246 T1746 C118 P56856 oash.SnapPuller.fetchLatestIndex removing temporary index download directory files MockDirWrapper(org.apache.lucene.store.RAMDirectory@33e5d8d0 lockFactory=org.apache.lucene.store.NativeFSLockFactory@3333d316)
[junit4:junit4]   2> 19246 T1746 C118 P56856 oasc.CachingDirectoryFactory.close Releasing directory:/usr/home/hudson/hudson-slave/workspace/Lucene-Solr-Tests-4.x-Java6/solr/build/solr-core/test/J0/./org.apache.solr.cloud.SyncSliceTest-1362590698293/jetty3/index.20130306142517523
[junit4:junit4]   2> 19247 T1746 C118 P56856 oasc.CachingDirectoryFactory.close Releasing directory:/usr/home/hudson/hudson-slave/workspace/Lucene-Solr-Tests-4.x-Java6/solr/build/solr-core/test/J0/./org.apache.solr.cloud.SyncSliceTest-1362590698293/jetty3/index
[junit4:junit4]   2> 19247 T1746 C118 P56856 oasc.RecoveryStrategy.replay No replay needed. core=collection1
[junit4:junit4]   2> 19247 T1746 C118 P56856 oasc.RecoveryStrategy.doRecovery Replication Recovery was successful - registering as Active. core=collection1
[junit4:junit4]   2> 19247 T1746 C118 P56856 oasc.ZkController.publish publishing core=collection1 state=active
[junit4:junit4]   2> 19247 T1746 C118 P56856 oasc.ZkController.publish numShards not found on descriptor - reading it from system property
[junit4:junit4]   2> 19249 T1746 C118 P56856 oasc.RecoveryStrategy.doRecovery Finished recovery process. core=collection1
[junit4:junit4]   2> 19292 T1694 oascc.ZkStateReader.updateClusterState Updating cloud state from ZooKeeper... 
[junit4:junit4]   2> 19293 T1694 oasc.Overseer$ClusterStateUpdater.updateState Update state numShards=1 message={
[junit4:junit4]   2> 	  "operation":"state",
[junit4:junit4]   2> 	  "core_node_name":null,
[junit4:junit4]   2> 	  "numShards":"1",
[junit4:junit4]   2> 	  "shard":"shard1",
[junit4:junit4]   2> 	  "roles":null,
[junit4:junit4]   2> 	  "state":"recovering",
[junit4:junit4]   2> 	  "core":"collection1",
[junit4:junit4]   2> 	  "collection":"collection1",
[junit4:junit4]   2> 	  "node_name":"127.0.0.1:48702_",
[junit4:junit4]   2> 	  "base_url":"http://127.0.0.1:48702"}
[junit4:junit4]   2> 19296 T1694 oasc.Overseer$ClusterStateUpdater.updateState Update state numShards=1 message={
[junit4:junit4]   2> 	  "operation":"state",
[junit4:junit4]   2> 	  "core_node_name":null,
[junit4:junit4]   2> 	  "numShards":"1",
[junit4:junit4]   2> 	  "shard":"shard1",
[junit4:junit4]   2> 	  "roles":null,
[junit4:junit4]   2> 	  "state":"active",
[junit4:junit4]   2> 	  "core":"collection1",
[junit4:junit4]   2> 	  "collection":"collection1",
[junit4:junit4]   2> 	  "node_name":"127.0.0.1:56856_",
[junit4:junit4]   2> 	  "base_url":"http://127.0.0.1:56856"}
[junit4:junit4]   2> 19308 T1693 oascc.ZkStateReader$2.process A cluster state change: WatchedEvent state:SyncConnected type:NodeDataChanged path:/clusterstate.json, has occurred - updating... (live nodes size: 5)
[junit4:junit4]   2> 19308 T1759 oascc.ZkStateReader$2.process A cluster state change: WatchedEvent state:SyncConnected type:NodeDataChanged path:/clusterstate.json, has occurred - updating... (live nodes size: 5)
[junit4:junit4]   2> 19308 T1699 oascc.ZkStateReader$2.process A cluster state change: WatchedEvent state:SyncConnected type:NodeDataChanged path:/clusterstate.json, has occurred - updating... (live nodes size: 5)
[junit4:junit4]   2> 19308 T1743 oascc.ZkStateReader$2.process A cluster state change: WatchedEvent state:SyncConnected type:NodeDataChanged path:/clusterstate.json, has occurred - updating... (live nodes size: 5)
[junit4:junit4]   2> 19308 T1727 oascc.ZkStateReader$2.process A cluster state change: WatchedEvent state:SyncConnected type:NodeDataChanged path:/clusterstate.json, has occurred - updating... (live nodes size: 5)
[junit4:junit4]   2> 19308 T1712 oascc.ZkStateReader$2.process A cluster state change: WatchedEvent state:SyncConnected type:NodeDataChanged path:/clusterstate.json, has occurred - updating... (live nodes size: 5)
[junit4:junit4]   2> 19464 T1707 oass.SolrDispatchFilter.handleAdminRequest /admin/cores {coreNodeName=127.0.0.1:48702__collection1&state=recovering&nodeName=127.0.0.1:48702_&action=PREPRECOVERY&checkLive=true&core=collection1&wt=javabin&onlyIfLeader=true&version=2} status=0 QTime=1001 
[junit4:junit4]   2> 19467 T1671 oascc.ZkStateReader.updateClusterState Updating cloud state from ZooKeeper... 
[junit4:junit4]   2> 20469 T1671 oascc.ZkStateReader.updateClusterState Updating cloud state from ZooKeeper... 
[junit4:junit4]   2>  C120_STATE=coll:collection1 core:collection1 props:{shard=shard1, state=recovering, core=collection1, collection=collection1, node_name=127.0.0.1:48702_, base_url=http://127.0.0.1:48702}
[junit4:junit4]   2> 21465 T1764 C120 P48702 oasc.RecoveryStrategy.doRecovery Attempting to PeerSync from http://127.0.0.1:58324/collection1/ core=collection1 - recoveringAfterStartup=true
[junit4:junit4]   2> 21465 T1764 C120 P48702 oasu.PeerSync.sync PeerSync: core=collection1 url=http://127.0.0.1:48702 START replicas=[http://127.0.0.1:58324/collection1/] nUpdates=100
[junit4:junit4]   2> 21466 T1764 C120 P48702 oasu.PeerSync.sync WARNING no frame of reference to tell of we've missed updates
[junit4:junit4]   2> 21466 T1764 C120 P48702 oasc.RecoveryStrategy.doRecovery PeerSync Recovery was not successful - trying replication. core=collection1
[junit4:junit4]   2> 21466 T1764 C120 P48702 oasc.RecoveryStrategy.doRecovery Starting Replication Recovery. core=collection1
[junit4:junit4]   2> 21466 T1764 C120 P48702 oasc.RecoveryStrategy.doRecovery Begin buffering updates. core=collection1
[junit4:junit4]   2> 21466 T1764 C120 P48702 oasu.UpdateLog.bufferUpdates Starting to buffer updates. FSUpdateLog{state=ACTIVE, tlog=null}
[junit4:junit4]   2> 21466 T1764 C120 P48702 oasc.RecoveryStrategy.replicate Attempting to replicate from http://127.0.0.1:58324/collection1/. core=collection1
[junit4:junit4]   2> 21466 T1764 C120 P48702 oascsi.HttpClientUtil.createClient Creating new http client, config:maxConnections=128&maxConnectionsPerHost=32&followRedirects=false
[junit4:junit4]   2> 21468 T1704 C119 P58324 REQ /get {getVersions=100&distrib=false&wt=javabin&qt=/get&version=2} status=0 QTime=0 
[junit4:junit4]   2> 21471 T1671 oascc.ZkStateReader.updateClusterState Updating cloud state from ZooKeeper... 
[junit4:junit4]   2> 21477 T1702 C119 P58324 oasu.DirectUpdateHandler2.commit start commit{,optimize=false,openSearcher=false,waitSearcher=true,expungeDeletes=false,softCommit=false,prepareCommit=false}
[junit4:junit4]   2> 21477 T1702 C119 P58324 oasc.SolrDeletionPolicy.onCommit SolrDeletionPolicy.onCommit: commits:num=3
[junit4:junit4]   2> 		commit{dir=MockDirWrapper(org.apache.lucene.store.RAMDirectory@2cac0ca8 lockFactory=org.apache.lucene.store.NativeFSLockFactory@23263ff4),segFN=segments_2,generation=2,filenames=[segments_2]
[junit4:junit4]   2> 		commit{dir=MockDirWrapper(org.apache.lucene.store.RAMDirectory@2cac0ca8 lockFactory=org.apache.lucene.store.NativeFSLockFactory@23263ff4),segFN=segments_3,generation=3,filenames=[segments_3]
[junit4:junit4]   2> 		commit{dir=MockDirWrapper(org.apache.lucene.store.RAMDirectory@2cac0ca8 lockFactory=org.apache.lucene.store.NativeFSLockFactory@23263ff4),segFN=segments_4,generation=4,filenames=[segments_4]
[junit4:junit4]   2> 21478 T1702 C119 P58324 oasc.SolrDeletionPolicy.updateCommits newest commit = 4[segments_4]
[junit4:junit4]   2> 21478 T1702 C119 P58324 oasc.CachingDirectoryFactory.close Releasing directory:/usr/home/hudson/hudson-slave/workspace/Lucene-Solr-Tests-4.x-Java6/solr/build/solr-core/test/J0/./org.apache.solr.cloud.SyncSliceTest-1362590698293/jetty1
[junit4:junit4]   2> 21479 T1702 C119 P58324 oasu.DirectUpdateHandler2.commit end_commit_flush
[junit4:junit4]   2> 21479 T1702 C119 P58324 /update {waitSearcher=true&openSearcher=false&commit=true&wt=javabin&commit_end_point=true&version=2&softCommit=false} {commit=} 0 2
[junit4:junit4]   2> 21480 T1764 C120 P48702 oash.ReplicationHandler.inform Commits will be reserved for  10000
[junit4:junit4]   2> 21480 T1764 C120 P48702 oash.SnapPuller.<init>  No value set for 'pollInterval'. Timer Task not started.
[junit4:junit4]   2> 21482 T1706 C119 P58324 REQ /replication {command=indexversion&qt=/replication&wt=javabin&version=2} status=0 QTime=0 
[junit4:junit4]   2> 21483 T1764 C120 P48702 oash.SnapPuller.fetchLatestIndex Master's generation: 4
[junit4:junit4]   2> 21483 T1764 C120 P48702 oash.SnapPuller.fetchLatestIndex Slave's generation: 1
[junit4:junit4]   2> 21483 T1764 C120 P48702 oash.SnapPuller.fetchLatestIndex Starting replication process
[junit4:junit4]   2> 21485 T1706 C119 P58324 oasc.CachingDirectoryFactory.close Releasing directory:/usr/home/hudson/hudson-slave/workspace/Lucene-Solr-Tests-4.x-Java6/solr/build/solr-core/test/J0/./org.apache.solr.cloud.SyncSliceTest-1362590698293/jetty1
[junit4:junit4]   2> 21485 T1706 C119 P58324 oasc.CachingDirectoryFactory.close Releasing directory:/usr/home/hudson/hudson-slave/workspace/Lucene-Solr-Tests-4.x-Java6/solr/build/solr-core/test/J0/./org.apache.solr.cloud.SyncSliceTest-1362590698293/jetty1/index
[junit4:junit4]   2> 21486 T1706 C119 P58324 REQ /replication {command=filelist&qt=/replication&wt=javabin&generation=4&version=2} status=0 QTime=1 
[junit4:junit4]   2> 21486 T1764 C120 P48702 oash.SnapPuller.fetchLatestIndex Number of files in latest index in master: 1
[junit4:junit4]   2> 21488 T1764 C120 P48702 oasc.CachingDirectoryFactory.get return new directory for /usr/home/hudson/hudson-slave/workspace/Lucene-Solr-Tests-4.x-Java6/solr/build/solr-core/test/J0/./org.apache.solr.cloud.SyncSliceTest-1362590698293/jetty4/index.20130306142519774 forceNew:false
[junit4:junit4]   2> 21488 T1764 C120 P48702 oasc.CachingDirectoryFactory.close Releasing directory:/usr/home/hudson/hudson-slave/workspace/Lucene-Solr-Tests-4.x-Java6/solr/build/solr-core/test/J0/./org.apache.solr.cloud.SyncSliceTest-1362590698293/jetty4
[junit4:junit4]   2> 21488 T1764 C120 P48702 oash.SnapPuller.fetchLatestIndex Starting download to MockDirWrapper(org.apache.lucene.store.RAMDirectory@37aabe3 lockFactory=org.apache.lucene.store.NativeFSLockFactory@71a466e0) fullCopy=false
[junit4:junit4]   2> 21491 T1706 C119 P58324 REQ /replication {file=segments_4&command=filecontent&checksum=true&wt=filestream&qt=/replication&generation=4} status=0 QTime=0 
[junit4:junit4]   2> 21492 T1764 C120 P48702 oasc.CachingDirectoryFactory.close Releasing directory:/usr/home/hudson/hudson-slave/workspace/Lucene-Solr-Tests-4.x-Java6/solr/build/solr-core/test/J0/./org.apache.solr.cloud.SyncSliceTest-1362590698293/jetty4/index
[junit4:junit4]   2> 21492 T1764 C120 P48702 oash.SnapPuller.fetchLatestIndex Total time taken for download : 0 secs
[junit4:junit4]   2> 21493 T1764 C120 P48702 oasc.CachingDirectoryFactory.close Releasing directory:/usr/home/hudson/hudson-slave/workspace/Lucene-Solr-Tests-4.x-Java6/solr/build/solr-core/test/J0/./org.apache.solr.cloud.SyncSliceTest-1362590698293/jetty4
[junit4:junit4]   2> 21493 T1764 C120 P48702 oasc.CachingDirectoryFactory.close Releasing directory:/usr/home/hudson/hudson-slave/workspace/Lucene-Solr-Tests-4.x-Java6/solr/build/solr-core/test/J0/./org.apache.solr.cloud.SyncSliceTest-1362590698293/jetty4
[junit4:junit4]   2> 21493 T1764 C120 P48702 oasu.DefaultSolrCoreState.newIndexWriter Creating new IndexWriter...
[junit4:junit4]   2> 21494 T1764 C120 P48702 oasu.DefaultSolrCoreState.newIndexWriter Waiting until IndexWriter is unused... core=collection1
[junit4:junit4]   2> 21494 T1764 C120 P48702 oasc.CachingDirectoryFactory.close Releasing directory:/usr/home/hudson/hudson-slave/workspace/Lucene-Solr-Tests-4.x-Java6/solr/build/solr-core/test/J0/./org.apache.solr.cloud.SyncSliceTest-1362590698293/jetty4
[junit4:junit4]   2> 21495 T1764 C120 P48702 oasc.SolrDeletionPolicy.onInit SolrDeletionPolicy.onInit: commits:num=2
[junit4:junit4]   2> 		commit{dir=MockDirWrapper(org.apache.lucene.store.RAMDirectory@4e44462d lockFactory=org.apache.lucene.store.NativeFSLockFactory@2a15c952),segFN=segments_1,generation=1,filenames=[segments_1]
[junit4:junit4]   2> 		commit{dir=MockDirWrapper(org.apache.lucene.store.RAMDirectory@4e44462d lockFactory=org.apache.lucene.store.NativeFSLockFactory@2a15c952),segFN=segments_4,generation=4,filenames=[segments_4]
[junit4:junit4]   2> 21496 T1764 C120 P48702 oasc.SolrDeletionPolicy.updateCommits newest commit = 4[segments_4]
[junit4:junit4]   2> 21496 T1764 C120 P48702 oasu.DefaultSolrCoreState.newIndexWriter New IndexWriter is ready to be used.
[junit4:junit4]   2> 21496 T1764 C120 P48702 oasc.CachingDirectoryFactory.close Releasing directory:/usr/home/hudson/hudson-slave/workspace/Lucene-Solr-Tests-4.x-Java6/solr/build/solr-core/test/J0/./org.apache.solr.cloud.SyncSliceTest-1362590698293/jetty4
[junit4:junit4]   2> 21497 T1764 C120 P48702 oass.SolrIndexSearcher.<init> Opening Searcher@4758c26e main
[junit4:junit4]   2> 21497 T1763 oasc.SolrCore.registerSearcher [collection1] Registered new searcher Searcher@4758c26e main{StandardDirectoryReader(segments_4:1:nrt)}
[junit4:junit4]   2> 21498 T1763 oasc.CachingDirectoryFactory.close Releasing directory:/usr/home/hudson/hudson-slave/workspace/Lucene-Solr-Tests-4.x-Java6/solr/build/solr-core/test/J0/./org.apache.solr.cloud.SyncSliceTest-1362590698293/jetty4/index
[junit4:junit4]   2> 21498 T1764 C120 P48702 oash.SnapPuller.fetchLatestIndex removing temporary index download directory files MockDirWrapper(org.apache.lucene.store.RAMDirectory@37aabe3 lockFactory=org.apache.lucene.store.NativeFSLockFactory@71a466e0)
[junit4:junit4]   2> 21498 T1764 C120 P48702 oasc.CachingDirectoryFactory.close Releasing directory:/usr/home/hudson/hudson-slave/workspace/Lucene-Solr-Tests-4.x-Java6/solr/build/solr-core/test/J0/./org.apache.solr.cloud.SyncSliceTest-1362590698293/jetty4/index.20130306142519774
[junit4:junit4]   2> 21498 T1764 C120 P48702 oasc.CachingDirectoryFactory.close Releasing directory:/usr/home/hudson/hudson-slave/workspace/Lucene-Solr-Tests-4.x-Java6/solr/build/solr-core/test/J0/./org.apache.solr.cloud.SyncSliceTest-1362590698293/jetty4/index
[junit4:junit4]   2> 21499 T1764 C120 P48702 oasc.RecoveryStrategy.replay No replay needed. core=collection1
[junit4:junit4]   2> 21499 T1764 C120 P48702 oasc.RecoveryStrategy.doRecovery Replication Recovery was successful - registering as Active. core=collection1
[junit4:junit4]   2> 21499 T1764 C120 P48702 oasc.ZkController.publish publishing core=collection1 state=active
[junit4:junit4]   2> 21499 T1764 C120 P48702 oasc.ZkController.publish numShards not found on descriptor - reading it from system property
[junit4:junit4]   2> 21532 T1764 C120 P48702 oasc.RecoveryStrategy.doRecovery Finished recovery process. core=collection1
[junit4:junit4]   2> 22316 T1694 oascc.ZkStateReader.updateClusterState Updating cloud state from ZooKeeper... 
[junit4:junit4]   2> 22317 T1694 oasc.Overseer$ClusterStateUpdater.updateState Update state numShards=1 message={
[junit4:junit4]   2> 	  "operation":"state",
[junit4:junit4]   2> 	  "core_node_name":null,
[junit4:junit4]   2> 	  "numShards":"1",
[junit4:junit4]   2> 	  "shard":"shard1",
[junit4:junit4]   2> 	  "roles":null,
[junit4:junit4]   2> 	  "state":"active",
[junit4:junit4]   2> 	  "core":"collection1",
[junit4:junit4]   2> 	  "collection":"collection1",
[junit4:junit4]   2> 	  "node_name":"127.0.0.1:48702_",
[junit4:junit4]   2> 	  "base_url":"http://127.0.0.1:48702"}
[junit4:junit4]   2> 22334 T1693 oascc.ZkStateReader$2.process A cluster state change: WatchedEvent state:SyncConnected type:NodeDataChanged path:/clusterstate.json, has occurred - updating... (live nodes size: 5)
[junit4:junit4]   2> 22334 T1759 oascc.ZkStateReader$2.process A cluster state change: WatchedEvent state:SyncConnected type:NodeDataChanged path:/clusterstate.json, has occurred - updating... (live nodes size: 5)
[junit4:junit4]   2> 22334 T1743 oascc.ZkStateReader$2.process A cluster state change: WatchedEvent state:SyncConnected type:NodeDataChanged path:/clusterstate.json, has occurred - updating... (live nodes size: 5)
[junit4:junit4]   2> 22334 T1699 oascc.ZkStateReader$2.process A cluster state change: WatchedEvent state:SyncConnected type:NodeDataChanged path:/clusterstate.json, has occurred - updating... (live nodes size: 5)
[junit4:junit4]   2> 22334 T1712 oascc.ZkStateReader$2.process A cluster state change: WatchedEvent state:SyncConnected type:NodeDataChanged path:/clusterstate.json, has occurred - updating... (live nodes size: 5)
[junit4:junit4]   2> 22334 T1727 oascc.ZkStateReader$2.process A cluster state change: WatchedEvent state:SyncConnected type:NodeDataChanged path:/clusterstate.json, has occurred - updating... (live nodes size: 5)
[junit4:junit4]   2> 22473 T1671 oascc.ZkStateReader.updateClusterState Updating cloud state from ZooKeeper... 
[junit4:junit4]   2> 22474 T1671 oasc.AbstractDistribZkTestBase.waitForRecoveriesToFinish Recoveries finished - collection: collection1
[junit4:junit4]   2> ASYNC  NEW_CORE C121 name=collection1 org.apache.solr.core.SolrCore@6ec226f1 url=http://127.0.0.1:14233/collection1 node=127.0.0.1:14233_ C121_STATE=coll:control_collection core:collection1 props:{shard=shard1, state=active, core=collection1, collection=control_collection, node_name=127.0.0.1:14233_, base_url=http://127.0.0.1:14233, leader=true}
[junit4:junit4]   2> 22481 T1683 C121 P14233 oasu.DirectUpdateHandler2.commit start commit{,optimize=false,openSearcher=true,waitSearcher=true,expungeDeletes=false,softCommit=false,prepareCommit=false}
[junit4:junit4]   2> 22482 T1683 C121 P14233 oasc.CachingDirectoryFactory.close Releasing directory:/usr/home/hudson/hudson-slave/workspace/Lucene-Solr-Tests-4.x-Java6/solr/build/solr-core/test/J0/./org.apache.solr.cloud.SyncSliceTest-1362590698293/control/data
[junit4:junit4]   2> 22484 T1683 C121 P14233 oasc.SolrDeletionPolicy.onInit SolrDeletionPolicy.onInit: commits:num=1
[junit4:junit4]   2> 		commit{dir=MockDirWrapper(org.apache.lucene.store.RAMDirectory@3b91372f lockFactory=org.apache.lucene.store.NativeFSLockFactory@1355725b),segFN=segments_1,generation=1,filenames=[segments_1]
[junit4:junit4]   2> 22485 T1683 C121 P14233 oasc.SolrDeletionPolicy.updateCommits newest commit = 1[segments_1]
[junit4:junit4]   2> 22486 T1683 C121 P14233 oasc.SolrDeletionPolicy.onCommit SolrDeletionPolicy.onCommit: commits:num=2
[junit4:junit4]   2> 		commit{dir=MockDirWrapper(org.apache.lucene.store.RAMDirectory@3b91372f lockFactory=org.apache.lucene.store.NativeFSLockFactory@1355725b),segFN=segments_1,generation=1,filenames=[segments_1]
[junit4:junit4]   2> 		commit{dir=MockDirWrapper(org.apache.lucene.store.RAMDirectory@3b91372f lockFactory=org.apache.lucene.store.NativeFSLockFactory@1355725b),segFN=segments_2,generation=2,filenames=[segments_2]
[junit4:junit4]   2> 22486 T1683 C121 P14233 oasc.SolrDeletionPolicy.updateCommits newest commit = 2[segments_2]
[junit4:junit4]   2> 22487 T1683 C121 P14233 oasc.CachingDirectoryFactory.close Releasing directory:/usr/home/hudson/hudson-slave/workspace/Lucene-Solr-Tests-4.x-Java6/solr/build/solr-core/test/J0/./org.apache.solr.cloud.SyncSliceTest-1362590698293/control/data
[junit4:junit4]   2> 22487 T1683 C121 P14233 oass.SolrIndexSearcher.<init> Opening Searcher@7d44673e main
[junit4:junit4]   2> 22487 T1683 C121 P14233 oasu.DirectUpdateHandler2.commit end_commit_flush
[junit4:junit4]   2> 22488 T1697 oasc.SolrCore.registerSearcher [collection1] Registered new searcher Searcher@7d44673e main{StandardDirectoryReader(segments_1:1)}
[junit4:junit4]   2> 22489 T1697 oasc.CachingDirectoryFactory.close Releasing directory:/usr/home/hudson/hudson-slave/workspace/Lucene-Solr-Tests-4.x-Java6/solr/build/solr-core/test/J0/./org.apache.solr.cloud.SyncSliceTest-1362590698293/control/data/index
[junit4:junit4]   2> 22489 T1683 C121 P14233 /update {waitSearcher=true&commit=true&wt=javabin&version=2&softCommit=false} {commit=} 0 8
[junit4:junit4]   2> 22499 T1705 C119 P58324 oasu.DirectUpdateHandler2.commit start commit{,optimize=false,openSearcher=true,waitSearcher=true,expungeDeletes=false,softCommit=false,prepareCommit=false}
[junit4:junit4]   2> 22499 T1705 C119 P58324 oasc.SolrDeletionPolicy.onCommit SolrDeletionPolicy.onCommit: commits:num=4
[junit4:junit4]   2> 		commit{dir=MockDirWrapper(org.apache.lucene.store.RAMDirectory@2cac0ca8 lockFactory=org.apache.lucene.store.NativeFSLockFactory@23263ff4),segFN=segments_2,generation=2,filenames=[segments_2]
[junit4:junit4]   2> 		commit{dir=MockDirWrapper(org.apache.lucene.store.RAMDirectory@2cac0ca8 lockFactory=org.apache.lucene.store.NativeFSLockFactory@23263ff4),segFN=segments_3,generation=3,filenames=[segments_3]
[junit4:junit4]   2> 		commit{dir=MockDirWrapper(org.apache.lucene.store.RAMDirectory@2cac0ca8 lockFactory=org.apache.lucene.store.NativeFSLockFactory@23263ff4),segFN=segments_4,generation=4,filenames=[segments_4]
[junit4:junit4]   2> 		commit{dir=MockDirWrapper(org.apache.lucene.store.RAMDirectory@2cac0ca8 lockFactory=org.apache.lucene.store.NativeFSLockFactory@23263ff4),segFN=segments_5,generation=5,filenames=[segments_5]
[junit4:junit4]   2> 22500 T1705 C119 P58324 oasc.SolrDeletionPolicy.updateCommits newest commit = 5[segments_5]
[junit4:junit4]   2> 22500 T1705 C119 P58324 oasc.CachingDirectoryFactory.close Releasing directory:/usr/home/hudson/hudson-slave/workspace/Lucene-Solr-Tests-4.x-Java6/solr/build/solr-core/test/J0/./org.apache.solr.cloud.SyncSliceTest-1362590698293/jetty1
[junit4:junit4]   2> 22501 T1705 C119 P58324 oass.SolrIndexSearcher.<init> Opening Searcher@6c3d2056 main
[junit4:junit4]   2> 22501 T1705 C119 P58324 oasc.CachingDirectoryFactory.close Releasing directory:/usr/home/hudson/hudson-slave/workspace/Lucene-Solr-Tests-4.x-Java6/solr/build/solr-core/test/J0/./org.apache.solr.cloud.SyncSliceTest-1362590698293/jetty1/index
[junit4:junit4]   2> 22501 T1705 C119 P58324 oasu.DirectUpdateHandler2.commit end_commit_flush
[junit4:junit4]   2> 22502 T1714 oasc.SolrCore.registerSearcher [collection1] Registered new searcher Searcher@6c3d2056 main{StandardDirectoryReader(segments_2:1:nrt)}
[junit4:junit4]   2> 22503 T1714 oasc.CachingDirectoryFactory.close Releasing directory:/usr/home/hudson/hudson-slave/workspace/Lucene-Solr-Tests-4.x-Java6/solr/build/solr-core/test/J0/./org.apache.solr.cloud.SyncSliceTest-1362590698293/jetty1/index
[junit4:junit4]   2> 22503 T1705 C119 P58324 oasu.SolrCmdDistributor.distribCommit Distrib commit to:[StdNode: http://127.0.0.1:58450/collection1/, StdNode: http://127.0.0.1:56856/collection1/, StdNode: http://127.0.0.1:48702/collection1/] params:commit_end_point=true&commit=true&softCommit=false&waitSearcher=true&expungeDeletes=false
[junit4:junit4]   2>  C118_STATE=coll:collection1 core:collection1 props:{shard=shard1, state=active, core=collection1, collection=collection1, node_name=127.0.0.1:56856_, base_url=http://127.0.0.1:56856}
[junit4:junit4]   2> 22512 T1733 C118 P56856 oasu.DirectUpdateHandler2.commit start commit{,optimize=false,openSearcher=true,waitSearcher=true,expungeDeletes=false,softCommit=false,prepareCommit=false}
[junit4:junit4]   2>  C120_STATE=coll:collection1 core:collection1 props:{shard=shard1, state=active, core=collection1, collection=collection1, node_name=127.0.0.1:48702_, base_url=http://127.0.0.1:48702}
[junit4:junit4]   2> 22512 T1749 C120 P48702 oasu.DirectUpdateHandler2.commit start commit{,optimize=false,openSearcher=true,waitSearcher=true,expungeDeletes=false,softCommit=false,prepareCommit=false}
[junit4:junit4]   2>  C117_STATE=coll:collection1 core:collection1 props:{shard=shard1, state=active, core=collection1, collection=collection1, node_name=127.0.0.1:58450_, base_url=http://127.0.0.1:58450}
[junit4:junit4]   2> 22512 T1717 C117 P58450 oasu.DirectUpdateHandler2.commit start commit{,optimize=false,openSearcher=true,waitSearcher=true,expungeDeletes=false,softCommit=false,prepareCommit=false}
[junit4:junit4]   2> 22514 T1733 C118 P56856 oasc.SolrDeletionPolicy.onCommit SolrDeletionPolicy.onCommit: commits:num=2
[junit4:junit4]   2> 		commit{dir=MockDirWrapper(org.apache.lucene.store.RAMDirectory@6c440b8 lockFactory=org.apache.lucene.store.NativeFSLockFactory@701e7888),segFN=segments_3,generation=3,filenames=[segments_3]
[junit4:junit4]   2> 		commit{dir=MockDirWrapper(org.apache.lucene.store.RAMDirectory@6c440b8 lockFactory=org.apache.lucene.store.NativeFSLockFactory@701e7888),segFN=segments_4,generation=4,filenames=[segments_4]
[junit4:junit4]   2> 22514 T1749 C120 P48702 oasc.SolrDeletionPolicy.onCommit SolrDeletionPolicy.onCommit: commits:num=2
[junit4:junit4]   2> 		commit{dir=MockDirWrapper(org.apache.lucene.store.RAMDirectory@4e44462d lockFactory=org.apache.lucene.store.NativeFSLockFactory@2a15c952),segFN=segments_4,generation=4,filenames=[segments_4]
[junit4:junit4]   2> 		commit{dir=MockDirWrapper(org.apache.lucene.store.RAMDirectory@4e44462d lockFactory=org.apache.lucene.store.NativeFSLockFactory@2a15c952),segFN=segments_5,generation=5,filenames=[segments_5]
[junit4:junit4]   2> 22514 T1717 C117 P58450 oasc.SolrDeletionPolicy.onCommit SolrDeletionPolicy.onCommit: commits:num=2
[junit4:junit4]   2> 		commit{dir=MockDirWrapper(org.apache.lucene.store.RAMDirectory@61ac14b7 lockFactory=org.apache.lucene.store.NativeFSLockFactory@3d83f18a),segFN=segments_2,generation=2,filenames=[segments_2]
[junit4:junit4]   2> 		commit{dir=MockDirWrapper(org.apache.lucene.store.RAMDirectory@61ac14b7 lockFactory=org.apache.lucene.store.NativeFSLockFactory@3d83f18a),segFN=segments_3,generation=3,filenames=[segments_3]
[junit4:junit4]   2> 22515 T1733 C118 P56856 oasc.SolrDeletionPolicy.updateCommits newest commit = 4[segments_4]
[junit4:junit4]   2> 22515 T1717 C117 P58450 oasc.SolrDeletionPolicy.updateCommits newest commit = 3[segments_3]
[junit4:junit4]   2> 22515 T1749 C120 P48702 oasc.SolrDeletionPolicy.updateCommits newest commit = 5[segments_5]
[junit4:junit4]   2> 22515 T1733 C118 P56856 oasc.CachingDirectoryFactory.close Releasing directory:/usr/home/hudson/hudson-slave/workspace/Lucene-Solr-Tests-4.x-Java6/solr/build/solr-core/test/J0/./org.apache.solr.cloud.SyncSliceTest-1362590698293/jetty3
[junit4:junit4]   2> 22515 T1717 C117 P58450 oasc.CachingDirectoryFactory.close Releasing directory:/usr/home/hudson/hudson-slave/workspace/Lucene-Solr-Tests-4.x-Java6/solr/build/solr-core/test/J0/./org.apache.solr.cloud.SyncSliceTest-1362590698293/jetty2
[junit4:junit4]   2> 22515 T1749 C120 P48702 oasc.CachingDirectoryFactory.close Releasing directory:/usr/home/hudson/hudson-slave/workspace/Lucene-Solr-Tests-4.x-Java6/solr/build/solr-core/test/J0/./org.apache.solr.cloud.SyncSliceTest-1362590698293/jetty4
[junit4:junit4]   2> 22516 T1733 C118 P56856 oass.SolrIndexSearcher.<init> Opening Searcher@6425fd5b main
[junit4:junit4]   2> 22516 T1749 C120 P48702 oass.SolrIndexSearcher.<init> Opening Searcher@2361b2f8 main
[junit4:junit4]   2> 22516 T1717 C117 P58450 oass.SolrIndexSearcher.<init> Opening Searcher@6a687df7 main
[junit4:junit4]   2> 22516 T1733 C118 P56856 oasu.DirectUpdateHandler2.commit end_commit_flush
[junit4:junit4]   2> 22517 T1763 oasc.JmxMonitoredMap.put WARNING Failed to register info bean: searcher javax.management.InstanceAlreadyExistsException: solr/collection1:type=searcher,id=org.apache.solr.search.SolrIndexSearcher
[junit4:junit4]   2> 	at com.sun.jmx.mbeanserver.Repository.addMBean(Repository.java:467)
[junit4:junit4]   2> 	at com.sun.jmx.interceptor.DefaultMBeanServerInterceptor.internal_addObject(DefaultMBeanServerInterceptor.java:1520)
[junit4:junit4]   2> 	at com.sun.jmx.interceptor.DefaultMBeanServerInterceptor.registerDynamicMBean(DefaultMBeanServerInterceptor.java:986)
[junit4:junit4]   2> 	at com.sun.jmx.interceptor.DefaultMBeanServerInterceptor.registerObject(DefaultMBeanServerInterceptor.java:938)
[junit4:junit4]   2> 	at com.sun.jmx.interceptor.DefaultMBeanServerInterceptor.registerMBean(DefaultMBeanServerInterceptor.java:330)
[junit4:junit4]   2> 	at com.sun.jmx.mbeanserver.JmxMBeanServer.registerMBean(JmxMBeanServer.java:516)
[junit4:junit4]   2> 	at org.apache.solr.core.JmxMonitoredMap.put(JmxMonitoredMap.java:140)
[junit4:junit4]   2> 	at org.apache.solr.core.JmxMonitoredMap.put(JmxMonitoredMap.java:51)
[junit4:junit4]   2> 	at org.apache.solr.search.SolrIndexSearcher.register(SolrIndexSearcher.java:239)
[junit4:junit4]   2> 	at org.apache.solr.core.SolrCore.registerSearcher(SolrCore.java:1749)
[junit4:junit4]   2> 	at org.apache.solr.core.SolrCore.access$000(SolrCore.java:129)
[junit4:junit4]   2> 	at org.apache.solr.core.SolrCore$7.call(SolrCore.java:1626)
[junit4:junit4]   2> 	at java.util.concurrent.FutureTask$Sync.innerRun(FutureTask.java:334)
[junit4:junit4]   2> 	at java.util.concurrent.FutureTask.run(FutureTask.java:166)
[junit4:junit4]   2> 	at java.util.concurrent.ThreadPoolExecutor.runWorker(ThreadPoolExecutor.java:1110)
[junit4:junit4]   2> 	at java.util.concurrent.ThreadPoolExecutor$Worker.run(ThreadPoolExecutor.java:603)
[junit4:junit4]   2> 	at java.lang.Thread.run(Thread.java:679)
[junit4:junit4]   2> 
[junit4:junit4]   2> 22516 T1749 C120 P48702 oasu.DirectUpdateHandler2.commit end_commit_flush
[junit4:junit4]   2> 22517 T1745 oasc.SolrCore.registerSearcher [collection1] Registered new searcher Searcher@6425fd5b main{StandardDirectoryReader(segments_3:1:nrt)}
[junit4:junit4]   2> 22517 T1717 C117 P58450 oasu.DirectUpdateHandler2.commit end_commit_flush
[junit4:junit4]   2> 22517 T1729 oasc.SolrCore.registerSearcher [collection1] Registered new searcher Searcher@6a687df7 main{StandardDirectoryReader(segments_2:1:nrt)}
[junit4:junit4]   2> 22518 T1745 oasc.CachingDirectoryFactory.close Releasing directory:/usr/home/hudson/hudson-slave/workspace/Lucene-Solr-Tests-4.x-Java6/solr/build/solr-core/test/J0/./org.apache.solr.cloud.SyncSliceTest-1362590698293/jetty3/index
[junit4:junit4]   2> 22518 T1763 oasc.SolrCore.registerSearcher [collection1] Registered new searcher Searcher@2361b2f8 main{StandardDirectoryReader(segments_4:1:nrt)}
[junit4:junit4]   2> 22518 T1729 oasc.CachingDirectoryFactory.close Releasing directory:/usr/home/hudson/hudson-slave/workspace/Lucene-Solr-Tests-4.x-Java6/solr/build/solr-core/test/J0/./org.apache.solr.cloud.SyncSliceTest-1362590698293/jetty2/index
[junit4:junit4]   2> 22518 T1733 C118 P56856 /update {waitSearcher=true&commit=true&wt=javabin&expungeDeletes=false&commit_end_point=true&version=2&softCommit=false} {commit=} 0 6
[junit4:junit4]   2> 22518 T1763 oasc.CachingDirectoryFactory.close Releasing directory:/usr/home/hudson/hudson-slave/workspace/Lucene-Solr-Tests-4.x-Java6/solr/build/solr-core/test/J0/./org.apache.solr.cloud.SyncSliceTest-1362590698293/jetty4/index
[junit4:junit4]   2> 22518 T1717 C117 P58450 /update {waitSearcher=true&commit=true&wt=javabin&expungeDeletes=false&commit_end_point=true&version=2&softCommit=false} {commit=} 0 6
[junit4:junit4]   2> 22519 T1749 C120 P48702 /update {waitSearcher=true&commit=true&wt=javabin&expungeDeletes=false&commit_end_point=true&version=2&softCommit=false} {commit=} 0 7
[junit4:junit4]   2> 22519 T1705 C119 P58324 /update {waitSearcher=true&commit=true&wt=javabin&version=2&softCommit=false} {commit=} 0 20
[junit4:junit4]   2> 22520 T1671 oascc.ZkStateReader.updateClusterState Updating cloud state from ZooKeeper... 
[junit4:junit4]   2> 22523 T1703 C119 P58324 REQ /select {tests=checkShardConsistency&q=*:*&distrib=false&wt=javabin&version=2&rows=0} hits=0 status=0 QTime=0 
[junit4:junit4]   2> 22525 T1718 C117 P58450 REQ /select {tests=checkShardConsistency&q=*:*&distrib=false&wt=javabin&version=2&rows=0} hits=0 status=0 QTime=0 
[junit4:junit4]   2> 22527 T1734 C118 P56856 REQ /select {tests=checkShardConsistency&q=*:*&distrib=false&wt=javabin&version=2&rows=0} hits=0 status=0 QTime=0 
[junit4:junit4]   2> 22529 T1750 C120 P48702 REQ /select {tests=checkShardConsistency&q=*:*&distrib=false&wt=javabin&version=2&rows=0} hits=0 status=0 QTime=0 
[junit4:junit4]   2> 24535 T1683 C121 P14233 oasc.CachingDirectoryFactory.close Releasing directory:/usr/home/hudson/hudson-slave/workspace/Lucene-Solr-Tests-4.x-Java6/solr/build/solr-core/test/J0/./org.apache.solr.cloud.SyncSliceTest-1362590698293/control/data
[junit4:junit4]   2> 24535 T1683 C121 P14233 oass.SolrIndexSearcher.<init> Opening Searcher@981f1f2 realtime
[junit4:junit4]   2> 24536 T1683 C121 P14233 /update {wt=javabin&version=2} {deleteByQuery=*:* (-1428779929772752896)} 0 3
[junit4:junit4]   2> 24540 T1705 C119 P58324 oasc.CachingDirectoryFactory.close Releasing directory:/usr/home/hudson/hudson-slave/workspace/Lucene-Solr-Tests-4.x-Java6/solr/build/solr-core/test/J0/./org.apache.solr.cloud.SyncSliceTest-1362590698293/jetty1
[junit4:junit4]   2> 24544 T1733 C118 P56856 oasc.CachingDirectoryFactory.close Releasing directory:/usr/home/hudson/hudson-slave/workspace/Lucene-Solr-Tests-4.x-Java6/solr/build/solr-core/test/J0/./org.apache.solr.cloud.SyncSliceTest-1362590698293/jetty3
[junit4:junit4]   2> 24544 T1749 C120 P48702 oasc.CachingDirectoryFactory.close Releasing directory:/usr/home/hudson/hudson-slave/workspace/Lucene-Solr-Tests-4.x-Java6/solr/build/solr-core/test/J0/./org.apache.solr.cloud.SyncSliceTest-1362590698293/jetty4
[junit4:junit4]   2> 24544 T1717 C117 P58450 oasc.CachingDirectoryFactory.close Releasing directory:/usr/home/hudson/hudson-slave/workspace/Lucene-Solr-Tests-4.x-Java6/solr/build/solr-core/test/J0/./org.apache.solr.cloud.SyncSliceTest-1362590698293/jetty2
[junit4:junit4]   2> 24544 T1733 C118 P56856 /update {update.distrib=FROMLEADER&_version_=-1428779929777995776&update.from=http://127.0.0.1:58324/collection1/&wt=javabin&version=2} {deleteByQuery=*:* (-14

[...truncated too long message...]

ead.java:679)
[junit4:junit4]   2> 136921 T1671 oas.SolrTestCaseJ4.deleteCore ###deleteCore
[junit4:junit4]   2> 136927 T1743 oascc.ZkStateReader$3.process WARNING ZooKeeper watch triggered, but Solr cannot talk to ZK
[junit4:junit4]   2> 136927 T1743 oascc.ZkStateReader$2.process A cluster state change: WatchedEvent state:SyncConnected type:NodeChildrenChanged path:/live_nodes, has occurred - updating... (live nodes size: 2)
[junit4:junit4]   2> 136927 T1743 oascc.ZkStateReader$2.process WARNING ZooKeeper watch triggered, but Solr cannot talk to ZK
[junit4:junit4]   2> 136927 T1743 oaz.ClientCnxn$EventThread.run EventThread shut down
[junit4:junit4]   2> 137714 T1674 oazs.SessionTrackerImpl.run SessionTrackerImpl exited loop!
[junit4:junit4]   2> 165716 T1759 oasu.PeerSync.handleResponse WARNING PeerSync: core=collection1 url=http://127.0.0.1:48702  couldn't connect to http://127.0.0.1:56856/collection1/, counting as success
[junit4:junit4]   2> 165716 T1759 oasu.PeerSync.sync PeerSync: core=collection1 url=http://127.0.0.1:48702 DONE. sync succeeded
[junit4:junit4]   2> 165716 T1759 oasc.SyncStrategy.syncReplicas We have been closed, won't attempt to sync replicas back to leader
[junit4:junit4]   2> 165718 T1759 oasc.ShardLeaderElectionContext.rejoinLeaderElection Not rejoining election because CoreContainer is shutdown
[junit4:junit4]   2> 165718 T1759 oasc.SolrCore.close [collection1]  CLOSING SolrCore org.apache.solr.core.SolrCore@583068f9
[junit4:junit4]   2> 165719 T1759 oasu.DirectUpdateHandler2.close closing DirectUpdateHandler2{commits=10,autocommits=0,soft autocommits=0,optimizes=0,rollbacks=0,expungeDeletes=0,docsPending=0,adds=0,deletesById=0,deletesByQuery=0,errors=0,cumulative_adds=305,cumulative_deletesById=0,cumulative_deletesByQuery=1,cumulative_errors=0}
[junit4:junit4]   2> 165719 T1759 oasu.SolrCoreState.decrefSolrCoreState Closing SolrCoreState
[junit4:junit4]   2> 165719 T1759 oasu.DefaultSolrCoreState.closeIndexWriter SolrCoreState ref count has reached 0 - closing IndexWriter
[junit4:junit4]   2> 165720 T1759 oasu.DefaultSolrCoreState.closeIndexWriter closing IndexWriter with IndexWriterCloser
[junit4:junit4]   2> 165720 T1759 C120 P48702 oasu.TransactionLog.forceClose SEVERE Error: Forcing close of tlog{file=./org.apache.solr.cloud.SyncSliceTest-1362590698293/jetty4/tlog/tlog.0000000000000000005 refcount=1}
[junit4:junit4]   2> 165723 T1759 C120 P48702 oasc.CachingDirectoryFactory.close Releasing directory:/usr/home/hudson/hudson-slave/workspace/Lucene-Solr-Tests-4.x-Java6/solr/build/solr-core/test/J0/./org.apache.solr.cloud.SyncSliceTest-1362590698293/jetty4/index
[junit4:junit4]   2> 165723 T1759 oasc.SolrCore.closeSearcher [collection1] Closing main searcher on request.
[junit4:junit4]   2> 165723 T1759 oasc.CachingDirectoryFactory.close Releasing directory:/usr/home/hudson/hudson-slave/workspace/Lucene-Solr-Tests-4.x-Java6/solr/build/solr-core/test/J0/./org.apache.solr.cloud.SyncSliceTest-1362590698293/jetty4/index
[junit4:junit4]   2> 165724 T1759 oasc.CachingDirectoryFactory.close Closing directory when closing factory:/usr/home/hudson/hudson-slave/workspace/Lucene-Solr-Tests-4.x-Java6/solr/build/solr-core/test/J0/./org.apache.solr.cloud.SyncSliceTest-1362590698293/jetty4/index
[junit4:junit4]   2> 165724 T1759 oasc.CachingDirectoryFactory.closeDirectory Closing directory:/usr/home/hudson/hudson-slave/workspace/Lucene-Solr-Tests-4.x-Java6/solr/build/solr-core/test/J0/./org.apache.solr.cloud.SyncSliceTest-1362590698293/jetty4/index
[junit4:junit4]   2> 165724 T1759 oasc.CachingDirectoryFactory.close Closing directory when closing factory:/usr/home/hudson/hudson-slave/workspace/Lucene-Solr-Tests-4.x-Java6/solr/build/solr-core/test/J0/./org.apache.solr.cloud.SyncSliceTest-1362590698293/jetty4
[junit4:junit4]   2> 165724 T1759 oasc.CachingDirectoryFactory.closeDirectory Closing directory:/usr/home/hudson/hudson-slave/workspace/Lucene-Solr-Tests-4.x-Java6/solr/build/solr-core/test/J0/./org.apache.solr.cloud.SyncSliceTest-1362590698293/jetty4
[junit4:junit4]   2> 165724 T1759 oasc.CachingDirectoryFactory.close Closing directory when closing factory:/usr/home/hudson/hudson-slave/workspace/Lucene-Solr-Tests-4.x-Java6/solr/build/solr-core/test/J0/./org.apache.solr.cloud.SyncSliceTest-1362590698293/jetty4/index.20130306142519774
[junit4:junit4]   2> 165725 T1759 oasc.CachingDirectoryFactory.closeDirectory Closing directory:/usr/home/hudson/hudson-slave/workspace/Lucene-Solr-Tests-4.x-Java6/solr/build/solr-core/test/J0/./org.apache.solr.cloud.SyncSliceTest-1362590698293/jetty4/index.20130306142519774
[junit4:junit4]   2> 165725 T1759 oasc.LeaderElector$1.process WARNING  org.apache.zookeeper.KeeperException$SessionExpiredException: KeeperErrorCode = Session expired for /overseer_elect/election
[junit4:junit4]   2> 	at org.apache.zookeeper.KeeperException.create(KeeperException.java:127)
[junit4:junit4]   2> 	at org.apache.zookeeper.KeeperException.create(KeeperException.java:51)
[junit4:junit4]   2> 	at org.apache.zookeeper.ZooKeeper.getChildren(ZooKeeper.java:1468)
[junit4:junit4]   2> 	at org.apache.solr.common.cloud.SolrZkClient$6.execute(SolrZkClient.java:236)
[junit4:junit4]   2> 	at org.apache.solr.common.cloud.SolrZkClient$6.execute(SolrZkClient.java:233)
[junit4:junit4]   2> 	at org.apache.solr.common.cloud.ZkCmdExecutor.retryOperation(ZkCmdExecutor.java:65)
[junit4:junit4]   2> 	at org.apache.solr.common.cloud.SolrZkClient.getChildren(SolrZkClient.java:233)
[junit4:junit4]   2> 	at org.apache.solr.cloud.LeaderElector.checkIfIamLeader(LeaderElector.java:84)
[junit4:junit4]   2> 	at org.apache.solr.cloud.LeaderElector.access$000(LeaderElector.java:55)
[junit4:junit4]   2> 	at org.apache.solr.cloud.LeaderElector$1.process(LeaderElector.java:129)
[junit4:junit4]   2> 	at org.apache.zookeeper.ClientCnxn$EventThread.processEvent(ClientCnxn.java:519)
[junit4:junit4]   2> 	at org.apache.zookeeper.ClientCnxn$EventThread.run(ClientCnxn.java:495)
[junit4:junit4]   2> 
[junit4:junit4]   2> 165725 T1759 oascc.ZkStateReader$3.process WARNING ZooKeeper watch triggered, but Solr cannot talk to ZK
[junit4:junit4]   2> 165725 T1759 oascc.ZkStateReader$2.process A cluster state change: WatchedEvent state:SyncConnected type:NodeChildrenChanged path:/live_nodes, has occurred - updating... (live nodes size: 2)
[junit4:junit4]   2> 165726 T1759 oascc.ZkStateReader$2.process WARNING ZooKeeper watch triggered, but Solr cannot talk to ZK
[junit4:junit4]   2> 165726 T1759 oaz.ClientCnxn$EventThread.run EventThread shut down
[junit4:junit4]   2> NOTE: test params are: codec=FastDecompressionCompressingStoredFields(storedFieldsFormat=CompressingStoredFieldsFormat(compressionMode=FAST_DECOMPRESSION, chunkSize=328), termVectorsFormat=CompressingTermVectorsFormat(compressionMode=FAST_DECOMPRESSION, chunkSize=328)), sim=DefaultSimilarity, locale=vi, timezone=Etc/GMT+3
[junit4:junit4]   2> NOTE: FreeBSD 9.0-RELEASE amd64/Sun Microsystems Inc. 1.6.0_32 (64-bit)/cpus=16,threads=3,free=180495272,total=399114240
[junit4:junit4]   2> NOTE: All tests run in this JVM: [TestWriterPerf, LegacyHTMLStripCharFilterTest, SolrPluginUtilsTest, AnalysisAfterCoreReloadTest, SolrIndexSplitterTest, LeaderElectionIntegrationTest, ShowFileRequestHandlerTest, TestJmxIntegration, UnloadDistributedZkTest, DistributedSpellCheckComponentTest, TestPluginEnable, TestSweetSpotSimilarityFactory, TestXIncludeConfig, ConvertedLegacyTest, PathHierarchyTokenizerFactoryTest, TestSolrDeletionPolicy2, StatelessScriptUpdateProcessorFactoryTest, SpellingQueryConverterTest, DateFieldTest, DirectUpdateHandlerOptimizeTest, TestPerFieldSimilarity, ResponseLogComponentTest, BinaryUpdateRequestHandlerTest, TestCoreContainer, TestArbitraryIndexDir, LukeRequestHandlerTest, JSONWriterTest, TestPhraseSuggestions, TestHashPartitioner, TestGroupingSearch, TestLFUCache, ExternalFileFieldSortTest, ResourceLoaderTest, TestSolrDeletionPolicy1, BadComponentTest, TestCollationKeyRangeQueries, TestFuzzyAnalyzedSuggestions, SuggesterTSTTest, TestRemoteStreaming, BasicZkTest, CacheHeaderTest, TestPHPSerializedResponseWriter, ZkSolrClientTest, TestFunctionQuery, TestFieldTypeResource, MinimalSchemaTest, SynonymTokenizerTest, SpellCheckCollatorTest, TestIBSimilarityFactory, PreAnalyzedFieldTest, TestDistributedSearch, ZkControllerTest, TestQuerySenderListener, TestCollationField, CircularListTest, SliceStateTest, DistributedTermsComponentTest, CurrencyFieldOpenExchangeTest, DirectSolrConnectionTest, HardAutoCommitTest, SearchHandlerTest, ZkCLITest, TestQueryUtils, SolrRequestParserTest, TestDocSet, BasicDistributedZkTest, SyncSliceTest]
[junit4:junit4] Completed on J0 in 165.98s, 1 test, 1 failure <<< FAILURES!

[...truncated 464 lines...]
BUILD FAILED
/usr/home/hudson/hudson-slave/workspace/Lucene-Solr-Tests-4.x-Java6/build.xml:381: The following error occurred while executing this line:
/usr/home/hudson/hudson-slave/workspace/Lucene-Solr-Tests-4.x-Java6/build.xml:361: The following error occurred while executing this line:
/usr/home/hudson/hudson-slave/workspace/Lucene-Solr-Tests-4.x-Java6/build.xml:39: The following error occurred while executing this line:
/usr/home/hudson/hudson-slave/workspace/Lucene-Solr-Tests-4.x-Java6/solr/build.xml:183: The following error occurred while executing this line:
/usr/home/hudson/hudson-slave/workspace/Lucene-Solr-Tests-4.x-Java6/solr/common-build.xml:449: The following error occurred while executing this line:
/usr/home/hudson/hudson-slave/workspace/Lucene-Solr-Tests-4.x-Java6/lucene/common-build.xml:1213: The following error occurred while executing this line:
/usr/home/hudson/hudson-slave/workspace/Lucene-Solr-Tests-4.x-Java6/lucene/common-build.xml:877: There were test failures: 267 suites, 1127 tests, 1 failure, 23 ignored (4 assumptions)

Total time: 44 minutes 37 seconds
Build step 'Invoke Ant' marked build as failure
Archiving artifacts
Recording test results
Email was triggered for: Failure
Sending email for trigger: Failure



Mime
View raw message