lucene-dev mailing list archives

Site index · List index
Message view « Date » · « Thread »
Top « Date » · « Thread »
From Apache Jenkins Server <jenk...@builds.apache.org>
Subject [JENKINS] Lucene-Solr-NightlyTests-trunk - Build # 205 - Still Failing
Date Wed, 13 Mar 2013 16:01:13 GMT
Build: https://builds.apache.org/job/Lucene-Solr-NightlyTests-trunk/205/

6 tests failed.
REGRESSION:  org.apache.solr.cloud.BasicDistributedZk2Test.testDistribSearch

Error Message:
No registered leader was found, collection:collection1 slice:shard1

Stack Trace:
org.apache.solr.common.SolrException: No registered leader was found, collection:collection1 slice:shard1
	at __randomizedtesting.SeedInfo.seed([E69158C9069FBD51:6777D6D171C0DD6D]:0)
	at org.apache.solr.common.cloud.ZkStateReader.getLeaderRetry(ZkStateReader.java:484)
	at org.apache.solr.cloud.BasicDistributedZk2Test.brindDownShardIndexSomeDocsAndRecover(BasicDistributedZk2Test.java:291)
	at org.apache.solr.cloud.BasicDistributedZk2Test.doTest(BasicDistributedZk2Test.java:116)
	at org.apache.solr.BaseDistributedSearchTestCase.testDistribSearch(BaseDistributedSearchTestCase.java:806)
	at sun.reflect.NativeMethodAccessorImpl.invoke0(Native Method)
	at sun.reflect.NativeMethodAccessorImpl.invoke(NativeMethodAccessorImpl.java:57)
	at sun.reflect.DelegatingMethodAccessorImpl.invoke(DelegatingMethodAccessorImpl.java:43)
	at java.lang.reflect.Method.invoke(Method.java:616)
	at com.carrotsearch.randomizedtesting.RandomizedRunner.invoke(RandomizedRunner.java:1559)
	at com.carrotsearch.randomizedtesting.RandomizedRunner.access$600(RandomizedRunner.java:79)
	at com.carrotsearch.randomizedtesting.RandomizedRunner$6.evaluate(RandomizedRunner.java:737)
	at com.carrotsearch.randomizedtesting.RandomizedRunner$7.evaluate(RandomizedRunner.java:773)
	at com.carrotsearch.randomizedtesting.RandomizedRunner$8.evaluate(RandomizedRunner.java:787)
	at com.carrotsearch.randomizedtesting.rules.SystemPropertiesRestoreRule$1.evaluate(SystemPropertiesRestoreRule.java:53)
	at org.apache.lucene.util.TestRuleSetupTeardownChained$1.evaluate(TestRuleSetupTeardownChained.java:50)
	at org.apache.lucene.util.TestRuleFieldCacheSanity$1.evaluate(TestRuleFieldCacheSanity.java:51)
	at org.apache.lucene.util.AbstractBeforeAfterRule$1.evaluate(AbstractBeforeAfterRule.java:46)
	at com.carrotsearch.randomizedtesting.rules.SystemPropertiesInvariantRule$1.evaluate(SystemPropertiesInvariantRule.java:55)
	at org.apache.lucene.util.TestRuleThreadAndTestName$1.evaluate(TestRuleThreadAndTestName.java:49)
	at org.apache.lucene.util.TestRuleIgnoreAfterMaxFailures$1.evaluate(TestRuleIgnoreAfterMaxFailures.java:70)
	at org.apache.lucene.util.TestRuleMarkFailure$1.evaluate(TestRuleMarkFailure.java:48)
	at com.carrotsearch.randomizedtesting.rules.StatementAdapter.evaluate(StatementAdapter.java:36)
	at com.carrotsearch.randomizedtesting.ThreadLeakControl$StatementRunner.run(ThreadLeakControl.java:358)
	at com.carrotsearch.randomizedtesting.ThreadLeakControl.forkTimeoutingTask(ThreadLeakControl.java:782)
	at com.carrotsearch.randomizedtesting.ThreadLeakControl$3.evaluate(ThreadLeakControl.java:442)
	at com.carrotsearch.randomizedtesting.RandomizedRunner.runSingleTest(RandomizedRunner.java:746)
	at com.carrotsearch.randomizedtesting.RandomizedRunner$3.evaluate(RandomizedRunner.java:648)
	at com.carrotsearch.randomizedtesting.RandomizedRunner$4.evaluate(RandomizedRunner.java:682)
	at com.carrotsearch.randomizedtesting.RandomizedRunner$5.evaluate(RandomizedRunner.java:693)
	at com.carrotsearch.randomizedtesting.rules.StatementAdapter.evaluate(StatementAdapter.java:36)
	at com.carrotsearch.randomizedtesting.rules.SystemPropertiesRestoreRule$1.evaluate(SystemPropertiesRestoreRule.java:53)
	at org.apache.lucene.util.AbstractBeforeAfterRule$1.evaluate(AbstractBeforeAfterRule.java:46)
	at org.apache.lucene.util.TestRuleStoreClassName$1.evaluate(TestRuleStoreClassName.java:42)
	at com.carrotsearch.randomizedtesting.rules.SystemPropertiesInvariantRule$1.evaluate(SystemPropertiesInvariantRule.java:55)
	at com.carrotsearch.randomizedtesting.rules.NoShadowingOrOverridesOnMethodsRule$1.evaluate(NoShadowingOrOverridesOnMethodsRule.java:39)
	at com.carrotsearch.randomizedtesting.rules.NoShadowingOrOverridesOnMethodsRule$1.evaluate(NoShadowingOrOverridesOnMethodsRule.java:39)
	at com.carrotsearch.randomizedtesting.rules.StatementAdapter.evaluate(StatementAdapter.java:36)
	at org.apache.lucene.util.TestRuleAssertionsRequired$1.evaluate(TestRuleAssertionsRequired.java:43)
	at org.apache.lucene.util.TestRuleMarkFailure$1.evaluate(TestRuleMarkFailure.java:48)
	at org.apache.lucene.util.TestRuleIgnoreAfterMaxFailures$1.evaluate(TestRuleIgnoreAfterMaxFailures.java:70)
	at org.apache.lucene.util.TestRuleIgnoreTestSuites$1.evaluate(TestRuleIgnoreTestSuites.java:55)
	at com.carrotsearch.randomizedtesting.rules.StatementAdapter.evaluate(StatementAdapter.java:36)
	at com.carrotsearch.randomizedtesting.ThreadLeakControl$StatementRunner.run(ThreadLeakControl.java:358)
	at java.lang.Thread.run(Thread.java:679)


REGRESSION:  org.apache.solr.cloud.ChaosMonkeySafeLeaderTest.testDistribSearch

Error Message:
shard3 is not consistent.  Got 36 from http://127.0.0.1:26839/hmge/collection1lastClient and got 2 from http://127.0.0.1:51802/hmge/collection1

Stack Trace:
java.lang.AssertionError: shard3 is not consistent.  Got 36 from http://127.0.0.1:26839/hmge/collection1lastClient and got 2 from http://127.0.0.1:51802/hmge/collection1
	at __randomizedtesting.SeedInfo.seed([E69158C9069FBD51:6777D6D171C0DD6D]:0)
	at org.junit.Assert.fail(Assert.java:93)
	at org.apache.solr.cloud.AbstractFullDistribZkTestBase.checkShardConsistency(AbstractFullDistribZkTestBase.java:963)
	at org.apache.solr.cloud.ChaosMonkeySafeLeaderTest.doTest(ChaosMonkeySafeLeaderTest.java:137)
	at org.apache.solr.BaseDistributedSearchTestCase.testDistribSearch(BaseDistributedSearchTestCase.java:806)
	at sun.reflect.NativeMethodAccessorImpl.invoke0(Native Method)
	at sun.reflect.NativeMethodAccessorImpl.invoke(NativeMethodAccessorImpl.java:57)
	at sun.reflect.DelegatingMethodAccessorImpl.invoke(DelegatingMethodAccessorImpl.java:43)
	at java.lang.reflect.Method.invoke(Method.java:616)
	at com.carrotsearch.randomizedtesting.RandomizedRunner.invoke(RandomizedRunner.java:1559)
	at com.carrotsearch.randomizedtesting.RandomizedRunner.access$600(RandomizedRunner.java:79)
	at com.carrotsearch.randomizedtesting.RandomizedRunner$6.evaluate(RandomizedRunner.java:737)
	at com.carrotsearch.randomizedtesting.RandomizedRunner$7.evaluate(RandomizedRunner.java:773)
	at com.carrotsearch.randomizedtesting.RandomizedRunner$8.evaluate(RandomizedRunner.java:787)
	at com.carrotsearch.randomizedtesting.rules.SystemPropertiesRestoreRule$1.evaluate(SystemPropertiesRestoreRule.java:53)
	at org.apache.lucene.util.TestRuleSetupTeardownChained$1.evaluate(TestRuleSetupTeardownChained.java:50)
	at org.apache.lucene.util.TestRuleFieldCacheSanity$1.evaluate(TestRuleFieldCacheSanity.java:51)
	at org.apache.lucene.util.AbstractBeforeAfterRule$1.evaluate(AbstractBeforeAfterRule.java:46)
	at com.carrotsearch.randomizedtesting.rules.SystemPropertiesInvariantRule$1.evaluate(SystemPropertiesInvariantRule.java:55)
	at org.apache.lucene.util.TestRuleThreadAndTestName$1.evaluate(TestRuleThreadAndTestName.java:49)
	at org.apache.lucene.util.TestRuleIgnoreAfterMaxFailures$1.evaluate(TestRuleIgnoreAfterMaxFailures.java:70)
	at org.apache.lucene.util.TestRuleMarkFailure$1.evaluate(TestRuleMarkFailure.java:48)
	at com.carrotsearch.randomizedtesting.rules.StatementAdapter.evaluate(StatementAdapter.java:36)
	at com.carrotsearch.randomizedtesting.ThreadLeakControl$StatementRunner.run(ThreadLeakControl.java:358)
	at com.carrotsearch.randomizedtesting.ThreadLeakControl.forkTimeoutingTask(ThreadLeakControl.java:782)
	at com.carrotsearch.randomizedtesting.ThreadLeakControl$3.evaluate(ThreadLeakControl.java:442)
	at com.carrotsearch.randomizedtesting.RandomizedRunner.runSingleTest(RandomizedRunner.java:746)
	at com.carrotsearch.randomizedtesting.RandomizedRunner$3.evaluate(RandomizedRunner.java:648)
	at com.carrotsearch.randomizedtesting.RandomizedRunner$4.evaluate(RandomizedRunner.java:682)
	at com.carrotsearch.randomizedtesting.RandomizedRunner$5.evaluate(RandomizedRunner.java:693)
	at com.carrotsearch.randomizedtesting.rules.StatementAdapter.evaluate(StatementAdapter.java:36)
	at com.carrotsearch.randomizedtesting.rules.SystemPropertiesRestoreRule$1.evaluate(SystemPropertiesRestoreRule.java:53)
	at org.apache.lucene.util.AbstractBeforeAfterRule$1.evaluate(AbstractBeforeAfterRule.java:46)
	at org.apache.lucene.util.TestRuleStoreClassName$1.evaluate(TestRuleStoreClassName.java:42)
	at com.carrotsearch.randomizedtesting.rules.SystemPropertiesInvariantRule$1.evaluate(SystemPropertiesInvariantRule.java:55)
	at com.carrotsearch.randomizedtesting.rules.NoShadowingOrOverridesOnMethodsRule$1.evaluate(NoShadowingOrOverridesOnMethodsRule.java:39)
	at com.carrotsearch.randomizedtesting.rules.NoShadowingOrOverridesOnMethodsRule$1.evaluate(NoShadowingOrOverridesOnMethodsRule.java:39)
	at com.carrotsearch.randomizedtesting.rules.StatementAdapter.evaluate(StatementAdapter.java:36)
	at org.apache.lucene.util.TestRuleAssertionsRequired$1.evaluate(TestRuleAssertionsRequired.java:43)
	at org.apache.lucene.util.TestRuleMarkFailure$1.evaluate(TestRuleMarkFailure.java:48)
	at org.apache.lucene.util.TestRuleIgnoreAfterMaxFailures$1.evaluate(TestRuleIgnoreAfterMaxFailures.java:70)
	at org.apache.lucene.util.TestRuleIgnoreTestSuites$1.evaluate(TestRuleIgnoreTestSuites.java:55)
	at com.carrotsearch.randomizedtesting.rules.StatementAdapter.evaluate(StatementAdapter.java:36)
	at com.carrotsearch.randomizedtesting.ThreadLeakControl$StatementRunner.run(ThreadLeakControl.java:358)
	at java.lang.Thread.run(Thread.java:679)


FAILED:  junit.framework.TestSuite.org.apache.solr.cloud.SyncSliceTest

Error Message:
ERROR: SolrIndexSearcher opens=98 closes=97

Stack Trace:
java.lang.AssertionError: ERROR: SolrIndexSearcher opens=98 closes=97
	at __randomizedtesting.SeedInfo.seed([E69158C9069FBD51]:0)
	at org.junit.Assert.fail(Assert.java:93)
	at org.apache.solr.SolrTestCaseJ4.endTrackingSearchers(SolrTestCaseJ4.java:247)
	at org.apache.solr.SolrTestCaseJ4.afterClass(SolrTestCaseJ4.java:97)
	at sun.reflect.NativeMethodAccessorImpl.invoke0(Native Method)
	at sun.reflect.NativeMethodAccessorImpl.invoke(NativeMethodAccessorImpl.java:57)
	at sun.reflect.DelegatingMethodAccessorImpl.invoke(DelegatingMethodAccessorImpl.java:43)
	at java.lang.reflect.Method.invoke(Method.java:616)
	at com.carrotsearch.randomizedtesting.RandomizedRunner.invoke(RandomizedRunner.java:1559)
	at com.carrotsearch.randomizedtesting.RandomizedRunner.access$600(RandomizedRunner.java:79)
	at com.carrotsearch.randomizedtesting.RandomizedRunner$5.evaluate(RandomizedRunner.java:700)
	at com.carrotsearch.randomizedtesting.rules.StatementAdapter.evaluate(StatementAdapter.java:36)
	at com.carrotsearch.randomizedtesting.rules.SystemPropertiesRestoreRule$1.evaluate(SystemPropertiesRestoreRule.java:53)
	at org.apache.lucene.util.AbstractBeforeAfterRule$1.evaluate(AbstractBeforeAfterRule.java:46)
	at org.apache.lucene.util.TestRuleStoreClassName$1.evaluate(TestRuleStoreClassName.java:42)
	at com.carrotsearch.randomizedtesting.rules.SystemPropertiesInvariantRule$1.evaluate(SystemPropertiesInvariantRule.java:55)
	at com.carrotsearch.randomizedtesting.rules.NoShadowingOrOverridesOnMethodsRule$1.evaluate(NoShadowingOrOverridesOnMethodsRule.java:39)
	at com.carrotsearch.randomizedtesting.rules.NoShadowingOrOverridesOnMethodsRule$1.evaluate(NoShadowingOrOverridesOnMethodsRule.java:39)
	at com.carrotsearch.randomizedtesting.rules.StatementAdapter.evaluate(StatementAdapter.java:36)
	at org.apache.lucene.util.TestRuleAssertionsRequired$1.evaluate(TestRuleAssertionsRequired.java:43)
	at org.apache.lucene.util.TestRuleMarkFailure$1.evaluate(TestRuleMarkFailure.java:48)
	at org.apache.lucene.util.TestRuleIgnoreAfterMaxFailures$1.evaluate(TestRuleIgnoreAfterMaxFailures.java:70)
	at org.apache.lucene.util.TestRuleIgnoreTestSuites$1.evaluate(TestRuleIgnoreTestSuites.java:55)
	at com.carrotsearch.randomizedtesting.rules.StatementAdapter.evaluate(StatementAdapter.java:36)
	at com.carrotsearch.randomizedtesting.ThreadLeakControl$StatementRunner.run(ThreadLeakControl.java:358)
	at java.lang.Thread.run(Thread.java:679)


FAILED:  junit.framework.TestSuite.org.apache.solr.cloud.SyncSliceTest

Error Message:
2 threads leaked from SUITE scope at org.apache.solr.cloud.SyncSliceTest:     1) Thread[id=290, name=searcherExecutor-163-thread-1, state=WAITING, group=TGRP-SyncSliceTest]         at sun.misc.Unsafe.park(Native Method)         at java.util.concurrent.locks.LockSupport.park(LockSupport.java:186)         at java.util.concurrent.locks.AbstractQueuedSynchronizer$ConditionObject.await(AbstractQueuedSynchronizer.java:2043)         at java.util.concurrent.LinkedBlockingQueue.take(LinkedBlockingQueue.java:386)         at java.util.concurrent.ThreadPoolExecutor.getTask(ThreadPoolExecutor.java:1069)         at java.util.concurrent.ThreadPoolExecutor.runWorker(ThreadPoolExecutor.java:1131)         at java.util.concurrent.ThreadPoolExecutor$Worker.run(ThreadPoolExecutor.java:615)         at java.lang.Thread.run(Thread.java:679)    2) Thread[id=469, name=RecoveryThread, state=TIMED_WAITING, group=TGRP-SyncSliceTest]         at java.lang.Thread.sleep(Native Method)         at org.apache.solr.cloud.RecoveryStrategy.doRecovery(RecoveryStrategy.java:490)         at org.apache.solr.cloud.RecoveryStrategy.run(RecoveryStrategy.java:223)

Stack Trace:
com.carrotsearch.randomizedtesting.ThreadLeakError: 2 threads leaked from SUITE scope at org.apache.solr.cloud.SyncSliceTest: 
   1) Thread[id=290, name=searcherExecutor-163-thread-1, state=WAITING, group=TGRP-SyncSliceTest]
        at sun.misc.Unsafe.park(Native Method)
        at java.util.concurrent.locks.LockSupport.park(LockSupport.java:186)
        at java.util.concurrent.locks.AbstractQueuedSynchronizer$ConditionObject.await(AbstractQueuedSynchronizer.java:2043)
        at java.util.concurrent.LinkedBlockingQueue.take(LinkedBlockingQueue.java:386)
        at java.util.concurrent.ThreadPoolExecutor.getTask(ThreadPoolExecutor.java:1069)
        at java.util.concurrent.ThreadPoolExecutor.runWorker(ThreadPoolExecutor.java:1131)
        at java.util.concurrent.ThreadPoolExecutor$Worker.run(ThreadPoolExecutor.java:615)
        at java.lang.Thread.run(Thread.java:679)
   2) Thread[id=469, name=RecoveryThread, state=TIMED_WAITING, group=TGRP-SyncSliceTest]
        at java.lang.Thread.sleep(Native Method)
        at org.apache.solr.cloud.RecoveryStrategy.doRecovery(RecoveryStrategy.java:490)
        at org.apache.solr.cloud.RecoveryStrategy.run(RecoveryStrategy.java:223)
	at __randomizedtesting.SeedInfo.seed([E69158C9069FBD51]:0)


FAILED:  junit.framework.TestSuite.org.apache.solr.cloud.SyncSliceTest

Error Message:
There are still zombie threads that couldn't be terminated:    1) Thread[id=290, name=searcherExecutor-163-thread-1, state=WAITING, group=TGRP-SyncSliceTest]         at sun.misc.Unsafe.park(Native Method)         at java.util.concurrent.locks.LockSupport.park(LockSupport.java:186)         at java.util.concurrent.locks.AbstractQueuedSynchronizer$ConditionObject.await(AbstractQueuedSynchronizer.java:2043)         at java.util.concurrent.LinkedBlockingQueue.take(LinkedBlockingQueue.java:386)         at java.util.concurrent.ThreadPoolExecutor.getTask(ThreadPoolExecutor.java:1069)         at java.util.concurrent.ThreadPoolExecutor.runWorker(ThreadPoolExecutor.java:1131)         at java.util.concurrent.ThreadPoolExecutor$Worker.run(ThreadPoolExecutor.java:615)         at java.lang.Thread.run(Thread.java:679)    2) Thread[id=469, name=RecoveryThread, state=WAITING, group=TGRP-SyncSliceTest]         at java.lang.Object.wait(Native Method)         at java.lang.Thread.join(Thread.java:1203)         at java.lang.Thread.join(Thread.java:1256)         at org.apache.solr.update.DefaultSolrCoreState.cancelRecovery(DefaultSolrCoreState.java:251)         at org.apache.solr.update.DefaultSolrCoreState.close(DefaultSolrCoreState.java:278)         at org.apache.solr.update.SolrCoreState.decrefSolrCoreState(SolrCoreState.java:73)         at org.apache.solr.core.SolrCore.close(SolrCore.java:986)         at org.apache.solr.cloud.RecoveryStrategy.run(RecoveryStrategy.java:235)

Stack Trace:
com.carrotsearch.randomizedtesting.ThreadLeakError: There are still zombie threads that couldn't be terminated:
   1) Thread[id=290, name=searcherExecutor-163-thread-1, state=WAITING, group=TGRP-SyncSliceTest]
        at sun.misc.Unsafe.park(Native Method)
        at java.util.concurrent.locks.LockSupport.park(LockSupport.java:186)
        at java.util.concurrent.locks.AbstractQueuedSynchronizer$ConditionObject.await(AbstractQueuedSynchronizer.java:2043)
        at java.util.concurrent.LinkedBlockingQueue.take(LinkedBlockingQueue.java:386)
        at java.util.concurrent.ThreadPoolExecutor.getTask(ThreadPoolExecutor.java:1069)
        at java.util.concurrent.ThreadPoolExecutor.runWorker(ThreadPoolExecutor.java:1131)
        at java.util.concurrent.ThreadPoolExecutor$Worker.run(ThreadPoolExecutor.java:615)
        at java.lang.Thread.run(Thread.java:679)
   2) Thread[id=469, name=RecoveryThread, state=WAITING, group=TGRP-SyncSliceTest]
        at java.lang.Object.wait(Native Method)
        at java.lang.Thread.join(Thread.java:1203)
        at java.lang.Thread.join(Thread.java:1256)
        at org.apache.solr.update.DefaultSolrCoreState.cancelRecovery(DefaultSolrCoreState.java:251)
        at org.apache.solr.update.DefaultSolrCoreState.close(DefaultSolrCoreState.java:278)
        at org.apache.solr.update.SolrCoreState.decrefSolrCoreState(SolrCoreState.java:73)
        at org.apache.solr.core.SolrCore.close(SolrCore.java:986)
        at org.apache.solr.cloud.RecoveryStrategy.run(RecoveryStrategy.java:235)
	at __randomizedtesting.SeedInfo.seed([E69158C9069FBD51]:0)


REGRESSION:  org.apache.solr.core.OpenCloseCoreStressTest.test10MinutesNew

Error Message:
Core 00012_core bad! expected:<317> but was:<311>

Stack Trace:
java.lang.AssertionError: Core 00012_core bad! expected:<317> but was:<311>
	at __randomizedtesting.SeedInfo.seed([E69158C9069FBD51:DCB4E0E8745157E5]:0)
	at org.junit.Assert.fail(Assert.java:93)
	at org.junit.Assert.failNotEquals(Assert.java:647)
	at org.junit.Assert.assertEquals(Assert.java:128)
	at org.junit.Assert.assertEquals(Assert.java:472)
	at org.apache.solr.core.OpenCloseCoreStressTest.checkResults(OpenCloseCoreStressTest.java:303)
	at org.apache.solr.core.OpenCloseCoreStressTest.doStress(OpenCloseCoreStressTest.java:201)
	at org.apache.solr.core.OpenCloseCoreStressTest.test10MinutesNew(OpenCloseCoreStressTest.java:133)
	at sun.reflect.NativeMethodAccessorImpl.invoke0(Native Method)
	at sun.reflect.NativeMethodAccessorImpl.invoke(NativeMethodAccessorImpl.java:57)
	at sun.reflect.DelegatingMethodAccessorImpl.invoke(DelegatingMethodAccessorImpl.java:43)
	at java.lang.reflect.Method.invoke(Method.java:616)
	at com.carrotsearch.randomizedtesting.RandomizedRunner.invoke(RandomizedRunner.java:1559)
	at com.carrotsearch.randomizedtesting.RandomizedRunner.access$600(RandomizedRunner.java:79)
	at com.carrotsearch.randomizedtesting.RandomizedRunner$6.evaluate(RandomizedRunner.java:737)
	at com.carrotsearch.randomizedtesting.RandomizedRunner$7.evaluate(RandomizedRunner.java:773)
	at com.carrotsearch.randomizedtesting.RandomizedRunner$8.evaluate(RandomizedRunner.java:787)
	at com.carrotsearch.randomizedtesting.rules.SystemPropertiesRestoreRule$1.evaluate(SystemPropertiesRestoreRule.java:53)
	at org.apache.lucene.util.TestRuleSetupTeardownChained$1.evaluate(TestRuleSetupTeardownChained.java:50)
	at org.apache.lucene.util.TestRuleFieldCacheSanity$1.evaluate(TestRuleFieldCacheSanity.java:51)
	at org.apache.lucene.util.AbstractBeforeAfterRule$1.evaluate(AbstractBeforeAfterRule.java:46)
	at com.carrotsearch.randomizedtesting.rules.SystemPropertiesInvariantRule$1.evaluate(SystemPropertiesInvariantRule.java:55)
	at org.apache.lucene.util.TestRuleThreadAndTestName$1.evaluate(TestRuleThreadAndTestName.java:49)
	at org.apache.lucene.util.TestRuleIgnoreAfterMaxFailures$1.evaluate(TestRuleIgnoreAfterMaxFailures.java:70)
	at org.apache.lucene.util.TestRuleMarkFailure$1.evaluate(TestRuleMarkFailure.java:48)
	at com.carrotsearch.randomizedtesting.rules.StatementAdapter.evaluate(StatementAdapter.java:36)
	at com.carrotsearch.randomizedtesting.ThreadLeakControl$StatementRunner.run(ThreadLeakControl.java:358)
	at com.carrotsearch.randomizedtesting.ThreadLeakControl.forkTimeoutingTask(ThreadLeakControl.java:782)
	at com.carrotsearch.randomizedtesting.ThreadLeakControl$3.evaluate(ThreadLeakControl.java:442)
	at com.carrotsearch.randomizedtesting.RandomizedRunner.runSingleTest(RandomizedRunner.java:746)
	at com.carrotsearch.randomizedtesting.RandomizedRunner$3.evaluate(RandomizedRunner.java:648)
	at com.carrotsearch.randomizedtesting.RandomizedRunner$4.evaluate(RandomizedRunner.java:682)
	at com.carrotsearch.randomizedtesting.RandomizedRunner$5.evaluate(RandomizedRunner.java:693)
	at com.carrotsearch.randomizedtesting.rules.StatementAdapter.evaluate(StatementAdapter.java:36)
	at com.carrotsearch.randomizedtesting.rules.SystemPropertiesRestoreRule$1.evaluate(SystemPropertiesRestoreRule.java:53)
	at org.apache.lucene.util.AbstractBeforeAfterRule$1.evaluate(AbstractBeforeAfterRule.java:46)
	at org.apache.lucene.util.TestRuleStoreClassName$1.evaluate(TestRuleStoreClassName.java:42)
	at com.carrotsearch.randomizedtesting.rules.SystemPropertiesInvariantRule$1.evaluate(SystemPropertiesInvariantRule.java:55)
	at com.carrotsearch.randomizedtesting.rules.NoShadowingOrOverridesOnMethodsRule$1.evaluate(NoShadowingOrOverridesOnMethodsRule.java:39)
	at com.carrotsearch.randomizedtesting.rules.NoShadowingOrOverridesOnMethodsRule$1.evaluate(NoShadowingOrOverridesOnMethodsRule.java:39)
	at com.carrotsearch.randomizedtesting.rules.StatementAdapter.evaluate(StatementAdapter.java:36)
	at org.apache.lucene.util.TestRuleAssertionsRequired$1.evaluate(TestRuleAssertionsRequired.java:43)
	at org.apache.lucene.util.TestRuleMarkFailure$1.evaluate(TestRuleMarkFailure.java:48)
	at org.apache.lucene.util.TestRuleIgnoreAfterMaxFailures$1.evaluate(TestRuleIgnoreAfterMaxFailures.java:70)
	at org.apache.lucene.util.TestRuleIgnoreTestSuites$1.evaluate(TestRuleIgnoreTestSuites.java:55)
	at com.carrotsearch.randomizedtesting.rules.StatementAdapter.evaluate(StatementAdapter.java:36)
	at com.carrotsearch.randomizedtesting.ThreadLeakControl$StatementRunner.run(ThreadLeakControl.java:358)
	at java.lang.Thread.run(Thread.java:679)




Build Log:
[...truncated 8271 lines...]
[junit4:junit4] Suite: org.apache.solr.cloud.SyncSliceTest
[junit4:junit4]   2> 1 T156 oas.BaseDistributedSearchTestCase.initHostContext Setting hostContext system property: /_zw/
[junit4:junit4]   2> 8 T156 oas.SolrTestCaseJ4.setUp ###Starting testDistribSearch
[junit4:junit4]   2> Creating dataDir: /usr/home/hudson/hudson-slave/workspace/Lucene-Solr-NightlyTests-trunk/solr/build/solr-core/test/J0/./solrtest-SyncSliceTest-1363188112562
[junit4:junit4]   2> 9 T156 oasc.ZkTestServer.run STARTING ZK TEST SERVER
[junit4:junit4]   2> 10 T157 oasc.ZkTestServer$ZKServerMain.runFromConfig Starting server
[junit4:junit4]   2> 14 T157 oazs.ZooKeeperServer.setTickTime tickTime set to 1000
[junit4:junit4]   2> 14 T157 oazs.ZooKeeperServer.setMinSessionTimeout minSessionTimeout set to -1
[junit4:junit4]   2> 15 T157 oazs.ZooKeeperServer.setMaxSessionTimeout maxSessionTimeout set to -1
[junit4:junit4]   2> 15 T157 oazs.NIOServerCnxnFactory.configure binding to port 0.0.0.0/0.0.0.0:0
[junit4:junit4]   2> 17 T157 oazsp.FileTxnSnapLog.save Snapshotting: 0x0 to /usr/home/hudson/hudson-slave/workspace/Lucene-Solr-NightlyTests-trunk/solr/build/solr-core/test/J0/./org.apache.solr.cloud.SyncSliceTest-1363188112562/zookeeper/server1/data/version-2/snapshot.0
[junit4:junit4]   2> 110 T156 oasc.ZkTestServer.run start zk server on port:40935
[junit4:junit4]   2> 110 T156 oaz.ZooKeeper.<init> Initiating client connection, connectString=127.0.0.1:40935 sessionTimeout=10000 watcher=org.apache.solr.common.cloud.ConnectionManager@138c3c8f
[junit4:junit4]   2> 112 T156 oascc.ConnectionManager.waitForConnected Waiting for client to connect to ZooKeeper
[junit4:junit4]   2> 112 T162 oaz.ClientCnxn$SendThread.logStartConnect Opening socket connection to server localhost/127.0.0.1:40935. Will not attempt to authenticate using SASL (access denied (javax.security.auth.AuthPermission getLoginConfiguration))
[junit4:junit4]   2> 113 T162 oaz.ClientCnxn$SendThread.primeConnection Socket connection established to localhost/127.0.0.1:40935, initiating session
[junit4:junit4]   2> 114 T158 oazs.NIOServerCnxnFactory.run Accepted socket connection from /140.211.11.196:39044
[junit4:junit4]   2> 114 T158 oazs.ZooKeeperServer.processConnectRequest Client attempting to establish new session at /140.211.11.196:39044
[junit4:junit4]   2> 115 T160 oazsp.FileTxnLog.append Creating new log file: log.1
[junit4:junit4]   2> 120 T160 oazs.ZooKeeperServer.finishSessionInit Established session 0x13d6457dcbc0000 with negotiated timeout 10000 for client /140.211.11.196:39044
[junit4:junit4]   2> 120 T162 oaz.ClientCnxn$SendThread.onConnected Session establishment complete on server localhost/127.0.0.1:40935, sessionid = 0x13d6457dcbc0000, negotiated timeout = 10000
[junit4:junit4]   2> 121 T163 oascc.ConnectionManager.process Watcher org.apache.solr.common.cloud.ConnectionManager@138c3c8f name:ZooKeeperConnection Watcher:127.0.0.1:40935 got event WatchedEvent state:SyncConnected type:None path:null path:null type:None
[junit4:junit4]   2> 121 T156 oascc.ConnectionManager.waitForConnected Client is connected to ZooKeeper
[junit4:junit4]   2> 122 T156 oascc.SolrZkClient.makePath makePath: /solr
[junit4:junit4]   2> 137 T161 oazs.PrepRequestProcessor.pRequest2Txn Processed session termination for sessionid: 0x13d6457dcbc0000
[junit4:junit4]   2> 139 T163 oaz.ClientCnxn$EventThread.run EventThread shut down
[junit4:junit4]   2> 139 T156 oaz.ZooKeeper.close Session: 0x13d6457dcbc0000 closed
[junit4:junit4]   2> 139 T158 oazs.NIOServerCnxn.closeSock Closed socket connection for client /140.211.11.196:39044 which had sessionid 0x13d6457dcbc0000
[junit4:junit4]   2> 140 T156 oaz.ZooKeeper.<init> Initiating client connection, connectString=127.0.0.1:40935/solr sessionTimeout=10000 watcher=org.apache.solr.common.cloud.ConnectionManager@6280d069
[junit4:junit4]   2> 141 T156 oascc.ConnectionManager.waitForConnected Waiting for client to connect to ZooKeeper
[junit4:junit4]   2> 142 T164 oaz.ClientCnxn$SendThread.logStartConnect Opening socket connection to server localhost/127.0.0.1:40935. Will not attempt to authenticate using SASL (access denied (javax.security.auth.AuthPermission getLoginConfiguration))
[junit4:junit4]   2> 142 T164 oaz.ClientCnxn$SendThread.primeConnection Socket connection established to localhost/127.0.0.1:40935, initiating session
[junit4:junit4]   2> 142 T158 oazs.NIOServerCnxnFactory.run Accepted socket connection from /140.211.11.196:38162
[junit4:junit4]   2> 143 T158 oazs.ZooKeeperServer.processConnectRequest Client attempting to establish new session at /140.211.11.196:38162
[junit4:junit4]   2> 145 T160 oazs.ZooKeeperServer.finishSessionInit Established session 0x13d6457dcbc0001 with negotiated timeout 10000 for client /140.211.11.196:38162
[junit4:junit4]   2> 145 T164 oaz.ClientCnxn$SendThread.onConnected Session establishment complete on server localhost/127.0.0.1:40935, sessionid = 0x13d6457dcbc0001, negotiated timeout = 10000
[junit4:junit4]   2> 146 T165 oascc.ConnectionManager.process Watcher org.apache.solr.common.cloud.ConnectionManager@6280d069 name:ZooKeeperConnection Watcher:127.0.0.1:40935/solr got event WatchedEvent state:SyncConnected type:None path:null path:null type:None
[junit4:junit4]   2> 146 T156 oascc.ConnectionManager.waitForConnected Client is connected to ZooKeeper
[junit4:junit4]   2> 147 T156 oascc.SolrZkClient.makePath makePath: /collections/collection1
[junit4:junit4]   2> 154 T156 oascc.SolrZkClient.makePath makePath: /collections/collection1/shards
[junit4:junit4]   2> 161 T156 oascc.SolrZkClient.makePath makePath: /collections/control_collection
[junit4:junit4]   2> 166 T156 oascc.SolrZkClient.makePath makePath: /collections/control_collection/shards
[junit4:junit4]   2> 173 T156 oasc.AbstractZkTestCase.putConfig put /usr/home/hudson/hudson-slave/workspace/Lucene-Solr-NightlyTests-trunk/solr/build/solr-core/test-files/solr/collection1/conf/solrconfig-tlog.xml to /configs/conf1/solrconfig.xml
[junit4:junit4]   2> 174 T156 oascc.SolrZkClient.makePath makePath: /configs/conf1/solrconfig.xml
[junit4:junit4]   2> 190 T156 oasc.AbstractZkTestCase.putConfig put /usr/home/hudson/hudson-slave/workspace/Lucene-Solr-NightlyTests-trunk/solr/build/solr-core/test-files/solr/collection1/conf/schema.xml to /configs/conf1/schema.xml
[junit4:junit4]   2> 191 T156 oascc.SolrZkClient.makePath makePath: /configs/conf1/schema.xml
[junit4:junit4]   2> 199 T156 oasc.AbstractZkTestCase.putConfig put /usr/home/hudson/hudson-slave/workspace/Lucene-Solr-NightlyTests-trunk/solr/build/solr-core/test-files/solr/collection1/conf/stopwords.txt to /configs/conf1/stopwords.txt
[junit4:junit4]   2> 200 T156 oascc.SolrZkClient.makePath makePath: /configs/conf1/stopwords.txt
[junit4:junit4]   2> 207 T156 oasc.AbstractZkTestCase.putConfig put /usr/home/hudson/hudson-slave/workspace/Lucene-Solr-NightlyTests-trunk/solr/build/solr-core/test-files/solr/collection1/conf/protwords.txt to /configs/conf1/protwords.txt
[junit4:junit4]   2> 208 T156 oascc.SolrZkClient.makePath makePath: /configs/conf1/protwords.txt
[junit4:junit4]   2> 215 T156 oasc.AbstractZkTestCase.putConfig put /usr/home/hudson/hudson-slave/workspace/Lucene-Solr-NightlyTests-trunk/solr/build/solr-core/test-files/solr/collection1/conf/currency.xml to /configs/conf1/currency.xml
[junit4:junit4]   2> 217 T156 oascc.SolrZkClient.makePath makePath: /configs/conf1/currency.xml
[junit4:junit4]   2> 224 T156 oasc.AbstractZkTestCase.putConfig put /usr/home/hudson/hudson-slave/workspace/Lucene-Solr-NightlyTests-trunk/solr/build/solr-core/test-files/solr/collection1/conf/open-exchange-rates.json to /configs/conf1/open-exchange-rates.json
[junit4:junit4]   2> 225 T156 oascc.SolrZkClient.makePath makePath: /configs/conf1/open-exchange-rates.json
[junit4:junit4]   2> 232 T156 oasc.AbstractZkTestCase.putConfig put /usr/home/hudson/hudson-slave/workspace/Lucene-Solr-NightlyTests-trunk/solr/build/solr-core/test-files/solr/collection1/conf/mapping-ISOLatin1Accent.txt to /configs/conf1/mapping-ISOLatin1Accent.txt
[junit4:junit4]   2> 233 T156 oascc.SolrZkClient.makePath makePath: /configs/conf1/mapping-ISOLatin1Accent.txt
[junit4:junit4]   2> 239 T156 oasc.AbstractZkTestCase.putConfig put /usr/home/hudson/hudson-slave/workspace/Lucene-Solr-NightlyTests-trunk/solr/build/solr-core/test-files/solr/collection1/conf/old_synonyms.txt to /configs/conf1/old_synonyms.txt
[junit4:junit4]   2> 240 T156 oascc.SolrZkClient.makePath makePath: /configs/conf1/old_synonyms.txt
[junit4:junit4]   2> 246 T156 oasc.AbstractZkTestCase.putConfig put /usr/home/hudson/hudson-slave/workspace/Lucene-Solr-NightlyTests-trunk/solr/build/solr-core/test-files/solr/collection1/conf/synonyms.txt to /configs/conf1/synonyms.txt
[junit4:junit4]   2> 247 T156 oascc.SolrZkClient.makePath makePath: /configs/conf1/synonyms.txt
[junit4:junit4]   2> 253 T161 oazs.PrepRequestProcessor.pRequest2Txn Processed session termination for sessionid: 0x13d6457dcbc0001
[junit4:junit4]   2> 255 T158 oazs.NIOServerCnxn.closeSock Closed socket connection for client /140.211.11.196:38162 which had sessionid 0x13d6457dcbc0001
[junit4:junit4]   2> 255 T165 oaz.ClientCnxn$EventThread.run EventThread shut down
[junit4:junit4]   2> 255 T156 oaz.ZooKeeper.close Session: 0x13d6457dcbc0001 closed
[junit4:junit4]   2> 487 T156 oejs.Server.doStart jetty-8.1.8.v20121106
[junit4:junit4]   2> 492 T156 oejs.AbstractConnector.doStart Started SocketConnector@127.0.0.1:12835
[junit4:junit4]   2> 492 T156 oass.SolrDispatchFilter.init SolrDispatchFilter.init()
[junit4:junit4]   2> 493 T156 oasc.SolrResourceLoader.locateSolrHome JNDI not configured for solr (NoInitialContextEx)
[junit4:junit4]   2> 494 T156 oasc.SolrResourceLoader.locateSolrHome using system property solr.solr.home: /usr/home/hudson/hudson-slave/workspace/Lucene-Solr-NightlyTests-trunk/solr/build/solr-core/test/J0/./org.apache.solr.cloud.SyncSliceTest-controljetty-1363188112810
[junit4:junit4]   2> 494 T156 oasc.CoreContainer$Initializer.initialize looking for solr config file: /usr/home/hudson/hudson-slave/workspace/Lucene-Solr-NightlyTests-trunk/solr/build/solr-core/test/J0/./org.apache.solr.cloud.SyncSliceTest-controljetty-1363188112810/solr.xml
[junit4:junit4]   2> 495 T156 oasc.CoreContainer.<init> New CoreContainer 600962034
[junit4:junit4]   2> 496 T156 oasc.CoreContainer.load Loading CoreContainer using Solr Home: '/usr/home/hudson/hudson-slave/workspace/Lucene-Solr-NightlyTests-trunk/solr/build/solr-core/test/J0/./org.apache.solr.cloud.SyncSliceTest-controljetty-1363188112810/'
[junit4:junit4]   2> 496 T156 oasc.SolrResourceLoader.<init> new SolrResourceLoader for directory: '/usr/home/hudson/hudson-slave/workspace/Lucene-Solr-NightlyTests-trunk/solr/build/solr-core/test/J0/./org.apache.solr.cloud.SyncSliceTest-controljetty-1363188112810/'
[junit4:junit4]   2> 555 T156 oashc.HttpShardHandlerFactory.getParameter Setting socketTimeout to: 120000
[junit4:junit4]   2> 556 T156 oashc.HttpShardHandlerFactory.getParameter Setting urlScheme to: http://
[junit4:junit4]   2> 556 T156 oashc.HttpShardHandlerFactory.getParameter Setting connTimeout to: 15000
[junit4:junit4]   2> 557 T156 oashc.HttpShardHandlerFactory.getParameter Setting maxConnectionsPerHost to: 20
[junit4:junit4]   2> 557 T156 oashc.HttpShardHandlerFactory.getParameter Setting corePoolSize to: 0
[junit4:junit4]   2> 558 T156 oashc.HttpShardHandlerFactory.getParameter Setting maximumPoolSize to: 2147483647
[junit4:junit4]   2> 558 T156 oashc.HttpShardHandlerFactory.getParameter Setting maxThreadIdleTime to: 5
[junit4:junit4]   2> 559 T156 oashc.HttpShardHandlerFactory.getParameter Setting sizeOfQueue to: -1
[junit4:junit4]   2> 559 T156 oashc.HttpShardHandlerFactory.getParameter Setting fairnessPolicy to: false
[junit4:junit4]   2> 560 T156 oascsi.HttpClientUtil.createClient Creating new http client, config:maxConnectionsPerHost=20&maxConnections=10000&socketTimeout=120000&connTimeout=15000&retry=false
[junit4:junit4]   2> 584 T156 oasc.CoreContainer.load Registering Log Listener
[junit4:junit4]   2> 604 T156 oasc.CoreContainer.initZooKeeper Zookeeper client=127.0.0.1:40935/solr
[junit4:junit4]   2> 604 T156 oasc.ZkController.checkChrootPath zkHost includes chroot
[junit4:junit4]   2> 605 T156 oaz.ZooKeeper.<init> Initiating client connection, connectString=127.0.0.1:40935 sessionTimeout=60000 watcher=org.apache.solr.common.cloud.ConnectionManager@5aedacd2
[junit4:junit4]   2> 606 T156 oascc.ConnectionManager.waitForConnected Waiting for client to connect to ZooKeeper
[junit4:junit4]   2> 607 T175 oaz.ClientCnxn$SendThread.logStartConnect Opening socket connection to server localhost/127.0.0.1:40935. Will not attempt to authenticate using SASL (access denied (javax.security.auth.AuthPermission getLoginConfiguration))
[junit4:junit4]   2> 607 T175 oaz.ClientCnxn$SendThread.primeConnection Socket connection established to localhost/127.0.0.1:40935, initiating session
[junit4:junit4]   2> 608 T158 oazs.NIOServerCnxnFactory.run Accepted socket connection from /140.211.11.196:49123
[junit4:junit4]   2> 608 T158 oazs.ZooKeeperServer.processConnectRequest Client attempting to establish new session at /140.211.11.196:49123
[junit4:junit4]   2> 612 T160 oazs.ZooKeeperServer.finishSessionInit Established session 0x13d6457dcbc0002 with negotiated timeout 20000 for client /140.211.11.196:49123
[junit4:junit4]   2> 612 T175 oaz.ClientCnxn$SendThread.onConnected Session establishment complete on server localhost/127.0.0.1:40935, sessionid = 0x13d6457dcbc0002, negotiated timeout = 20000
[junit4:junit4]   2> 612 T176 oascc.ConnectionManager.process Watcher org.apache.solr.common.cloud.ConnectionManager@5aedacd2 name:ZooKeeperConnection Watcher:127.0.0.1:40935 got event WatchedEvent state:SyncConnected type:None path:null path:null type:None
[junit4:junit4]   2> 613 T156 oascc.ConnectionManager.waitForConnected Client is connected to ZooKeeper
[junit4:junit4]   2> 615 T161 oazs.PrepRequestProcessor.pRequest2Txn Processed session termination for sessionid: 0x13d6457dcbc0002
[junit4:junit4]   2> 639 T176 oaz.ClientCnxn$EventThread.run EventThread shut down
[junit4:junit4]   2> 639 T158 oazs.NIOServerCnxn.closeSock Closed socket connection for client /140.211.11.196:49123 which had sessionid 0x13d6457dcbc0002
[junit4:junit4]   2> 639 T156 oaz.ZooKeeper.close Session: 0x13d6457dcbc0002 closed
[junit4:junit4]   2> 641 T156 oascsi.HttpClientUtil.createClient Creating new http client, config:maxConnections=500&maxConnectionsPerHost=16&socketTimeout=120000&connTimeout=15000
[junit4:junit4]   2> 655 T156 oaz.ZooKeeper.<init> Initiating client connection, connectString=127.0.0.1:40935/solr sessionTimeout=30000 watcher=org.apache.solr.common.cloud.ConnectionManager@77fa37d2
[junit4:junit4]   2> 656 T156 oascc.ConnectionManager.waitForConnected Waiting for client to connect to ZooKeeper
[junit4:junit4]   2> 657 T177 oaz.ClientCnxn$SendThread.logStartConnect Opening socket connection to server localhost/127.0.0.1:40935. Will not attempt to authenticate using SASL (access denied (javax.security.auth.AuthPermission getLoginConfiguration))
[junit4:junit4]   2> 658 T177 oaz.ClientCnxn$SendThread.primeConnection Socket connection established to localhost/127.0.0.1:40935, initiating session
[junit4:junit4]   2> 658 T158 oazs.NIOServerCnxnFactory.run Accepted socket connection from /140.211.11.196:35835
[junit4:junit4]   2> 659 T158 oazs.ZooKeeperServer.processConnectRequest Client attempting to establish new session at /140.211.11.196:35835
[junit4:junit4]   2> 660 T160 oazs.ZooKeeperServer.finishSessionInit Established session 0x13d6457dcbc0003 with negotiated timeout 20000 for client /140.211.11.196:35835
[junit4:junit4]   2> 661 T177 oaz.ClientCnxn$SendThread.onConnected Session establishment complete on server localhost/127.0.0.1:40935, sessionid = 0x13d6457dcbc0003, negotiated timeout = 20000
[junit4:junit4]   2> 661 T178 oascc.ConnectionManager.process Watcher org.apache.solr.common.cloud.ConnectionManager@77fa37d2 name:ZooKeeperConnection Watcher:127.0.0.1:40935/solr got event WatchedEvent state:SyncConnected type:None path:null path:null type:None
[junit4:junit4]   2> 662 T156 oascc.ConnectionManager.waitForConnected Client is connected to ZooKeeper
[junit4:junit4]   2> 703 T161 oazs.PrepRequestProcessor.pRequest Got user-level KeeperException when processing sessionid:0x13d6457dcbc0003 type:create cxid:0x2 zxid:0x1a txntype:-1 reqpath:n/a Error Path:/solr/overseer Error:KeeperErrorCode = NodeExists for /solr/overseer
[junit4:junit4]   2> 707 T156 oascc.SolrZkClient.makePath makePath: /live_nodes
[junit4:junit4]   2> 712 T156 oasc.ZkController.createEphemeralLiveNode Register node as live in ZooKeeper:/live_nodes/127.0.0.1:12835__zw
[junit4:junit4]   2> 713 T161 oazs.PrepRequestProcessor.pRequest Got user-level KeeperException when processing sessionid:0x13d6457dcbc0003 type:delete cxid:0x8 zxid:0x1c txntype:-1 reqpath:n/a Error Path:/solr/live_nodes/127.0.0.1:12835__zw Error:KeeperErrorCode = NoNode for /solr/live_nodes/127.0.0.1:12835__zw
[junit4:junit4]   2> 715 T156 oascc.SolrZkClient.makePath makePath: /live_nodes/127.0.0.1:12835__zw
[junit4:junit4]   2> 721 T156 oascc.SolrZkClient.makePath makePath: /overseer_elect/election
[junit4:junit4]   2> 747 T161 oazs.PrepRequestProcessor.pRequest Got user-level KeeperException when processing sessionid:0x13d6457dcbc0003 type:delete cxid:0x16 zxid:0x21 txntype:-1 reqpath:n/a Error Path:/solr/overseer_elect/leader Error:KeeperErrorCode = NoNode for /solr/overseer_elect/leader
[junit4:junit4]   2> 748 T156 oascc.SolrZkClient.makePath makePath: /overseer_elect/leader
[junit4:junit4]   2> 800 T156 oasc.Overseer.start Overseer (id=89337896145518595-127.0.0.1:12835__zw-n_0000000000) starting
[junit4:junit4]   2> 802 T161 oazs.PrepRequestProcessor.pRequest Got user-level KeeperException when processing sessionid:0x13d6457dcbc0003 type:create cxid:0x1b zxid:0x23 txntype:-1 reqpath:n/a Error Path:/solr/overseer Error:KeeperErrorCode = NodeExists for /solr/overseer
[junit4:junit4]   2> 805 T161 oazs.PrepRequestProcessor.pRequest Got user-level KeeperException when processing sessionid:0x13d6457dcbc0003 type:create cxid:0x1c zxid:0x24 txntype:-1 reqpath:n/a Error Path:/solr/overseer Error:KeeperErrorCode = NodeExists for /solr/overseer
[junit4:junit4]   2> 807 T161 oazs.PrepRequestProcessor.pRequest Got user-level KeeperException when processing sessionid:0x13d6457dcbc0003 type:create cxid:0x1d zxid:0x25 txntype:-1 reqpath:n/a Error Path:/solr/overseer Error:KeeperErrorCode = NodeExists for /solr/overseer
[junit4:junit4]   2> 816 T161 oazs.PrepRequestProcessor.pRequest Got user-level KeeperException when processing sessionid:0x13d6457dcbc0003 type:create cxid:0x1e zxid:0x26 txntype:-1 reqpath:n/a Error Path:/solr/overseer Error:KeeperErrorCode = NodeExists for /solr/overseer
[junit4:junit4]   2> 821 T180 oasc.OverseerCollectionProcessor.run Process current queue of collection creations
[junit4:junit4]   2> 823 T156 oascc.SolrZkClient.makePath makePath: /clusterstate.json
[junit4:junit4]   2> 828 T156 oascc.SolrZkClient.makePath makePath: /aliases.json
[junit4:junit4]   2> 838 T156 oascc.ZkStateReader.createClusterStateWatchersAndUpdate Updating cluster state from ZooKeeper... 
[junit4:junit4]   2> 843 T179 oasc.Overseer$ClusterStateUpdater.run Starting to work on the main queue
[junit4:junit4]   2> 847 T181 oasc.CoreContainer.create Creating SolrCore 'collection1' using instanceDir: /usr/home/hudson/hudson-slave/workspace/Lucene-Solr-NightlyTests-trunk/solr/build/solr-core/test/J0/./org.apache.solr.cloud.SyncSliceTest-controljetty-1363188112810/collection1
[junit4:junit4]   2> 848 T181 oasc.ZkController.createCollectionZkNode Check for collection zkNode:control_collection
[junit4:junit4]   2> 849 T181 oasc.ZkController.createCollectionZkNode Collection zkNode exists
[junit4:junit4]   2> 849 T181 oasc.ZkController.readConfigName Load collection config from:/collections/control_collection
[junit4:junit4]   2> 851 T181 oasc.SolrResourceLoader.<init> new SolrResourceLoader for directory: '/usr/home/hudson/hudson-slave/workspace/Lucene-Solr-NightlyTests-trunk/solr/build/solr-core/test/J0/./org.apache.solr.cloud.SyncSliceTest-controljetty-1363188112810/collection1/'
[junit4:junit4]   2> 853 T181 oasc.SolrResourceLoader.replaceClassLoader Adding 'file:/usr/home/hudson/hudson-slave/workspace/Lucene-Solr-NightlyTests-trunk/solr/build/solr-core/test/J0/org.apache.solr.cloud.SyncSliceTest-controljetty-1363188112810/collection1/lib/README' to classloader
[junit4:junit4]   2> 854 T181 oasc.SolrResourceLoader.replaceClassLoader Adding 'file:/usr/home/hudson/hudson-slave/workspace/Lucene-Solr-NightlyTests-trunk/solr/build/solr-core/test/J0/org.apache.solr.cloud.SyncSliceTest-controljetty-1363188112810/collection1/lib/classes/' to classloader
[junit4:junit4]   2> 919 T181 oasc.SolrConfig.<init> Using Lucene MatchVersion: LUCENE_50
[junit4:junit4]   2> 999 T181 oasc.SolrConfig.<init> Loaded SolrConfig: solrconfig.xml
[junit4:junit4]   2> 1001 T181 oass.IndexSchema.readSchema Reading Solr Schema
[junit4:junit4]   2> 1014 T181 oass.IndexSchema.readSchema Schema name=test
[junit4:junit4]   2> 1821 T181 oass.OpenExchangeRatesOrgProvider.init Initialized with rates=open-exchange-rates.json, refreshInterval=1440.
[junit4:junit4]   2> 1837 T181 oass.IndexSchema.readSchema default search field in schema is text
[junit4:junit4]   2> 1843 T181 oass.IndexSchema.readSchema unique key field: id
[junit4:junit4]   2> 1873 T181 oass.FileExchangeRateProvider.reload Reloading exchange rates from file currency.xml
[junit4:junit4]   2> 1879 T181 oass.FileExchangeRateProvider.reload Reloading exchange rates from file currency.xml
[junit4:junit4]   2> 1884 T181 oass.OpenExchangeRatesOrgProvider.reload Reloading exchange rates from open-exchange-rates.json
[junit4:junit4]   2> 1886 T181 oass.OpenExchangeRatesOrgProvider$OpenExchangeRates.<init> WARNING Unknown key IMPORTANT NOTE
[junit4:junit4]   2> 1887 T181 oass.OpenExchangeRatesOrgProvider$OpenExchangeRates.<init> WARNING Expected key, got STRING
[junit4:junit4]   2> 1887 T181 oass.OpenExchangeRatesOrgProvider.reload Reloading exchange rates from open-exchange-rates.json
[junit4:junit4]   2> 1889 T181 oass.OpenExchangeRatesOrgProvider$OpenExchangeRates.<init> WARNING Unknown key IMPORTANT NOTE
[junit4:junit4]   2> 1890 T181 oass.OpenExchangeRatesOrgProvider$OpenExchangeRates.<init> WARNING Expected key, got STRING
[junit4:junit4]   2> 1890 T181 oasc.SolrCore.initDirectoryFactory org.apache.solr.core.MockDirectoryFactory
[junit4:junit4]   2> 1890 T181 oasc.SolrCore.<init> [collection1] Opening new SolrCore at /usr/home/hudson/hudson-slave/workspace/Lucene-Solr-NightlyTests-trunk/solr/build/solr-core/test/J0/./org.apache.solr.cloud.SyncSliceTest-controljetty-1363188112810/collection1/, dataDir=./org.apache.solr.cloud.SyncSliceTest-1363188112562/control/data/
[junit4:junit4]   2> 1891 T181 oasc.JmxMonitoredMap.<init> JMX monitoring is enabled. Adding Solr mbeans to JMX Server: com.sun.jmx.mbeanserver.JmxMBeanServer@2cc22a3b
[junit4:junit4]   2> 1891 T181 oasc.SolrCore.initDirectoryFactory org.apache.solr.core.MockDirectoryFactory
[junit4:junit4]   2> 1892 T181 oasc.CachingDirectoryFactory.get return new directory for ./org.apache.solr.cloud.SyncSliceTest-1363188112562/control/data forceNew: false
[junit4:junit4]   2> 1893 T181 oasc.SolrCore.getNewIndexDir New index directory detected: old=null new=./org.apache.solr.cloud.SyncSliceTest-1363188112562/control/data/index/
[junit4:junit4]   2> 1893 T181 oasc.SolrCore.initIndex WARNING [collection1] Solr index directory './org.apache.solr.cloud.SyncSliceTest-1363188112562/control/data/index' doesn't exist. Creating new index...
[junit4:junit4]   2> 1893 T181 oasc.CachingDirectoryFactory.get return new directory for ./org.apache.solr.cloud.SyncSliceTest-1363188112562/control/data/index forceNew: false
[junit4:junit4]   2> 1897 T181 oasc.SolrDeletionPolicy.onCommit SolrDeletionPolicy.onCommit: commits:num=1
[junit4:junit4]   2> 		commit{dir=BaseDirectoryWrapper(org.apache.lucene.store.RAMDirectory@4247609b lockFactory=org.apache.lucene.store.NativeFSLockFactory@b5ee9d9),segFN=segments_1,generation=1,filenames=[segments_1]
[junit4:junit4]   2> 1898 T181 oasc.SolrDeletionPolicy.updateCommits newest commit = 1[segments_1]
[junit4:junit4]   2> 1901 T181 oasup.UpdateRequestProcessorChain.init inserting DistributedUpdateProcessorFactory into updateRequestProcessorChain "dedupe"
[junit4:junit4]   2> 1901 T181 oasup.UpdateRequestProcessorChain.init inserting DistributedUpdateProcessorFactory into updateRequestProcessorChain "stored_sig"
[junit4:junit4]   2> 1902 T181 oasup.UpdateRequestProcessorChain.init inserting DistributedUpdateProcessorFactory into updateRequestProcessorChain "distrib-dup-test-chain-implicit"
[junit4:junit4]   2> 1903 T181 oasc.RequestHandlers.initHandlersFromConfig created standard: solr.StandardRequestHandler
[junit4:junit4]   2> 1903 T181 oasc.RequestHandlers.initHandlersFromConfig created /get: solr.RealTimeGetHandler
[junit4:junit4]   2> 1904 T181 oasc.RequestHandlers.initHandlersFromConfig adding lazy requestHandler: solr.ReplicationHandler
[junit4:junit4]   2> 1904 T181 oasc.RequestHandlers.initHandlersFromConfig created /replication: solr.ReplicationHandler
[junit4:junit4]   2> 1905 T181 oasc.RequestHandlers.initHandlersFromConfig created /update: solr.UpdateRequestHandler
[junit4:junit4]   2> 1905 T181 oasc.RequestHandlers.initHandlersFromConfig created /admin/: org.apache.solr.handler.admin.AdminHandlers
[junit4:junit4]   2> 1914 T181 oashl.XMLLoader.init xsltCacheLifetimeSeconds=60
[junit4:junit4]   2> 1921 T181 oass.SolrIndexSearcher.<init> Opening Searcher@4136083b main
[junit4:junit4]   2> 1922 T181 oasu.UpdateHandler.clearLog Clearing tlog files, tlogDir=./org.apache.solr.cloud.SyncSliceTest-1363188112562/control/data/tlog
[junit4:junit4]   2> 1923 T181 oasu.CommitTracker.<init> Hard AutoCommit: disabled
[junit4:junit4]   2> 1923 T181 oasu.CommitTracker.<init> Soft AutoCommit: disabled
[junit4:junit4]   2> 1928 T182 oasc.SolrCore.registerSearcher [collection1] Registered new searcher Searcher@4136083b main{StandardDirectoryReader(segments_1:1)}
[junit4:junit4]   2> 1931 T181 oasc.ZkController.publish publishing core=collection1 state=down
[junit4:junit4]   2> 1932 T181 oasc.ZkController.publish numShards not found on descriptor - reading it from system property
[junit4:junit4]   2> 1933 T161 oazs.PrepRequestProcessor.pRequest Got user-level KeeperException when processing sessionid:0x13d6457dcbc0003 type:create cxid:0x55 zxid:0x2a txntype:-1 reqpath:n/a Error Path:/solr/overseer/queue Error:KeeperErrorCode = NoNode for /solr/overseer/queue
[junit4:junit4]   2> 2351 T179 oascc.ZkStateReader.updateClusterState Updating cloud state from ZooKeeper... 
[junit4:junit4]   2> 2352 T179 oasc.Overseer$ClusterStateUpdater.updateState Update state numShards=1 message={
[junit4:junit4]   2> 	  "operation":"state",
[junit4:junit4]   2> 	  "core_node_name":"1",
[junit4:junit4]   2> 	  "numShards":"1",
[junit4:junit4]   2> 	  "shard":null,
[junit4:junit4]   2> 	  "roles":null,
[junit4:junit4]   2> 	  "state":"down",
[junit4:junit4]   2> 	  "core":"collection1",
[junit4:junit4]   2> 	  "collection":"control_collection",
[junit4:junit4]   2> 	  "node_name":"127.0.0.1:12835__zw",
[junit4:junit4]   2> 	  "base_url":"http://127.0.0.1:12835/_zw"}
[junit4:junit4]   2> 2353 T179 oasc.Overseer$ClusterStateUpdater.createCollection Create collection control_collection with numShards 1
[junit4:junit4]   2> 2353 T179 oasc.Overseer$ClusterStateUpdater.updateState Assigning new node to shard shard=shard1
[junit4:junit4]   2> 2354 T161 oazs.PrepRequestProcessor.pRequest Got user-level KeeperException when processing sessionid:0x13d6457dcbc0003 type:create cxid:0x5d zxid:0x2d txntype:-1 reqpath:n/a Error Path:/solr/overseer/queue-work Error:KeeperErrorCode = NoNode for /solr/overseer/queue-work
[junit4:junit4]   2> 2371 T178 oascc.ZkStateReader$2.process A cluster state change: WatchedEvent state:SyncConnected type:NodeDataChanged path:/clusterstate.json, has occurred - updating... (live nodes size: 1)
[junit4:junit4]   2> 2981 T181 oasc.CoreContainer.registerCore registering core: collection1
[junit4:junit4]   2> 2981 T181 oasc.ZkController.register Register replica - core:collection1 address:http://127.0.0.1:12835/_zw collection:control_collection shard:shard1
[junit4:junit4]   2> 2982 T181 oascc.SolrZkClient.makePath makePath: /collections/control_collection/leader_elect/shard1/election
[junit4:junit4]   2> 2995 T161 oazs.PrepRequestProcessor.pRequest Got user-level KeeperException when processing sessionid:0x13d6457dcbc0003 type:delete cxid:0x77 zxid:0x37 txntype:-1 reqpath:n/a Error Path:/solr/collections/control_collection/leaders Error:KeeperErrorCode = NoNode for /solr/collections/control_collection/leaders
[junit4:junit4]   2> 2996 T181 oasc.ShardLeaderElectionContext.runLeaderProcess Running the leader process.
[junit4:junit4]   2> 2997 T161 oazs.PrepRequestProcessor.pRequest Got user-level KeeperException when processing sessionid:0x13d6457dcbc0003 type:create cxid:0x78 zxid:0x38 txntype:-1 reqpath:n/a Error Path:/solr/overseer Error:KeeperErrorCode = NodeExists for /solr/overseer
[junit4:junit4]   2> 3006 T181 oasc.ShardLeaderElectionContext.waitForReplicasToComeUp Enough replicas found to continue.
[junit4:junit4]   2> 3007 T181 oasc.ShardLeaderElectionContext.runLeaderProcess I may be the new leader - try and sync
[junit4:junit4]   2> 3007 T181 oasc.SyncStrategy.sync Sync replicas to http://127.0.0.1:12835/_zw/collection1/
[junit4:junit4]   2> 3007 T181 oasc.SyncStrategy.syncReplicas Sync Success - now sync replicas to me
[junit4:junit4]   2> 3007 T181 oasc.SyncStrategy.syncToMe http://127.0.0.1:12835/_zw/collection1/ has no replicas
[junit4:junit4]   2> 3008 T181 oasc.ShardLeaderElectionContext.runLeaderProcess I am the new leader: http://127.0.0.1:12835/_zw/collection1/
[junit4:junit4]   2> 3008 T181 oascc.SolrZkClient.makePath makePath: /collections/control_collection/leaders/shard1
[junit4:junit4]   2> 3016 T161 oazs.PrepRequestProcessor.pRequest Got user-level KeeperException when processing sessionid:0x13d6457dcbc0003 type:create cxid:0x82 zxid:0x3c txntype:-1 reqpath:n/a Error Path:/solr/overseer Error:KeeperErrorCode = NodeExists for /solr/overseer
[junit4:junit4]   2> 3880 T179 oascc.ZkStateReader.updateClusterState Updating cloud state from ZooKeeper... 
[junit4:junit4]   2> 3931 T178 oascc.ZkStateReader$2.process A cluster state change: WatchedEvent state:SyncConnected type:NodeDataChanged path:/clusterstate.json, has occurred - updating... (live nodes size: 1)
[junit4:junit4]   2> 3944 T181 oasc.ZkController.register We are http://127.0.0.1:12835/_zw/collection1/ and leader is http://127.0.0.1:12835/_zw/collection1/
[junit4:junit4]   2> 3944 T181 oasc.ZkController.register No LogReplay needed for core=collection1 baseURL=http://127.0.0.1:12835/_zw
[junit4:junit4]   2> 3944 T181 oasc.ZkController.checkRecovery I am the leader, no recovery necessary
[junit4:junit4]   2> 3944 T181 oasc.ZkController.publish publishing core=collection1 state=active
[junit4:junit4]   2> 3945 T181 oasc.ZkController.publish numShards not found on descriptor - reading it from system property
[junit4:junit4]   2> 3947 T181 oascc.ZkStateReader.updateClusterState Updating cloud state from ZooKeeper... 
[junit4:junit4]   2> 3949 T156 oass.SolrDispatchFilter.init user.dir=/usr/home/hudson/hudson-slave/workspace/Lucene-Solr-NightlyTests-trunk/solr/build/solr-core/test/J0
[junit4:junit4]   2> 3950 T156 oass.SolrDispatchFilter.init SolrDispatchFilter.init() done
[junit4:junit4]   2> 3950 T156 oascsi.HttpClientUtil.createClient Creating new http client, config:maxConnections=128&maxConnectionsPerHost=32&followRedirects=false
[junit4:junit4]   2> 3968 T156 oascsi.HttpClientUtil.createClient Creating new http client, config:
[junit4:junit4]   2> 3969 T156 oaz.ZooKeeper.<init> Initiating client connection, connectString=127.0.0.1:40935/solr sessionTimeout=10000 watcher=org.apache.solr.common.cloud.ConnectionManager@27420a71
[junit4:junit4]   2> 3971 T156 oascc.ConnectionManager.waitForConnected Waiting for client to connect to ZooKeeper
[junit4:junit4]   2> 3971 T184 oaz.ClientCnxn$SendThread.logStartConnect Opening socket connection to server localhost/127.0.0.1:40935. Will not attempt to authenticate using SASL (access denied (javax.security.auth.AuthPermission getLoginConfiguration))
[junit4:junit4]   2> 3972 T184 oaz.ClientCnxn$SendThread.primeConnection Socket connection established to localhost/127.0.0.1:40935, initiating session
[junit4:junit4]   2> 3972 T158 oazs.NIOServerCnxnFactory.run Accepted socket connection from /140.211.11.196:53053
[junit4:junit4]   2> 3973 T158 oazs.ZooKeeperServer.processConnectRequest Client attempting to establish new session at /140.211.11.196:53053
[junit4:junit4]   2> 3975 T160 oazs.ZooKeeperServer.finishSessionInit Established session 0x13d6457dcbc0004 with negotiated timeout 10000 for client /140.211.11.196:53053
[junit4:junit4]   2> 3975 T184 oaz.ClientCnxn$SendThread.onConnected Session establishment complete on server localhost/127.0.0.1:40935, sessionid = 0x13d6457dcbc0004, negotiated timeout = 10000
[junit4:junit4]   2> 3975 T185 oascc.ConnectionManager.process Watcher org.apache.solr.common.cloud.ConnectionManager@27420a71 name:ZooKeeperConnection Watcher:127.0.0.1:40935/solr got event WatchedEvent state:SyncConnected type:None path:null path:null type:None
[junit4:junit4]   2> 3976 T156 oascc.ConnectionManager.waitForConnected Client is connected to ZooKeeper
[junit4:junit4]   2> 3978 T156 oascc.ZkStateReader.createClusterStateWatchersAndUpdate Updating cluster state from ZooKeeper... 
[junit4:junit4]   2> 3982 T156 oasc.ChaosMonkey.monkeyLog monkey: init - expire sessions:true cause connection loss:true
[junit4:junit4]   2> 4351 T156 oejs.Server.doStart jetty-8.1.8.v20121106
[junit4:junit4]   2> 4354 T156 oejs.AbstractConnector.doStart Started SocketConnector@127.0.0.1:33424
[junit4:junit4]   2> 4355 T156 oass.SolrDispatchFilter.init SolrDispatchFilter.init()
[junit4:junit4]   2> 4356 T156 oasc.SolrResourceLoader.locateSolrHome JNDI not configured for solr (NoInitialContextEx)
[junit4:junit4]   2> 4356 T156 oasc.SolrResourceLoader.locateSolrHome using system property solr.solr.home: /usr/home/hudson/hudson-slave/workspace/Lucene-Solr-NightlyTests-trunk/solr/build/solr-core/test/J0/./org.apache.solr.cloud.SyncSliceTest-jetty1-1363188116537
[junit4:junit4]   2> 4357 T156 oasc.CoreContainer$Initializer.initialize looking for solr config file: /usr/home/hudson/hudson-slave/workspace/Lucene-Solr-NightlyTests-trunk/solr/build/solr-core/test/J0/./org.apache.solr.cloud.SyncSliceTest-jetty1-1363188116537/solr.xml
[junit4:junit4]   2> 4358 T156 oasc.CoreContainer.<init> New CoreContainer 932526229
[junit4:junit4]   2> 4358 T156 oasc.CoreContainer.load Loading CoreContainer using Solr Home: '/usr/home/hudson/hudson-slave/workspace/Lucene-Solr-NightlyTests-trunk/solr/build/solr-core/test/J0/./org.apache.solr.cloud.SyncSliceTest-jetty1-1363188116537/'
[junit4:junit4]   2> 4359 T156 oasc.SolrResourceLoader.<init> new SolrResourceLoader for directory: '/usr/home/hudson/hudson-slave/workspace/Lucene-Solr-NightlyTests-trunk/solr/build/solr-core/test/J0/./org.apache.solr.cloud.SyncSliceTest-jetty1-1363188116537/'
[junit4:junit4]   2> 4430 T156 oashc.HttpShardHandlerFactory.getParameter Setting socketTimeout to: 120000
[junit4:junit4]   2> 4431 T156 oashc.HttpShardHandlerFactory.getParameter Setting urlScheme to: http://
[junit4:junit4]   2> 4431 T156 oashc.HttpShardHandlerFactory.getParameter Setting connTimeout to: 15000
[junit4:junit4]   2> 4432 T156 oashc.HttpShardHandlerFactory.getParameter Setting maxConnectionsPerHost to: 20
[junit4:junit4]   2> 4433 T156 oashc.HttpShardHandlerFactory.getParameter Setting corePoolSize to: 0
[junit4:junit4]   2> 4433 T156 oashc.HttpShardHandlerFactory.getParameter Setting maximumPoolSize to: 2147483647
[junit4:junit4]   2> 4434 T156 oashc.HttpShardHandlerFactory.getParameter Setting maxThreadIdleTime to: 5
[junit4:junit4]   2> 4434 T156 oashc.HttpShardHandlerFactory.getParameter Setting sizeOfQueue to: -1
[junit4:junit4]   2> 4435 T156 oashc.HttpShardHandlerFactory.getParameter Setting fairnessPolicy to: false
[junit4:junit4]   2> 4435 T156 oascsi.HttpClientUtil.createClient Creating new http client, config:maxConnectionsPerHost=20&maxConnections=10000&socketTimeout=120000&connTimeout=15000&retry=false
[junit4:junit4]   2> 4466 T156 oasc.CoreContainer.load Registering Log Listener
[junit4:junit4]   2> 4491 T156 oasc.CoreContainer.initZooKeeper Zookeeper client=127.0.0.1:40935/solr
[junit4:junit4]   2> 4492 T156 oasc.ZkController.checkChrootPath zkHost includes chroot
[junit4:junit4]   2> 4492 T156 oaz.ZooKeeper.<init> Initiating client connection, connectString=127.0.0.1:40935 sessionTimeout=60000 watcher=org.apache.solr.common.cloud.ConnectionManager@4629b46a
[junit4:junit4]   2> 4493 T156 oascc.ConnectionManager.waitForConnected Waiting for client to connect to ZooKeeper
[junit4:junit4]   2> 4494 T195 oaz.ClientCnxn$SendThread.logStartConnect Opening socket connection to server localhost/127.0.0.1:40935. Will not attempt to authenticate using SASL (access denied (javax.security.auth.AuthPermission getLoginConfiguration))
[junit4:junit4]   2> 4495 T195 oaz.ClientCnxn$SendThread.primeConnection Socket connection established to localhost/127.0.0.1:40935, initiating session
[junit4:junit4]   2> 4495 T158 oazs.NIOServerCnxnFactory.run Accepted socket connection from /140.211.11.196:55346
[junit4:junit4]   2> 4496 T158 oazs.ZooKeeperServer.processConnectRequest Client attempting to establish new session at /140.211.11.196:55346
[junit4:junit4]   2> 4508 T160 oazs.ZooKeeperServer.finishSessionInit Established session 0x13d6457dcbc0005 with negotiated timeout 20000 for client /140.211.11.196:55346
[junit4:junit4]   2> 4508 T195 oaz.ClientCnxn$SendThread.onConnected Session establishment complete on server localhost/127.0.0.1:40935, sessionid = 0x13d6457dcbc0005, negotiated timeout = 20000
[junit4:junit4]   2> 4509 T196 oascc.ConnectionManager.process Watcher org.apache.solr.common.cloud.ConnectionManager@4629b46a name:ZooKeeperConnection Watcher:127.0.0.1:40935 got event WatchedEvent state:SyncConnected type:None path:null path:null type:None
[junit4:junit4]   2> 4509 T156 oascc.ConnectionManager.waitForConnected Client is connected to ZooKeeper
[junit4:junit4]   2> 4511 T161 oazs.PrepRequestProcessor.pRequest2Txn Processed session termination for sessionid: 0x13d6457dcbc0005
[junit4:junit4]   2> 4524 T196 oaz.ClientCnxn$EventThread.run EventThread shut down
[junit4:junit4]   2> 4524 T156 oaz.ZooKeeper.close Session: 0x13d6457dcbc0005 closed
[junit4:junit4]   2> 4524 T158 oazs.NIOServerCnxn.closeSock Closed socket connection for client /140.211.11.196:55346 which had sessionid 0x13d6457dcbc0005
[junit4:junit4]   2> 4525 T156 oascsi.HttpClientUtil.createClient Creating new http client, config:maxConnections=500&maxConnectionsPerHost=16&socketTimeout=120000&connTimeout=15000
[junit4:junit4]   2> 4539 T156 oaz.ZooKeeper.<init> Initiating client connection, connectString=127.0.0.1:40935/solr sessionTimeout=30000 watcher=org.apache.solr.common.cloud.ConnectionManager@764dabd7
[junit4:junit4]   2> 4540 T156 oascc.ConnectionManager.waitForConnected Waiting for client to connect to ZooKeeper
[junit4:junit4]   2> 4541 T197 oaz.ClientCnxn$SendThread.logStartConnect Opening socket connection to server localhost/127.0.0.1:40935. Will not attempt to authenticate using SASL (access denied (javax.security.auth.AuthPermission getLoginConfiguration))
[junit4:junit4]   2> 4542 T197 oaz.ClientCnxn$SendThread.primeConnection Socket connection established to localhost/127.0.0.1:40935, initiating session
[junit4:junit4]   2> 4542 T158 oazs.NIOServerCnxnFactory.run Accepted socket connection from /140.211.11.196:31994
[junit4:junit4]   2> 4543 T158 oazs.ZooKeeperServer.processConnectRequest Client attempting to establish new session at /140.211.11.196:31994
[junit4:junit4]   2> 4544 T160 oazs.ZooKeeperServer.finishSessionInit Established session 0x13d6457dcbc0006 with negotiated timeout 20000 for client /140.211.11.196:31994
[junit4:junit4]   2> 4544 T197 oaz.ClientCnxn$SendThread.onConnected Session establishment complete on server localhost/127.0.0.1:40935, sessionid = 0x13d6457dcbc0006, negotiated timeout = 20000
[junit4:junit4]   2> 4545 T198 oascc.ConnectionManager.process Watcher org.apache.solr.common.cloud.ConnectionManager@764dabd7 name:ZooKeeperConnection Watcher:127.0.0.1:40935/solr got event WatchedEvent state:SyncConnected type:None path:null path:null type:None
[junit4:junit4]   2> 4545 T156 oascc.ConnectionManager.waitForConnected Client is connected to ZooKeeper
[junit4:junit4]   2> 4547 T161 oazs.PrepRequestProcessor.pRequest Got user-level KeeperException when processing sessionid:0x13d6457dcbc0006 type:create cxid:0x1 zxid:0x4a txntype:-1 reqpath:n/a Error Path:/solr/overseer Error:KeeperErrorCode = NodeExists for /solr/overseer
[junit4:junit4]   2> 4549 T161 oazs.PrepRequestProcessor.pRequest Got user-level KeeperException when processing sessionid:0x13d6457dcbc0006 type:create cxid:0x2 zxid:0x4b txntype:-1 reqpath:n/a Error Path:/solr/overseer Error:KeeperErrorCode = NodeExists for /solr/overseer
[junit4:junit4]   2> 4559 T156 oascc.ZkStateReader.createClusterStateWatchersAndUpdate Updating cluster state from ZooKeeper... 
[junit4:junit4]   2> 5442 T179 oascc.ZkStateReader.updateClusterState Updating cloud state from ZooKeeper... 
[junit4:junit4]   2> 5444 T179 oasc.Overseer$ClusterStateUpdater.updateState Update state numShards=1 message={
[junit4:junit4]   2> 	  "operation":"state",
[junit4:junit4]   2> 	  "core_node_name":"1",
[junit4:junit4]   2> 	  "numShards":"1",
[junit4:junit4]   2> 	  "shard":"shard1",
[junit4:junit4]   2> 	  "roles":null,
[junit4:junit4]   2> 	  "state":"active",
[junit4:junit4]   2> 	  "core":"collection1",
[junit4:junit4]   2> 	  "collection":"control_collection",
[junit4:junit4]   2> 	  "node_name":"127.0.0.1:12835__zw",
[junit4:junit4]   2> 	  "base_url":"http://127.0.0.1:12835/_zw"}
[junit4:junit4]   2> 5459 T198 oascc.ZkStateReader$2.process A cluster state change: WatchedEvent state:SyncConnected type:NodeDataChanged path:/clusterstate.json, has occurred - updating... (live nodes size: 1)
[junit4:junit4]   2> 5459 T178 oascc.ZkStateReader$2.process A cluster state change: WatchedEvent state:SyncConnected type:NodeDataChanged path:/clusterstate.json, has occurred - updating... (live nodes size: 1)
[junit4:junit4]   2> 5459 T185 oascc.ZkStateReader$2.process A cluster state change: WatchedEvent state:SyncConnected type:NodeDataChanged path:/clusterstate.json, has occurred - updating... (live nodes size: 1)
[junit4:junit4]   2> 5565 T156 oasc.ZkController.createEphemeralLiveNode Register node as live in ZooKeeper:/live_nodes/127.0.0.1:33424__zw
[junit4:junit4]   2> 5566 T161 oazs.PrepRequestProcessor.pRequest Got user-level KeeperException when processing sessionid:0x13d6457dcbc0006 type:delete cxid:0xd zxid:0x50 txntype:-1 reqpath:n/a Error Path:/solr/live_nodes/127.0.0.1:33424__zw Error:KeeperErrorCode = NoNode for /solr/live_nodes/127.0.0.1:33424__zw
[junit4:junit4]   2> 5593 T156 oascc.SolrZkClient.makePath makePath: /live_nodes/127.0.0.1:33424__zw
[junit4:junit4]   2> 5600 T185 oascc.ZkStateReader$2.process A cluster state change: WatchedEvent state:SyncConnected type:NodeChildrenChanged path:/live_nodes, has occurred - updating... (live nodes size: 1)
[junit4:junit4]   2> 5601 T178 oascc.ZkStateReader$3.process Updating live nodes... (2)
[junit4:junit4]   2> 5601 T178 oascc.ZkStateReader$2.process A cluster state change: WatchedEvent state:SyncConnected type:NodeChildrenChanged path:/live_nodes, has occurred - updating... (live nodes size: 2)
[junit4:junit4]   2> 5601 T198 oascc.ZkStateReader$3.process Updating live nodes... (2)
[junit4:junit4]   2> 5602 T198 oascc.ZkStateReader$2.process A cluster state change: WatchedEvent state:SyncConnected type:NodeChildrenChanged path:/live_nodes, has occurred - updating... (live nodes size: 2)
[junit4:junit4]   2> 5604 T185 oascc.ZkStateReader$3.process Updating live nodes... (2)
[junit4:junit4]   2> 5614 T199 oasc.CoreContainer.create Creating SolrCore 'collection1' using instanceDir: /usr/home/hudson/hudson-slave/workspace/Lucene-Solr-NightlyTests-trunk/solr/build/solr-core/test/J0/./org.apache.solr.cloud.SyncSliceTest-jetty1-1363188116537/collection1
[junit4:junit4]   2> 5614 T199 oasc.ZkController.createCollectionZkNode Check for collection zkNode:collection1
[junit4:junit4]   2> 5615 T199 oasc.ZkController.createCollectionZkNode Collection zkNode exists
[junit4:junit4]   2> 5616 T199 oasc.ZkController.readConfigName Load collection config from:/collections/collection1
[junit4:junit4]   2> 5618 T199 oasc.SolrResourceLoader.<init> new SolrResourceLoader for directory: '/usr/home/hudson/hudson-slave/workspace/Lucene-Solr-NightlyTests-trunk/solr/build/solr-core/test/J0/./org.apache.solr.cloud.SyncSliceTest-jetty1-1363188116537/collection1/'
[junit4:junit4]   2> 5619 T199 oasc.SolrResourceLoader.replaceClassLoader Adding 'file:/usr/home/hudson/hudson-slave/workspace/Lucene-Solr-NightlyTests-trunk/solr/build/solr-core/test/J0/org.apache.solr.cloud.SyncSliceTest-jetty1-1363188116537/collection1/lib/classes/' to classloader
[junit4:junit4]   2> 5620 T199 oasc.SolrResourceLoader.replaceClassLoader Adding 'file:/usr/home/hudson/hudson-slave/workspace/Lucene-Solr-NightlyTests-trunk/solr/build/solr-core/test/J0/org.apache.solr.cloud.SyncSliceTest-jetty1-1363188116537/collection1/lib/README' to classloader
[junit4:junit4]   2> 5678 T199 oasc.SolrConfig.<init> Using Lucene MatchVersion: LUCENE_50
[junit4:junit4]   2> 5750 T199 oasc.SolrConfig.<init> Loaded SolrConfig: solrconfig.xml
[junit4:junit4]   2> 5752 T199 oass.IndexSchema.readSchema Reading Solr Schema
[junit4:junit4]   2> 5762 T199 oass.IndexSchema.readSchema Schema name=test
[junit4:junit4]   2> 6582 T199 oass.OpenExchangeRatesOrgProvider.init Initialized with rates=open-exchange-rates.json, refreshInterval=1440.
[junit4:junit4]   2> 6598 T199 oass.IndexSchema.readSchema default search field in schema is text
[junit4:junit4]   2> 6604 T199 oass.IndexSchema.readSchema unique key field: id
[junit4:junit4]   2> 6634 T199 oass.FileExchangeRateProvider.reload Reloading exchange rates from file currency.xml
[junit4:junit4]   2> 6641 T199 oass.FileExchangeRateProvider.reload Reloading exchange rates from file currency.xml
[junit4:junit4]   2> 6649 T199 oass.OpenExchangeRatesOrgProvider.reload Reloading exchange rates from open-exchange-rates.json
[junit4:junit4]   2> 6651 T199 oass.OpenExchangeRatesOrgProvider$OpenExchangeRates.<init> WARNING Unknown key IMPORTANT NOTE
[junit4:junit4]   2> 6652 T199 oass.OpenExchangeRatesOrgProvider$OpenExchangeRates.<init> WARNING Expected key, got STRING
[junit4:junit4]   2> 6652 T199 oass.OpenExchangeRatesOrgProvider.reload Reloading exchange rates from open-exchange-rates.json
[junit4:junit4]   2> 6654 T199 oass.OpenExchangeRatesOrgProvider$OpenExchangeRates.<init> WARNING Unknown key IMPORTANT NOTE
[junit4:junit4]   2> 6655 T199 oass.OpenExchangeRatesOrgProvider$OpenExchangeRates.<init> WARNING Expected key, got STRING
[junit4:junit4]   2> 6655 T199 oasc.SolrCore.initDirectoryFactory org.apache.solr.core.MockDirectoryFactory
[junit4:junit4]   2> 6655 T199 oasc.SolrCore.<init> [collection1] Opening new SolrCore at /usr/home/hudson/hudson-slave/workspace/Lucene-Solr-NightlyTests-trunk/solr/build/solr-core/test/J0/./org.apache.solr.cloud.SyncSliceTest-jetty1-1363188116537/collection1/, dataDir=./org.apache.solr.cloud.SyncSliceTest-1363188112562/jetty1/
[junit4:junit4]   2> 6656 T199 oasc.JmxMonitoredMap.<init> JMX monitoring is enabled. Adding Solr mbeans to JMX Server: com.sun.jmx.mbeanserver.JmxMBeanServer@2cc22a3b
[junit4:junit4]   2> 6656 T199 oasc.SolrCore.initDirectoryFactory org.apache.solr.core.MockDirectoryFactory
[junit4:junit4]   2> 6657 T199 oasc.CachingDirectoryFactory.get return new directory for ./org.apache.solr.cloud.SyncSliceTest-1363188112562/jetty1 forceNew: false
[junit4:junit4]   2> 6657 T199 oasc.SolrCore.getNewIndexDir New index directory detected: old=null new=./org.apache.solr.cloud.SyncSliceTest-1363188112562/jetty1/index/
[junit4:junit4]   2> 6658 T199 oasc.SolrCore.initIndex WARNING [collection1] Solr index directory './org.apache.solr.cloud.SyncSliceTest-1363188112562/jetty1/index' doesn't exist. Creating new index...
[junit4:junit4]   2> 6658 T199 oasc.CachingDirectoryFactory.get return new directory for ./org.apache.solr.cloud.SyncSliceTest-1363188112562/jetty1/index forceNew: false
[junit4:junit4]   2> 6662 T199 oasc.SolrDeletionPolicy.onCommit SolrDeletionPolicy.onCommit: commits:num=1
[junit4:junit4]   2> 		commit{dir=BaseDirectoryWrapper(org.apache.lucene.store.RAMDirectory@2a2096d7 lockFactory=org.apache.lucene.store.NativeFSLockFactory@181f4b24),segFN=segments_1,generation=1,filenames=[segments_1]
[junit4:junit4]   2> 6662 T199 oasc.SolrDeletionPolicy.updateCommits newest commit = 1[segments_1]
[junit4:junit4]   2> 6666 T199 oasup.UpdateRequestProcessorChain.init inserting DistributedUpdateProcessorFactory into updateRequestProcessorChain "dedupe"
[junit4:junit4]   2> 6666 T199 oasup.UpdateRequestProcessorChain.init inserting DistributedUpdateProcessorFactory into updateRequestProcessorChain "stored_sig"
[junit4:junit4]   2> 6667 T199 oasup.UpdateRequestProcessorChain.init inserting DistributedUpdateProcessorFactory into updateRequestProcessorChain "distrib-dup-test-chain-implicit"
[junit4:junit4]   2> 6668 T199 oasc.RequestHandlers.initHandlersFromConfig created standard: solr.StandardRequestHandler
[junit4:junit4]   2> 6669 T199 oasc.RequestHandlers.initHandlersFromConfig created /get: solr.RealTimeGetHandler
[junit4:junit4]   2> 6669 T199 oasc.RequestHandlers.initHandlersFromConfig adding lazy requestHandler: solr.ReplicationHandler
[junit4:junit4]   2> 6669 T199 oasc.RequestHandlers.initHandlersFromConfig created /replication: solr.ReplicationHandler
[junit4:junit4]   2> 6670 T199 oasc.RequestHandlers.initHandlersFromConfig created /update: solr.UpdateRequestHandler
[junit4:junit4]   2> 6671 T199 oasc.RequestHandlers.initHandlersFromConfig created /admin/: org.apache.solr.handler.admin.AdminHandlers
[junit4:junit4]   2> 6679 T199 oashl.XMLLoader.init xsltCacheLifetimeSeconds=60
[junit4:junit4]   2> 6686 T199 oass.SolrIndexSearcher.<init> Opening Searcher@2c851425 main
[junit4:junit4]   2> 6687 T199 oasu.UpdateHandler.clearLog Clearing tlog files, tlogDir=./org.apache.solr.cloud.SyncSliceTest-1363188112562/jetty1/tlog
[junit4:junit4]   2> 6688 T199 oasu.CommitTracker.<init> Hard AutoCommit: disabled
[junit4:junit4]   2> 6688 T199 oasu.CommitTracker.<init> Soft AutoCommit: disabled
[junit4:junit4]   2> 6694 T200 oasc.SolrCore.registerSearcher [collection1] Registered new searcher Searcher@2c851425 main{StandardDirectoryReader(segments_1:1)}
[junit4:junit4]   2> 6697 T199 oasc.ZkController.publish publishing core=collection1 state=down
[junit4:junit4]   2> 6697 T199 oasc.ZkController.publish numShards not found on descriptor - reading it from system property
[junit4:junit4]   2> 6984 T179 oascc.ZkStateReader.updateClusterState Updating cloud state from ZooKeeper... 
[junit4:junit4]   2> 6986 T179 oasc.Overseer$ClusterStateUpdater.updateState Update state numShards=1 message={
[junit4:junit4]   2> 	  "operation":"state",
[junit4:junit4]   2> 	  "core_node_name":"2",
[junit4:junit4]   2> 	  "numShards":"1",
[junit4:junit4]   2> 	  "shard":null,
[junit4:junit4]   2> 	  "roles":null,
[junit4:junit4]   2> 	  "state":"down",
[junit4:junit4]   2> 	  "core":"collection1",
[junit4:junit4]   2> 	  "collection":"collection1",
[junit4:junit4]   2> 	  "node_name":"127.0.0.1:33424__zw",
[junit4:junit4]   2> 	  "base_url":"http://127.0.0.1:33424/_zw"}
[junit4:junit4]   2> 6987 T179 oasc.Overseer$ClusterStateUpdater.createCollection Create collection collection1 with numShards 1
[junit4:junit4]   2> 6987 T179 oasc.Overseer$ClusterStateUpdater.updateState Assigning new node to shard shard=shard1
[junit4:junit4]   2> 7001 T198 oascc.ZkStateReader$2.process A cluster state change: WatchedEvent state:SyncConnected type:NodeDataChanged path:/clusterstate.json, has occurred - updating... (live nodes size: 2)
[junit4:junit4]   2> 7001 T185 oascc.ZkStateReader$2.process A cluster state change: WatchedEvent state:SyncConnected type:NodeDataChanged path:/clusterstate.json, has occurred - updating... (live nodes size: 2)
[junit4:junit4]   2> 7001 T178 oascc.ZkStateReader$2.process A cluster state change: WatchedEvent state:SyncConnected type:NodeDataChanged path:/clusterstate.json, has occurred - updating... (live nodes size: 2)
[junit4:junit4]   2> 7727 T199 oasc.CoreContainer.registerCore registering core: collection1
[junit4:junit4]   2> 7727 T199 oasc.ZkController.register Register replica - core:collection1 address:http://127.0.0.1:33424/_zw collection:collection1 shard:shard1
[junit4:junit4]   2> 7729 T199 oascc.SolrZkClient.makePath makePath: /collections/collection1/leader_elect/shard1/election
[junit4:junit4]   2> 7787 T161 oazs.PrepRequestProcessor.pRequest Got user-level KeeperException when processing sessionid:0x13d6457dcbc0006 type:delete cxid:0x4a zxid:0x5c txntype:-1 reqpath:n/a Error Path:/solr/collections/collection1/leaders Error:KeeperErrorCode = NoNode for /solr/collections/collection1/leaders
[junit4:junit4]   2> 7789 T199 oasc.ShardLeaderElectionContext.runLeaderProcess Running the leader process.
[junit4:junit4]   2> 7790 T161 oazs.PrepRequestProcessor.pRequest Got user-level KeeperException when processing sessionid:0x13d6457dcbc0006 type:create cxid:0x4b zxid:0x5d txntype:-1 reqpath:n/a Error Path:/solr/overseer Error:KeeperErrorCode = NodeExists for /solr/overseer
[junit4:junit4]   2> 7794 T199 oasc.ShardLeaderElectionContext.waitForReplicasToComeUp Enough replicas found to continue.
[junit4:junit4]   2> 7794 T199 oasc.ShardLeaderElectionContext.runLeaderProcess I may be the new leader - try and sync
[junit4:junit4]   2> 7795 T199 oasc.SyncStrategy.sync Sync replicas to http://127.0.0.1:33424/_zw/collection1/
[junit4:junit4]   2> 7795 T199 oasc.SyncStrategy.syncReplicas Sync Success - now sync replicas to me
[junit4:junit4]   2> 7795 T199 oasc.SyncStrategy.syncToMe http://127.0.0.1:33424/_zw/collection1/ has no replicas
[junit4:junit4]   2> 7796 T199 oasc.ShardLeaderElectionContext.runLeaderProcess I am the new leader: http://127.0.0.1:33424/_zw/collection1/
[junit4:junit4]   2> 7796 T199 oascc.SolrZkClient.makePath makePath: /collections/collection1/leaders/shard1
[junit4:junit4]   2> 7804 T161 oazs.PrepRequestProcessor.pRequest Got user-level KeeperException when processing sessionid:0x13d6457dcbc0006 type:create cxid:0x55 zxid:0x61 txntype:-1 reqpath:n/a Error Path:/solr/overseer Error:KeeperErrorCode = NodeExists for /solr/overseer
[junit4:junit4]   2> 8511 T179 oascc.ZkStateReader.updateClusterState Updating cloud state from ZooKeeper... 
[junit4:junit4]   2> 8562 T178 oascc.ZkStateReader$2.process A cluster state change: WatchedEvent state:SyncConnected type:NodeDataChanged path:/clusterstate.json, has occurred - updating... (live nodes size: 2)
[junit4:junit4]   2> 8563 T185 oascc.ZkStateReader$2.process A cluster state change: WatchedEvent state:SyncConnected type:NodeDataChanged path:/clusterstate.json, has occurred - updating... (live nodes size: 2)
[junit4:junit4]   2> 8563 T198 oascc.ZkStateReader$2.process A cluster state change: WatchedEvent state:SyncConnected type:NodeDataChanged path:/clusterstate.json, has occurred - updating... (live nodes size: 2)
[junit4:junit4]   2> 8573 T199 oasc.ZkController.register We are http://127.0.0.1:33424/_zw/collection1/ and leader is http://127.0.0.1:33424/_zw/collection1/
[junit4:junit4]   2> 8573 T199 oasc.ZkController.register No LogReplay needed for core=collection1 baseURL=http://127.0.0.1:33424/_zw
[junit4:junit4]   2> 8573 T199 oasc.ZkController.checkRecovery I am the leader, no recovery necessary
[junit4:junit4]   2> 8574 T199 oasc.ZkController.publish publishing core=collection1 state=active
[junit4:junit4]   2> 8574 T199 oasc.ZkController.publish numShards not found on descriptor - reading it from system property
[junit4:junit4]   2> 8577 T199 oascc.ZkStateReader.updateClusterState Updating cloud state from ZooKeeper... 
[junit4:junit4]   2> 8579 T156 oass.SolrDispatchFilter.init user.dir=/usr/home/hudson/hudson-slave/workspace/Lucene-Solr-NightlyTests-trunk/solr/build/solr-core/test/J0
[junit4:junit4]   2> 8580 T156 oass.SolrDispatchFilter.init SolrDispatchFilter.init() done
[junit4:junit4]   2> 8581 T156 oascsi.HttpClientUtil.createClient Creating new http client, config:maxConnections=128&maxConnectionsPerHost=32&followRedirects=false
[junit4:junit4]   2> 8840 T156 oejs.Server.doStart jetty-8.1.8.v20121106
[junit4:junit4]   2> 8844 T156 oejs.AbstractConnector.doStart Started SocketConnector@127.0.0.1:45486
[junit4:junit4]   2> 8845 T156 oass.SolrDispatchFilter.init SolrDispatchFilter.init()
[junit4:junit4]   2> 8845 T156 oasc.SolrResourceLoader.locateSolrHome JNDI not configured for solr (NoInitialContextEx)
[junit4:junit4]   2> 8846 T156 oasc.SolrResourceLoader.locateSolrHome using system property solr.solr.home: /usr/home/hudson/hudson-slave/workspace/Lucene-Solr-NightlyTests-trunk/solr/build/solr-core/test/J0/./org.apache.solr.cloud.SyncSliceTest-jetty2-1363188121160
[junit4:junit4]   2> 8846 T156 oasc.CoreContainer$Initializer.initialize looking for solr config file: /usr/home/hudson/hudson-slave/workspace/Lucene-Solr-NightlyTests-trunk/solr/build/solr-core/test/J0/./org.apache.solr.cloud.SyncSliceTest-jetty2-1363188121160/solr.xml
[junit4:junit4]   2> 8847 T156 oasc.CoreContainer.<init> New CoreContainer 110447614
[junit4:junit4]   2> 8848 T156 oasc.CoreContainer.load Loading CoreContainer using Solr Home: '/usr/home/hudson/hudson-slave/workspace/Lucene-Solr-NightlyTests-trunk/solr/build/solr-core/test/J0/./org.apache.solr.cloud.SyncSliceTest-jetty2-1363188121160/'
[junit4:junit4]   2> 8848 T156 oasc.SolrResourceLoader.<init> new SolrResourceLoader for directory: '/usr/home/hudson/hudson-slave/workspace/Lucene-Solr-NightlyTests-trunk/solr/build/solr-core/test/J0/./org.apache.solr.cloud.SyncSliceTest-jetty2-1363188121160/'
[junit4:junit4]   2> 8914 T156 oashc.HttpShardHandlerFactory.getParameter Setting socketTimeout to: 120000
[junit4:junit4]   2> 8915 T156 oashc.HttpShardHandlerFactory.getParameter Setting urlScheme to: http://
[junit4:junit4]   2> 8915 T156 oashc.HttpShardHandlerFactory.getParameter Setting connTimeout to: 15000
[junit4:junit4]   2> 8916 T156 oashc.HttpShardHandlerFactory.getParameter Setting maxConnectionsPerHost to: 20
[junit4:junit4]   2> 8916 T156 oashc.HttpShardHandlerFactory.getParameter Setting corePoolSize to: 0
[junit4:junit4]   2> 8917 T156 oashc.HttpShardHandlerFactory.getParameter Setting maximumPoolSize to: 2147483647
[junit4:junit4]   2> 8917 T156 oashc.HttpShardHandlerFactory.getParameter Setting maxThreadIdleTime to: 5
[junit4:junit4]   2> 8918 T156 oashc.HttpShardHandlerFactory.getParameter Setting sizeOfQueue to: -1
[junit4:junit4]   2> 8918 T156 oashc.HttpShardHandlerFactory.getParameter Setting fairnessPolicy to: false
[junit4:junit4]   2> 8919 T156 oascsi.HttpClientUtil.createClient Creating new http client, config:maxConnectionsPerHost=20&maxConnections=10000&socketTimeout=120000&connTimeout=15000&retry=false
[junit4:junit4]   2> 8949 T156 oasc.CoreContainer.load Registering Log Listener
[junit4:junit4]   2> 8976 T156 oasc.CoreContainer.initZooKeeper Zookeeper client=127.0.0.1:40935/solr
[junit4:junit4]   2> 8977 T156 oasc.ZkController.checkChrootPath zkHost includes chroot
[junit4:junit4]   2> 8977 T156 oaz.ZooKeeper.<init> Initiating client connection, connectString=127.0.0.1:40935 sessionTimeout=60000 watcher=org.apache.solr.common.cloud.ConnectionManager@6cf5c440
[junit4:junit4]   2> 8978 T156 oascc.ConnectionManager.waitForConnected Waiting for client to connect to ZooKeeper
[junit4:junit4]   2> 8979 T211 oaz.ClientCnxn$SendThread.logStartConnect Opening socket connection to server localhost/127.0.0.1:40935. Will not attempt to authenticate using SASL (access denied (javax.security.auth.AuthPermission getLoginConfiguration))
[junit4:junit4]   2> 8980 T211 oaz.ClientCnxn$SendThread.primeConnection Socket connection established to localhost/127.0.0.1:40935, initiating session
[junit4:junit4]   2> 8980 T158 oazs.NIOServerCnxnFactory.run Accepted socket connection from /140.211.11.196:43837
[junit4:junit4]   2> 8981 T158 oazs.ZooKeeperServer.processConnectRequest Client attempting to establish new session at /140.211.11.196:43837
[junit4:junit4]   2> 8983 T160 oazs.ZooKeeperServer.finishSessionInit Established session 0x13d6457dcbc0007 with negotiated timeout 20000 for client /140.211.11.196:43837
[junit4:junit4]   2> 8983 T211 oaz.ClientCnxn$SendThread.onConnected Session establishment complete on server localhost/127.0.0.1:40935, sessionid = 0x13d6457dcbc0007, negotiated timeout = 20000
[junit4:junit4]   2> 8983 T212 oascc.ConnectionManager.process Watcher org.apache.solr.common.cloud.ConnectionManager@6cf5c440 name:ZooKeeperConnection Watcher:127.0.0.1:40935 got event WatchedEvent state:SyncConnected type:None path:null path:null type:None
[junit4:junit4]   2> 8984 T156 oascc.ConnectionManager.waitForConnected Client is connected to ZooKeeper
[junit4:junit4]   2> 8986 T161 oazs.PrepRequestProcessor.pRequest2Txn Processed session termination for sessionid: 0x13d6457dcbc0007
[junit4:junit4]   2> 8988 T212 oaz.ClientCnxn$EventThread.run EventThread shut down
[junit4:junit4]   2> 8988 T156 oaz.ZooKeeper.close Session: 0x13d6457dcbc0007 closed
[junit4:junit4]   2> 8988 T158 oazs.NIOServerCnxn.closeSock Closed socket connection for client /140.211.11.196:43837 which had sessionid 0x13d6457dcbc0007
[junit4:junit4]   2> 8989 T156 oascsi.HttpClientUtil.createClient Creating new http client, config:maxConnections=500&maxConnectionsPerHost=16&socketTimeout=120000&connTimeout=15000
[junit4:junit4]   2> 9003 T156 oaz.ZooKeeper.<init> Initiating client connection, connectString=127.0.0.1:40935/solr sessionTimeout=30000 watcher=org.apache.solr.common.cloud.ConnectionManager@df077d2
[junit4:junit4]   2> 9005 T156 oascc.ConnectionManager.waitForConnected Waiting for client to connect to ZooKeeper
[junit4:junit4]   2> 9005 T213 oaz.ClientCnxn$SendThread.logStartConnect Opening socket connection to server localhost/127.0.0.1:40935. Will not attempt to authenticate using SASL (access denied (javax.security.auth.AuthPermission getLoginConfiguration))
[junit4:junit4]   2> 9006 T213 oaz.ClientCnxn$SendThread.primeConnection Socket connection established to localhost/127.0.0.1:40935, initiating session
[junit4:junit4]   2> 9006 T158 oazs.NIOServerCnxnFactory.run Accepted socket connection from /140.211.11.196:10343
[junit4:junit4]   2> 9007 T158 oazs.ZooKeeperServer.processConnectRequest Client attempting to establish new session at /140.211.11.196:10343
[junit4:junit4]   2> 9009 T160 oazs.ZooKeeperServer.finishSessionInit Established session 0x13d6457dcbc0008 with negotiated timeout 20000 for client /140.211.11.196:10343
[junit4:junit4]   2> 9009 T213 oaz.ClientCnxn$SendThread.onConnected Session establishment complete on server localhost/127.0.0.1:40935, sessionid = 0x13d6457dcbc0008, negotiated timeout = 20000
[junit4:junit4]   2> 9009 T214 oascc.ConnectionManager.process Watcher org.apache.solr.common.cloud.ConnectionManager@df077d2 name:ZooKeeperConnection Watcher:127.0.0.1:40935/solr got event WatchedEvent state:SyncConnected type:None path:null path:null type:None
[junit4:junit4]   2> 9010 T156 oascc.ConnectionManager.waitForConnected Client is connected to ZooKeeper
[junit4:junit4]   2> 9012 T161 oazs.PrepRequestProcessor.pRequest Got user-level KeeperException when processing sessionid:0x13d6457dcbc0008 type:create cxid:0x1 zxid:0x6e txntype:-1 reqpath:n/a Error Path:/solr/overseer Error:KeeperErrorCode = NodeExists for /solr/overseer
[junit4:junit4]   2> 9014 T161 oazs.PrepRequestProcessor.pRequest Got user-level KeeperException when processing sessionid:0x13d6457dcbc0008 type:create cxid:0x2 zxid:0x6f txntype:-1 reqpath:n/a Error Path:/solr/overseer Error:KeeperErrorCode = NodeExists for /solr/overseer
[junit4:junit4]   2> 9018 T156 oascc.ZkStateReader.createClusterStateWatchersAndUpdate Updating cluster state from ZooKeeper... 
[junit4:junit4]   2> 10025 T156 oasc.ZkController.createEphemeralLiveNode Register node as live in ZooKeeper:/live_nodes/127.0.0.1:45486__zw
[junit4:junit4]   2> 10026 T161 oazs.PrepRequestProcessor.pRequest Got user-level KeeperException when processing sessionid:0x13d6457dcbc0008 type:delete cxid:0xb zxid:0x70 txntype:-1 reqpath:n/a Error Path:/solr/live_nodes/127.0.0.1:45486__zw Error:KeeperErrorCode = NoNode for /solr/live_nodes/127.0.0.1:45486__zw
[junit4:junit4]   2> 10028 T156 oascc.SolrZkClient.makePath makePath: /live_nodes/127.0.0.1:45486__zw
[junit4:junit4]   2> 10033 T185 oascc.ZkStateReader$2.process A cluster state change: WatchedEvent state:SyncConnected type:NodeChildrenChanged path:/live_nodes, has occurred - updating... (live nodes size: 2)
[junit4:junit4]   2> 10034 T178 oascc.ZkStateReader$3.process Updating live nodes... (3)
[junit4:junit4]   2> 10034 T198 oascc.ZkStateReader$3.process Updating live nodes... (3)
[junit4:junit4]   2> 10034 T178 oascc.ZkStateReader$2.process A cluster state change: WatchedEvent state:SyncConnected type:NodeChildrenChanged path:/live_nodes, has occurred - updating... (live nodes size: 3)
[junit4:junit4]   2> 10034 T214 oascc.ZkStateReader$3.process Updating live nodes... (3)
[junit4:junit4]   2> 10034 T198 oascc.ZkStateReader$2.process A cluster state change: WatchedEvent state:SyncConnected type:NodeChildrenChanged path:/live_nodes, has occurred - updating... (live nodes size: 3)
[junit4:junit4]   2> 10038 T185 oascc.ZkStateReader$3.process Updating live nodes... (3)
[junit4:junit4]   2> 10047 T215 oasc.CoreContainer.create Creating SolrCore 'collection1' using instanceDir: /usr/home/hudson/hudson-slave/workspace/Lucene-Solr-NightlyTests-trunk/solr/build/solr-core/test/J0/./org.apache.solr.cloud.SyncSliceTest-jetty2-1363188121160/collection1
[junit4:junit4]   2> 10048 T215 oasc.ZkController.createCollectionZkNode Check for collection zkNode:collection1
[junit4:junit4]   2> 10049 T215 oasc.ZkController.createCollectionZkNode Collection zkNode exists
[junit4:junit4]   2> 10049 T215 oasc.ZkController.readConfigName Load collection config from:/collections/collection1
[junit4:junit4]   2> 10052 T215 oasc.SolrResourceLoader.<init> new SolrResourceLoader for directory: '/usr/home/hudson/hudson-slave/workspace/Lucene-Solr-NightlyTests-trunk/solr/build/solr-core/test/J0/./org.apache.solr.cloud.SyncSliceTest-jetty2-1363188121160/collection1/'
[junit4:junit4]   2> 10053 T215 oasc.SolrResourceLoader.replaceClassLoader Adding 'file:/usr/home/hudson/hudson-slave/workspace/Lucene-Solr-NightlyTests-trunk/solr/build/solr-core/test/J0/org.apache.solr.cloud.SyncSliceTest-jetty2-1363188121160/collection1/lib/README' to classloader
[junit4:junit4]   2> 10054 T215 oasc.SolrResourceLoader.replaceClassLoader Adding 'file:/usr/home/hudson/hudson-slave/workspace/Lucene-Solr-NightlyTests-trunk/solr/build/solr-core/test/J0/org.apache.solr.cloud.SyncSliceTest-jetty2-1363188121160/collection1/lib/classes/' to classloader
[junit4:junit4]   2> 10076 T179 oascc.ZkStateReader.updateClusterState Updating cloud state from ZooKeeper... 
[junit4:junit4]   2> 10079 T179 oasc.Overseer$ClusterStateUpdater.updateState Update state numShards=1 message={
[junit4:junit4]   2> 	  "operation":"state",
[junit4:junit4]   2> 	  "core_node_name":"2",
[junit4:junit4]   2> 	  "numShards":"1",
[junit4:junit4]   2> 	  "shard":"shard1",
[junit4:junit4]   2> 	  "roles":null,
[junit4:junit4]   2> 	  "state":"active",
[junit4:junit4]   2> 	  "core":"collection1",
[junit4:junit4]   2> 	  "collection":"collection1",
[junit4:junit4]   2> 	  "node_name":"127.0.0.1:33424__zw",
[junit4:junit4]   2> 	  "base_url":"http://127.0.0.1:33424/_zw"}
[junit4:junit4]   2> 10093 T178 oascc.ZkStateReader$2.process A cluster state change: WatchedEvent state:SyncConnected type:NodeDataChanged path:/clusterstate.json, has occurred - updating... (live nodes size: 3)
[junit4:junit4]   2> 10093 T185 oascc.ZkStateReader$2.process A cluster state change: WatchedEvent state:SyncConnected type:NodeDataChanged path:/clusterstate.json, has occurred - updating... (live nodes size: 3)
[junit4:junit4]   2> 10093 T214 oascc.ZkStateReader$2.process A cluster state change: WatchedEvent state:SyncConnected type:NodeDataChanged path:/clusterstate.json, has occurred - updating... (live nodes size: 3)
[junit4:junit4]   2> 10093 T198 oascc.ZkStateReader$2.process A cluster state change: WatchedEvent state:SyncConnected type:NodeDataChanged path:/clusterstate.json, has occurred - updating... (live nodes size: 3)
[junit4:junit4]   2> 10118 T215 oasc.SolrConfig.<init> Using Lucene MatchVersion: LUCENE_50
[junit4:junit4]   2> 10214 T215 oasc.SolrConfig.<init> Loaded SolrConfig: solrconfig.xml
[junit4:junit4]   2> 10216 T215 oass.IndexSchema.readSchema Reading Solr Schema
[junit4:junit4]   2> 10226 T215 oass.IndexSchema.readSchema Schema name=test
[junit4:junit4]   2> 11113 T215 oass.OpenExchangeRatesOrgProvider.init Initialized with rates=open-exchange-rates.json, refreshInterval=1440.
[junit4:junit4]   2> 11133 T215 oass.IndexSchema.readSchema default search field in schema is text
[junit4:junit4]   2> 11139 T215 oass.IndexSchema.readSchema unique key field: id
[junit4:junit4]   2> 11171 T215 oass.FileExchangeRateProvider.reload Reloading exchange rates from file currency.xml
[junit4:junit4]   2> 11181 T215 oass.FileExchangeRateProvider.reload Reloading exchange rates from file currency.xml
[junit4:junit4]   2> 11189 T215 oass.OpenExchangeRatesOrgProvider.reload Reloading exchange rates from open-exchange-rates.json
[junit4:junit4]   2> 11191 T215 oass.OpenExchangeRatesOrgProvider$OpenExchangeRates.<init> WARNING Unknown key IMPORTANT NOTE
[junit4:junit4]   2> 11192 T215 oass.OpenExchangeRatesOrgProvider$OpenExchangeRates.<init> WARNING Expected key, got STRING
[junit4:junit4]   2> 11193 T215 oass.OpenExchangeRatesOrgProvider.reload Reloading exchange rates from open-exchange-rates.json
[junit4:junit4]   2> 11195 T215 oass.OpenExchangeRatesOrgProvider$OpenExchangeRates.<init> WARNING Unknown key IMPORTANT NOTE
[junit4:junit4]   2> 11195 T215 oass.OpenExchangeRatesOrgProvider$OpenExchangeRates.<init> WARNING Expected key, got STRING
[junit4:junit4]   2> 11196 T215 oasc.SolrCore.initDirectoryFactory org.apache.solr.core.MockDirectoryFactory
[junit4:junit4]   2> 11196 T215 oasc.SolrCore.<init> [collection1] Opening new SolrCore at /usr/home/hudson/hudson-slave/workspace/Lucene-Solr-NightlyTests-trunk/solr/build/solr-core/test/J0/./org.apache.solr.cloud.SyncSliceTest-jetty2-1363188121160/collection1/, dataDir=./org.apache.solr.cloud.SyncSliceTest-1363188112562/jetty2/
[junit4:junit4]   2> 11197 T215 oasc.JmxMonitoredMap.<init> JMX monitoring is enabled. Adding Solr mbeans to JMX Server: com.sun.jmx.mbeanserver.JmxMBeanServer@2cc22a3b
[junit4:junit4]   2> 11198 T215 oasc.SolrCore.initDirectoryFactory org.apache.solr.core.MockDirectoryFactory
[junit4:junit4]   2> 11198 T215 oasc.CachingDirectoryFactory.get return new directory for ./org.apache.solr.cloud.SyncSliceTest-1363188112562/jetty2 forceNew: false
[junit4:junit4]   2> 11199 T215 oasc.SolrCore.getNewIndexDir New index directory detected: old=null new=./org.apache.solr.cloud.SyncSliceTest-1363188112562/jetty2/index/
[junit4:junit4]   2> 11199 T215 oasc.SolrCore.initIndex WARNING [collection1] Solr index directory './org.apache.solr.cloud.SyncSliceTest-1363188112562/jetty2/index' doesn't exist. Creating new index...
[junit4:junit4]   2> 11199 T215 oasc.CachingDirectoryFactory.get return new directory for ./org.apache.solr.cloud.SyncSliceTest-1363188112562/jetty2/index forceNew: false
[junit4:junit4]   2> 11202 T215 oasc.SolrDeletionPolicy.onCommit SolrDeletionPolicy.onCommit: commits:num=1
[junit4:junit4]   2> 		commit{dir=BaseDirectoryWrapper(org.apache.lucene.store.RAMDirectory@14b3b898 lockFactory=org.apache.lucene.store.NativeFSLockFactory@6cc542c),segFN=segments_1,generation=1,filenames=[segments_1]
[junit4:junit4]   2> 11203 T215 oasc.SolrDeletionPolicy.updateCommits newest commit = 1[segments_1]
[junit4:junit4]   2> 11206 T215 oasup.UpdateRequestProcessorChain.init inserting DistributedUpdateProcessorFactory into updateRequestProcessorChain "dedupe"
[junit4:junit4]   2> 11207 T215 oasup.UpdateRequestProcessorChain.init inserting DistributedUpdateProcessorFactory into updateRequestProcessorChain "stored_sig"
[junit4:junit4]   2> 11208 T215 oasup.UpdateRequestProcessorChain.init inserting DistributedUpdateProcessorFactory into updateRequestProcessorChain "distrib-dup-test-chain-implicit"
[junit4:junit4]   2> 11209 T215 oasc.RequestHandlers.initHandlersFromConfig created standard: solr.StandardRequestHandler
[junit4:junit4]   2> 11210 T215 oasc.RequestHandlers.initHandlersFromConfig created /get: solr.RealTimeGetHandler
[junit4:junit4]   2> 11211 T215 oasc.RequestHandlers.initHandlersFromConfig adding lazy requestHandler: solr.ReplicationHandler
[junit4:junit4]   2> 11211 T215 oasc.RequestHandlers.initHandlersFromConfig created /replication: solr.ReplicationHandler
[junit4:junit4]   2> 11216 T215 oasc.RequestHandlers.initHandlersFromConfig created /update: solr.UpdateRequestHandler
[junit4:junit4]   2> 11217 T215 oasc.RequestHandlers.initHandlersFromConfig created /admin/: org.apache.solr.handler.admin.AdminHandlers
[junit4:junit4]   2> 11230 T215 oashl.XMLLoader.init xsltCacheLifetimeSeconds=60
[junit4:junit4]   2> 11240 T215 oass.SolrIndexSearcher.<init> Opening Searcher@674b4735 main
[junit4:junit4]   2> 11241 T215 oasu.UpdateHandler.clearLog Clearing tlog files, tlogDir=./org.apache.solr.cloud.SyncSliceTest-1363188112562/jetty2/tlog
[junit4:junit4]   2> 11242 T215 oasu.CommitTracker.<init> Hard AutoCommit: disabled
[junit4:junit4]   2> 11242 T215 oasu.CommitTracker.<init> Soft AutoCommit: disabled
[junit4:junit4]   2> 11249 T216 oasc.SolrCore.registerSearcher [collection1] Registered new searcher Searcher@674b4735 main{StandardDirectoryReader(segments_1:1)}
[junit4:junit4]   2> 11252 T215 oasc.ZkController.publish publishing core=collection1 state=down
[junit4:junit4]   2> 11252 T215 oasc.ZkController.publish numShards not found on descriptor - reading it from system property
[junit4:junit4]   2> 11602 T179 oascc.ZkStateReader.updateClusterState Updating cloud state from ZooKeeper... 
[junit4:junit4]   2> 11604 T179 oasc.Overseer$ClusterStateUpdater.updateState Update state numShards=1 message={
[junit4:junit4]   2> 	  "operation":"state",
[junit4:junit4]   2> 	  "core_node_name":"3",
[junit4:junit4]   2> 	  "numShards":"1",
[junit4:junit4]   2> 	  "shard":null,
[junit4:junit4]   2> 	  "roles":null,
[junit4:junit4]   2> 	  "state":"down",
[junit4:junit4]   2> 	  "core":"collection1",
[junit4:junit4]   2> 	  "collection":"collection1",
[junit4:junit4]   2> 	  "node_name":"127.0.0.1:45486__zw",
[junit4:junit4]   2> 	  "base_url":"http://127.0.0.1:45486/_zw"}
[junit4:junit4]   2> 11604 T179 oasc.Overseer$ClusterStateUpdater.updateState Collection already exists with numShards=1
[junit4:junit4]   2> 11604 T179 oasc.Overseer$ClusterStateUpdater.updateState Assigning new node to shard shard=shard1
[junit4:junit4]   2> 11621 T178 oascc.ZkStateReader$2.process A cluster state change: WatchedEvent state:SyncConnected type:NodeDataChanged path:/clusterstate.json, has occurred - updating... (live nodes size: 3)
[junit4:junit4]   2> 11621 T198 oascc.ZkStateReader$2.process A cluster state change: WatchedEvent state:SyncConnected type:NodeDataChanged path:/clusterstate.json, has occurred - updating... (live nodes size: 3)
[junit4:junit4]   2> 11621 T185 oascc.ZkStateReader$2.process A cluster state change: WatchedEvent state:SyncConnected type:NodeDataChanged path:/clusterstate.json, has occurred - updating... (live nodes size: 3)
[junit4:junit4]   2> 11621 T214 oascc.ZkStateReader$2.process A cluster state change: WatchedEvent state:SyncConnected type:NodeDataChanged path:/clusterstate.json, has occurred - updating... (live nodes size: 3)
[junit4:junit4]   2> 12257 T215 oasc.CoreContainer.registerCore registering core: collection1
[junit4:junit4]   2> 12257 T215 oasc.ZkController.register Register replica - core:collection1 address:http://127.0.0.1:45486/_zw collection:collection1 shard:shard1
[junit4:junit4]   2> 12266 T215 oasc.ZkController.register We are http://127.0.0.1:45486/_zw/collection1/ and leader is http://127.0.0.1:33424/_zw/collection1/
[junit4:junit4]   2> 12266 T215 oasc.ZkController.register No LogReplay needed for core=collection1 baseURL=http://127.0.0.1:45486/_zw
[junit4:junit4]   2> 12267 T215 oasc.ZkController.checkRecovery Core needs to recover:collection1
[junit4:junit4]   2> 12267 T215 oasu.DefaultSolrCoreState.doRecovery Running recovery - first canceling any ongoing recovery
[junit4:junit4]   2> ASYNC  NEW_CORE C13 name=collection1 org.apache.solr.core.SolrCore@18adb210 url=http://127.0.0.1:45486/_zw/collection1 node=127.0.0.1:45486__zw C13_STATE=coll:collection1 core:collection1 props:{state=down, core=collection1, collection=collection1, node_name=127.0.0.1:45486__zw, base_url=http://127.0.0.1:45486/_zw}
[junit4:junit4]   2> 12268 T217 C13 P45486 oasc.RecoveryStrategy.run Starting recovery process.  core=collection1 recoveringAfterStartup=true
[junit4:junit4]   2> 12269 T217 C13 P45486 oasc.RecoveryStrategy.doRecovery ###### startupVersions=[]
[junit4:junit4]   2> 12269 T215 oascc.ZkStateReader.updateClusterState Updating cloud state from ZooKeeper... 
[junit4:junit4]   2> 12269 T217 C13 P45486 oasc.ZkController.publish publishing core=collection1 state=recovering
[junit4:junit4]   2> 12270 T217 C13 P45486 oasc.ZkController.publish numShards not found on descriptor - reading it from system property
[junit4:junit4]   2> 12271 T156 oass.SolrDispatchFilter.init user.dir=/usr/home/hudson/hudson-slave/workspace/Lucene-Solr-NightlyTests-trunk/solr/build/solr-core/test/J0
[junit4:junit4]   2> 12271 T156 oass.SolrDispatchFilter.init SolrDispatchFilter.init() done
[junit4:junit4]   2> 12272 T217 C13 P45486 oascsi.HttpClientUtil.createClient Creating new http client, config:maxConnections=128&maxConnectionsPerHost=32&followRedirects=false
[junit4:junit4]   2> 12272 T156 oascsi.HttpClientUtil.createClient Creating new http client, config:maxConnections=128&maxConnectionsPerHost=32&followRedirects=false
[junit4:junit4]   2> 12518 T156 oejs.Server.doStart jetty-8.1.8.v20121106
[junit4:junit4]   2> 12520 T156 oejs.AbstractConnector.doStart Started SocketConnector@127.0.0.1:48068
[junit4:junit4]   2> 12521 T156 oass.SolrDispatchFilter.init SolrDispatchFilter.init()
[junit4:junit4]   2> 12522 T156 oasc.SolrResourceLoader.locateSolrHome JNDI not configured for solr (NoInitialContextEx)
[junit4:junit4]   2> 12522 T156 oasc.SolrResourceLoader.locateSolrHome using system property solr.solr.home: /usr/home/hudson/hudson-slave/workspace/Lucene-Solr-NightlyTests-trunk/solr/build/solr-core/test/J0/./org.apache.solr.cloud.SyncSliceTest-jetty3-1363188124849
[junit4:junit4]   2> 12523 T156 oasc.CoreContainer$Initializer.initialize looking for solr config file: /usr/home/hudson/hudson-slave/workspace/Lucene-Solr-NightlyTests-trunk/solr/build/solr-core/test/J0/./org.apache.solr.cloud.SyncSliceTest-jetty3-1363188124849/solr.xml
[junit4:junit4]   2> 12523 T156 oasc.CoreContainer.<init> New CoreContainer 1864221705
[junit4:junit4]   2> 12524 T156 oasc.CoreContainer.load Loading CoreContainer using Solr Home: '/usr/home/hudson/hudson-slave/workspace/Lucene-Solr-NightlyTests-trunk/solr/build/solr-core/test/J0/./org.apache.solr.cloud.SyncSliceTest-jetty3-1363188124849/'
[junit4:junit4]   2> 12525 T156 oasc.SolrResourceLoader.<init> new SolrResourceLoader for directory: '/usr/home/hudson/hudson-slave/workspace/Lucene-Solr-NightlyTests-trunk/solr/build/solr-core/test/J0/./org.apache.solr.cloud.SyncSliceTest-jetty3-1363188124849/'
[junit4:junit4]   2> 12576 T156 oashc.HttpShardHandlerFactory.getParameter Setting socketTimeout to: 120000
[junit4:junit4]   2> 12577 T156 oashc.HttpShardHandlerFactory.getParameter Setting urlScheme to: http://
[junit4:junit4]   2> 12578 T156 oashc.HttpShardHandlerFactory.getParameter Setting connTimeout to: 15000
[junit4:junit4]   2> 12578 T156 oashc.HttpShardHandlerFactory.getParameter Setting maxConnectionsPerHost to: 20
[junit4:junit4]   2> 12578 T156 oashc.HttpShardHandlerFactory.getParameter Setting corePoolSize to: 0
[junit4:junit4]   2> 12579 T156 oashc.HttpShardHandlerFactory.getParameter Setting maximumPoolSize to: 2147483647
[junit4:junit4]   2> 12579 T156 oashc.HttpShardHandlerFactory.getParameter Setting maxThreadIdleTime to: 5
[junit4:junit4]   2> 12580 T156 oashc.HttpShardHandlerFactory.getParameter Setting sizeOfQueue to: -1
[junit4:junit4]   2> 12581 T156 oashc.HttpShardHandlerFactory.getParameter Setting fairnessPolicy to: false
[junit4:junit4]   2> 12581 T156 oascsi.HttpClientUtil.createClient Creating new http client, config:maxConnectionsPerHost=20&maxConnections=10000&socketTimeout=120000&connTimeout=15000&retry=false
[junit4:junit4]   2> 12607 T156 oasc.CoreContainer.load Registering Log Listener
[junit4:junit4]   2> 12630 T156 oasc.CoreContainer.initZooKeeper Zookeeper client=127.0.0.1:40935/solr
[junit4:junit4]   2> 12631 T156 oasc.ZkController.checkChrootPath zkHost includes chroot
[junit4:junit4]   2> 12632 T156 oaz.ZooKeeper.<init> Initiating client connection, connectString=127.0.0.1:40935 sessionTimeout=60000 watcher=org.apache.solr.common.cloud.ConnectionManager@579347e8
[junit4:junit4]   2> 12633 T156 oascc.ConnectionManager.waitForConnected Waiting for client to connect to ZooKeeper
[junit4:junit4]   2> 12633 T228 oaz.ClientCnxn$SendThread.logStartConnect Opening socket connection to server localhost/127.0.0.1:40935. Will not attempt to authenticate using SASL (access denied (javax.security.auth.AuthPermission getLoginConfiguration))
[junit4:junit4]   2> 12634 T228 oaz.ClientCnxn$SendThread.primeConnection Socket connection established to localhost/127.0.0.1:40935, initiating session
[junit4:junit4]   2> 12634 T158 oazs.NIOServerCnxnFactory.run Accepted socket connection from /140.211.11.196:11652
[junit4:junit4]   2> 12635 T158 oazs.ZooKeeperServer.processConnectRequest Client attempting to establish new session at /140.211.11.196:11652
[junit4:junit4]   2> 12637 T160 oazs.ZooKeeperServer.finishSessionInit Established session 0x13d6457dcbc0009 with negotiated timeout 20000 for client /140.211.11.196:11652
[junit4:junit4]   2> 12637 T228 oaz.ClientCnxn$SendThread.onConnected Session establishment complete on server localhost/127.0.0.1:40935, sessionid = 0x13d6457dcbc0009, negotiated timeout = 20000
[junit4:junit4]   2> 12637 T229 oascc.ConnectionManager.process Watcher org.apache.solr.common.cloud.ConnectionManager@579347e8 name:ZooKeeperConnection Watcher:127.0.0.1:40935 got event WatchedEvent state:SyncConnected type:None path:null path:null type:None
[junit4:junit4]   2> 12638 T156 oascc.ConnectionManager.waitForConnected Client is connected to ZooKeeper
[junit4:junit4]   2> 12639 T161 oazs.PrepRequestProcessor.pRequest2Txn Processed session termination for sessionid: 0x13d6457dcbc0009
[junit4:junit4]   2> 12642 T158 oazs.NIOServerCnxn.closeSock Closed socket connection for client /140.211.11.196:11652 which had sessionid 0x13d6457dcbc0009
[junit4:junit4]   2> 12642 T229 oaz.ClientCnxn$EventThread.run EventThread shut down
[junit4:junit4]   2> 12642 T156 oaz.ZooKeeper.close Session: 0x13d6457dcbc0009 closed
[junit4:junit4]   2> 12643 T156 oascsi.HttpClientUtil.createClient Creating new http client, config:maxConnections=500&maxConnectionsPerHost=16&socketTimeout=120000&connTimeout=15000
[junit4:junit4]   2> 12656 T156 oaz.ZooKeeper.<init> Initiating client connection, connectString=127.0.0.1:40935/solr sessionTimeout=30000 watcher=org.apache.solr.common.cloud.ConnectionManager@37a7481f
[junit4:junit4]   2> 12657 T156 oascc.ConnectionManager.waitForConnected Waiting for client to connect to ZooKeeper
[junit4:junit4]   2> 12658 T230 oaz.ClientCnxn$SendThread.logStartConnect Opening socket connection to server localhost/127.0.0.1:40935. Will not attempt to authenticate using SASL (access denied (javax.security.auth.AuthPermission getLoginConfiguration))
[junit4:junit4]   2> 12658 T230 oaz.ClientCnxn$SendThread.primeConnection Socket connection established to localhost/127.0.0.1:40935, initiating session
[junit4:junit4]   2> 12659 T158 oazs.NIOServerCnxnFactory.run Accepted socket connection from /140.211.11.196:59460
[junit4:junit4]   2> 12660 T158 oazs.ZooKeeperServer.processConnectRequest Client attempting to establish new session at /140.211.11.196:59460
[junit4:junit4]   2> 12662 T160 oazs.ZooKeeperServer.finishSessionInit Established session 0x13d6457dcbc000a with negotiated timeout 20000 for client /140.211.11.196:59460
[junit4:junit4]   2> 12662 T230 oaz.ClientCnxn$SendThread.onConnected Session establishment complete on server localhost/127.0.0.1:40935, sessionid = 0x13d6457dcbc000a, negotiated timeout = 20000
[junit4:junit4]   2> 12662 T231 oascc.ConnectionManager.process Watcher org.apache.solr.common.cloud.ConnectionManager@37a7481f name:ZooKeeperConnection Watcher:127.0.0.1:40935/solr got event WatchedEvent state:SyncConnected type:None path:null path:null type:None
[junit4:junit4]   2> 12662 T156 oascc.ConnectionManager.waitForConnected Client is connected to ZooKeeper
[junit4:junit4]   2> 12664 T161 oazs.PrepRequestProcessor.pRequest Got user-level KeeperException when processing sessionid:0x13d6457dcbc000a type:create cxid:0x1 zxid:0x81 txntype:-1 reqpath:n/a Error Path:/solr/overseer Error:KeeperErrorCode = NodeExists for /solr/overseer
[junit4:junit4]   2> 12667 T161 oazs.PrepRequestProcessor.pRequest Got user-level KeeperException when processing sessionid:0x13d6457dcbc000a type:create cxid:0x2 zxid:0x82 txntype:-1 reqpath:n/a Error Path:/solr/overseer Error:KeeperErrorCode = NodeExists for /solr/overseer
[junit4:junit4]   2> 12675 T156 oascc.ZkStateReader.createClusterStateWatchersAndUpdate Updating cluster state from ZooKeeper... 
[junit4:junit4]   2> 13132 T179 oascc.ZkStateReader.updateClusterState Updating cloud state from ZooKeeper... 
[junit4:junit4]   2> 13133 T179 oasc.Overseer$ClusterStateUpdater.updateState Update state numShards=1 message={
[junit4:junit4]   2> 	  "operation":"state",
[junit4:junit4]   2> 	  "core_node_name":"3",
[junit4:junit4]   2> 	  "numShards":"1",
[junit4:junit4]   2> 	  "shard":"shard1",
[junit4:junit4]   2> 	  "roles":null,
[junit4:junit4]   2> 	  "state":"recovering",
[junit4:junit4]   2> 	  "core":"collection1",
[junit4:junit4]   2> 	  "collection":"collection1",
[junit4:junit4]   2> 	  "node_name":"127.0.0.1:45486__zw",
[junit4:junit4]   2> 	  "base_url":"http://127.0.0.1:45486/_zw"}
[junit4:junit4]   2> 13148 T214 oascc.ZkStateReader$2.process A cluster state change: WatchedEvent state:SyncConnected type:NodeDataChanged path:/clusterstate.json, has occurred - updating... (live nodes size: 3)
[junit4:junit4]   2> 13148 T178 oascc.ZkStateReader$2.process A cluster state change: WatchedEvent state:SyncConnected type:NodeDataChanged path:/clusterstate.json, has occurred - updating... (live nodes size: 3)
[junit4:junit4]   2> 13148 T231 oascc.ZkStateReader$2.process A cluster state change: WatchedEvent state:SyncConnected type:NodeDataChanged path:/clusterstate.json, has occurred - updating... (live nodes size: 3)
[junit4:junit4]   2> 13148 T198 oascc.ZkStateReader$2.process A cluster state change: WatchedEvent state:SyncConnected type:NodeDataChanged path:/clusterstate.json, has occurred - updating... (live nodes size: 3)
[junit4:junit4]   2> 13148 T185 oascc.ZkStateReader$2.process A cluster state change: WatchedEvent state:SyncConnected type:NodeDataChanged path:/clusterstate.json, has occurred - updating... (live nodes size: 3)
[junit4:junit4]   2> 13299 T188 oass.SolrDispatchFilter.handleAdminRequest /admin/cores {coreNodeName=3&state=recovering&nodeName=127.0.0.1:45486__zw&action=PREPRECOVERY&checkLive=true&core=collection1&wt=javabin&onlyIfLeader=true&version=2} status=0 QTime=1001 
[junit4:junit4]   2> 13682 T156 oasc.ZkController.createEphemeralLiveNode Register node as live in ZooKeeper:/live_nodes/127.0.0.1:48068__zw
[junit4:junit4]   2> 13683 T161 oazs.PrepRequestProcessor.pRequest Got user-level KeeperException when processing sessionid:0x13d6457dcbc000a type:delete cxid:0xd zxid:0x87 txntype:-1 reqpath:n/a Error Path:/solr/live_nodes/127.0.0.1:48068__zw Error:KeeperErrorCode = NoNode for /solr/live_nodes/127.0.0.1:48068__zw
[junit4:junit4]   2> 13685 T156 oascc.SolrZkClient.makePath makePath: /live_nodes/127.0.0.1:48068__zw
[junit4:junit4]   2> 13690 T214 oascc.ZkStateReader$2.process A cluster state change: WatchedEvent state:SyncConnected type:NodeChildrenChanged path:/live_nodes, has occurred - updating... (live nodes size: 3)
[junit4:junit4]   2> 13690 T185 oascc.ZkStateReader$2.process A cluster state change: WatchedEvent state:SyncConnected type:NodeChildrenChanged path:/live_nodes, has occurred - updating... (live nodes size: 3)
[junit4:junit4]   2> 13691 T198 oascc.ZkStateReader$3.process Updating live nodes... (4)
[junit4:junit4]   2> 13691 T198 oascc.ZkStateReader$2.process A cluster state change: WatchedEvent state:SyncConnected type:NodeChildrenChanged path:/live_nodes, has occurred - updating... (live nodes size: 4)
[junit4:junit4]   2> 13691 T231 oascc.ZkStateReader$3.process Updating live nodes... (4)
[junit4:junit4]   2> 13692 T231 oascc.ZkStateReader$2.process A cluster state change: WatchedEvent state:SyncConnected type:NodeChildrenChanged path:/live_nodes, has occurred - updating... (live nodes size: 4)
[junit4:junit4]   2> 13692 T178 oascc.ZkStateReader$3.process Updating live nodes... (4)
[junit4:junit4]   2> 13692 T178 oascc.ZkStateReader$2.process A cluster state change: WatchedEvent state:SyncConnected type:NodeChildrenChanged path:/live_nodes, has occurred - updating... (live nodes size: 4)
[junit4:junit4]   2> 13694 T185 oascc.ZkStateReader$3.process Updating live nodes... (4)
[junit4:junit4]   2> 13695 T214 oascc.ZkStateReader$3.process Updating live nodes... (4)
[junit4:junit4]   2> 13703 T232 oasc.CoreContainer.create Creating SolrCore 'collection1' using instanceDir: /usr/home/hudson/hudson-slave/workspace/Lucene-Solr-NightlyTests-trunk/solr/build/solr-core/test/J0/./org.apache.solr.cloud.SyncSliceTest-jetty3-1363188124849/collection1
[junit4:junit4]   2> 13704 T232 oasc.ZkController.createCollectionZkNode Check for collection zkNode:collection1
[junit4:junit4]   2> 13705 T232 oasc.ZkController.createCollectionZkNode Collection zkNode exists
[junit4:junit4]   2> 13705 T232 oasc.ZkController.readConfigName Load collection config from:/collections/collection1
[junit4:junit4]   2> 13708 T232 oasc.SolrResourceLoader.<init> new SolrResourceLoader for directory: '/usr/home/hudson/hudson-slave/workspace/Lucene-Solr-NightlyTests-trunk/solr/build/solr-core/test/J0/./org.apache.solr.cloud.SyncSliceTest-jetty3-1363188124849/collection1/'
[junit4:junit4]   2> 13709 T232 oasc.SolrResourceLoader.replaceClassLoader Adding 'file:/usr/home/hudson/hudson-slave/workspace/Lucene-Solr-NightlyTests-trunk/solr/build/solr-core/test/J0/org.apache.solr.cloud.SyncSliceTest-jetty3-1363188124849/collection1/lib/classes/' to classloader
[junit4:junit4]   2> 13710 T232 oasc.SolrResourceLoader.replaceClassLoader Adding 'file:/usr/home/hudson/hudson-slave/workspace/Lucene-Solr-NightlyTests-trunk/solr/build/solr-core/test/J0/org.apache.solr.cloud.SyncSliceTest-jetty3-1363188124849/collection1/lib/README' to classloader
[junit4:junit4]   2> 13810 T232 oasc.SolrConfig.<init> Using Lucene MatchVersion: LUCENE_50
[junit4:junit4]   2> 13915 T232 oasc.SolrConfig.<init> Loaded SolrConfig: solrconfig.xml
[junit4:junit4]   2> 13917 T232 oass.IndexSchema.readSchema Reading Solr Schema
[junit4:junit4]   2> 13928 T232 oass.IndexSchema.readSchema Schema name=test
[junit4:junit4]   2>  C13_STATE=coll:collection1 core:collection1 props:{shard=shard1, state=recovering, core=collection1, collection=collection1, node_name=127.0.0.1:45486__zw, base_url=http://127.0.0.1:45486/_zw}
[junit4:junit4]   2> 15303 T217 C13 P45486 oasc.RecoveryStrategy.doRecovery Attempting to PeerSync from http://127.0.0.1:33424/_zw/collection1/ core=collection1 - recoveringAfterStartup=true
[junit4:junit4]   2> 15303 T217 C13 P45486 oasu.PeerSync.sync PeerSync: core=collection1 url=http://127.0.0.1:45486/_zw START replicas=[http://127.0.0.1:33424/_zw/collection1/] nUpdates=100
[junit4:junit4]   2> 15313 T217 C13 P45486 oasu.PeerSync.sync WARNING no frame of reference to tell of we've missed updates
[junit4:junit4]   2> 15316 T217 C13 P45486 oasc.RecoveryStrategy.doRecovery PeerSync Recovery was not successful - trying replication. core=collection1
[junit4:junit4]   2> 15317 T217 C13 P45486 oasc.RecoveryStrategy.doRecovery Starting Replication Recovery. core=collection1
[junit4:junit4]   2> 15317 T217 C13 P45486 oasc.RecoveryStrategy.doRecovery Begin buffering updates. core=collection1
[junit4:junit4]   2> 15317 T217 C13 P45486 oasu.UpdateLog.bufferUpdates Starting to buffer updates. FSUpdateLog{state=ACTIVE, tlog=null}
[junit4:junit4]   2> 15318 T217 C13 P45486 oasc.RecoveryStrategy.replicate Attempting to replicate from http://127.0.0.1:33424/_zw/collection1/. core=collection1
[junit4:junit4]   2> 15318 T217 C13 P45486 oascsi.HttpClientUtil.createClient Creating new http client, config:maxConnections=128&maxConnectionsPerHost=32&followRedirects=false
[junit4:junit4]   2> ASYNC  NEW_CORE C14 name=collection1 org.apache.solr.core.SolrCore@1a53929c url=http://127.0.0.1:33424/_zw/collection1 node=127.0.0.1:33424__zw C14_STATE=coll:collection1 core:collection1 props:{shard=shard1, state=active, core=collection1, collection=collection1, node_name=127.0.0.1:33424__zw, base_url=http://127.0.0.1:33424/_zw, leader=true}
[junit4:junit4]   2> 15327 T189 C14 P33424 REQ /get {getVersions=100&distrib=false&wt=javabin&qt=/get&version=2} status=0 QTime=1 
[junit4:junit4]   2> 15342 T190 C14 P33424 oasu.DirectUpdateHandler2.commit start commit{,optimize=false,openSearcher=false,waitSearcher=true,expungeDeletes=false,softCommit=false,prepareCommit=false}
[junit4:junit4]   2> 15347 T190 C14 P33424 oasc.SolrDeletionPolicy.onInit SolrDeletionPolicy.onInit: commits:num=1
[junit4:junit4]   2> 		commit{dir=BaseDirectoryWrapper(org.apache.lucene.store.RAMDirectory@2a2096d7 lockFactory=org.apache.lucene.store.NativeFSLockFactory@181f4b24),segFN=segments_1,generation=1,filenames=[segments_1]
[junit4:junit4]   2> 15349 T190 C14 P33424 oasc.SolrDeletionPolicy.updateCommits newest commit = 1[segments_1]
[junit4:junit4]   2> 15350 T190 C14 P33424 oasc.SolrDeletionPolicy.onCommit SolrDeletionPolicy.onCommit: commits:num=2
[junit4:junit4]   2> 		commit{dir=BaseDirectoryWrapper(org.apache.lucene.store.RAMDirectory@2a2096d7 lockFactory=org.apache.lucene.store.NativeFSLockFactory@181f4b24),segFN=segments_1,generation=1,filenames=[segments_1]
[junit4:junit4]   2> 		commit{dir=BaseDirectoryWrapper(org.apache.lucene.store.RAMDirectory@2a2096d7 lockFactory=org.apache.lucene.store.NativeFSLockFactory@181f4b24),segFN=segments_2,generation=2,filenames=[segments_2]
[junit4:junit4]   2> 15351 T190 C14 P33424 oasc.SolrDeletionPolicy.updateCommits newest commit = 2[segments_2]
[junit4:junit4]   2> 15352 T190 C14 P33424 oass.SolrIndexSearcher.<init> Opening Searcher@5626b468 realtime
[junit4:junit4]   2> 15353 T190 C14 P33424 oasu.DirectUpdateHandler2.commit end_commit_flush
[junit4:junit4]   2> 15353 T190 C14 P33424 /update {waitSearcher=true&openSearcher=false&commit=true&wt=javabin&commit_end_point=true&version=2&softCommit=false} {commit=} 0 12
[junit4:junit4]   2> 15355 T217 C13 P45486 oash.ReplicationHandler.inform Commits will be reserved for  10000
[junit4:junit4]   2> 15355 T217 C13 P45486 oash.SnapPuller.<init>  No value set for 'pollInterval'. Timer Task not started.
[junit4:junit4]   2> 15359 T191 C14 P33424 oash.ReplicationHandler.inform Commits will be reserved for  10000
[junit4:junit4]   2> 15359 T191 C14 P33424 REQ /replication {command=indexversion&qt=/replication&wt=javabin&version=2} status=0 QTime=2 
[junit4:junit4]   2> 15361 T217 C13 P45486 oash.SnapPuller.fetchLatestIndex Master's generation: 2
[junit4:junit4]   2> 15361 T217 C13 P45486 oash.SnapPuller.fetchLatestIndex Slave's generation: 1
[junit4:junit4]   2> 15361 T217 C13 P45486 oash.SnapPuller.fetchLatestIndex Starting replication process
[junit4:junit4]   2> 15386 T191 C14 P33424 REQ /replication {command=filelist&qt=/replication&wt=javabin&generation=2&version=2} status=0 QTime=21 
[junit4:junit4]   2> 15388 T217 C13 P45486 oash.SnapPuller.fetchLatestIndex Number of files in latest index in master: 1
[junit4:junit4]   2> 15389 T217 C13 P45486 oasc.CachingDirectoryFactory.get return new directory for ./org.apache.solr.cloud.SyncSliceTest-1363188112562/jetty2/index.20130313082207942 forceNew: false
[junit4:junit4]   2> 15390 T217 C13 P45486 oash.SnapPuller.fetchLatestIndex Starting download to MockDirWrapper(org.apache.lucene.store.RAMDirectory@6242d05e lockFactory=org.apache.lucene.store.NativeFSLockFactory@3f9c437d) fullCopy=false
[junit4:junit4]   2> 15394 T191 C14 P33424 REQ /replication {file=segments_2&command=filecontent&checksum=true&wt=filestream&qt=/replication&generation=2} status=0 QTime=0 
[junit4:junit4]   2> 15396 T217 C13 P45486 oash.SnapPuller.fetchLatestIndex Total time taken for download : 0 secs
[junit4:junit4]   2> 15397 T217 C13 P45486 oasu.DefaultSolrCoreState.newIndexWriter Creating new IndexWriter...
[junit4:junit4]   2> 15398 T217 C13 P45486 oasu.DefaultSolrCoreState.newIndexWriter Waiting until IndexWriter is unused... core=collection1
[junit4:junit4]   2> 15401 T217 C13 P45486 oasc.SolrDeletionPolicy.onInit SolrDeletionPolicy.onInit: commits:num=2
[junit4:junit4]   2> 		commit{dir=BaseDirectoryWrapper(org.apache.lucene.store.RAMDirectory@14b3b898 lockFactory=org.apache.lucene.store.NativeFSLockFactory@6cc542c),segFN=segments_1,generation=1,filenames=[segments_1]
[junit4:junit4]   2> 		commit{dir=BaseDirectoryWrapper(org.apache.lucene.store.RAMDirectory@14b3b898 lockFactory=org.apache.lucene.store.NativeFSLockFactory@6cc542c),segFN=segments_2,generation=2,filenames=[segments_2]
[junit4:junit4]   2> 15402 T217 C13 P45486 oasc.SolrDeletionPolicy.updateCommits newest commit = 2[segments_2]
[junit4:junit4]   2> 15402 T217 C13 P45486 oasu.DefaultSolrCoreState.newIndexWriter New IndexWriter is ready to be used.
[junit4:junit4]   2> 15403 T217 C13 P45486 oass.SolrIndexSearcher.<init> Opening Searcher@259709b1 main
[junit4:junit4]   2> 15404 T216 oasc.SolrCore.registerSearcher [collection1] Registered new searcher Searcher@259709b1 main{StandardDirectoryReader(segments_2:1:nrt)}
[junit4:junit4]   2> 15405 T217 C13 P45486 oash.SnapPuller.fetchLatestIndex removing temporary index download directory files MockDirWrapper(org.apache.lucene.store.RAMDirectory@6242d05e lockFactory=org.apache.lucene.store.NativeFSLockFactory@3f9c437d)
[junit4:junit4]   2> 15405 T217 C13 P45486 oasc.RecoveryStrategy.replay No replay needed. core=collection1
[junit4:junit4]   2> 15405 T217 C13 P45486 oasc.RecoveryStrategy.doRecovery Replication Recovery was successful - registering as Active. core=collection1
[junit4:junit4]   2> 15406 T217 C13 P45486 oasc.ZkController.publish publishing core=collection1 state=active
[junit4:junit4]   2> 15406 T217 C13 P45486 oasc.ZkController.publish numShards not found on descriptor - reading it from system property
[junit4:junit4]   2> 15454 T217 C13 P45486 oasc.RecoveryStrategy.doRecovery Finished recovery process. core=collection1
[junit4:junit4]   2> 15611 T232 oass.OpenExchangeRatesOrgProvider.init Initialized with rates=open-exchange-rates.json, refreshInterval=1440.
[junit4:junit4]   2> 15646 T232 oass.IndexSchema.readSchema default search field in schema is text
[junit4:junit4]   2> 15659 T232 oass.IndexSchema.readSchema unique key field: id
[junit4:junit4]   2> 15715 T232 oass.FileExchangeRateProvider.reload Reloading exchange rates from file currency.xml
[junit4:junit4]   2> 15728 T232 oass.FileExchangeRateProvider.reload Reloading exchange rates from file currency.xml
[junit4:junit4]   2> 15738 T232 oass.OpenExchangeRatesOrgProvider.reload Reloading exchange rates from open-exchange-rates.json
[junit4:junit4]   2> 15741 T232 oass.OpenExchangeRatesOrgProvider$OpenExchangeRates.<init> WARNING Unknown key IMPORTANT NOTE
[junit4:junit4]   2> 15742 T232 oass.OpenExchangeRatesOrgProvider$OpenExchangeRates.<init> WARNING Expected key, got STRING
[junit4:junit4]   2> 15743 T232 oass.OpenExchangeRatesOrgProvider.reload Reloading exchange rates from open-exchange-rates.json
[junit4:junit4]   2> 15745 T232 oass.OpenExchangeRatesOrgProvider$OpenExchangeRates.<init> WARNING Unknown key IMPORTANT NOTE
[junit4:junit4]   2> 15746 T232 oass.OpenExchangeRatesOrgProvider$OpenExchangeRates.<init> WARNING Expected key, got STRING
[junit4:junit4]   2> 15746 T232 oasc.SolrCore.initDirectoryFactory org.apache.solr.core.MockDirectoryFactory
[junit4:junit4]   2> 15746 T232 oasc.SolrCore.<init> [collection1] Opening new SolrCore at /usr/home/hudson/hudson-slave/workspace/Lucene-Solr-NightlyTests-trunk/solr/build/solr-core/test/J0/./org.apache.solr.cloud.SyncSliceTest-jetty3-1363188124849/collection1/, dataDir=./org.apache.solr.cloud.SyncSliceTest-1363188112562/jetty3/
[junit4:junit4]   2> 15747 T232 oasc.JmxMonitoredMap.<init> JMX monitoring is enabled. Adding Solr mbeans to JMX Server: com.sun.jmx.mbeanserver.JmxMBeanServer@2cc22a3b
[junit4:junit4]   2> 15748 T232 oasc.SolrCore.initDirectoryFactory org.apache.solr.core.MockDirectoryFactory
[junit4:junit4]   2> 15748 T232 oasc.CachingDirectoryFactory.get return new directory for ./org.apache.solr.cloud.SyncSliceTest-1363188112562/jetty3 forceNew: false
[junit4:junit4]   2> 15749 T232 oasc.SolrCore.getNewIndexDir New index directory detected: old=null new=./org.apache.solr.cloud.SyncSliceTest-1363188112562/jetty3/index/
[junit4:junit4]   2> 15749 T232 oasc.SolrCore.initIndex WARNING [collection1] Solr index directory './org.apache.solr.cloud.SyncSliceTest-1363188112562/jetty3/index' doesn't exist. Creating new index...
[junit4:junit4]   2> 15750 T232 oasc.CachingDirectoryFactory.get return new directory for ./org.apache.solr.cloud.SyncSliceTest-1363188112562/jetty3/index forceNew: false
[junit4:junit4]   2> 15755 T232 oasc.SolrDeletionPolicy.onCommit SolrDeletionPolicy.onCommit: commits:num=1
[junit4:junit4]   2> 		commit{dir=BaseDirectoryWrapper(org.apache.lucene.store.RAMDirectory@4bd128b6 lockFactory=org.apache.lucene.store.NativeFSLockFactory@353d9906),segFN=segments_1,generation=1,filenames=[segments_1]
[junit4:junit4]   2> 15756 T232 oasc.SolrDeletionPolicy.updateCommits newest commit = 1[segments_1]
[junit4:junit4]   2> 15761 T232 oasup.UpdateRequestProcessorChain.init inserting DistributedUpdateProcessorFactory into updateRequestProcessorChain "dedupe"
[junit4:junit4]   2> 15762 T232 oasup.UpdateRequestProcessorChain.init inserting DistributedUpdateProcessorFactory into updateRequestProcessorChain "stored_sig"
[junit4:junit4]   2> 15763 T232 oasup.UpdateRequestProcessorChain.init inserting DistributedUpdateProcessorFactory into updateRequestProcessorChain "distrib-dup-test-chain-implicit"
[junit4:junit4]   2> 15764 T232 oasc.RequestHandlers.initHandlersFromConfig created standard: solr.StandardRequestHandler
[junit4:junit4]   2> 15766 T232 oasc.RequestHandlers.initHandlersFromConfig created /get: solr.RealTimeGetHandler
[junit4:junit4]   2> 15766 T232 oasc.RequestHandlers.initHandlersFromConfig adding lazy requestHandler: solr.ReplicationHandler
[junit4:junit4]   2> 15768 T232 oasc.RequestHandlers.initHandlersFromConfig created /replication: solr.ReplicationHandler
[junit4:junit4]   2> 15769 T232 oasc.RequestHandlers.initHandlersFromConfig created /update: solr.UpdateRequestHandler
[junit4:junit4]   2> 15771 T232 oasc.RequestHandlers.initHandlersFromConfig created /admin/: org.apache.solr.handler.admin.AdminHandlers
[junit4:junit4]   2> 15791 T232 oashl.XMLLoader.init xsltCacheLifetimeSeconds=60
[junit4:junit4]   2> 15827 T232 oass.SolrIndexSearcher.<init> Opening Searcher@1ea85692 main
[junit4:junit4]   2> 15828 T232 oasu.UpdateHandler.clearLog Clearing tlog files, tlogDir=./org.apache.solr.cloud.SyncSliceTest-1363188112562/jetty3/tlog
[junit4:junit4]   2> 15830 T232 oasu.CommitTracker.<init> Hard AutoCommit: disabled
[junit4:junit4]   2> 15830 T232 oasu.CommitTracker.<init> Soft AutoCommit: disabled
[junit4:junit4]   2> 15840 T235 oasc.SolrCore.registerSearcher [collection1] Registered new searcher Searcher@1ea85692 main{StandardDirectoryReader(segments_1:1)}
[junit4:junit4]   2> 15844 T232 oasc.ZkController.publish publishing core=collection1 state=down
[junit4:junit4]   2> 15845 T232 oasc.ZkController.publish numShards not found on descriptor - reading it from system property
[junit4:junit4]   2> 16172 T179 oascc.ZkStateReader.updateClusterState Updating cloud state from ZooKeeper... 
[junit4:junit4]   2> 16174 T179 oasc.Overseer$ClusterStateUpdater.updateState Update state numShards=1 message={
[junit4:junit4]   2> 	  "operation":"state",
[junit4:junit4]   2> 	  "core_node_name":"3",
[junit4:junit4]   2> 	  "numShards":"1",
[junit4:junit4]   2> 	  "shard":"shard1",
[junit4:junit4]   2> 	  "roles":null,
[junit4:junit4]   2> 	  "state":"active",
[junit4:junit4]   2> 	  "core":"collection1",
[junit4:junit4]   2> 	  "collection":"collection1",
[junit4:junit4]   2> 	  "node_name":"127.0.0.1:45486__zw",
[junit4:junit4]   2> 	  "base_url":"http://127.0.0.1:45486/_zw"}
[junit4:junit4]   2> 16182 T179 oasc.Overseer$ClusterStateUpdater.updateState Update state numShards=1 message={
[junit4:junit4]   2> 	  "operation":"state",
[junit4:junit4]   2> 	  "core_node_name":"4",
[junit4:junit4]   2> 	  "numShards":"1",
[junit4:junit4]   2> 	  "shard":null,
[junit4:junit4]   2> 	  "roles":null,
[junit4:junit4]   2> 	  "state":"down",
[junit4:junit4]   2> 	  "core":"collection1",
[junit4:junit4]   2> 	  "collection":"collection1",
[junit4:junit4]   2> 	  "node_name":"127.0.0.1:48068__zw",
[junit4:junit4]   2> 	  "base_url":"http://127.0.0.1:48068/_zw"}
[junit4:junit4]   2> 16182 T179 oasc.Overseer$ClusterStateUpdater.updateState Collection already exists with numShards=1
[junit4:junit4]   2> 16183 T179 oasc.Overseer$ClusterStateUpdater.updateState Assigning new node to shard shard=shard1
[junit4:junit4]   2> 16197 T178 oascc.ZkStateReader$2.process A cluster state change: WatchedEvent state:SyncConnected type:NodeDataChanged path:/clusterstate.json, has occurred - updating... (live nodes size: 4)
[junit4:junit4]   2> 16197 T231 oascc.ZkStateReader$2.process A cluster state change: WatchedEvent state:SyncConnected type:NodeDataChanged path:/clusterstate.json, has occurred - updating... (live nodes size: 4)
[junit4:junit4]   2> 16197 T198 oascc.ZkStateReader$2.process A cluster state change: WatchedEvent state:SyncConnected type:NodeDataChanged path:/clusterstate.json, has occurred - updating... (live nodes size: 4)
[junit4:junit4]   2> 16197 T185 oascc.ZkStateReader$2.process A cluster state change: WatchedEvent state:SyncConnected type:NodeDataChanged path:/clusterstate.json, has occurred - updating... (live nodes size: 4)
[junit4:junit4]   2> 16197 T214 oascc.ZkStateReader$2.process A cluster state change: WatchedEvent state:SyncConnected type:NodeDataChanged path:/clusterstate.json, has occurred - updating... (live nodes size: 4)
[junit4:junit4]   2> 17013 T232 oasc.CoreContainer.registerCore registering core: collection1
[junit4:junit4]   2> 17013 T232 oasc.ZkController.register Register replica - core:collection1 address:http://127.0.0.1:48068/_zw collection:collection1 shard:shard1
[junit4:junit4]   2> 17021 T232 oasc.ZkController.register We are http://127.0.0.1:48068/_zw/collection1/ and leader is http://127.0.0.1:33424/_zw/collection1/
[junit4:junit4]   2> 17021 T232 oasc.ZkController.register No LogReplay needed for core=collection1 baseURL=http://127.0.0.1:48068/_zw
[junit4:junit4]   2> 17021 T232 oasc.ZkController.checkRecovery Core needs to recover:collection1
[junit4:junit4]   2> 17022 T232 oasu.DefaultSolrCoreState.doRecovery Running recovery - first canceling any ongoing recovery
[junit4:junit4]   2> ASYNC  NEW_CORE C15 name=collection1 org.apache.solr.core.SolrCore@6303aa37 url=http://127.0.0.1:48068/_zw/collection1 node=127.0.0.1:48068__zw C15_STATE=coll:collection1 core:collection1 props:{state=down, core=collection1, collection=collection1, node_name=127.0.0.1:48068__zw, base_url=http://127.0.0.1:48068/_zw}
[junit4:junit4]   2> 17022 T236 C15 P48068 oasc.RecoveryStrategy.run Starting recovery process.  core=collection1 recoveringAfterStartup=true
[junit4:junit4]   2> 17023 T236 C15 P48068 oasc.RecoveryStrategy.doRecovery ###### startupVersions=[]
[junit4:junit4]   2> 17023 T232 oascc.ZkStateReader.updateClusterState Updating cloud state from ZooKeeper... 
[junit4:junit4]   2> 17024 T236 C15 P48068 oasc.ZkController.publish publishing core=collection1 state=recovering
[junit4:junit4]   2> 17024 T236 C15 P48068 oasc.ZkController.publish numShards not found on descriptor - reading it from system property
[junit4:junit4]   2> 17025 T156 oass.SolrDispatchFilter.init user.dir=/usr/home/hudson/hudson-slave/workspace/Lucene-Solr-NightlyTests-trunk/solr/build/solr-core/test/J0
[junit4:junit4]   2> 17026 T156 oass.SolrDispatchFilter.init SolrDispatchFilter.init() done
[junit4:junit4]   2> 17027 T236 C15 P48068 oascsi.HttpClientUtil.createClient Creating new http client, config:maxConnections=128&maxConnectionsPerHost=32&followRedirects=false
[junit4:junit4]   2> 17027 T156 oascsi.HttpClientUtil.createClient Creating new http client, config:maxConnections=128&maxConnectionsPerHost=32&followRedirects=false
[junit4:junit4]   2> 17253 T156 oejs.Server.doStart jetty-8.1.8.v20121106
[junit4:junit4]   2> 17256 T156 oejs.AbstractConnector.doStart Started SocketConnector@127.0.0.1:32324
[junit4:junit4]   2> 17257 T156 oass.SolrDispatchFilter.init SolrDispatchFilter.init()
[junit4:junit4]   2> 17258 T156 oasc.SolrResourceLoader.locateSolrHome JNDI not configured for solr (NoInitialContextEx)
[junit4:junit4]   2> 17258 T156 oasc.SolrResourceLoader.locateSolrHome using system property solr.solr.home: /usr/home/hudson/hudson-slave/workspace/Lucene-Solr-NightlyTests-trunk/solr/build/solr-core/test/J0/./org.apache.solr.cloud.SyncSliceTest-jetty4-1363188129599
[junit4:junit4]   2> 17259 T156 oasc.CoreContainer$Initializer.initialize looking for solr config file: /usr/home/hudson/hudson-slave/workspace/Lucene-Solr-NightlyTests-trunk/solr/build/solr-core/test/J0/./org.apache.solr.cloud.SyncSliceTest-jetty4-1363188129599/solr.xml
[junit4:junit4]   2> 17259 T156 oasc.CoreContainer.<init> New CoreContainer 959968660
[junit4:junit4]   2> 17260 T156 oasc.CoreContainer.load Loading CoreContainer using Solr Home: '/usr/home/hudson/hudson-slave/workspace/Lucene-Solr-NightlyTests-trunk/solr/build/solr-core/test/J0/./org.apache.solr.cloud.SyncSliceTest-jetty4-1363188129599/'
[junit4:junit4]   2> 17260 T156 oasc.SolrResourceLoader.<init> new SolrResourceLoader for directory: '/usr/home/hudson/hudson-slave/workspace/Lucene-Solr-NightlyTests-trunk/solr/build/solr-core/test/J0/./org.apache.solr.cloud.SyncSliceTest-jetty4-1363188129599/'
[junit4:junit4]   2> 17318 T156 oashc.HttpShardHandlerFactory.getParameter Setting socketTimeout to: 120000
[junit4:junit4]   2> 17319 T156 oashc.HttpShardHandlerFactory.getParameter Setting urlScheme to: http://
[junit4:junit4]   2> 17319 T156 oashc.HttpShardHandlerFactory.getParameter Setting connTimeout to: 15000
[junit4:junit4]   2> 17320 T156 oashc.HttpShardHandlerFactory.getParameter Setting maxConnectionsPerHost to: 20
[junit4:junit4]   2> 17320 T156 oashc.HttpShardHandlerFactory.getParameter Setting corePoolSize to: 0
[junit4:junit4]   2> 17321 T156 oashc.HttpShardHandlerFactory.getParameter Setting maximumPoolSize to: 2147483647
[junit4:junit4]   2> 17321 T156 oashc.HttpShardHandlerFactory.getParameter Setting maxThreadIdleTime to: 5
[junit4:junit4]   2> 17322 T156 oashc.HttpShardHandlerFactory.getParameter Setting sizeOfQueue to: -1
[junit4:junit4]   2> 17322 T156 oashc.HttpShardHandlerFactory.getParameter Setting fairnessPolicy to: false
[junit4:junit4]   2> 17323 T156 oascsi.HttpClientUtil.createClient Creating new http client, config:maxConnectionsPerHost=20&maxConnections=10000&socketTimeout=120000&connTimeout=15000&retry=false
[junit4:junit4]   2> 17346 T156 oasc.CoreContainer.load Registering Log Listener
[junit4:junit4]   2> 17368 T156 oasc.CoreContainer.initZooKeeper Zookeeper client=127.0.0.1:40935/solr
[junit4:junit4]   2> 17368 T156 oasc.ZkController.checkChrootPath zkHost includes chroot
[junit4:junit4]   2> 17369 T156 oaz.ZooKeeper.<init> Initiating client connection, connectString=127.0.0.1:40935 sessionTimeout=60000 watcher=org.apache.solr.common.cloud.ConnectionManager@1c907aee
[junit4:junit4]   2> 17370 T156 oascc.ConnectionManager.waitForConnected Waiting for client to connect to ZooKeeper
[junit4:junit4]   2> 17371 T247 oaz.ClientCnxn$SendThread.logStartConnect Opening socket connection to server localhost/127.0.0.1:40935. Will not attempt to authenticate using SASL (access denied (javax.security.auth.AuthPermission getLoginConfiguration))
[junit4:junit4]   2> 17373 T247 oaz.ClientCnxn$SendThread.primeConnection Socket connection established to localhost/127.0.0.1:40935, initiating session
[junit4:junit4]   2> 17373 T158 oazs.NIOServerCnxnFactory.run Accepted socket connection from /140.211.11.196:14169
[junit4:junit4]   2> 17374 T158 oazs.ZooKeeperServer.processConnectRequest Client attempting to establish new session at /140.211.11.196:14169
[junit4:junit4]   2> 17376 T160 oazs.ZooKeeperServer.finishSessionInit Established session 0x13d6457dcbc000b with negotiated timeout 20000 for client /140.211.11.196:14169
[junit4:junit4]   2> 17376 T247 oaz.ClientCnxn$SendThread.onConnected Session establishment complete on server localhost/127.0.0.1:40935, sessionid = 0x13d6457dcbc000b, negotiated timeout = 20000
[junit4:junit4]   2> 17377 T248 oascc.ConnectionManager.process Watcher org.apache.solr.common.cloud.ConnectionManager@1c907aee name:ZooKeeperConnection Watcher:127.0.0.1:40935 got event WatchedEvent state:SyncConnected type:None path:null path:null type:None
[junit4:junit4]   2> 17377 T156 oascc.ConnectionManager.waitForConnected Client is connected to ZooKeeper
[junit4:junit4]   2> 17379 T161 oazs.PrepRequestProcessor.pRequest2Txn Processed session termination for sessionid: 0x13d6457dcbc000b
[junit4:junit4]   2> 17381 T248 oaz.ClientCnxn$EventThread.run EventThread shut down
[junit4:junit4]   2> 17381 T158 oazs.NIOServerCnxn.closeSock Closed socket connection for client /140.211.11.196:14169 which had sessionid 0x13d6457dcbc000b
[junit4:junit4]   2> 17381 T156 oaz.ZooKeeper.close Session: 0x13d6457dcbc000b closed
[junit4:junit4]   2> 17382 T156 oascsi.HttpClientUtil.createClient Creating new http client, config:maxConnections=500&maxConnectionsPerHost=16&socketTimeout=120000&connTimeout=15000
[junit4:junit4]   2> 17393 T156 oaz.ZooKeeper.<init> Initiating client connection, connectString=127.0.0.1:40935/solr sessionTimeout=30000 watcher=org.apache.solr.common.cloud.ConnectionManager@3d35cda0
[junit4:junit4]   2> 17395 T156 oascc.ConnectionManager.waitForConnected Waiting for client to connect to ZooKeeper
[junit4:junit4]   2> 17395 T249 oaz.ClientCnxn$SendThread.logStartConnect Opening socket connection to server localhost/127.0.0.1:40935. Will not attempt to authenticate using SASL (access denied (javax.security.auth.AuthPermission getLoginConfiguration))
[junit4:junit4]   2> 17396 T249 oaz.ClientCnxn$SendThread.primeConnection Socket connection established to localhost/127.0.0.1:40935, initiating session
[junit4:junit4]   2> 17396 T158 oazs.NIOServerCnxnFactory.run Accepted socket connection from /140.211.11.196:46811
[junit4:junit4]   2> 17397 T158 oazs.ZooKeeperServer.processConnectRequest Client attempting to establish new session at /140.211.11.196:46811
[junit4:junit4]   2> 17399 T160 oazs.ZooKeeperServer.finishSessionInit Established session 0x13d6457dcbc000c with negotiated timeout 20000 for client /140.211.11.196:46811
[junit4:junit4]   2> 17399 T249 oaz.ClientCnxn$SendThread.onConnected Session establishment complete on server localhost/127.0.0.1:40935, sessionid = 0x13d6457dcbc000c, negotiated timeout = 20000
[junit4:junit4]   2> 17400 T250 oascc.ConnectionManager.process Watcher org.apache.solr.common.cloud.ConnectionManager@3d35cda0 name:ZooKeeperConnection Watcher:127.0.0.1:40935/solr got event WatchedEvent state:SyncConnected type:None path:null path:null type:None
[junit4:junit4]   2> 17400 T156 oascc.ConnectionManager.waitForConnected Client is connected to ZooKeeper
[junit4:junit4]   2> 17401 T161 oazs.PrepRequestProcessor.pRequest Got user-level KeeperException when processing sessionid:0x13d6457dcbc000c type:create cxid:0x1 zxid:0x98 txntype:-1 reqpath:n/a Error Path:/solr/overseer Error:KeeperErrorCode = NodeExists for /solr/overseer
[junit4:junit4]   2> 17403 T161 oazs.PrepRequestProcessor.pRequest Got user-level KeeperException when processing sessionid:0x13d6457dcbc000c type:create cxid:0x2 zxid:0x99 txntype:-1 reqpath:n/a Error Path:/solr/overseer Error:KeeperErrorCode = NodeExists for /solr/overseer
[junit4:junit4]   2> 17407 T156 oascc.ZkStateReader.createClusterStateWatchersAndUpdate Updating cluster state from ZooKeeper... 
[junit4:junit4]   2> 17710 T179 oascc.ZkStateReader.updateClusterState Updating cloud state from ZooKeeper... 
[junit4:junit4]   2> 17711 T179 oasc.Overseer$ClusterStateUpdater.updateState Update state numShards=1 message={
[junit4:junit4]   2> 	  "operation":"state",
[junit4:junit4]   2> 	  "core_node_name":"4",
[junit4:junit4]   2> 	  "numShards":"1",
[junit4:junit4]   2> 	  "shard":"shard1",
[junit4:junit4]   2> 	  "roles":null,
[junit4:junit4]   2> 	  "state":"recovering",
[junit4:junit4]   2> 	  "core":"collection1",
[junit4:junit4]   2> 	  "collection":"collection1",
[junit4:junit4]   2> 	  "node_name":"127.0.0.1:48068__zw",
[junit4:junit4]   2> 	  "base_url":"http://127.0.0.1:48068/_zw"}
[junit4:junit4]   2> 17720 T178 oascc.ZkStateReader$2.process A cluster state change: WatchedEvent state:SyncConnected type:NodeDataChanged path:/clusterstate.json, has occurred - updating... (live nodes size: 4)
[junit4:junit4]   2> 17720 T231 oascc.ZkStateReader$2.process A cluster state change: WatchedEvent state:SyncConnected type:NodeDataChanged path:/clusterstate.json, has occurred - updating... (live nodes size: 4)
[junit4:junit4]   2> 17720 T185 oascc.ZkStateReader$2.process A cluster state change: WatchedEvent state:SyncConnected type:NodeDataChanged path:/clusterstate.json, has occurred - updating... (live nodes size: 4)
[junit4:junit4]   2> 17720 T250 oascc.ZkStateReader$2.process A cluster state change: WatchedEvent state:SyncConnected type:NodeDataChanged path:/clusterstate.json, has occurred - updating... (live nodes size: 4)
[junit4:junit4]   2> 17720 T198 oascc.ZkStateReader$2.process A cluster state change: WatchedEvent state:SyncConnected type:NodeDataChanged path:/clusterstate.json, has occurred - updating... (live nodes size: 4)
[junit4:junit4]   2> 17720 T214 oascc.ZkStateReader$2.process A cluster state change: WatchedEvent state:SyncConnected type:NodeDataChanged path:/clusterstate.json, has occurred - updating... (live nodes size: 4)
[junit4:junit4]   2> 18048 T192 oass.SolrDispatchFilter.handleAdminRequest /admin/cores {coreNodeName=4&state=recovering&nodeName=127.0.0.1:48068__zw&action=PREPRECOVERY&checkLive=true&core=collection1&wt=javabin&onlyIfLeader=true&version=2} status=0 QTime=1001 
[junit4:junit4]   2> 18412 T156 oasc.ZkController.createEphemeralLiveNode Register node as live in ZooKeeper:/live_nodes/127.0.0.1:32324__zw
[junit4:junit4]   2> 18413 T161 oazs.PrepRequestProcessor.pRequest Got user-level KeeperException when processing sessionid:0x13d6457dcbc000c type:delete cxid:0xd zxid:0x9e txntype:-1 reqpath:n/a Error Path:/solr/live_nodes/127.0.0.1:32324__zw Error:KeeperErrorCode = NoNode for /solr/live_nodes/127.0.0.1:32324__zw
[junit4:junit4]   2> 18415 T156 oascc.SolrZkClient.makePath makePath: /live_nodes/127.0.0.1:32324__zw
[junit4:junit4]   2> 18419 T214 oascc.ZkStateReader$2.process A cluster state change: WatchedEvent state:SyncConnected type:NodeChildrenChanged path:/live_nodes, has occurred - updating... (live nodes size: 4)
[junit4:junit4]   2> 18419 T185 oascc.ZkStateReader$2.process A cluster state change: WatchedEvent state:SyncConnected type:NodeChildrenChanged path:/live_nodes, has occurred - updating... (live nodes size: 4)
[junit4:junit4]   2> 18419 T250 oascc.ZkStateReader$2.process A cluster state change: WatchedEvent state:SyncConnected type:NodeChildrenChanged path:/live_nodes, has occurred - updating... (live nodes size: 4)
[junit4:junit4]   2> 18420 T178 oascc.ZkStateReader$3.process Updating live nodes... (5)
[junit4:junit4]   2> 18420 T231 oascc.ZkStateReader$3.process Updating live nodes... (5)
[junit4:junit4]   2> 18420 T198 oascc.ZkStateReader$3.process Updating live nodes... (5)
[junit4:junit4]   2> 18420 T178 oascc.ZkStateReader$2.process A cluster state change: WatchedEvent state:SyncConnected type:NodeChildrenChanged path:/live_nodes, has occurred - updating... (live nodes size: 5)
[junit4:junit4]   2> 18420 T231 oascc.ZkStateReader$2.process A cluster state change: WatchedEvent state:SyncConnected type:NodeChildrenChanged path:/live_nodes, has occurred - updating... (live nodes size: 5)
[junit4:junit4]   2> 18421 T198 oascc.ZkStateReader$2.process A cluster state change: WatchedEvent state:SyncConnected type:NodeChildrenChanged path:/live_nodes, has occurred - updating... (live nodes size: 5)
[junit4:junit4]   2> 18423 T214 oascc.ZkStateReader$3.process Updating live nodes... (5)
[junit4:junit4]   2> 18423 T185 oascc.ZkStateReader$3.process Updating live nodes... (5)
[junit4:junit4]   2> 18424 T250 oascc.ZkStateReader$3.process Updating live nodes... (5)
[junit4:junit4]   2> 18432 T251 oasc.CoreContainer.create Creating SolrCore 'collection1' using instanceDir: /usr/home/hudson/hudson-slave/workspace/Lucene-Solr-NightlyTests-trunk/solr/build/solr-core/test/J0/./org.apache.solr.cloud.SyncSliceTest-jetty4-1363188129599/collection1
[junit4:junit4]   2> 18432 T251 oasc.ZkController.createCollectionZkNode Check for collection zkNode:collection1
[junit4:junit4]   2> 18433 T251 oasc.ZkController.createCollectionZkNode Collection zkNode exists
[junit4:junit4]   2> 18434 T251 oasc.ZkController.readConfigName Load collection config from:/collections/collection1
[junit4:junit4]   2> 18436 T251 oasc.SolrResourceLoader.<init> new SolrResourceLoader for directory: '/usr/home/hudson/hudson-slave/workspace/Lucene-Solr-NightlyTests-trunk/solr/build/solr-core/test/J0/./org.apache.solr.cloud.SyncSliceTest-jetty4-1363188129599/collection1/'
[junit4:junit4]   2> 18437 T251 oasc.SolrResourceLoader.replaceClassLoader Adding 'file:/usr/home/hudson/hudson-slave/workspace/Lucene-Solr-NightlyTests-trunk/solr/build/solr-core/test/J0/org.apache.solr.cloud.SyncSliceTest-jetty4-1363188129599/collection1/lib/classes/' to classloader
[junit4:junit4]   2> 18438 T251 oasc.SolrResourceLoader.replaceClassLoader Adding 'file:/usr/home/hudson/hudson-slave/workspace/Lucene-Solr-NightlyTests-trunk/solr/build/solr-core/test/J0/org.apache.solr.cloud.SyncSliceTest-jetty4-1363188129599/collection1/lib/README' to classloader
[junit4:junit4]   2> 18498 T251 oasc.SolrConfig.<init> Using Lucene MatchVersion: LUCENE_50
[junit4:junit4]   2> 18572 T251 oasc.SolrConfig.<init> Loaded SolrConfig: solrconfig.xml
[junit4:junit4]   2> 18574 T251 oass.IndexSchema.readSchema Reading Solr Schema
[junit4:junit4]   2> 18585 T251 oass.IndexSchema.readSchema Schema name=test
[junit4:junit4]   2> 19464 T251 oass.OpenExchangeRatesOrgProvider.init Initialized with rates=open-exchange-rates.json, refreshInterval=1440.
[junit4:junit4]   2> 19481 T251 oass.IndexSchema.readSchema default search field in schema is text
[junit4:junit4]   2> 19487 T251 oass.IndexSchema.readSchema unique key field: id
[junit4:junit4]   2> 19520 T251 oass.FileExchangeRateProvider.reload Reloading exchange rates from file currency.xml
[junit4:junit4]   2> 19527 T251 oass.FileExchangeRateProvider.reload Reloading exchange rates from file currency.xml
[junit4:junit4]   2> 19533 T251 oass.OpenExchangeRatesOrgProvider.reload Reloading exchange rates from open-exchange-rates.json
[junit4:junit4]   2> 19535 T251 oass.OpenExchangeRatesOrgProvider$OpenExchangeRates.<init> WARNING Unknown key IMPORTANT NOTE
[junit4:junit4]   2> 19535 T251 oass.OpenExchangeRatesOrgProvider$OpenExchangeRates.<init> WARNING Expected key, got STRING
[junit4:junit4]   2> 19536 T251 oass.OpenExchangeRatesOrgProvider.reload Reloading exchange rates from open-exchange-rates.json
[junit4:junit4]   2> 19538 T251 oass.OpenExchangeRatesOrgProvider$OpenExchangeRates.<init> WARNING Unknown key IMPORTANT NOTE
[junit4:junit4]   2> 19538 T251 oass.OpenExchangeRatesOrgProvider$OpenExchangeRates.<init> WARNING Expected key, got STRING
[junit4:junit4]   2> 19539 T251 oasc.SolrCore.initDirectoryFactory org.apache.solr.core.MockDirectoryFactory
[junit4:junit4]   2> 19539 T251 oasc.SolrCore.<init> [collection1] Opening new SolrCore at /usr/home/hudson/hudson-slave/workspace/Lucene-Solr-NightlyTests-trunk/solr/build/solr-core/test/J0/./org.apache.solr.cloud.SyncSliceTest-jetty4-1363188129599/collection1/, dataDir=./org.apache.solr.cloud.SyncSliceTest-1363188112562/jetty4/
[junit4:junit4]   2> 19539 T251 oasc.JmxMonitoredMap.<init> JMX monitoring is enabled. Adding Solr mbeans to JMX Server: com.sun.jmx.mbeanserver.JmxMBeanServer@2cc22a3b
[junit4:junit4]   2> 19540 T251 oasc.SolrCore.initDirectoryFactory org.apache.solr.core.MockDirectoryFactory
[junit4:junit4]   2> 19541 T251 oasc.CachingDirectoryFactory.get return new directory for ./org.apache.solr.cloud.SyncSliceTest-1363188112562/jetty4 forceNew: false
[junit4:junit4]   2> 19541 T251 oasc.SolrCore.getNewIndexDir New index directory detected: old=null new=./org.apache.solr.cloud.SyncSliceTest-1363188112562/jetty4/index/
[junit4:junit4]   2> 19541 T251 oasc.SolrCore.initIndex WARNING [collection1] Solr index directory './org.apache.solr.cloud.SyncSliceTest-1363188112562/jetty4/index' doesn't exist. Creating new index...
[junit4:junit4]   2> 19542 T251 oasc.CachingDirectoryFactory.get return new directory for ./org.apache.solr.cloud.SyncSliceTest-1363188112562/jetty4/index forceNew: false
[junit4:junit4]   2> 19545 T251 oasc.SolrDeletionPolicy.onCommit SolrDeletionPolicy.onCommit: commits:num=1
[junit4:junit4]   2> 		commit{dir=BaseDirectoryWrapper(org.apache.lucene.store.RAMDirectory@74e08014 lockFactory=org.apache.lucene.store.NativeFSLockFactory@4474c7fe),segFN=segments_1,generation=1,filenames=[segments_1]
[junit4:junit4]   2> 19545 T251 oasc.SolrDeletionPolicy.updateCommits newest commit = 1[segments_1]
[junit4:junit4]   2> 19549 T251 oasup.UpdateRequestProcessorChain.init inserting DistributedUpdateProcessorFactory into updateRequestProcessorChain "dedupe"
[junit4:junit4]   2> 19549 T251 oasup.UpdateRequestProcessorChain.init inserting DistributedUpdateProcessorFactory into updateRequestProcessorChain "stored_sig"
[junit4:junit4]   2> 19550 T251 oasup.UpdateRequestProcessorChain.init inserting DistributedUpdateProcessorFactory into updateRequestProcessorChain "distrib-dup-test-chain-implicit"
[junit4:junit4]   2> 19551 T251 oasc.RequestHandlers.initHandlersFromConfig created standard: solr.StandardRequestHandler
[junit4:junit4]   2> 19552 T251 oasc.RequestHandlers.initHandlersFromConfig created /get: solr.RealTimeGetHandler
[junit4:junit4]   2> 19552 T251 oasc.RequestHandlers.initHandlersFromConfig adding lazy requestHandler: solr.ReplicationHandler
[junit4:junit4]   2> 19552 T251 oasc.RequestHandlers.initHandlersFromConfig created /replication: solr.ReplicationHandler
[junit4:junit4]   2> 19553 T251 oasc.RequestHandlers.initHandlersFromConfig created /update: solr.UpdateRequestHandler
[junit4:junit4]   2> 19554 T251 oasc.RequestHandlers.initHandlersFromConfig created /admin/: org.apache.solr.handler.admin.AdminHandlers
[junit4:junit4]   2> 19562 T251 oashl.XMLLoader.init xsltCacheLifetimeSeconds=60
[junit4:junit4]   2> 19569 T251 oass.SolrIndexSearcher.<init> Opening Searcher@642a590d main
[junit4:junit4]   2> 19569 T251 oasu.UpdateHandler.clearLog Clearing tlog files, tlogDir=./org.apache.solr.cloud.SyncSliceTest-1363188112562/jetty4/tlog
[junit4:junit4]   2> 19570 T251 oasu.CommitTracker.<init> Hard AutoCommit: disabled
[junit4:junit4]   2> 19570 T251 oasu.CommitTracker.<init> Soft AutoCommit: disabled
[junit4:junit4]   2> 19577 T252 oasc.SolrCore.registerSearcher [collection1] Registered new searcher Searcher@642a590d main{StandardDirectoryReader(segments_1:1)}
[junit4:junit4]   2> 19580 T251 oasc.ZkController.publish publishing core=collection1 state=down
[junit4:junit4]   2> 19580 T251 oasc.ZkController.publish numShards not found on descriptor - reading it from system property
[junit4:junit4]   2>  C15_STATE=coll:collection1 core:collection1 props:{shard=shard1, state=recovering, core=collection1, collection=collection1, node_name=127.0.0.1:48068__zw, base_url=http://127.0.0.1:48068/_zw}
[junit4:junit4]   2> 20050 T236 C15 P48068 oasc.RecoveryStrategy.doRecovery Attempting to PeerSync from http://127.0.0.1:33424/_zw/collection1/ core=collection1 - recoveringAfterStartup=true
[junit4:junit4]   2> 20050 T236 C15 P48068 oasu.PeerSync.sync PeerSync: core=collection1 url=http://127.0.0.1:48068/_zw START replicas=[http://127.0.0.1:33424/_zw/collection1/] nUpdates=100
[junit4:junit4]   2> 20051 T236 C15 P48068 oasu.PeerSync.sync WARNING no frame of reference to tell of we've missed updates
[junit4:junit4]   2> 20052 T236 C15 P48068 oasc.RecoveryStrategy.doRecovery PeerSync Recovery was not successful - trying replication. core=collection1
[junit4:junit4]   2> 20052 T236 C15 P48068 oasc.RecoveryStrategy.doRecovery Starting Replication Recovery. core=collection1
[junit4:junit4]   2> 20053 T236 C15 P48068 oasc.RecoveryStrategy.doRecovery Begin buffering updates. core=collection1
[junit4:junit4]   2> 20053 T236 C15 P48068 oasu.UpdateLog.bufferUpdates Starting to buffer updates. FSUpdateLog{state=ACTIVE, tlog=null}
[junit4:junit4]   2> 20053 T236 C15 P48068 oasc.RecoveryStrategy.replicate Attempting to replicate from http://127.0.0.1:33424/_zw/collection1/. core=collection1
[junit4:junit4]   2> 20054 T236 C15 P48068 oascsi.HttpClientUtil.createClient Creating new http client, config:maxConnections=128&maxConnectionsPerHost=32&followRedirects=false
[junit4:junit4]   2> 20054 T189 C14 P33424 REQ /get {getVersions=100&distrib=false&wt=javabin&qt=/get&version=2} status=0 QTime=0 
[junit4:junit4]   2> 20073 T193 C14 P33424 oasu.DirectUpdateHandler2.commit start commit{,optimize=false,openSearcher=false,waitSearcher=true,expungeDeletes=false,softCommit=false,prepareCommit=false}
[junit4:junit4]   2> 20074 T193 C14 P33424 oasc.SolrDeletionPolicy.onCommit SolrDeletionPolicy.onCommit: commits:num=2
[junit4:junit4]   2> 		commit{dir=BaseDirectoryWrapper(org.apache.lucene.store.RAMDirectory@2a2096d7 lockFactory=org.apache.lucene.store.NativeFSLockFactory@181f4b24),segFN=segments_2,generation=2,filenames=[segments_2]
[junit4:junit4]   2> 		commit{dir=BaseDirectoryWrapper(org.apache.lucene.store.RAMDirectory@2a2096d7 lockFactory=org.apache.lucene.store.NativeFSLockFactory@181f4b24),segFN=segments_3,generation=3,filenames=[segments_3]
[junit4:junit4]   2> 20074 T193 C14 P33424 oasc.SolrDeletionPolicy.updateCommits newest commit = 3[segments_3]
[junit4:junit4]   2> 20075 T193 C14 P33424 oasu.DirectUpdateHandler2.commit end_commit_flush
[junit4:junit4]   2> 20075 T193 C14 P33424 /update {waitSearcher=true&openSearcher=false&commit=true&wt=javabin&commit_end_point=true&version=2&softCommit=false} {commit=} 0 3
[junit4:junit4]   2> 20076 T236 C15 P48068 oash.ReplicationHandler.inform Commits will be reserved for  10000
[junit4:junit4]   2> 20077 T236 C15 P48068 oash.SnapPuller.<init>  No value set for 'pollInterval'. Timer Task not started.
[junit4:junit4]   2> 20079 T191 C14 P33424 REQ /replication {command=indexversion&qt=/replication&wt=javabin&version=2} status=0 QTime=0 
[junit4:junit4]   2> 20080 T236 C15 P48068 oash.SnapPuller.fetchLatestIndex Master's generation: 3
[junit4:junit4]   2> 20081 T236 C15 P48068 oash.SnapPuller.fetchLatestIndex Slave's generation: 1
[junit4:junit4]   2> 20081 T236 C15 P48068 oash.SnapPuller.fetchLatestIndex Starting replication process
[junit4:junit4]   2> 20083 T191 C14 P33424 REQ /replication {command=filelist&qt=/replication&wt=javabin&generation=3&version=2} status=0 QTime=0 
[junit4:junit4]   2> 20084 T236 C15 P48068 oash.SnapPuller.fetchLatestIndex Number of files in latest index in master: 1
[junit4:junit4]   2> 20086 T236 C15 P48068 oasc.CachingDirectoryFactory.get return new directory for ./org.apache.solr.cloud.SyncSliceTest-1363188112562/jetty3/index.20130313082212639 forceNew: false
[junit4:junit4]   2> 20086 T236 C15 P48068 oash.SnapPuller.fetchLatestIndex Starting download to MockDirWrapper(org.apache.lucene.store.RAMDirectory@4ac194ad lockFactory=org.apache.lucene.store.NativeFSLockFactory@5e5f7983) fullCopy=false
[junit4:junit4]   2> 20089 T191 C14 P33424 REQ /replication {file=segments_3&command=filecontent&checksum=true&wt=filestream&qt=/replication&generation=3} status=0 QTime=0 
[junit4:junit4]   2> 20091 T236 C15 P48068 oash.SnapPuller.fetchLatestIndex Total time taken for download : 0 secs
[junit4:junit4]   2> 20092 T236 C15 P48068 oasu.DefaultSolrCoreState.newIndexWriter Creating new IndexWriter...
[junit4:junit4]   2> 20092 T236 C15 P48068 oasu.DefaultSolrCoreState.newIndexWriter Waiting until IndexWriter is unused... core=collection1
[junit4:junit4]   2> 20094 T236 C15 P48068 oasc.SolrDeletionPolicy.onInit SolrDeletionPolicy.onInit: commits:num=2
[junit4:junit4]   2> 		commit{dir=BaseDirectoryWrapper(org.apache.lucene.store.RAMDirectory@4bd128b6 lockFactory=org.apache.lucene.store.NativeFSLockFactory@353d9906),segFN=segments_1,generation=1,filenames=[segments_1]
[junit4:junit4]   2> 		commit{dir=BaseDirectoryWrapper(org.apache.lucene.store.RAMDirectory@4bd128b6 lockFactory=org.apache.lucene.store.NativeFSLockFactory@353d9906),segFN=segments_3,generation=3,filenames=[segments_3]
[junit4:junit4]   2> 20094 T236 C15 P48068 oasc.SolrDeletionPolicy.updateCommits newest commit = 3[segments_3]
[junit4:junit4]   2> 20095 T236 C15 P48068 oasu.DefaultSolrCoreState.newIndexWriter New IndexWriter is ready to be used.
[junit4:junit4]   2> 20095 T236 C15 P48068 oass.SolrIndexSearcher.<init> Opening Searcher@61492336 main
[junit4:junit4]   2> 20096 T235 oasc.SolrCore.registerSearcher [collection1] Registered new searcher Searcher@61492336 main{StandardDirectoryReader(segments_3:1:nrt)}
[junit4:junit4]   2> 20097 T236 C15 P48068 oash.SnapPuller.fetchLatestIndex removing temporary index download directory files MockDirWrapper(org.apache.lucene.store.RAMDirectory@4ac194ad lockFactory=org.apache.lucene.store.NativeFSLockFactory@5e5f7983)
[junit4:junit4]   2> 20097 T236 C15 P48068 oasc.RecoveryStrategy.replay No replay needed. core=collection1
[junit4:junit4]   2> 20098 T236 C15 P48068 oasc.RecoveryStrategy.doRecovery Replication Recovery was successful - registering as Active. core=collection1
[junit4:junit4]   2> 20098 T236 C15 P48068 oasc.ZkController.publish publishing core=collection1 state=active
[junit4:junit4]   2> 20098 T236 C15 P48068 oasc.ZkController.publish numShards not found on descriptor - reading it from system property
[junit4:junit4]   2> 20101 T236 C15 P48068 oasc.RecoveryStrategy.doRecovery Finished recovery process. core=collection1
[junit4:junit4]   2> 20735 T179 oascc.ZkStateReader.updateClusterState Updating cloud state from ZooKeeper... 
[junit4:junit4]   2> 20736 T179 oasc.Overseer$ClusterStateUpdater.updateState Update state numShards=1 message={
[junit4:junit4]   2> 	  "operation":"state",
[junit4:junit4]   2> 	  "core_node_name":"5",
[junit4:junit4]   2> 	  "numShards":"1",
[junit4:junit4]   2> 	  "shard":null,
[junit4:junit4]   2> 	  "roles":null,
[junit4:junit4]   2> 	  "state":"down",
[junit4:junit4]   2> 	  "core":"collection1",
[junit4:junit4]   2> 	  "collection":"collection1",
[junit4:junit4]   2> 	  "node_name":"127.0.0.1:32324__zw",
[junit4:junit4]   2> 	  "base_url":"http://127.0.0.1:32324/_zw"}
[junit4:junit4]   2> 20737 T179 oasc.Overseer$ClusterStateUpdater.updateState Collection already exists with numShards=1
[junit4:junit4]   2> 20737 T179 oasc.Overseer$ClusterStateUpdater.updateState Assigning new node to shard shard=shard1
[junit4:junit4]   2> 20744 T179 oasc.Overseer$ClusterStateUpdater.updateState Update state numShards=1 message={
[junit4:junit4]   2> 	  "operation":"state",
[junit4:junit4]   2> 	  "core_node_name":"4",
[junit4:junit4]   2> 	  "numShards":"1",
[junit4:junit4]   2> 	  "shard":"shard1",
[junit4:junit4]   2> 	  "roles":null,
[junit4:junit4]   2> 	  "state":"active",
[junit4:junit4]   2> 	  "core":"collection1",
[junit4:junit4]   2> 	  "collection":"collection1",
[junit4:junit4]   2> 	  "node_name":"127.0.0.1:48068__zw",
[junit4:junit4]   2> 	  "base_url":"http://127.0.0.1:48068/_zw"}
[junit4:junit4]   2> 20767 T214 oascc.ZkStateReader$2.process A cluster state change: WatchedEvent state:SyncConnected type:NodeDataChanged path:/clusterstate.json, has occurred - updating... (live nodes size: 5)
[junit4:junit4]   2> 20767 T178 oascc.ZkStateReader$2.process A cluster state change: WatchedEvent state:SyncConnected type:NodeDataChanged path:/clusterstate.json, has occurred - updating... (live nodes size: 5)
[junit4:junit4]   2> 20767 T250 oascc.ZkStateReader$2.process A cluster state change: WatchedEvent state:SyncConnected type:NodeDataChanged path:/clusterstate.json, has occurred - updating... (live nodes size: 5)
[junit4:junit4]   2> 20767 T198 oascc.ZkStateReader$2.process A cluster state change: WatchedEvent state:SyncConnected type:NodeDataChanged path:/clusterstate.json, has occurred - updating... (live nodes size: 5)
[junit4:junit4]   2> 20767 T231 oascc.ZkStateReader$2.process A cluster state change: WatchedEvent state:SyncConnected type:NodeDataChanged path:/clusterstate.json, has occurred - updating... (live nodes size: 5)
[junit4:junit4]   2> 20767 T185 oascc.ZkStateReader$2.process A cluster state change: WatchedEvent state:SyncConnected type:NodeDataChanged path:/clusterstate.json, has occurred - updating... (live nodes size: 5)
[junit4:junit4]   2> 21586 T251 oasc.CoreContainer.registerCore registering core: collection1
[junit4:junit4]   2> 21586 T251 oasc.ZkController.register Register replica - core:collection1 address:http://127.0.0.1:32324/_zw collection:collection1 shard:shard1
[junit4:junit4]   2> 21595 T251 oasc.ZkController.register We are http://127.0.0.1:32324/_zw/collection1/ and leader is http://127.0.0.1:33424/_zw/collection1/
[junit4:junit4]   2> 21595 T251 oasc.ZkController.register No LogReplay needed for core=collection1 baseURL=http://127.0.0.1:32324/_zw
[junit4:junit4]   2> 21595 T251 oasc.ZkController.checkRecovery Core needs to recover:collection1
[junit4:junit4]   2> 21596 T251 oasu.DefaultSolrCoreState.doRecovery Running recovery - first canceling any ongoing recovery
[junit4:junit4]   2> ASYNC  NEW_CORE C16 name=collection1 org.apache.solr.core.SolrCore@75115dab url=http://127.0.0.1:32324/_zw/collection1 node=127.0.0.1:32324__zw C16_STATE=coll:collection1 core:collection1 props:{state=down, core=collection1, collection=collection1, node_name=127.0.0.1:32324__zw, base_url=http://127.0.0.1:32324/_zw}
[junit4:junit4]   2> 21596 T255 C16 P32324 oasc.RecoveryStrategy.run Starting recovery process.  core=collection1 recoveringAfterStartup=true
[junit4:junit4]   2> 21597 T255 C16 P32324 oasc.RecoveryStrategy.doRecovery ###### startupVersions=[]
[junit4:junit4]   2> 21597 T255 C16 P32324 oasc.ZkController.publish publishing core=collection1 state=recovering
[junit4:junit4]   2> 21597 T255 C16 P32324 oasc.ZkController.publish numShards not found on descriptor - reading it from system property
[junit4:junit4]   2> 21597 T251 oascc.ZkStateReader.updateClusterState Updating cloud state from ZooKeeper... 
[junit4:junit4]   2> 21599 T156 oass.SolrDispatchFilter.init user.dir=/usr/home/hudson/hudson-slave/workspace/Lucene-Solr-NightlyTests-trunk/solr/build/solr-core/test/J0
[junit4:junit4]   2> 21600 T156 oass.SolrDispatchFilter.init SolrDispatchFilter.init() done
[junit4:junit4]   2> 21601 T255 C16 P32324 oascsi.HttpClientUtil.createClient Creating new http client, config:maxConnections=128&maxConnectionsPerHost=32&followRedirects=false
[junit4:junit4]   2> 21601 T156 oascsi.HttpClientUtil.createClient Creating new http client, config:maxConnections=128&maxConnectionsPerHost=32&followRedirects=false
[junit4:junit4]   2> 21855 T156 oejs.Server.doStart jetty-8.1.8.v20121106
[junit4:junit4]   2> 21859 T156 oejs.AbstractConnector.doStart Started SocketConnector@127.0.0.1:38965
[junit4:junit4]   2> 21860 T156 oass.SolrDispatchFilter.init SolrDispatchFilter.init()
[junit4:junit4]   2> 21860 T156 oasc.SolrResourceLoader.locateSolrHome JNDI not configured for solr (NoInitialContextEx)
[junit4:junit4]   2> 21861 T156 oasc.SolrResourceLoader.locateSolrHome using system property solr.solr.home: /usr/home/hudson/hudson-slave/workspace/Lucene-Solr-NightlyTests-trunk/solr/build/solr-core/test/J0/./org.apache.solr.cloud.SyncSliceTest-jetty5-1363188134170
[junit4:junit4]   2> 21861 T156 oasc.CoreContainer$Initializer.initialize looking for solr config file: /usr/home/hudson/hudson-slave/workspace/Lucene-Solr-NightlyTests-trunk/solr/build/solr-core/test/J0/./org.apache.solr.cloud.SyncSliceTest-jetty5-1363188134170/solr.xml
[junit4:junit4]   2> 21862 T156 oasc.CoreContainer.<init> New CoreContainer 1579198506
[junit4:junit4]   2> 21862 T156 oasc.CoreContainer.load Loading CoreContainer using Solr Home: '/usr/home/hudson/hudson-slave/workspace/Lucene-Solr-NightlyTests-trunk/solr/build/solr-core/test/J0/./org.apache.solr.cloud.SyncSliceTest-jetty5-1363188134170/'
[junit4:junit4]   2> 21863 T156 oasc.SolrResourceLoader.<init> new SolrResourceLoader for directory: '/usr/home/hudson/hudson-slave/workspace/Lucene-Solr-NightlyTests-trunk/solr/build/solr-core/test/J0/./org.apache.solr.cloud.SyncSliceTest-jetty5-1363188134170/'
[junit4:junit4]   2> 21918 T156 oashc.HttpShardHandlerFactory.getParameter Setting socketTimeout to: 120000
[junit4:junit4]   2> 21919 T156 oashc.HttpShardHandlerFactory.getParameter Setting urlScheme to: http://
[junit4:junit4]   2> 21920 T156 oashc.HttpShardHandlerFactory.getParameter Setting connTimeout to: 15000
[junit4:junit4]   2> 21920 T156 oashc.HttpShardHandlerFactory.getParameter Setting maxConnectionsPerHost to: 20
[junit4:junit4]   2> 21920 T156 oashc.HttpShardHandlerFactory.getParameter Setting corePoolSize to: 0
[junit4:junit4]   2> 21921 T156 oashc.HttpShardHandlerFactory.getParameter Setting maximumPoolSize to: 2147483647
[junit4:junit4]   2> 21921 T156 oashc.HttpShardHandlerFactory.getParameter Setting maxThreadIdleTime to: 5
[junit4:junit4]   2> 21922 T156 oashc.HttpShardHandlerFactory.getParameter Setting sizeOfQueue to: -1
[junit4:junit4]   2> 21922 T156 oashc.HttpShardHandlerFactory.getParameter Setting fairnessPolicy to: false
[junit4:junit4]   2> 21923 T156 oascsi.HttpClientUtil.createClient Creating new http client, config:maxConnectionsPerHost=20&maxConnections=10000&socketTimeout=120000&connTimeout=15000&retry=false
[junit4:junit4]   2> 21954 T156 oasc.CoreContainer.load Registering Log Listener
[junit4:junit4]   2> 21981 T156 oasc.CoreContainer.initZooKeeper Zookeeper client=127.0.0.1:40935/solr
[junit4:junit4]   2> 21982 T156 oasc.ZkController.checkChrootPath zkHost includes chroot
[junit4:junit4]   2> 21982 T156 oaz.ZooKeeper.<init> Initiating client connection, connectString=127.0.0.1:40935 sessionTimeout=60000 watcher=org.apache.solr.common.cloud.ConnectionManager@42557280
[junit4:junit4]   2> 21984 T156 oascc.ConnectionManager.waitForConnected Waiting for client to connect to ZooKeeper
[junit4:junit4]   2> 21984 T266 oaz.ClientCnxn$SendThread.logStartConnect Opening socket connection to server localhost/127.0.0.1:40935. Will not attempt to authenticate using SASL (access denied (javax.security.auth.AuthPermission getLoginConfiguration))
[junit4:junit4]   2> 21985 T266 oaz.ClientCnxn$SendThread.primeConnection Socket connection established to localhost/127.0.0.1:40935, initiating session
[junit4:junit4]   2> 21985 T158 oazs.NIOServerCnxnFactory.run Accepted socket connection from /140.211.11.196:61970
[junit4:junit4]   2> 21986 T158 oazs.ZooKeeperServer.processConnectRequest Client attempting to establish new session at /140.211.11.196:61970
[junit4:junit4]   2> 21988 T160 oazs.ZooKeeperServer.finishSessionInit Established session 0x13d6457dcbc000d with negotiated timeout 20000 for client /140.211.11.196:61970
[junit4:junit4]   2> 21988 T266 oaz.ClientCnxn$SendThread.onConnected Session establishment complete on server localhost/127.0.0.1:40935, sessionid = 0x13d6457dcbc000d, negotiated timeout = 20000
[junit4:junit4]   2> 21988 T267 oascc.ConnectionManager.process Watcher org.apache.solr.common.cloud.ConnectionManager@42557280 name:ZooKeeperConnection Watcher:127.0.0.1:40935 got event WatchedEvent state:SyncConnected type:None path:null path:null type:None
[junit4:junit4]   2> 21989 T156 oascc.ConnectionManager.waitForConnected Client is connected to ZooKeeper
[junit4:junit4]   2> 21991 T161 oazs.PrepRequestProcessor.pRequest2Txn Processed session termination for sessionid: 0x13d6457dcbc000d
[junit4:junit4]   2> 21992 T158 oazs.NIOServerCnxn.closeSock Closed socket connection for client /140.211.11.196:61970 which had sessionid 0x13d6457dcbc000d
[junit4:junit4]   2> 21993 T267 oaz.ClientCnxn$EventThread.run EventThread shut down
[junit4:junit4]   2> 21993 T156 oaz.ZooKeeper.close Session: 0x13d6457dcbc000d closed
[junit4:junit4]   2> 21994 T156 oascsi.HttpClientUtil.createClient Creating new http client, config:maxConnections=500&maxConnectionsPerHost=16&socketTimeout=120000&connTimeout=15000
[junit4:junit4]   2> 22007 T156 oaz.ZooKeeper.<init> Initiating client connection, connectString=127.0.0.1:40935/solr sessionTimeout=30000 watcher=org.apache.solr.common.cloud.ConnectionManager@78adaa9f
[junit4:junit4]   2> 22009 T156 oascc.ConnectionManager.waitForConnected Waiting for client to connect to ZooKeeper
[junit4:junit4]   2> 22009 T268 oaz.ClientCnxn$SendThread.logStartConnect Opening socket connection to server localhost/127.0.0.1:40935. Will not attempt to authenticate using SASL (access denied (javax.security.auth.AuthPermission getLoginConfiguration))
[junit4:junit4]   2> 22010 T268 oaz.ClientCnxn$SendThread.primeConnection Socket connection established to localhost/127.0.0.1:40935, initiating session
[junit4:junit4]   2> 22010 T158 oazs.NIOServerCnxnFactory.run Accepted socket connection from /140.211.11.196:63499
[junit4:junit4]   2> 22011 T158 oazs.ZooKeeperServer.processConnectRequest Client attempting to establish new session at /140.211.11.196:63499
[junit4:junit4]   2> 22013 T160 oazs.ZooKeeperServer.finishSessionInit Established session 0x13d6457dcbc000e with negotiated timeout 20000 for client /140.211.11.196:63499
[junit4:junit4]   2> 22013 T268 oaz.ClientCnxn$SendThread.onConnected Session establishment complete on server localhost/127.0.0.1:40935, sessionid = 0x13d6457dcbc000e, negotiated timeout = 20000
[junit4:junit4]   2> 22013 T269 oascc.ConnectionManager.process Watcher org.apache.solr.common.cloud.ConnectionManager@78adaa9f name:ZooKeeperConnection Watcher:127.0.0.1:40935/solr got event WatchedEvent state:SyncConnected type:None path:null path:null type:None
[junit4:junit4]   2> 22014 T156 oascc.ConnectionManager.waitForConnected Client is connected to ZooKeeper
[junit4:junit4]   2> 22015 T161 oazs.PrepRequestProcessor.pRequest Got user-level KeeperException when processing sessionid:0x13d6457dcbc000e type:create cxid:0x1 zxid:0xaf txntype:-1 reqpath:n/a Error Path:/solr/overseer Error:KeeperErrorCode = NodeExists for /solr/overseer
[junit4:junit4]   2> 22020 T161 oazs.PrepRequestProcessor.pRequest Got user-level KeeperException when processing sessionid:0x13d6457dcbc000e type:create cxid:0x2 zxid:0xb0 txntype:-1 reqpath:n/a Error Path:/solr/overseer Error:KeeperErrorCode = NodeExists for /solr/overseer
[junit4:junit4]   2> 22024 T156 oascc.ZkStateReader.createClusterStateWatchersAndUpdate Updating cluster state from ZooKeeper... 
[junit4:junit4]   2> 22280 T179 oascc.ZkStateReader.updateClusterState Updating cloud state from ZooKeeper... 
[junit4:junit4]   2> 22281 T179 oasc.Overseer$ClusterStateUpdater.updateState Update state numShards=1 message={
[junit4:junit4]   2> 	  "operation":"state",
[junit4:junit4]   2> 	  "core_node_name":"5",
[junit4:junit4]   2> 	  "numShards":"1",
[junit4:junit4]   2> 	  "shard":"shard1",
[junit4:junit4]   2> 	  "roles":null,
[junit4:junit4]   2> 	  "state":"recovering",
[junit4:junit4]   2> 	  "core":"collection1",
[junit4:junit4]   2> 	  "collection":"collection1",
[junit4:junit4]   2> 	  "node_name":"127.0.0.1:32324__zw",
[junit4:junit4]   2> 	  "base_url":"http://127.0.0.1:32324/_zw"}
[junit4:junit4]   2> 22295 T178 oascc.ZkStateReader$2.process A cluster state change: WatchedEvent state:SyncConnected type:NodeDataChanged path:/clusterstate.json, has occurred - updating... (live nodes size: 5)
[junit4:junit4]   2> 22295 T231 oascc.ZkStateReader$2.process A cluster state change: WatchedEvent state:SyncConnected type:NodeDataChanged path:/clusterstate.json, has occurred - updating... (live nodes size: 5)
[junit4:junit4]   2> 22295 T185 oascc.ZkStateReader$2.process A cluster state change: WatchedEvent state:SyncConnected type:NodeDataChanged path:/clusterstate.json, has occurred - updating... (live nodes size: 5)
[junit4:junit4]   2> 22295 T214 oascc.ZkStateReader$2.process A cluster state change: WatchedEvent state:SyncConnected type:NodeDataChanged path:/clusterstate.json, has occurred - updating... (live nodes size: 5)
[junit4:junit4]   2> 22295 T250 oascc.ZkStateReader$2.process A cluster state change: WatchedEvent state:SyncConnected type:NodeDataChanged path:/clusterstate.json, has occurred - updating... (live nodes size: 5)
[junit4:junit4]   2> 22295 T198 oascc.ZkStateReader$2.process A cluster state change: WatchedEvent state:SyncConnected type:NodeDataChanged path:/clusterstate.json, has occurred - updating... (live nodes size: 5)
[junit4:junit4]   2> 22295 T269 oascc.ZkStateReader$2.process A cluster state change: WatchedEvent state:SyncConnected type:NodeDataChanged path:/clusterstate.json, has occurred - updating... (live nodes size: 5)
[junit4:junit4]   2> 22619 T194 oass.SolrDispatchFilter.handleAdminRequest /admin/cores {coreNodeName=5&state=recovering&nodeName=127.0.0.1:32324__zw&action=PREPRECOVERY&checkLive=true&core=collection1&wt=javabin&onlyIfLeader=true&version=2} status=0 QTime=1001 
[junit4:junit4]   2> 23030 T156 oasc.ZkController.createEphemeralLiveNode Register node as live in ZooKeeper:/live_nodes/127.0.0.1:38965__zw
[junit4:junit4]   2> 23031 T161 oazs.PrepRequestProcessor.pRequest Got user-level KeeperException when processing sessionid:0x13d6457dcbc000e type:delete cxid:0xd zxid:0xb5 txntype:-1 reqpath:n/a Error Path:/solr/live_nodes/127.0.0.1:38965__zw Error:KeeperErrorCode = NoNode for /solr/live_nodes/127.0.0.1:38965__zw
[junit4:junit4]   2> 23037 T156 oascc.SolrZkClient.makePath makePath: /live_nodes/127.0.0.1:38965__zw
[junit4:junit4]   2> 23042 T214 oascc.ZkStateReader$2.process A cluster state change: WatchedEvent state:SyncConnected type:NodeChildrenChanged path:/live_nodes, has occurred - updating... (live nodes size: 5)
[junit4:junit4]   2> 23042 T250 oascc.ZkStateReader$2.process A cluster state change: WatchedEvent state:SyncConnected type:NodeChildrenChanged path:/live_nodes, has occurred - updating... (live nodes size: 5)
[junit4:junit4]   2> 23042 T185 oascc.ZkStateReader$2.process A cluster state change: WatchedEvent state:SyncConnected type:NodeChildrenChanged path:/live_nodes, has occurred - updating... (live nodes size: 5)
[junit4:junit4]   2> 23043 T231 oascc.ZkStateReader$3.process Updating live nodes... (6)
[junit4:junit4]   2> 23043 T178 oascc.ZkStateReader$3.process Updating live nodes... (6)
[junit4:junit4]   2> 23043 T198 oascc.ZkStateReader$3.process Updating live nodes... (6)
[junit4:junit4]   2> 23043 T231 oascc.ZkStateReader$2.process A cluster state change: WatchedEvent state:SyncConnected type:NodeChildrenChanged path:/live_nodes, has occurred - updating... (live nodes size: 6)
[junit4:junit4]   2> 23043 T269 oascc.ZkStateReader$3.process Updating live nodes... (6)
[junit4:junit4]   2> 23044 T198 oascc.ZkStateReader$2.process A cluster state change: WatchedEvent state:SyncConnected type:NodeChildrenChanged path:/live_nodes, has occurred - updating... (live nodes size: 6)
[junit4:junit4]   2> 23044 T269 oascc.ZkStateReader$2.process A cluster state change: WatchedEvent state:SyncConnected type:NodeChildrenChanged path:/live_nodes, has occurred - updating... (live nodes size: 6)
[junit4:junit4]   2> 23044 T178 oascc.ZkStateReader$2.process A cluster state change: WatchedEvent state:SyncConnected type:NodeChildrenChanged path:/live_nodes, has occurred - updating... (live nodes size: 6)
[junit4:junit4]   2> 23047 T250 oascc.ZkStateReader$3.process Updating live nodes... (6)
[junit4:junit4]   2> 23047 T214 oascc.ZkStateReader$3.process Updating live nodes... (6)
[junit4:junit4]   2> 23047 T185 oascc.ZkStateReader$3.process Updating live nodes... (6)
[junit4:junit4]   2> 23055 T270 oasc.CoreContainer.create Creating SolrCore 'collection1' using instanceDir: /usr/home/hudson/hudson-slave/workspace/Lucene-Solr-NightlyTests-trunk/solr/build/solr-core/test/J0/./org.apache.solr.cloud.SyncSliceTest-jetty5-1363188134170/collection1
[junit4:junit4]   2> 23056 T270 oasc.ZkController.createCollectionZkNode Check for collection zkNode:collection1
[junit4:junit4]   2> 23057 T270 oasc.ZkController.createCollectionZkNode Collection zkNode exists
[junit4:junit4]   2> 23057 T270 oasc.ZkController.readConfigName Load collection config from:/collections/collection1
[junit4:junit4]   2> 23059 T270 oasc.SolrResourceLoader.<init> new SolrResourceLoader for directory: '/usr/home/hudson/hudson-slave/workspace/Lucene-Solr-NightlyTests-trunk/solr/build/solr-core/test/J0/./org.apache.solr.cloud.SyncSliceTest-jetty5-1363188134170/collection1/'
[junit4:junit4]   2> 23060 T270 oasc.SolrResourceLoader.replaceClassLoader Adding 'file:/usr/home/hudson/hudson-slave/workspace/Lucene-Solr-NightlyTests-trunk/solr/build/solr-core/test/J0/org.apache.solr.cloud.SyncSliceTest-jetty5-1363188134170/collection1/lib/README' to classloader
[junit4:junit4]   2> 23061 T270 oasc.SolrResourceLoader.replaceClassLoader Adding 'file:/usr/home/hudson/hudson-slave/workspace/Lucene-Solr-NightlyTests-trunk/solr/build/solr-core/test/J0/org.apache.solr.cloud.SyncSliceTest-jetty5-1363188134170/collection1/lib/classes/' to classloader
[junit4:junit4]   2> 23119 T270 oasc.SolrConfig.<init> Using Lucene MatchVersion: LUCENE_50
[junit4:junit4]   2> 23189 T270 oasc.SolrConfig.<init> Loaded SolrConfig: solrconfig.xml
[junit4:junit4]   2> 23190 T270 oass.IndexSchema.readSchema Reading Solr Schema
[junit4:junit4]   2> 23200 T270 oass.IndexSchema.readSchema Schema name=test
[junit4:junit4]   2> 23980 T270 oass.OpenExchangeRatesOrgProvider.init Initialized with rates=open-exchange-rates.json, refreshInterval=1440.
[junit4:junit4]   2> 23996 T270 oass.IndexSchema.readSchema default search field in schema is text
[junit4:junit4]   2> 24001 T270 oass.IndexSchema.readSchema unique key field: id
[junit4:junit4]   2> 24028 T270 oass.FileExchangeRateProvider.reload Reloading exchange rates from file currency.xml
[junit4:junit4]   2> 24035 T270 oass.FileExchangeRateProvider.reload Reloading exchange rates from file currency.xml
[junit4:junit4]   2> 24041 T270 oass.OpenExchangeRatesOrgProvider.reload Reloading exchange rates from open-exchange-rates.json
[junit4:junit4]   2> 24043 T270 oass.OpenExchangeRatesOrgProvider$OpenExchangeRates.<init> WARNING Unknown key IMPORTANT NOTE
[junit4:junit4]   2> 24044 T270 oass.OpenExchangeRatesOrgProvider$OpenExchangeRates.<init> WARNING Expected key, got STRING
[junit4:junit4]   2> 24044 T270 oass.OpenExchangeRatesOrgProvider.reload Reloading exchange rates from open-exchange-rates.json
[junit4:junit4]   2> 24046 T270 oass.OpenExchangeRatesOrgProvider$OpenExchangeRates.<init> WARNING Unknown key IMPORTANT NOTE
[junit4:junit4]   2> 24047 T270 oass.OpenExchangeRatesOrgProvider$OpenExchangeRates.<init> WARNING Expected key, got STRING
[junit4:junit4]   2> 24047 T270 oasc.SolrCore.initDirectoryFactory org.apache.solr.core.MockDirectoryFactory
[junit4:junit4]   2> 24047 T270 oasc.SolrCore.<init> [collection1] Opening new SolrCore at /usr/home/hudson/hudson-slave/workspace/Lucene-Solr-NightlyTests-trunk/solr/build/solr-core/test/J0/./org.apache.solr.cloud.SyncSliceTest-jetty5-1363188134170/collection1/, dataDir=./org.apache.solr.cloud.SyncSliceTest-1363188112562/jetty5/
[junit4:junit4]   2> 24048 T270 oasc.JmxMonitoredMap.<init> JMX monitoring is enabled. Adding Solr mbeans to JMX Server: com.sun.jmx.mbeanserver.JmxMBeanServer@2cc22a3b
[junit4:junit4]   2> 24049 T270 oasc.SolrCore.initDirectoryFactory org.apache.solr.core.MockDirectoryFactory
[junit4:junit4]   2> 24049 T270 oasc.CachingDirectoryFactory.get return new directory for ./org.apache.solr.cloud.SyncSliceTest-1363188112562/jetty5 forceNew: false
[junit4:junit4]   2> 24050 T270 oasc.SolrCore.getNewIndexDir New index directory detected: old=null new=./org.apache.solr.cloud.SyncSliceTest-1363188112562/jetty5/index/
[junit4:junit4]   2> 24050 T270 oasc.SolrCore.initIndex WARNING [collection1] Solr index directory './org.apache.solr.cloud.SyncSliceTest-1363188112562/jetty5/index' doesn't exist. Creating new index...
[junit4:junit4]   2> 24050 T270 oasc.CachingDirectoryFactory.get return new directory for ./org.apache.solr.cloud.SyncSliceTest-1363188112562/jetty5/index forceNew: false
[junit4:junit4]   2> 24053 T270 oasc.SolrDeletionPolicy.onCommit SolrDeletionPolicy.onCommit: commits:num=1
[junit4:junit4]   2> 		commit{dir=BaseDirectoryWrapper(org.apache.lucene.store.RAMDirectory@2f21b1f2 lockFactory=org.apache.lucene.store.NativeFSLockFactory@67887119),segFN=segments_1,generation=1,filenames=[segments_1]
[junit4:junit4]   2> 24054 T270 oasc.SolrDeletionPolicy.updateCommits newest commit = 1[segments_1]
[junit4:junit4]   2> 24057 T270 oasup.UpdateRequestProcessorChain.init inserting DistributedUpdateProcessorFactory into updateRequestProcessorChain "dedupe"
[junit4:junit4]   2> 24057 T270 oasup.UpdateRequestProcessorChain.init inserting DistributedUpdateProcessorFactory into updateRequestProcessorChain "stored_sig"
[junit4:junit4]   2> 24058 T270 oasup.UpdateRequestProcessorChain.init inserting DistributedUpdateProcessorFactory into updateRequestProcessorChain "distrib-dup-test-chain-implicit"
[junit4:junit4]   2> 24059 T270 oasc.RequestHandlers.initHandlersFromConfig created standard: solr.StandardRequestHandler
[junit4:junit4]   2> 24059 T270 oasc.RequestHandlers.initHandlersFromConfig created /get: solr.RealTimeGetHandler
[junit4:junit4]   2> 24059 T270 oasc.RequestHandlers.initHandlersFromConfig adding lazy requestHandler: solr.ReplicationHandler
[junit4:junit4]   2> 24060 T270 oasc.RequestHandlers.initHandlersFromConfig created /replication: solr.ReplicationHandler
[junit4:junit4]   2> 24061 T270 oasc.RequestHandlers.initHandlersFromConfig created /update: solr.UpdateRequestHandler
[junit4:junit4]   2> 24061 T270 oasc.RequestHandlers.initHandlersFromConfig created /admin/: org.apache.solr.handler.admin.AdminHandlers
[junit4:junit4]   2> 24069 T270 oashl.XMLLoader.init xsltCacheLifetimeSeconds=60
[junit4:junit4]   2> 24076 T270 oass.SolrIndexSearcher.<init> Opening Searcher@25048104 main
[junit4:junit4]   2> 24077 T270 oasu.UpdateHandler.clearLog Clearing tlog files, tlogDir=./org.apache.solr.cloud.SyncSliceTest-1363188112562/jetty5/tlog
[junit4:junit4]   2> 24078 T270 oasu.CommitTracker.<init> Hard AutoCommit: disabled
[junit4:junit4]   2> 24078 T270 oasu.CommitTracker.<init> Soft AutoCommit: disabled
[junit4:junit4]   2> 24084 T271 oasc.SolrCore.registerSearcher [collection1] Registered new searcher Searcher@25048104 main{StandardDirectoryReader(segments_1:1)}
[junit4:junit4]   2> 24088 T270 oasc.ZkController.publish publishing core=collection1 state=down
[junit4:junit4]   2> 24088 T270 oasc.ZkController.publish numShards not found on descriptor - reading it from system property
[junit4:junit4]   2>  C16_STATE=coll:collection1 core:collection1 props:{shard=shard1, state=recovering, core=collection1, collection=collection1, node_name=127.0.0.1:32324__zw, base_url=http://127.0.0.1:32324/_zw}
[junit4:junit4]   2> 24621 T255 C16 P32324 oasc.RecoveryStrategy.doRecovery Attempting to PeerSync from http://127.0.0.1:33424/_zw/collection1/ core=collection1 - recoveringAfterStartup=true
[junit4:junit4]   2> 24621 T255 C16 P32324 oasu.PeerSync.sync PeerSync: core=collection1 url=http://127.0.0.1:32324/_zw START replicas=[http://127.0.0.1:33424/_zw/collection1/] nUpdates=100
[junit4:junit4]   2> 24622 T255 C16 P32324 oasu.PeerSync.sync WARNING no frame of reference to tell of we've missed updates
[junit4:junit4]   2> 24623 T255 C16 P32324 oasc.RecoveryStrategy.doRecovery PeerSync Recovery was not successful - trying replication. core=collection1
[junit4:junit4]   2> 24623 T255 C16 P32324 oasc.RecoveryStrategy.doRecovery Starting Replication Recovery. core=collection1
[junit4:junit4]   2> 24623 T255 C16 P32324 oasc.RecoveryStrategy.doRecovery Begin buffering updates. core=collection1
[junit4:junit4]   2> 24623 T255 C16 P32324 oasu.UpdateLog.bufferUpdates Starting to buffer updates. FSUpdateLog{state=ACTIVE, tlog=null}
[junit4:junit4]   2> 24623 T255 C16 P32324 oasc.RecoveryStrategy.replicate Attempting to replicate from http://127.0.0.1:33424/_zw/collection1/. core=collection1
[junit4:junit4]   2> 24624 T255 C16 P32324 oascsi.HttpClientUtil.createClient Creating new http client, config:maxConnections=128&maxConnectionsPerHost=32&followRedirects=false
[junit4:junit4]   2> 24625 T189 C14 P33424 REQ /get {getVersions=100&distrib=false&wt=javabin&qt=/get&version=2} status=0 QTime=0 
[junit4:junit4]   2> 24645 T188 C14 P33424 oasu.DirectUpdateHandler2.commit start commit{,optimize=false,openSearcher=false,waitSearcher=true,expungeDeletes=false,softCommit=false,prepareCommit=false}
[junit4:junit4]   2> 24646 T188 C14 P33424 oasc.SolrDeletionPolicy.onCommit SolrDeletionPolicy.onCommit: commits:num=3
[junit4:junit4]   2> 		commit{dir=BaseDirectoryWrapper(org.apache.lucene.store.RAMDirectory@2a2096d7 lockFactory=org.apache.lucene.store.NativeFSLockFactory@181f4b24),segFN=segments_2,generation=2,filenames=[segments_2]
[junit4:junit4]   2> 		commit{dir=BaseDirectoryWrapper(org.apache.lucene.store.RAMDirectory@2a2096d7 lockFactory=org.apache.lucene.store.NativeFSLockFactory@181f4b24),segFN=segments_3,generation=3,filenames=[segments_3]
[junit4:junit4]   2> 		commit{dir=BaseDirectoryWrapper(org.apache.lucene.store.RAMDirectory@2a2096d7 lockFactory=org.apache.lucene.store.NativeFSLockFactory@181f4b24),segFN=segments_4,generation=4,filenames=[segments_4]
[junit4:junit4]   2> 24646 T188 C14 P33424 oasc.SolrDeletionPolicy.updateCommits newest commit = 4[segments_4]
[junit4:junit4]   2> 24647 T188 C14 P33424 oasu.DirectUpdateHandler2.commit end_commit_flush
[junit4:junit4]   2> 24647 T188 C14 P33424 /update {waitSearcher=true&openSearcher=false&commit=true&wt=javabin&commit_end_point=true&version=2&softCommit=false} {commit=} 0 2
[junit4:junit4]   2> 24648 T255 C16 P32324 oash.ReplicationHandler.inform Commits will be reserved for  10000
[junit4:junit4]   2> 24649 T255 C16 P32324 oash.SnapPuller.<init>  No value set for 'pollInterval'. Timer Task not started.
[junit4:junit4]   2> 24651 T191 C14 P33424 REQ /replication {command=indexversion&qt=/replication&wt=javabin&version=2} status=0 QTime=0 
[junit4:junit4]   2> 24652 T255 C16 P32324 oash.SnapPuller.fetchLatestIndex Master's generation: 4
[junit4:junit4]   2> 24652 T255 C16 P32324 oash.SnapPuller.fetchLatestIndex Slave's generation: 1
[junit4:junit4]   2> 24653 T255 C16 P32324 oash.SnapPuller.fetchLatestIndex Starting replication process
[junit4:junit4]   2> 24656 T191 C14 P33424 REQ /replication {command=filelist&qt=/replication&wt=javabin&generation=4&version=2} status=0 QTime=1 
[junit4:junit4]   2> 24656 T255 C16 P32324 oash.SnapPuller.fetchLatestIndex Number of files in latest index in master: 1
[junit4:junit4]   2> 24658 T255 C16 P32324 oasc.CachingDirectoryFactory.get return new directory for ./org.apache.solr.cloud.SyncSliceTest-1363188112562/jetty4/index.20130313082217211 forceNew: false
[junit4:junit4]   2> 24658 T255 C16 P32324 oash.SnapPuller.fetchLatestIndex Starting download to MockDirWrapper(org.apache.lucene.store.RAMDirectory@20f5e794 lockFactory=org.apache.lucene.store.NativeFSLockFactory@18047193) fullCopy=false
[junit4:junit4]   2> 24661 T191 C14 P33424 REQ /replication {file=segments_4&command=filecontent&checksum=true&wt=filestream&qt=/replication&generation=4} status=0 QTime=0 
[junit4:junit4]   2> 24663 T255 C16 P32324 oash.SnapPuller.fetchLatestIndex Total time taken for download : 0 secs
[junit4:junit4]   2> 24664 T255 C16 P32324 oasu.DefaultSolrCoreState.newIndexWriter Creating new IndexWriter...
[junit4:junit4]   2> 24664 T255 C16 P32324 oasu.DefaultSolrCoreState.newIndexWriter Waiting until IndexWriter is unused... core=collection1
[junit4:junit4]   2> 24667 T255 C16 P32324 oasc.SolrDeletionPolicy.onInit SolrDeletionPolicy.onInit: commits:num=2
[junit4:junit4]   2> 		commit{dir=BaseDirectoryWrapper(org.apache.lucene.store.RAMDirectory@74e08014 lockFactory=org.apache.lucene.store.NativeFSLockFactory@4474c7fe),segFN=segments_1,generation=1,filenames=[segments_1]
[junit4:junit4]   2> 		commit{dir=BaseDirectoryWrapper(org.apache.lucene.store.RAMDirectory@74e08014 lockFactory=org.apache.lucene.store.NativeFSLockFactory@4474c7fe),segFN=segments_4,generation=4,filenames=[segments_4]
[junit4:

[...truncated too long message...]

4]   2> 150931 T5783 oasc.SolrException.log SEVERE Sync request error: org.apache.solr.client.solrj.SolrServerException: IOException occured when talking to server at: http://127.0.0.1:64036/sy_b/fb/collection1
[junit4:junit4]   2> 150931 T5783 oasc.SyncStrategy.syncToMe http://127.0.0.1:27602/sy_b/fb/collection1/: Sync failed - asking replica (http://127.0.0.1:64036/sy_b/fb/collection1/) to recover.
[junit4:junit4]   2> 150931 T5783 oasc.SyncStrategy.syncToMe We have been closed, don't request that a replica recover
[junit4:junit4]   2> 150932 T5783 oasc.ShardLeaderElectionContext.runLeaderProcess I am the new leader: http://127.0.0.1:27602/sy_b/fb/collection1/
[junit4:junit4]   2> 150932 T5783 oasc.SolrCore.close [collection1]  CLOSING SolrCore org.apache.solr.core.SolrCore@300a5dd4
[junit4:junit4]   2> 150936 T5783 oasu.DirectUpdateHandler2.close closing DirectUpdateHandler2{commits=5,autocommits=0,soft autocommits=0,optimizes=0,rollbacks=0,expungeDeletes=0,docsPending=0,adds=0,deletesById=0,deletesByQuery=0,errors=0,cumulative_adds=35,cumulative_deletesById=0,cumulative_deletesByQuery=0,cumulative_errors=0}
[junit4:junit4]   2> 150936 T5783 oasu.SolrCoreState.decrefSolrCoreState Closing SolrCoreState
[junit4:junit4]   2> 150936 T5783 oasu.DefaultSolrCoreState.closeIndexWriter SolrCoreState ref count has reached 0 - closing IndexWriter
[junit4:junit4]   2> 150936 T5783 oasu.DefaultSolrCoreState.closeIndexWriter closing IndexWriter with IndexWriterCloser
[junit4:junit4]   2> 150939 T5783 oasc.SolrCore.closeSearcher [collection1] Closing main searcher on request.
[junit4:junit4]   2> 150939 T5783 oasc.CachingDirectoryFactory.close Closing directory when closing factory: ./org.apache.solr.cloud.BasicDistributedZk2Test-1363190185438/jetty4/index
[junit4:junit4]   2> 150939 T5783 oasc.CachingDirectoryFactory.closeDirectory Closing directory: ./org.apache.solr.cloud.BasicDistributedZk2Test-1363190185438/jetty4/index
[junit4:junit4]   2> 150939 T5783 oasc.CachingDirectoryFactory.close Closing directory when closing factory: ./org.apache.solr.cloud.BasicDistributedZk2Test-1363190185438/jetty4/index.20130314035648895
[junit4:junit4]   2> 150939 T5783 oasc.CachingDirectoryFactory.closeDirectory Closing directory: ./org.apache.solr.cloud.BasicDistributedZk2Test-1363190185438/jetty4/index.20130314035648895
[junit4:junit4]   2> 150940 T5783 oasc.CachingDirectoryFactory.close Closing directory when closing factory: ./org.apache.solr.cloud.BasicDistributedZk2Test-1363190185438/jetty4
[junit4:junit4]   2> 150940 T5783 oasc.CachingDirectoryFactory.closeDirectory Closing directory: ./org.apache.solr.cloud.BasicDistributedZk2Test-1363190185438/jetty4
[junit4:junit4]   2> 150940 T5783 oascc.SolrZkClient.makePath makePath: /collections/collection1/leaders/shard2
[junit4:junit4]   2> 150940 T5783 oasc.LeaderElector$1.process WARNING  org.apache.zookeeper.KeeperException$SessionExpiredException: KeeperErrorCode = Session expired for /collections/collection1/leader_elect/shard2/election/89338031993323532-5-n_0000000001
[junit4:junit4]   2> 	at org.apache.zookeeper.KeeperException.create(KeeperException.java:127)
[junit4:junit4]   2> 	at org.apache.zookeeper.KeeperException.create(KeeperException.java:51)
[junit4:junit4]   2> 	at org.apache.zookeeper.ZooKeeper.delete(ZooKeeper.java:873)
[junit4:junit4]   2> 	at org.apache.solr.common.cloud.SolrZkClient$2.execute(SolrZkClient.java:153)
[junit4:junit4]   2> 	at org.apache.solr.common.cloud.SolrZkClient$2.execute(SolrZkClient.java:150)
[junit4:junit4]   2> 	at org.apache.solr.common.cloud.ZkCmdExecutor.retryOperation(ZkCmdExecutor.java:65)
[junit4:junit4]   2> 	at org.apache.solr.common.cloud.SolrZkClient.delete(SolrZkClient.java:150)
[junit4:junit4]   2> 	at org.apache.solr.cloud.ElectionContext.cancelElection(ElectionContext.java:63)
[junit4:junit4]   2> 	at org.apache.solr.cloud.ShardLeaderElectionContext.runLeaderProcess(ElectionContext.java:243)
[junit4:junit4]   2> 	at org.apache.solr.cloud.LeaderElector.runIamLeaderProcess(LeaderElector.java:156)
[junit4:junit4]   2> 	at org.apache.solr.cloud.LeaderElector.checkIfIamLeader(LeaderElector.java:100)
[junit4:junit4]   2> 	at org.apache.solr.cloud.LeaderElector.access$000(LeaderElector.java:55)
[junit4:junit4]   2> 	at org.apache.solr.cloud.LeaderElector$1.process(LeaderElector.java:129)
[junit4:junit4]   2> 	at org.apache.zookeeper.ClientCnxn$EventThread.processEvent(ClientCnxn.java:519)
[junit4:junit4]   2> 	at org.apache.zookeeper.ClientCnxn$EventThread.run(ClientCnxn.java:495)
[junit4:junit4]   2> 
[junit4:junit4]   2> 150941 T5783 oascc.ZkStateReader$2.process A cluster state change: WatchedEvent state:SyncConnected type:NodeChildrenChanged path:/live_nodes, has occurred - updating... (live nodes size: 3)
[junit4:junit4]   2> 150941 T5783 oascc.ZkStateReader$2.process WARNING ZooKeeper watch triggered, but Solr cannot talk to ZK
[junit4:junit4]   2> 150941 T5783 oascc.ZkStateReader$3.process WARNING ZooKeeper watch triggered, but Solr cannot talk to ZK
[junit4:junit4]   2> 150941 T5783 oascc.ZkStateReader$2.process A cluster state change: WatchedEvent state:SyncConnected type:NodeDataChanged path:/clusterstate.json, has occurred - updating... (live nodes size: 3)
[junit4:junit4]   2> 150941 T5783 oascc.ZkStateReader$2.process WARNING ZooKeeper watch triggered, but Solr cannot talk to ZK
[junit4:junit4]   2> 150942 T5783 oasc.LeaderElector$1.process WARNING  org.apache.zookeeper.KeeperException$SessionExpiredException: KeeperErrorCode = Session expired for /overseer_elect/election
[junit4:junit4]   2> 	at org.apache.zookeeper.KeeperException.create(KeeperException.java:127)
[junit4:junit4]   2> 	at org.apache.zookeeper.KeeperException.create(KeeperException.java:51)
[junit4:junit4]   2> 	at org.apache.zookeeper.ZooKeeper.getChildren(ZooKeeper.java:1468)
[junit4:junit4]   2> 	at org.apache.solr.common.cloud.SolrZkClient$6.execute(SolrZkClient.java:236)
[junit4:junit4]   2> 	at org.apache.solr.common.cloud.SolrZkClient$6.execute(SolrZkClient.java:233)
[junit4:junit4]   2> 	at org.apache.solr.common.cloud.ZkCmdExecutor.retryOperation(ZkCmdExecutor.java:65)
[junit4:junit4]   2> 	at org.apache.solr.common.cloud.SolrZkClient.getChildren(SolrZkClient.java:233)
[junit4:junit4]   2> 	at org.apache.solr.cloud.LeaderElector.checkIfIamLeader(LeaderElector.java:84)
[junit4:junit4]   2> 	at org.apache.solr.cloud.LeaderElector.access$000(LeaderElector.java:55)
[junit4:junit4]   2> 	at org.apache.solr.cloud.LeaderElector$1.process(LeaderElector.java:129)
[junit4:junit4]   2> 	at org.apache.zookeeper.ClientCnxn$EventThread.processEvent(ClientCnxn.java:519)
[junit4:junit4]   2> 	at org.apache.zookeeper.ClientCnxn$EventThread.run(ClientCnxn.java:495)
[junit4:junit4]   2> 
[junit4:junit4]   2> 150942 T5783 oaz.ClientCnxn$EventThread.run EventThread shut down
[junit4:junit4]   2> NOTE: test params are: codec=DummyCompressingStoredFields(storedFieldsFormat=CompressingStoredFieldsFormat(compressionMode=DUMMY, chunkSize=158), termVectorsFormat=CompressingTermVectorsFormat(compressionMode=DUMMY, chunkSize=158)), sim=DefaultSimilarity, locale=fr_FR, timezone=Pacific/Majuro
[junit4:junit4]   2> NOTE: FreeBSD 9.0-RELEASE amd64/Sun Microsystems Inc. 1.6.0_32 (64-bit)/cpus=16,threads=2,free=179146984,total=512622592
[junit4:junit4]   2> NOTE: All tests run in this JVM: [OpenCloseCoreStressTest, DOMUtilTest, TimeZoneUtilsTest, ChaosMonkeySafeLeaderTest, TestPropInject, UniqFieldsUpdateProcessorFactoryTest, TestRandomFaceting, OutputWriterTest, ZkSolrClientTest, DocValuesMultiTest, StandardRequestHandlerTest, SolrCoreCheckLockOnStartupTest, TestFiltering, DirectUpdateHandlerTest, TestPartialUpdateDeduplication, TestFastOutputStream, PingRequestHandlerTest, TestCodecSupport, TestFieldCollectionResource, ClusterStateTest, NumericFieldsTest, TestSuggestSpellingConverter, TestNumberUtils, FullSolrCloudDistribCmdsTest, TestCSVResponseWriter, CollectionsAPIDistributedZkTest, RequiredFieldsTest, TestStressReorder, TestSystemIdResolver, TestLMJelinekMercerSimilarityFactory, TestIndexSearcher, TestSolrDiscoveryProperties, TestComponentsName, StatsComponentTest, RequestHandlersTest, TestCollationField, DirectSolrSpellCheckerTest, TestRecovery, XmlUpdateRequestHandlerTest, TestArbitraryIndexDir, SolrCmdDistributorTest, TestDFRSimilarityFactory, TestIndexingPerformance, DebugComponentTest, TestDistributedSearch, DocumentAnalysisRequestHandlerTest, HighlighterConfigTest, TestLazyCores, SolrPluginUtilsTest, OpenExchangeRatesOrgProviderTest, SimplePostToolTest, BasicDistributedZk2Test]
[junit4:junit4] Completed on J1 in 151.94s, 1 test, 1 error <<< FAILURES!

[...truncated 53 lines...]
BUILD FAILED
/usr/home/hudson/hudson-slave/workspace/Lucene-Solr-NightlyTests-trunk/build.xml:388: The following error occurred while executing this line:
/usr/home/hudson/hudson-slave/workspace/Lucene-Solr-NightlyTests-trunk/build.xml:361: The following error occurred while executing this line:
/usr/home/hudson/hudson-slave/workspace/Lucene-Solr-NightlyTests-trunk/build.xml:39: The following error occurred while executing this line:
/usr/home/hudson/hudson-slave/workspace/Lucene-Solr-NightlyTests-trunk/solr/build.xml:183: The following error occurred while executing this line:
/usr/home/hudson/hudson-slave/workspace/Lucene-Solr-NightlyTests-trunk/solr/common-build.xml:449: The following error occurred while executing this line:
/usr/home/hudson/hudson-slave/workspace/Lucene-Solr-NightlyTests-trunk/lucene/common-build.xml:1213: The following error occurred while executing this line:
/usr/home/hudson/hudson-slave/workspace/Lucene-Solr-NightlyTests-trunk/lucene/common-build.xml:877: There were test failures: 271 suites, 1141 tests, 3 suite-level errors, 1 error, 2 failures, 790 ignored (2 assumptions)

Total time: 105 minutes 17 seconds
Build step 'Invoke Ant' marked build as failure
Archiving artifacts
Recording test results
Email was triggered for: Failure
Sending email for trigger: Failure



Mime
View raw message