lucene-dev mailing list archives

Site index · List index
Message view « Date » · « Thread »
Top « Date » · « Thread »
From Apache Jenkins Server <jenk...@builds.apache.org>
Subject [JENKINS] Lucene-Solr-Tests-trunk-java7 - Build # 3816 - Failure
Date Sat, 16 Mar 2013 04:12:55 GMT
Build: https://builds.apache.org/job/Lucene-Solr-Tests-trunk-java7/3816/

5 tests failed.
REGRESSION:  org.apache.solr.core.OpenCloseCoreStressTest.test30SecondsNew

Error Message:
Core 00002_core bad! expected:<35> but was:<30>

Stack Trace:
java.lang.AssertionError: Core 00002_core bad! expected:<35> but was:<30>
	at __randomizedtesting.SeedInfo.seed([A208317CF4D7FF76:C6BD2DA8A6170633]:0)
	at org.junit.Assert.fail(Assert.java:93)
	at org.junit.Assert.failNotEquals(Assert.java:647)
	at org.junit.Assert.assertEquals(Assert.java:128)
	at org.junit.Assert.assertEquals(Assert.java:472)
	at org.apache.solr.core.OpenCloseCoreStressTest.checkResults(OpenCloseCoreStressTest.java:303)
	at org.apache.solr.core.OpenCloseCoreStressTest.doStress(OpenCloseCoreStressTest.java:201)
	at org.apache.solr.core.OpenCloseCoreStressTest.test30SecondsNew(OpenCloseCoreStressTest.java:121)
	at sun.reflect.NativeMethodAccessorImpl.invoke0(Native Method)
	at sun.reflect.NativeMethodAccessorImpl.invoke(NativeMethodAccessorImpl.java:57)
	at sun.reflect.DelegatingMethodAccessorImpl.invoke(DelegatingMethodAccessorImpl.java:43)
	at java.lang.reflect.Method.invoke(Method.java:601)
	at com.carrotsearch.randomizedtesting.RandomizedRunner.invoke(RandomizedRunner.java:1559)
	at com.carrotsearch.randomizedtesting.RandomizedRunner.access$600(RandomizedRunner.java:79)
	at com.carrotsearch.randomizedtesting.RandomizedRunner$6.evaluate(RandomizedRunner.java:737)
	at com.carrotsearch.randomizedtesting.RandomizedRunner$7.evaluate(RandomizedRunner.java:773)
	at com.carrotsearch.randomizedtesting.RandomizedRunner$8.evaluate(RandomizedRunner.java:787)
	at com.carrotsearch.randomizedtesting.rules.SystemPropertiesRestoreRule$1.evaluate(SystemPropertiesRestoreRule.java:53)
	at org.apache.lucene.util.TestRuleSetupTeardownChained$1.evaluate(TestRuleSetupTeardownChained.java:50)
	at org.apache.lucene.util.TestRuleFieldCacheSanity$1.evaluate(TestRuleFieldCacheSanity.java:51)
	at org.apache.lucene.util.AbstractBeforeAfterRule$1.evaluate(AbstractBeforeAfterRule.java:46)
	at com.carrotsearch.randomizedtesting.rules.SystemPropertiesInvariantRule$1.evaluate(SystemPropertiesInvariantRule.java:55)
	at org.apache.lucene.util.TestRuleThreadAndTestName$1.evaluate(TestRuleThreadAndTestName.java:49)
	at org.apache.lucene.util.TestRuleIgnoreAfterMaxFailures$1.evaluate(TestRuleIgnoreAfterMaxFailures.java:70)
	at org.apache.lucene.util.TestRuleMarkFailure$1.evaluate(TestRuleMarkFailure.java:48)
	at com.carrotsearch.randomizedtesting.rules.StatementAdapter.evaluate(StatementAdapter.java:36)
	at com.carrotsearch.randomizedtesting.ThreadLeakControl$StatementRunner.run(ThreadLeakControl.java:358)
	at com.carrotsearch.randomizedtesting.ThreadLeakControl.forkTimeoutingTask(ThreadLeakControl.java:782)
	at com.carrotsearch.randomizedtesting.ThreadLeakControl$3.evaluate(ThreadLeakControl.java:442)
	at com.carrotsearch.randomizedtesting.RandomizedRunner.runSingleTest(RandomizedRunner.java:746)
	at com.carrotsearch.randomizedtesting.RandomizedRunner$3.evaluate(RandomizedRunner.java:648)
	at com.carrotsearch.randomizedtesting.RandomizedRunner$4.evaluate(RandomizedRunner.java:682)
	at com.carrotsearch.randomizedtesting.RandomizedRunner$5.evaluate(RandomizedRunner.java:693)
	at com.carrotsearch.randomizedtesting.rules.StatementAdapter.evaluate(StatementAdapter.java:36)
	at com.carrotsearch.randomizedtesting.rules.SystemPropertiesRestoreRule$1.evaluate(SystemPropertiesRestoreRule.java:53)
	at org.apache.lucene.util.AbstractBeforeAfterRule$1.evaluate(AbstractBeforeAfterRule.java:46)
	at org.apache.lucene.util.TestRuleStoreClassName$1.evaluate(TestRuleStoreClassName.java:42)
	at com.carrotsearch.randomizedtesting.rules.SystemPropertiesInvariantRule$1.evaluate(SystemPropertiesInvariantRule.java:55)
	at com.carrotsearch.randomizedtesting.rules.NoShadowingOrOverridesOnMethodsRule$1.evaluate(NoShadowingOrOverridesOnMethodsRule.java:39)
	at com.carrotsearch.randomizedtesting.rules.NoShadowingOrOverridesOnMethodsRule$1.evaluate(NoShadowingOrOverridesOnMethodsRule.java:39)
	at com.carrotsearch.randomizedtesting.rules.StatementAdapter.evaluate(StatementAdapter.java:36)
	at org.apache.lucene.util.TestRuleAssertionsRequired$1.evaluate(TestRuleAssertionsRequired.java:43)
	at org.apache.lucene.util.TestRuleMarkFailure$1.evaluate(TestRuleMarkFailure.java:48)
	at org.apache.lucene.util.TestRuleIgnoreAfterMaxFailures$1.evaluate(TestRuleIgnoreAfterMaxFailures.java:70)
	at org.apache.lucene.util.TestRuleIgnoreTestSuites$1.evaluate(TestRuleIgnoreTestSuites.java:55)
	at com.carrotsearch.randomizedtesting.rules.StatementAdapter.evaluate(StatementAdapter.java:36)
	at com.carrotsearch.randomizedtesting.ThreadLeakControl$StatementRunner.run(ThreadLeakControl.java:358)
	at java.lang.Thread.run(Thread.java:722)


REGRESSION:  org.apache.solr.core.OpenCloseCoreStressTest.test30SecondsOld

Error Message:
Core 00013_core bad! expected:<15> but was:<0>

Stack Trace:
java.lang.AssertionError: Core 00013_core bad! expected:<15> but was:<0>
	at __randomizedtesting.SeedInfo.seed([A208317CF4D7FF76:8E39BB226837D215]:0)
	at org.junit.Assert.fail(Assert.java:93)
	at org.junit.Assert.failNotEquals(Assert.java:647)
	at org.junit.Assert.assertEquals(Assert.java:128)
	at org.junit.Assert.assertEquals(Assert.java:472)
	at org.apache.solr.core.OpenCloseCoreStressTest.checkResults(OpenCloseCoreStressTest.java:303)
	at org.apache.solr.core.OpenCloseCoreStressTest.doStress(OpenCloseCoreStressTest.java:201)
	at org.apache.solr.core.OpenCloseCoreStressTest.test30SecondsOld(OpenCloseCoreStressTest.java:115)
	at sun.reflect.NativeMethodAccessorImpl.invoke0(Native Method)
	at sun.reflect.NativeMethodAccessorImpl.invoke(NativeMethodAccessorImpl.java:57)
	at sun.reflect.DelegatingMethodAccessorImpl.invoke(DelegatingMethodAccessorImpl.java:43)
	at java.lang.reflect.Method.invoke(Method.java:601)
	at com.carrotsearch.randomizedtesting.RandomizedRunner.invoke(RandomizedRunner.java:1559)
	at com.carrotsearch.randomizedtesting.RandomizedRunner.access$600(RandomizedRunner.java:79)
	at com.carrotsearch.randomizedtesting.RandomizedRunner$6.evaluate(RandomizedRunner.java:737)
	at com.carrotsearch.randomizedtesting.RandomizedRunner$7.evaluate(RandomizedRunner.java:773)
	at com.carrotsearch.randomizedtesting.RandomizedRunner$8.evaluate(RandomizedRunner.java:787)
	at com.carrotsearch.randomizedtesting.rules.SystemPropertiesRestoreRule$1.evaluate(SystemPropertiesRestoreRule.java:53)
	at org.apache.lucene.util.TestRuleSetupTeardownChained$1.evaluate(TestRuleSetupTeardownChained.java:50)
	at org.apache.lucene.util.TestRuleFieldCacheSanity$1.evaluate(TestRuleFieldCacheSanity.java:51)
	at org.apache.lucene.util.AbstractBeforeAfterRule$1.evaluate(AbstractBeforeAfterRule.java:46)
	at com.carrotsearch.randomizedtesting.rules.SystemPropertiesInvariantRule$1.evaluate(SystemPropertiesInvariantRule.java:55)
	at org.apache.lucene.util.TestRuleThreadAndTestName$1.evaluate(TestRuleThreadAndTestName.java:49)
	at org.apache.lucene.util.TestRuleIgnoreAfterMaxFailures$1.evaluate(TestRuleIgnoreAfterMaxFailures.java:70)
	at org.apache.lucene.util.TestRuleMarkFailure$1.evaluate(TestRuleMarkFailure.java:48)
	at com.carrotsearch.randomizedtesting.rules.StatementAdapter.evaluate(StatementAdapter.java:36)
	at com.carrotsearch.randomizedtesting.ThreadLeakControl$StatementRunner.run(ThreadLeakControl.java:358)
	at com.carrotsearch.randomizedtesting.ThreadLeakControl.forkTimeoutingTask(ThreadLeakControl.java:782)
	at com.carrotsearch.randomizedtesting.ThreadLeakControl$3.evaluate(ThreadLeakControl.java:442)
	at com.carrotsearch.randomizedtesting.RandomizedRunner.runSingleTest(RandomizedRunner.java:746)
	at com.carrotsearch.randomizedtesting.RandomizedRunner$3.evaluate(RandomizedRunner.java:648)
	at com.carrotsearch.randomizedtesting.RandomizedRunner$4.evaluate(RandomizedRunner.java:682)
	at com.carrotsearch.randomizedtesting.RandomizedRunner$5.evaluate(RandomizedRunner.java:693)
	at com.carrotsearch.randomizedtesting.rules.StatementAdapter.evaluate(StatementAdapter.java:36)
	at com.carrotsearch.randomizedtesting.rules.SystemPropertiesRestoreRule$1.evaluate(SystemPropertiesRestoreRule.java:53)
	at org.apache.lucene.util.AbstractBeforeAfterRule$1.evaluate(AbstractBeforeAfterRule.java:46)
	at org.apache.lucene.util.TestRuleStoreClassName$1.evaluate(TestRuleStoreClassName.java:42)
	at com.carrotsearch.randomizedtesting.rules.SystemPropertiesInvariantRule$1.evaluate(SystemPropertiesInvariantRule.java:55)
	at com.carrotsearch.randomizedtesting.rules.NoShadowingOrOverridesOnMethodsRule$1.evaluate(NoShadowingOrOverridesOnMethodsRule.java:39)
	at com.carrotsearch.randomizedtesting.rules.NoShadowingOrOverridesOnMethodsRule$1.evaluate(NoShadowingOrOverridesOnMethodsRule.java:39)
	at com.carrotsearch.randomizedtesting.rules.StatementAdapter.evaluate(StatementAdapter.java:36)
	at org.apache.lucene.util.TestRuleAssertionsRequired$1.evaluate(TestRuleAssertionsRequired.java:43)
	at org.apache.lucene.util.TestRuleMarkFailure$1.evaluate(TestRuleMarkFailure.java:48)
	at org.apache.lucene.util.TestRuleIgnoreAfterMaxFailures$1.evaluate(TestRuleIgnoreAfterMaxFailures.java:70)
	at org.apache.lucene.util.TestRuleIgnoreTestSuites$1.evaluate(TestRuleIgnoreTestSuites.java:55)
	at com.carrotsearch.randomizedtesting.rules.StatementAdapter.evaluate(StatementAdapter.java:36)
	at com.carrotsearch.randomizedtesting.ThreadLeakControl$StatementRunner.run(ThreadLeakControl.java:358)
	at java.lang.Thread.run(Thread.java:722)


FAILED:  junit.framework.TestSuite.org.apache.solr.core.OpenCloseCoreStressTest

Error Message:
ERROR: SolrIndexSearcher opens=240 closes=239

Stack Trace:
java.lang.AssertionError: ERROR: SolrIndexSearcher opens=240 closes=239
	at __randomizedtesting.SeedInfo.seed([A208317CF4D7FF76]:0)
	at org.junit.Assert.fail(Assert.java:93)
	at org.apache.solr.SolrTestCaseJ4.endTrackingSearchers(SolrTestCaseJ4.java:247)
	at org.apache.solr.SolrTestCaseJ4.afterClass(SolrTestCaseJ4.java:97)
	at sun.reflect.GeneratedMethodAccessor17.invoke(Unknown Source)
	at sun.reflect.DelegatingMethodAccessorImpl.invoke(DelegatingMethodAccessorImpl.java:43)
	at java.lang.reflect.Method.invoke(Method.java:601)
	at com.carrotsearch.randomizedtesting.RandomizedRunner.invoke(RandomizedRunner.java:1559)
	at com.carrotsearch.randomizedtesting.RandomizedRunner.access$600(RandomizedRunner.java:79)
	at com.carrotsearch.randomizedtesting.RandomizedRunner$5.evaluate(RandomizedRunner.java:700)
	at com.carrotsearch.randomizedtesting.rules.StatementAdapter.evaluate(StatementAdapter.java:36)
	at com.carrotsearch.randomizedtesting.rules.SystemPropertiesRestoreRule$1.evaluate(SystemPropertiesRestoreRule.java:53)
	at org.apache.lucene.util.AbstractBeforeAfterRule$1.evaluate(AbstractBeforeAfterRule.java:46)
	at org.apache.lucene.util.TestRuleStoreClassName$1.evaluate(TestRuleStoreClassName.java:42)
	at com.carrotsearch.randomizedtesting.rules.SystemPropertiesInvariantRule$1.evaluate(SystemPropertiesInvariantRule.java:55)
	at com.carrotsearch.randomizedtesting.rules.NoShadowingOrOverridesOnMethodsRule$1.evaluate(NoShadowingOrOverridesOnMethodsRule.java:39)
	at com.carrotsearch.randomizedtesting.rules.NoShadowingOrOverridesOnMethodsRule$1.evaluate(NoShadowingOrOverridesOnMethodsRule.java:39)
	at com.carrotsearch.randomizedtesting.rules.StatementAdapter.evaluate(StatementAdapter.java:36)
	at org.apache.lucene.util.TestRuleAssertionsRequired$1.evaluate(TestRuleAssertionsRequired.java:43)
	at org.apache.lucene.util.TestRuleMarkFailure$1.evaluate(TestRuleMarkFailure.java:48)
	at org.apache.lucene.util.TestRuleIgnoreAfterMaxFailures$1.evaluate(TestRuleIgnoreAfterMaxFailures.java:70)
	at org.apache.lucene.util.TestRuleIgnoreTestSuites$1.evaluate(TestRuleIgnoreTestSuites.java:55)
	at com.carrotsearch.randomizedtesting.rules.StatementAdapter.evaluate(StatementAdapter.java:36)
	at com.carrotsearch.randomizedtesting.ThreadLeakControl$StatementRunner.run(ThreadLeakControl.java:358)
	at java.lang.Thread.run(Thread.java:722)


FAILED:  junit.framework.TestSuite.org.apache.solr.core.OpenCloseCoreStressTest

Error Message:
2 threads leaked from SUITE scope at org.apache.solr.core.OpenCloseCoreStressTest:     1) Thread[id=3725, name=searcherExecutor-2261-thread-1, state=WAITING, group=TGRP-OpenCloseCoreStressTest]         at sun.misc.Unsafe.park(Native Method)         at java.util.concurrent.locks.LockSupport.park(LockSupport.java:186)         at java.util.concurrent.locks.AbstractQueuedSynchronizer$ConditionObject.await(AbstractQueuedSynchronizer.java:2043)         at java.util.concurrent.LinkedBlockingQueue.take(LinkedBlockingQueue.java:442)         at java.util.concurrent.ThreadPoolExecutor.getTask(ThreadPoolExecutor.java:1068)         at java.util.concurrent.ThreadPoolExecutor.runWorker(ThreadPoolExecutor.java:1130)         at java.util.concurrent.ThreadPoolExecutor$Worker.run(ThreadPoolExecutor.java:615)         at java.lang.Thread.run(Thread.java:722)    2) Thread[id=3727, name=commitScheduler-2263-thread-1, state=WAITING, group=TGRP-OpenCloseCoreStressTest]         at sun.misc.Unsafe.park(Native Method)         at java.util.concurrent.locks.LockSupport.park(LockSupport.java:186)         at java.util.concurrent.locks.AbstractQueuedSynchronizer$ConditionObject.await(AbstractQueuedSynchronizer.java:2043)         at java.util.concurrent.ScheduledThreadPoolExecutor$DelayedWorkQueue.take(ScheduledThreadPoolExecutor.java:1079)         at java.util.concurrent.ScheduledThreadPoolExecutor$DelayedWorkQueue.take(ScheduledThreadPoolExecutor.java:807)         at java.util.concurrent.ThreadPoolExecutor.getTask(ThreadPoolExecutor.java:1068)         at java.util.concurrent.ThreadPoolExecutor.runWorker(ThreadPoolExecutor.java:1130)         at java.util.concurrent.ThreadPoolExecutor$Worker.run(ThreadPoolExecutor.java:615)         at java.lang.Thread.run(Thread.java:722)

Stack Trace:
com.carrotsearch.randomizedtesting.ThreadLeakError: 2 threads leaked from SUITE scope at org.apache.solr.core.OpenCloseCoreStressTest: 
   1) Thread[id=3725, name=searcherExecutor-2261-thread-1, state=WAITING, group=TGRP-OpenCloseCoreStressTest]
        at sun.misc.Unsafe.park(Native Method)
        at java.util.concurrent.locks.LockSupport.park(LockSupport.java:186)
        at java.util.concurrent.locks.AbstractQueuedSynchronizer$ConditionObject.await(AbstractQueuedSynchronizer.java:2043)
        at java.util.concurrent.LinkedBlockingQueue.take(LinkedBlockingQueue.java:442)
        at java.util.concurrent.ThreadPoolExecutor.getTask(ThreadPoolExecutor.java:1068)
        at java.util.concurrent.ThreadPoolExecutor.runWorker(ThreadPoolExecutor.java:1130)
        at java.util.concurrent.ThreadPoolExecutor$Worker.run(ThreadPoolExecutor.java:615)
        at java.lang.Thread.run(Thread.java:722)
   2) Thread[id=3727, name=commitScheduler-2263-thread-1, state=WAITING, group=TGRP-OpenCloseCoreStressTest]
        at sun.misc.Unsafe.park(Native Method)
        at java.util.concurrent.locks.LockSupport.park(LockSupport.java:186)
        at java.util.concurrent.locks.AbstractQueuedSynchronizer$ConditionObject.await(AbstractQueuedSynchronizer.java:2043)
        at java.util.concurrent.ScheduledThreadPoolExecutor$DelayedWorkQueue.take(ScheduledThreadPoolExecutor.java:1079)
        at java.util.concurrent.ScheduledThreadPoolExecutor$DelayedWorkQueue.take(ScheduledThreadPoolExecutor.java:807)
        at java.util.concurrent.ThreadPoolExecutor.getTask(ThreadPoolExecutor.java:1068)
        at java.util.concurrent.ThreadPoolExecutor.runWorker(ThreadPoolExecutor.java:1130)
        at java.util.concurrent.ThreadPoolExecutor$Worker.run(ThreadPoolExecutor.java:615)
        at java.lang.Thread.run(Thread.java:722)
	at __randomizedtesting.SeedInfo.seed([A208317CF4D7FF76]:0)


FAILED:  junit.framework.TestSuite.org.apache.solr.core.OpenCloseCoreStressTest

Error Message:
There are still zombie threads that couldn't be terminated:    1) Thread[id=3725, name=searcherExecutor-2261-thread-1, state=WAITING, group=TGRP-OpenCloseCoreStressTest]         at sun.misc.Unsafe.park(Native Method)         at java.util.concurrent.locks.LockSupport.park(LockSupport.java:186)         at java.util.concurrent.locks.AbstractQueuedSynchronizer$ConditionObject.await(AbstractQueuedSynchronizer.java:2043)         at java.util.concurrent.LinkedBlockingQueue.take(LinkedBlockingQueue.java:442)         at java.util.concurrent.ThreadPoolExecutor.getTask(ThreadPoolExecutor.java:1068)         at java.util.concurrent.ThreadPoolExecutor.runWorker(ThreadPoolExecutor.java:1130)         at java.util.concurrent.ThreadPoolExecutor$Worker.run(ThreadPoolExecutor.java:615)         at java.lang.Thread.run(Thread.java:722)    2) Thread[id=3727, name=commitScheduler-2263-thread-1, state=WAITING, group=TGRP-OpenCloseCoreStressTest]         at sun.misc.Unsafe.park(Native Method)         at java.util.concurrent.locks.LockSupport.park(LockSupport.java:186)         at java.util.concurrent.locks.AbstractQueuedSynchronizer$ConditionObject.await(AbstractQueuedSynchronizer.java:2043)         at java.util.concurrent.ScheduledThreadPoolExecutor$DelayedWorkQueue.take(ScheduledThreadPoolExecutor.java:1079)         at java.util.concurrent.ScheduledThreadPoolExecutor$DelayedWorkQueue.take(ScheduledThreadPoolExecutor.java:807)         at java.util.concurrent.ThreadPoolExecutor.getTask(ThreadPoolExecutor.java:1068)         at java.util.concurrent.ThreadPoolExecutor.runWorker(ThreadPoolExecutor.java:1130)         at java.util.concurrent.ThreadPoolExecutor$Worker.run(ThreadPoolExecutor.java:615)         at java.lang.Thread.run(Thread.java:722)

Stack Trace:
com.carrotsearch.randomizedtesting.ThreadLeakError: There are still zombie threads that couldn't be terminated:
   1) Thread[id=3725, name=searcherExecutor-2261-thread-1, state=WAITING, group=TGRP-OpenCloseCoreStressTest]
        at sun.misc.Unsafe.park(Native Method)
        at java.util.concurrent.locks.LockSupport.park(LockSupport.java:186)
        at java.util.concurrent.locks.AbstractQueuedSynchronizer$ConditionObject.await(AbstractQueuedSynchronizer.java:2043)
        at java.util.concurrent.LinkedBlockingQueue.take(LinkedBlockingQueue.java:442)
        at java.util.concurrent.ThreadPoolExecutor.getTask(ThreadPoolExecutor.java:1068)
        at java.util.concurrent.ThreadPoolExecutor.runWorker(ThreadPoolExecutor.java:1130)
        at java.util.concurrent.ThreadPoolExecutor$Worker.run(ThreadPoolExecutor.java:615)
        at java.lang.Thread.run(Thread.java:722)
   2) Thread[id=3727, name=commitScheduler-2263-thread-1, state=WAITING, group=TGRP-OpenCloseCoreStressTest]
        at sun.misc.Unsafe.park(Native Method)
        at java.util.concurrent.locks.LockSupport.park(LockSupport.java:186)
        at java.util.concurrent.locks.AbstractQueuedSynchronizer$ConditionObject.await(AbstractQueuedSynchronizer.java:2043)
        at java.util.concurrent.ScheduledThreadPoolExecutor$DelayedWorkQueue.take(ScheduledThreadPoolExecutor.java:1079)
        at java.util.concurrent.ScheduledThreadPoolExecutor$DelayedWorkQueue.take(ScheduledThreadPoolExecutor.java:807)
        at java.util.concurrent.ThreadPoolExecutor.getTask(ThreadPoolExecutor.java:1068)
        at java.util.concurrent.ThreadPoolExecutor.runWorker(ThreadPoolExecutor.java:1130)
        at java.util.concurrent.ThreadPoolExecutor$Worker.run(ThreadPoolExecutor.java:615)
        at java.lang.Thread.run(Thread.java:722)
	at __randomizedtesting.SeedInfo.seed([A208317CF4D7FF76]:0)




Build Log:
[...truncated 9340 lines...]
[junit4:junit4] Suite: org.apache.solr.core.OpenCloseCoreStressTest
[junit4:junit4] IGNOR/A 0.02s J0 | OpenCloseCoreStressTest.test1HourNew
[junit4:junit4]    > Assumption #1: 'weekly' test group is disabled (@Weekly)
[junit4:junit4] IGNOR/A 0.00s J0 | OpenCloseCoreStressTest.test1HourOld
[junit4:junit4]    > Assumption #1: 'weekly' test group is disabled (@Weekly)
[junit4:junit4]   2> 30 T3385 oas.SolrTestCaseJ4.setUp ###Starting test30SecondsNew
[junit4:junit4]   2> 125 T3385 oejs.Server.doStart jetty-8.1.8.v20121106
[junit4:junit4]   2> 131 T3385 oejs.AbstractConnector.doStart Started SocketConnector@127.0.0.1:46229
[junit4:junit4]   2> 132 T3385 oass.SolrDispatchFilter.init SolrDispatchFilter.init()
[junit4:junit4]   2> 133 T3385 oasc.SolrResourceLoader.locateSolrHome JNDI not configured for solr (NoInitialContextEx)
[junit4:junit4]   2> 133 T3385 oasc.SolrResourceLoader.locateSolrHome using system property solr.solr.home: /usr/home/hudson/hudson-slave/workspace/Lucene-Solr-Tests-trunk-java7/solr/build/solr-core/test/J0/./OpenCloseCoreStressTest_
[junit4:junit4]   2> 134 T3385 oasc.CoreContainer$Initializer.initialize looking for solr config file: /usr/home/hudson/hudson-slave/workspace/Lucene-Solr-Tests-trunk-java7/solr/build/solr-core/test/J0/./OpenCloseCoreStressTest_/solr.xml
[junit4:junit4]   2> 134 T3385 oasc.CoreContainer.<init> New CoreContainer 898141986
[junit4:junit4]   2> 135 T3385 oasc.CoreContainer.load Loading CoreContainer using Solr Home: '/usr/home/hudson/hudson-slave/workspace/Lucene-Solr-Tests-trunk-java7/solr/build/solr-core/test/J0/./OpenCloseCoreStressTest_/'
[junit4:junit4]   2> 135 T3385 oasc.SolrResourceLoader.<init> new SolrResourceLoader for directory: '/usr/home/hudson/hudson-slave/workspace/Lucene-Solr-Tests-trunk-java7/solr/build/solr-core/test/J0/./OpenCloseCoreStressTest_/'
[junit4:junit4]   2> 168 T3385 oasc.SolrProperties.walkFromHere Looking for cores in /usr/home/hudson/hudson-slave/workspace/Lucene-Solr-Tests-trunk-java7/solr/build/solr-core/test/J0/./OpenCloseCoreStressTest_
[junit4:junit4]   2> 169 T3385 oasc.SolrProperties.walkFromHere Discovered properties file /usr/home/hudson/hudson-slave/workspace/Lucene-Solr-Tests-trunk-java7/solr/build/solr-core/test/J0/./OpenCloseCoreStressTest_/00016_core/core.properties, adding to cores
[junit4:junit4]   2> 174 T3385 oasc.SolrProperties.walkFromHere Discovered properties file /usr/home/hudson/hudson-slave/workspace/Lucene-Solr-Tests-trunk-java7/solr/build/solr-core/test/J0/./OpenCloseCoreStressTest_/00012_core/core.properties, adding to cores
[junit4:junit4]   2> 175 T3385 oasc.SolrProperties.walkFromHere Discovered properties file /usr/home/hudson/hudson-slave/workspace/Lucene-Solr-Tests-trunk-java7/solr/build/solr-core/test/J0/./OpenCloseCoreStressTest_/00006_core/core.properties, adding to cores
[junit4:junit4]   2> 175 T3385 oasc.SolrProperties.walkFromHere Discovered properties file /usr/home/hudson/hudson-slave/workspace/Lucene-Solr-Tests-trunk-java7/solr/build/solr-core/test/J0/./OpenCloseCoreStressTest_/00002_core/core.properties, adding to cores
[junit4:junit4]   2> 176 T3385 oasc.SolrProperties.walkFromHere Discovered properties file /usr/home/hudson/hudson-slave/workspace/Lucene-Solr-Tests-trunk-java7/solr/build/solr-core/test/J0/./OpenCloseCoreStressTest_/00007_core/core.properties, adding to cores
[junit4:junit4]   2> 177 T3385 oasc.SolrProperties.walkFromHere Discovered properties file /usr/home/hudson/hudson-slave/workspace/Lucene-Solr-Tests-trunk-java7/solr/build/solr-core/test/J0/./OpenCloseCoreStressTest_/00003_core/core.properties, adding to cores
[junit4:junit4]   2> 178 T3385 oasc.SolrProperties.walkFromHere Discovered properties file /usr/home/hudson/hudson-slave/workspace/Lucene-Solr-Tests-trunk-java7/solr/build/solr-core/test/J0/./OpenCloseCoreStressTest_/00017_core/core.properties, adding to cores
[junit4:junit4]   2> 179 T3385 oasc.SolrProperties.walkFromHere Discovered properties file /usr/home/hudson/hudson-slave/workspace/Lucene-Solr-Tests-trunk-java7/solr/build/solr-core/test/J0/./OpenCloseCoreStressTest_/00013_core/core.properties, adding to cores
[junit4:junit4]   2> 180 T3385 oasc.SolrProperties.walkFromHere Discovered properties file /usr/home/hudson/hudson-slave/workspace/Lucene-Solr-Tests-trunk-java7/solr/build/solr-core/test/J0/./OpenCloseCoreStressTest_/00005_core/core.properties, adding to cores
[junit4:junit4]   2> 180 T3385 oasc.SolrProperties.walkFromHere Discovered properties file /usr/home/hudson/hudson-slave/workspace/Lucene-Solr-Tests-trunk-java7/solr/build/solr-core/test/J0/./OpenCloseCoreStressTest_/00019_core/core.properties, adding to cores
[junit4:junit4]   2> 181 T3385 oasc.SolrProperties.walkFromHere Discovered properties file /usr/home/hudson/hudson-slave/workspace/Lucene-Solr-Tests-trunk-java7/solr/build/solr-core/test/J0/./OpenCloseCoreStressTest_/00001_core/core.properties, adding to cores
[junit4:junit4]   2> 182 T3385 oasc.SolrProperties.walkFromHere Discovered properties file /usr/home/hudson/hudson-slave/workspace/Lucene-Solr-Tests-trunk-java7/solr/build/solr-core/test/J0/./OpenCloseCoreStressTest_/00015_core/core.properties, adding to cores
[junit4:junit4]   2> 182 T3385 oasc.SolrProperties.walkFromHere Discovered properties file /usr/home/hudson/hudson-slave/workspace/Lucene-Solr-Tests-trunk-java7/solr/build/solr-core/test/J0/./OpenCloseCoreStressTest_/00009_core/core.properties, adding to cores
[junit4:junit4]   2> 183 T3385 oasc.SolrProperties.walkFromHere Discovered properties file /usr/home/hudson/hudson-slave/workspace/Lucene-Solr-Tests-trunk-java7/solr/build/solr-core/test/J0/./OpenCloseCoreStressTest_/00011_core/core.properties, adding to cores
[junit4:junit4]   2> 184 T3385 oasc.SolrProperties.walkFromHere Discovered properties file /usr/home/hudson/hudson-slave/workspace/Lucene-Solr-Tests-trunk-java7/solr/build/solr-core/test/J0/./OpenCloseCoreStressTest_/00014_core/core.properties, adding to cores
[junit4:junit4]   2> 185 T3385 oasc.SolrProperties.walkFromHere Discovered properties file /usr/home/hudson/hudson-slave/workspace/Lucene-Solr-Tests-trunk-java7/solr/build/solr-core/test/J0/./OpenCloseCoreStressTest_/00008_core/core.properties, adding to cores
[junit4:junit4]   2> 185 T3385 oasc.SolrProperties.walkFromHere Discovered properties file /usr/home/hudson/hudson-slave/workspace/Lucene-Solr-Tests-trunk-java7/solr/build/solr-core/test/J0/./OpenCloseCoreStressTest_/00010_core/core.properties, adding to cores
[junit4:junit4]   2> 186 T3385 oasc.SolrProperties.walkFromHere Discovered properties file /usr/home/hudson/hudson-slave/workspace/Lucene-Solr-Tests-trunk-java7/solr/build/solr-core/test/J0/./OpenCloseCoreStressTest_/00004_core/core.properties, adding to cores
[junit4:junit4]   2> 187 T3385 oasc.SolrProperties.walkFromHere Discovered properties file /usr/home/hudson/hudson-slave/workspace/Lucene-Solr-Tests-trunk-java7/solr/build/solr-core/test/J0/./OpenCloseCoreStressTest_/00018_core/core.properties, adding to cores
[junit4:junit4]   2> 188 T3385 oasc.SolrProperties.walkFromHere Discovered properties file /usr/home/hudson/hudson-slave/workspace/Lucene-Solr-Tests-trunk-java7/solr/build/solr-core/test/J0/./OpenCloseCoreStressTest_/00000_core/core.properties, adding to cores
[junit4:junit4]   2> 188 T3385 oasc.SolrProperties.walkFromHere Looking for cores in /usr/home/hudson/hudson-slave/workspace/Lucene-Solr-Tests-trunk-java7/solr/build/solr-core/test/J0/./OpenCloseCoreStressTest_
[junit4:junit4]   2> 189 T3385 oasc.SolrProperties.walkFromHere Discovered properties file /usr/home/hudson/hudson-slave/workspace/Lucene-Solr-Tests-trunk-java7/solr/build/solr-core/test/J0/./OpenCloseCoreStressTest_/00016_core/core.properties, adding to cores
[junit4:junit4]   2> 190 T3385 oasc.SolrProperties.walkFromHere Discovered properties file /usr/home/hudson/hudson-slave/workspace/Lucene-Solr-Tests-trunk-java7/solr/build/solr-core/test/J0/./OpenCloseCoreStressTest_/00012_core/core.properties, adding to cores
[junit4:junit4]   2> 191 T3385 oasc.SolrProperties.walkFromHere Discovered properties file /usr/home/hudson/hudson-slave/workspace/Lucene-Solr-Tests-trunk-java7/solr/build/solr-core/test/J0/./OpenCloseCoreStressTest_/00006_core/core.properties, adding to cores
[junit4:junit4]   2> 191 T3385 oasc.SolrProperties.walkFromHere Discovered properties file /usr/home/hudson/hudson-slave/workspace/Lucene-Solr-Tests-trunk-java7/solr/build/solr-core/test/J0/./OpenCloseCoreStressTest_/00002_core/core.properties, adding to cores
[junit4:junit4]   2> 192 T3385 oasc.SolrProperties.walkFromHere Discovered properties file /usr/home/hudson/hudson-slave/workspace/Lucene-Solr-Tests-trunk-java7/solr/build/solr-core/test/J0/./OpenCloseCoreStressTest_/00007_core/core.properties, adding to cores
[junit4:junit4]   2> 193 T3385 oasc.SolrProperties.walkFromHere Discovered properties file /usr/home/hudson/hudson-slave/workspace/Lucene-Solr-Tests-trunk-java7/solr/build/solr-core/test/J0/./OpenCloseCoreStressTest_/00003_core/core.properties, adding to cores
[junit4:junit4]   2> 194 T3385 oasc.SolrProperties.walkFromHere Discovered properties file /usr/home/hudson/hudson-slave/workspace/Lucene-Solr-Tests-trunk-java7/solr/build/solr-core/test/J0/./OpenCloseCoreStressTest_/00017_core/core.properties, adding to cores
[junit4:junit4]   2> 194 T3385 oasc.SolrProperties.walkFromHere Discovered properties file /usr/home/hudson/hudson-slave/workspace/Lucene-Solr-Tests-trunk-java7/solr/build/solr-core/test/J0/./OpenCloseCoreStressTest_/00013_core/core.properties, adding to cores
[junit4:junit4]   2> 195 T3385 oasc.SolrProperties.walkFromHere Discovered properties file /usr/home/hudson/hudson-slave/workspace/Lucene-Solr-Tests-trunk-java7/solr/build/solr-core/test/J0/./OpenCloseCoreStressTest_/00005_core/core.properties, adding to cores
[junit4:junit4]   2> 196 T3385 oasc.SolrProperties.walkFromHere Discovered properties file /usr/home/hudson/hudson-slave/workspace/Lucene-Solr-Tests-trunk-java7/solr/build/solr-core/test/J0/./OpenCloseCoreStressTest_/00019_core/core.properties, adding to cores
[junit4:junit4]   2> 197 T3385 oasc.SolrProperties.walkFromHere Discovered properties file /usr/home/hudson/hudson-slave/workspace/Lucene-Solr-Tests-trunk-java7/solr/build/solr-core/test/J0/./OpenCloseCoreStressTest_/00001_core/core.properties, adding to cores
[junit4:junit4]   2> 197 T3385 oasc.SolrProperties.walkFromHere Discovered properties file /usr/home/hudson/hudson-slave/workspace/Lucene-Solr-Tests-trunk-java7/solr/build/solr-core/test/J0/./OpenCloseCoreStressTest_/00015_core/core.properties, adding to cores
[junit4:junit4]   2> 198 T3385 oasc.SolrProperties.walkFromHere Discovered properties file /usr/home/hudson/hudson-slave/workspace/Lucene-Solr-Tests-trunk-java7/solr/build/solr-core/test/J0/./OpenCloseCoreStressTest_/00009_core/core.properties, adding to cores
[junit4:junit4]   2> 199 T3385 oasc.SolrProperties.walkFromHere Discovered properties file /usr/home/hudson/hudson-slave/workspace/Lucene-Solr-Tests-trunk-java7/solr/build/solr-core/test/J0/./OpenCloseCoreStressTest_/00011_core/core.properties, adding to cores
[junit4:junit4]   2> 200 T3385 oasc.SolrProperties.walkFromHere Discovered properties file /usr/home/hudson/hudson-slave/workspace/Lucene-Solr-Tests-trunk-java7/solr/build/solr-core/test/J0/./OpenCloseCoreStressTest_/00014_core/core.properties, adding to cores
[junit4:junit4]   2> 200 T3385 oasc.SolrProperties.walkFromHere Discovered properties file /usr/home/hudson/hudson-slave/workspace/Lucene-Solr-Tests-trunk-java7/solr/build/solr-core/test/J0/./OpenCloseCoreStressTest_/00008_core/core.properties, adding to cores
[junit4:junit4]   2> 201 T3385 oasc.SolrProperties.walkFromHere Discovered properties file /usr/home/hudson/hudson-slave/workspace/Lucene-Solr-Tests-trunk-java7/solr/build/solr-core/test/J0/./OpenCloseCoreStressTest_/00010_core/core.properties, adding to cores
[junit4:junit4]   2> 202 T3385 oasc.SolrProperties.walkFromHere Discovered properties file /usr/home/hudson/hudson-slave/workspace/Lucene-Solr-Tests-trunk-java7/solr/build/solr-core/test/J0/./OpenCloseCoreStressTest_/00004_core/core.properties, adding to cores
[junit4:junit4]   2> 202 T3385 oasc.SolrProperties.walkFromHere Discovered properties file /usr/home/hudson/hudson-slave/workspace/Lucene-Solr-Tests-trunk-java7/solr/build/solr-core/test/J0/./OpenCloseCoreStressTest_/00018_core/core.properties, adding to cores
[junit4:junit4]   2> 203 T3385 oasc.SolrProperties.walkFromHere Discovered properties file /usr/home/hudson/hudson-slave/workspace/Lucene-Solr-Tests-trunk-java7/solr/build/solr-core/test/J0/./OpenCloseCoreStressTest_/00000_core/core.properties, adding to cores
[junit4:junit4]   2> 204 T3385 oashc.HttpShardHandlerFactory.getParameter Setting socketTimeout to: 0
[junit4:junit4]   2> 205 T3385 oashc.HttpShardHandlerFactory.getParameter Setting urlScheme to: http://
[junit4:junit4]   2> 205 T3385 oashc.HttpShardHandlerFactory.getParameter Setting connTimeout to: 0
[junit4:junit4]   2> 206 T3385 oashc.HttpShardHandlerFactory.getParameter Setting maxConnectionsPerHost to: 20
[junit4:junit4]   2> 206 T3385 oashc.HttpShardHandlerFactory.getParameter Setting corePoolSize to: 0
[junit4:junit4]   2> 206 T3385 oashc.HttpShardHandlerFactory.getParameter Setting maximumPoolSize to: 2147483647
[junit4:junit4]   2> 207 T3385 oashc.HttpShardHandlerFactory.getParameter Setting maxThreadIdleTime to: 5
[junit4:junit4]   2> 207 T3385 oashc.HttpShardHandlerFactory.getParameter Setting sizeOfQueue to: -1
[junit4:junit4]   2> 208 T3385 oashc.HttpShardHandlerFactory.getParameter Setting fairnessPolicy to: false
[junit4:junit4]   2> 208 T3385 oascsi.HttpClientUtil.createClient Creating new http client, config:maxConnectionsPerHost=20&maxConnections=10000&socketTimeout=0&connTimeout=0&retry=false
[junit4:junit4]   2> 225 T3385 oasc.CoreMaps.allocateLazyCores Allocating transient cache for 10 transient cores
[junit4:junit4]   2> 230 T3385 oasc.CoreContainer.load Registering Log Listener
[junit4:junit4]   2> 232 T3385 oass.SolrDispatchFilter.init user.dir=/usr/home/hudson/hudson-slave/workspace/Lucene-Solr-Tests-trunk-java7/solr/build/solr-core/test/J0
[junit4:junit4]   2> 232 T3385 oass.SolrDispatchFilter.init SolrDispatchFilter.init() done
[junit4:junit4]   2> 233 T3385 oascsi.HttpClientUtil.createClient Creating new http client, config:maxConnections=128&maxConnectionsPerHost=32&followRedirects=false
[junit4:junit4]   2> 244 T3385 oascsi.HttpClientUtil.createClient Creating new http client, config:maxConnections=128&maxConnectionsPerHost=32&followRedirects=false
[junit4:junit4]   2> 255 T3385 oascsi.HttpClientUtil.createClient Creating new http client, config:maxConnections=128&maxConnectionsPerHost=32&followRedirects=false
[junit4:junit4]   2> 266 T3385 oascsi.HttpClientUtil.createClient Creating new http client, config:maxConnections=128&maxConnectionsPerHost=32&followRedirects=false
[junit4:junit4]   2> 278 T3385 oascsi.HttpClientUtil.createClient Creating new http client, config:maxConnections=128&maxConnectionsPerHost=32&followRedirects=false
[junit4:junit4]   2> 289 T3385 oascsi.HttpClientUtil.createClient Creating new http client, config:maxConnections=128&maxConnectionsPerHost=32&followRedirects=false
[junit4:junit4]   2> 300 T3385 oascsi.HttpClientUtil.createClient Creating new http client, config:maxConnections=128&maxConnectionsPerHost=32&followRedirects=false
[junit4:junit4]   2> 311 T3385 oascsi.HttpClientUtil.createClient Creating new http client, config:maxConnections=128&maxConnectionsPerHost=32&followRedirects=false
[junit4:junit4]   2> 322 T3385 oascsi.HttpClientUtil.createClient Creating new http client, config:maxConnections=128&maxConnectionsPerHost=32&followRedirects=false
[junit4:junit4]   2> 334 T3385 oascsi.HttpClientUtil.createClient Creating new http client, config:maxConnections=128&maxConnectionsPerHost=32&followRedirects=false
[junit4:junit4]   2> 345 T3385 oascsi.HttpClientUtil.createClient Creating new http client, config:maxConnections=128&maxConnectionsPerHost=32&followRedirects=false
[junit4:junit4]   2> 356 T3385 oascsi.HttpClientUtil.createClient Creating new http client, config:maxConnections=128&maxConnectionsPerHost=32&followRedirects=false
[junit4:junit4]   2> 367 T3385 oascsi.HttpClientUtil.createClient Creating new http client, config:maxConnections=128&maxConnectionsPerHost=32&followRedirects=false
[junit4:junit4]   2> 378 T3385 oascsi.HttpClientUtil.createClient Creating new http client, config:maxConnections=128&maxConnectionsPerHost=32&followRedirects=false
[junit4:junit4]   2> 391 T3385 oascsi.HttpClientUtil.createClient Creating new http client, config:maxConnections=128&maxConnectionsPerHost=32&followRedirects=false
[junit4:junit4]   2> 402 T3385 oascsi.HttpClientUtil.createClient Creating new http client, config:maxConnections=128&maxConnectionsPerHost=32&followRedirects=false
[junit4:junit4]   2> 414 T3385 oascsi.HttpClientUtil.createClient Creating new http client, config:maxConnections=128&maxConnectionsPerHost=32&followRedirects=false
[junit4:junit4]   2> 426 T3385 oascsi.HttpClientUtil.createClient Creating new http client, config:maxConnections=128&maxConnectionsPerHost=32&followRedirects=false
[junit4:junit4]   2> 437 T3385 oascsi.HttpClientUtil.createClient Creating new http client, config:maxConnections=128&maxConnectionsPerHost=32&followRedirects=false
[junit4:junit4]   2> 448 T3385 oascsi.HttpClientUtil.createClient Creating new http client, config:maxConnections=128&maxConnectionsPerHost=32&followRedirects=false
[junit4:junit4]   2> 459 T3385 oascsi.HttpClientUtil.createClient Creating new http client, config:maxConnections=128&maxConnectionsPerHost=32&followRedirects=false
[junit4:junit4]   2> 471 T3385 oascsi.HttpClientUtil.createClient Creating new http client, config:maxConnections=128&maxConnectionsPerHost=32&followRedirects=false
[junit4:junit4]   2> 482 T3385 oascsi.HttpClientUtil.createClient Creating new http client, config:maxConnections=128&maxConnectionsPerHost=32&followRedirects=false
[junit4:junit4]   2> 494 T3385 oascsi.HttpClientUtil.createClient Creating new http client, config:maxConnections=128&maxConnectionsPerHost=32&followRedirects=false
[junit4:junit4]   2> 506 T3385 oascsi.HttpClientUtil.createClient Creating new http client, config:maxConnections=128&maxConnectionsPerHost=32&followRedirects=false
[junit4:junit4]   2> 517 T3385 oascsi.HttpClientUtil.createClient Creating new http client, config:maxConnections=128&maxConnectionsPerHost=32&followRedirects=false
[junit4:junit4]   2> 528 T3385 oascsi.HttpClientUtil.createClient Creating new http client, config:maxConnections=128&maxConnectionsPerHost=32&followRedirects=false
[junit4:junit4]   2> 540 T3385 oascsi.HttpClientUtil.createClient Creating new http client, config:maxConnections=128&maxConnectionsPerHost=32&followRedirects=false
[junit4:junit4]   2> 552 T3385 oascsi.HttpClientUtil.createClient Creating new http client, config:maxConnections=128&maxConnectionsPerHost=32&followRedirects=false
[junit4:junit4]   2> 564 T3385 oascsi.HttpClientUtil.createClient Creating new http client, config:maxConnections=128&maxConnectionsPerHost=32&followRedirects=false
[junit4:junit4]   2> 575 T3385 oasc.OpenCloseCoreStressTest.doStress Starting indexing and querying
[junit4:junit4]   2> 576 T3385 oasc.OpenCloseCoreStressTest.doStress 
[junit4:junit4]   2> 	
[junit4:junit4]   2> 	
[junit4:junit4]   2> 	
[junit4:junit4]   2> 	
[junit4:junit4]   2> 	Starting a 30 second cycle, seconds left: 30. Seconds run so far: 0.
[junit4:junit4]   2> 579 T3396 oasc.OneIndexer.run Starting indexing thread: 3396
[junit4:junit4]   2> 580 T3398 oasc.OneIndexer.run Starting indexing thread: 3398
[junit4:junit4]   2> 579 T3397 oasc.OneIndexer.run Starting indexing thread: 3397
[junit4:junit4]   2> 580 T3400 oasc.OneIndexer.run Starting indexing thread: 3400
[junit4:junit4]   2> 581 T3404 oasc.OneIndexer.run Starting indexing thread: 3404
[junit4:junit4]   2> 580 T3399 oasc.OneIndexer.run Starting indexing thread: 3399
[junit4:junit4]   2> 582 T3405 oasc.OneIndexer.run Starting indexing thread: 3405
[junit4:junit4]   2> 581 T3403 oasc.OneIndexer.run Starting indexing thread: 3403
[junit4:junit4]   2> 581 T3402 oasc.OneIndexer.run Starting indexing thread: 3402
[junit4:junit4]   2> 580 T3401 oasc.OneIndexer.run Starting indexing thread: 3401
[junit4:junit4]   2> 583 T3410 oasc.OneIndexer.run Starting indexing thread: 3410
[junit4:junit4]   2> 583 T3409 oasc.OneIndexer.run Starting indexing thread: 3409
[junit4:junit4]   2> 583 T3408 oasc.OneIndexer.run Starting indexing thread: 3408
[junit4:junit4]   2> 582 T3407 oasc.OneIndexer.run Starting indexing thread: 3407
[junit4:junit4]   2> 589 T3389 oasc.CoreContainer.create Creating SolrCore '00019_core' using instanceDir: /usr/home/hudson/hudson-slave/workspace/Lucene-Solr-Tests-trunk-java7/solr/build/solr-core/test/J0/./OpenCloseCoreStressTest_/00019_core
[junit4:junit4]   2> 582 T3406 oasc.OneIndexer.run Starting indexing thread: 3406
[junit4:junit4]   2> 589 T3411 oasc.OneQuery.run Starting query thread: 3411
[junit4:junit4]   2> 589 T3392 oasc.CoreContainer.create Creating SolrCore '00000_core' using instanceDir: /usr/home/hudson/hudson-slave/workspace/Lucene-Solr-Tests-trunk-java7/solr/build/solr-core/test/J0/./OpenCloseCoreStressTest_/00000_core
[junit4:junit4]   2> 589 T3391 oasc.CoreContainer.create Creating SolrCore '00003_core' using instanceDir: /usr/home/hudson/hudson-slave/workspace/Lucene-Solr-Tests-trunk-java7/solr/build/solr-core/test/J0/./OpenCloseCoreStressTest_/00003_core
[junit4:junit4]   2> 591 T3420 oasc.OneQuery.run Starting query thread: 3420
[junit4:junit4]   2> 592 T3423 oasc.OneQuery.run Starting query thread: 3423
[junit4:junit4]   2> 592 T3424 oasc.OneQuery.run Starting query thread: 3424
[junit4:junit4]   2> 592 T3425 oasc.OneQuery.run Starting query thread: 3425
[junit4:junit4]   2> 590 T3413 oasc.OneQuery.run Starting query thread: 3413
[junit4:junit4]   2> 592 T3428 oasc.OneQuery.run Starting query thread: 3428
[junit4:junit4]   2> 590 T3412 oasc.OneQuery.run Starting query thread: 3412
[junit4:junit4]   2> 589 T3390 oasc.CoreContainer.create Creating SolrCore '00002_core' using instanceDir: /usr/home/hudson/hudson-slave/workspace/Lucene-Solr-Tests-trunk-java7/solr/build/solr-core/test/J0/./OpenCloseCoreStressTest_/00002_core
[junit4:junit4]   2> 593 T3430 oasc.CoreContainer.create Creating SolrCore '00001_core' using instanceDir: /usr/home/hudson/hudson-slave/workspace/Lucene-Solr-Tests-trunk-java7/solr/build/solr-core/test/J0/./OpenCloseCoreStressTest_/00001_core
[junit4:junit4]   2> 589 T3388 oasc.CoreContainer.create Creating SolrCore '00015_core' using instanceDir: /usr/home/hudson/hudson-slave/workspace/Lucene-Solr-Tests-trunk-java7/solr/build/solr-core/test/J0/./OpenCloseCoreStressTest_/00015_core
[junit4:junit4]   2> 594 T3390 oasc.SolrResourceLoader.<init> new SolrResourceLoader for directory: '/usr/home/hudson/hudson-slave/workspace/Lucene-Solr-Tests-trunk-java7/solr/build/solr-core/test/J0/./OpenCloseCoreStressTest_/00002_core/'
[junit4:junit4]   2> 593 T3429 oasc.CoreContainer.create Creating SolrCore '00016_core' using instanceDir: /usr/home/hudson/hudson-slave/workspace/Lucene-Solr-Tests-trunk-java7/solr/build/solr-core/test/J0/./OpenCloseCoreStressTest_/00016_core
[junit4:junit4]   2> 592 T3426 oasc.CoreContainer.create Creating SolrCore '00005_core' using instanceDir: /usr/home/hudson/hudson-slave/workspace/Lucene-Solr-Tests-trunk-java7/solr/build/solr-core/test/J0/./OpenCloseCoreStressTest_/00005_core
[junit4:junit4]   2> 592 T3427 oasc.OneQuery.run Starting query thread: 3427
[junit4:junit4]   2> 592 T3391 oasc.SolrResourceLoader.<init> new SolrResourceLoader for directory: '/usr/home/hudson/hudson-slave/workspace/Lucene-Solr-Tests-trunk-java7/solr/build/solr-core/test/J0/./OpenCloseCoreStressTest_/00003_core/'
[junit4:junit4]   2> 595 T3429 oasc.SolrResourceLoader.<init> new SolrResourceLoader for directory: '/usr/home/hudson/hudson-slave/workspace/Lucene-Solr-Tests-trunk-java7/solr/build/solr-core/test/J0/./OpenCloseCoreStressTest_/00016_core/'
[junit4:junit4]   2> 592 T3392 oasc.SolrResourceLoader.<init> new SolrResourceLoader for directory: '/usr/home/hudson/hudson-slave/workspace/Lucene-Solr-Tests-trunk-java7/solr/build/solr-core/test/J0/./OpenCloseCoreStressTest_/00000_core/'
[junit4:junit4]   2> 595 T3426 oasc.SolrResourceLoader.<init> new SolrResourceLoader for directory: '/usr/home/hudson/hudson-slave/workspace/Lucene-Solr-Tests-trunk-java7/solr/build/solr-core/test/J0/./OpenCloseCoreStressTest_/00005_core/'
[junit4:junit4]   2> 591 T3418 oasc.CoreContainer.create Creating SolrCore '00008_core' using instanceDir: /usr/home/hudson/hudson-slave/workspace/Lucene-Solr-Tests-trunk-java7/solr/build/solr-core/test/J0/./OpenCloseCoreStressTest_/00008_core
[junit4:junit4]   2> 592 T3421 oasc.OneQuery.run Starting query thread: 3421
[junit4:junit4]   2> 591 T3394 oasc.CoreContainer.create Creating SolrCore '00010_core' using instanceDir: /usr/home/hudson/hudson-slave/workspace/Lucene-Solr-Tests-trunk-java7/solr/build/solr-core/test/J0/./OpenCloseCoreStressTest_/00010_core
[junit4:junit4]   2> 591 T3419 oasc.OneQuery.run Starting query thread: 3419
[junit4:junit4]   2> 597 T3418 oasc.SolrResourceLoader.<init> new SolrResourceLoader for directory: '/usr/home/hudson/hudson-slave/workspace/Lucene-Solr-Tests-trunk-java7/solr/build/solr-core/test/J0/./OpenCloseCoreStressTest_/00008_core/'
[junit4:junit4]   2> 591 T3417 oasc.OneQuery.run Starting query thread: 3417
[junit4:junit4]   2> 591 T3416 oasc.OneQuery.run Starting query thread: 3416
[junit4:junit4]   2> 597 T3394 oasc.SolrResourceLoader.<init> new SolrResourceLoader for directory: '/usr/home/hudson/hudson-slave/workspace/Lucene-Solr-Tests-trunk-java7/solr/build/solr-core/test/J0/./OpenCloseCoreStressTest_/00010_core/'
[junit4:junit4]   2> 591 T3415 oasc.OneQuery.run Starting query thread: 3415
[junit4:junit4]   2> 591 T3414 oasc.OneQuery.run Starting query thread: 3414
[junit4:junit4]   2> 595 T3388 oasc.SolrResourceLoader.<init> new SolrResourceLoader for directory: '/usr/home/hudson/hudson-slave/workspace/Lucene-Solr-Tests-trunk-java7/solr/build/solr-core/test/J0/./OpenCloseCoreStressTest_/00015_core/'
[junit4:junit4]   2> 594 T3430 oasc.SolrResourceLoader.<init> new SolrResourceLoader for directory: '/usr/home/hudson/hudson-slave/workspace/Lucene-Solr-Tests-trunk-java7/solr/build/solr-core/test/J0/./OpenCloseCoreStressTest_/00001_core/'
[junit4:junit4]   2> 594 T3389 oasc.SolrResourceLoader.<init> new SolrResourceLoader for directory: '/usr/home/hudson/hudson-slave/workspace/Lucene-Solr-Tests-trunk-java7/solr/build/solr-core/test/J0/./OpenCloseCoreStressTest_/00019_core/'
[junit4:junit4]   2> 594 T3432 oasc.CoreContainer.create Creating SolrCore '00018_core' using instanceDir: /usr/home/hudson/hudson-slave/workspace/Lucene-Solr-Tests-trunk-java7/solr/build/solr-core/test/J0/./OpenCloseCoreStressTest_/00018_core
[junit4:junit4]   2> 599 T3432 oasc.SolrResourceLoader.<init> new SolrResourceLoader for directory: '/usr/home/hudson/hudson-slave/workspace/Lucene-Solr-Tests-trunk-java7/solr/build/solr-core/test/J0/./OpenCloseCoreStressTest_/00018_core/'
[junit4:junit4]   2> 694 T3426 oasc.SolrConfig.<init> Using Lucene MatchVersion: LUCENE_41
[junit4:junit4]   2> 698 T3439 oasc.CoreContainer.create Creating SolrCore '00007_core' using instanceDir: /usr/home/hudson/hudson-slave/workspace/Lucene-Solr-Tests-trunk-java7/solr/build/solr-core/test/J0/./OpenCloseCoreStressTest_/00007_core
[junit4:junit4]   2> 698 T3391 oasc.SolrConfig.<init> Using Lucene MatchVersion: LUCENE_41
[junit4:junit4]   2> 699 T3439 oasc.SolrResourceLoader.<init> new SolrResourceLoader for directory: '/usr/home/hudson/hudson-slave/workspace/Lucene-Solr-Tests-trunk-java7/solr/build/solr-core/test/J0/./OpenCloseCoreStressTest_/00007_core/'
[junit4:junit4]   2> 700 T3394 oasc.SolrConfig.<init> Using Lucene MatchVersion: LUCENE_41
[junit4:junit4]   2> 701 T3445 oasc.CoreContainer.create Creating SolrCore '00009_core' using instanceDir: /usr/home/hudson/hudson-slave/workspace/Lucene-Solr-Tests-trunk-java7/solr/build/solr-core/test/J0/./OpenCloseCoreStressTest_/00009_core
[junit4:junit4]   2> 702 T3447 oasc.CoreContainer.create Creating SolrCore '00014_core' using instanceDir: /usr/home/hudson/hudson-slave/workspace/Lucene-Solr-Tests-trunk-java7/solr/build/solr-core/test/J0/./OpenCloseCoreStressTest_/00014_core
[junit4:junit4]   2> 703 T3445 oasc.SolrResourceLoader.<init> new SolrResourceLoader for directory: '/usr/home/hudson/hudson-slave/workspace/Lucene-Solr-Tests-trunk-java7/solr/build/solr-core/test/J0/./OpenCloseCoreStressTest_/00009_core/'
[junit4:junit4]   2> 703 T3447 oasc.SolrResourceLoader.<init> new SolrResourceLoader for directory: '/usr/home/hudson/hudson-slave/workspace/Lucene-Solr-Tests-trunk-java7/solr/build/solr-core/test/J0/./OpenCloseCoreStressTest_/00014_core/'
[junit4:junit4]   2> 707 T3388 oasc.SolrConfig.<init> Using Lucene MatchVersion: LUCENE_41
[junit4:junit4]   2> 737 T3390 oasc.SolrConfig.<init> Using Lucene MatchVersion: LUCENE_41
[junit4:junit4]   2> 742 T3418 oasc.SolrConfig.<init> Using Lucene MatchVersion: LUCENE_41
[junit4:junit4]   2> 743 T3392 oasc.SolrConfig.<init> Using Lucene MatchVersion: LUCENE_41
[junit4:junit4]   2> 761 T3389 oasc.SolrConfig.<init> Using Lucene MatchVersion: LUCENE_41
[junit4:junit4]   2> 765 T3432 oasc.SolrConfig.<init> Using Lucene MatchVersion: LUCENE_41
[junit4:junit4]   2> 774 T3430 oasc.SolrConfig.<init> Using Lucene MatchVersion: LUCENE_41
[junit4:junit4]   2> 784 T3429 oasc.SolrConfig.<init> Using Lucene MatchVersion: LUCENE_41
[junit4:junit4]   2> 837 T3439 oasc.SolrConfig.<init> Using Lucene MatchVersion: LUCENE_41
[junit4:junit4]   2> 861 T3447 oasc.SolrConfig.<init> Using Lucene MatchVersion: LUCENE_41
[junit4:junit4]   2> 866 T3445 oasc.SolrConfig.<init> Using Lucene MatchVersion: LUCENE_41
[junit4:junit4]   2> 896 T3391 oasc.SolrConfig.<init> Loaded SolrConfig: solrconfig-minimal.xml
[junit4:junit4]   2> 899 T3391 oass.IndexSchema.readSchema Reading Solr Schema
[junit4:junit4]   2> 900 T3388 oasc.SolrConfig.<init> Loaded SolrConfig: solrconfig-minimal.xml
[junit4:junit4]   2> 901 T3388 oass.IndexSchema.readSchema Reading Solr Schema
[junit4:junit4]   2> 903 T3394 oasc.SolrConfig.<init> Loaded SolrConfig: solrconfig-minimal.xml
[junit4:junit4]   2> 905 T3394 oass.IndexSchema.readSchema Reading Solr Schema
[junit4:junit4]   2> 906 T3391 oass.IndexSchema.readSchema Schema name=tiny
[junit4:junit4]   2> 910 T3388 oass.IndexSchema.readSchema Schema name=tiny
[junit4:junit4]   2> 914 T3394 oass.IndexSchema.readSchema Schema name=tiny
[junit4:junit4]   2> 917 T3390 oasc.SolrConfig.<init> Loaded SolrConfig: solrconfig-minimal.xml
[junit4:junit4]   2> 948 T3390 oass.IndexSchema.readSchema Reading Solr Schema
[junit4:junit4]   2> 950 T3426 oasc.SolrConfig.<init> Loaded SolrConfig: solrconfig-minimal.xml
[junit4:junit4]   2> 953 T3426 oass.IndexSchema.readSchema Reading Solr Schema
[junit4:junit4]   2> 955 T3418 oasc.SolrConfig.<init> Loaded SolrConfig: solrconfig-minimal.xml
[junit4:junit4]   2> 958 T3418 oass.IndexSchema.readSchema Reading Solr Schema
[junit4:junit4]   2> 958 T3392 oasc.SolrConfig.<init> Loaded SolrConfig: solrconfig-minimal.xml
[junit4:junit4]   2> 960 T3390 oass.IndexSchema.readSchema Schema name=tiny
[junit4:junit4]   2> 961 T3426 oass.IndexSchema.readSchema Schema name=tiny
[junit4:junit4]   2> 961 T3392 oass.IndexSchema.readSchema Reading Solr Schema
[junit4:junit4]   2> 966 T3389 oasc.SolrConfig.<init> Loaded SolrConfig: solrconfig-minimal.xml
[junit4:junit4]   2> 967 T3389 oass.IndexSchema.readSchema Reading Solr Schema
[junit4:junit4]   2> 967 T3418 oass.IndexSchema.readSchema Schema name=tiny
[junit4:junit4]   2> 969 T3392 oass.IndexSchema.readSchema Schema name=tiny
[junit4:junit4]   2> 972 T3432 oasc.SolrConfig.<init> Loaded SolrConfig: solrconfig-minimal.xml
[junit4:junit4]   2> 974 T3432 oass.IndexSchema.readSchema Reading Solr Schema
[junit4:junit4]   2> 977 T3389 oass.IndexSchema.readSchema Schema name=tiny
[junit4:junit4]   2> 978 T3430 oasc.SolrConfig.<init> Loaded SolrConfig: solrconfig-minimal.xml
[junit4:junit4]   2> 981 T3430 oass.IndexSchema.readSchema Reading Solr Schema
[junit4:junit4]   2> 982 T3432 oass.IndexSchema.readSchema Schema name=tiny
[junit4:junit4]   2> 990 T3430 oass.IndexSchema.readSchema Schema name=tiny
[junit4:junit4]   2> 991 T3429 oasc.SolrConfig.<init> Loaded SolrConfig: solrconfig-minimal.xml
[junit4:junit4]   2> 993 T3429 oass.IndexSchema.readSchema Reading Solr Schema
[junit4:junit4]   2> 1001 T3429 oass.IndexSchema.readSchema Schema name=tiny
[junit4:junit4]   2> 1015 T3388 oass.IndexSchema.readSchema unique key field: id
[junit4:junit4]   2> 1016 T3391 oass.IndexSchema.readSchema unique key field: id
[junit4:junit4]   2> 1017 T3394 oass.IndexSchema.readSchema unique key field: id
[junit4:junit4]   2> 1019 T3388 oasc.SolrCore.initDirectoryFactory org.apache.solr.core.MockFSDirectoryFactory
[junit4:junit4]   2> 1021 T3391 oasc.SolrCore.initDirectoryFactory org.apache.solr.core.MockFSDirectoryFactory
[junit4:junit4]   2> 1021 T3394 oasc.SolrCore.initDirectoryFactory org.apache.solr.core.MockFSDirectoryFactory
[junit4:junit4]   2> 1024 T3388 oasc.SolrCore.<init> [00015_core] Opening new SolrCore at /usr/home/hudson/hudson-slave/workspace/Lucene-Solr-Tests-trunk-java7/solr/build/solr-core/test/J0/./OpenCloseCoreStressTest_/00015_core/, dataDir=/usr/home/hudson/hudson-slave/workspace/Lucene-Solr-Tests-trunk-java7/solr/build/solr-core/test/J0/OpenCloseCoreStressTest_/00015_core/data/
[junit4:junit4]   2> 1024 T3391 oasc.SolrCore.<init> [00003_core] Opening new SolrCore at /usr/home/hudson/hudson-slave/workspace/Lucene-Solr-Tests-trunk-java7/solr/build/solr-core/test/J0/./OpenCloseCoreStressTest_/00003_core/, dataDir=/usr/home/hudson/hudson-slave/workspace/Lucene-Solr-Tests-trunk-java7/solr/build/solr-core/test/J0/OpenCloseCoreStressTest_/00003_core/data/
[junit4:junit4]   2> 1025 T3388 oasc.JmxMonitoredMap.<init> JMX monitoring is enabled. Adding Solr mbeans to JMX Server: com.sun.jmx.mbeanserver.JmxMBeanServer@3cf7366d
[junit4:junit4]   2> 1024 T3394 oasc.SolrCore.<init> [00010_core] Opening new SolrCore at /usr/home/hudson/hudson-slave/workspace/Lucene-Solr-Tests-trunk-java7/solr/build/solr-core/test/J0/./OpenCloseCoreStressTest_/00010_core/, dataDir=/usr/home/hudson/hudson-slave/workspace/Lucene-Solr-Tests-trunk-java7/solr/build/solr-core/test/J0/OpenCloseCoreStressTest_/00010_core/data/
[junit4:junit4]   2> 1025 T3391 oasc.JmxMonitoredMap.<init> JMX monitoring is enabled. Adding Solr mbeans to JMX Server: com.sun.jmx.mbeanserver.JmxMBeanServer@3cf7366d
[junit4:junit4]   2> 1026 T3426 oass.IndexSchema.readSchema unique key field: id
[junit4:junit4]   2> 1026 T3388 oasc.SolrCore.initDirectoryFactory org.apache.solr.core.MockFSDirectoryFactory
[junit4:junit4]   2> 1026 T3394 oasc.JmxMonitoredMap.<init> JMX monitoring is enabled. Adding Solr mbeans to JMX Server: com.sun.jmx.mbeanserver.JmxMBeanServer@3cf7366d
[junit4:junit4]   2> 1026 T3391 oasc.SolrCore.initDirectoryFactory org.apache.solr.core.MockFSDirectoryFactory
[junit4:junit4]   2> 1027 T3394 oasc.SolrCore.initDirectoryFactory org.apache.solr.core.MockFSDirectoryFactory
[junit4:junit4]   2> 1029 T3426 oasc.SolrCore.initDirectoryFactory org.apache.solr.core.MockFSDirectoryFactory
[junit4:junit4]   2> 1029 T3388 oasc.CachingDirectoryFactory.get return new directory for /usr/home/hudson/hudson-slave/workspace/Lucene-Solr-Tests-trunk-java7/solr/build/solr-core/test/J0/OpenCloseCoreStressTest_/00015_core/data forceNew: false
[junit4:junit4]   2> 1029 T3390 oass.IndexSchema.readSchema unique key field: id
[junit4:junit4]   2> 1030 T3394 oasc.CachingDirectoryFactory.get return new directory for /usr/home/hudson/hudson-slave/workspace/Lucene-Solr-Tests-trunk-java7/solr/build/solr-core/test/J0/OpenCloseCoreStressTest_/00010_core/data forceNew: false
[junit4:junit4]   2> 1030 T3426 oasc.SolrCore.<init> [00005_core] Opening new SolrCore at /usr/home/hudson/hudson-slave/workspace/Lucene-Solr-Tests-trunk-java7/solr/build/solr-core/test/J0/./OpenCloseCoreStressTest_/00005_core/, dataDir=/usr/home/hudson/hudson-slave/workspace/Lucene-Solr-Tests-trunk-java7/solr/build/solr-core/test/J0/OpenCloseCoreStressTest_/00005_core/data/
[junit4:junit4]   2> 1030 T3391 oasc.CachingDirectoryFactory.get return new directory for /usr/home/hudson/hudson-slave/workspace/Lucene-Solr-Tests-trunk-java7/solr/build/solr-core/test/J0/OpenCloseCoreStressTest_/00003_core/data forceNew: false
[junit4:junit4]   2> 1032 T3426 oasc.JmxMonitoredMap.<init> JMX monitoring is enabled. Adding Solr mbeans to JMX Server: com.sun.jmx.mbeanserver.JmxMBeanServer@3cf7366d
[junit4:junit4]   2> 1032 T3388 oasc.SolrCore.getNewIndexDir New index directory detected: old=null new=/usr/home/hudson/hudson-slave/workspace/Lucene-Solr-Tests-trunk-java7/solr/build/solr-core/test/J0/OpenCloseCoreStressTest_/00015_core/data/index/
[junit4:junit4]   2> 1033 T3426 oasc.SolrCore.initDirectoryFactory org.apache.solr.core.MockFSDirectoryFactory
[junit4:junit4]   2> 1035 T3426 oasc.CachingDirectoryFactory.get return new directory for /usr/home/hudson/hudson-slave/workspace/Lucene-Solr-Tests-trunk-java7/solr/build/solr-core/test/J0/OpenCloseCoreStressTest_/00005_core/data forceNew: false
[junit4:junit4]   2> 1036 T3394 oasc.SolrCore.getNewIndexDir New index directory detected: old=null new=/usr/home/hudson/hudson-slave/workspace/Lucene-Solr-Tests-trunk-java7/solr/build/solr-core/test/J0/OpenCloseCoreStressTest_/00010_core/data/index/
[junit4:junit4]   2> 1036 T3392 oass.IndexSchema.readSchema unique key field: id
[junit4:junit4]   2> 1037 T3391 oasc.SolrCore.getNewIndexDir New index directory detected: old=null new=/usr/home/hudson/hudson-slave/workspace/Lucene-Solr-Tests-trunk-java7/solr/build/solr-core/test/J0/OpenCloseCoreStressTest_/00003_core/data/index/
[junit4:junit4]   2> 1037 T3388 oasc.SolrCore.initIndex WARNING [00015_core] Solr index directory '/usr/home/hudson/hudson-slave/workspace/Lucene-Solr-Tests-trunk-java7/solr/build/solr-core/test/J0/OpenCloseCoreStressTest_/00015_core/data/index' doesn't exist. Creating new index...
[junit4:junit4]   2> 1037 T3418 oass.IndexSchema.readSchema unique key field: id
[junit4:junit4]   2> 1038 T3426 oasc.SolrCore.getNewIndexDir New index directory detected: old=null new=/usr/home/hudson/hudson-slave/workspace/Lucene-Solr-Tests-trunk-java7/solr/build/solr-core/test/J0/OpenCloseCoreStressTest_/00005_core/data/index/
[junit4:junit4]   2> 1037 T3390 oasc.SolrCore.initDirectoryFactory org.apache.solr.core.MockFSDirectoryFactory
[junit4:junit4]   2> 1038 T3394 oasc.SolrCore.initIndex WARNING [00010_core] Solr index directory '/usr/home/hudson/hudson-slave/workspace/Lucene-Solr-Tests-trunk-java7/solr/build/solr-core/test/J0/OpenCloseCoreStressTest_/00010_core/data/index' doesn't exist. Creating new index...
[junit4:junit4]   2> 1039 T3390 oasc.SolrCore.<init> [00002_core] Opening new SolrCore at /usr/home/hudson/hudson-slave/workspace/Lucene-Solr-Tests-trunk-java7/solr/build/solr-core/test/J0/./OpenCloseCoreStressTest_/00002_core/, dataDir=/usr/home/hudson/hudson-slave/workspace/Lucene-Solr-Tests-trunk-java7/solr/build/solr-core/test/J0/OpenCloseCoreStressTest_/00002_core/data/
[junit4:junit4]   2> 1039 T3391 oasc.SolrCore.initIndex WARNING [00003_core] Solr index directory '/usr/home/hudson/hudson-slave/workspace/Lucene-Solr-Tests-trunk-java7/solr/build/solr-core/test/J0/OpenCloseCoreStressTest_/00003_core/data/index' doesn't exist. Creating new index...
[junit4:junit4]   2> 1040 T3390 oasc.JmxMonitoredMap.<init> JMX monitoring is enabled. Adding Solr mbeans to JMX Server: com.sun.jmx.mbeanserver.JmxMBeanServer@3cf7366d
[junit4:junit4]   2> 1040 T3394 oasc.CachingDirectoryFactory.get return new directory for /usr/home/hudson/hudson-slave/workspace/Lucene-Solr-Tests-trunk-java7/solr/build/solr-core/test/J0/OpenCloseCoreStressTest_/00010_core/data/index forceNew: false
[junit4:junit4]   2> 1040 T3390 oasc.SolrCore.initDirectoryFactory org.apache.solr.core.MockFSDirectoryFactory
[junit4:junit4]   2> 1040 T3388 oasc.CachingDirectoryFactory.get return new directory for /usr/home/hudson/hudson-slave/workspace/Lucene-Solr-Tests-trunk-java7/solr/build/solr-core/test/J0/OpenCloseCoreStressTest_/00015_core/data/index forceNew: false
[junit4:junit4]   2> 1040 T3392 oasc.SolrCore.initDirectoryFactory org.apache.solr.core.MockFSDirectoryFactory
[junit4:junit4]   2> 1040 T3426 oasc.SolrCore.initIndex WARNING [00005_core] Solr index directory '/usr/home/hudson/hudson-slave/workspace/Lucene-Solr-Tests-trunk-java7/solr/build/solr-core/test/J0/OpenCloseCoreStressTest_/00005_core/data/index' doesn't exist. Creating new index...
[junit4:junit4]   2> 1041 T3391 oasc.CachingDirectoryFactory.get return new directory for /usr/home/hudson/hudson-slave/workspace/Lucene-Solr-Tests-trunk-java7/solr/build/solr-core/test/J0/OpenCloseCoreStressTest_/00003_core/data/index forceNew: false
[junit4:junit4]   2> 1041 T3418 oasc.SolrCore.initDirectoryFactory org.apache.solr.core.MockFSDirectoryFactory
[junit4:junit4]   2> 1042 T3392 oasc.SolrCore.<init> [00000_core] Opening new SolrCore at /usr/home/hudson/hudson-slave/workspace/Lucene-Solr-Tests-trunk-java7/solr/build/solr-core/test/J0/./OpenCloseCoreStressTest_/00000_core/, dataDir=/usr/home/hudson/hudson-slave/workspace/Lucene-Solr-Tests-trunk-java7/solr/build/solr-core/test/J0/OpenCloseCoreStressTest_/00000_core/data/
[junit4:junit4]   2> 1042 T3390 oasc.CachingDirectoryFactory.get return new directory for /usr/home/hudson/hudson-slave/workspace/Lucene-Solr-Tests-trunk-java7/solr/build/solr-core/test/J0/OpenCloseCoreStressTest_/00002_core/data forceNew: false
[junit4:junit4]   2> 1042 T3392 oasc.JmxMonitoredMap.<init> JMX monitoring is enabled. Adding Solr mbeans to JMX Server: com.sun.jmx.mbeanserver.JmxMBeanServer@3cf7366d
[junit4:junit4]   2> 1043 T3418 oasc.SolrCore.<init> [00008_core] Opening new SolrCore at /usr/home/hudson/hudson-slave/workspace/Lucene-Solr-Tests-trunk-java7/solr/build/solr-core/test/J0/./OpenCloseCoreStressTest_/00008_core/, dataDir=/usr/home/hudson/hudson-slave/workspace/Lucene-Solr-Tests-trunk-java7/solr/build/solr-core/test/J0/OpenCloseCoreStressTest_/00008_core/data/
[junit4:junit4]   2> 1042 T3426 oasc.CachingDirectoryFactory.get return new directory for /usr/home/hudson/hudson-slave/workspace/Lucene-Solr-Tests-trunk-java7/solr/build/solr-core/test/J0/OpenCloseCoreStressTest_/00005_core/data/index forceNew: false
[junit4:junit4]   2> 1043 T3392 oasc.SolrCore.initDirectoryFactory org.apache.solr.core.MockFSDirectoryFactory
[junit4:junit4]   2> 1043 T3418 oasc.JmxMonitoredMap.<init> JMX monitoring is enabled. Adding Solr mbeans to JMX Server: com.sun.jmx.mbeanserver.JmxMBeanServer@3cf7366d
[junit4:junit4]   2> 1044 T3390 oasc.SolrCore.getNewIndexDir New index directory detected: old=null new=/usr/home/hudson/hudson-slave/workspace/Lucene-Solr-Tests-trunk-java7/solr/build/solr-core/test/J0/OpenCloseCoreStressTest_/00002_core/data/index/
[junit4:junit4]   2> 1044 T3418 oasc.SolrCore.initDirectoryFactory org.apache.solr.core.MockFSDirectoryFactory
[junit4:junit4]   2> 1046 T3392 oasc.CachingDirectoryFactory.get return new directory for /usr/home/hudson/hudson-slave/workspace/Lucene-Solr-Tests-trunk-java7/solr/build/solr-core/test/J0/OpenCloseCoreStressTest_/00000_core/data forceNew: false
[junit4:junit4]   2> 1047 T3390 oasc.SolrCore.initIndex WARNING [00002_core] Solr index directory '/usr/home/hudson/hudson-slave/workspace/Lucene-Solr-Tests-trunk-java7/solr/build/solr-core/test/J0/OpenCloseCoreStressTest_/00002_core/data/index' doesn't exist. Creating new index...
[junit4:junit4]   2> 1047 T3418 oasc.CachingDirectoryFactory.get return new directory for /usr/home/hudson/hudson-slave/workspace/Lucene-Solr-Tests-trunk-java7/solr/build/solr-core/test/J0/OpenCloseCoreStressTest_/00008_core/data forceNew: false
[junit4:junit4]   2> 1048 T3390 oasc.CachingDirectoryFactory.get return new directory for /usr/home/hudson/hudson-slave/workspace/Lucene-Solr-Tests-trunk-java7/solr/build/solr-core/test/J0/OpenCloseCoreStressTest_/00002_core/data/index forceNew: false
[junit4:junit4]   2> 1048 T3389 oass.IndexSchema.readSchema unique key field: id
[junit4:junit4]   2> 1050 T3392 oasc.SolrCore.getNewIndexDir New index directory detected: old=null new=/usr/home/hudson/hudson-slave/workspace/Lucene-Solr-Tests-trunk-java7/solr/build/solr-core/test/J0/OpenCloseCoreStressTest_/00000_core/data/index/
[junit4:junit4]   2> 1051 T3418 oasc.SolrCore.getNewIndexDir New index directory detected: old=null new=/usr/home/hudson/hudson-slave/workspace/Lucene-Solr-Tests-trunk-java7/solr/build/solr-core/test/J0/OpenCloseCoreStressTest_/00008_core/data/index/
[junit4:junit4]   2> 1056 T3392 oasc.SolrCore.initIndex WARNING [00000_core] Solr index directory '/usr/home/hudson/hudson-slave/workspace/Lucene-Solr-Tests-trunk-java7/solr/build/solr-core/test/J0/OpenCloseCoreStressTest_/00000_core/data/index' doesn't exist. Creating new index...
[junit4:junit4]   2> 1057 T3418 oasc.SolrCore.initIndex WARNING [00008_core] Solr index directory '/usr/home/hudson/hudson-slave/workspace/Lucene-Solr-Tests-trunk-java7/solr/build/solr-core/test/J0/OpenCloseCoreStressTest_/00008_core/data/index' doesn't exist. Creating new index...
[junit4:junit4]   2> 1057 T3392 oasc.CachingDirectoryFactory.get return new directory for /usr/home/hudson/hudson-slave/workspace/Lucene-Solr-Tests-trunk-java7/solr/build/solr-core/test/J0/OpenCloseCoreStressTest_/00000_core/data/index forceNew: false
[junit4:junit4]   2> 1064 T3418 oasc.CachingDirectoryFactory.get return new directory for /usr/home/hudson/hudson-slave/workspace/Lucene-Solr-Tests-trunk-java7/solr/build/solr-core/test/J0/OpenCloseCoreStressTest_/00008_core/data/index forceNew: false
[junit4:junit4]   2> 1068 T3439 oasc.SolrConfig.<init> Loaded SolrConfig: solrconfig-minimal.xml
[junit4:junit4]   2> 1073 T3439 oass.IndexSchema.readSchema Reading Solr Schema
[junit4:junit4]   2> 1078 T3389 oasc.SolrCore.initDirectoryFactory org.apache.solr.core.MockFSDirectoryFactory
[junit4:junit4]   2> 1080 T3389 oasc.SolrCore.<init> [00019_core] Opening new SolrCore at /usr/home/hudson/hudson-slave/workspace/Lucene-Solr-Tests-trunk-java7/solr/build/solr-core/test/J0/./OpenCloseCoreStressTest_/00019_core/, dataDir=/usr/home/hudson/hudson-slave/workspace/Lucene-Solr-Tests-trunk-java7/solr/build/solr-core/test/J0/OpenCloseCoreStressTest_/00019_core/data/
[junit4:junit4]   2> 1081 T3389 oasc.JmxMonitoredMap.<init> JMX monitoring is enabled. Adding Solr mbeans to JMX Server: com.sun.jmx.mbeanserver.JmxMBeanServer@3cf7366d
[junit4:junit4]   2> 1081 T3389 oasc.SolrCore.initDirectoryFactory org.apache.solr.core.MockFSDirectoryFactory
[junit4:junit4]   2> 1082 T3432 oass.IndexSchema.readSchema unique key field: id
[junit4:junit4]   2> 1083 T3389 oasc.CachingDirectoryFactory.get return new directory for /usr/home/hudson/hudson-slave/workspace/Lucene-Solr-Tests-trunk-java7/solr/build/solr-core/test/J0/OpenCloseCoreStressTest_/00019_core/data forceNew: false
[junit4:junit4]   2> 1086 T3389 oasc.SolrCore.getNewIndexDir New index directory detected: old=null new=/usr/home/hudson/hudson-slave/workspace/Lucene-Solr-Tests-trunk-java7/solr/build/solr-core/test/J0/OpenCloseCoreStressTest_/00019_core/data/index/
[junit4:junit4]   2> 1088 T3389 oasc.SolrCore.initIndex WARNING [00019_core] Solr index directory '/usr/home/hudson/hudson-slave/workspace/Lucene-Solr-Tests-trunk-java7/solr/build/solr-core/test/J0/OpenCloseCoreStressTest_/00019_core/data/index' doesn't exist. Creating new index...
[junit4:junit4]   2> 1089 T3389 oasc.CachingDirectoryFactory.get return new directory for /usr/home/hudson/hudson-slave/workspace/Lucene-Solr-Tests-trunk-java7/solr/build/solr-core/test/J0/OpenCloseCoreStressTest_/00019_core/data/index forceNew: false
[junit4:junit4]   2> 1093 T3388 oasc.SolrDeletionPolicy.onCommit SolrDeletionPolicy.onCommit: commits:num=1
[junit4:junit4]   2> 		commit{dir=MockDirWrapper(RateLimitedDirectoryWrapper(NRTCachingDirectory(org.apache.lucene.store.MMapDirectory@/usr/home/hudson/hudson-slave/workspace/Lucene-Solr-Tests-trunk-java7/solr/build/solr-core/test/J0/OpenCloseCoreStressTest_/00015_core/data/index lockFactory=org.apache.lucene.store.NativeFSLockFactory@4fb997d2; maxCacheMB=0.4072265625 maxMergeSizeMB=0.82421875))),segFN=segments_1,generation=1,filenames=[segments_1]
[junit4:junit4]   2> 1094 T3388 oasc.SolrDeletionPolicy.updateCommits newest commit = 1[segments_1]
[junit4:junit4]   2> 1095 T3391 oasc.SolrDeletionPolicy.onCommit SolrDeletionPolicy.onCommit: commits:num=1
[junit4:junit4]   2> 		commit{dir=MockDirWrapper(RateLimitedDirectoryWrapper(NRTCachingDirectory(org.apache.lucene.store.MMapDirectory@/usr/home/hudson/hudson-slave/workspace/Lucene-Solr-Tests-trunk-java7/solr/build/solr-core/test/J0/OpenCloseCoreStressTest_/00003_core/data/index lockFactory=org.apache.lucene.store.NativeFSLockFactory@5a8eb7a0; maxCacheMB=0.4072265625 maxMergeSizeMB=0.82421875))),segFN=segments_1,generation=1,filenames=[segments_1]
[junit4:junit4]   2> 1095 T3394 oasc.SolrDeletionPolicy.onCommit SolrDeletionPolicy.onCommit: commits:num=1
[junit4:junit4]   2> 		commit{dir=MockDirWrapper(RateLimitedDirectoryWrapper(NRTCachingDirectory(org.apache.lucene.store.MMapDirectory@/usr/home/hudson/hudson-slave/workspace/Lucene-Solr-Tests-trunk-java7/solr/build/solr-core/test/J0/OpenCloseCoreStressTest_/00010_core/data/index lockFactory=org.apache.lucene.store.NativeFSLockFactory@76a93875; maxCacheMB=0.4072265625 maxMergeSizeMB=0.82421875))),segFN=segments_1,generation=1,filenames=[segments_1]
[junit4:junit4]   2> 1095 T3391 oasc.SolrDeletionPolicy.updateCommits newest commit = 1[segments_1]
[junit4:junit4]   2> 1096 T3394 oasc.SolrDeletionPolicy.updateCommits newest commit = 1[segments_1]
[junit4:junit4]   2> 1104 T3392 oasc.SolrDeletionPolicy.onCommit SolrDeletionPolicy.onCommit: commits:num=1
[junit4:junit4]   2> 		commit{dir=MockDirWrapper(RateLimitedDirectoryWrapper(NRTCachingDirectory(org.apache.lucene.store.MMapDirectory@/usr/home/hudson/hudson-slave/workspace/Lucene-Solr-Tests-trunk-java7/solr/build/solr-core/test/J0/OpenCloseCoreStressTest_/00000_core/data/index lockFactory=org.apache.lucene.store.NativeFSLockFactory@24c48a2; maxCacheMB=0.4072265625 maxMergeSizeMB=0.82421875))),segFN=segments_1,generation=1,filenames=[segments_1]
[junit4:junit4]   2> 1104 T3392 oasc.SolrDeletionPolicy.updateCommits newest commit = 1[segments_1]
[junit4:junit4]   2> 1112 T3390 oasc.SolrDeletionPolicy.onCommit SolrDeletionPolicy.onCommit: commits:num=1
[junit4:junit4]   2> 		commit{dir=MockDirWrapper(RateLimitedDirectoryWrapper(NRTCachingDirectory(org.apache.lucene.store.MMapDirectory@/usr/home/hudson/hudson-slave/workspace/Lucene-Solr-Tests-trunk-java7/solr/build/solr-core/test/J0/OpenCloseCoreStressTest_/00002_core/data/index lockFactory=org.apache.lucene.store.NativeFSLockFactory@64f5f3bf; maxCacheMB=0.4072265625 maxMergeSizeMB=0.82421875))),segFN=segments_1,generation=1,filenames=[segments_1]
[junit4:junit4]   2> 1112 T3390 oasc.SolrDeletionPolicy.updateCommits newest commit = 1[segments_1]
[junit4:junit4]   2> 1117 T3426 oasc.SolrDeletionPolicy.onCommit SolrDeletionPolicy.onCommit: commits:num=1
[junit4:junit4]   2> 		commit{dir=MockDirWrapper(RateLimitedDirectoryWrapper(NRTCachingDirectory(org.apache.lucene.store.MMapDirectory@/usr/home/hudson/hudson-slave/workspace/Lucene-Solr-Tests-trunk-java7/solr/build/solr-core/test/J0/OpenCloseCoreStressTest_/00005_core/data/index lockFactory=org.apache.lucene.store.NativeFSLockFactory@219e84e2; maxCacheMB=0.4072265625 maxMergeSizeMB=0.82421875))),segFN=segments_1,generation=1,filenames=[segments_1]
[junit4:junit4]   2> 1117 T3418 oasc.SolrDeletionPolicy.onCommit SolrDeletionPolicy.onCommit: commits:num=1
[junit4:junit4]   2> 		commit{dir=MockDirWrapper(RateLimitedDirectoryWrapper(NRTCachingDirectory(org.apache.lucene.store.MMapDirectory@/usr/home/hudson/hudson-slave/workspace/Lucene-Solr-Tests-trunk-java7/solr/build/solr-core/test/J0/OpenCloseCoreStressTest_/00008_core/data/index lockFactory=org.apache.lucene.store.NativeFSLockFactory@6100ebf5; maxCacheMB=0.4072265625 maxMergeSizeMB=0.82421875))),segFN=segments_1,generation=1,filenames=[segments_1]
[junit4:junit4]   2> 1117 T3426 oasc.SolrDeletionPolicy.updateCommits newest commit = 1[segments_1]
[junit4:junit4]   2> 1118 T3418 oasc.SolrDeletionPolicy.updateCommits newest commit = 1[segments_1]
[junit4:junit4]   2> 1118 T3432 oasc.SolrCore.initDirectoryFactory org.apache.solr.core.MockFSDirectoryFactory
[junit4:junit4]   2> 1118 T3430 oass.IndexSchema.readSchema unique key field: id
[junit4:junit4]   2> 1120 T3432 oasc.SolrCore.<init> [00018_core] Opening new SolrCore at /usr/home/hudson/hudson-slave/workspace/Lucene-Solr-Tests-trunk-java7/solr/build/solr-core/test/J0/./OpenCloseCoreStressTest_/00018_core/, dataDir=/usr/home/hudson/hudson-slave/workspace/Lucene-Solr-Tests-trunk-java7/solr/build/solr-core/test/J0/OpenCloseCoreStressTest_/00018_core/data/
[junit4:junit4]   2> 1121 T3432 oasc.JmxMonitoredMap.<init> JMX monitoring is enabled. Adding Solr mbeans to JMX Server: com.sun.jmx.mbeanserver.JmxMBeanServer@3cf7366d
[junit4:junit4]   2> 1121 T3432 oasc.SolrCore.initDirectoryFactory org.apache.solr.core.MockFSDirectoryFactory
[junit4:junit4]   2> 1125 T3432 oasc.CachingDirectoryFactory.get return new directory for /usr/home/hudson/hudson-slave/workspace/Lucene-Solr-Tests-trunk-java7/solr/build/solr-core/test/J0/OpenCloseCoreStressTest_/00018_core/data forceNew: false
[junit4:junit4]   2> 1127 T3389 oasc.SolrDeletionPolicy.onCommit SolrDeletionPolicy.onCommit: commits:num=1
[junit4:junit4]   2> 		commit{dir=MockDirWrapper(RateLimitedDirectoryWrapper(NRTCachingDirectory(org.apache.lucene.store.MMapDirectory@/usr/home/hudson/hudson-slave/workspace/Lucene-Solr-Tests-trunk-java7/solr/build/solr-core/test/J0/OpenCloseCoreStressTest_/00019_core/data/index lockFactory=org.apache.lucene.store.NativeFSLockFactory@1803a639; maxCacheMB=0.4072265625 maxMergeSizeMB=0.82421875))),segFN=segments_1,generation=1,filenames=[segments_1]
[junit4:junit4]   2> 1127 T3432 oasc.SolrCore.getNewIndexDir New index directory detected: old=null new=/usr/home/hudson/hudson-slave/workspace/Lucene-Solr-Tests-trunk-java7/solr/build/solr-core/test/J0/OpenCloseCoreStressTest_/00018_core/data/index/
[junit4:junit4]   2> 1127 T3389 oasc.SolrDeletionPolicy.updateCommits newest commit = 1[segments_1]
[junit4:junit4]   2> 1131 T3432 oasc.SolrCore.initIndex WARNING [00018_core] Solr index directory '/usr/home/hudson/hudson-slave/workspace/Lucene-Solr-Tests-trunk-java7/solr/build/solr-core/test/J0/OpenCloseCoreStressTest_/00018_core/data/index' doesn't exist. Creating new index...
[junit4:junit4]   2> 1132 T3432 oasc.CachingDirectoryFactory.get return new directory for /usr/home/hudson/hudson-slave/workspace/Lucene-Solr-Tests-trunk-java7/solr/build/solr-core/test/J0/OpenCloseCoreStressTest_/00018_core/data/index forceNew: false
[junit4:junit4]   2> 1151 T3439 oass.IndexSchema.readSchema Schema name=tiny
[junit4:junit4]   2> 1151 T3430 oasc.SolrCore.initDirectoryFactory org.apache.solr.core.MockFSDirectoryFactory
[junit4:junit4]   2> 1153 T3430 oasc.SolrCore.<init> [00001_core] Opening new SolrCore at /usr/home/hudson/hudson-slave/workspace/Lucene-Solr-Tests-trunk-java7/solr/build/solr-core/test/J0/./OpenCloseCoreStressTest_/00001_core/, dataDir=/usr/home/hudson/hudson-slave/workspace/Lucene-Solr-Tests-trunk-java7/solr/build/solr-core/test/J0/OpenCloseCoreStressTest_/00001_core/data/
[junit4:junit4]   2> 1153 T3432 oasc.SolrDeletionPolicy.onCommit SolrDeletionPolicy.onCommit: commits:num=1
[junit4:junit4]   2> 		commit{dir=MockDirWrapper(RateLimitedDirectoryWrapper(NRTCachingDirectory(org.apache.lucene.store.MMapDirectory@/usr/home/hudson/hudson-slave/workspace/Lucene-Solr-Tests-trunk-java7/solr/build/solr-core/test/J0/OpenCloseCoreStressTest_/00018_core/data/index lockFactory=org.apache.lucene.store.NativeFSLockFactory@68d1b7e5; maxCacheMB=0.4072265625 maxMergeSizeMB=0.82421875))),segFN=segments_1,generation=1,filenames=[segments_1]
[junit4:junit4]   2> 1153 T3430 oasc.JmxMonitoredMap.<init> JMX monitoring is enabled. Adding Solr mbeans to JMX Server: com.sun.jmx.mbeanserver.JmxMBeanServer@3cf7366d
[junit4:junit4]   2> 1154 T3432 oasc.SolrDeletionPolicy.updateCommits newest commit = 1[segments_1]
[junit4:junit4]   2> 1154 T3430 oasc.SolrCore.initDirectoryFactory org.apache.solr.core.MockFSDirectoryFactory
[junit4:junit4]   2> 1157 T3430 oasc.CachingDirectoryFactory.get return new directory for /usr/home/hudson/hudson-slave/workspace/Lucene-Solr-Tests-trunk-java7/solr/build/solr-core/test/J0/OpenCloseCoreStressTest_/00001_core/data forceNew: false
[junit4:junit4]   2> 1160 T3430 oasc.SolrCore.getNewIndexDir New index directory detected: old=null new=/usr/home/hudson/hudson-slave/workspace/Lucene-Solr-Tests-trunk-java7/solr/build/solr-core/test/J0/OpenCloseCoreStressTest_/00001_core/data/index/
[junit4:junit4]   2> 1163 T3430 oasc.SolrCore.initIndex WARNING [00001_core] Solr index directory '/usr/home/hudson/hudson-slave/workspace/Lucene-Solr-Tests-trunk-java7/solr/build/solr-core/test/J0/OpenCloseCoreStressTest_/00001_core/data/index' doesn't exist. Creating new index...
[junit4:junit4]   2> 1164 T3430 oasc.CachingDirectoryFactory.get return new directory for /usr/home/hudson/hudson-slave/workspace/Lucene-Solr-Tests-trunk-java7/solr/build/solr-core/test/J0/OpenCloseCoreStressTest_/00001_core/data/index forceNew: false
[junit4:junit4]   2> 1166 T3429 oass.IndexSchema.readSchema unique key field: id
[junit4:junit4]   2> 1167 T3447 oasc.SolrConfig.<init> Loaded SolrConfig: solrconfig-minimal.xml
[junit4:junit4]   2> 1168 T3445 oasc.SolrConfig.<init> Loaded SolrConfig: solrconfig-minimal.xml
[junit4:junit4]   2> 1170 T3447 oass.IndexSchema.readSchema Reading Solr Schema
[junit4:junit4]   2> 1170 T3429 oasc.SolrCore.initDirectoryFactory org.apache.solr.core.MockFSDirectoryFactory
[junit4:junit4]   2> 1170 T3445 oass.IndexSchema.readSchema Reading Solr Schema
[junit4:junit4]   2> 1173 T3429 oasc.SolrCore.<init> [00016_core] Opening new SolrCore at /usr/home/hudson/hudson-slave/workspace/Lucene-Solr-Tests-trunk-java7/solr/build/solr-core/test/J0/./OpenCloseCoreStressTest_/00016_core/, dataDir=/usr/home/hudson/hudson-slave/workspace/Lucene-Solr-Tests-trunk-java7/solr/build/solr-core/test/J0/OpenCloseCoreStressTest_/00016_core/data/
[junit4:junit4]   2> 1173 T3429 oasc.JmxMonitoredMap.<init> JMX monitoring is enabled. Adding Solr mbeans to JMX Server: com.sun.jmx.mbeanserver.JmxMBeanServer@3cf7366d
[junit4:junit4]   2> 1174 T3429 oasc.SolrCore.initDirectoryFactory org.apache.solr.core.MockFSDirectoryFactory
[junit4:junit4]   2> 1177 T3429 oasc.CachingDirectoryFactory.get return new directory for /usr/home/hudson/hudson-slave/workspace/Lucene-Solr-Tests-trunk-java7/solr/build/solr-core/test/J0/OpenCloseCoreStressTest_/00016_core/data forceNew: false
[junit4:junit4]   2> 1180 T3430 oasc.SolrDeletionPolicy.onCommit SolrDeletionPolicy.onCommit: commits:num=1
[junit4:junit4]   2> 		commit{dir=MockDirWrapper(RateLimitedDirectoryWrapper(NRTCachingDirectory(org.apache.lucene.store.MMapDirectory@/usr/home/hudson/hudson-slave/workspace/Lucene-Solr-Tests-trunk-java7/solr/build/solr-core/test/J0/OpenCloseCoreStressTest_/00001_core/data/index lockFactory=org.apache.lucene.store.NativeFSLockFactory@8e98f16; maxCacheMB=0.4072265625 maxMergeSizeMB=0.82421875))),segFN=segments_1,generation=1,filenames=[segments_1]
[junit4:junit4]   2> 1181 T3429 oasc.SolrCore.getNewIndexDir New index directory detected: old=null new=/usr/home/hudson/hudson-slave/workspace/Lucene-Solr-Tests-trunk-java7/solr/build/solr-core/test/J0/OpenCloseCoreStressTest_/00016_core/data/index/
[junit4:junit4]   2> 1181 T3430 oasc.SolrDeletionPolicy.updateCommits newest commit = 1[segments_1]
[junit4:junit4]   2> 1185 T3429 oasc.SolrCore.initIndex WARNING [00016_core] Solr index directory '/usr/home/hudson/hudson-slave/workspace/Lucene-Solr-Tests-trunk-java7/solr/build/solr-core/test/J0/OpenCloseCoreStressTest_/00016_core/data/index' doesn't exist. Creating new index...
[junit4:junit4]   2> 1187 T3429 oasc.CachingDirectoryFactory.get return new directory for /usr/home/hudson/hudson-slave/workspace/Lucene-Solr-Tests-trunk-java7/solr/build/solr-core/test/J0/OpenCloseCoreStressTest_/00016_core/data/index forceNew: false
[junit4:junit4]   2> 1212 T3429 oasc.SolrDeletionPolicy.onCommit SolrDeletionPolicy.onCommit: commits:num=1
[junit4:junit4]   2> 		commit{dir=MockDirWrapper(RateLimitedDirectoryWrapper(NRTCachingDirectory(org.apache.lucene.store.MMapDirectory@/usr/home/hudson/hudson-slave/workspace/Lucene-Solr-Tests-trunk-java7/solr/build/solr-core/test/J0/OpenCloseCoreStressTest_/00016_core/data/index lockFactory=org.apache.lucene.store.NativeFSLockFactory@325ebe8b; maxCacheMB=0.4072265625 maxMergeSizeMB=0.82421875))),segFN=segments_1,generation=1,filenames=[segments_1]
[junit4:junit4]   2> 1213 T3429 oasc.SolrDeletionPolicy.updateCommits newest commit = 1[segments_1]
[junit4:junit4]   2> 1237 T3445 oass.IndexSchema.readSchema Schema name=tiny
[junit4:junit4]   2> 1238 T3447 oass.IndexSchema.readSchema Schema name=tiny
[junit4:junit4]   2> 1253 T3388 oasc.SolrCore.initWriters created json: solr.JSONResponseWriter
[junit4:junit4]   2> 1253 T3429 oasc.SolrCore.initWriters created json: solr.JSONResponseWriter
[junit4:junit4]   2> 1254 T3432 oasc.SolrCore.initWriters created json: solr.JSONResponseWriter
[junit4:junit4]   2> 1256 T3390 oasc.SolrCore.initWriters created json: solr.JSONResponseWriter
[junit4:junit4]   2> 1257 T3389 oasc.SolrCore.initWriters created json: solr.JSONResponseWriter
[junit4:junit4]   2> 1258 T3394 oasc.SolrCore.initWriters created json: solr.JSONResponseWriter
[junit4:junit4]   2> 1258 T3426 oasc.SolrCore.initWriters created json: solr.JSONResponseWriter
[junit4:junit4]   2> 1260 T3418 oasc.SolrCore.initWriters created json: solr.JSONResponseWriter
[junit4:junit4]   2> 1261 T3391 oasc.SolrCore.initWriters created json: solr.JSONResponseWriter
[junit4:junit4]   2> 1262 T3392 oasc.SolrCore.initWriters created json: solr.JSONResponseWriter
[junit4:junit4]   2> 1262 T3430 oasc.SolrCore.initWriters created json: solr.JSONResponseWriter
[junit4:junit4]   2> 1264 T3439 oass.IndexSchema.readSchema unique key field: id
[junit4:junit4]   2> 1267 T3439 oasc.SolrCore.initDirectoryFactory org.apache.solr.core.MockFSDirectoryFactory
[junit4:junit4]   2> 1267 T3439 oasc.SolrCore.<init> [00007_core] Opening new SolrCore at /usr/home/hudson/hudson-slave/workspace/Lucene-Solr-Tests-trunk-java7/solr/build/solr-core/test/J0/./OpenCloseCoreStressTest_/00007_core/, dataDir=/usr/home/hudson/hudson-slave/workspace/Lucene-Solr-Tests-trunk-java7/solr/build/solr-core/test/J0/OpenCloseCoreStressTest_/00007_core/data/
[junit4:junit4]   2> 1268 T3439 oasc.JmxMonitoredMap.<init> JMX monitoring is enabled. Adding Solr mbeans to JMX Server: com.sun.jmx.mbeanserver.JmxMBeanServer@3cf7366d
[junit4:junit4]   2> 1268 T3439 oasc.SolrCore.initDirectoryFactory org.apache.solr.core.MockFSDirectoryFactory
[junit4:junit4]   2> 1270 T3439 oasc.CachingDirectoryFactory.get return new directory for /usr/home/hudson/hudson-slave/workspace/Lucene-Solr-Tests-trunk-java7/solr/build/solr-core/test/J0/OpenCloseCoreStressTest_/00007_core/data forceNew: false
[junit4:junit4]   2> 1271 T3439 oasc.SolrCore.getNewIndexDir New index directory detected: old=null new=/usr/home/hudson/hudson-slave/workspace/Lucene-Solr-Tests-trunk-java7/solr/build/solr-core/test/J0/OpenCloseCoreStressTest_/00007_core/data/index/
[junit4:junit4]   2> 1272 T3439 oasc.SolrCore.initIndex WARNING [00007_core] Solr index directory '/usr/home/hudson/hudson-slave/workspace/Lucene-Solr-Tests-trunk-java7/solr/build/solr-core/test/J0/OpenCloseCoreStressTest_/00007_core/data/index' doesn't exist. Creating new index...
[junit4:junit4]   2> 1273 T3439 oasc.CachingDirectoryFactory.get return new directory for /usr/home/hudson/hudson-slave/workspace/Lucene-Solr-Tests-trunk-java7/solr/build/solr-core/test/J0/OpenCloseCoreStressTest_/00007_core/data/index forceNew: false
[junit4:junit4]   2> 1281 T3439 oasc.SolrDeletionPolicy.onCommit SolrDeletionPolicy.onCommit: commits:num=1
[junit4:junit4]   2> 		commit{dir=MockDirWrapper(RateLimitedDirectoryWrapper(NRTCachingDirectory(org.apache.lucene.store.MMapDirectory@/usr/home/hudson/hudson-slave/workspace/Lucene-Solr-Tests-trunk-java7/solr/build/solr-core/test/J0/OpenCloseCoreStressTest_/00007_core/data/index lockFactory=org.apache.lucene.store.NativeFSLockFactory@232fa55b; maxCacheMB=0.4072265625 maxMergeSizeMB=0.82421875))),segFN=segments_1,generation=1,filenames=[segments_1]
[junit4:junit4]   2> 1282 T3439 oasc.SolrDeletionPolicy.updateCommits newest commit = 1[segments_1]
[junit4:junit4]   2> 1283 T3447 oass.IndexSchema.readSchema unique key field: id
[junit4:junit4]   2> 1284 T3439 oasc.SolrCore.initWriters created json: solr.JSONResponseWriter
[junit4:junit4]   2> 1290 T3447 oasc.SolrCore.initDirectoryFactory org.apache.solr.core.MockFSDirectoryFactory
[junit4:junit4]   2> 1291 T3447 oasc.SolrCore.<init> [00014_core] Opening new SolrCore at /usr/home/hudson/hudson-slave/workspace/Lucene-Solr-Tests-trunk-java7/solr/build/solr-core/test/J0/./OpenCloseCoreStressTest_/00014_core/, dataDir=/usr/home/hudson/hudson-slave/workspace/Lucene-Solr-Tests-trunk-java7/solr/build/solr-core/test/J0/OpenCloseCoreStressTest_/00014_core/data/
[junit4:junit4]   2> 1292 T3447 oasc.JmxMonitoredMap.<init> JMX monitoring is enabled. Adding Solr mbeans to JMX Server: com.sun.jmx.mbeanserver.JmxMBeanServer@3cf7366d
[junit4:junit4]   2> 1292 T3445 oass.IndexSchema.readSchema unique key field: id
[junit4:junit4]   2> 1292 T3447 oasc.SolrCore.initDirectoryFactory org.apache.solr.core.MockFSDirectoryFactory
[junit4:junit4]   2> 1294 T3447 oasc.CachingDirectoryFactory.get return new directory for /usr/home/hudson/hudson-slave/workspace/Lucene-Solr-Tests-trunk-java7/solr/build/solr-core/test/J0/OpenCloseCoreStressTest_/00014_core/data forceNew: false
[junit4:junit4]   2> 1295 T3445 oasc.SolrCore.initDirectoryFactory org.apache.solr.core.MockFSDirectoryFactory
[junit4:junit4]   2> 1295 T3447 oasc.SolrCore.getNewIndexDir New index directory detected: old=null new=/usr/home/hudson/hudson-slave/workspace/Lucene-Solr-Tests-trunk-java7/solr/build/solr-core/test/J0/OpenCloseCoreStressTest_/00014_core/data/index/
[junit4:junit4]   2> 1296 T3445 oasc.SolrCore.<init> [00009_core] Opening new SolrCore at /usr/home/hudson/hudson-slave/workspace/Lucene-Solr-Tests-trunk-java7/solr/build/solr-core/test/J0/./OpenCloseCoreStressTest_/00009_core/, dataDir=/usr/home/hudson/hudson-slave/workspace/Lucene-Solr-Tests-trunk-java7/solr/build/solr-core/test/J0/OpenCloseCoreStressTest_/00009_core/data/
[junit4:junit4]   2> 1296 T3445 oasc.JmxMonitoredMap.<init> JMX monitoring is enabled. Adding Solr mbeans to JMX Server: com.sun.jmx.mbeanserver.JmxMBeanServer@3cf7366d
[junit4:junit4]   2> 1296 T3447 oasc.SolrCore.initIndex WARNING [00014_core] Solr index directory '/usr/home/hudson/hudson-slave/workspace/Lucene-Solr-Tests-trunk-java7/solr/build/solr-core/test/J0/OpenCloseCoreStressTest_/00014_core/data/index' doesn't exist. Creating new index...
[junit4:junit4]   2> 1297 T3445 oasc.SolrCore.initDirectoryFactory org.apache.solr.core.MockFSDirectoryFactory
[junit4:junit4]   2> 1297 T3447 oasc.CachingDirectoryFactory.get return new directory for /usr/home/hudson/hudson-slave/workspace/Lucene-Solr-Tests-trunk-java7/solr/build/solr-core/test/J0/OpenCloseCoreStressTest_/00014_core/data/index forceNew: false
[junit4:junit4]   2> 1298 T3445 oasc.CachingDirectoryFactory.get return new directory for /usr/home/hudson/hudson-slave/workspace/Lucene-Solr-Tests-trunk-java7/solr/build/solr-core/test/J0/OpenCloseCoreStressTest_/00009_core/data forceNew: false
[junit4:junit4]   2> 1299 T3445 oasc.SolrCore.getNewIndexDir New index directory detected: old=null new=/usr/home/hudson/hudson-slave/workspace/Lucene-Solr-Tests-trunk-java7/solr/build/solr-core/test/J0/OpenCloseCoreStressTest_/00009_core/data/index/
[junit4:junit4]   2> 1301 T3445 oasc.SolrCore.initIndex WARNING [00009_core] Solr index directory '/usr/home/hudson/hudson-slave/workspace/Lucene-Solr-Tests-trunk-java7/solr/build/solr-core/test/J0/OpenCloseCoreStressTest_/00009_core/data/index' doesn't exist. Creating new index...
[junit4:junit4]   2> 1301 T3445 oasc.CachingDirectoryFactory.get return new directory for /usr/home/hudson/hudson-slave/workspace/Lucene-Solr-Tests-trunk-java7/solr/build/solr-core/test/J0/OpenCloseCoreStressTest_/00009_core/data/index forceNew: false
[junit4:junit4]   2> 1304 T3388 oasc.RequestHandlers.initHandlersFromConfig created /admin/: solr.admin.AdminHandlers
[junit4:junit4]   2> 1305 T3388 oasc.RequestHandlers.initHandlersFromConfig created /select: solr.SearchHandler
[junit4:junit4]   2> 1305 T3447 oasc.SolrDeletionPolicy.onCommit SolrDeletionPolicy.onCommit: commits:num=1
[junit4:junit4]   2> 		commit{dir=MockDirWrapper(RateLimitedDirectoryWrapper(NRTCachingDirectory(org.apache.lucene.store.MMapDirectory@/usr/home/hudson/hudson-slave/workspace/Lucene-Solr-Tests-trunk-java7/solr/build/solr-core/test/J0/OpenCloseCoreStressTest_/00014_core/data/index lockFactory=org.apache.lucene.store.NativeFSLockFactory@34ff6dbb; maxCacheMB=0.4072265625 maxMergeSizeMB=0.82421875))),segFN=segments_1,generation=1,filenames=[segments_1]
[junit4:junit4]   2> 1306 T3388 oasc.RequestHandlers.initHandlersFromConfig created /update: solr.UpdateRequestHandler
[junit4:junit4]   2> 1306 T3447 oasc.SolrDeletionPolicy.updateCommits newest commit = 1[segments_1]
[junit4:junit4]   2> 1308 T3447 oasc.SolrCore.initWriters created json: solr.JSONResponseWriter
[junit4:junit4]   2> 1310 T3447 oasc.RequestHandlers.initHandlersFromConfig created /admin/: solr.admin.AdminHandlers
[junit4:junit4]   2> 1311 T3447 oasc.RequestHandlers.initHandlersFromConfig created /select: solr.SearchHandler
[junit4:junit4]   2> 1311 T3447 oasc.RequestHandlers.initHandlersFromConfig created /update: solr.UpdateRequestHandler
[junit4:junit4]   2> 1314 T3439 oasc.RequestHandlers.initHandlersFromConfig created /admin/: solr.admin.AdminHandlers
[junit4:junit4]   2> 1314 T3439 oasc.RequestHandlers.initHandlersFromConfig created /select: solr.SearchHandler
[junit4:junit4]   2> 1315 T3439 oasc.RequestHandlers.initHandlersFromConfig created /update: solr.UpdateRequestHandler
[junit4:junit4]   2> 1319 T3391 oasc.RequestHandlers.initHandlersFromConfig created /admin/: solr.admin.AdminHandlers
[junit4:junit4]   2> 1319 T3430 oasc.RequestHandlers.initHandlersFromConfig created /admin/: solr.admin.AdminHandlers
[junit4:junit4]   2> 1320 T3391 oasc.RequestHandlers.initHandlersFromConfig created /select: solr.SearchHandler
[junit4:junit4]   2> 1320 T3430 oasc.RequestHandlers.initHandlersFromConfig created /select: solr.SearchHandler
[junit4:junit4]   2> 1321 T3391 oasc.RequestHandlers.initHandlersFromConfig created /update: solr.UpdateRequestHandler
[junit4:junit4]   2> 1321 T3426 oasc.RequestHandlers.initHandlersFromConfig created /admin/: solr.admin.AdminHandlers
[junit4:junit4]   2> 1321 T3430 oasc.RequestHandlers.initHandlersFromConfig created /update: solr.UpdateRequestHandler
[junit4:junit4]   2> 1322 T3394 oasc.RequestHandlers.initHandlersFromConfig created /admin/: solr.admin.AdminHandlers
[junit4:junit4]   2> 1322 T3426 oasc.RequestHandlers.initHandlersFromConfig created /select: solr.SearchHandler
[junit4:junit4]   2> 1322 T3445 oasc.SolrDeletionPolicy.onCommit SolrDeletionPolicy.onCommit: commits:num=1
[junit4:junit4]   2> 		commit{dir=MockDirWrapper(RateLimitedDirectoryWrapper(NRTCachingDirectory(org.apache.lucene.store.MMapDirectory@/usr/home/hudson/hudson-slave/workspace/Lucene-Solr-Tests-trunk-java7/solr/build/solr-core/test/J0/OpenCloseCoreStressTest_/00009_core/data/index lockFactory=org.apache.lucene.store.NativeFSLockFactory@62805b26; maxCacheMB=0.4072265625 maxMergeSizeMB=0.82421875))),segFN=segments_1,generation=1,filenames=[segments_1]
[junit4:junit4]   2> 1322 T3394 oasc.RequestHandlers.initHandlersFromConfig created /select: solr.SearchHandler
[junit4:junit4]   2> 1323 T3445 oasc.SolrDeletionPolicy.updateCommits newest commit = 1[segments_1]
[junit4:junit4]   2> 1323 T3426 oasc.RequestHandlers.initHandlersFromConfig created /update: solr.UpdateRequestHandler
[junit4:junit4]   2> 1323 T3394 oasc.RequestHandlers.initHandlersFromConfig created /update: solr.UpdateRequestHandler
[junit4:junit4]   2> 1323 T3429 oasc.RequestHandlers.initHandlersFromConfig created /admin/: solr.admin.AdminHandlers
[junit4:junit4]   2> 1324 T3432 oasc.RequestHandlers.initHandlersFromConfig created /admin/: solr.admin.AdminHandlers
[junit4:junit4]   2> 1324 T3429 oasc.RequestHandlers.initHandlersFromConfig created /select: solr.SearchHandler
[junit4:junit4]   2> 1325 T3432 oasc.RequestHandlers.initHandlersFromConfig created /select: solr.SearchHandler
[junit4:junit4]   2> 1325 T3429 oasc.RequestHandlers.initHandlersFromConfig created /update: solr.UpdateRequestHandler
[junit4:junit4]   2> 1326 T3432 oasc.RequestHandlers.initHandlersFromConfig created /update: solr.UpdateRequestHandler
[junit4:junit4]   2> 1328 T3445 oasc.SolrCore.initWriters created json: solr.JSONResponseWriter
[junit4:junit4]   2> 1330 T3445 oasc.RequestHandlers.initHandlersFromConfig created /admin/: solr.admin.AdminHandlers
[junit4:junit4]   2> 1331 T3445 oasc.RequestHandlers.initHandlersFromConfig created /select: solr.SearchHandler
[junit4:junit4]   2> 1332 T3390 oasc.RequestHandlers.initHandlersFromConfig created /admin/: solr.admin.AdminHandlers
[junit4:junit4]   2> 1332 T3445 oasc.RequestHandlers.initHandlersFromConfig created /update: solr.UpdateRequestHandler
[junit4:junit4]   2> 1333 T3390 oasc.RequestHandlers.initHandlersFromConfig created /select: solr.SearchHandler
[junit4:junit4]   2> 1334 T3390 oasc.RequestHandlers.initHandlersFromConfig created /update: solr.UpdateRequestHandler
[junit4:junit4]   2> 1364 T3447 oashl.XMLLoader.init xsltCacheLifetimeSeconds=60
[junit4:junit4]   2> 1365 T3426 oashl.XMLLoader.init xsltCacheLifetimeSeconds=60
[junit4:junit4]   2> 1366 T3390 oashl.XMLLoader.init xsltCacheLifetimeSeconds=60
[junit4:junit4]   2> 1366 T3445 oashl.XMLLoader.init xsltCacheLifetimeSeconds=60
[junit4:junit4]   2> 1366 T3432 oashl.XMLLoader.init xsltCacheLifetimeSeconds=60
[junit4:junit4]   2> 1367 T3430 oashl.XMLLoader.init xsltCacheLifetimeSeconds=60
[junit4:junit4]   2> 1366 T3439 oashl.XMLLoader.init xsltCacheLifetimeSeconds=60
[junit4:junit4]   2> 1366 T3429 oashl.XMLLoader.init xsltCacheLifetimeSeconds=60
[junit4:junit4]   2> 1367 T3388 oashl.XMLLoader.init xsltCacheLifetimeSeconds=60
[junit4:junit4]   2> 1367 T3391 oashl.XMLLoader.init xsltCacheLifetimeSeconds=60
[junit4:junit4]   2> 1366 T3394 oashl.XMLLoader.init xsltCacheLifetimeSeconds=60
[junit4:junit4]   2> 1381 T3389 oasc.RequestHandlers.initHandlersFromConfig created /admin/: solr.admin.AdminHandlers
[junit4:junit4]   2> 1382 T3389 oasc.RequestHandlers.initHandlersFromConfig created /select: solr.SearchHandler
[junit4:junit4]   2> 1382 T3389 oasc.RequestHandlers.initHandlersFromConfig created /update: solr.UpdateRequestHandler
[junit4:junit4]   2> 1384 T3418 oasc.RequestHandlers.initHandlersFromConfig created /admin/: solr.admin.AdminHandlers
[junit4:junit4]   2> 1384 T3418 oasc.RequestHandlers.initHandlersFromConfig created /select: solr.SearchHandler
[junit4:junit4]   2> 1385 T3418 oasc.RequestHandlers.initHandlersFromConfig created /update: solr.UpdateRequestHandler
[junit4:junit4]   2> 1386 T3392 oasc.RequestHandlers.initHandlersFromConfig created /admin/: solr.admin.AdminHandlers
[junit4:junit4]   2> 1387 T3392 oasc.RequestHandlers.initHandlersFromConfig created /select: solr.SearchHandler
[junit4:junit4]   2> 1388 T3392 oasc.RequestHandlers.initHandlersFromConfig created /update: solr.UpdateRequestHandler
[junit4:junit4]   2> 1390 T3389 oashl.XMLLoader.init xsltCacheLifetimeSeconds=60
[junit4:junit4]   2> 1391 T3418 oashl.XMLLoader.init xsltCacheLifetimeSeconds=60
[junit4:junit4]   2> 1393 T3392 oashl.XMLLoader.init xsltCacheLifetimeSeconds=60
[junit4:junit4]   2> 1414 T3391 oass.SolrIndexSearcher.<init> Opening Searcher@6000d456 main
[junit4:junit4]   2> 1414 T3439 oass.SolrIndexSearcher.<init> Opening Searcher@56748b57 main
[junit4:junit4]   2> 1415 T3426 oass.SolrIndexSearcher.<init> Opening Searcher@b91b7c9 main
[junit4:junit4]   2> 1415 T3390 oass.SolrIndexSearcher.<init> Opening Searcher@49904418 main
[junit4:junit4]   2> 1415 T3432 oass.SolrIndexSearcher.<init> Opening Searcher@588b55ad main
[junit4:junit4]   2> 1415 T3429 oass.SolrIndexSearcher.<init> Opening Searcher@7eddcc01 main
[junit4:junit4]   2> 1415 T3389 oass.SolrIndexSearcher.<init> Opening Searcher@4eef0560 main
[junit4:junit4]   2> 1415 T3447 oass.SolrIndexSearcher.<init> Opening Searcher@53834c24 main
[junit4:junit4]   2> 1415 T3445 oass.SolrIndexSearcher.<init> Opening Searcher@1a3eb9ab main
[junit4:junit4]   2> 1416 T3418 oass.SolrIndexSearcher.<init> Opening Searcher@6fd6782f main
[junit4:junit4]   2> 1416 T3392 oass.SolrIndexSearcher.<init> Opening Searcher@5621c755 main
[junit4:junit4]   2> 1416 T3429 oasc.SolrCore.registerSearcher [00016_core] Registered new searcher Searcher@7eddcc01 main{StandardDirectoryReader(segments_1:1)}
[junit4:junit4]   2> 1417 T3389 oasc.SolrCore.registerSearcher [00019_core] Registered new searcher Searcher@4eef0560 main{StandardDirectoryReader(segments_1:1)}
[junit4:junit4]   2> 1415 T3394 oass.SolrIndexSearcher.<init> Opening Searcher@eb20583 main
[junit4:junit4]   2> 1417 T3429 oasu.CommitTracker.<init> Hard AutoCommit: disabled
[junit4:junit4]   2> 1415 T3430 oass.SolrIndexSearcher.<init> Opening Searcher@eb20583 main
[junit4:junit4]   2> 1415 T3388 oass.SolrIndexSearcher.<init> Opening Searcher@2c5a4a89 main
[junit4:junit4]   2> 1418 T3429 oasu.CommitTracker.<init> Soft AutoCommit: disabled
[junit4:junit4]   2> 1417 T3392 oasc.SolrCore.registerSearcher [00000_core] Registered new searcher Searcher@5621c755 main{StandardDirectoryReader(segments_1:1)}
[junit4:junit4]   2> 1417 T3389 oasu.CommitTracker.<init> Hard AutoCommit: disabled
[junit4:junit4]   2> 1417 T3447 oasc.SolrCore.registerSearcher [00014_core] Registered new searcher Searcher@53834c24 main{StandardDirectoryReader(segments_1:1)}
[junit4:junit4]   2> 1417 T3418 oasc.SolrCore.registerSearcher [00008_core] Registered new searcher Searcher@6fd6782f main{StandardDirectoryReader(segments_1:1)}
[junit4:junit4]   2> 1416 T3432 oasc.SolrCore.registerSearcher [00018_core] Registered new searcher Searcher@588b55ad main{StandardDirectoryReader(segments_1:1)}
[junit4:junit4]   2> 1420 T3418 oasu.CommitTracker.<init> Hard AutoCommit: disabled
[junit4:junit4]   2> 1416 T3391 oasc.SolrCore.registerSearcher [00003_core] Registered new searcher Searcher@6000d456 main{StandardDirectoryReader(segments_1:1)}
[junit4:junit4]   2> 1421 T3418 oasu.CommitTracker.<init> Soft AutoCommit: disabled
[junit4:junit4]   2> 1416 T3426 oasc.SolrCore.registerSearcher [00005_core] Registered new searcher Searcher@b91b7c9 main{StandardDirectoryReader(segments_1:1)}
[junit4:junit4]   2> 1421 T3432 oasu.CommitTracker.<init> Hard AutoCommit: disabled
[junit4:junit4]   2> 1420 T3447 oasu.CommitTracker.<init> Hard AutoCommit: disabled
[junit4:junit4]   2> 1419 T3388 oasc.SolrCore.registerSearcher [00015_core] Registered new searcher Searcher@2c5a4a89 main{StandardDirectoryReader(segments_1:1)}
[junit4:junit4]   2> 1419 T3439 oasc.SolrCore.registerSearcher [00007_core] Registered new searcher Searcher@56748b57 main{StandardDirectoryReader(segments_1:1)}
[junit4:junit4]   2> 1419 T3389 oasu.CommitTracker.<init> Soft AutoCommit: disabled
[junit4:junit4]   2> 1419 T3392 oasu.CommitTracker.<init> Hard AutoCommit: disabled
[junit4:junit4]   2> 1419 T3390 oasc.SolrCore.registerSearcher [00002_core] Registered new searcher Searcher@49904418 main{StandardDirectoryReader(segments_1:1)}
[junit4:junit4]   2> 1423 T3392 oasu.CommitTracker.<init> Soft AutoCommit: disabled
[junit4:junit4]   2> 1419 T3430 oasc.SolrCore.registerSearcher [00001_core] Registered new searcher Searcher@eb20583 main{StandardDirectoryReader(segments_1:1)}
[junit4:junit4]   2> 1418 T3394 oasc.SolrCore.registerSearcher [00010_core] Registered new searcher Searcher@eb20583 main{StandardDirectoryReader(segments_1:1)}
[junit4:junit4]   2> 1423 T3439 oasu.CommitTracker.<init> Hard AutoCommit: disabled
[junit4:junit4]   2> 1422 T3388 oasu.CommitTracker.<init> Hard AutoCommit: disabled
[junit4:junit4]   2> 1422 T3447 oasu.CommitTracker.<init> Soft AutoCommit: disabled
[junit4:junit4]   2> 1425 T3388 oasu.CommitTracker.<init> Soft AutoCommit: disabled
[junit4:junit4]   2> 1422 T3432 oasu.CommitTracker.<init> Soft AutoCommit: disabled
[junit4:junit4]   2> 1422 T3426 oasu.CommitTracker.<init> Hard AutoCommit: disabled
[junit4:junit4]   2> 1425 T3418 oasc.CoreMaps.putTransientCore Opening transient core 00008_core
[junit4:junit4]   2> 1421 T3445 oasc.SolrCore.registerSearcher [00009_core] Registered new searcher Searcher@1a3eb9ab main{StandardDirectoryReader(segments_1:1)}
[junit4:junit4]   2> 1421 T3391 oasu.CommitTracker.<init> Hard AutoCommit: disabled
[junit4:junit4]   2> 1426 T3418 oasc.CoreContainer.registerCore registering core: 00008_core
[junit4:junit4]   2> 1426 T3426 oasu.CommitTracker.<init> Soft AutoCommit: disabled
[junit4:junit4]   2> 1427 T3391 oasu.CommitTracker.<init> Soft AutoCommit: disabled
[junit4:junit4]   2> 1424 T3439 oasu.CommitTracker.<init> Soft AutoCommit: disabled
[junit4:junit4]   2> 1424 T3394 oasu.CommitTracker.<init> Hard AutoCommit: disabled
[junit4:junit4]   2> 1424 T3430 oasu.CommitTracker.<init> Hard AutoCommit: disabled
[junit4:junit4]   2> 1428 T3394 oasu.CommitTracker.<init> Soft AutoCommit: disabled
[junit4:junit4]   2> 1424 T3429 oasc.CoreMaps.putTransientCore Opening transient core 00016_core
[junit4:junit4]   2> 1428 T3430 oasu.CommitTracker.<init> Soft AutoCommit: disabled
[junit4:junit4]   2> 1424 T3390 oasu.CommitTracker.<init> Hard AutoCommit: disabled
[junit4:junit4]   2> 1429 T3429 oasc.CoreContainer.registerCore registering core: 00016_core
[junit4:junit4]   2> 1427 T3445 oasu.CommitTracker.<init> Hard AutoCommit: disabled
[junit4:junit4]   2> 1429 T3390 oasu.CommitTracker.<init> Soft AutoCommit: disabled
[junit4:junit4]   2> 1429 T3445 oasu.CommitTracker.<init> Soft AutoCommit: disabled
[junit4:junit4]   2> 1429 T3392 oasc.CoreMaps.putTransientCore Opening transient core 00000_core
[junit4:junit4]   2> 1429 T3389 oasc.CoreMaps.putTransientCore Opening transient core 00019_core
[junit4:junit4]   2> 1431 T3392 oasc.CoreContainer.registerCore registering core: 00000_core
[junit4:junit4]   2> 1431 T3389 oasc.CoreContainer.registerCore registering core: 00019_core
[junit4:junit4]   2> 1439 T3432 oasc.CoreMaps.putTransientCore Opening transient core 00018_core
[junit4:junit4]   2> 1440 T3432 oasc.CoreContainer.registerCore registering core: 00018_core
[junit4:junit4]   2> ASYNC  NEW_CORE C200 name=00016_core org.apache.solr.core.SolrCore@4bdacc2e
[junit4:junit4]   2> 1440 T3440 C200 REQ [00016_core] webapp=/solr path=/select params={q=*:*&wt=javabin&qt=/select&version=2} hits=0 status=0 QTime=0 
[junit4:junit4]   2> 1440 T3438 C200 REQ [00016_core] webapp=/solr path=/select params={q=*:*&wt=javabin&qt=/select&version=2} hits=0 status=0 QTime=0 
[junit4:junit4]   2> 1442 T3444 C200 REQ [00016_core] webapp=/solr path=/select params={q=*:*&wt=javabin&qt=/select&version=2} hits=0 status=0 QTime=0 
[junit4:junit4]   2> ASYNC  NEW_CORE C201 name=00000_core org.apache.solr.core.SolrCore@12a16407
[junit4:junit4]   2> 1444 T3434 C201 REQ [00000_core] webapp=/solr path=/select params={q=*:*&wt=javabin&qt=/select&version=2} hits=0 status=0 QTime=0 
[junit4:junit4]   2> ASYNC  NEW_CORE C202 name=00008_core org.apache.solr.core.SolrCore@2ae61b7f
[junit4:junit4]   2> 1444 T3418 C202 oasc.SolrDeletionPolicy.onInit SolrDeletionPolicy.onInit: commits:num=1
[junit4:junit4]   2> 		commit{dir=MockDirWrapper(RateLimitedDirectoryWrapper(NRTCachingDirectory(org.apache.lucene.store.MMapDirectory@/usr/home/hudson/hudson-slave/workspace/Lucene-Solr-Tests-trunk-java7/solr/build/solr-core/test/J0/OpenCloseCoreStressTest_/00008_core/data/index lockFactory=org.apache.lucene.store.NativeFSLockFactory@6100ebf5; maxCacheMB=0.4072265625 maxMergeSizeMB=0.82421875))),segFN=segments_1,generation=1,filenames=[segments_1]
[junit4:junit4]   2> 1445 T3418 C202 oasc.SolrDeletionPolicy.updateCommits newest commit = 1[segments_1]
[junit4:junit4]   2> 1446 T3393 C201 oasc.SolrDeletionPolicy.onInit SolrDeletionPolicy.onInit: commits:num=1
[junit4:junit4]   2> 		commit{dir=MockDirWrapper(RateLimitedDirectoryWrapper(NRTCachingDirectory(org.apache.lucene.store.MMapDirectory@/usr/home/hudson/hudson-slave/workspace/Lucene-Solr-Tests-trunk-java7/solr/build/solr-core/test/J0/OpenCloseCoreStressTest_/00000_core/data/index lockFactory=org.apache.lucene.store.NativeFSLockFactory@24c48a2; maxCacheMB=0.4072265625 maxMergeSizeMB=0.82421875))),segFN=segments_1,generation=1,filenames=[segments_1]
[junit4:junit4]   2> 1445 T3388 oasc.CoreMaps.putTransientCore Opening transient core 00015_core
[junit4:junit4]   2> 1445 T3429 C200 oasc.SolrDeletionPolicy.onInit SolrDeletionPolicy.onInit: commits:num=1
[junit4:junit4]   2> 		commit{dir=MockDirWrapper(RateLimitedDirectoryWrapper(NRTCachingDirectory(org.apache.lucene.store.MMapDirectory@/usr/home/hudson/hudson-slave/workspace/Lucene-Solr-Tests-trunk-java7/solr/build/solr-core/test/J0/OpenCloseCoreStressTest_/00016_core/data/index lockFactory=org.apache.lucene.store.NativeFSLockFactory@325ebe8b; maxCacheMB=0.4072265625 maxMergeSizeMB=0.82421875))),segFN=segments_1,generation=1,filenames=[segments_1]
[junit4:junit4]   2> 1446 T3393 C201 oasc.SolrDeletionPolicy.updateCommits newest commit = 1[segments_1]
[junit4:junit4]   2> 1447 T3429 C200 oasc.SolrDeletionPolicy.updateCommits newest commit = 1[segments_1]
[junit4:junit4]   2> 1447 T3388 oasc.CoreContainer.registerCore registering core: 00015_core
[junit4:junit4]   2> ASYNC  NEW_CORE C203 name=00019_core org.apache.solr.core.SolrCore@5e3484db
[junit4:junit4]   2> 1447 T3389 C203 oasc.SolrDeletionPolicy.onInit SolrDeletionPolicy.onInit: commits:num=1
[junit4:junit4]   2> 		commit{dir=MockDirWrapper(RateLimitedDirectoryWrapper(NRTCachingDirectory(org.apache.lucene.store.MMapDirectory@/usr/home/hudson/hudson-slave/workspace/Lucene-Solr-Tests-trunk-java7/solr/build/solr-core/test/J0/OpenCloseCoreStressTest_/00019_core/data/index lockFactory=org.apache.lucene.store.NativeFSLockFactory@1803a639; maxCacheMB=0.4072265625 maxMergeSizeMB=0.82421875))),segFN=segments_1,generation=1,filenames=[segments_1]
[junit4:junit4]   2> 1447 T3447 oasc.CoreMaps.putTransientCore Opening transient core 00014_core
[junit4:junit4]   2> 1448 T3389 C203 oasc.SolrDeletionPolicy.updateCommits newest commit = 1[segments_1]
[junit4:junit4]   2> 1448 T3447 oasc.CoreContainer.registerCore registering core: 00014_core
[junit4:junit4]   2> 1448 T3418 C202 UPDATE [00008_core] webapp=/solr path=/update params={wt=javabin&version=2} {add=[id8]} 0 11
[junit4:junit4]   2> 1449 T3393 C201 UPDATE [00000_core] webapp=/solr path=/update params={wt=javabin&version=2} {add=[id6]} 0 9
[junit4:junit4]   2> 1450 T3392 C201 UPDATE [00000_core] webapp=/solr path=/update params={wt=javabin&version=2} {add=[id5]} 0 7
[junit4:junit4]   2> 1450 T3389 C203 UPDATE [00019_core] webapp=/solr path=/update params={wt=javabin&version=2} {add=[id2]} 0 10
[junit4:junit4]   2> 1451 T3391 oasc.CoreMaps.putTransientCore Opening transient core 00003_core
[junit4:junit4]   2> 1451 T3391 oasc.CoreContainer.registerCore registering core: 00003_core
[junit4:junit4]   2> 1452 T3394 oasc.CoreMaps.putTransientCore Opening transient core 00010_core
[junit4:junit4]   2> 1452 T3430 oasc.CoreMaps.putTransientCore Opening transient core 00001_core
[junit4:junit4]   2> 1452 T3439 oasc.CoreMaps.putTransientCore Opening transient core 00007_core
[junit4:junit4]   2> 1452 T3426 oasc.CoreMaps.putTransientCore Opening transient core 00005_core
[junit4:junit4]   2> 1452 T3390 oasc.CoreMaps.putTransientCore Opening transient core 00002_core
[junit4:junit4]   2> 1452 T3429 C200 UPDATE [00016_core] webapp=/solr path=/update params={wt=javabin&version=2} {add=[id10]} 0 12
[junit4:junit4]   2> 1453 T3395 oasc.SolrCore.close [00008_core]  CLOSING SolrCore org.apache.solr.core.SolrCore@2ae61b7f
[junit4:junit4]   2> 1453 T3390 oasc.CoreContainer.registerCore registering core: 00002_core
[junit4:junit4]   2> 1453 T3445 oasc.CoreMaps.putTransientCore Opening transient core 00009_core
[junit4:junit4]   2> 1452 T3439 oasc.CoreContainer.registerCore registering core: 00007_core
[junit4:junit4]   2> 1452 T3393 oasc.CoreContainer.create Creating SolrCore '00004_core' using instanceDir: /usr/home/hudson/hudson-slave/workspace/Lucene-Solr-Tests-trunk-java7/solr/build/solr-core/test/J0/./OpenCloseCoreStressTest_/00004_core
[junit4:junit4]   2> 1452 T3394 oasc.CoreContainer.registerCore registering core: 00010_core
[junit4:junit4]   2> 1454 T3445 oasc.CoreContainer.registerCore registering core: 00009_core
[junit4:junit4]   2> 1454 T3430 oasc.CoreContainer.registerCore registering core: 00001_core
[junit4:junit4]   2> 1453 T3418 oasc.CoreContainer.create Creating SolrCore '00012_core' using instanceDir: /usr/home/hudson/hudson-slave/workspace/Lucene-Solr-Tests-trunk-java7/solr/build/solr-core/test/J0/./OpenCloseCoreStressTest_/00012_core
[junit4:junit4]   2> 1453 T3426 oasc.CoreContainer.registerCore registering core: 00005_core
[junit4:junit4]   2> 1455 T3393 oasc.SolrResourceLoader.<init> new SolrResourceLoader for directory: '/usr/home/hudson/hudson-slave/workspace/Lucene-Solr-Tests-trunk-java7/solr/build/solr-core/test/J0/./OpenCloseCoreStressTest_/00004_core/'
[junit4:junit4]   2> 1456 T3418 oasc.SolrResourceLoader.<init> new SolrResourceLoader for directory: '/usr/home/hudson/hudson-slave/workspace/Lucene-Solr-Tests-trunk-java7/solr/build/solr-core/test/J0/./OpenCloseCoreStressTest_/00012_core/'
[junit4:junit4]   2> 1459 T3395 oasu.DirectUpdateHandler2.close closing DirectUpdateHandler2{commits=0,autocommits=0,soft autocommits=0,optimizes=0,rollbacks=0,expungeDeletes=0,docsPending=1,adds=1,deletesById=0,deletesByQuery=0,errors=0,cumulative_adds=1,cumulative_deletesById=0,cumulative_deletesByQuery=0,cumulative_errors=0}
[junit4:junit4]   2> 1462 T3395 oasu.SolrCoreState.decrefSolrCoreState Closing SolrCoreState
[junit4:junit4]   2> 1462 T3395 oasu.DefaultSolrCoreState.closeIndexWriter SolrCoreState ref count has reached 0 - closing IndexWriter
[junit4:junit4]   2> 1462 T3395 oasu.DefaultSolrCoreState.closeIndexWriter closing IndexWriter with IndexWriterCloser
[junit4:junit4]   2> ASYNC  NEW_CORE C204 name=00002_core org.apache.solr.core.SolrCore@6cfa622f
[junit4:junit4]   2> 1525 T3435 C204 REQ [00002_core] webapp=/solr path=/select params={q=*:*&wt=javabin&qt=/select&version=2} hits=0 status=0 QTime=1 
[junit4:junit4]   2> ASYNC  NEW_CORE C205 name=00010_core org.apache.solr.core.SolrCore@3fff92cf
[junit4:junit4]   2> 1526 T3443 C205 REQ [00010_core] webapp=/solr path=/select params={q=*:*&wt=javabin&qt=/select&version=2} hits=0 status=0 QTime=0 
[junit4:junit4]   2> ASYNC  NEW_CORE C206 name=00001_core org.apache.solr.core.SolrCore@1e03316a
[junit4:junit4]   2> 1526 T3442 C206 REQ [00001_core] webapp=/solr path=/select params={q=*:*&wt=javabin&qt=/select&version=2} hits=0 status=0 QTime=0 
[junit4:junit4]   2> ASYNC  NEW_CORE C207 name=00003_core org.apache.solr.core.SolrCore@efde9c9
[junit4:junit4]   2> 1526 T3441 C207 REQ [00003_core] webapp=/solr path=/select params={q=*:*&wt=javabin&qt=/select&version=2} hits=0 status=0 QTime=0 
[junit4:junit4]   2> ASYNC  NEW_CORE C208 name=00015_core org.apache.solr.core.SolrCore@72b803be
[junit4:junit4]   2> 1527 T3446 C208 REQ [00015_core] webapp=/solr path=/select params={q=*:*&wt=javabin&qt=/select&version=2} hits=0 status=0 QTime=0 
[junit4:junit4]   2> ASYNC  NEW_CORE C209 name=00018_core org.apache.solr.core.SolrCore@72e40b64
[junit4:junit4]   2> 1581 T3432 C209 oasc.SolrDeletionPolicy.onInit SolrDeletionPolicy.onInit: commits:num=1
[junit4:junit4]   2> 		commit{dir=MockDirWrapper(RateLimitedDirectoryWrapper(NRTCachingDirectory(org.apache.lucene.store.MMapDirectory@/usr/home/hudson/hudson-slave/workspace/Lucene-Solr-Tests-trunk-java7/solr/build/solr-core/test/J0/OpenCloseCoreStressTest_/00018_core/data/index lockFactory=org.apache.lucene.store.NativeFSLockFactory@68d1b7e5; maxCacheMB=0.4072265625 maxMergeSizeMB=0.82421875))),segFN=segments_1,generation=1,filenames=[segments_1]
[junit4:junit4]   2> 1582 T3432 C209 oasc.SolrDeletionPolicy.updateCommits newest commit = 1[segments_1]
[junit4:junit4]   2> ASYNC  NEW_CORE C210 name=00014_core org.apache.solr.core.SolrCore@528fffbd
[junit4:junit4]   2> 1581 T3447 C210 REQ [00014_core] webapp=/solr path=/select params={q=*:*&wt=javabin&qt=/select&version=2} hits=0 status=0 QTime=0 
[junit4:junit4]   2> ASYNC  NEW_CORE C211 name=00005_core org.apache.solr.core.SolrCore@e8bf740
[junit4:junit4]   2> 1581 T3436 C211 REQ [00005_core] webapp=/solr path=/select params={q=*:*&wt=javabin&qt=/select&version=2} hits=0 status=0 QTime=0 
[junit4:junit4]   2> 1585 T3448 C206 REQ [00001_core] webapp=/solr path=/select params={q=*:*&wt=javabin&qt=/select&version=2} hits=0 status=0 QTime=1 
[junit4:junit4]   2> ASYNC  NEW_CORE C212 name=00009_core org.apache.solr.core.SolrCore@30198a54
[junit4:junit4]   2> 1581 T3445 C212 REQ [00009_core] webapp=/solr path=/select params={q=*:*&wt=javabin&qt=/select&version=2} hits=0 status=0 QTime=0 
[junit4:junit4]   2> 1596 T3432 C209 UPDATE [00018_core] webapp=/solr path=/update params={wt=javabin&version=2} {add=[id12]} 0 140
[junit4:junit4]   2> 1598 T3433 C209 UPDATE [00018_core] webapp=/solr path=/update params={wt=javabin&version=2} {add=[id15]} 0 134
[junit4:junit4]   2> ASYNC  NEW_CORE C213 name=00007_core org.apache.solr.core.SolrCore@66060f81
[junit4:junit4]   2> 1599 T3439 C213 REQ [00007_core] webapp=/solr path=/select params={q=*:*&wt=javabin&qt=/select&version=2} hits=0 status=0 QTime=1 
[junit4:junit4]   2> 1604 T3432 oasc.CoreContainer.create Creating SolrCore '00006_core' using instanceDir: /usr/home/hudson/hudson-slave/workspace/Lucene-Solr-Tests-trunk-java7/solr/build/solr-core/test/J0/./OpenCloseCoreStressTest_/00006_core
[junit4:junit4]   2> 1608 T3432 oasc.SolrResourceLoader.<init> new SolrResourceLoader for directory: '/usr/home/hudson/hudson-slave/workspace/Lucene-Solr-Tests-trunk-java7/solr/build/solr-core/test/J0/./OpenCloseCoreStressTest_/00006_core/'
[junit4:junit4]   2> 1611 T3437 C204 REQ [00002_core] webapp=/solr path=/select params={q=*:*&wt=javabin&qt=/select&version=2} hits=0 status=0 QTime=0 
[junit4:junit4]   2> 1613 T3394 C205 oasc.SolrDeletionPolicy.onInit SolrDeletionPolicy.onInit: commits:num=1
[junit4:junit4]   2> 		commit{dir=MockDirWrapper(RateLimitedDirectoryWrapper(NRTCachingDirectory(org.apache.lucene.store.MMapDirectory@/usr/home/hudson/hudson-slave/workspace/Lucene-Solr-Tests-trunk-java7/solr/build/solr-core/test/J0/OpenCloseCoreStressTest_/00010_core/data/index lockFactory=org.apache.lucene.store.NativeFSLockFactory@76a93875; maxCacheMB=0.4072265625 maxMergeSizeMB=0.82421875))),segFN=segments_1,generation=1,filenames=[segments_1]
[junit4:junit4]   2> 1613 T3394 C205 oasc.SolrDeletionPolicy.updateCommits newest commit = 1[segments_1]
[junit4:junit4]   2> 1614 T3391 C207 oasc.SolrDeletionPolicy.onInit SolrDeletionPolicy.onInit: commits:num=1
[junit4:junit4]   2> 		commit{dir=MockDirWrapper(RateLimitedDirectoryWrapper(NRTCachingDirectory(org.apache.lucene.store.MMapDirectory@/usr/home/hudson/hudson-slave/workspace/Lucene-Solr-Tests-trunk-java7/solr/build/solr-core/test/J0/OpenCloseCoreStressTest_/00003_core/data/index lockFactory=org.apache.lucene.store.NativeFSLockFactory@5a8eb7a0; maxCacheMB=0.4072265625 maxMergeSizeMB=0.82421875))),segFN=segments_1,generation=1,filenames=[segments_1]
[junit4:junit4]   2> 1615 T3391 C207 oasc.SolrDeletionPolicy.updateCommits newest commit = 1[segments_1]
[junit4:junit4]   2> 1616 T3390 C204 oasc.SolrDeletionPolicy.onInit SolrDeletionPolicy.onInit: commits:num=1
[junit4:junit4]   2> 		commit{dir=MockDirWrapper(RateLimitedDirectoryWrapper(NRTCachingDirectory(org.apache.lucene.store.MMapDirectory@/usr/home/hudson/hudson-slave/workspace/Lucene-Solr-Tests-trunk-java7/solr/build/solr-core/test/J0/OpenCloseCoreStressTest_/00002_core/data/index lockFactory=org.apache.lucene.store.NativeFSLockFactory@64f5f3bf; maxCacheMB=0.4072265625 maxMergeSizeMB=0.82421875))),segFN=segments_1,generation=1,filenames=[segments_1]
[junit4:junit4]   2> 1617 T3390 C204 oasc.SolrDeletionPolicy.updateCommits newest commit = 1[segments_1]
[junit4:junit4]   2> 1620 T3394 C205 UPDATE [00010_core] webapp=/solr path=/update params={wt=javabin&version=2} {add=[id7]} 0 98
[junit4:junit4]   2> 1621 T3422 C205 UPDATE [00010_core] webapp=/solr path=/update params={wt=javabin&version=2} {add=[id9]} 0 15
[junit4:junit4]   2> 1622 T3391 C207 UPDATE [00003_core] webapp=/solr path=/update params={wt=javabin&version=2} {add=[id4]} 0 96
[junit4:junit4]   2> 1623 T3430 C206 oasc.SolrDeletionPolicy.onInit SolrDeletionPolicy.onInit: commits:num=1
[junit4:junit4]   2> 		commit{dir=MockDirWrapper(RateLimitedDirectoryWrapper(NRTCachingDirectory(org.apache.lucene.store.MMapDirectory@/usr/home/hudson/hudson-slave/workspace/Lucene-Solr-Tests-trunk-java7/solr/build/solr-core/test/J0/OpenCloseCoreStressTest_/00001_core/data/index lockFactory=org.apache.lucene.store.NativeFSLockFactory@8e98f16; maxCacheMB=0.4072265625 maxMergeSizeMB=0.82421875))),segFN=segments_1,generation=1,filenames=[segments_1]
[junit4:junit4]   2> 1623 T3390 C204 UPDATE [00002_core] webapp=/solr path=/update params={wt=javabin&version=2} {add=[id3]} 0 43
[junit4:junit4]   2> 1623 T3430 C206 oasc.SolrDeletionPolicy.updateCommits newest commit = 1[segments_1]
[junit4:junit4]   2> 1625 T3422 C204 UPDATE [00002_core] webapp=/solr path=/update params={wt=javabin&version=2} {add=[id24]} 0 1
[junit4:junit4]   2> 1626 T3391 C205 UPDATE [00010_core] webapp=/solr path=/update params={wt=javabin&version=2} {add=[id25]} 0 0
[junit4:junit4]   2> 1630 T3442 oasc.CoreContainer.create Creating SolrCore '00017_core' using instanceDir: /usr/home/hudson/hudson-slave/workspace/Lucene-Solr-Tests-trunk-java7/solr/build/solr-core/test/J0/./OpenCloseCoreStressTest_/00017_core
[junit4:junit4]   2> 1630 T3435 C206 REQ [00001_core] webapp=/solr path=/select params={q=*:*&wt=javabin&qt=/select&version=2} hits=0 status=0 QTime=0 
[junit4:junit4]   2> 1632 T3430 C206 UPDATE [00001_core] webapp=/solr path=/update params={wt=javabin&version=2} {add=[id14]} 0 51
[junit4:junit4]   2> 1633 T3442 oasc.SolrResourceLoader.<init> new SolrResourceLoader for directory: '/usr/home/hudson/hudson-slave/workspace/Lucene-Solr-Tests-trunk-java7/solr/build/solr-core/test/J0/./OpenCloseCoreStressTest_/00017_core/'
[junit4:junit4]   2> 1634 T3388 C208 oasc.SolrDeletionPolicy.onInit SolrDeletionPolicy.onInit: commits:num=1
[junit4:junit4]   2> 		commit{dir=MockDirWrapper(RateLimitedDirectoryWrapper(NRTCachingDirectory(org.apache.lucene.store.MMapDirectory@/usr/home/hudson/hudson-slave/workspace/Lucene-Solr-Tests-trunk-java7/solr/build/solr-core/test/J0/OpenCloseCoreStressTest_/00015_core/data/index lockFactory=org.apache.lucene.store.NativeFSLockFactory@4fb997d2; maxCacheMB=0.4072265625 maxMergeSizeMB=0.82421875))),segFN=segments_1,generation=1,filenames=[segments_1]
[junit4:junit4]   2> 1636 T3388 C208 oasc.SolrDeletionPolicy.updateCommits newest commit = 1[segments_1]
[junit4:junit4]   2> 1641 T3431 C211 oasc.SolrDeletionPolicy.onInit SolrDeletionPolicy.onInit: commits:num=1
[junit4:junit4]   2> 		commit{dir=MockDirWrapper(RateLimitedDirectoryWrapper(NRTCachingDirectory(org.apache.lucene.store.MMapDirectory@/usr/home/hudson/hudson-slave/workspace/Lucene-Solr-Tests-trunk-java7/solr/build/solr-core/test/J0/OpenCloseCoreStressTest_/00005_core/data/index lockFactory=org.apache.lucene.store.NativeFSLockFactory@219e84e2; maxCacheMB=0.4072265625 maxMergeSizeMB=0.82421875))),segFN=segments_1,generation=1,filenames=[segments_1]
[junit4:junit4]   2> 1642 T3431 C211 oasc.SolrDeletionPolicy.updateCommits newest commit = 1[segments_1]
[junit4:junit4]   2> 1650 T3430 C208 UPDATE [00015_core] webapp=/solr path=/update params={wt=javabin&version=2} {add=[id29]} 0 14
[junit4:junit4]   2> 1650 T3388 C208 UPDATE [00015_core] webapp=/solr path=/update params={wt=javabin&version=2} {add=[id1]} 0 63
[junit4:junit4]   2> 1651 T3429 C212 oasc.SolrDeletionPolicy.onInit SolrDeletionPolicy.onInit: commits:num=1
[junit4:junit4]   2> 		commit{dir=MockDirWrapper(RateLimitedDirectoryWrapper(NRTCachingDirectory(org.apache.lucene.store.MMapDirectory@/usr/home/hudson/hudson-slave/workspace/Lucene-Solr-Tests-trunk-java7/solr/build/solr-core/test/J0/OpenCloseCoreStressTest_/00009_core/data/index lockFactory=org.apache.lucene.store.NativeFSLockFactory@62805b26; maxCacheMB=0.4072265625 maxMergeSizeMB=0.82421875))),segFN=segments_1,generation=1,filenames=[segments_1]
[junit4:junit4]   2> 1651 T3429 C212 oasc.SolrDeletionPolicy.updateCommits newest commit = 1[segments_1]
[junit4:junit4]   2> 1654 T3388 oasc.CoreContainer.create Creating SolrCore '00011_core' using instanceDir: /usr/home/hudson/hudson-slave/workspace/Lucene-Solr-Tests-trunk-java7/solr/build/solr-core/test/J0/./OpenCloseCoreStressTest_/00011_core
[junit4:junit4]   2> 1658 T3429 C212 UPDATE [00009_core] webapp=/solr path=/update params={wt=javabin&version=2} {add=[id20]} 0 49
[junit4:junit4]   2> 1658 T3430 C212 UPDATE [00009_core] webapp=/solr path=/update params={wt=javabin&version=2} {add=[id31]} 0 4
[junit4:junit4]   2> 1658 T3388 oasc.SolrResourceLoader.<init> new SolrResourceLoader for directory: '/usr/home/hudson/hudson-slave/workspace/Lucene-Solr-Tests-trunk-java7/solr/build/solr-core/test/J0/./OpenCloseCoreStressTest_/00011_core/'
[junit4:junit4]   2> 1663 T3433 C211 UPDATE [00005_core] webapp=/solr path=/update params={wt=javabin&version=2} {add=[id22]} 0 53
[junit4:junit4]   2> 1663 T3426 C211 UPDATE [00005_core] webapp=/solr path=/update params={wt=javabin&version=2} {add=[id11]} 0 54
[junit4:junit4]   2> 1663 T3390 C211 UPDATE [00005_core] webapp=/solr path=/update params={wt=javabin&version=2} {add=[id26]} 0 35
[junit4:junit4]   2> 1663 T3431 C211 UPDATE [00005_core] webapp=/solr path=/update params={wt=javabin&version=2} {add=[id13]} 0 65
[junit4:junit4]   2> 1664 T3430 C209 UPDATE [00018_core] webapp=/solr path=/update params={wt=javabin&version=2} {add=[id33]} 0 1
[junit4:junit4]   2> 1664 T3444 C210 REQ [00014_core] webapp=/solr path=/select params={q=*:*&wt=javabin&qt=/select&version=2} hits=0 status=0 QTime=0 
[junit4:junit4]   2> 1666 T3394 C213 oasc.SolrDeletionPolicy.onInit SolrDeletionPolicy.onInit: commits:num=1
[junit4:junit4]   2> 		commit{dir=MockDirWrapper(RateLimitedDirectoryWrapper(NRTCachingDirectory(org.apache.lucene.store.MMapDirectory@/usr/home/hudson/hudson-slave/workspace/Lucene-Solr-Tests-trunk-java7/solr/build/solr-core/test/J0/OpenCloseCoreStressTest_/00007_core/data/index lockFactory=org.apache.lucene.store.NativeFSLockFactory@232fa55b; maxCacheMB=0.4072265625 maxMergeSizeMB=0.82421875))),segFN=segments_1,generation=1,filenames=[segments_1]
[junit4:junit4]   2> 1667 T3431 C212 UPDATE [00009_core] webapp=/solr path=/update params={wt=javabin&version=2} {add=[id37]} 0 1
[junit4:junit4]   2> 1667 T3390 C212 UPDATE [00009_core] webapp=/solr path=/update params={wt=javabin&version=2} {add=[id36]} 0 1
[junit4:junit4]   2> 1667 T3426 C206 UPDATE [00001_core] webapp=/solr path=/update params={wt=javabin&version=2} {add=[id35]} 0 1
[junit4:junit4]   2> 1668 T3394 C213 oasc.SolrDeletionPolicy.updateCommits newest commit = 1[segments_1]
[junit4:junit4]   2> 1670 T3422 C210 oasc.SolrDeletionPolicy.onInit SolrDeletionPolicy.onInit: commits:num=1
[junit4:junit4]   2> 		commit{dir=MockDirWrapper(RateLimitedDirectoryWrapper(NRTCachingDirectory(org.apache.lucene.store.MMapDirectory@/usr/home/hudson/hudson-slave/workspace/Lucene-Solr-Tests-trunk-java7/solr/build/solr-core/test/J0/OpenCloseCoreStressTest_/00014_core/data/index lockFactory=org.apache.lucene.store.NativeFSLockFactory@34ff6dbb; maxCacheMB=0.4072265625 maxMergeSizeMB=0.82421875))),segFN=segments_1,generation=1,filenames=[segments_1]
[junit4:junit4]   2> 1671 T3422 C210 oasc.SolrDeletionPolicy.updateCommits newest commit = 1[segments_1]
[junit4:junit4]   2> 1676 T3394 C213 UPDATE [00007_core] webapp=/solr path=/update params={wt=javabin&version=2} {add=[id23]} 0 52
[junit4:junit4]   2> 1676 T3391 C213 UPDATE [00007_core] webapp=/solr path=/update params={wt=javabin&version=2} {add=[id28]} 0 47
[junit4:junit4]   2> 1676 T3426 C213 UPDATE [00007_core] webapp=/solr path=/update params={wt=javabin&version=2} {add=[id41]} 0 6
[junit4:junit4]   2> 1678 T3434 C210 REQ [00014_core] webapp=/solr path=/select params={q=*:*&wt=javabin&qt=/select&version=2} hits=0 status=0 QTime=1 
[junit4:junit4]   2> 1678 T3422 C210 UPDATE [00014_core] webapp=/solr path=/update params={wt=javabin&version=2} {add=[id27]} 0 48
[junit4:junit4]   2> 1678 T3390 C210 UPDATE [00014_core] webapp=/solr path=/update params={wt=javabin&version=2} {add=[id40]} 0 8
[junit4:junit4]   2> 1678 T3440 C210 REQ [00014_core] webapp=/solr path=/select params={q=*:*&wt=javabin&qt=/select&version=2} hits=0 status=0 QTime=1 
[junit4:junit4]   2> 1678 T3429 C210 UPDATE [00014_core] webapp=/solr path=/update params={wt=javabin&version=2} {add=[id32]} 0 17
[junit4:junit4]   2> 1680 T3394 C212 UPDATE [00009_core] webapp=/solr path=/update params={wt=javabin&version=2} {add=[id42]} 0 1
[junit4:junit4]   2> 1681 T3422 oasc.CoreContainer.create Creating SolrCore '00013_core' using instanceDir: /usr/home/hudson/hudson-slave/workspace/Lucene-Solr-Tests-trunk-java7/solr/build/solr-core/test/J0/./OpenCloseCoreStressTest_/00013_core
[junit4:junit4]   2> 1682 T3422 oasc.SolrResourceLoader.<init> new SolrResourceLoader for directory: '/usr/home/hudson/hudson-slave/workspace/Lucene-Solr-Tests-trunk-java7/solr/build/solr-core/test/J0/./OpenCloseCoreStressTest_/00013_core/'
[junit4:junit4]   2> 1683 T3441 C211 REQ [00005_core] webapp=/solr path=/select params={q=*:*&wt=javabin&qt=/select&version=2} hits=0 status=0 QTime=0 
[junit4:junit4]   2> 1683 T3446 C212 REQ [00009_core] webapp=/solr path=/select params={q=*:*&wt=javabin&qt=/select&version=2} hits=0 status=0 QTime=0 
[junit4:junit4]   2> 1688 T3448 C207 REQ [00003_core] webapp=/solr path=/select params={q=*:*&wt=javabin&qt=/select&version=2} hits=0 status=0 QTime=0 
[junit4:junit4]   2> 1737 T3435 C213 REQ [00007_core] webapp=/solr path=/select params={q=*:*&wt=javabin&qt=/select&version=2} hits=0 status=0 QTime=0 
[junit4:junit4]   2> 1762 T3418 oasc.SolrConfig.<init> Using Lucene MatchVersion: LUCENE_41
[junit4:junit4]   2> 1762 T3432 oasc.SolrConfig.<init> Using Lucene MatchVersion: LUCENE_41
[junit4:junit4]   2> 1764 T3388 oasc.SolrConfig.<init> Using Lucene MatchVersion: LUCENE_41
[junit4:junit4]   2> 1764 T3442 oasc.SolrConfig.<init> Using Lucene MatchVersion: LUCENE_41
[junit4:junit4]   2> 1765 T3393 oasc.SolrConfig.<init> Using Lucene MatchVersion: LUCENE_41
[junit4:junit4]   2> 1766 T3422 oasc.SolrConfig.<init> Using Lucene MatchVersion: LUCENE_41
[junit4:junit4]   2> 1769 T3444 C204 REQ [00002_core] webapp=/solr path=/select params={q=*:*&wt=javabin&qt=/select&version=2} hits=0 status=0 QTime=1 
[junit4:junit4]   2> 1783 T3434 C206 REQ [00001_core] webapp=/solr path=/select params={q=*:*&wt=javabin&qt=/select&version=2} hits=0 status=0 QTime=1 
[junit4:junit4]   2> 1783 T3440 C211 REQ [00005_core] webapp=/solr path=/select params={q=*:*&wt=javabin&qt=/select&version=2} hits=0 status=0 QTime=1 
[junit4:junit4]   2> 1788 T3446 C208 REQ [00015_core] webapp=/solr path=/select params={q=*:*&wt=javabin&qt=/select&version=2} hits=0 status=0 QTime=1 
[junit4:junit4]   2> 1799 T3448 C210 REQ [00014_core] webapp=/solr path=/select params={q=*:*&wt=javabin&qt=/select&version=2} hits=0 status=0 QTime=1 
[junit4:junit4]   2> 1846 T3418 oasc.SolrConfig.<init> Loaded SolrConfig: solrconfig-minimal.xml
[junit4:junit4]   2> 1847 T3418 oass.IndexSchema.readSchema Reading Solr Schema
[junit4:junit4]   2> 1848 T3395 C202 oasc.SolrDeletionPolicy.onCommit SolrDeletionPolicy.onCommit: commits:num=2
[junit4:junit4]   2> 		commit{dir=MockDirWrapper(RateLimitedDirectoryWrapper(NRTCachingDirectory(org.apache.lucene.store.MMapDirectory@/usr/home/hudson/hudson-slave/workspace/Lucene-Solr-Tests-trunk-java7/solr/build/solr-core/test/J0/OpenCloseCoreStressTest_/00008_core/data/index lockFactory=org.apache.lucene.store.NativeFSLockFactory@6100ebf5; maxCacheMB=0.4072265625 maxMergeSizeMB=0.82421875))),segFN=segments_1,generation=1,filenames=[segments_1]
[junit4:junit4]   2> 		commit{dir=MockDirWrapper(RateLimitedDirectoryWrapper(NRTCachingDirectory(org.apache.lucene.store.MMapDirectory@/usr/home/hudson/hudson-slave/workspace/Lucene-Solr-Tests-trunk-java7/solr/build/solr-core/test/J0/OpenCloseCoreStressTest_/00008_core/data/index lockFactory=org.apache.lucene.store.NativeFSLockFactory@6100ebf5; maxCacheMB=0.4072265625 maxMergeSizeMB=0.82421875))),segFN=segments_2,generation=2,filenames=[_0.fnm, _0_Lucene41_0.doc, _0_Lucene41_0.pos, _0_Memory_0.ram, _0.nvd, segments_2, _0.fdx, _0.si, _0.nvm, _0_Lucene41_0.tim, _0.fdt, _0_Lucene41_0.tip]
[junit4:junit4]   2> 1848 T3395 C202 oasc.SolrDeletionPolicy.updateCommits newest commit = 2[_0.fnm, _0_Lucene41_0.doc, _0_Lucene41_0.pos, _0_Memory_0.ram, _0.nvd, segments_2, _0.fdx, _0.si, _0.nvm, _0_Lucene41_0.tim, _0.fdt, _0_Lucene41_0.tip]
[junit4:junit4]   2> 1848 T3393 oasc.SolrConfig.<init> Loaded SolrConfig: solrconfig-minimal.xml
[junit4:junit4]   2> 1849 T3388 oasc.SolrConfig.<init> Loaded SolrConfig: solrconfig-minimal.xml
[junit4:junit4]   2> 1850 T3393 oass.IndexSchema.readSchema Reading Solr Schema
[junit4:junit4]   2> 1851 T3388 oass.IndexSchema.readSchema Reading Solr Schema
[junit4:junit4]   2> 1855 T3395 oasc.SolrCore.closeSearcher [00008_core] Closing main searcher on request.
[junit4:junit4]   2> 1855 T3395 oasc.CachingDirectoryFactory.close Closing directory when closing factory: /usr/home/hudson/hudson-slave/workspace/Lucene-Solr-Tests-trunk-java7/solr/build/solr-core/test/J0/OpenCloseCoreStressTest_/00008_core/data/index
[junit4:junit4]   2> 1855 T3395 oasc.CachingDirectoryFactory.closeDirectory Closing directory: /usr/home/hudson/hudson-slave/workspace/Lucene-Solr-Tests-trunk-java7/solr/build/solr-core/test/J0/OpenCloseCoreStressTest_/00008_core/data/index
[junit4:junit4]   2> 1867 T3422 oasc.SolrConfig.<init> Loaded SolrConfig: solrconfig-minimal.xml
[junit4:junit4]   2> 1867 T3432 oasc.SolrConfig.<init> Loaded SolrConfig: solrconfig-minimal.xml
[junit4:junit4]   2> 1868 T3422 oass.IndexSchema.readSchema Reading Solr Schema
[junit4:junit4]   2> 1869 T3442 oasc.SolrConfig.<init> Loaded SolrConfig: solrconfig-minimal.xml
[junit4:junit4]   2> 1869 T3432 oass.IndexSchema.readSchema Reading Solr Schema
[junit4:junit4]   2> 1870 T3442 oass.IndexSchema.readSchema Reading Solr Schema
[junit4:junit4]   2> 1875 T3418 oass.IndexSchema.readSchema Schema name=tiny
[junit4:junit4]   2> 1875 T3393 oass.IndexSchema.readSchema Schema name=tiny
[junit4:junit4]   2> 1876 T3422 oass.IndexSchema.readSchema Schema name=tiny
[junit4:junit4]   2> 1876 T3388 oass.IndexSchema.readSchema Schema name=tiny
[junit4:junit4]   2> 1876 T3432 oass.IndexSchema.readSchema Schema name=tiny
[junit4:junit4]   2> 1876 T3442 oass.IndexSchema.readSchema Schema name=tiny
[junit4:junit4]   2> 1889 T3395 oasc.CachingDirectoryFactory.close Closing directory when closing factory: /usr/home/hudson/hudson-slave/workspace/Lucene-Solr-Tests-trunk-java7/solr/build/solr-core/test/J0/OpenCloseCoreStressTest_/00008_core/data
[junit4:junit4]   2> 1889 T3395 oasc.CachingDirectoryFactory.closeDirectory Closing directory: /usr/home/hudson/hudson-slave/workspace/Lucene-Solr-Tests-trunk-java7/solr/build/solr-core/test/J0/OpenCloseCoreStressTest_/00008_core/data
[junit4:junit4]   2> 1890 T3434 C204 REQ [00002_core] webapp=/solr path=/select params={q=*:*&wt=javabin&qt=/select&version=2} hits=0 status=0 QTime=1 
[junit4:junit4]   2> 1891 T3395 oasc.SolrCore.close [00016_core]  CLOSING SolrCore org.apache.solr.core.SolrCore@4bdacc2e
[junit4:junit4]   2> 1896 T3395 oasu.DirectUpdateHandler2.close closing DirectUpdateHandler2{commits=0,autocommits=0,soft autocommits=0,optimizes=0,rollbacks=0,expungeDeletes=0,docsPending=1,adds=1,deletesById=0,deletesByQuery=0,errors=0,cumulative_adds=1,cumulative_deletesById=0,cumulative_deletesByQuery=0,cumulative_errors=0}
[junit4:junit4]   2> 1897 T3395 oasu.SolrCoreState.decrefSolrCoreState Closing SolrCoreState
[junit4:junit4]   2> 1897 T3395 oasu.DefaultSolrCoreState.closeIndexWriter SolrCoreState ref count has reached 0 - closing IndexWriter
[junit4:junit4]   2> 1897 T3395 oasu.DefaultSolrCoreState.closeIndexWriter closing IndexWriter with IndexWriterCloser
[junit4:junit4]   2> 1904 T3448 C204 REQ [00002_core] webapp=/solr path=/select params={q=*:*&wt=javabin&qt=/select&version=2} hits=0 status=0 QTime=1 
[junit4:junit4]   2> 1933 T3422 oass.IndexSchema.readSchema unique key field: id
[junit4:junit4]   2> 1934 T3393 oass.IndexSchema.readSchema unique key field: id
[junit4:junit4]   2> 1936 T3422 oasc.SolrCore.initDirectoryFactory org.apache.solr.core.MockFSDirectoryFactory
[junit4:junit4]   2> 1936 T3393 oasc.SolrCore.initDirectoryFactory org.apache.solr.core.MockFSDirectoryFactory
[junit4:junit4]   2> 1936 T3418 oass.IndexSchema.readSchema unique key field: id
[junit4:junit4]   2> 1936 T3422 oasc.SolrCore.<init> [00013_core] Opening new SolrCore at /usr/home/hudson/hudson-slave/workspace/Lucene-Solr-Tests-trunk-java7/solr/build/solr-core/test/J0/./OpenCloseCoreStressTest_/00013_core/, dataDir=/usr/home/hudson/hudson-slave/workspace/Lucene-Solr-Tests-trunk-java7/solr/build/solr-core/test/J0/OpenCloseCoreStressTest_/00013_core/data/
[junit4:junit4]   2> 1937 T3393 oasc.SolrCore.<init> [00004_core] Opening new SolrCore at /usr/home/hudson/hudson-slave/workspace/Lucene-Solr-Tests-trunk-java7/solr/build/solr-core/test/J0/./OpenCloseCoreStressTest_/00004_core/, dataDir=/usr/home/hudson/hudson-slave/workspace/Lucene-Solr-Tests-trunk-java7/solr/build/solr-core/test/J0/OpenCloseCoreStressTest_/00004_core/data/
[junit4:junit4]   2> 1937 T3422 oasc.JmxMonitoredMap.<init> JMX monitoring is enabled. Adding Solr mbeans to JMX Server: com.sun.jmx.mbeanserver.JmxMBeanServer@3cf7366d
[junit4:junit4]   2> 1937 T3393 oasc.JmxMonitoredMap.<init> JMX monitoring is enabled. Adding Solr mbeans to JMX Server: com.sun.jmx.mbeanserver.JmxMBeanServer@3cf7366d
[junit4:junit4]   2> 1937 T3422 oasc.SolrCore.initDirectoryFactory org.apache.solr.core.MockFSDirectoryFactory
[junit4:junit4]   2> 1938 T3393 oasc.SolrCore.initDirectoryFactory org.apache.solr.core.MockFSDirectoryFactory
[junit4:junit4]   2> 1938 T3418 oasc.SolrCore.initDirectoryFactory org.apache.solr.core.MockFSDirectoryFactory
[junit4:junit4]   2> 1939 T3418 oasc.SolrCore.<init> [00012_core] Opening new SolrCore at /usr/home/hudson/hudson-slave/workspace/Lucene-Solr-Tests-trunk-java7/solr/build/solr-core/test/J0/./OpenCloseCoreStressTest_/00012_core/, dataDir=/usr/home/hudson/hudson-slave/workspace/Lucene-Solr-Tests-trunk-java7/solr/build/solr-core/test/J0/OpenCloseCoreStressTest_/00012_core/data/
[junit4:junit4]   2> 1966 T3422 oasc.CachingDirectoryFactory.get return new directory for /usr/home/hudson/hudson-slave/workspace/Lucene-Solr-Tests-trunk-java7/solr/build/solr-core/test/J0/OpenCloseCoreStressTest_/00013_core/data forceNew: false
[junit4:junit4]   2> 1966 T3393 oasc.CachingDirectoryFactory.get return new directory for /usr/home/hudson/hudson-slave/workspace/Lucene-Solr-Tests-trunk-java7/solr/build/solr-core/test/J0/OpenCloseCoreStressTest_/00004_core/data forceNew: false
[junit4:junit4]   2> 1966 T3418 oasc.JmxMonitoredMap.<init> JMX monitoring is enabled. Adding Solr mbeans to JMX Server: com.sun.jmx.mbeanserver.JmxMBeanServer@3cf7366d
[junit4:junit4]   2> 1968 T3422 oasc.SolrCore.getNewIndexDir New index directory detected: old=null new=/usr/home/hudson/hudson-slave/workspace/Lucene-Solr-Tests-trunk-java7/solr/build/solr-core/test/J0/OpenCloseCoreStressTest_/00013_core/data/index/
[junit4:junit4]   2> 1968 T3418 oasc.SolrCore.initDirectoryFactory org.apache.solr.core.MockFSDirectoryFactory
[junit4:junit4]   2> 1968 T3388 oass.IndexSchema.readSchema unique key field: id
[junit4:junit4]   2> 1968 T3393 oasc.SolrCore.getNewIndexDir New index directory detected: old=null new=/usr/home/hudson/hudson-slave/workspace/Lucene-Solr-Tests-trunk-java7/solr/build/solr-core/test/J0/OpenCloseCoreStressTest_/00004_core/data/index/
[junit4:junit4]   2> 1969 T3422 oasc.SolrCore.initIndex WARNING [00013_core] Solr index directory '/usr/home/hudson/hudson-slave/workspace/Lucene-Solr-Tests-trunk-java7/solr/build/solr-core/test/J0/OpenCloseCoreStressTest_/00013_core/data/index' doesn't exist. Creating new index...
[junit4:junit4]   2> 1968 T3432 oass.IndexSchema.readSchema unique key field: id
[junit4:junit4]   2> 1969 T3442 oass.IndexSchema.readSchema unique key field: id
[junit4:junit4]   2> 1969 T3418 oasc.CachingDirectoryFactory.get return new directory for /usr/home/hudson/hudson-slave/workspace/Lucene-Solr-Tests-trunk-java7/solr/build/solr-core/test/J0/OpenCloseCoreStressTest_/00012_core/data forceNew: false
[junit4:junit4]   2> 1970 T3422 oasc.CachingDirectoryFactory.get return new directory for /usr/home/hudson/hudson-slave/workspace/Lucene-Solr-Tests-trunk-java7/solr/build/solr-core/test/J0/OpenCloseCoreStressTest_/00013_core/data/index forceNew: false
[junit4:junit4]   2> 1970 T3393 oasc.SolrCore.initIndex WARNING [00004_core] Solr index directory '/usr/home/hudson/hudson-slave/workspace/Lucene-Solr-Tests-trunk-java7/solr/build/solr-core/test/J0/OpenCloseCoreStressTest_/00004_core/data/index' doesn't exist. Creating new index...
[junit4:junit4]   2> 1971 T3418 oasc.SolrCore.getNewIndexDir New index directory detected: old=null new=/usr/home/hudson/hudson-slave/workspace/Lucene-Solr-Tests-trunk-java7/solr/build/solr-core/test/J0/OpenCloseCoreStressTest_/00012_core/data/index/
[junit4:junit4]   2> 1971 T3388 oasc.SolrCore.initDirectoryFactory org.apache.solr.core.MockFSDirectoryFactory
[junit4:junit4]   2> 1971 T3432 oasc.SolrCore.initDirectoryFactory org.apache.solr.core.MockFSDirectoryFactory
[junit4:junit4]   2> 1971 T3442 oasc.SolrCore.initDirectoryFactory org.apache.solr.core.MockFSDirectoryFactory
[junit4:junit4]   2> 1971 T3393 oasc.CachingDirectoryFactory.get return new directory for /usr/home/hudson/hudson-slave/workspace/Lucene-Solr-Tests-trunk-java7/solr/build/solr-core/test/J0/OpenCloseCoreStressTest_/00004_core/data/index forceNew: false
[junit4:junit4]   2> 1972 T3418 oasc.SolrCore.initIndex WARNING [00012_core] Solr index directory '/usr/home/hudson/hudson-slave/workspace/Lucene-Solr-Tests-trunk-java7/solr/build/solr-core/test/J0/OpenCloseCoreStressTest_/00012_core/data/index' doesn't exist. Creating new index...
[junit4:junit4]   2> 1972 T3388 oasc.SolrCore.<init> [00011_core] Opening new SolrCore at /usr/home/hudson/hudson-slave/workspace/Lucene-Solr-Tests-trunk-java7/solr/build/solr-core/test/J0/./OpenCloseCoreStressTest_/00011_core/, dataDir=/usr/home/hudson/hudson-slave/workspace/Lucene-Solr-Tests-trunk-java7/solr/build/solr-core/test/J0/OpenCloseCoreStressTest_/00011_core/data/
[junit4:junit4]   2> 1972 T3442 oasc.SolrCore.<init> [00017_core] Opening new SolrCore at /usr/home/hudson/hudson-slave/workspace/Lucene-Solr-Tests-trunk-java7/solr/build/solr-core/test/J0/./OpenCloseCoreStressTest_/00017_core/, dataDir=/usr/home/hudson/hudson-slave/workspace/Lucene-Solr-Tests-trunk-java7/solr/build/solr-core/test/J0/OpenCloseCoreStressTest_/00017_core/data/
[junit4:junit4]   2> 1972 T3432 oasc.SolrCore.<init> [00006_core] Opening new SolrCore at /usr/home/hudson/hudson-slave/workspace/Lucene-Solr-Tests-trunk-java7/solr/build/solr-core/test/J0/./OpenCloseCoreStressTest_/00006_core/, dataDir=/usr/home/hudson/hudson-slave/workspace/Lucene-Solr-Tests-trunk-java7/solr/build/solr-core/test/J0/OpenCloseCoreStressTest_/00006_core/data/
[junit4:junit4]   2> 1973 T3442 oasc.JmxMonitoredMap.<init> JMX monitoring is enabled. Adding Solr mbeans to JMX Server: com.sun.jmx.mbeanserver.JmxMBeanServer@3cf7366d
[junit4:junit4]   2> 1972 T3388 oasc.JmxMonitoredMap.<init> JMX monitoring is enabled. Adding Solr mbeans to JMX Server: com.sun.jmx.mbeanserver.JmxMBeanServer@3cf7366d
[junit4:junit4]   2> 1973 T3432 oasc.JmxMonitoredMap.<init> JMX monitoring is enabled. Adding Solr mbeans to JMX Server: com.sun.jmx.mbeanserver.JmxMBeanServer@3cf7366d
[junit4:junit4]   2> 1973 T3442 oasc.SolrCore.initDirectoryFactory org.apache.solr.core.MockFSDirectoryFactory
[junit4:junit4]   2> 1974 T3388 oasc.SolrCore.initDirectoryFactory org.apache.solr.core.MockFSDirectoryFactory
[junit4:junit4]   2> 1974 T3432 oasc.SolrCore.initDirectoryFactory org.apache.solr.core.MockFSDirectoryFactory
[junit4:junit4]   2> 1974 T3418 oasc.CachingDirectoryFactory.get return new directory for /usr/home/hudson/hudson-slave/workspace/Lucene-Solr-Tests-trunk-java7/solr/build/solr-core/test/J0/OpenCloseCoreStressTest_/00012_core/data/index forceNew: false
[junit4:junit4]   2> 1975 T3432 oasc.CachingDirectoryFactory.get return new directory for /usr/home/hudson/hudson-slave/workspace/Lucene-Solr-Tests-trunk-java7/solr/build/solr-core/test/J0/OpenCloseCoreStressTest_/00006_core/data forceNew: false
[junit4:junit4]   2> 1976 T3388 oasc.CachingDirectoryFactory.get return new directory for /usr/home/hudson/hudson-slave/workspace/Lucene-Solr-Tests-trunk-java7/solr/build/solr-core/test/J0/OpenCloseCoreStressTest_/00011_core/data forceNew: false
[junit4:junit4]   2> 1976 T3442 oasc.CachingDirectoryFactory.get return new directory for /usr/home/hudson/hudson-slave/workspace/Lucene-Solr-Tests-trunk-java7/solr/build/solr-core/test/J0/OpenCloseCoreStressTest_/00017_core/data forceNew: false
[junit4:junit4]   2> 1977 T3442 oasc.SolrCore.getNewIndexDir New index directory detected: old=null new=/usr/home/hudson/hudson-slave/workspace/Lucene-Solr-Tests-trunk-java7/solr/build/solr-core/test/J0/OpenCloseCoreStressTest_/00017_core/data/index/
[junit4:junit4]   2> 1977 T3432 oasc.SolrCore.getNewIndexDir New index directory detected: old=null new=/usr/home/hudson/hudson-slave/workspace/Lucene-Solr-Tests-trunk-java7/solr/build/solr-core/test/J0/OpenCloseCoreStressTest_/00006_core/data/index/
[junit4:junit4]   2> 1977 T3388 oasc.SolrCore.getNewIndexDir New index directory detected: old=null new=/usr/home/hudson/hudson-slave/workspace/Lucene-Solr-Tests-trunk-java7/solr/build/solr-core/test/J0/OpenCloseCoreStressTest_/00011_core/data/index/
[junit4:junit4]   2> 1978 T3442 oasc.SolrCore.initIndex WARNING [00017_core] Solr index directory '/usr/home/hudson/hudson-slave/workspace/Lucene-Solr-Tests-trunk-java7/solr/build/solr-core/test/J0/OpenCloseCoreStressTest_/00017_core/data/index' doesn't exist. Creating new index...
[junit4:junit4]   2> 1979 T3432 oasc.SolrCore.initIndex WARNING [00006_core] Solr index directory '/usr/home/hudson/hudson-slave/workspace/Lucene-Solr-Tests-trunk-java7/solr/build/solr-core/test/J0/OpenCloseCoreStressTest_/00006_core/data/index' doesn't exist. Creating new index...
[junit4:junit4]   2> 1979 T3442 oasc.CachingDirectoryFactory.get return new directory for /usr/home/hudson/hudson-slave/workspace/Lucene-Solr-Tests-trunk-java7/solr/build/solr-core/test/J0/OpenCloseCoreStressTest_/00017_core/data/index forceNew: false
[junit4:junit4]   2> 1979 T3388 oasc.SolrCore.initIndex WARNING [00011_core] Solr index directory '/usr/home/hudson/hudson-slave/workspace/Lucene-Solr-Tests-trunk-java7/solr/build/solr-core/test/J0/OpenCloseCoreStressTest_/00011_core/data/index' doesn't exist. Creating new index...
[junit4:junit4]   2> 1980 T3432 oasc.CachingDirectoryFactory.get return new directory for /usr/home/hudson/hudson-slave/workspace/Lucene-Solr-Tests-trunk-java7/solr/build/solr-core/test/J0/OpenCloseCoreStressTest_/00006_core/data/index forceNew: false
[junit4:junit4]   2> 1980 T3388 oasc.CachingDirectoryFactory.get return new directory for /usr/home/hudson/hudson-slave/workspace/Lucene-Solr-Tests-trunk-java7/solr/build/solr-core/test/J0/OpenCloseCoreStressTest_/00011_core/data/index forceNew: false
[junit4:junit4]   2> 1994 T3434 C207 REQ [00003_core] webapp=/solr path=/select params={q=*:*&wt=javabin&qt=/select&version=2} hits=0 status=0 QTime=0 
[junit4:junit4]   2> 2020 T3422 oasc.SolrDeletionPolicy.onCommit SolrDeletionPolicy.onCommit: commits:num=1
[junit4:junit4]   2> 		commit{dir=MockDirWrapper(RateLimitedDirectoryWrapper(NRTCachingDirectory(org.apache.lucene.store.MMapDirectory@/usr/home/hudson/hudson-slave/workspace/Lucene-Solr-Tests-trunk-java7/solr/build/solr-core/test/J0/OpenCloseCoreStressTest_/00013_core/data/index lockFactory=org.apache.lucene.store.NativeFSLockFactory@362dee3c; maxCacheMB=0.4072265625 maxMergeSizeMB=0.82421875))),segFN=segments_1,generation=1,filenames=[segments_1]
[junit4:junit4]   2> 2021 T3422 oasc.SolrDeletionPolicy.updateCommits newest commit = 1[segments_1]
[junit4:junit4]   2> 2023 T3422 oasc.SolrCore.initWriters created json: solr.JSONResponseWriter
[junit4:junit4]   2> 2026 T3422 oasc.RequestHandlers.initHandlersFromConfig created /admin/: solr.admin.AdminHandlers
[junit4:junit4]   2> 2027 T3422 oasc.RequestHandlers.initHandlersFromConfig created /select: solr.SearchHandler
[junit4:junit4]   2> 2028 T3422 oasc.RequestHandlers.initHandlersFromConfig created /update: solr.UpdateRequestHandler
[junit4:junit4]   2> 2042 T3418 oasc.SolrDeletionPolicy.onCommit SolrDeletionPolicy.onCommit: commits:num=1
[junit4:junit4]   2> 		commit{dir=MockDirWrapper(org.apache.lucene.store.SimpleFSDirectory@/usr/home/hudson/hudson-slave/workspace/Lucene-Solr-Tests-trunk-java7/solr/build/solr-core/test/J0/OpenCloseCoreStressTest_/00012_core/data/index lockFactory=org.apache.lucene.store.NativeFSLockFactory@4604d3f3),segFN=segments_1,generation=1,filenames=[segments_1]
[junit4:junit4]   2> 2042 T3442 oasc.SolrDeletionPolicy.onCommit SolrDeletionPolicy.onCommit: commits:num=1
[junit4:junit4]   2> 		commit{dir=MockDirWrapper(RateLimitedDirectoryWrapper(NRTCachingDirectory(org.apache.lucene.store.MMapDirectory@/usr/home/hudson/hudson-slave/workspace/Lucene-Solr-Tests-trunk-java7/solr/build/solr-core/test/J0/OpenCloseCoreStressTest_/00017_core/data/index lockFactory=org.apache.lucene.store.NativeFSLockFactory@1aade34b; maxCacheMB=0.4072265625 maxMergeSizeMB=0.82421875))),segFN=segments_1,generation=1,filenames=[segments_1]
[junit4:junit4]   2> 2043 T3395 C200 oasc.SolrDeletionPolicy.onCommit SolrDeletionPolicy.onCommit: commits:num=2
[junit4:junit4]   2> 		commit{dir=MockDirWrapper(RateLimitedDirectoryWrapper(NRTCachingDirectory(org.apache.lucene.store.MMapDirectory@/usr/home/hudson/hudson-slave/workspace/Lucene-Solr-Tests-trunk-java7/solr/build/solr-core/test/J0/OpenCloseCoreStressTest_/00016_core/data/index lockFactory=org.apache.lucene.store.NativeFSLockFactory@325ebe8b; maxCacheMB=0.4072265625 maxMergeSizeMB=0.82421875))),segFN=segments_1,generation=1,filenames=[segments_1]
[junit4:junit4]   2> 		commit{dir=MockDirWrapper(RateLimitedDirectoryWrapper(NRTCachingDirectory(org.apache.lucene.store.MMapDirectory@/usr/home/hudson/hudson-slave/workspace/Lucene-Solr-Tests-trunk-java7/solr/build/solr-core/test/J0/OpenCloseCoreStressTest_/00016_core/data/index lockFactory=org.apache.lucene.store.NativeFSLockFactory@325ebe8b; maxCacheMB=0.4072265625 maxMergeSizeMB=0.82421875))),segFN=segments_2,generation=2,filenames=[_0.fnm, _0_Lucene41_0.doc, _0_Lucene41_0.pos, _0_Memory_0.ram, _0.nvd, segments_2, _0.fdx, _0.si, _0.nvm, _0_Lucene41_0.tim, _0.fdt, _0_Lucene41_0.tip]
[junit4:junit4]   2> 2043 T3442 oasc.SolrDeletionPolicy.updateCommits newest commit = 1[segments_1]
[junit4:junit4]   2> 2042 T3388 oasc.SolrDeletionPolicy.onCommit SolrDeletionPolicy.onCommit: commits:num=1
[junit4:junit4]   2> 		commit{dir=MockDirWrapper(org.apache.lucene.store.SimpleFSDirectory@/usr/home/hudson/hudson-slave/workspace/Lucene-Solr-Tests-trunk-java7/solr/build/solr-core/test/J0/OpenCloseCoreStressTest_/00011_core/data/index lockFactory=org.apache.lucene.store.NativeFSLockFactory@44c7193a),segFN=segments_1,generation=1,filenames=[segments_1]
[junit4:junit4]   2> 2042 T3432 oasc.SolrDeletionPolicy.onCommit SolrDeletionPolicy.onCommit: commits:num=1
[junit4:junit4]   2> 		commit{dir=MockDirWrapper(org.apache.lucene.store.SimpleFSDirectory@/usr/home/hudson/hudson-slave/workspace/Lucene-Solr-Tests-trunk-java7/solr/build/solr-core/test/J0/OpenCloseCoreStressTest_/00006_core/data/index lockFactory=org.apache.lucene.store.NativeFSLockFactory@6b49521c),segFN=segments_1,generation=1,filenames=[segments_1]
[junit4:junit4]   2> 2044 T3388 oasc.SolrDeletionPolicy.updateCommits newest commit = 1[segments_1]
[junit4:junit4]   2> 2042 T3393 oasc.SolrDeletionPolicy.onCommit SolrDeletionPolicy.onCommit: commits:num=1
[junit4:junit4]   2> 		commit{dir=MockDirWrapper(RateLimitedDirectoryWrapper(NRTCachingDirectory(org.apache.lucene.store.MMapDirectory@/usr/home/hudson/hudson-slave/workspace/Lucene-Solr-Tests-trunk-java7/solr/build/solr-core/test/J0/OpenCloseCoreStressTest_/00004_core/data/index lockFactory=org.apache.lucene.store.NativeFSLockFactory@c8428f8; maxCacheMB=0.4072265625 maxMergeSizeMB=0.82421875))),segFN=segments_1,generation=1,filenames=[segments_1]
[junit4:junit4]   2> 2044 T3432 oasc.SolrDeletionPolicy.updateCommits newest commit = 1[segments_1]
[junit4:junit4]   2> 2045 T3393 oasc.SolrDeletionPolicy.updateCommits newest commit = 1[segments_1]
[junit4:junit4]   2> 2043 T3395 C200 oasc.SolrDeletionPolicy.updateCommits newest commit = 2[_0.fnm, _0_Lucene41_0.doc, _0_Lucene41_0.pos, _0_Memory_0.ram, _0.nvd, segments_2, _0.fdx, _0.si, _0.nvm, _0_Lucene41_0.tim, _0.fdt, _0_Lucene41_0.tip]
[junit4:junit4]   2> 2042 T3418 oasc.SolrDeletionPolicy.updateCommits newest commit = 1[segments_1]
[junit4:junit4]   2> 2046 T3442 oasc.SolrCore.initWriters created json: solr.JSONResponseWriter
[junit4:junit4]   2> 2047 T3388 oasc.SolrCore.initWriters created json: solr.JSONResponseWriter
[junit4:junit4]   2> 2048 T3393 oasc.SolrCore.initWriters created json: solr.JSONResponseWriter
[junit4:junit4]   2> 2048 T3432 oasc.SolrCore.initWriters created json: solr.JSONResponseWriter
[junit4:junit4]   2> 2048 T3418 oasc.SolrCore.initWriters created json: solr.JSONResponseWriter
[junit4:junit4]   2> 2049 T3395 oasc.SolrCore.closeSearcher [00016_core] Closing main searcher on request.
[junit4:junit4]   2> 2049 T3395 oasc.CachingDirectoryFactory.close Closing directory when closing factory: /usr/home/hudson/hudson-slave/workspace/Lucene-Solr-Tests-trunk-java7/solr/build/solr-core/test/J0/OpenCloseCoreStressTest_/00016_core/data
[junit4:junit4]   2> 2050 T3395 oasc.CachingDirectoryFactory.closeDirectory Closing directory: /usr/home/hudson/hudson-slave/workspace/Lucene-Solr-Tests-trunk-java7/solr/build/solr-core/test/J0/OpenCloseCoreStressTest_/00016_core/data
[junit4:junit4]   2> 2049 T3422 oashl.XMLLoader.init xsltCacheLifetimeSeconds=60
[junit4:junit4]   2> 2050 T3442 oasc.RequestHandlers.initHandlersFromConfig created /admin/: solr.admin.AdminHandlers
[junit4:junit4]   2> 2050 T3393 oasc.RequestHandlers.initHandlersFromConfig created /admin/: solr.admin.AdminHandlers
[junit4:junit4]   2> 2051 T3395 oasc.CachingDirectoryFactory.close Closing directory when closing factory: /usr/home/hudson/hudson-slave/workspace/Lucene-Solr-Tests-trunk-java7/solr/build/solr-core/test/J0/OpenCloseCoreStressTest_/00016_core/data/index
[junit4:junit4]   2> 2051 T3388 oasc.RequestHandlers.initHandlersFromConfig created /admin/: solr.admin.AdminHandlers
[junit4:junit4]   2> 2051 T3393 oasc.RequestHandlers.initHandlersFromConfig created /select: solr.SearchHandler
[junit4:junit4]   2> 2051 T3432 oasc.RequestHandlers.initHandlersFromConfig created /admin/: solr.admin.AdminHandlers
[junit4:junit4]   2> 2051 T3388 oasc.RequestHandlers.initHandlersFromConfig created /select: solr.SearchHandler
[junit4:junit4]   2> 2051 T3442 oasc.RequestHandlers.initHandlersFromConfig created /select: solr.SearchHandler
[junit4:junit4]   2> 2052 T3393 oasc.RequestHandlers.initHandlersFromConfig created /update: solr.UpdateRequestHandler
[junit4:junit4]   2> 2051 T3395 oasc.CachingDirectoryFactory.closeDirectory Closing directory: /usr/home/hudson/hudson-slave/workspace/Lucene-Solr-Tests-trunk-java7/solr/build/solr-core/test/J0/OpenCloseCoreStressTest_/00016_core/data/index
[junit4:junit4]   2> 2051 T3418 oasc.RequestHandlers.initHandlersFromConfig created /admin/: solr.admin.AdminHandlers
[junit4:junit4]   2> 2052 T3388 oasc.RequestHandlers.initHandlersFromConfig created /update: solr.UpdateRequestHandler
[junit4:junit4]   2> 2052 T3432 oasc.RequestHandlers.initHandlersFromConfig created /select: solr.SearchHandler
[junit4:junit4]   2> 2053 T3418 oasc.RequestHandlers.initHandlersFromConfig created /select: solr.SearchHandler
[junit4:junit4]   2> 2053 T3442 oasc.RequestHandlers.initHandlersFromConfig created /update: solr.UpdateRequestHandler
[junit4:junit4]   2> 2053 T3432 oasc.RequestHandlers.initHandlersFromConfig created /update: solr.UpdateRequestHandler
[junit4:junit4]   2> 2053 T3418 oasc.RequestHandlers.initHandlersFromConfig created /update: solr.UpdateRequestHandler
[junit4:junit4]   2> 2071 T3422 oass.SolrIndexSearcher.<init> Opening Searcher@777e23fa main
[junit4:junit4]   2> 2072 T3422 oasc.SolrCore.registerSearcher [00013_core] Registered new searcher Searcher@777e23fa main{StandardDirectoryReader(segments_1:1)}
[junit4:junit4]   2> 2073 T3422 oasu.CommitTracker.<init> Hard AutoCommit: disabled
[junit4:junit4]   2> 2074 T3422 oasu.CommitTracker.<init> Soft AutoCommit: disabled
[junit4:junit4]   2> 2075 T3433 oasc.CoreContainer.create Creating SolrCore '00016_core' using instanceDir: /usr/home/hudson/hudson-slave/workspace/Lucene-Solr-Tests-trunk-java7/solr/build/solr-core/test/J0/./OpenCloseCoreStressTest_/00016_core
[junit4:junit4]   2> 2076 T3395 oasc.SolrCore.close [00019_core]  CLOSING SolrCore org.apache.solr.core.SolrCore@5e3484db
[junit4:junit4]   2> 2077 T3433 oasc.SolrResourceLoader.<init> new SolrResourceLoader for directory: '/usr/home/hudson/hudson-slave/workspace/Lucene-Solr-Tests-trunk-java7/solr/build/solr-core/test/J0/./OpenCloseCoreStressTest_/00016_core/'
[junit4:junit4]   2> 2080 T3422 oasc.CoreMaps.putTransientCore Opening transient core 00013_core
[junit4:junit4]   2> 2080 T3422 oasc.CoreContainer.registerCore registering core: 00013_core
[junit4:junit4]   2> 2082 T3395 oasu.DirectUpdateHandler2.close closing DirectUpdateHandler2{commits=0,autocommits=0,soft autocommits=0,optimizes=0,rollbacks=0,expungeDeletes=0,docsPending=1,adds=1,deletesById=0,deletesByQuery=0,errors=0,cumulative_adds=1,cumulative_deletesById=0,cumulative_deletesByQuery=0,cumulative_errors=0}
[junit4:junit4]   2> 2083 T3395 oasu.SolrCoreState.decrefSolrCoreState Closing SolrCoreState
[junit4:junit4]   2> 2083 T3395 oasu.DefaultSolrCoreState.closeIndexWriter SolrCoreState ref count has reached 0 - closing IndexWriter
[junit4:junit4]   2> 2083 T3395 oasu.DefaultSolrCoreState.closeIndexWriter closing IndexWriter with IndexWriterCloser
[junit4:junit4]   2> 2084 T3418 oashl.XMLLoader.init xsltCacheLifetimeSeconds=60
[junit4:junit4]   2> 2085 T3393 oashl.XMLLoader.init xsltCacheLifetimeSeconds=60
[junit4:junit4]   2> 2085 T3388 oashl.XMLLoader.init xsltCacheLifetimeSeconds=60
[junit4:junit4]   2> 2091 T3442 oashl.XMLLoader.init xsltCacheLifetimeSeconds=60
[junit4:junit4]   2> 2093 T3432 oashl.XMLLoader.init xsltCacheLifetimeSeconds=60
[junit4:junit4]   2> 2099 T3434 C204 REQ [00002_core] webapp=/solr path=/select params={q=*:*&wt=javabin&qt=/select&version=2} hits=0 status=0 QTime=1 
[junit4:junit4]   2> 2132 T3432 oass.SolrIndexSearcher.<init> Opening Searcher@431cf583 main
[junit4:junit4]   2> 2132 T3418 oass.SolrIndexSearcher.<init> Opening Searcher@50f67cc0 main
[junit4:junit4]   2> 2133 T3393 oass.SolrIndexSearcher.<init> Opening Searcher@7cbad3d3 main
[junit4:junit4]   2> 2133 T3432 oasc.SolrCore.registerSearcher [00006_core] Registered new searcher Searcher@431cf583 main{StandardDirectoryReader(segments_1:1)}
[junit4:junit4]   2> 2132 T3388 oass.SolrIndexSearcher.<init> Opening Searcher@2f2bac45 main
[junit4:junit4]   2> ASYNC  NEW_CORE C214 name=00013_core org.apache.solr.core.SolrCore@34775676
[junit4:junit4]   2> 2133 T3436 C214 REQ [00013_core] webapp=/solr path=/select params={q=*:*&wt=javabin&qt=/select&version=2} hits=0 status=0 QTime=0 
[junit4:junit4]   2> 2133 T3445 C214 REQ [00013_core] webapp=/solr path=/select params={q=*:*&wt=javabin&qt=/select&version=2} hits=0 status=0 QTime=0 
[junit4:junit4]   2> 2132 T3442 oass.SolrIndexSearcher.<init> Opening Searcher@f32d003 main
[junit4:junit4]   2> 2134 T3418 oasc.SolrCore.registerSearcher [00012_core] Registered new searcher Searcher@50f67cc0 main{StandardDirectoryReader(segments_1:1)}
[junit4:junit4]   2> 2133 T3432 oasu.CommitTracker.<init> Hard AutoCommit: disabled
[junit4:junit4]   2> 2134 T3388 oasc.SolrCore.registerSearcher [00011_core] Registered new searcher Searcher@2f2bac45 main{StandardDirectoryReader(segments_1:1)}
[junit4:junit4]   2> 2134 T3393 oasc.SolrCore.registerSearcher [00004_core] Registered new searcher Searcher@7cbad3d3 main{StandardDirectoryReader(segments_1:1)}
[junit4:junit4]   2> 2135 T3432 oasu.CommitTracker.<init> Soft AutoCommit: disabled
[junit4:junit4]   2> 2135 T3418 oasu.CommitTracker.<init> Hard AutoCommit: disabled
[junit4:junit4]   2> 2135 T3388 oasu.CommitTracker.<init> Hard AutoCommit: disabled
[junit4:junit4]   2> 2135 T3442 oasc.SolrCore.registerSearcher [00017_core] Registered new searcher Searcher@f32d003 main{StandardDirectoryReader(segments_1:1)}
[junit4:junit4]   2> 2135 T3393 oasu.CommitTracker.<init> Hard AutoCommit: disabled
[junit4:junit4]   2> 2136 T3442 oasu.CommitTracker.<init> Hard AutoCommit: disabled
[junit4:junit4]   2> 2136 T3393 oasu.CommitTracker.<init> Soft AutoCommit: disabled
[junit4:junit4]   2> 2136 T3388 oasu.CommitTracker.<init> Soft AutoCommit: disabled
[junit4:junit4]   2> 2137 T3442 oasu.CommitTracker.<init> Soft AutoCommit: disabled
[junit4:junit4]   2> 2136 T3418 oasu.CommitTracker.<init> Soft AutoCommit: disabled
[junit4:junit4]   2> 2140 T3432 oasc.CoreMaps.putTransientCore Opening transient core 00006_core
[junit4:junit4]   2> 2140 T3432 oasc.CoreContainer.registerCore registering core: 00006_core
[junit4:junit4]   2> 2142 T3422 C214 oasc.SolrDeletionPolicy.onInit SolrDeletionPolicy.onInit: commits:num=1
[junit4:junit4]   2> 		commit{dir=MockDirWrapper(RateLimitedDirectoryWrapper(NRTCachingDirectory(org.apache.lucene.store.MMapDirectory@/usr/home/hudson/hudson-slave/workspace/Lucene-Solr-Tests-trunk-java7/solr/build/solr-core/test/J0/OpenCloseCoreStressTest_/00013_core/data/index lockFactory=org.apache.lucene.store.NativeFSLockFactory@362dee3c; maxCacheMB=0.4072265625 maxMergeSizeMB=0.82421875))),segFN=segments_1,generation=1,filenames=[segments_1]
[junit4:junit4]   2> 2143 T3422 C214 oasc.SolrDeletionPolicy.updateCommits newest commit = 1[segments_1]
[junit4:junit4]   2> 2144 T3388 oasc.CoreMaps.putTransientCore Opening transient core 00011_core
[junit4:junit4]   2> 2144 T3393 oasc.CoreMaps.putTransientCore Opening transient core 00004_core
[junit4:junit4]   2> 2144 T3418 oasc.CoreMaps.putTransientCore Opening transient core 00012_core
[junit4:junit4]   2> 2144 T3388 oasc.CoreContainer.registerCore registering core: 00011_core
[junit4:junit4]   2> 2145 T3418 oasc.CoreContainer.registerCore registering core: 00012_core
[junit4:junit4]   2> 2144 T3442 oasc.CoreMaps.putTransientCore Opening transient core 00017_core
[junit4:junit4]   2> 2145 T3393 oasc.CoreContainer.registerCore registering core: 00004_core
[junit4:junit4]   2> 2146 T3442 oasc.CoreContainer.registerCore registering core: 00017_core
[junit4:junit4]   2> 2146 T3422 C214 UPDATE [00013_core] webapp=/solr path=/update params={wt=javabin&version=2} {add=[id45]} 0 12
[junit4:junit4]   2> ASYNC  NEW_CORE C215 name=00006_core org.apache.solr.core.SolrCore@567f4a00
[junit4:junit4]   2> 2190 T3441 C215 REQ [00006_core] webapp=/solr path=/select params={q=*:*&wt=javabin&qt=/select&version=2} hits=0 status=0 QTime=0 
[junit4:junit4]   2> ASYNC  NEW_CORE C216 name=00004_core org.apache.solr.core.SolrCore@6cd77e3
[junit4:junit4]   2> 2196 T3446 C216 REQ [00004_core] webapp=/solr path=/select params={q=*:*&wt=javabin&qt=/select&version=2} hits=0 status=0 QTime=0 
[junit4:junit4]   2> 2197 T3447 C215 REQ [00006_core] webapp=/solr path=/select params={q=*:*&wt=javabin&qt=/select&version=2} hits=0 status=0 QTime=0 
[junit4:junit4]   2> ASYNC  NEW_CORE C217 name=00017_core org.apache.solr.core.SolrCore@173c0ee
[junit4:junit4]   2> 2197 T3435 C217 REQ [00017_core] webapp=/solr path=/select params={q=*:*&wt=javabin&qt=/select&version=2} hits=0 status=0 QTime=0 
[junit4:junit4]   2> 2198 T3442 C217 REQ [00017_core] webapp=/solr path=/select params={q=*:*&wt=javabin&qt=/select&version=2} hits=0 status=0 QTime=0 
[junit4:junit4]   2> ASYNC  NEW_CORE C218 name=00011_core org.apache.solr.core.SolrCore@40a9789e
[junit4:junit4]   2> 2198 T3437 C218 REQ [00011_core] webapp=/solr path=/select params={q=*:*&wt=javabin&qt=/select&version=2} hits=0 status=0 QTime=0 
[junit4:junit4]   2> 2199 T3439 C218 REQ [00011_core] webapp=/solr path=/select params={q=*:*&wt=javabin&qt=/select&version=2} hits=0 status=0 QTime=0 
[junit4:junit4]   2> 2201 T3444 C217 REQ [00017_core] webapp=/solr path=/select params={q=*:*&wt=javabin&qt=/select&version=2} hits=0 status=0 QTime=0 
[junit4:junit4]   2> 2201 T3448 C217 REQ [00017_core] webapp=/solr path=/select params={q=*:*&wt=javabin&qt=/select&version=2} hits=0 status=0 QTime=0 
[junit4:junit4]   2> 2204 T3432 C215 oasc.SolrDeletionPolicy.onInit SolrDeletionPolicy.onInit: commits:num=1
[junit4:junit4]   2> 		commit{dir=MockDirWrapper(org.apache.lucene.store.SimpleFSDirectory@/usr/home/hudson/hudson-slave/workspace/Lucene-Solr-Tests-trunk-java7/solr/build/solr-core/test/J0/OpenCloseCoreStressTest_/00006_core/data/index lockFactory=org.apache.lucene.store.NativeFSLockFactory@6b49521c),segFN=segments_1,generation=1,filenames=[segments_1]
[junit4:junit4]   2> 2205 T3432 C215 oasc.SolrDeletionPolicy.updateCommits newest commit = 1[segments_1]
[junit4:junit4]   2> ASYNC  NEW_CORE C219 name=00012_core org.apache.solr.core.SolrCore@6b562458
[junit4:junit4]   2> 2207 T3418 C219 oasc.SolrDeletionPolicy.onInit SolrDeletionPolicy.onInit: commits:num=1
[junit4:junit4]   2> 		commit{dir=MockDirWrapper(org.apache.lucene.store.SimpleFSDirectory@/usr/home/hudson/hudson-slave/workspace/Lucene-Solr-Tests-trunk-java7/solr/build/solr-core/test/J0/OpenCloseCoreStressTest_/00012_core/data/index lockFactory=org.apache.lucene.store.NativeFSLockFactory@4604d3f3),segFN=segments_1,generation=1,filenames=[segments_1]
[junit4:junit4]   2> 2208 T3388 C218 oasc.SolrDeletionPolicy.onInit SolrDeletionPolicy.onInit: commits:num=1
[junit4:junit4]   2> 		commit{dir=MockDirWrapper(org.apache.lucene.store.SimpleFSDirectory@/usr/home/hudson/hudson-slave/workspace/Lucene-Solr-Tests-trunk-java7/solr/build/solr-core/test/J0/OpenCloseCoreStressTest_/00011_core/data/index lockFactory=org.apache.lucene.store.NativeFSLockFactory@44c7193a),segFN=segments_1,generation=1,filenames=[segments_1]
[junit4:junit4]   2> 2208 T3418 C219 oasc.SolrDeletionPolicy.updateCommits newest commit = 1[segments_1]
[junit4:junit4]   2> 2208 T3388 C218 oasc.SolrDeletionPolicy.updateCommits newest commit = 1[segments_1]
[junit4:junit4]   2> 2208 T3422 C216 oasc.SolrDeletionPolicy.onInit SolrDeletionPolicy.onInit: commits:num=1
[junit4:junit4]   2> 		commit{dir=MockDirWrapper(RateLimitedDirectoryWrapper(NRTCachingDirectory(org.apache.lucene.store.MMapDirectory@/usr/home/hudson/hudson-slave/workspace/Lucene-Solr-Tests-trunk-java7/solr/build/solr-core/test/J0/OpenCloseCoreStressTest_/00004_core/data/index lockFactory=org.apache.lucene.store.NativeFSLockFactory@c8428f8; maxCacheMB=0.4072265625 maxMergeSizeMB=0.82421875))),segFN=segments_1,generation=1,filenames=[segments_1]
[junit4:junit4]   2> 2208 T3432 C215 UPDATE [00006_core] webapp=/solr path=/update params={wt=javabin&version=2} {add=[id21]} 0 18
[junit4:junit4]   2> 2209 T3422 C216 oasc.SolrDeletionPolicy.updateCommits newest commit = 1[segments_1]
[junit4:junit4]   2> 2212 T3389 C219 UPDATE [00012_core] webapp=/solr path=/update params={wt=javabin&version=2} {add=[id19]} 0 11
[junit4:junit4]   2> 2212 T3418 C219 UPDATE [00012_core] webapp=/solr path=/update params={wt=javabin&version=2} {add=[id16]} 0 13
[junit4:junit4]   2> 2213 T3388 C218 UPDATE [00011_core] webapp=/solr path=/update params={wt=javabin&version=2} {add=[id30]} 0 11
[junit4:junit4]   2> 2214 T3422 C216 UPDATE [00004_core] webapp=/solr path=/update params={wt=javabin&version=2} {add=[id49]} 0 17
[junit4:junit4]   2> 2214 T3393 C216 UPDATE [00004_core] webapp=/solr path=/update params={wt=javabin&version=2} {add=[id17]} 0 15
[junit4:junit4]   2> 2214 T3432 C219 UPDATE [00012_core] webapp=/solr path=/update params={wt=javabin&version=2} {add=[id50]} 0 1
[junit4:junit4]   2> 2214 T3392 C216 UPDATE [00004_core] webapp=/solr path=/update params={wt=javabin&version=2} {add=[id18]} 0 16
[junit4:junit4]   2> 2216 T3389 C218 UPDATE [00011_core] webapp=/solr path=/update params={wt=javabin&version=2} {add=[id51]} 0 1
[junit4:junit4]   2> 2217 T3388 oasc.CoreContainer.create Creating SolrCore '00008_core' using instanceDir: /usr/home/hudson/hudson-slave/workspace/Lucene-Solr-Tests-trunk-java7/solr/build/solr-core/test/J0/./OpenCloseCoreStressTest_/00008_core
[junit4:junit4]   2> 2217 T3422 C210 UPDATE [00014_core] webapp=/solr path=/update params={wt=javabin&version=2} {add=[id54]} 0 0
[junit4:junit4]   2> 2217 T3388 oasc.SolrResourceLoader.<init> new SolrResourceLoader for directory: '/usr/home/hudson/hudson-slave/workspace/Lucene-Solr-Tests-trunk-java7/solr/build/solr-core/test/J0/./OpenCloseCoreStressTest_/00008_core/'
[junit4:junit4]   2> 2217 T3393 C218 UPDATE [00011_core] webapp=/solr path=/update params={wt=javabin&version=2} {add=[id55]} 0 0
[junit4:junit4]   2> 2219 T3392 C207 UPDATE [00003_core] webapp=/solr path=/update params={wt=javabin&version=2} {add=[id56]} 0 1
[junit4:junit4]   2> 2221 T3389 C214 UPDATE [00013_core] webapp=/solr path=/update params={wt=javabin&version=2} {add=[id58]} 0 1
[junit4:junit4]   2> 2248 T3433 oasc.SolrConfig.<init> Using Lucene MatchVersion: LUCENE_41
[junit4:junit4]   2> 2293 T3388 oasc.SolrConfig.<init> Using Lucene MatchVersion: LUCENE_41
[junit4:junit4]   2> 2294 T3441 C217 REQ [00017_core] webapp=/solr path=/select params={q=*:*&wt=javabin&qt=/select&version=2} hits=0 status=0 QTime=0 
[junit4:junit4]   2> 2301 T3435 C207 REQ [00003_core] webapp=/solr path=/select params={q=*:*&wt=javabin&qt=/select&version=2} hits=0 status=0 QTime=0 
[junit4:junit4]   2> 2301 T3447 C214 REQ [00013_core] webapp=/solr path=/select params={q=*:*&wt=javabin&qt=/select&version=2} hits=0 status=0 QTime=0 
[junit4:junit4]   2> 2302 T3442 C217 REQ [00017_core] webapp=/solr path=/select params={q=*:*&wt=javabin&qt=/select&version=2} hits=0 status=0 QTime=0 
[junit4:junit4]   2> 2302 T3437 C215 REQ [00006_core] webapp=/solr path=/select params={q=*:*&wt=javabin&qt=/select&version=2} hits=0 status=0 QTime=0 
[junit4:junit4]   2> 2304 T3439 C216 REQ [00004_core] webapp=/solr path=/select params={q=*:*&wt=javabin&qt=/select&version=2} hits=0 status=0 QTime=0 
[junit4:junit4]   2> 2305 T3444 C204 REQ [00002_core] webapp=/solr path=/select params={q=*:*&wt=javabin&qt=/select&version=2} hits=0 status=0 QTime=0 
[junit4:junit4]   2> 2310 T3395 C203 oasc.SolrDeletionPolicy.onCommit SolrDeletionPolicy.onCommit: commits:num=2
[junit4:junit4]   2> 		commit{dir=MockDirWrapper(RateLimitedDirectoryWrapper(NRTCachingDirectory(org.apache.lucene.store.MMapDirectory@/usr/home/hudson/hudson-slave/workspace/Lucene-Solr-Tests-trunk-java7/solr/build/solr-core/test/J0/OpenCloseCoreStressTest_/00019_core/data/index lockFactory=org.apache.lucene.store.NativeFSLockFactory@1803a639; maxCacheMB=0.4072265625 maxMergeSizeMB=0.82421875))),segFN=segments_1,generation=1,filenames=[segments_1]
[junit4:junit4]   2> 		commit{dir=MockDirWrapper(RateLimitedDirectoryWrapper(NRTCachingDirectory(org.apache.lucene.store.MMapDirectory@/usr/home/hudson/hudson-slave/workspace/Lucene-Solr-Tests-trunk-java7/solr/build/solr-core/test/J0/OpenCloseCoreStressTest_/00019_core/data/index lockFactory=org.apache.lucene.store.NativeFSLockFactory@1803a639; maxCacheMB=0.4072265625 maxMergeSizeMB=0.82421875))),segFN=segments_2,generation=2,filenames=[_0.fnm, _0_Lucene41_0.doc, _0_Lucene41_0.pos, _0_Memory_0.ram, _0.nvd, segments_2, _0.fdx, _0.si, _0.nvm, _0_Lucene41_0.tim, _0.fdt, _0_Lucene41_0.tip]
[junit4:junit4]   2> 2310 T3433 oasc.SolrConfig.<init> Loaded SolrConfig: solrconfig-minimal.xml
[junit4:junit4]   2> 2311 T3395 C203 oasc.SolrDeletionPolicy.updateCommits newest commit = 2[_0.fnm, _0_Lucene41_0.doc, _0_Lucene41_0.pos, _0_Memory_0.ram, _0.nvd, segments_2, _0.fdx, _0.si, _0.nvm, _0_Lucene41_0.tim, _0.fdt, _0_Lucene41_0.tip]
[junit4:junit4]   2> 2312 T3433 oass.IndexSchema.readSchema Reading Solr Schema
[junit4:junit4]   2> 2314 T3395 oasc.SolrCore.closeSearcher [00019_core] Closing main searcher on request.
[junit4:junit4]   2> 2314 T3395 oasc.CachingDirectoryFactory.close Closing directory when closing factory: /usr/home/hudson/hudson-slave/workspace/Lucene-Solr-Tests-trunk-java7/solr/build/solr-core/test/J0/OpenCloseCoreStressTest_/00019_core/data/index
[junit4:junit4]   2> 2314 T3395 oasc.CachingDirectoryFactory.closeDirectory Closing directory: /usr/home/hudson/hudson-slave/workspace/Lucene-Solr-Tests-trunk-java7/solr/build/solr-core/test/J0/OpenCloseCoreStressTest_/00019_core/data/index
[junit4:junit4]   2> 2327 T3433 oass.IndexSchema.readSchema Schema name=tiny
[junit4:junit4]   2> 2328 T3395 oasc.CachingDirectoryFactory.close Closing directory when closing factory: /usr/home/hudson/hudson-slave/workspace/Lucene-Solr-Tests-trunk-java7/solr/build/solr-core/test/J0/OpenCloseCoreStressTest_/00019_core/data
[junit4:junit4]   2> 2328 T3395 oasc.CachingDirectoryFactory.closeDirectory Closing directory: /usr/home/hudson/hudson-slave/workspace/Lucene-Solr-Tests-trunk-java7/solr/build/solr-core/test/J0/OpenCloseCoreStressTest_/00019_core/data
[junit4:junit4]   2> 2329 T3395 oasc.SolrCore.close [00000_core]  CLOSING SolrCore org.apache.solr.core.SolrCore@12a16407
[junit4:junit4]   2> 2329 T3446 oasc.CoreContainer.create Creating SolrCore '00019_core' using instanceDir: /usr/home/hudson/hudson-slave/workspace/Lucene-Solr-Tests-trunk-java7/solr/build/solr-core/test/J0/./OpenCloseCoreStressTest_/00019_core
[junit4:junit4]   2> 2330 T3446 oasc.SolrResourceLoader.<init> new SolrResourceLoader for directory: '/usr/home/hudson/hudson-slave/workspace/Lucene-Solr-Tests-trunk-java7/solr/build/solr-core/test/J0/./OpenCloseCoreStressTest_/00019_core/'
[junit4:junit4]   2> 2333 T3395 oasu.DirectUpdateHandler2.close closing DirectUpdateHandler2{commits=0,autocommits=0,soft autocommits=0,optimizes=0,rollbacks=0,expungeDeletes=0,docsPending=2,adds=2,deletesById=0,deletesByQuery=0,errors=0,cumulative_adds=2,cumulative_deletesById=0,cumulative_deletesByQuery=0,cumulative_errors=0}
[junit4:junit4]   2> 2333 T3395 oasu.SolrCoreState.decrefSolrCoreState Closing SolrCoreState
[junit4:junit4]   2> 2333 T3395 oasu.DefaultSolrCoreState.closeIndexWriter SolrCoreState ref count has reached 0 - closing IndexWriter
[junit4:junit4]   2> 2334 T3395 oasu.DefaultSolrCoreState.closeIndexWriter closing IndexWriter with IndexWriterCloser
[junit4:junit4]   2> 2368 T3433 oass.IndexSchema.readSchema unique key field: id
[junit4:junit4]   2> 2370 T3433 oasc.SolrCore.initDirectoryFactory org.apache.solr.core.MockFSDirectoryFactory
[junit4:junit4]   2> 2371 T3433 oasc.SolrCore.<init> [00016_core] Opening new SolrCore at /usr/home/hudson/hudson-slave/workspace/Lucene-Solr-Tests-trunk-java7/solr/build/solr-core/test/J0/./OpenCloseCoreStressTest_/00016_core/, dataDir=/usr/home/hudson/hudson-slave/workspace/Lucene-Solr-Tests-trunk-java7/solr/build/solr-core/test/J0/OpenCloseCoreStressTest_/00016_core/data/
[junit4:junit4]   2> 2371 T3433 oasc.JmxMonitoredMap.<init> JMX monitoring is enabled. Adding Solr mbeans to JMX Server: com.sun.jmx.mbeanserver.JmxMBeanServer@3cf7366d
[junit4:junit4]   2> 2372 T3433 oasc.SolrCore.initDirectoryFactory org.apache.solr.core.MockFSDirectoryFactory
[junit4:junit4]   2> 2373 T3433 oasc.CachingDirectoryFactory.get return new directory for /usr/home/hudson/hudson-slave/workspace/Lucene-Solr-Tests-trunk-java7/solr/build/solr-core/test/J0/OpenCloseCoreStressTest_/00016_core/data forceNew: false
[junit4:junit4]   2> 2374 T3433 oasc.SolrCore.getNewIndexDir New index directory detected: old=null new=/usr/home/hudson/hudson-slave/workspace/Lucene-Solr-Tests-trunk-java7/solr/build/solr-core/test/J0/OpenCloseCoreStressTest_/00016_core/data/index/
[junit4:junit4]   2> 2375 T3433 oasc.SolrCore.initWriters created json: solr.JSONResponseWriter
[junit4:junit4]   2> 2377 T3433 oasc.RequestHandlers.initHandlersFromConfig created /admin/: solr.admin.AdminHandlers
[junit4:junit4]   2> 2377 T3388 oasc.SolrConfig.<init> Loaded SolrConfig: solrconfig-minimal.xml
[junit4:junit4]   2> 2378 T3433 oasc.RequestHandlers.initHandlersFromConfig created /select: solr.SearchHandler
[junit4:junit4]   2> 2378 T3388 oass.IndexSchema.readSchema Reading Solr Schema
[junit4:junit4]   2> 2378 T3433 oasc.RequestHandlers.initHandlersFromConfig created /update: solr.UpdateRequestHandler
[junit4:junit4]   2> 2395 T3388 oass.IndexSchema.readSchema Schema name=tiny
[junit4:junit4]   2> 2397 T3433 oashl.XMLLoader.init xsltCacheLifetimeSeconds=60
[junit4:junit4]   2> 2402 T3433 oasc.CachingDirectoryFactory.get return new directory for /usr/home/hudson/hudson-slave/workspace/Lucene-Solr-Tests-trunk-java7/solr/build/solr-core/test/J0/OpenCloseCoreStressTest_/00016_core/data/index forceNew: false
[junit4:junit4]   2> 2405 T3435 C216 REQ [00004_core] webapp=/solr path=/select params={q=*:*&wt=javabin&qt=/select&version=2} hits=0 status=0 QTime=0 
[junit4:junit4]   2> 2406 T3437 C215 REQ [00006_core] webapp=/solr path=/select params={q=*:*&wt=javabin&qt=/select&version=2} hits=0 status=0 QTime=0 
[junit4:junit4]   2> 2408 T3439 C214 REQ [00013_core] webapp=/solr path=/select params={q=*:*&wt=javabin&qt=/select&version=2} hits=0 status=0 QTime=0 
[junit4:junit4]   2> 2411 T3433 oass.SolrIndexSearcher.<init> Opening Searcher@3d9286ae main
[junit4:junit4]   2> 2413 T3433 oasc.SolrCore.registerSearcher [00016_core] Registered new searcher Searcher@3d9286ae main{StandardDirectoryReader(segments_2:3 _0(5.0):C1)}
[junit4:junit4]   2> 2413 T3433 oasu.CommitTracker.<init> Hard AutoCommit: disabled
[junit4:junit4]   2> 2413 T3433 oasu.CommitTracker.<init> Soft AutoCommit: disabled
[junit4:junit4]   2> 2418 T3433 oasc.CoreMaps.putTransientCore Opening transient core 00016_core
[junit4:junit4]   2> 2418 T3433 oasc.CoreContainer.registerCore registering core: 00016_core
[junit4:junit4]   2> 2422 T3395 C201 oasc.SolrDeletionPolicy.onCommit SolrDeletionPolicy.onCommit: commits:num=2
[junit4:junit4]   2> 		commit{dir=MockDirWrapper(RateLimitedDirectoryWrapper(NRTCachingDirectory(org.apache.lucene.store.MMapDirectory@/usr/home/hudson/hudson-slave/workspace/Lucene-Solr-Tests-trunk-java7/solr/build/solr-core/test/J0/OpenCloseCoreStressTest_/00000_core/data/index lockFactory=org.apache.lucene.store.NativeFSLockFactory@24c48a2; maxCacheMB=0.4072265625 maxMergeSizeMB=0.82421875))),segFN=segments_1,generation=1,filenames=[segments_1]
[junit4:junit4]   2> 		commit{dir=MockDirWrapper(RateLimitedDirectoryWrapper(NRTCachingDirectory(org.apache.lucene.store.MMapDirectory@/usr/home/hudson/hudson-slave/workspace/Lucene-Solr-Tests-trunk-java7/solr/build/solr-core/test/J0/OpenCloseCoreStressTest_/00000_core/data/index lockFactory=org.apache.lucene.store.NativeFSLockFactory@24c48a2; maxCacheMB=0.4072265625 maxMergeSizeMB=0.82421875))),segFN=segments_2,generation=2,filenames=[_0.fnm, _0_Lucene41_0.doc, _0_Lucene41_0.pos, _0_Memory_0.ram, _0.nvd, segments_2, _0.fdx, _0.si, _0.nvm, _0_Lucene41_0.tim, _0.fdt, _0_Lucene41_0.tip]
[junit4:junit4]   2> 2423 T3395 C201 oasc.SolrDeletionPolicy.updateCommits newest commit = 2[_0.fnm, _0_Lucene41_0.doc, _0_Lucene41_0.pos, _0_Memory_0.ram, _0.nvd, segments_2, _0.fdx, _0.si, _0.nvm, _0_Lucene41_0.tim, _0.fdt, _0_Lucene41_0.tip]
[junit4:junit4]   2> 2428 T3395 oasc.SolrCore.closeSearcher [00000_core] Closing main searcher on request.
[junit4:junit4]   2> 2428 T3395 oasc.CachingDirectoryFactory.close Closing directory when closing factory: /usr/home/hudson/hudson-slave/workspace/Lucene-Solr-Tests-trunk-java7/solr/build/solr-core/test/J0/OpenCloseCoreStressTest_/00000_core/data/index
[junit4:junit4]   2> 2429 T3395 oasc.CachingDirectoryFactory.closeDirectory Closing directory: /usr/home/hudson/hudson-slave/workspace/Lucene-Solr-Tests-trunk-java7/solr/build/solr-core/test/J0/OpenCloseCoreStressTest_/00000_core/data/index
[junit4:junit4]   2> ASYNC  NEW_CORE C220 name=00016_core org.apache.solr.core.SolrCore@45a156da
[junit4:junit4]   2> 2433 T3440 C220 REQ [00016_core] webapp=/solr path=/select params={q=*:*&wt=javabin&qt=/select&version=2} hits=1 status=0 QTime=0 
[junit4:junit4]   2> 2439 T3388 oass.IndexSchema.readSchema unique key field: id
[junit4:junit4]   2> 2439 T3446 oasc.SolrConfig.<init> Using Lucene MatchVersion: LUCENE_41
[junit4:junit4]   2> 2441 T3388 oasc.SolrCore.initDirectoryFactory org.apache.solr.core.MockFSDirectoryFactory
[junit4:junit4]   2> 2441 T3388 oasc.SolrCore.<init> [00008_core] Opening new SolrCore at /usr/home/hudson/hudson-slave/workspace/Lucene-Solr-Tests-trunk-java7/solr/build/solr-core/test/J0/./OpenCloseCoreStressTest_/00008_core/, dataDir=/usr/home/hudson/hudson-slave/workspace/Lucene-Solr-Tests-trunk-java7/solr/build/solr-core/test/J0/OpenCloseCoreStressTest_/00008_core/data/
[junit4:junit4]   2> 2442 T3388 oasc.JmxMonitoredMap.<init> JMX monitoring is enabled. Adding Solr mbeans to JMX Server: com.sun.jmx.mbeanserver.JmxMBeanServer@3cf7366d
[junit4:junit4]   2> 2442 T3388 oasc.SolrCore.initDirectoryFactory org.apache.solr.core.MockFSDirectoryFactory
[junit4:junit4]   2> 2444 T3388 oasc.CachingDirectoryFactory.get return new directory for /usr/home/hudson/hudson-slave/workspace/Lucene-Solr-Tests-trunk-java7/solr/build/solr-core/test/J0/OpenCloseCoreStressTest_/00008_core/data forceNew: false
[junit4:junit4]   2> 2444 T3388 oasc.SolrCore.getNewIndexDir New index directory detected: old=null new=/usr/home/hudson/hudson-slave/workspace/Lucene-Solr-Tests-trunk-java7/solr/build/solr-core/test/J0/OpenCloseCoreStressTest_/00008_core/data/index/
[junit4:junit4]   2> 2445 T3433 C220 oasc.SolrDeletionPolicy.onInit SolrDeletionPolicy.onInit: commits:num=1
[junit4:junit4]   2> 		commit{dir=MockDirWrapper(RateLimitedDirectoryWrapper(NRTCachingDirectory(org.apache.lucene.store.MMapDirectory@/usr/home/hudson/hudson-slave/workspace/Lucene-Solr-Tests-trunk-java7/solr/build/solr-core/test/J0/OpenCloseCoreStressTest_/00016_core/data/index lockFactory=org.apache.lucene.store.NativeFSLockFactory@dedec3e; maxCacheMB=0.4072265625 maxMergeSizeMB=0.82421875))),segFN=segments_2,generation=2,filenames=[_0.fnm, _0_Lucene41_0.doc, _0_Memory_0.ram, _0_Lucene41_0.pos, _0.nvd, segments_2, _0.fdx, _0.nvm, _0.si, _0_Lucene41_0.tim, _0_Lucene41_0.tip, _0.fdt]
[junit4:junit4]   2> 2445 T3433 C220 oasc.SolrDeletionPolicy.updateCommits newest commit = 2[_0.fnm, _0_Lucene41_0.doc, _0_Memory_0.ram, _0_Lucene41_0.pos, _0.nvd, segments_2, _0.fdx, _0.nvm, _0.si, _0_Lucene41_0.tim, _0_Lucene41_0.tip, _0.fdt]
[junit4:junit4]   2> 2445 T3388 oasc.SolrCore.initWriters created json: solr.JSONResponseWriter
[junit4:junit4]   2> 2447 T3395 oasc.CachingDirectoryFactory.close Closing directory when closing factory: /usr/home/hudson/hudson-slave/workspace/Lucene-Solr-Tests-trunk-java7/solr/build/solr-core/test/J0/OpenCloseCoreStressTest_/00000_core/data
[junit4:junit4]   2> 2447 T3395 oasc.CachingDirectoryFactory.closeDirectory Closing directory: /usr/home/hudson/hudson-slave/workspace/Lucene-Solr-Tests-trunk-java7/solr/build/solr-core/test/J0/OpenCloseCoreStressTest_/00000_core/data
[junit4:junit4]   2> 2448 T3395 oasc.SolrCore.close [00010_core]  CLOSING SolrCore org.apache.solr.core.SolrCore@3fff92cf
[junit4:junit4]   2> 2449 T3438 oasc.CoreContainer.create Creating SolrCore '00000_core' using instanceDir: /usr/home/hudson/hudson-slave/workspace/Lucene-Solr-Tests-trunk-java7/solr/build/solr-core/test/J0/./OpenCloseCoreStressTest_/00000_core
[junit4:junit4]   2> 2449 T3388 oasc.RequestHandlers.initHandlersFromConfig created /admin/: solr.admin.AdminHandlers
[junit4:junit4]   2> 2449 T3388 oasc.RequestHandlers.initHandlersFromConfig created /select: solr.SearchHandler
[junit4:junit4]   2> 2449 T3438 oasc.SolrResourceLoader.<init> new SolrResourceLoader for directory: '/usr/home/hudson/hudson-slave/workspace/Lucene-Solr-Tests-trunk-java7/solr/build/solr-core/test/J0/./OpenCloseCoreStressTest_/00000_core/'
[junit4:junit4]   2> 2450 T3388 oasc.RequestHandlers.initHandlersFromConfig created /update: solr.UpdateRequestHandler
[junit4:junit4]   2> 2451 T3393 C220 UPDATE [00016_core] webapp=/solr path=/update params={wt=javabin&version=2} {add=[id60]} 0 18
[junit4:junit4]   2> 2451 T3433 C220 UPDATE [00016_core] webapp=/solr path=/update params={wt=javabin&version=2} {add=[id34]} 0 19
[junit4:junit4]   2> 2451 T3394 C220 UPDATE [00016_core] webapp=/solr path=/update params={wt=javabin&version=2} {add=[id48]} 0 16
[junit4:junit4]   2> 2453 T3395 oasu.DirectUpdateHandler2.close closing DirectUpdateHandler2{commits=0,autocommits=0,soft autocommits=0,optimizes=0,rollbacks=0,expungeDeletes=0,docsPending=3,adds=3,deletesById=0,deletesByQuery=0,errors=0,cumulative_adds=3,cumulative_deletesById=0,cumulative_deletesByQuery=0,cumulative_errors=0}
[junit4:junit4]   2> 2453 T3395 oasu.SolrCoreState.decrefSolrCoreState Closing SolrCoreState
[junit4:junit4]   2> 2454 T3395 oasu.DefaultSolrCoreState.closeIndexWriter SolrCoreState ref count has reached 0 - closing IndexWriter
[junit4:junit4]   2> 2454 T3395 oasu.DefaultSolrCoreState.closeIndexWriter closing IndexWriter with IndexWriterCloser
[junit4:junit4]   2> 2470 T3388 oashl.XMLLoader.init xsltCacheLifetimeSeconds=60
[junit4:junit4]   2> 2478 T3388 oasc.CachingDirectoryFactory.get return new directory for /usr/home/hudson/hudson-slave/workspace/Lucene-Solr-Tests-trunk-java7/solr/build/solr-core/test/J0/OpenCloseCoreStressTest_/00008_core/data/index forceNew: false
[junit4:junit4]   2> 2487 T3388 oass.SolrIndexSearcher.<init> Opening Searcher@8ef9299 main
[junit4:junit4]   2> 2489 T3388 oasc.SolrCore.registerSearcher [00008_core] Registered new searcher Searcher@8ef9299 main{StandardDirectoryReader(segments_2:3 _0(5.0):C1)}
[junit4:junit4]   2> 2489 T3388 oasu.CommitTracker.<init> Hard AutoCommit: disabled
[junit4:junit4]   2> 2489 T3388 oasu.CommitTracker.<init> Soft AutoCommit: disabled
[junit4:junit4]   2> 2493 T3388 oasc.CoreMaps.putTransientCore Opening transient core 00008_core
[junit4:junit4]   2> 2494 T3388 oasc.CoreContainer.registerCore registering core: 00008_core
[junit4:junit4]   2> ASYNC  NEW_CORE C221 name=00008_core org.apache.solr.core.SolrCore@1302b59e
[junit4:junit4]   2> 2506 T3388 C221 oasc.SolrDeletionPolicy.onInit SolrDeletionPolicy.onInit: commits:num=1
[junit4:junit4]   2> 		commit{dir=MockDirWrapper(NRTCachingDirectory(org.apache.lucene.store.MMapDirectory@/usr/home/hudson/hudson-slave/workspace/Lucene-Solr-Tests-trunk-java7/solr/build/solr-core/test/J0/OpenCloseCoreStressTest_/00008_core/data/index lockFactory=org.apache.lucene.store.NativeFSLockFactory@26ef60e7; maxCacheMB=0.8515625 maxMergeSizeMB=0.7333984375)),segFN=segments_2,generation=2,filenames=[_0.fnm, _0_Lucene41_0.doc, _0_Memory_0.ram, _0_Lucene41_0.pos, _0.nvd, segments_2, _0.fdx, _0.nvm, _0.si, _0_Lucene41_0.tim, _0_Lucene41_0.tip, _0.fdt]
[junit4:junit4]   2> 2507 T3388 C221 oasc.SolrDeletionPolicy.updateCommits newest commit = 2[_0.fnm, _0_Lucene41_0.doc, _0_Memory_0.ram, _0_Lucene41_0.pos, _0.nvd, segments_2, _0.fdx, _0.nvm, _0.si, _0_Lucene41_0.tim, _0_Lucene41_0.tip, _0.fdt]
[junit4:junit4]   2> 2509 T3388 C221 UPDATE [00008_core] webapp=/solr path=/update params={wt=javabin&version=2} {add=[id53]} 0 9
[junit4:junit4]   2> 2510 T3435 C214 REQ [00013_core] webapp=/solr path=/select params={q=*:*&wt=javabin&qt=/select&version=2} hits=0 status=0 QTime=0 
[junit4:junit4]   2> 2510 T3437 C216 REQ [00004_core] webapp=/solr path=/select params={q=*:*&wt=javabin&qt=/select&version=2} hits=0 status=0 QTime=0 
[junit4:junit4]   2> 2526 T3446 oasc.SolrConfig.<init> Loaded SolrConfig: solrconfig-minimal.xml
[junit4:junit4]   2> 2527 T3446 oass.IndexSchema.readSchema Reading Solr Schema
[junit4:junit4]   2> 2539 T3438 oasc.SolrConfig.<init> Using Lucene MatchVersion: LUCENE_41
[junit4:junit4]   2> 2541 T3446 oass.IndexSchema.readSchema Schema name=tiny
[junit4:junit4]   2> 2544 T3395 C205 oasc.SolrDeletionPolicy.onCommit SolrDeletionPolicy.onCommit: commits:num=2
[junit4:junit4]   2> 		commit{dir=MockDirWrapper(RateLimitedDirectoryWrapper(NRTCachingDirectory(org.apache.lucene.store.MMapDirectory@/usr/home/hudson/hudson-slave/workspace/Lucene-Solr-Tests-trunk-java7/solr/build/solr-core/test/J0/OpenCloseCoreStressTest_/00010_core/data/index lockFactory=org.apache.lucene.store.NativeFSLockFactory@76a93875; maxCacheMB=0.4072265625 maxMergeSizeMB=0.82421875))),segFN=segments_1,generation=1,filenames=[segments_1]
[junit4:junit4]   2> 		commit{dir=MockDirWrapper(RateLimitedDirectoryWrapper(NRTCachingDirectory(org.apache.lucene.store.MMapDirectory@/usr/home/hudson/hudson-slave/workspace/Lucene-Solr-Tests-trunk-java7/solr/build/solr-core/test/J0/OpenCloseCoreStressTest_/00010_core/data/index lockFactory=org.apache.lucene.store.NativeFSLockFactory@76a93875; maxCacheMB=0.4072265625 maxMergeSizeMB=0.82421875))),segFN=segments_2,generation=2,filenames=[_0.fnm, _0_Lucene41_0.doc, _0_Lucene41_0.pos, _0_Memory_0.ram, _0.nvd, segments_2, _0.fdx, _0.si, _0.nvm, _0_Lucene41_0.tim, _0.fdt, _0_Lucene41_0.tip]
[junit4:junit4]   2> 2545 T3395 C205 oasc.SolrDeletionPolicy.updateCommits newest commit = 2[_0.fnm, _0_Lucene41_0.doc, _0_Lucene41_0.pos, _0_Memory_0.ram, _0.nvd, segments_2, _0.fdx, _0.si, _0.nvm, _0_Lucene41_0.tim, _0.fdt, _0_Lucene41_0.tip]
[junit4:junit4]   2> 2549 T3395 oasc.SolrCore.closeSearcher [00010_core] Closing main searcher on request.
[junit4:junit4]   2> 2550 T3395 oasc.CachingDirectoryFactory.close Closing directory when closing factory: /usr/home/hudson/hudson-slave/workspace/Lucene-Solr-Tests-trunk-java7/solr/build/solr-core/test/J0/OpenCloseCoreStressTest_/00010_core/data/index
[junit4:junit4]   2> 2550 T3395 oasc.CachingDirectoryFactory.closeDirectory Closing directory: /usr/home/hudson/hudson-slave/workspace/Lucene-Solr-Tests-trunk-java7/solr/build/solr-core/test/J0/OpenCloseCoreStressTest_/00010_core/data/index
[junit4:junit4]   2> 2566 T3395 oasc.CachingDirectoryFactory.close Closing directory when closing factory: /usr/home/hudson/hudson-slave/workspace/Lucene-Solr-Tests-trunk-java7/solr/build/solr-core/test/J0/OpenCloseCoreStressTest_/00010_core/data
[junit4:junit4]   2> 2566 T3395 oasc.CachingDirectoryFactory.closeDirectory Closing directory: /usr/home/hudson/hudson-slave/workspace/Lucene-Solr-Tests-trunk-java7/solr/build/solr-core/test/J0/OpenCloseCoreStressTest_/00010_core/data
[junit4:junit4]   2> 2568 T3395 oasc.SolrCore.close [00018_core]  CLOSING SolrCore org.apache.solr.core.SolrCore@72e40b64
[junit4:junit4]   2> 2568 T3394 oasc.CoreContainer.create Creating SolrCore '00010_core' using instanceDir: /usr/home/hudson/hudson-slave/workspace/Lucene-Solr-Tests-trunk-java7/solr/build/solr-core/test/J0/./OpenCloseCoreStressTest_/00010_core
[junit4:junit4]   2> 2569 T3394 oasc.SolrResourceLoader.<init> new SolrResourceLoader for directory: '/usr/home/hudson/hudson-slave/workspace/Lucene-Solr-Tests-trunk-java7/solr/build/solr-core/test/J0/./OpenCloseCoreStressTest_/00010_core/'
[junit4:junit4]   2> 2574 T3395 oasu.DirectUpdateHandler2.close closing DirectUpdateHandler2{commits=0,autocommits=0,soft autocommits=0,optimizes=0,rollbacks=0,expungeDeletes=0,docsPending=3,adds=3,deletesById=0,deletesByQuery=0,errors=0,cumulative_adds=3,cumulative_deletesById=0,cumulative_deletesByQuery=0,cumulative_errors=0}
[junit4:junit4]   2> 2575 T3395 oasu.SolrCoreState.decrefSolrCoreState Closing SolrCoreState
[junit4:junit4]   2> 2575 T3395 oasu.DefaultSolrCoreState.closeIndexWriter SolrCoreState ref count has reached 0 - closing IndexWriter
[junit4:junit4]   2> 2575 T3395 oasu.DefaultSolrCoreState.closeIndexWriter closing IndexWriter with IndexWriterCloser
[junit4:junit4]   2> 2575 T3446 oass.IndexSchema.readSchema unique key field: id
[junit4:junit4]   2> 2583 T3446 oasc.SolrCore.initDirectoryFactory org.apache.solr.core.MockFSDirectoryFactory
[junit4:junit4]   2> 2583 T3446 oasc.SolrCore.<init> [00019_core] Opening new SolrCore at /usr/home/hudson/hudson-slave/workspace/Lucene-Solr-Tests-trunk-java7/solr/build/solr-core/test/J0/./OpenCloseCoreStressTest_/00019_core/, dataDir=/usr/home/hudson/hudson-slave/workspace/Lucene-Solr-Tests-trunk-java7/solr/build/solr-core/test/J0/OpenCloseCoreStressTest_/00019_core/data/
[junit4:junit4]   2> 2584 T3446 oasc.JmxMonitoredMap.<init> JMX monitoring is enabled. Adding Solr mbeans to JMX Server: com.sun.jmx.mbeanserver.JmxMBeanServer@3cf7366d
[junit4:junit4]   2> 2584 T3446 oasc.SolrC

[...truncated too long message...]

nymTokenizerTest, TestStressVersions, UpdateRequestProcessorFactoryTest, TestLRUCache, UnloadDistributedZkTest, TestBadConfig, PrimitiveFieldTypeTest, FieldMutatingUpdateProcessorTest, DistributedTermsComponentTest, QueryElevationComponentTest, TestValueSourceCache, PrimUtilsTest, RecoveryZkTest, WordBreakSolrSpellCheckerTest, MinimalSchemaTest, SliceStateTest, MoreLikeThisHandlerTest, OverseerTest, TestPluginEnable, PluginInfoTest, LeaderElectionTest, QueryEqualityTest, AliasIntegrationTest, TermsComponentTest, TestJoin, TestRemoteStreaming, TestStressRecovery, JsonLoaderTest, SpatialFilterTest, TestFastLRUCache, BasicDistributedZkTest, CollectionsAPIDistributedZkTest, OpenCloseCoreStressTest]
[junit4:junit4]   2> NOTE: reproduce with: ant test  -Dtestcase=OpenCloseCoreStressTest -Dtests.seed=A208317CF4D7FF76 -Dtests.multiplier=3 -Dtests.slow=true -Dtests.locale=sq_AL -Dtests.timezone=Africa/Lusaka -Dtests.file.encoding=ISO-8859-1
[junit4:junit4] ERROR   0.00s J0 | OpenCloseCoreStressTest (suite) <<<
[junit4:junit4]    > Throwable #1: java.lang.AssertionError: ERROR: SolrIndexSearcher opens=240 closes=239
[junit4:junit4]    > 	at __randomizedtesting.SeedInfo.seed([A208317CF4D7FF76]:0)
[junit4:junit4]    > 	at org.junit.Assert.fail(Assert.java:93)
[junit4:junit4]    > 	at org.apache.solr.SolrTestCaseJ4.endTrackingSearchers(SolrTestCaseJ4.java:247)
[junit4:junit4]    > 	at org.apache.solr.SolrTestCaseJ4.afterClass(SolrTestCaseJ4.java:97)
[junit4:junit4]    > 	at sun.reflect.GeneratedMethodAccessor17.invoke(Unknown Source)
[junit4:junit4]    > 	at sun.reflect.DelegatingMethodAccessorImpl.invoke(DelegatingMethodAccessorImpl.java:43)
[junit4:junit4]    > 	at java.lang.reflect.Method.invoke(Method.java:601)
[junit4:junit4]    > 	at com.carrotsearch.randomizedtesting.RandomizedRunner.invoke(RandomizedRunner.java:1559)
[junit4:junit4]    > 	at com.carrotsearch.randomizedtesting.RandomizedRunner.access$600(RandomizedRunner.java:79)
[junit4:junit4]    > 	at com.carrotsearch.randomizedtesting.RandomizedRunner$5.evaluate(RandomizedRunner.java:700)
[junit4:junit4]    > 	at com.carrotsearch.randomizedtesting.rules.StatementAdapter.evaluate(StatementAdapter.java:36)
[junit4:junit4]    > 	at com.carrotsearch.randomizedtesting.rules.SystemPropertiesRestoreRule$1.evaluate(SystemPropertiesRestoreRule.java:53)
[junit4:junit4]    > 	at org.apache.lucene.util.AbstractBeforeAfterRule$1.evaluate(AbstractBeforeAfterRule.java:46)
[junit4:junit4]    > 	at org.apache.lucene.util.TestRuleStoreClassName$1.evaluate(TestRuleStoreClassName.java:42)
[junit4:junit4]    > 	at com.carrotsearch.randomizedtesting.rules.SystemPropertiesInvariantRule$1.evaluate(SystemPropertiesInvariantRule.java:55)
[junit4:junit4]    > 	at com.carrotsearch.randomizedtesting.rules.NoShadowingOrOverridesOnMethodsRule$1.evaluate(NoShadowingOrOverridesOnMethodsRule.java:39)
[junit4:junit4]    > 	at com.carrotsearch.randomizedtesting.rules.NoShadowingOrOverridesOnMethodsRule$1.evaluate(NoShadowingOrOverridesOnMethodsRule.java:39)
[junit4:junit4]    > 	at com.carrotsearch.randomizedtesting.rules.StatementAdapter.evaluate(StatementAdapter.java:36)
[junit4:junit4]    > 	at org.apache.lucene.util.TestRuleAssertionsRequired$1.evaluate(TestRuleAssertionsRequired.java:43)
[junit4:junit4]    > 	at org.apache.lucene.util.TestRuleMarkFailure$1.evaluate(TestRuleMarkFailure.java:48)
[junit4:junit4]    > 	at org.apache.lucene.util.TestRuleIgnoreAfterMaxFailures$1.evaluate(TestRuleIgnoreAfterMaxFailures.java:70)
[junit4:junit4]    > 	at org.apache.lucene.util.TestRuleIgnoreTestSuites$1.evaluate(TestRuleIgnoreTestSuites.java:55)
[junit4:junit4]    > 	at com.carrotsearch.randomizedtesting.rules.StatementAdapter.evaluate(StatementAdapter.java:36)
[junit4:junit4]    > 	at com.carrotsearch.randomizedtesting.ThreadLeakControl$StatementRunner.run(ThreadLeakControl.java:358)
[junit4:junit4]    > 	at java.lang.Thread.run(Thread.java:722)
[junit4:junit4]    > Throwable #2: com.carrotsearch.randomizedtesting.ThreadLeakError: 2 threads leaked from SUITE scope at org.apache.solr.core.OpenCloseCoreStressTest: 
[junit4:junit4]    >    1) Thread[id=3725, name=searcherExecutor-2261-thread-1, state=WAITING, group=TGRP-OpenCloseCoreStressTest]
[junit4:junit4]    >         at sun.misc.Unsafe.park(Native Method)
[junit4:junit4]    >         at java.util.concurrent.locks.LockSupport.park(LockSupport.java:186)
[junit4:junit4]    >         at java.util.concurrent.locks.AbstractQueuedSynchronizer$ConditionObject.await(AbstractQueuedSynchronizer.java:2043)
[junit4:junit4]    >         at java.util.concurrent.LinkedBlockingQueue.take(LinkedBlockingQueue.java:442)
[junit4:junit4]    >         at java.util.concurrent.ThreadPoolExecutor.getTask(ThreadPoolExecutor.java:1068)
[junit4:junit4]    >         at java.util.concurrent.ThreadPoolExecutor.runWorker(ThreadPoolExecutor.java:1130)
[junit4:junit4]    >         at java.util.concurrent.ThreadPoolExecutor$Worker.run(ThreadPoolExecutor.java:615)
[junit4:junit4]    >         at java.lang.Thread.run(Thread.java:722)
[junit4:junit4]    >    2) Thread[id=3727, name=commitScheduler-2263-thread-1, state=WAITING, group=TGRP-OpenCloseCoreStressTest]
[junit4:junit4]    >         at sun.misc.Unsafe.park(Native Method)
[junit4:junit4]    >         at java.util.concurrent.locks.LockSupport.park(LockSupport.java:186)
[junit4:junit4]    >         at java.util.concurrent.locks.AbstractQueuedSynchronizer$ConditionObject.await(AbstractQueuedSynchronizer.java:2043)
[junit4:junit4]    >         at java.util.concurrent.ScheduledThreadPoolExecutor$DelayedWorkQueue.take(ScheduledThreadPoolExecutor.java:1079)
[junit4:junit4]    >         at java.util.concurrent.ScheduledThreadPoolExecutor$DelayedWorkQueue.take(ScheduledThreadPoolExecutor.java:807)
[junit4:junit4]    >         at java.util.concurrent.ThreadPoolExecutor.getTask(ThreadPoolExecutor.java:1068)
[junit4:junit4]    >         at java.util.concurrent.ThreadPoolExecutor.runWorker(ThreadPoolExecutor.java:1130)
[junit4:junit4]    >         at java.util.concurrent.ThreadPoolExecutor$Worker.run(ThreadPoolExecutor.java:615)
[junit4:junit4]    >         at java.lang.Thread.run(Thread.java:722)
[junit4:junit4]    > 	at __randomizedtesting.SeedInfo.seed([A208317CF4D7FF76]:0)
[junit4:junit4]    > Throwable #3: com.carrotsearch.randomizedtesting.ThreadLeakError: There are still zombie threads that couldn't be terminated:
[junit4:junit4]    >    1) Thread[id=3725, name=searcherExecutor-2261-thread-1, state=WAITING, group=TGRP-OpenCloseCoreStressTest]
[junit4:junit4]    >         at sun.misc.Unsafe.park(Native Method)
[junit4:junit4]    >         at java.util.concurrent.locks.LockSupport.park(LockSupport.java:186)
[junit4:junit4]    >         at java.util.concurrent.locks.AbstractQueuedSynchronizer$ConditionObject.await(AbstractQueuedSynchronizer.java:2043)
[junit4:junit4]    >         at java.util.concurrent.LinkedBlockingQueue.take(LinkedBlockingQueue.java:442)
[junit4:junit4]    >         at java.util.concurrent.ThreadPoolExecutor.getTask(ThreadPoolExecutor.java:1068)
[junit4:junit4]    >         at java.util.concurrent.ThreadPoolExecutor.runWorker(ThreadPoolExecutor.java:1130)
[junit4:junit4]    >         at java.util.concurrent.ThreadPoolExecutor$Worker.run(ThreadPoolExecutor.java:615)
[junit4:junit4]    >         at java.lang.Thread.run(Thread.java:722)
[junit4:junit4]    >    2) Thread[id=3727, name=commitScheduler-2263-thread-1, state=WAITING, group=TGRP-OpenCloseCoreStressTest]
[junit4:junit4]    >         at sun.misc.Unsafe.park(Native Method)
[junit4:junit4]    >         at java.util.concurrent.locks.LockSupport.park(LockSupport.java:186)
[junit4:junit4]    >         at java.util.concurrent.locks.AbstractQueuedSynchronizer$ConditionObject.await(AbstractQueuedSynchronizer.java:2043)
[junit4:junit4]    >         at java.util.concurrent.ScheduledThreadPoolExecutor$DelayedWorkQueue.take(ScheduledThreadPoolExecutor.java:1079)
[junit4:junit4]    >         at java.util.concurrent.ScheduledThreadPoolExecutor$DelayedWorkQueue.take(ScheduledThreadPoolExecutor.java:807)
[junit4:junit4]    >         at java.util.concurrent.ThreadPoolExecutor.getTask(ThreadPoolExecutor.java:1068)
[junit4:junit4]    >         at java.util.concurrent.ThreadPoolExecutor.runWorker(ThreadPoolExecutor.java:1130)
[junit4:junit4]    >         at java.util.concurrent.ThreadPoolExecutor$Worker.run(ThreadPoolExecutor.java:615)
[junit4:junit4]    >         at java.lang.Thread.run(Thread.java:722)
[junit4:junit4]    > 	at __randomizedtesting.SeedInfo.seed([A208317CF4D7FF76]:0)
[junit4:junit4] Completed on J0 in 399.02s, 6 tests, 3 failures, 2 errors, 4 skipped <<< FAILURES!

[...truncated 409 lines...]
BUILD FAILED
/usr/home/hudson/hudson-slave/workspace/Lucene-Solr-Tests-trunk-java7/build.xml:381: The following error occurred while executing this line:
/usr/home/hudson/hudson-slave/workspace/Lucene-Solr-Tests-trunk-java7/build.xml:361: The following error occurred while executing this line:
/usr/home/hudson/hudson-slave/workspace/Lucene-Solr-Tests-trunk-java7/build.xml:39: The following error occurred while executing this line:
/usr/home/hudson/hudson-slave/workspace/Lucene-Solr-Tests-trunk-java7/solr/build.xml:183: The following error occurred while executing this line:
/usr/home/hudson/hudson-slave/workspace/Lucene-Solr-Tests-trunk-java7/solr/common-build.xml:449: The following error occurred while executing this line:
/usr/home/hudson/hudson-slave/workspace/Lucene-Solr-Tests-trunk-java7/lucene/common-build.xml:1213: The following error occurred while executing this line:
/usr/home/hudson/hudson-slave/workspace/Lucene-Solr-Tests-trunk-java7/lucene/common-build.xml:877: There were test failures: 272 suites, 1144 tests, 3 suite-level errors, 2 failures, 527 ignored (6 assumptions)

Total time: 59 minutes 54 seconds
Build step 'Invoke Ant' marked build as failure
Archiving artifacts
Recording test results
Email was triggered for: Failure
Sending email for trigger: Failure



Mime
View raw message