lucene-dev mailing list archives

Site index · List index
Message view « Date » · « Thread »
Top « Date » · « Thread »
From Policeman Jenkins Server <jenk...@thetaphi.de>
Subject [JENKINS] Lucene-Solr-4.x-Linux (64bit/jdk1.8.0-ea-b79) - Build # 4575 - Still Failing!
Date Thu, 07 Mar 2013 09:03:22 GMT
Build: http://jenkins.thetaphi.de/job/Lucene-Solr-4.x-Linux/4575/
Java: 64bit/jdk1.8.0-ea-b79 -XX:+UseG1GC

4 tests failed.
REGRESSION:  org.apache.solr.cloud.BasicDistributedZk2Test.testDistribSearch

Error Message:
Server at http://127.0.0.1:35097/fhb/f/onenodecollectioncore returned non ok status:404, message:Can not find: /fhb/f/onenodecollectioncore/update

Stack Trace:
org.apache.solr.common.SolrException: Server at http://127.0.0.1:35097/fhb/f/onenodecollectioncore returned non ok status:404, message:Can not find: /fhb/f/onenodecollectioncore/update
	at __randomizedtesting.SeedInfo.seed([E8D2B859D380A4D3:69343641A4DFC4EF]:0)
	at org.apache.solr.client.solrj.impl.HttpSolrServer.request(HttpSolrServer.java:375)
	at org.apache.solr.client.solrj.impl.HttpSolrServer.request(HttpSolrServer.java:181)
	at org.apache.solr.client.solrj.request.AbstractUpdateRequest.process(AbstractUpdateRequest.java:117)
	at org.apache.solr.client.solrj.SolrServer.add(SolrServer.java:116)
	at org.apache.solr.client.solrj.SolrServer.add(SolrServer.java:102)
	at org.apache.solr.cloud.BasicDistributedZk2Test.testNodeWithoutCollectionForwarding(BasicDistributedZk2Test.java:196)
	at org.apache.solr.cloud.BasicDistributedZk2Test.doTest(BasicDistributedZk2Test.java:85)
	at org.apache.solr.BaseDistributedSearchTestCase.testDistribSearch(BaseDistributedSearchTestCase.java:806)
	at sun.reflect.NativeMethodAccessorImpl.invoke0(Native Method)
	at sun.reflect.NativeMethodAccessorImpl.invoke(NativeMethodAccessorImpl.java:57)
	at sun.reflect.DelegatingMethodAccessorImpl.invoke(DelegatingMethodAccessorImpl.java:43)
	at java.lang.reflect.Method.invoke(Method.java:487)
	at com.carrotsearch.randomizedtesting.RandomizedRunner.invoke(RandomizedRunner.java:1559)
	at com.carrotsearch.randomizedtesting.RandomizedRunner.access$600(RandomizedRunner.java:79)
	at com.carrotsearch.randomizedtesting.RandomizedRunner$6.evaluate(RandomizedRunner.java:737)
	at com.carrotsearch.randomizedtesting.RandomizedRunner$7.evaluate(RandomizedRunner.java:773)
	at com.carrotsearch.randomizedtesting.RandomizedRunner$8.evaluate(RandomizedRunner.java:787)
	at com.carrotsearch.randomizedtesting.rules.SystemPropertiesRestoreRule$1.evaluate(SystemPropertiesRestoreRule.java:53)
	at org.apache.lucene.util.TestRuleSetupTeardownChained$1.evaluate(TestRuleSetupTeardownChained.java:50)
	at org.apache.lucene.util.TestRuleFieldCacheSanity$1.evaluate(TestRuleFieldCacheSanity.java:51)
	at org.apache.lucene.util.AbstractBeforeAfterRule$1.evaluate(AbstractBeforeAfterRule.java:46)
	at com.carrotsearch.randomizedtesting.rules.SystemPropertiesInvariantRule$1.evaluate(SystemPropertiesInvariantRule.java:55)
	at org.apache.lucene.util.TestRuleThreadAndTestName$1.evaluate(TestRuleThreadAndTestName.java:49)
	at org.apache.lucene.util.TestRuleIgnoreAfterMaxFailures$1.evaluate(TestRuleIgnoreAfterMaxFailures.java:70)
	at org.apache.lucene.util.TestRuleMarkFailure$1.evaluate(TestRuleMarkFailure.java:48)
	at com.carrotsearch.randomizedtesting.rules.StatementAdapter.evaluate(StatementAdapter.java:36)
	at com.carrotsearch.randomizedtesting.ThreadLeakControl$StatementRunner.run(ThreadLeakControl.java:358)
	at com.carrotsearch.randomizedtesting.ThreadLeakControl.forkTimeoutingTask(ThreadLeakControl.java:782)
	at com.carrotsearch.randomizedtesting.ThreadLeakControl$3.evaluate(ThreadLeakControl.java:442)
	at com.carrotsearch.randomizedtesting.RandomizedRunner.runSingleTest(RandomizedRunner.java:746)
	at com.carrotsearch.randomizedtesting.RandomizedRunner$3.evaluate(RandomizedRunner.java:648)
	at com.carrotsearch.randomizedtesting.RandomizedRunner$4.evaluate(RandomizedRunner.java:682)
	at com.carrotsearch.randomizedtesting.RandomizedRunner$5.evaluate(RandomizedRunner.java:693)
	at com.carrotsearch.randomizedtesting.rules.StatementAdapter.evaluate(StatementAdapter.java:36)
	at com.carrotsearch.randomizedtesting.rules.SystemPropertiesRestoreRule$1.evaluate(SystemPropertiesRestoreRule.java:53)
	at org.apache.lucene.util.AbstractBeforeAfterRule$1.evaluate(AbstractBeforeAfterRule.java:46)
	at org.apache.lucene.util.TestRuleStoreClassName$1.evaluate(TestRuleStoreClassName.java:42)
	at com.carrotsearch.randomizedtesting.rules.SystemPropertiesInvariantRule$1.evaluate(SystemPropertiesInvariantRule.java:55)
	at com.carrotsearch.randomizedtesting.rules.NoShadowingOrOverridesOnMethodsRule$1.evaluate(NoShadowingOrOverridesOnMethodsRule.java:39)
	at com.carrotsearch.randomizedtesting.rules.NoShadowingOrOverridesOnMethodsRule$1.evaluate(NoShadowingOrOverridesOnMethodsRule.java:39)
	at com.carrotsearch.randomizedtesting.rules.StatementAdapter.evaluate(StatementAdapter.java:36)
	at org.apache.lucene.util.TestRuleAssertionsRequired$1.evaluate(TestRuleAssertionsRequired.java:43)
	at org.apache.lucene.util.TestRuleMarkFailure$1.evaluate(TestRuleMarkFailure.java:48)
	at org.apache.lucene.util.TestRuleIgnoreAfterMaxFailures$1.evaluate(TestRuleIgnoreAfterMaxFailures.java:70)
	at org.apache.lucene.util.TestRuleIgnoreTestSuites$1.evaluate(TestRuleIgnoreTestSuites.java:55)
	at com.carrotsearch.randomizedtesting.rules.StatementAdapter.evaluate(StatementAdapter.java:36)
	at com.carrotsearch.randomizedtesting.ThreadLeakControl$StatementRunner.run(ThreadLeakControl.java:358)
	at java.lang.Thread.run(Thread.java:722)


FAILED:  org.apache.solr.cloud.UnloadDistributedZkTest.testDistribSearch

Error Message:
Still found shard

Stack Trace:
java.lang.AssertionError: Still found shard
	at __randomizedtesting.SeedInfo.seed([E8D2B859D380A4D3:69343641A4DFC4EF]:0)
	at org.junit.Assert.fail(Assert.java:93)
	at org.apache.solr.cloud.UnloadDistributedZkTest.testUnloadShardAndCollection(UnloadDistributedZkTest.java:124)
	at org.apache.solr.cloud.UnloadDistributedZkTest.doTest(UnloadDistributedZkTest.java:77)
	at org.apache.solr.BaseDistributedSearchTestCase.testDistribSearch(BaseDistributedSearchTestCase.java:806)
	at sun.reflect.NativeMethodAccessorImpl.invoke0(Native Method)
	at sun.reflect.NativeMethodAccessorImpl.invoke(NativeMethodAccessorImpl.java:57)
	at sun.reflect.DelegatingMethodAccessorImpl.invoke(DelegatingMethodAccessorImpl.java:43)
	at java.lang.reflect.Method.invoke(Method.java:487)
	at com.carrotsearch.randomizedtesting.RandomizedRunner.invoke(RandomizedRunner.java:1559)
	at com.carrotsearch.randomizedtesting.RandomizedRunner.access$600(RandomizedRunner.java:79)
	at com.carrotsearch.randomizedtesting.RandomizedRunner$6.evaluate(RandomizedRunner.java:737)
	at com.carrotsearch.randomizedtesting.RandomizedRunner$7.evaluate(RandomizedRunner.java:773)
	at com.carrotsearch.randomizedtesting.RandomizedRunner$8.evaluate(RandomizedRunner.java:787)
	at com.carrotsearch.randomizedtesting.rules.SystemPropertiesRestoreRule$1.evaluate(SystemPropertiesRestoreRule.java:53)
	at org.apache.lucene.util.TestRuleSetupTeardownChained$1.evaluate(TestRuleSetupTeardownChained.java:50)
	at org.apache.lucene.util.TestRuleFieldCacheSanity$1.evaluate(TestRuleFieldCacheSanity.java:51)
	at org.apache.lucene.util.AbstractBeforeAfterRule$1.evaluate(AbstractBeforeAfterRule.java:46)
	at com.carrotsearch.randomizedtesting.rules.SystemPropertiesInvariantRule$1.evaluate(SystemPropertiesInvariantRule.java:55)
	at org.apache.lucene.util.TestRuleThreadAndTestName$1.evaluate(TestRuleThreadAndTestName.java:49)
	at org.apache.lucene.util.TestRuleIgnoreAfterMaxFailures$1.evaluate(TestRuleIgnoreAfterMaxFailures.java:70)
	at org.apache.lucene.util.TestRuleMarkFailure$1.evaluate(TestRuleMarkFailure.java:48)
	at com.carrotsearch.randomizedtesting.rules.StatementAdapter.evaluate(StatementAdapter.java:36)
	at com.carrotsearch.randomizedtesting.ThreadLeakControl$StatementRunner.run(ThreadLeakControl.java:358)
	at com.carrotsearch.randomizedtesting.ThreadLeakControl.forkTimeoutingTask(ThreadLeakControl.java:782)
	at com.carrotsearch.randomizedtesting.ThreadLeakControl$3.evaluate(ThreadLeakControl.java:442)
	at com.carrotsearch.randomizedtesting.RandomizedRunner.runSingleTest(RandomizedRunner.java:746)
	at com.carrotsearch.randomizedtesting.RandomizedRunner$3.evaluate(RandomizedRunner.java:648)
	at com.carrotsearch.randomizedtesting.RandomizedRunner$4.evaluate(RandomizedRunner.java:682)
	at com.carrotsearch.randomizedtesting.RandomizedRunner$5.evaluate(RandomizedRunner.java:693)
	at com.carrotsearch.randomizedtesting.rules.StatementAdapter.evaluate(StatementAdapter.java:36)
	at com.carrotsearch.randomizedtesting.rules.SystemPropertiesRestoreRule$1.evaluate(SystemPropertiesRestoreRule.java:53)
	at org.apache.lucene.util.AbstractBeforeAfterRule$1.evaluate(AbstractBeforeAfterRule.java:46)
	at org.apache.lucene.util.TestRuleStoreClassName$1.evaluate(TestRuleStoreClassName.java:42)
	at com.carrotsearch.randomizedtesting.rules.SystemPropertiesInvariantRule$1.evaluate(SystemPropertiesInvariantRule.java:55)
	at com.carrotsearch.randomizedtesting.rules.NoShadowingOrOverridesOnMethodsRule$1.evaluate(NoShadowingOrOverridesOnMethodsRule.java:39)
	at com.carrotsearch.randomizedtesting.rules.NoShadowingOrOverridesOnMethodsRule$1.evaluate(NoShadowingOrOverridesOnMethodsRule.java:39)
	at com.carrotsearch.randomizedtesting.rules.StatementAdapter.evaluate(StatementAdapter.java:36)
	at org.apache.lucene.util.TestRuleAssertionsRequired$1.evaluate(TestRuleAssertionsRequired.java:43)
	at org.apache.lucene.util.TestRuleMarkFailure$1.evaluate(TestRuleMarkFailure.java:48)
	at org.apache.lucene.util.TestRuleIgnoreAfterMaxFailures$1.evaluate(TestRuleIgnoreAfterMaxFailures.java:70)
	at org.apache.lucene.util.TestRuleIgnoreTestSuites$1.evaluate(TestRuleIgnoreTestSuites.java:55)
	at com.carrotsearch.randomizedtesting.rules.StatementAdapter.evaluate(StatementAdapter.java:36)
	at com.carrotsearch.randomizedtesting.ThreadLeakControl$StatementRunner.run(ThreadLeakControl.java:358)
	at java.lang.Thread.run(Thread.java:722)


FAILED:  org.apache.solr.rest.TestFieldCollectionResource.testGetAllFields

Error Message:
Exception during query

Stack Trace:
java.lang.RuntimeException: Exception during query
	at __randomizedtesting.SeedInfo.seed([E8D2B859D380A4D3:47CF29D29735D4B]:0)
	at org.apache.solr.util.RestTestBase.assertQ(RestTestBase.java:143)
	at org.apache.solr.rest.TestFieldCollectionResource.testGetAllFields(TestFieldCollectionResource.java:26)
	at sun.reflect.NativeMethodAccessorImpl.invoke0(Native Method)
	at sun.reflect.NativeMethodAccessorImpl.invoke(NativeMethodAccessorImpl.java:57)
	at sun.reflect.DelegatingMethodAccessorImpl.invoke(DelegatingMethodAccessorImpl.java:43)
	at java.lang.reflect.Method.invoke(Method.java:487)
	at com.carrotsearch.randomizedtesting.RandomizedRunner.invoke(RandomizedRunner.java:1559)
	at com.carrotsearch.randomizedtesting.RandomizedRunner.access$600(RandomizedRunner.java:79)
	at com.carrotsearch.randomizedtesting.RandomizedRunner$6.evaluate(RandomizedRunner.java:737)
	at com.carrotsearch.randomizedtesting.RandomizedRunner$7.evaluate(RandomizedRunner.java:773)
	at com.carrotsearch.randomizedtesting.RandomizedRunner$8.evaluate(RandomizedRunner.java:787)
	at com.carrotsearch.randomizedtesting.rules.SystemPropertiesRestoreRule$1.evaluate(SystemPropertiesRestoreRule.java:53)
	at org.apache.lucene.util.TestRuleSetupTeardownChained$1.evaluate(TestRuleSetupTeardownChained.java:50)
	at org.apache.lucene.util.TestRuleFieldCacheSanity$1.evaluate(TestRuleFieldCacheSanity.java:51)
	at org.apache.lucene.util.AbstractBeforeAfterRule$1.evaluate(AbstractBeforeAfterRule.java:46)
	at com.carrotsearch.randomizedtesting.rules.SystemPropertiesInvariantRule$1.evaluate(SystemPropertiesInvariantRule.java:55)
	at org.apache.lucene.util.TestRuleThreadAndTestName$1.evaluate(TestRuleThreadAndTestName.java:49)
	at org.apache.lucene.util.TestRuleIgnoreAfterMaxFailures$1.evaluate(TestRuleIgnoreAfterMaxFailures.java:70)
	at org.apache.lucene.util.TestRuleMarkFailure$1.evaluate(TestRuleMarkFailure.java:48)
	at com.carrotsearch.randomizedtesting.rules.StatementAdapter.evaluate(StatementAdapter.java:36)
	at com.carrotsearch.randomizedtesting.ThreadLeakControl$StatementRunner.run(ThreadLeakControl.java:358)
	at com.carrotsearch.randomizedtesting.ThreadLeakControl.forkTimeoutingTask(ThreadLeakControl.java:782)
	at com.carrotsearch.randomizedtesting.ThreadLeakControl$3.evaluate(ThreadLeakControl.java:442)
	at com.carrotsearch.randomizedtesting.RandomizedRunner.runSingleTest(RandomizedRunner.java:746)
	at com.carrotsearch.randomizedtesting.RandomizedRunner$3.evaluate(RandomizedRunner.java:648)
	at com.carrotsearch.randomizedtesting.RandomizedRunner$4.evaluate(RandomizedRunner.java:682)
	at com.carrotsearch.randomizedtesting.RandomizedRunner$5.evaluate(RandomizedRunner.java:693)
	at com.carrotsearch.randomizedtesting.rules.StatementAdapter.evaluate(StatementAdapter.java:36)
	at com.carrotsearch.randomizedtesting.rules.SystemPropertiesRestoreRule$1.evaluate(SystemPropertiesRestoreRule.java:53)
	at org.apache.lucene.util.AbstractBeforeAfterRule$1.evaluate(AbstractBeforeAfterRule.java:46)
	at org.apache.lucene.util.TestRuleStoreClassName$1.evaluate(TestRuleStoreClassName.java:42)
	at com.carrotsearch.randomizedtesting.rules.SystemPropertiesInvariantRule$1.evaluate(SystemPropertiesInvariantRule.java:55)
	at com.carrotsearch.randomizedtesting.rules.NoShadowingOrOverridesOnMethodsRule$1.evaluate(NoShadowingOrOverridesOnMethodsRule.java:39)
	at com.carrotsearch.randomizedtesting.rules.NoShadowingOrOverridesOnMethodsRule$1.evaluate(NoShadowingOrOverridesOnMethodsRule.java:39)
	at com.carrotsearch.randomizedtesting.rules.StatementAdapter.evaluate(StatementAdapter.java:36)
	at org.apache.lucene.util.TestRuleAssertionsRequired$1.evaluate(TestRuleAssertionsRequired.java:43)
	at org.apache.lucene.util.TestRuleMarkFailure$1.evaluate(TestRuleMarkFailure.java:48)
	at org.apache.lucene.util.TestRuleIgnoreAfterMaxFailures$1.evaluate(TestRuleIgnoreAfterMaxFailures.java:70)
	at org.apache.lucene.util.TestRuleIgnoreTestSuites$1.evaluate(TestRuleIgnoreTestSuites.java:55)
	at com.carrotsearch.randomizedtesting.rules.StatementAdapter.evaluate(StatementAdapter.java:36)
	at com.carrotsearch.randomizedtesting.ThreadLeakControl$StatementRunner.run(ThreadLeakControl.java:358)
	at java.lang.Thread.run(Thread.java:722)
Caused by: java.lang.RuntimeException: REQUEST FAILED: xpath=(/response/arr[@name='fields']/lst/str[@name='name'])[1] = 'custstopfilt'
	xml response was: <?xml version="1.0" encoding="UTF-8"?>
<response>

<lst name="responseHeader">
  <int name="status">0</int>
  <int name="QTime">284</int>
</lst>
<arr name="fields">
  <lst>
    <str name="name">patternreplacefilt</str>
    <str name="type">patternreplacefilt</str>
    <bool name="indexed">true</bool>
    <bool name="stored">true</bool>
  </lst>
  <lst>
    <str name="name">bday</str>
    <str name="type">date</str>
    <bool name="indexed">true</bool>
    <bool name="stored">true</bool>
  </lst>
  <lst>
    <str name="name">test_notv</str>
    <str name="type">text</str>
    <bool name="termVectors">false</bool>
  </lst>
  <lst>
    <str name="name">standardtokfilt</str>
    <str name="type">standardtokfilt</str>
    <bool name="indexed">true</bool>
    <bool name="stored">true</bool>
  </lst>
  <lst>
    <str name="name">nouniq</str>
    <str name="type">string</str>
    <bool name="multiValued">true</bool>
    <bool name="indexed">true</bool>
    <bool name="stored">true</bool>
  </lst>
  <lst>
    <str name="name">title_stemmed</str>
    <str name="type">text</str>
    <bool name="indexed">true</bool>
    <bool name="stored">false</bool>
  </lst>
  <lst>
    <str name="name">whitetok</str>
    <str name="type">whitetok</str>
    <bool name="indexed">true</bool>
    <bool name="stored">true</bool>
  </lst>
  <lst>
    <str name="name">weight</str>
    <str name="type">float</str>
    <bool name="indexed">true</bool>
    <bool name="stored">true</bool>
  </lst>
  <lst>
    <str name="name">numberpartfail</str>
    <str name="type">failtype1</str>
    <bool name="indexed">true</bool>
    <bool name="stored">true</bool>
  </lst>
  <lst>
    <str name="name">sind</str>
    <str name="type">string</str>
    <bool name="indexed">true</bool>
    <bool name="stored">false</bool>
  </lst>
  <lst>
    <str name="name">lowertok</str>
    <str name="type">lowertok</str>
    <bool name="indexed">true</bool>
    <bool name="stored">true</bool>
  </lst>
  <lst>
    <str name="name">standardtok</str>
    <str name="type">standardtok</str>
    <bool name="indexed">true</bool>
    <bool name="stored">true</bool>
  </lst>
  <lst>
    <str name="name">test_hlt</str>
    <str name="type">highlittext</str>
    <bool name="indexed">true</bool>
    <bool name="compressed">true</bool>
  </lst>
  <lst>
    <str name="name">keywordtok</str>
    <str name="type">keywordtok</str>
    <bool name="indexed">true</bool>
    <bool name="stored">true</bool>
  </lst>
  <lst>
    <str name="name">uniq3</str>
    <str name="type">string</str>
    <bool name="indexed">true</bool>
    <bool name="stored">true</bool>
  </lst>
  <lst>
    <str name="name">bind</str>
    <str name="type">boolean</str>
    <bool name="indexed">true</bool>
    <bool name="stored">false</bool>
  </lst>
  <lst>
    <str name="name">teststop</str>
    <str name="type">teststop</str>
    <bool name="indexed">true</bool>
    <bool name="stored">true</bool>
  </lst>
  <lst>
    <str name="name">uniq</str>
    <str name="type">string</str>
    <bool name="multiValued">true</bool>
    <bool name="indexed">true</bool>
    <bool name="stored">true</bool>
  </lst>
  <lst>
    <str name="name">textgap</str>
    <str name="type">textgap</str>
    <bool name="indexed">true</bool>
    <bool name="stored">true</bool>
  </lst>
  <lst>
    <str name="name">test_basictv</str>
    <str name="type">text</str>
    <bool name="termVectors">true</bool>
  </lst>
  <lst>
    <str name="name">uniq2</str>
    <str name="type">string</str>
    <bool name="multiValued">true</bool>
    <bool name="indexed">true</bool>
    <bool name="stored">true</bool>
  </lst>
  <lst>
    <str name="name">iind</str>
    <str name="type">int</str>
    <bool name="indexed">true</bool>
    <bool name="stored">false</bool>
  </lst>
  <lst>
    <str name="name">title_lettertok</str>
    <str name="type">lettertok</str>
    <bool name="indexed">true</bool>
    <bool name="stored">false</bool>
  </lst>
  <lst>
    <str name="name">isto</str>
    <str name="type">int</str>
    <bool name="indexed">false</bool>
    <bool name="stored">true</bool>
  </lst>
  <lst>
    <str name="name">test_hlt_off</str>
    <str name="type">highlittext</str>
    <bool name="indexed">true</bool>
    <bool name="compressed">false</bool>
  </lst>
  <lst>
    <str name="name">sku1</str>
    <str name="type">skutype1</str>
    <bool name="indexed">true</bool>
    <bool name="stored">true</bool>
  </lst>
  <lst>
    <str name="name">custengporterfilt</str>
    <str name="type">custengporterfilt</str>
    <bool name="indexed">true</bool>
    <bool name="stored">true</bool>
  </lst>
  <lst>
    <str name="name">wdf_nocase</str>
    <str name="type">wdf_nocase</str>
    <bool name="indexed">true</bool>
    <bool name="stored">true</bool>
  </lst>
  <lst>
    <str name="name">dedup</str>
    <str name="type">dedup</str>
    <bool name="indexed">true</bool>
    <bool name="stored">true</bool>
  </lst>
  <lst>
    <str name="name">title</str>
    <str name="type">nametext</str>
    <bool name="indexed">true</bool>
    <bool name="stored">true</bool>
  </lst>
  <lst>
    <str name="name">syn</str>
    <str name="type">syn</str>
    <bool name="indexed">true</bool>
    <bool name="stored">true</bool>
  </lst>
  <lst>
    <str name="name">lengthfilt</str>
    <str name="type">lengthfilt</str>
    <bool name="indexed">true</bool>
    <bool name="stored">true</bool>
  </lst>
  <lst>
    <str name="name">pointD</str>
    <str name="type">xyd</str>
    <bool name="multiValued">false</bool>
    <bool name="indexed">true</bool>
    <bool name="stored">true</bool>
  </lst>
  <lst>
    <str name="name">engporterfilt</str>
    <str name="type">engporterfilt</str>
    <bool name="indexed">true</bool>
    <bool name="stored">true</bool>
  </lst>
  <lst>
    <str name="name">porterfilt</str>
    <str name="type">porterfilt</str>
    <bool name="indexed">true</bool>
    <bool name="stored">true</bool>
  </lst>
  <lst>
    <str name="name">shouldbestored</str>
    <str name="type">unstored</str>
    <bool name="stored">true</bool>
  </lst>
  <lst>
    <str name="name">_version_</str>
    <str name="type">long</str>
    <bool name="indexed">true</bool>
    <bool name="stored">true</bool>
  </lst>
  <lst>
    <str name="name">test_offtv</str>
    <str name="type">text</str>
    <bool name="termVectors">true</bool>
    <bool name="termOffsets">true</bool>
  </lst>
  <lst>
    <str name="name">HTMLstandardtok</str>
    <str name="type">HTMLstandardtok</str>
    <bool name="indexed">true</bool>
    <bool name="stored">true</bool>
  </lst>
  <lst>
    <str name="name">bsto</str>
    <str name="type">boolean</str>
    <bool name="indexed">false</bool>
    <bool name="stored">true</bool>
  </lst>
  <lst>
    <str name="name">point</str>
    <str name="type">xy</str>
    <bool name="multiValued">false</bool>
    <bool name="indexed">true</bool>
    <bool name="stored">true</bool>
  </lst>
  <lst>
    <str name="name">numericsubword</str>
    <str name="type">numericsubword</str>
    <bool name="indexed">true</bool>
    <bool name="stored">true</bool>
  </lst>
  <lst>
    <str name="name">lowerfilt</str>
    <str name="type">lowerfilt</str>
    <bool name="indexed">true</bool>
    <bool name="stored">true</bool>
  </lst>
  <lst>
    <str name="name">ssto</str>
    <str name="type">string</str>
    <bool name="indexed">false</bool>
    <bool name="stored">true</bool>
  </lst>
  <lst>
    <str name="name">test_posofftv</str>
    <str name="type">text</str>
    <bool name="termVectors">true</bool>
    <bool name="termPositions">true</bool>
    <bool name="termOffsets">true</bool>
  </lst>
  <lst>
    <str name="name">point_hash</str>
    <str name="type">geohash</str>
    <bool name="multiValued">false</bool>
    <bool name="indexed">true</bool>
    <bool name="stored">true</bool>
  </lst>
  <lst>
    <str name="name">stopfilt</str>
    <str name="type">stopfilt</str>
    <bool name="indexed">true</bool>
    <bool name="stored">true</bool>
  </lst>
  <lst>
    <str name="name">custstopfilt</str>
    <str name="type">custstopfilt</str>
    <bool name="indexed">true</bool>
    <bool name="stored">true</bool>
  </lst>
  <lst>
    <str name="name">HTMLwhitetok</str>
    <str name="type">HTMLwhitetok</str>
    <bool name="indexed">true</bool>
    <bool name="stored">true</bool>
  </lst>
  <lst>
    <str name="name">text_np</str>
    <str name="type">text_np</str>
    <bool name="indexed">true</bool>
    <bool name="stored">false</bool>
  </lst>
  <lst>
    <str name="name">shouldbeunstored</str>
    <str name="type">unstored</str>
  </lst>
  <lst>
    <str name="name">text</str>
    <str name="type">text</str>
    <bool name="multiValued">true</bool>
    <bool name="indexed">true</bool>
    <bool name="stored">false</bool>
  </lst>
  <lst>
    <str name="name">wdf_preserve</str>
    <str name="type">wdf_preserve</str>
    <bool name="indexed">true</bool>
    <bool name="stored">true</bool>
  </lst>
  <lst>
    <str name="name">store</str>
    <str name="type">location</str>
    <bool name="indexed">true</bool>
    <bool name="stored">true</bool>
  </lst>
  <lst>
    <str name="name">signatureField</str>
    <str name="type">string</str>
    <bool name="indexed">true</bool>
    <bool name="stored">false</bool>
  </lst>
  <lst>
    <str name="name">bindsto</str>
    <str name="type">boolean</str>
    <bool name="indexed">true</bool>
    <bool name="stored">true</bool>
  </lst>
  <lst>
    <str name="name">subject</str>
    <str name="type">text</str>
    <bool name="indexed">true</bool>
    <bool name="stored">true</bool>
  </lst>
  <lst>
    <str name="name">sindsto</str>
    <str name="type">string</str>
    <bool name="indexed">true</bool>
    <bool name="stored">true</bool>
  </lst>
  <lst>
    <str name="name">lettertok</str>
    <str name="type">lettertok</str>
    <bool name="indexed">true</bool>
    <bool name="stored">true</bool>
  </lst>
  <lst>
    <str name="name">uuid</str>
    <str name="type">uuid</str>
    <bool name="stored">true</bool>
  </lst>
  <lst>
    <str name="name">nullfirst</str>
    <str name="type">string</str>
    <bool name="sortMissingFirst">true</bool>
    <bool name="indexed">true</bool>
    <bool name="stored">true</bool>
  </lst>
  <lst>
    <str name="name">subword</str>
    <str name="type">subword</str>
    <bool name="indexed">true</bool>
    <bool name="stored">true</bool>
  </lst>
  <lst>
    <str name="name">test_postv</str>
    <str name="type">text</str>
    <bool name="termVectors">true</bool>
    <bool name="termPositions">true</bool>
  </lst>
  <lst>
    <str name="name">timestamp</str>
    <str name="type">date</str>
    <bool name="indexed">true</bool>
    <bool name="stored">true</bool>
  </lst>
  <lst>
    <str name="name">sku2</str>
    <str name="type">skutype2</str>
    <bool name="indexed">true</bool>
    <bool name="stored">true</bool>
  </lst>
  <lst>
    <str name="name">standardfilt</str>
    <str name="type">standardfilt</str>
    <bool name="indexed">true</bool>
    <bool name="stored">true</bool>
  </lst>
  <lst>
    <str name="name">copyfield_source</str>
    <str name="type">string</str>
    <bool name="multiValued">true</bool>
    <bool name="indexed">true</bool>
    <bool name="stored">true</bool>
  </lst>
  <lst>
    <str name="name">id</str>
    <str name="type">string</str>
    <bool name="multiValued">false</bool>
    <bool name="indexed">true</bool>
    <bool name="stored">true</bool>
    <bool name="required">true</bool>
    <bool name="uniqueKey">true</bool>
  </lst>
  <lst>
    <str name="name">name</str>
    <str name="type">nametext</str>
    <bool name="indexed">true</bool>
    <bool name="stored">true</bool>
  </lst>
  <lst>
    <str name="name">shouldbeunindexed</str>
    <str name="type">unstored</str>
    <bool name="indexed">false</bool>
    <bool name="stored">true</bool>
  </lst>
  <lst>
    <str name="name">protectedsubword</str>
    <str name="type">protectedsubword</str>
    <bool name="indexed">true</bool>
    <bool name="stored">true</bool>
  </lst>
</arr>
</response>

	request was:/schema/fields?indent=on&wt=xml
	at org.apache.solr.util.RestTestBase.assertQ(RestTestBase.java:136)
	... 41 more


FAILED:  org.apache.solr.rest.TestFieldCollectionResource.testJsonGetAllFields

Error Message:
mismatch: 'custstopfilt'!='patternreplacefilt' @ fields/[0]/name

Stack Trace:
java.lang.RuntimeException: mismatch: 'custstopfilt'!='patternreplacefilt' @ fields/[0]/name
	at __randomizedtesting.SeedInfo.seed([E8D2B859D380A4D3:61D2CAD57333E8F5]:0)
	at org.apache.solr.util.RestTestBase.assertJQ(RestTestBase.java:242)
	at org.apache.solr.util.RestTestBase.assertJQ(RestTestBase.java:186)
	at org.apache.solr.rest.TestFieldCollectionResource.testJsonGetAllFields(TestFieldCollectionResource.java:50)
	at sun.reflect.NativeMethodAccessorImpl.invoke0(Native Method)
	at sun.reflect.NativeMethodAccessorImpl.invoke(NativeMethodAccessorImpl.java:57)
	at sun.reflect.DelegatingMethodAccessorImpl.invoke(DelegatingMethodAccessorImpl.java:43)
	at java.lang.reflect.Method.invoke(Method.java:487)
	at com.carrotsearch.randomizedtesting.RandomizedRunner.invoke(RandomizedRunner.java:1559)
	at com.carrotsearch.randomizedtesting.RandomizedRunner.access$600(RandomizedRunner.java:79)
	at com.carrotsearch.randomizedtesting.RandomizedRunner$6.evaluate(RandomizedRunner.java:737)
	at com.carrotsearch.randomizedtesting.RandomizedRunner$7.evaluate(RandomizedRunner.java:773)
	at com.carrotsearch.randomizedtesting.RandomizedRunner$8.evaluate(RandomizedRunner.java:787)
	at com.carrotsearch.randomizedtesting.rules.SystemPropertiesRestoreRule$1.evaluate(SystemPropertiesRestoreRule.java:53)
	at org.apache.lucene.util.TestRuleSetupTeardownChained$1.evaluate(TestRuleSetupTeardownChained.java:50)
	at org.apache.lucene.util.TestRuleFieldCacheSanity$1.evaluate(TestRuleFieldCacheSanity.java:51)
	at org.apache.lucene.util.AbstractBeforeAfterRule$1.evaluate(AbstractBeforeAfterRule.java:46)
	at com.carrotsearch.randomizedtesting.rules.SystemPropertiesInvariantRule$1.evaluate(SystemPropertiesInvariantRule.java:55)
	at org.apache.lucene.util.TestRuleThreadAndTestName$1.evaluate(TestRuleThreadAndTestName.java:49)
	at org.apache.lucene.util.TestRuleIgnoreAfterMaxFailures$1.evaluate(TestRuleIgnoreAfterMaxFailures.java:70)
	at org.apache.lucene.util.TestRuleMarkFailure$1.evaluate(TestRuleMarkFailure.java:48)
	at com.carrotsearch.randomizedtesting.rules.StatementAdapter.evaluate(StatementAdapter.java:36)
	at com.carrotsearch.randomizedtesting.ThreadLeakControl$StatementRunner.run(ThreadLeakControl.java:358)
	at com.carrotsearch.randomizedtesting.ThreadLeakControl.forkTimeoutingTask(ThreadLeakControl.java:782)
	at com.carrotsearch.randomizedtesting.ThreadLeakControl$3.evaluate(ThreadLeakControl.java:442)
	at com.carrotsearch.randomizedtesting.RandomizedRunner.runSingleTest(RandomizedRunner.java:746)
	at com.carrotsearch.randomizedtesting.RandomizedRunner$3.evaluate(RandomizedRunner.java:648)
	at com.carrotsearch.randomizedtesting.RandomizedRunner$4.evaluate(RandomizedRunner.java:682)
	at com.carrotsearch.randomizedtesting.RandomizedRunner$5.evaluate(RandomizedRunner.java:693)
	at com.carrotsearch.randomizedtesting.rules.StatementAdapter.evaluate(StatementAdapter.java:36)
	at com.carrotsearch.randomizedtesting.rules.SystemPropertiesRestoreRule$1.evaluate(SystemPropertiesRestoreRule.java:53)
	at org.apache.lucene.util.AbstractBeforeAfterRule$1.evaluate(AbstractBeforeAfterRule.java:46)
	at org.apache.lucene.util.TestRuleStoreClassName$1.evaluate(TestRuleStoreClassName.java:42)
	at com.carrotsearch.randomizedtesting.rules.SystemPropertiesInvariantRule$1.evaluate(SystemPropertiesInvariantRule.java:55)
	at com.carrotsearch.randomizedtesting.rules.NoShadowingOrOverridesOnMethodsRule$1.evaluate(NoShadowingOrOverridesOnMethodsRule.java:39)
	at com.carrotsearch.randomizedtesting.rules.NoShadowingOrOverridesOnMethodsRule$1.evaluate(NoShadowingOrOverridesOnMethodsRule.java:39)
	at com.carrotsearch.randomizedtesting.rules.StatementAdapter.evaluate(StatementAdapter.java:36)
	at org.apache.lucene.util.TestRuleAssertionsRequired$1.evaluate(TestRuleAssertionsRequired.java:43)
	at org.apache.lucene.util.TestRuleMarkFailure$1.evaluate(TestRuleMarkFailure.java:48)
	at org.apache.lucene.util.TestRuleIgnoreAfterMaxFailures$1.evaluate(TestRuleIgnoreAfterMaxFailures.java:70)
	at org.apache.lucene.util.TestRuleIgnoreTestSuites$1.evaluate(TestRuleIgnoreTestSuites.java:55)
	at com.carrotsearch.randomizedtesting.rules.StatementAdapter.evaluate(StatementAdapter.java:36)
	at com.carrotsearch.randomizedtesting.ThreadLeakControl$StatementRunner.run(ThreadLeakControl.java:358)
	at java.lang.Thread.run(Thread.java:722)




Build Log:
[...truncated 8857 lines...]
[junit4:junit4] Suite: org.apache.solr.rest.TestFieldCollectionResource
[junit4:junit4]   2> 62 T13 oas.SolrJettyTestBase.beforeSolrJettyTestBase Randomized ssl (true) and clientAuth (false)
[junit4:junit4]   2> 103 T13 oas.SolrTestCaseJ4.initCore ####initCore
[junit4:junit4]   2> Creating dataDir: /mnt/ssd/jenkins/workspace/Lucene-Solr-4.x-Linux/solr/build/solr-core/test/J0/./solrtest-TestFieldCollectionResource-1362646038756
[junit4:junit4]   2> 104 T13 oas.SolrTestCaseJ4.initCore ####initCore end
[junit4:junit4]   2> 237 T13 oejs.Server.doStart jetty-8.1.8.v20121106
[junit4:junit4]   2> 1105 T13 oejus.SslContextFactory.doStart Enabled Protocols [SSLv2Hello, SSLv3, TLSv1, TLSv1.1, TLSv1.2] of [SSLv2Hello, SSLv3, TLSv1, TLSv1.1, TLSv1.2]
[junit4:junit4]   2> 1203 T13 oejs.AbstractConnector.doStart Started SslSelectChannelConnector@127.0.0.1:47646
[junit4:junit4]   2> 1226 T13 oass.SolrDispatchFilter.init SolrDispatchFilter.init()
[junit4:junit4]   2> 1268 T13 oasc.SolrResourceLoader.locateSolrHome JNDI not configured for solr (NoInitialContextEx)
[junit4:junit4]   2> 1269 T13 oasc.SolrResourceLoader.locateSolrHome using system property solr.solr.home: /mnt/ssd/jenkins/workspace/Lucene-Solr-4.x-Linux/solr/build/solr-core/test-files/solr
[junit4:junit4]   2> 1290 T13 oasc.CoreContainer$Initializer.initialize looking for solr.xml: /mnt/ssd/jenkins/workspace/Lucene-Solr-4.x-Linux/solr/build/solr-core/test-files/solr/solr.xml
[junit4:junit4]   2> 1294 T13 oasc.CoreContainer.<init> New CoreContainer 408044458
[junit4:junit4]   2> 1296 T13 oasc.CoreContainer.load Loading CoreContainer using Solr Home: '/mnt/ssd/jenkins/workspace/Lucene-Solr-4.x-Linux/solr/build/solr-core/test-files/solr/'
[junit4:junit4]   2> 1297 T13 oasc.SolrResourceLoader.<init> new SolrResourceLoader for directory: '/mnt/ssd/jenkins/workspace/Lucene-Solr-4.x-Linux/solr/build/solr-core/test-files/solr/'
[junit4:junit4]   2> 1593 T13 oashc.HttpShardHandlerFactory.getParameter Setting socketTimeout to: 120000
[junit4:junit4]   2> 1594 T13 oashc.HttpShardHandlerFactory.getParameter Setting urlScheme to: http://
[junit4:junit4]   2> 1595 T13 oashc.HttpShardHandlerFactory.getParameter Setting connTimeout to: 15000
[junit4:junit4]   2> 1595 T13 oashc.HttpShardHandlerFactory.getParameter Setting maxConnectionsPerHost to: 20
[junit4:junit4]   2> 1596 T13 oashc.HttpShardHandlerFactory.getParameter Setting corePoolSize to: 0
[junit4:junit4]   2> 1597 T13 oashc.HttpShardHandlerFactory.getParameter Setting maximumPoolSize to: 2147483647
[junit4:junit4]   2> 1597 T13 oashc.HttpShardHandlerFactory.getParameter Setting maxThreadIdleTime to: 5
[junit4:junit4]   2> 1598 T13 oashc.HttpShardHandlerFactory.getParameter Setting sizeOfQueue to: -1
[junit4:junit4]   2> 1599 T13 oashc.HttpShardHandlerFactory.getParameter Setting fairnessPolicy to: false
[junit4:junit4]   2> 1615 T13 oascsi.HttpClientUtil.createClient Creating new http client, config:maxConnectionsPerHost=20&maxConnections=10000&socketTimeout=120000&connTimeout=15000&retry=false
[junit4:junit4]   2> 1806 T13 oasc.CoreContainer.load Registering Log Listener
[junit4:junit4]   2> 1872 T24 oasc.CoreContainer.create Creating SolrCore 'collection1' using instanceDir: /mnt/ssd/jenkins/workspace/Lucene-Solr-4.x-Linux/solr/build/solr-core/test-files/solr/collection1
[junit4:junit4]   2> 1873 T24 oasc.SolrResourceLoader.<init> new SolrResourceLoader for directory: '/mnt/ssd/jenkins/workspace/Lucene-Solr-4.x-Linux/solr/build/solr-core/test-files/solr/collection1/'
[junit4:junit4]   2> 1874 T24 oasc.SolrResourceLoader.replaceClassLoader Adding 'file:/mnt/ssd/jenkins/workspace/Lucene-Solr-4.x-Linux/solr/build/solr-core/test-files/solr/collection1/lib/README' to classloader
[junit4:junit4]   2> 1875 T24 oasc.SolrResourceLoader.replaceClassLoader Adding 'file:/mnt/ssd/jenkins/workspace/Lucene-Solr-4.x-Linux/solr/build/solr-core/test-files/solr/collection1/lib/classes/' to classloader
[junit4:junit4]   2> 2133 T24 oasc.SolrConfig.<init> Using Lucene MatchVersion: LUCENE_42
[junit4:junit4]   2> 2273 T24 oasc.SolrConfig.<init> Loaded SolrConfig: solrconfig.xml
[junit4:junit4]   2> 2282 T24 oass.IndexSchema.readSchema Reading Solr Schema
[junit4:junit4]   2> 2341 T24 oass.IndexSchema.readSchema Schema name=test-rest
[junit4:junit4]   2> 3202 T24 oass.IndexSchema.readSchema default search field in schema is text
[junit4:junit4]   2> 3207 T24 oass.IndexSchema.readSchema unique key field: id
[junit4:junit4]   2> 3216 T24 oass.IndexSchema.readSchema WARNING Field title is not multivalued and destination for multiple copyFields (3)
[junit4:junit4]   2> 3399 T24 oasc.SolrCore.<init> [collection1] Opening new SolrCore at /mnt/ssd/jenkins/workspace/Lucene-Solr-4.x-Linux/solr/build/solr-core/test-files/solr/collection1/, dataDir=/mnt/ssd/jenkins/workspace/Lucene-Solr-4.x-Linux/solr/build/solr-core/test/J0/solrtest-TestFieldCollectionResource-1362646038756/
[junit4:junit4]   2> 3401 T24 oasc.JmxMonitoredMap.<init> JMX monitoring is enabled. Adding Solr mbeans to JMX Server: com.sun.jmx.mbeanserver.JmxMBeanServer@56b00884
[junit4:junit4]   2> 3406 T24 oasc.SolrCore.initDirectoryFactory org.apache.solr.core.MockDirectoryFactory
[junit4:junit4]   2> 3441 T24 oasc.CachingDirectoryFactory.get return new directory for /mnt/ssd/jenkins/workspace/Lucene-Solr-4.x-Linux/solr/build/solr-core/test/J0/solrtest-TestFieldCollectionResource-1362646038756 forceNew: false
[junit4:junit4]   2> 3442 T24 oasc.SolrCore.getNewIndexDir New index directory detected: old=null new=/mnt/ssd/jenkins/workspace/Lucene-Solr-4.x-Linux/solr/build/solr-core/test/J0/solrtest-TestFieldCollectionResource-1362646038756/index/
[junit4:junit4]   2> 3443 T24 oasc.SolrCore.initIndex WARNING [collection1] Solr index directory '/mnt/ssd/jenkins/workspace/Lucene-Solr-4.x-Linux/solr/build/solr-core/test/J0/solrtest-TestFieldCollectionResource-1362646038756/index' doesn't exist. Creating new index...
[junit4:junit4]   2> 3453 T24 oasc.CachingDirectoryFactory.get return new directory for /mnt/ssd/jenkins/workspace/Lucene-Solr-4.x-Linux/solr/build/solr-core/test/J0/solrtest-TestFieldCollectionResource-1362646038756/index forceNew: false
[junit4:junit4]   2> 3579 T24 oasc.SolrDeletionPolicy.onCommit SolrDeletionPolicy.onCommit: commits:num=1
[junit4:junit4]   2> 		commit{dir=RateLimitedDirectoryWrapper(BaseDirectoryWrapper(org.apache.lucene.store.RAMDirectory@515a10c0 lockFactory=org.apache.lucene.store.NativeFSLockFactory@69c8236c)),segFN=segments_1,generation=1,filenames=[segments_1]
[junit4:junit4]   2> 3579 T24 oasc.SolrDeletionPolicy.updateCommits newest commit = 1[segments_1]
[junit4:junit4]   2> 3587 T24 oasc.SolrCore.initWriters created xml: solr.XMLResponseWriter
[junit4:junit4]   2> 3797 T24 oasup.UpdateRequestProcessorChain.init inserting DistributedUpdateProcessorFactory into updateRequestProcessorChain "dedupe"
[junit4:junit4]   2> 3798 T24 oasup.UpdateRequestProcessorChain.init inserting DistributedUpdateProcessorFactory into updateRequestProcessorChain "dedupe-allfields"
[junit4:junit4]   2> 3799 T24 oasup.UpdateRequestProcessorChain.init inserting DistributedUpdateProcessorFactory into updateRequestProcessorChain "stored_sig"
[junit4:junit4]   2> 3803 T24 oasup.UpdateRequestProcessorChain.init inserting DistributedUpdateProcessorFactory into updateRequestProcessorChain "uniq-fields"
[junit4:junit4]   2> 3828 T24 oasup.UpdateRequestProcessorChain.init inserting DistributedUpdateProcessorFactory into updateRequestProcessorChain "distrib-dup-test-chain-implicit"
[junit4:junit4]   2> 3831 T24 oasc.RequestHandlers.initHandlersFromConfig adding lazy requestHandler: solr.ReplicationHandler
[junit4:junit4]   2> 3833 T24 oasc.RequestHandlers.initHandlersFromConfig created /replication: solr.ReplicationHandler
[junit4:junit4]   2> 3842 T24 oasc.RequestHandlers.initHandlersFromConfig created standard: solr.StandardRequestHandler
[junit4:junit4]   2> 3847 T24 oasc.RequestHandlers.initHandlersFromConfig created /get: solr.RealTimeGetHandler
[junit4:junit4]   2> 3861 T24 oasc.RequestHandlers.initHandlersFromConfig created dismax: solr.SearchHandler
[junit4:junit4]   2> 3864 T24 oasc.RequestHandlers.initHandlersFromConfig created mock: org.apache.solr.core.MockQuerySenderListenerReqHandler
[junit4:junit4]   2> 3867 T24 oasc.RequestHandlers.initHandlersFromConfig created /admin/: org.apache.solr.handler.admin.AdminHandlers
[junit4:junit4]   2> 3869 T24 oasc.RequestHandlers.initHandlersFromConfig created defaults: solr.StandardRequestHandler
[junit4:junit4]   2> 3870 T24 oasc.RequestHandlers.initHandlersFromConfig adding lazy requestHandler: solr.StandardRequestHandler
[junit4:junit4]   2> 3871 T24 oasc.RequestHandlers.initHandlersFromConfig created lazy: solr.StandardRequestHandler
[junit4:junit4]   2> 3884 T24 oasc.RequestHandlers.initHandlersFromConfig created /update: solr.UpdateRequestHandler
[junit4:junit4]   2> 3888 T24 oasc.RequestHandlers.initHandlersFromConfig created /terms: org.apache.solr.handler.component.SearchHandler
[junit4:junit4]   2> 3890 T24 oasc.RequestHandlers.initHandlersFromConfig created spellCheckCompRH: org.apache.solr.handler.component.SearchHandler
[junit4:junit4]   2> 3892 T24 oasc.RequestHandlers.initHandlersFromConfig created spellCheckCompRH_Direct: org.apache.solr.handler.component.SearchHandler
[junit4:junit4]   2> 3894 T24 oasc.RequestHandlers.initHandlersFromConfig created spellCheckWithWordbreak: org.apache.solr.handler.component.SearchHandler
[junit4:junit4]   2> 3897 T24 oasc.RequestHandlers.initHandlersFromConfig created spellCheckWithWordbreak_Direct: org.apache.solr.handler.component.SearchHandler
[junit4:junit4]   2> 3899 T24 oasc.RequestHandlers.initHandlersFromConfig created spellCheckCompRH1: org.apache.solr.handler.component.SearchHandler
[junit4:junit4]   2> 3901 T24 oasc.RequestHandlers.initHandlersFromConfig created mltrh: org.apache.solr.handler.component.SearchHandler
[junit4:junit4]   2> 3902 T24 oasc.RequestHandlers.initHandlersFromConfig created tvrh: org.apache.solr.handler.component.SearchHandler
[junit4:junit4]   2> 3908 T24 oasc.RequestHandlers.initHandlersFromConfig created /mlt: solr.MoreLikeThisHandler
[junit4:junit4]   2> 3914 T24 oasc.RequestHandlers.initHandlersFromConfig created /debug/dump: solr.DumpRequestHandler
[junit4:junit4]   2> 3947 T24 oashl.XMLLoader.init xsltCacheLifetimeSeconds=60
[junit4:junit4]   2> 3954 T24 oasc.SolrCore.initDeprecatedSupport WARNING solrconfig.xml uses deprecated <admin/gettableFiles>, Please update your config to use the ShowFileRequestHandler.
[junit4:junit4]   2> 3960 T24 oasc.SolrCore.initDeprecatedSupport WARNING adding ShowFileRequestHandler with hidden files: [SOLRCONFIG-SLAVE1.XML, SCHEMA-LUCENEMATCHVERSION.XML, OLD_SYNONYMS.TXT, SOLRCONFIG-SCRIPT-UPDATEPROCESSOR.XML, SCHEMA-SIM.XML, SOLRCONFIG-REPEATER.XML, SOLRCONFIG-NOCACHE.XML, SCHEMA-REST.XML, SCHEMA-DOCVALUESMULTI.XML, SCHEMA-XINCLUDE.XML, BAD-SCHEMA-DOCVALUES-NOT-REQUIRED-NO-DEFAULT.XML, SOLRCONFIG-HIGHLIGHT.XML, SOLRCONFIG-INDEXCONFIG.XML, BAD-SCHEMA-DUP-DYNAMICFIELD.XML, SOLRCONFIG-DELPOLICY1.XML, KEEP-1.TXT, PROTWORDS.TXT, KEEP-2.TXT, SOLRCONFIG-TLOG.XML, SOLRCONFIG-PROPINJECT-INDEXDEFAULT.XML, TRIVIAL.UPDATEPROCESSOR1.JS, SOLRCONFIG-PROPINJECT.XML, BAD-SCHEMA-NOT-INDEXED-BUT-TF.XML, THROW.ERROR.ON.ADD.UPDATEPROCESSOR.JS, SYNONYMS.TXT, DA_UTF8.XML, HUNSPELL-TEST.DIC, SOLRCONFIG-BASIC.XML, WDFTYPES.TXT, CONDITIONAL.UPDATEPROCESSOR.JS, SCHEMA-IB.XML, SCHEMA-BINARYFIELD.XML, BAD_SOLRCONFIG.XML, BAD-SCHEMA-CURRENCY-FT-BOGUS-DEFAULT-CODE.XML, ELEVATE.XML, BAD-SCHEMA-SWEETSPOT-PARTIAL-HYPERBOLIC.XML, REGEX-BOOST-PROCESSOR-TEST.TXT, SOLRCONFIG-RESPONSE-LOG-COMPONENT.XML, SOLRCONFIG-SIMPLELOCK.XML, SOLRCONFIG-TERMINDEX.XML, BAD-SCHEMA-SWEETSPOT-PARTIAL-BASELINE.XML, SCHEMA-REVERSED.XML, CURRENCY.XML, SCHEMA-NUMERIC.XML, SOLRCONFIG-SOLR-749.XML, SCHEMA-SNIPPET-TYPE.XML, BAD-SCHEMA-ANALYZER-CLASS-AND-NESTED.XML, SCHEMA-REPLICATION2.XML, SOLRCONFIG-REQHANDLER.INCL, SCHEMASURROUND.XML, BAD-SCHEMA-CURRENCY-FT-BOGUS-CODE-IN-XML.XML, SCHEMA-LMDIRICHLET.XML, SOLRCONFIG-QUERYSENDER-NOQUERY.XML, SOLRCONFIG-PHRASESUGGEST.XML, SCHEMA-BEHAVIOR.XML, SOLRCONFIG-ELEVATE.XML, STOPWORDS.TXT, SOLRCONFIG-MASTER1-KEEPONEBACKUP.XML, STOP-2.TXT, BAD-SOLRCONFIG-INVALID-SCRIPTFILE.XML, SOLRCONFIG-MASTER3.XML, BAD-SCHEMA-NOT-INDEXED-BUT-POS.XML, SCHEMA-COLLATE.XML, FUZZYSUGGEST.TXT, BAD-SCHEMA-EXTERNAL-FILEFIELD.XML, SOLRCONFIG-MERGEPOLICY.XML, BAD-SOLRCONFIG-BOGUS-SCRIPTENGINE-NAME.XML, BAD-SCHEMA-UNIQUEKEY-MULTIVALUED.XML, SOLRCONFIG-POSTINGSHIGHLIGHT.XML, SOLRCONFIG-MASTER1.XML, SOLRCONFIG-LAZYWRITER.XML, SCHEMA-LMJELINEKMERCER.XML, BAD-SOLRCONFIG-MISSING-SCRIPTFILE.XML, COMPOUNDDICTIONARY.TXT, SOLRCONFIG-XINCLUDE.XML, BAD-SCHEMA-CURRENCY-MULTIVALUED.XML, BAD-SCHEMA-OMIT-TF-BUT-NOT-POS.XML, SCHEMA-EFF.XML, SCHEMA-DOCVALUESFACETING.XML, BAD-MP-SOLRCONFIG.XML, STOP-SNOWBALL.TXT, PHRASESUGGEST.TXT, SCHEMA-SPELLCHECKER.XML, SOLRCONFIG-MASTER2.XML, BAD-SCHEMA-UNIQUEKEY-USES-DEFAULT.XML, SCHEMA-FOLDING.XML, BAD-SCHEMA-SWEETSPOT-PARTIAL-NORMS.XML, SCHEMA12.XML, HYPHENATION.DTD, MISSING.FUNCTIONS.UPDATEPROCESSOR.JS, SCHEMA-COPYFIELD-TEST.XML, MISSLEADING.EXTENSION.UPDATEPROCESSOR.JS.TXT, SCHEMA-NOT-REQUIRED-UNIQUE-KEY.XML, SCHEMA_CODEC.XML, SCHEMA-SYNONYM-TOKENIZER.XML, SCHEMA-DFR.XML, STOP-1.TXT, SOLRCONFIG-SPELLCHECKCOMPONENT.XML, HUNSPELL-TEST.AFF, STOPTYPES-1.TXT, STOPWORDSWRONGENCODING.TXT, SOLRCONFIG-FUNCTIONQUERY.XML, BAD-SCHEMA-SWEETSPOT-BOTH-TF.XML, SOLRCONFIG-NATIVELOCK.XML, JASUGGEST.TXT, BAD-SCHEMA-CURRENCY-FT-MULTIVALUED.XML, SCHEMA-REPLICATION1.XML, SCHEMA-COLLATEFILTER.XML, SCHEMA11.XML, BAD-SCHEMA-SIM-GLOBAL-VS-FT-MISMATCH.XML, SOLRCONFIG-TRANSFORMERS.XML, SOLRCONFIG-COMPONENTS-NAME.XML, SCHEMA-TRIE.XML, SOLRCONFIG_CODEC.XML, SCHEMA-PHRASESUGGEST.XML, SCHEMA-TFIDF.XML, BAD-SCHEMA-DUP-FIELDTYPE.XML, SOLRCONFIG_PERF.XML, BAD-SCHEMA-UNSUPPORTED-DOCVALUES.XML, STOPWITHBOM.TXT, BAD-SCHEMA-NOT-INDEXED-BUT-NORMS.XML, SCHEMA15.XML, SOLRCONFIG-SNIPPET-PROCESSOR.XML, XSLT, STOPTYPES-2.TXT, SCHEMA-DOCVALUES.XML, FRENCHARTICLES.TXT, BAD-SCHEMA-CURRENCY-FT-OER-NORATES.XML, SCHEMA-CHARFILTERS.XML, BAD-SCHEMA-CODEC-GLOBAL-VS-FT-MISMATCH.XML, STEMDICT.TXT, SOLRCONFIG-SPELLCHECKER.XML, MAPPING-ISOLATIN1ACCENT.TXT, TRIVIAL.UPDATEPROCESSOR0.JS, SCHEMA-SPATIAL.XML, SOLRCONFIG-SLAVE.XML, SOLRCONFIG-SOLCOREPROPERTIES.XML, SCHEMA-POSTINGSHIGHLIGHT.XML, SCHEMA-SWEETSPOT.XML, ADDFIELDS.UPDATEPROCESSOR.JS, SOLRCONFIG-BASIC-LUCENEVERSION31.XML, SCHEMA-SNIPPET-FIELD.XML, SOLRCONFIG-UPDATE-PROCESSOR-CHAINS.XML, SCHEMA-MINIMAL.XML, BAD-SCHEMA-NONTEXT-ANALYZER.XML, BAD-SCHEMA-CURRENCY-DYNAMIC-MULTIVALUED.XML, BAD-CURRENCY.XML, SCHEMA-STOP-KEEP.XML, SCHEMA-REQUIRED-FIELDS.XML, SOLRCONFIG-CACHING.XML, SOLRCONFIG-DELPOLICY2.XML, SOLRCONFIG-ENABLEPLUGIN.XML, OPEN-EXCHANGE-RATES.JSON, SOLRCONFIG-MASTER.XML, SCHEMA-BM25.XML, SOLRCONFIG-ALTDIRECTORY.XML, BAD-SCHEMA-UNIQUEKEY-IS-COPYFIELD-DEST.XML, DA_COMPOUNDDICTIONARY.TXT, SOLRCONFIG-QUERYSENDER.XML, BAD-SCHEMA-DUP-FIELD.XML]
[junit4:junit4]   2> 3978 T24 oass.SolrIndexSearcher.<init> Opening Searcher@43a4d2e4 main
[junit4:junit4]   2> 4002 T24 oasu.CommitTracker.<init> Hard AutoCommit: disabled
[junit4:junit4]   2> 4002 T24 oasu.CommitTracker.<init> Soft AutoCommit: disabled
[junit4:junit4]   2> 4004 T24 oashc.SpellCheckComponent.inform Initializing spell checkers
[junit4:junit4]   2> 4098 T24 oass.DirectSolrSpellChecker.init init: {name=direct,classname=DirectSolrSpellChecker,field=lowerfilt,minQueryLength=3}
[junit4:junit4]   2> 4233 T25 oasc.SolrCore.registerSearcher [collection1] Registered new searcher Searcher@43a4d2e4 main{StandardDirectoryReader(segments_1:1)}
[junit4:junit4]   2> 4271 T24 oasc.CoreContainer.registerCore registering core: collection1
[junit4:junit4]   2> 4273 T13 oass.SolrDispatchFilter.init user.dir=/mnt/ssd/jenkins/workspace/Lucene-Solr-4.x-Linux/solr/build/solr-core/test/J0
[junit4:junit4]   2> 4274 T13 oass.SolrDispatchFilter.init SolrDispatchFilter.init() done
[junit4:junit4]   2> 4275 T13 oas.SolrJettyTestBase.createJetty Jetty Assigned Port#47646
[junit4:junit4]   2> 4289 T13 oas.SolrTestCaseJ4.setUp ###Starting testGetAllFields
[junit4:junit4]   2> ASYNC  NEW_CORE C0 name=collection1 org.apache.solr.core.SolrCore@6564c37b
[junit4:junit4]   2> 5776 T23 C0 oejsh.ContextHandler$Context.log SchemaRestApi: [Restlet] Attaching application: org.apache.solr.rest.SchemaRestApi@598389b to URI: /solr/schema
[junit4:junit4]   2> 5824 T23 C0 oasr.SchemaRestApi.createInboundRoot createInboundRoot started
[junit4:junit4]   2> 5840 T23 C0 oasr.SchemaRestApi.createInboundRoot createInboundRoot complete
[junit4:junit4]   2> 5854 T23 C0 oasr.BaseSchemaResource.handlePostExecution [collection1] webapp=/solr path=/schema/fields params={wt=xml&indent=on} status=0 QTime=284 
[junit4:junit4]   2> 5859 T23 C0 orel.LogFilter.afterHandle 2013-03-07	03:47:24	127.0.0.1	-	127.0.0.1	47646	GET	/solr/schema/fields	indent=on&wt=xml	200	-	0	43	https://127.0.0.1:47646	Java/1.8.0-ea	-
[junit4:junit4]   2> 6300 T13 oasu.RestTestBase.assertQ SEVERE REQUEST FAILED: xpath=(/response/arr[@name='fields']/lst/str[@name='name'])[1] = 'custstopfilt'
[junit4:junit4]   2> 		xml response was: <?xml version="1.0" encoding="UTF-8"?>
[junit4:junit4]   2> 	<response>
[junit4:junit4]   2> 	
[junit4:junit4]   2> 	<lst name="responseHeader">
[junit4:junit4]   2> 	  <int name="status">0</int>
[junit4:junit4]   2> 	  <int name="QTime">284</int>
[junit4:junit4]   2> 	</lst>
[junit4:junit4]   2> 	<arr name="fields">
[junit4:junit4]   2> 	  <lst>
[junit4:junit4]   2> 	    <str name="name">patternreplacefilt</str>
[junit4:junit4]   2> 	    <str name="type">patternreplacefilt</str>
[junit4:junit4]   2> 	    <bool name="indexed">true</bool>
[junit4:junit4]   2> 	    <bool name="stored">true</bool>
[junit4:junit4]   2> 	  </lst>
[junit4:junit4]   2> 	  <lst>
[junit4:junit4]   2> 	    <str name="name">bday</str>
[junit4:junit4]   2> 	    <str name="type">date</str>
[junit4:junit4]   2> 	    <bool name="indexed">true</bool>
[junit4:junit4]   2> 	    <bool name="stored">true</bool>
[junit4:junit4]   2> 	  </lst>
[junit4:junit4]   2> 	  <lst>
[junit4:junit4]   2> 	    <str name="name">test_notv</str>
[junit4:junit4]   2> 	    <str name="type">text</str>
[junit4:junit4]   2> 	    <bool name="termVectors">false</bool>
[junit4:junit4]   2> 	  </lst>
[junit4:junit4]   2> 	  <lst>
[junit4:junit4]   2> 	    <str name="name">standardtokfilt</str>
[junit4:junit4]   2> 	    <str name="type">standardtokfilt</str>
[junit4:junit4]   2> 	    <bool name="indexed">true</bool>
[junit4:junit4]   2> 	    <bool name="stored">true</bool>
[junit4:junit4]   2> 	  </lst>
[junit4:junit4]   2> 	  <lst>
[junit4:junit4]   2> 	    <str name="name">nouniq</str>
[junit4:junit4]   2> 	    <str name="type">string</str>
[junit4:junit4]   2> 	    <bool name="multiValued">true</bool>
[junit4:junit4]   2> 	    <bool name="indexed">true</bool>
[junit4:junit4]   2> 	    <bool name="stored">true</bool>
[junit4:junit4]   2> 	  </lst>
[junit4:junit4]   2> 	  <lst>
[junit4:junit4]   2> 	    <str name="name">title_stemmed</str>
[junit4:junit4]   2> 	    <str name="type">text</str>
[junit4:junit4]   2> 	    <bool name="indexed">true</bool>
[junit4:junit4]   2> 	    <bool name="stored">false</bool>
[junit4:junit4]   2> 	  </lst>
[junit4:junit4]   2> 	  <lst>
[junit4:junit4]   2> 	    <str name="name">whitetok</str>
[junit4:junit4]   2> 	    <str name="type">whitetok</str>
[junit4:junit4]   2> 	    <bool name="indexed">true</bool>
[junit4:junit4]   2> 	    <bool name="stored">true</bool>
[junit4:junit4]   2> 	  </lst>
[junit4:junit4]   2> 	  <lst>
[junit4:junit4]   2> 	    <str name="name">weight</str>
[junit4:junit4]   2> 	    <str name="type">float</str>
[junit4:junit4]   2> 	    <bool name="indexed">true</bool>
[junit4:junit4]   2> 	    <bool name="stored">true</bool>
[junit4:junit4]   2> 	  </lst>
[junit4:junit4]   2> 	  <lst>
[junit4:junit4]   2> 	    <str name="name">numberpartfail</str>
[junit4:junit4]   2> 	    <str name="type">failtype1</str>
[junit4:junit4]   2> 	    <bool name="indexed">true</bool>
[junit4:junit4]   2> 	    <bool name="stored">true</bool>
[junit4:junit4]   2> 	  </lst>
[junit4:junit4]   2> 	  <lst>
[junit4:junit4]   2> 	    <str name="name">sind</str>
[junit4:junit4]   2> 	    <str name="type">string</str>
[junit4:junit4]   2> 	    <bool name="indexed">true</bool>
[junit4:junit4]   2> 	    <bool name="stored">false</bool>
[junit4:junit4]   2> 	  </lst>
[junit4:junit4]   2> 	  <lst>
[junit4:junit4]   2> 	    <str name="name">lowertok</str>
[junit4:junit4]   2> 	    <str name="type">lowertok</str>
[junit4:junit4]   2> 	    <bool name="indexed">true</bool>
[junit4:junit4]   2> 	    <bool name="stored">true</bool>
[junit4:junit4]   2> 	  </lst>
[junit4:junit4]   2> 	  <lst>
[junit4:junit4]   2> 	    <str name="name">standardtok</str>
[junit4:junit4]   2> 	    <str name="type">standardtok</str>
[junit4:junit4]   2> 	    <bool name="indexed">true</bool>
[junit4:junit4]   2> 	    <bool name="stored">true</bool>
[junit4:junit4]   2> 	  </lst>
[junit4:junit4]   2> 	  <lst>
[junit4:junit4]   2> 	    <str name="name">test_hlt</str>
[junit4:junit4]   2> 	    <str name="type">highlittext</str>
[junit4:junit4]   2> 	    <bool name="indexed">true</bool>
[junit4:junit4]   2> 	    <bool name="compressed">true</bool>
[junit4:junit4]   2> 	  </lst>
[junit4:junit4]   2> 	  <lst>
[junit4:junit4]   2> 	    <str name="name">keywordtok</str>
[junit4:junit4]   2> 	    <str name="type">keywordtok</str>
[junit4:junit4]   2> 	    <bool name="indexed">true</bool>
[junit4:junit4]   2> 	    <bool name="stored">true</bool>
[junit4:junit4]   2> 	  </lst>
[junit4:junit4]   2> 	  <lst>
[junit4:junit4]   2> 	    <str name="name">uniq3</str>
[junit4:junit4]   2> 	    <str name="type">string</str>
[junit4:junit4]   2> 	    <bool name="indexed">true</bool>
[junit4:junit4]   2> 	    <bool name="stored">true</bool>
[junit4:junit4]   2> 	  </lst>
[junit4:junit4]   2> 	  <lst>
[junit4:junit4]   2> 	    <str name="name">bind</str>
[junit4:junit4]   2> 	    <str name="type">boolean</str>
[junit4:junit4]   2> 	    <bool name="indexed">true</bool>
[junit4:junit4]   2> 	    <bool name="stored">false</bool>
[junit4:junit4]   2> 	  </lst>
[junit4:junit4]   2> 	  <lst>
[junit4:junit4]   2> 	    <str name="name">teststop</str>
[junit4:junit4]   2> 	    <str name="type">teststop</str>
[junit4:junit4]   2> 	    <bool name="indexed">true</bool>
[junit4:junit4]   2> 	    <bool name="stored">true</bool>
[junit4:junit4]   2> 	  </lst>
[junit4:junit4]   2> 	  <lst>
[junit4:junit4]   2> 	    <str name="name">uniq</str>
[junit4:junit4]   2> 	    <str name="type">string</str>
[junit4:junit4]   2> 	    <bool name="multiValued">true</bool>
[junit4:junit4]   2> 	    <bool name="indexed">true</bool>
[junit4:junit4]   2> 	    <bool name="stored">true</bool>
[junit4:junit4]   2> 	  </lst>
[junit4:junit4]   2> 	  <lst>
[junit4:junit4]   2> 	    <str name="name">textgap</str>
[junit4:junit4]   2> 	    <str name="type">textgap</str>
[junit4:junit4]   2> 	    <bool name="indexed">true</bool>
[junit4:junit4]   2> 	    <bool name="stored">true</bool>
[junit4:junit4]   2> 	  </lst>
[junit4:junit4]   2> 	  <lst>
[junit4:junit4]   2> 	    <str name="name">test_basictv</str>
[junit4:junit4]   2> 	    <str name="type">text</str>
[junit4:junit4]   2> 	    <bool name="termVectors">true</bool>
[junit4:junit4]   2> 	  </lst>
[junit4:junit4]   2> 	  <lst>
[junit4:junit4]   2> 	    <str name="name">uniq2</str>
[junit4:junit4]   2> 	    <str name="type">string</str>
[junit4:junit4]   2> 	    <bool name="multiValued">true</bool>
[junit4:junit4]   2> 	    <bool name="indexed">true</bool>
[junit4:junit4]   2> 	    <bool name="stored">true</bool>
[junit4:junit4]   2> 	  </lst>
[junit4:junit4]   2> 	  <lst>
[junit4:junit4]   2> 	    <str name="name">iind</str>
[junit4:junit4]   2> 	    <str name="type">int</str>
[junit4:junit4]   2> 	    <bool name="indexed">true</bool>
[junit4:junit4]   2> 	    <bool name="stored">false</bool>
[junit4:junit4]   2> 	  </lst>
[junit4:junit4]   2> 	  <lst>
[junit4:junit4]   2> 	    <str name="name">title_lettertok</str>
[junit4:junit4]   2> 	    <str name="type">lettertok</str>
[junit4:junit4]   2> 	    <bool name="indexed">true</bool>
[junit4:junit4]   2> 	    <bool name="stored">false</bool>
[junit4:junit4]   2> 	  </lst>
[junit4:junit4]   2> 	  <lst>
[junit4:junit4]   2> 	    <str name="name">isto</str>
[junit4:junit4]   2> 	    <str name="type">int</str>
[junit4:junit4]   2> 	    <bool name="indexed">false</bool>
[junit4:junit4]   2> 	    <bool name="stored">true</bool>
[junit4:junit4]   2> 	  </lst>
[junit4:junit4]   2> 	  <lst>
[junit4:junit4]   2> 	    <str name="name">test_hlt_off</str>
[junit4:junit4]   2> 	    <str name="type">highlittext</str>
[junit4:junit4]   2> 	    <bool name="indexed">true</bool>
[junit4:junit4]   2> 	    <bool name="compressed">false</bool>
[junit4:junit4]   2> 	  </lst>
[junit4:junit4]   2> 	  <lst>
[junit4:junit4]   2> 	    <str name="name">sku1</str>
[junit4:junit4]   2> 	    <str name="type">skutype1</str>
[junit4:junit4]   2> 	    <bool name="indexed">true</bool>
[junit4:junit4]   2> 	    <bool name="stored">true</bool>
[junit4:junit4]   2> 	  </lst>
[junit4:junit4]   2> 	  <lst>
[junit4:junit4]   2> 	    <str name="name">custengporterfilt</str>
[junit4:junit4]   2> 	    <str name="type">custengporterfilt</str>
[junit4:junit4]   2> 	    <bool name="indexed">true</bool>
[junit4:junit4]   2> 	    <bool name="stored">true</bool>
[junit4:junit4]   2> 	  </lst>
[junit4:junit4]   2> 	  <lst>
[junit4:junit4]   2> 	    <str name="name">wdf_nocase</str>
[junit4:junit4]   2> 	    <str name="type">wdf_nocase</str>
[junit4:junit4]   2> 	    <bool name="indexed">true</bool>
[junit4:junit4]   2> 	    <bool name="stored">true</bool>
[junit4:junit4]   2> 	  </lst>
[junit4:junit4]   2> 	  <lst>
[junit4:junit4]   2> 	    <str name="name">dedup</str>
[junit4:junit4]   2> 	    <str name="type">dedup</str>
[junit4:junit4]   2> 	    <bool name="indexed">true</bool>
[junit4:junit4]   2> 	    <bool name="stored">true</bool>
[junit4:junit4]   2> 	  </lst>
[junit4:junit4]   2> 	  <lst>
[junit4:junit4]   2> 	    <str name="name">title</str>
[junit4:junit4]   2> 	    <str name="type">nametext</str>
[junit4:junit4]   2> 	    <bool name="indexed">true</bool>
[junit4:junit4]   2> 	    <bool name="stored">true</bool>
[junit4:junit4]   2> 	  </lst>
[junit4:junit4]   2> 	  <lst>
[junit4:junit4]   2> 	    <str name="name">syn</str>
[junit4:junit4]   2> 	    <str name="type">syn</str>
[junit4:junit4]   2> 	    <bool name="indexed">true</bool>
[junit4:junit4]   2> 	    <bool name="stored">true</bool>
[junit4:junit4]   2> 	  </lst>
[junit4:junit4]   2> 	  <lst>
[junit4:junit4]   2> 	    <str name="name">lengthfilt</str>
[junit4:junit4]   2> 	    <str name="type">lengthfilt</str>
[junit4:junit4]   2> 	    <bool name="indexed">true</bool>
[junit4:junit4]   2> 	    <bool name="stored">true</bool>
[junit4:junit4]   2> 	  </lst>
[junit4:junit4]   2> 	  <lst>
[junit4:junit4]   2> 	    <str name="name">pointD</str>
[junit4:junit4]   2> 	    <str name="type">xyd</str>
[junit4:junit4]   2> 	    <bool name="multiValued">false</bool>
[junit4:junit4]   2> 	    <bool name="indexed">true</bool>
[junit4:junit4]   2> 	    <bool name="stored">true</bool>
[junit4:junit4]   2> 	  </lst>
[junit4:junit4]   2> 	  <lst>
[junit4:junit4]   2> 	    <str name="name">engporterfilt</str>
[junit4:junit4]   2> 	    <str name="type">engporterfilt</str>
[junit4:junit4]   2> 	    <bool name="indexed">true</bool>
[junit4:junit4]   2> 	    <bool name="stored">true</bool>
[junit4:junit4]   2> 	  </lst>
[junit4:junit4]   2> 	  <lst>
[junit4:junit4]   2> 	    <str name="name">porterfilt</str>
[junit4:junit4]   2> 	    <str name="type">porterfilt</str>
[junit4:junit4]   2> 	    <bool name="indexed">true</bool>
[junit4:junit4]   2> 	    <bool name="stored">true</bool>
[junit4:junit4]   2> 	  </lst>
[junit4:junit4]   2> 	  <lst>
[junit4:junit4]   2> 	    <str name="name">shouldbestored</str>
[junit4:junit4]   2> 	    <str name="type">unstored</str>
[junit4:junit4]   2> 	    <bool name="stored">true</bool>
[junit4:junit4]   2> 	  </lst>
[junit4:junit4]   2> 	  <lst>
[junit4:junit4]   2> 	    <str name="name">_version_</str>
[junit4:junit4]   2> 	    <str name="type">long</str>
[junit4:junit4]   2> 	    <bool name="indexed">true</bool>
[junit4:junit4]   2> 	    <bool name="stored">true</bool>
[junit4:junit4]   2> 	  </lst>
[junit4:junit4]   2> 	  <lst>
[junit4:junit4]   2> 	    <str name="name">test_offtv</str>
[junit4:junit4]   2> 	    <str name="type">text</str>
[junit4:junit4]   2> 	    <bool name="termVectors">true</bool>
[junit4:junit4]   2> 	    <bool name="termOffsets">true</bool>
[junit4:junit4]   2> 	  </lst>
[junit4:junit4]   2> 	  <lst>
[junit4:junit4]   2> 	    <str name="name">HTMLstandardtok</str>
[junit4:junit4]   2> 	    <str name="type">HTMLstandardtok</str>
[junit4:junit4]   2> 	    <bool name="indexed">true</bool>
[junit4:junit4]   2> 	    <bool name="stored">true</bool>
[junit4:junit4]   2> 	  </lst>
[junit4:junit4]   2> 	  <lst>
[junit4:junit4]   2> 	    <str name="name">bsto</str>
[junit4:junit4]   2> 	    <str name="type">boolean</str>
[junit4:junit4]   2> 	    <bool name="indexed">false</bool>
[junit4:junit4]   2> 	    <bool name="stored">true</bool>
[junit4:junit4]   2> 	  </lst>
[junit4:junit4]   2> 	  <lst>
[junit4:junit4]   2> 	    <str name="name">point</str>
[junit4:junit4]   2> 	    <str name="type">xy</str>
[junit4:junit4]   2> 	    <bool name="multiValued">false</bool>
[junit4:junit4]   2> 	    <bool name="indexed">true</bool>
[junit4:junit4]   2> 	    <bool name="stored">true</bool>
[junit4:junit4]   2> 	  </lst>
[junit4:junit4]   2> 	  <lst>
[junit4:junit4]   2> 	    <str name="name">numericsubword</str>
[junit4:junit4]   2> 	    <str name="type">numericsubword</str>
[junit4:junit4]   2> 	    <bool name="indexed">true</bool>
[junit4:junit4]   2> 	    <bool name="stored">true</bool>
[junit4:junit4]   2> 	  </lst>
[junit4:junit4]   2> 	  <lst>
[junit4:junit4]   2> 	    <str name="name">lowerfilt</str>
[junit4:junit4]   2> 	    <str name="type">lowerfilt</str>
[junit4:junit4]   2> 	    <bool name="indexed">true</bool>
[junit4:junit4]   2> 	    <bool name="stored">true</bool>
[junit4:junit4]   2> 	  </lst>
[junit4:junit4]   2> 	  <lst>
[junit4:junit4]   2> 	    <str name="name">ssto</str>
[junit4:junit4]   2> 	    <str name="type">string</str>
[junit4:junit4]   2> 	    <bool name="indexed">false</bool>
[junit4:junit4]   2> 	    <bool name="stored">true</bool>
[junit4:junit4]   2> 	  </lst>
[junit4:junit4]   2> 	  <lst>
[junit4:junit4]   2> 	    <str name="name">test_posofftv</str>
[junit4:junit4]   2> 	    <str name="type">text</str>
[junit4:junit4]   2> 	    <bool name="termVectors">true</bool>
[junit4:junit4]   2> 	    <bool name="termPositions">true</bool>
[junit4:junit4]   2> 	    <bool name="termOffsets">true</bool>
[junit4:junit4]   2> 	  </lst>
[junit4:junit4]   2> 	  <lst>
[junit4:junit4]   2> 	    <str name="name">point_hash</str>
[junit4:junit4]   2> 	    <str name="type">geohash</str>
[junit4:junit4]   2> 	    <bool name="multiValued">false</bool>
[junit4:junit4]   2> 	    <bool name="indexed">true</bool>
[junit4:junit4]   2> 	    <bool name="stored">true</bool>
[junit4:junit4]   2> 	  </lst>
[junit4:junit4]   2> 	  <lst>
[junit4:junit4]   2> 	    <str name="name">stopfilt</str>
[junit4:junit4]   2> 	    <str name="type">stopfilt</str>
[junit4:junit4]   2> 	    <bool name="indexed">true</bool>
[junit4:junit4]   2> 	    <bool name="stored">true</bool>
[junit4:junit4]   2> 	  </lst>
[junit4:junit4]   2> 	  <lst>
[junit4:junit4]   2> 	    <str name="name">custstopfilt</str>
[junit4:junit4]   2> 	    <str name="type">custstopfilt</str>
[junit4:junit4]   2> 	    <bool name="indexed">true</bool>
[junit4:junit4]   2> 	    <bool name="stored">true</bool>
[junit4:junit4]   2> 	  </lst>
[junit4:junit4]   2> 	  <lst>
[junit4:junit4]   2> 	    <str name="name">HTMLwhitetok</str>
[junit4:junit4]   2> 	    <str name="type">HTMLwhitetok</str>
[junit4:junit4]   2> 	    <bool name="indexed">true</bool>
[junit4:junit4]   2> 	    <bool name="stored">true</bool>
[junit4:junit4]   2> 	  </lst>
[junit4:junit4]   2> 	  <lst>
[junit4:junit4]   2> 	    <str name="name">text_np</str>
[junit4:junit4]   2> 	    <str name="type">text_np</str>
[junit4:junit4]   2> 	    <bool name="indexed">true</bool>
[junit4:junit4]   2> 	    <bool name="stored">false</bool>
[junit4:junit4]   2> 	  </lst>
[junit4:junit4]   2> 	  <lst>
[junit4:junit4]   2> 	    <str name="name">shouldbeunstored</str>
[junit4:junit4]   2> 	    <str name="type">unstored</str>
[junit4:junit4]   2> 	  </lst>
[junit4:junit4]   2> 	  <lst>
[junit4:junit4]   2> 	    <str name="name">text</str>
[junit4:junit4]   2> 	    <str name="type">text</str>
[junit4:junit4]   2> 	    <bool name="multiValued">true</bool>
[junit4:junit4]   2> 	    <bool name="indexed">true</bool>
[junit4:junit4]   2> 	    <bool name="stored">false</bool>
[junit4:junit4]   2> 	  </lst>
[junit4:junit4]   2> 	  <lst>
[junit4:junit4]   2> 	    <str name="name">wdf_preserve</str>
[junit4:junit4]   2> 	    <str name="type">wdf_preserve</str>
[junit4:junit4]   2> 	    <bool name="indexed">true</bool>
[junit4:junit4]   2> 	    <bool name="stored">true</bool>
[junit4:junit4]   2> 	  </lst>
[junit4:junit4]   2> 	  <lst>
[junit4:junit4]   2> 	    <str name="name">store</str>
[junit4:junit4]   2> 	    <str name="type">location</str>
[junit4:junit4]   2> 	    <bool name="indexed">true</bool>
[junit4:junit4]   2> 	    <bool name="stored">true</bool>
[junit4:junit4]   2> 	  </lst>
[junit4:junit4]   2> 	  <lst>
[junit4:junit4]   2> 	    <str name="name">signatureField</str>
[junit4:junit4]   2> 	    <str name="type">string</str>
[junit4:junit4]   2> 	    <bool name="indexed">true</bool>
[junit4:junit4]   2> 	    <bool name="stored">false</bool>
[junit4:junit4]   2> 	  </lst>
[junit4:junit4]   2> 	  <lst>
[junit4:junit4]   2> 	    <str name="name">bindsto</str>
[junit4:junit4]   2> 	    <str name="type">boolean</str>
[junit4:junit4]   2> 	    <bool name="indexed">true</bool>
[junit4:junit4]   2> 	    <bool name="stored">true</bool>
[junit4:junit4]   2> 	  </lst>
[junit4:junit4]   2> 	  <lst>
[junit4:junit4]   2> 	    <str name="name">subject</str>
[junit4:junit4]   2> 	    <str name="type">text</str>
[junit4:junit4]   2> 	    <bool name="indexed">true</bool>
[junit4:junit4]   2> 	    <bool name="stored">true</bool>
[junit4:junit4]   2> 	  </lst>
[junit4:junit4]   2> 	  <lst>
[junit4:junit4]   2> 	    <str name="name">sindsto</str>
[junit4:junit4]   2> 	    <str name="type">string</str>
[junit4:junit4]   2> 	    <bool name="indexed">true</bool>
[junit4:junit4]   2> 	    <bool name="stored">true</bool>
[junit4:junit4]   2> 	  </lst>
[junit4:junit4]   2> 	  <lst>
[junit4:junit4]   2> 	    <str name="name">lettertok</str>
[junit4:junit4]   2> 	    <str name="type">lettertok</str>
[junit4:junit4]   2> 	    <bool name="indexed">true</bool>
[junit4:junit4]   2> 	    <bool name="stored">true</bool>
[junit4:junit4]   2> 	  </lst>
[junit4:junit4]   2> 	  <lst>
[junit4:junit4]   2> 	    <str name="name">uuid</str>
[junit4:junit4]   2> 	    <str name="type">uuid</str>
[junit4:junit4]   2> 	    <bool name="stored">true</bool>
[junit4:junit4]   2> 	  </lst>
[junit4:junit4]   2> 	  <lst>
[junit4:junit4]   2> 	    <str name="name">nullfirst</str>
[junit4:junit4]   2> 	    <str name="type">string</str>
[junit4:junit4]   2> 	    <bool name="sortMissingFirst">true</bool>
[junit4:junit4]   2> 	    <bool name="indexed">true</bool>
[junit4:junit4]   2> 	    <bool name="stored">true</bool>
[junit4:junit4]   2> 	  </lst>
[junit4:junit4]   2> 	  <lst>
[junit4:junit4]   2> 	    <str name="name">subword</str>
[junit4:junit4]   2> 	    <str name="type">subword</str>
[junit4:junit4]   2> 	    <bool name="indexed">true</bool>
[junit4:junit4]   2> 	    <bool name="stored">true</bool>
[junit4:junit4]   2> 	  </lst>
[junit4:junit4]   2> 	  <lst>
[junit4:junit4]   2> 	    <str name="name">test_postv</str>
[junit4:junit4]   2> 	    <str name="type">text</str>
[junit4:junit4]   2> 	    <bool name="termVectors">true</bool>
[junit4:junit4]   2> 	    <bool name="termPositions">true</bool>
[junit4:junit4]   2> 	  </lst>
[junit4:junit4]   2> 	  <lst>
[junit4:junit4]   2> 	    <str name="name">timestamp</str>
[junit4:junit4]   2> 	    <str name="type">date</str>
[junit4:junit4]   2> 	    <bool name="indexed">true</bool>
[junit4:junit4]   2> 	    <bool name="stored">true</bool>
[junit4:junit4]   2> 	  </lst>
[junit4:junit4]   2> 	  <lst>
[junit4:junit4]   2> 	    <str name="name">sku2</str>
[junit4:junit4]   2> 	    <str name="type">skutype2</str>
[junit4:junit4]   2> 	    <bool name="indexed">true</bool>
[junit4:junit4]   2> 	    <bool name="stored">true</bool>
[junit4:junit4]   2> 	  </lst>
[junit4:junit4]   2> 	  <lst>
[junit4:junit4]   2> 	    <str name="name">standardfilt</str>
[junit4:junit4]   2> 	    <str name="type">standardfilt</str>
[junit4:junit4]   2> 	    <bool name="indexed">true</bool>
[junit4:junit4]   2> 	    <bool name="stored">true</bool>
[junit4:junit4]   2> 	  </lst>
[junit4:junit4]   2> 	  <lst>
[junit4:junit4]   2> 	    <str name="name">copyfield_source</str>
[junit4:junit4]   2> 	    <str name="type">string</str>
[junit4:junit4]   2> 	    <bool name="multiValued">true</bool>
[junit4:junit4]   2> 	    <bool name="indexed">true</bool>
[junit4:junit4]   2> 	    <bool name="stored">true</bool>
[junit4:junit4]   2> 	  </lst>
[junit4:junit4]   2> 	  <lst>
[junit4:junit4]   2> 	    <str name="name">id</str>
[junit4:junit4]   2> 	    <str name="type">string</str>
[junit4:junit4]   2> 	    <bool name="multiValued">false</bool>
[junit4:junit4]   2> 	    <bool name="indexed">true</bool>
[junit4:junit4]   2> 	    <bool name="stored">true</bool>
[junit4:junit4]   2> 	    <bool name="required">true</bool>
[junit4:junit4]   2> 	    <bool name="uniqueKey">true</bool>
[junit4:junit4]   2> 	  </lst>
[junit4:junit4]   2> 	  <lst>
[junit4:junit4]   2> 	    <str name="name">name</str>
[junit4:junit4]   2> 	    <str name="type">nametext</str>
[junit4:junit4]   2> 	    <bool name="indexed">true</bool>
[junit4:junit4]   2> 	    <bool name="stored">true</bool>
[junit4:junit4]   2> 	  </lst>
[junit4:junit4]   2> 	  <lst>
[junit4:junit4]   2> 	    <str name="name">shouldbeunindexed</str>
[junit4:junit4]   2> 	    <str name="type">unstored</str>
[junit4:junit4]   2> 	    <bool name="indexed">false</bool>
[junit4:junit4]   2> 	    <bool name="stored">true</bool>
[junit4:junit4]   2> 	  </lst>
[junit4:junit4]   2> 	  <lst>
[junit4:junit4]   2> 	    <str name="name">protectedsubword</str>
[junit4:junit4]   2> 	    <str name="type">protectedsubword</str>
[junit4:junit4]   2> 	    <bool name="indexed">true</bool>
[junit4:junit4]   2> 	    <bool name="stored">true</bool>
[junit4:junit4]   2> 	  </lst>
[junit4:junit4]   2> 	</arr>
[junit4:junit4]   2> 	</response>
[junit4:junit4]   2> 	
[junit4:junit4]   2> 		request was:/schema/fields?indent=on&wt=xml
[junit4:junit4]   2> 6306 T13 oasc.SolrException.log SEVERE REQUEST FAILED: /schema/fields?indent=on&wt=xml:java.lang.RuntimeException: REQUEST FAILED: xpath=(/response/arr[@name='fields']/lst/str[@name='name'])[1] = 'custstopfilt'
[junit4:junit4]   2> 		xml response was: <?xml version="1.0" encoding="UTF-8"?>
[junit4:junit4]   2> 	<response>
[junit4:junit4]   2> 	
[junit4:junit4]   2> 	<lst name="responseHeader">
[junit4:junit4]   2> 	  <int name="status">0</int>
[junit4:junit4]   2> 	  <int name="QTime">284</int>
[junit4:junit4]   2> 	</lst>
[junit4:junit4]   2> 	<arr name="fields">
[junit4:junit4]   2> 	  <lst>
[junit4:junit4]   2> 	    <str name="name">patternreplacefilt</str>
[junit4:junit4]   2> 	    <str name="type">patternreplacefilt</str>
[junit4:junit4]   2> 	    <bool name="indexed">true</bool>
[junit4:junit4]   2> 	    <bool name="stored">true</bool>
[junit4:junit4]   2> 	  </lst>
[junit4:junit4]   2> 	  <lst>
[junit4:junit4]   2> 	    <str name="name">bday</str>
[junit4:junit4]   2> 	    <str name="type">date</str>
[junit4:junit4]   2> 	    <bool name="indexed">true</bool>
[junit4:junit4]   2> 	    <bool name="stored">true</bool>
[junit4:junit4]   2> 	  </lst>
[junit4:junit4]   2> 	  <lst>
[junit4:junit4]   2> 	    <str name="name">test_notv</str>
[junit4:junit4]   2> 	    <str name="type">text</str>
[junit4:junit4]   2> 	    <bool name="termVectors">false</bool>
[junit4:junit4]   2> 	  </lst>
[junit4:junit4]   2> 	  <lst>
[junit4:junit4]   2> 	    <str name="name">standardtokfilt</str>
[junit4:junit4]   2> 	    <str name="type">standardtokfilt</str>
[junit4:junit4]   2> 	    <bool name="indexed">true</bool>
[junit4:junit4]   2> 	    <bool name="stored">true</bool>
[junit4:junit4]   2> 	  </lst>
[junit4:junit4]   2> 	  <lst>
[junit4:junit4]   2> 	    <str name="name">nouniq</str>
[junit4:junit4]   2> 	    <str name="type">string</str>
[junit4:junit4]   2> 	    <bool name="multiValued">true</bool>
[junit4:junit4]   2> 	    <bool name="indexed">true</bool>
[junit4:junit4]   2> 	    <bool name="stored">true</bool>
[junit4:junit4]   2> 	  </lst>
[junit4:junit4]   2> 	  <lst>
[junit4:junit4]   2> 	    <str name="name">title_stemmed</str>
[junit4:junit4]   2> 	    <str name="type">text</str>
[junit4:junit4]   2> 	    <bool name="indexed">true</bool>
[junit4:junit4]   2> 	    <bool name="stored">false</bool>
[junit4:junit4]   2> 	  </lst>
[junit4:junit4]   2> 	  <lst>
[junit4:junit4]   2> 	    <str name="name">whitetok</str>
[junit4:junit4]   2> 	    <str name="type">whitetok</str>
[junit4:junit4]   2> 	    <bool name="indexed">true</bool>
[junit4:junit4]   2> 	    <bool name="stored">true</bool>
[junit4:junit4]   2> 	  </lst>
[junit4:junit4]   2> 	  <lst>
[junit4:junit4]   2> 	    <str name="name">weight</str>
[junit4:junit4]   2> 	    <str name="type">float</str>
[junit4:junit4]   2> 	    <bool name="indexed">true</bool>
[junit4:junit4]   2> 	    <bool name="stored">true</bool>
[junit4:junit4]   2> 	  </lst>
[junit4:junit4]   2> 	  <lst>
[junit4:junit4]   2> 	    <str name="name">numberpartfail</str>
[junit4:junit4]   2> 	    <str name="type">failtype1</str>
[junit4:junit4]   2> 	    <bool name="indexed">true</bool>
[junit4:junit4]   2> 	    <bool name="stored">true</bool>
[junit4:junit4]   2> 	  </lst>
[junit4:junit4]   2> 	  <lst>
[junit4:junit4]   2> 	    <str name="name">sind</str>
[junit4:junit4]   2> 	    <str name="type">string</str>
[junit4:junit4]   2> 	    <bool name="indexed">true</bool>
[junit4:junit4]   2> 	    <bool name="stored">false</bool>
[junit4:junit4]   2> 	  </lst>
[junit4:junit4]   2> 	  <lst>
[junit4:junit4]   2> 	    <str name="name">lowertok</str>
[junit4:junit4]   2> 	    <str name="type">lowertok</str>
[junit4:junit4]   2> 	    <bool name="indexed">true</bool>
[junit4:junit4]   2> 	    <bool name="stored">true</bool>
[junit4:junit4]   2> 	  </lst>
[junit4:junit4]   2> 	  <lst>
[junit4:junit4]   2> 	    <str name="name">standardtok</str>
[junit4:junit4]   2> 	    <str name="type">standardtok</str>
[junit4:junit4]   2> 	    <bool name="indexed">true</bool>
[junit4:junit4]   2> 	    <bool name="stored">true</bool>
[junit4:junit4]   2> 	  </lst>
[junit4:junit4]   2> 	  <lst>
[junit4:junit4]   2> 	    <str name="name">test_hlt</str>
[junit4:junit4]   2> 	    <str name="type">highlittext</str>
[junit4:junit4]   2> 	    <bool name="indexed">true</bool>
[junit4:junit4]   2> 	    <bool name="compressed">true</bool>
[junit4:junit4]   2> 	  </lst>
[junit4:junit4]   2> 	  <lst>
[junit4:junit4]   2> 	    <str name="name">keywordtok</str>
[junit4:junit4]   2> 	    <str name="type">keywordtok</str>
[junit4:junit4]   2> 	    <bool name="indexed">true</bool>
[junit4:junit4]   2> 	    <bool name="stored">true</bool>
[junit4:junit4]   2> 	  </lst>
[junit4:junit4]   2> 	  <lst>
[junit4:junit4]   2> 	    <str name="name">uniq3</str>
[junit4:junit4]   2> 	    <str name="type">string</str>
[junit4:junit4]   2> 	    <bool name="indexed">true</bool>
[junit4:junit4]   2> 	    <bool name="stored">true</bool>
[junit4:junit4]   2> 	  </lst>
[junit4:junit4]   2> 	  <lst>
[junit4:junit4]   2> 	    <str name="name">bind</str>
[junit4:junit4]   2> 	    <str name="type">boolean</str>
[junit4:junit4]   2> 	    <bool name="indexed">true</bool>
[junit4:junit4]   2> 	    <bool name="stored">false</bool>
[junit4:junit4]   2> 	  </lst>
[junit4:junit4]   2> 	  <lst>
[junit4:junit4]   2> 	    <str name="name">teststop</str>
[junit4:junit4]   2> 	    <str name="type">teststop</str>
[junit4:junit4]   2> 	    <bool name="indexed">true</bool>
[junit4:junit4]   2> 	    <bool name="stored">true</bool>
[junit4:junit4]   2> 	  </lst>
[junit4:junit4]   2> 	  <lst>
[junit4:junit4]   2> 	    <str name="name">uniq</str>
[junit4:junit4]   2> 	    <str name="type">string</str>
[junit4:junit4]   2> 	    <bool name="multiValued">true</bool>
[junit4:junit4]   2> 	    <bool name="indexed">true</bool>
[junit4:junit4]   2> 	    <bool name="stored">true</bool>
[junit4:junit4]   2> 	  </lst>
[junit4:junit4]   2> 	  <lst>
[junit4:junit4]   2> 	    <str name="name">textgap</str>
[junit4:junit4]   2> 	    <str name="type">textgap</str>
[junit4:junit4]   2> 	    <bool name="indexed">true</bool>
[junit4:junit4]   2> 	    <bool name="stored">true</bool>
[junit4:junit4]   2> 	  </lst>
[junit4:junit4]   2> 	  <lst>
[junit4:junit4]   2> 	    <str name="name">test_basictv</str>
[junit4:junit4]   2> 	    <str name="type">text</str>
[junit4:junit4]   2> 	    <bool name="termVectors">true</bool>
[junit4:junit4]   2> 	  </lst>
[junit4:junit4]   2> 	  <lst>
[junit4:junit4]   2> 	    <str name="name">uniq2</str>
[junit4:junit4]   2> 	    <str name="type">string</str>
[junit4:junit4]   2> 	    <bool name="multiValued">true</bool>
[junit4:junit4]   2> 	    <bool name="indexed">true</bool>
[junit4:junit4]   2> 	    <bool name="stored">true</bool>
[junit4:junit4]   2> 	  </lst>
[junit4:junit4]   2> 	  <lst>
[junit4:junit4]   2> 	    <str name="name">iind</str>
[junit4:junit4]   2> 	    <str name="type">int</str>
[junit4:junit4]   2> 	    <bool name="indexed">true</bool>
[junit4:junit4]   2> 	    <bool name="stored">false</bool>
[junit4:junit4]   2> 	  </lst>
[junit4:junit4]   2> 	  <lst>
[junit4:junit4]   2> 	    <str name="name">title_lettertok</str>
[junit4:junit4]   2> 	    <str name="type">lettertok</str>
[junit4:junit4]   2> 	    <bool name="indexed">true</bool>
[junit4:junit4]   2> 	    <bool name="stored">false</bool>
[junit4:junit4]   2> 	  </lst>
[junit4:junit4]   2> 	  <lst>
[junit4:junit4]   2> 	    <str name="name">isto</str>
[junit4:junit4]   2> 	    <str name="type">int</str>
[junit4:junit4]   2> 	    <bool name="indexed">false</bool>
[junit4:junit4]   2> 	    <bool name="stored">true</bool>
[junit4:junit4]   2> 	  </lst>
[junit4:junit4]   2> 	  <lst>
[junit4:junit4]   2> 	    <str name="name">test_hlt_off</str>
[junit4:junit4]   2> 	    <str name="type">highlittext</str>
[junit4:junit4]   2> 	    <bool name="indexed">true</bool>
[junit4:junit4]   2> 	    <bool name="compressed">false</bool>
[junit4:junit4]   2> 	  </lst>
[junit4:junit4]   2> 	  <lst>
[junit4:junit4]   2> 	    <str name="name">sku1</str>
[junit4:junit4]   2> 	    <str name="type">skutype1</str>
[junit4:junit4]   2> 	    <bool name="indexed">true</bool>
[junit4:junit4]   2> 	    <bool name="stored">true</bool>
[junit4:junit4]   2> 	  </lst>
[junit4:junit4]   2> 	  <lst>
[junit4:junit4]   2> 	    <str name="name">custengporterfilt</str>
[junit4:junit4]   2> 	    <str name="type">custengporterfilt</str>
[junit4:junit4]   2> 	    <bool name="indexed">true</bool>
[junit4:junit4]   2> 	    <bool name="stored">true</bool>
[junit4:junit4]   2> 	  </lst>
[junit4:junit4]   2> 	  <lst>
[junit4:junit4]   2> 	    <str name="name">wdf_nocase</str>
[junit4:junit4]   2> 	    <str name="type">wdf_nocase</str>
[junit4:junit4]   2> 	    <bool name="indexed">true</bool>
[junit4:junit4]   2> 	    <bool name="stored">true</bool>
[junit4:junit4]   2> 	  </lst>
[junit4:junit4]   2> 	  <lst>
[junit4:junit4]   2> 	    <str name="name">dedup</str>
[junit4:junit4]   2> 	    <str name="type">dedup</str>
[junit4:junit4]   2> 	    <bool name="indexed">true</bool>
[junit4:junit4]   2> 	    <bool name="stored">true</bool>
[junit4:junit4]   2> 	  </lst>
[junit4:junit4]   2> 	  <lst>
[junit4:junit4]   2> 	    <str name="name">title</str>
[junit4:junit4]   2> 	    <str name="type">nametext</str>
[junit4:junit4]   2> 	    <bool name="indexed">true</bool>
[junit4:junit4]   2> 	    <bool name="stored">true</bool>
[junit4:junit4]   2> 	  </lst>
[junit4:junit4]   2> 	  <lst>
[junit4:junit4]   2> 	    <str name="name">syn</str>
[junit4:junit4]   2> 	    <str name="type">syn</str>
[junit4:junit4]   2> 	    <bool name="indexed">true</bool>
[junit4:junit4]   2> 	    <bool name="stored">true</bool>
[junit4:junit4]   2> 	  </lst>
[junit4:junit4]   2> 	  <lst>
[junit4:junit4]   2> 	    <str name="name">lengthfilt</str>
[junit4:junit4]   2> 	    <str name="type">lengthfilt</str>
[junit4:junit4]   2> 	    <bool name="indexed">true</bool>
[junit4:junit4]   2> 	    <bool name="stored">true</bool>
[junit4:junit4]   2> 	  </lst>
[junit4:junit4]   2> 	  <lst>
[junit4:junit4]   2> 	    <str name="name">pointD</str>
[junit4:junit4]   2> 	    <str name="type">xyd</str>
[junit4:junit4]   2> 	    <bool name="multiValued">false</bool>
[junit4:junit4]   2> 	    <bool name="indexed">true</bool>
[junit4:junit4]   2> 	    <bool name="stored">true</bool>
[junit4:junit4]   2> 	  </lst>
[junit4:junit4]   2> 	  <lst>
[junit4:junit4]   2> 	    <str name="name">engporterfilt</str>
[junit4:junit4]   2> 	    <str name="type">engporterfilt</str>
[junit4:junit4]   2> 	    <bool name="indexed">true</bool>
[junit4:junit4]   2> 	    <bool name="stored">true</bool>
[junit4:junit4]   2> 	  </lst>
[junit4:junit4]   2> 	  <lst>
[junit4:junit4]   2> 	    <str name="name">porterfilt</str>
[junit4:junit4]   2> 	    <str name="type">porterfilt</str>
[junit4:junit4]   2> 	    <bool name="indexed">true</bool>
[junit4:junit4]   2> 	    <bool name="stored">true</bool>
[junit4:junit4]   2> 	  </lst>
[junit4:junit4]   2> 	  <lst>
[junit4:junit4]   2> 	    <str name="name">shouldbestored</str>
[junit4:junit4]   2> 	    <str name="type">unstored</str>
[junit4:junit4]   2> 	    <bool name="stored">true</bool>
[junit4:junit4]   2> 	  </lst>
[junit4:junit4]   2> 	  <lst>
[junit4:junit4]   2> 	    <str name="name">_version_</str>
[junit4:junit4]   2> 	    <str name="type">long</str>
[junit4:junit4]   2> 	    <bool name="indexed">true</bool>
[junit4:junit4]   2> 	    <bool name="stored">true</bool>
[junit4:junit4]   2> 	  </lst>
[junit4:junit4]   2> 	  <lst>
[junit4:junit4]   2> 	    <str name="name">test_offtv</str>
[junit4:junit4]   2> 	    <str name="type">text</str>
[junit4:junit4]   2> 	    <bool name="termVectors">true</bool>
[junit4:junit4]   2> 	    <bool name="termOffsets">true</bool>
[junit4:junit4]   2> 	  </lst>
[junit4:junit4]   2> 	  <lst>
[junit4:junit4]   2> 	    <str name="name">HTMLstandardtok</str>
[junit4:junit4]   2> 	    <str name="type">HTMLstandardtok</str>
[junit4:junit4]   2> 	    <bool name="indexed">true</bool>
[junit4:junit4]   2> 	    <bool name="stored">true</bool>
[junit4:junit4]   2> 	  </lst>
[junit4:junit4]   2> 	  <lst>
[junit4:junit4]   2> 	    <str name="name">bsto</str>
[junit4:junit4]   2> 	    <str name="type">boolean</str>
[junit4:junit4]   2> 	    <bool name="indexed">false</bool>
[junit4:junit4]   2> 	    <bool name="stored">true</bool>
[junit4:junit4]   2> 	  </lst>
[junit4:junit4]   2> 	  <lst>
[junit4:junit4]   2> 	    <str name="name">point</str>
[junit4:junit4]   2> 	    <str name="type">xy</str>
[junit4:junit4]   2> 	    <bool name="multiValued">false</bool>
[junit4:junit4]   2> 	    <bool name="indexed">true</bool>
[junit4:junit4]   2> 	    <bool name="stored">true</bool>
[junit4:junit4]   2> 	  </lst>
[junit4:junit4]   2> 	  <lst>
[junit4:junit4]   2> 	    <str name="name">numericsubword</str>
[junit4:junit4]   2> 	    <str name="type">numericsubword</str>
[junit4:junit4]   2> 	    <bool name="indexed">true</bool>
[junit4:junit4]   2> 	    <bool name="stored">true</bool>
[junit4:junit4]   2> 	  </lst>
[junit4:junit4]   2> 	  <lst>
[junit4:junit4]   2> 	    <str name="name">lowerfilt</str>
[junit4:junit4]   2> 	    <str name="type">lowerfilt</str>
[junit4:junit4]   2> 	    <bool name="indexed">true</bool>
[junit4:junit4]   2> 	    <bool name="stored">true</bool>
[junit4:junit4]   2> 	  </lst>
[junit4:junit4]   2> 	  <lst>
[junit4:junit4]   2> 	    <str name="name">ssto</str>
[junit4:junit4]   2> 	    <str name="type">string</str>
[junit4:junit4]   2> 	    <bool name="indexed">false</bool>
[junit4:junit4]   2> 	    <bool name="stored">true</bool>
[junit4:junit4]   2> 	  </lst>
[junit4:junit4]   2> 	  <lst>
[junit4:junit4]   2> 	    <str name="name">test_posofftv</str>
[junit4:junit4]   2> 	    <str name="type">text</str>
[junit4:junit4]   2> 	    <bool name="termVectors">true</bool>
[junit4:junit4]   2> 	    <bool name="termPositions">true</bool>
[junit4:junit4]   2> 	    <bool name="termOffsets">true</bool>
[junit4:junit4]   2> 	  </lst>
[junit4:junit4]   2> 	  <lst>
[junit4:junit4]   2> 	    <str name="name">point_hash</str>
[junit4:junit4]   2> 	    <str name="type">geohash</str>
[junit4:junit4]   2> 	    <bool name="multiValued">false</bool>
[junit4:junit4]   2> 	    <bool name="indexed">true</bool>
[junit4:junit4]   2> 	    <bool name="stored">true</bool>
[junit4:junit4]   2> 	  </lst>
[junit4:junit4]   2> 	  <lst>
[junit4:junit4]   2> 	    <str name="name">stopfilt</str>
[junit4:junit4]   2> 	    <str name="type">stopfilt</str>
[junit4:junit4]   2> 	    <bool name="indexed">true</bool>
[junit4:junit4]   2> 	    <bool name="stored">true</bool>
[junit4:junit4]   2> 	  </lst>
[junit4:junit4]   2> 	  <lst>
[junit4:junit4]   2> 	    <str name="name">custstopfilt</str>
[junit4:junit4]   2> 	    <str name="type">custstopfilt</str>
[junit4:junit4]   2> 	    <bool name="indexed">true</bool>
[junit4:junit4]   2> 	    <bool name="stored">true</bool>
[junit4:junit4]   2> 	  </lst>
[junit4:junit4]   2> 	  <lst>
[junit4:junit4]   2> 	    <str name="name">HTMLwhitetok</str>
[junit4:junit4]   2> 	    <str name="type">HTMLwhitetok</str>
[junit4:junit4]   2> 	    <bool name="indexed">true</bool>
[junit4:junit4]   2> 	    <bool name="stored">true</bool>
[junit4:junit4]   2> 	  </lst>
[junit4:junit4]   2> 	  <lst>
[junit4:junit4]   2> 	    <str name="name">text_np</str>
[junit4:junit4]   2> 	    <str name="type">text_np</str>
[junit4:junit4]   2> 	    <bool name="indexed">true</bool>
[junit4:junit4]   2> 	    <bool name="stored">false</bool>
[junit4:junit4]   2> 	  </lst>
[junit4:junit4]   2> 	  <lst>
[junit4:junit4]   2> 	    <str name="name">shouldbeunstored</str>
[junit4:junit4]   2> 	    <str name="type">unstored</str>
[junit4:junit4]   2> 	  </lst>
[junit4:junit4]   2> 	  <lst>
[junit4:junit4]   2> 	    <str name="name">text</str>
[junit4:junit4]   2> 	    <str name="type">text</str>
[junit4:junit4]   2> 	    <bool name="multiValued">true</bool>
[junit4:junit4]   2> 	    <bool name="indexed">true</bool>
[junit4:junit4]   2> 	    <bool name="stored">false</bool>
[junit4:junit4]   2> 	  </lst>
[junit4:junit4]   2> 	  <lst>
[junit4:junit4]   2> 	    <str name="name">wdf_preserve</str>
[junit4:junit4]   2> 	    <str name="type">wdf_preserve</str>
[junit4:junit4]   2> 	    <bool name="indexed">true</bool>
[junit4:junit4]   2> 	    <bool name="stored">true</bool>
[junit4:junit4]   2> 	  </lst>
[junit4:junit4]   2> 	  <lst>
[junit4:junit4]   2> 	    <str name="name">store</str>
[junit4:junit4]   2> 	    <str name="type">location</str>
[junit4:junit4]   2> 	    <bool name="indexed">true</bool>
[junit4:junit4]   2> 	    <bool name="stored">true</bool>
[junit4:junit4]   2> 	  </lst>
[junit4:junit4]   2> 	  <lst>
[junit4:junit4]   2> 	    <str name="name">signatureField</str>
[junit4:junit4]   2> 	    <str name="type">string</str>
[junit4:junit4]   2> 	    <bool name="indexed">true</bool>
[junit4:junit4]   2> 	    <bool name="stored">false</bool>
[junit4:junit4]   2> 	  </lst>
[junit4:junit4]   2> 	  <lst>
[junit4:junit4]   2> 	    <str name="name">bindsto</str>
[junit4:junit4]   2> 	    <str name="type">boolean</str>
[junit4:junit4]   2> 	    <bool name="indexed">true</bool>
[junit4:junit4]   2> 	    <bool name="stored">true</bool>
[junit4:junit4]   2> 	  </lst>
[junit4:junit4]   2> 	  <lst>
[junit4:junit4]   2> 	    <str name="name">subject</str>
[junit4:junit4]   2> 	    <str name="type">text</str>
[junit4:junit4]   2> 	    <bool name="indexed">true</bool>
[junit4:junit4]   2> 	    <bool name="stored">true</bool>
[junit4:junit4]   2> 	  </lst>
[junit4:junit4]   2> 	  <lst>
[junit4:junit4]   2> 	    <str name="name">sindsto</str>
[junit4:junit4]   2> 	    <str name="type">string</str>
[junit4:junit4]   2> 	    <bool name="indexed">true</bool>
[junit4:junit4]   2> 	    <bool name="stored">true</bool>
[junit4:junit4]   2> 	  </lst>
[junit4:junit4]   2> 	  <lst>
[junit4:junit4]   2> 	    <str name="name">lettertok</str>
[junit4:junit4]   2> 	    <str name="type">lettertok</str>
[junit4:junit4]   2> 	    <bool name="indexed">true</bool>
[junit4:junit4]   2> 	    <bool name="stored">true</bool>
[junit4:junit4]   2> 	  </lst>
[junit4:junit4]   2> 	  <lst>
[junit4:junit4]   2> 	    <str name="name">uuid</str>
[junit4:junit4]   2> 	    <str name="type">uuid</str>
[junit4:junit4]   2> 	    <bool name="stored">true</bool>
[junit4:junit4]   2> 	  </lst>
[junit4:junit4]   2> 	  <lst>
[junit4:junit4]   2> 	    <str name="name">nullfirst</str>
[junit4:junit4]   2> 	    <str name="type">string</str>
[junit4:junit4]   2> 	    <bool name="sortMissingFirst">true</bool>
[junit4:junit4]   2> 	    <bool name="indexed">true</bool>
[junit4:junit4]   2> 	    <bool name="stored">true</bool>
[junit4:junit4]   2> 	  </lst>
[junit4:junit4]   2> 	  <lst>
[junit4:junit4]   2> 	    <str name="name">subword</str>
[junit4:junit4]   2> 	    <str name="type">subword</str>
[junit4:junit4]   2> 	    <bool name="indexed">true</bool>
[junit4:junit4]   2> 	    <bool name="stored">true</bool>
[junit4:junit4]   2> 	  </lst>
[junit4:junit4]   2> 	  <lst>
[junit4:junit4]   2> 	    <str name="name">test_postv</str>
[junit4:junit4]   2> 	    <str name="type">text</str>
[junit4:junit4]   2> 	    <bool name="termVectors">true</bool>
[junit4:junit4]   2> 	    <bool name="termPositions">true</bool>
[junit4:junit4]   2> 	  </lst>
[junit4:junit4]   2> 	  <lst>
[junit4:junit4]   2> 	    <str name="name">timestamp</str>
[junit4:junit4]   2> 	    <str name="type">date</str>
[junit4:junit4]   2> 	    <bool name="indexed">true</bool>
[junit4:junit4]   2> 	    <bool name="stored">true</bool>
[junit4:junit4]   2> 	  </lst>
[junit4:junit4]   2> 	  <lst>
[junit4:junit4]   2> 	    <str name="name">sku2</str>
[junit4:junit4]   2> 	    <str name="type">skutype2</str>
[junit4:junit4]   2> 	    <bool name="indexed">true</bool>
[junit4:junit4]   2> 	    <bool name="stored">true</bool>
[junit4:junit4]   2> 	  </lst>
[junit4:junit4]   2> 	  <lst>
[junit4:junit4]   2> 	    <str name="name">standardfilt</str>
[junit4:junit4]   2> 	    <str name="type">standardfilt</str>
[junit4:junit4]   2> 	    <bool name="indexed">true</bool>
[junit4:junit4]   2> 	    <bool name="stored">true</bool>
[junit4:junit4]   2> 	  </lst>
[junit4:junit4]   2> 	  <lst>
[junit4:junit4]   2> 	    <str name="name">copyfield_source</str>
[junit4:junit4]   2> 	    <str name="type">string</str>
[junit4:junit4]   2> 	    <bool name="multiValued">true</bool>
[junit4:junit4]   2> 	    <bool name="indexed">true</bool>
[junit4:junit4]   2> 	    <bool name="stored">true</bool>
[junit4:junit4]   2> 	  </lst>
[junit4:junit4]   2> 	  <lst>
[junit4:junit4]   2> 	    <str name="name">id</str>
[junit4:junit4]   2> 	    <str name="type">string</str>
[junit4:junit4]   2> 	    <bool name="multiValued">false</bool>
[junit4:junit4]   2> 	    <bool name="indexed">true</bool>
[junit4:junit4]   2> 	    <bool name="stored">true</bool>
[junit4:junit4]   2> 	    <bool name="required">true</bool>
[junit4:junit4]   2> 	    <bool name="uniqueKey">true</bool>
[junit4:junit4]   2> 	  </lst>
[junit4:junit4]   2> 	  <lst>
[junit4:junit4]   2> 	    <str name="name">name</str>
[junit4:junit4]   2> 	    <str name="type">nametext</str>
[junit4:junit4]   2> 	    <bool name="indexed">true</bool>
[junit4:junit4]   2> 	    <bool name="stored">true</bool>
[junit4:junit4]   2> 	  </lst>
[junit4:junit4]   2> 	  <lst>
[junit4:junit4]   2> 	    <str name="name">shouldbeunindexed</str>
[junit4:junit4]   2> 	    <str name="type">unstored</str>
[junit4:junit4]   2> 	    <bool name="indexed">false</bool>
[junit4:junit4]   2> 	    <bool name="stored">true</bool>
[junit4:junit4]   2> 	  </lst>
[junit4:junit4]   2> 	  <lst>
[junit4:junit4]   2> 	    <str name="name">protectedsubword</str>
[junit4:junit4]   2> 	    <str name="type">protectedsubword</str>
[junit4:junit4]   2> 	    <bool name="indexed">true</bool>
[junit4:junit4]   2> 	    <bool name="stored">true</bool>
[junit4:junit4]   2> 	  </lst>
[junit4:junit4]   2> 	</arr>
[junit4:junit4]   2> 	</response>
[junit4:junit4]   2> 	
[junit4:junit4]   2> 		request was:/schema/fields?indent=on&wt=xml
[junit4:junit4]   2> 		at org.apache.solr.util.RestTestBase.assertQ(RestTestBase.java:136)
[junit4:junit4]   2> 		at org.apache.solr.rest.TestFieldCollectionResource.testGetAllFields(TestFieldCollectionResource.java:26)
[junit4:junit4]   2> 		at sun.reflect.NativeMethodAccessorImpl.invoke0(Native Method)
[junit4:junit4]   2> 		at sun.reflect.NativeMethodAccessorImpl.invoke(NativeMethodAccessorImpl.java:57)
[junit4:junit4]   2> 		at sun.reflect.DelegatingMethodAccessorImpl.invoke(DelegatingMethodAccessorImpl.java:43)
[junit4:junit4]   2> 		at java.lang.reflect.Method.invoke(Method.java:487)
[junit4:junit4]   2> 		at com.carrotsearch.randomizedtesting.RandomizedRunner.invoke(RandomizedRunner.java:1559)
[junit4:junit4]   2> 		at com.carrotsearch.randomizedtesting.RandomizedRunner.access$600(RandomizedRunner.java:79)
[junit4:junit4]   2> 		at com.carrotsearch.randomizedtesting.RandomizedRunner$6.evaluate(RandomizedRunner.java:737)
[junit4:junit4]   2> 		at com.carrotsearch.randomizedtesting.RandomizedRunner$7.evaluate(RandomizedRunner.java:773)
[junit4:junit4]   2> 		at com.carrotsearch.randomizedtesting.RandomizedRunner$8.evaluate(RandomizedRunner.java:787)
[junit4:junit4]   2> 		at com.carrotsearch.randomizedtesting.rules.SystemPropertiesRestoreRule$1.evaluate(SystemPropertiesRestoreRule.java:53)
[junit4:junit4]   2> 		at org.apache.lucene.util.TestRuleSetupTeardownChained$1.evaluate(TestRuleSetupTeardownChained.java:50)
[junit4:junit4]   2> 		at org.apache.lucene.util.TestRuleFieldCacheSanity$1.evaluate(TestRuleFieldCacheSanity.java:51)
[junit4:junit4]   2> 		at org.apache.lucene.util.AbstractBeforeAfterRule$1.evaluate(AbstractBeforeAfterRule.java:46)
[junit4:junit4]   2> 		at com.carrotsearch.randomizedtesting.rules.SystemPropertiesInvariantRule$1.evaluate(SystemPropertiesInvariantRule.java:55)
[junit4:junit4]   2> 		at org.apache.lucene.util.TestRuleThreadAndTestName$1.evaluate(TestRuleThreadAndTestName.java:49)
[junit4:junit4]   2> 		at org.apache.lucene.util.TestRuleIgnoreAfterMaxFailures$1.evaluate(TestRuleIgnoreAfterMaxFailures.java:70)
[junit4:junit4]   2> 		at org.apache.lucene.util.TestRuleMarkFailure$1.evaluate(TestRuleMarkFailure.java:48)
[junit4:junit4]   2> 		at com.carrotsearch.randomizedtesting.rules.StatementAdapter.evaluate(StatementAdapter.java:36)
[junit4:junit4]   2> 		at com.carrotsearch.randomizedtesting.ThreadLeakControl$StatementRunner.run(ThreadLeakControl.java:358)
[junit4:junit4]   2> 		at com.carrotsearch.randomizedtesting.ThreadLeakControl.forkTimeoutingTask(ThreadLeakControl.java:782)
[junit4:junit4]   2> 		at com.carrotsearch.randomizedtesting.ThreadLeakControl$3.evaluate(ThreadLeakControl.java:442)
[junit4:junit4]   2> 		at com.carrotsearch.randomizedtesting.RandomizedRunner.runSingleTest(RandomizedRunner.java:746)
[junit4:junit4]   2> 		at com.carrotsearch.randomizedtesting.RandomizedRunner$3.evaluate(RandomizedRunner.java:648)
[junit4:junit4]   2> 		at com.carrotsearch.randomizedtesting.RandomizedRunner$4.evaluate(RandomizedRunner.java:682)
[junit4:junit4]   2> 		at com.carrotsearch.randomizedtesting.RandomizedRunner$5.evaluate(RandomizedRunner.java:693)
[junit4:junit4]   2> 		at com.carrotsearch.randomizedtesting.rules.StatementAdapter.evaluate(StatementAdapter.java:36)
[junit4:junit4]   2> 		at com.carrotsearch.randomizedtesting.rules.SystemPropertiesRestoreRule$1.evaluate(SystemPropertiesRestoreRule.java:53)
[junit4:junit4]   2> 		at org.apache.lucene.util.AbstractBeforeAfterRule$1.evaluate(AbstractBeforeAfterRule.java:46)
[junit4:junit4]   2> 		at org.apache.lucene.util.TestRuleStoreClassName$1.evaluate(TestRuleStoreClassName.java:42)
[junit4:junit4]   2> 		at com.carrotsearch.randomizedtesting.rules.SystemPropertiesInvariantRule$1.evaluate(SystemPropertiesInvariantRule.java:55)
[junit4:junit4]   2> 		at com.carrotsearch.randomizedtesting.rules.NoShadowingOrOverridesOnMethodsRule$1.evaluate(NoShadowingOrOverridesOnMethodsRule.java:39)
[junit4:junit4]   2> 		at com.carrotsearch.randomizedtesting.rules.NoShadowingOrOverridesOnMethodsRule$1.evaluate(NoShadowingOrOverridesOnMethodsRule.java:39)
[junit4:junit4]   2> 		at com.carrotsearch.randomizedtesting.rules.StatementAdapter.evaluate(StatementAdapter.java:36)
[junit4:junit4]   2> 		at org.apache.lucene.util.TestRuleAssertionsRequired$1.evaluate(TestRuleAssertionsRequired.java:43)
[junit4:junit4]   2> 		at org.apache.lucene.util.TestRuleMarkFailure$1.evaluate(TestRuleMarkFailure.java:48)
[junit4:junit4]   2> 		at org.apache.lucene.util.TestRuleIgnoreAfterMaxFailures$1.evaluate(TestRuleIgnoreAfterMaxFailures.java:70)
[junit4:junit4]   2> 		at org.apache.lucene.util.TestRuleIgnoreTestSuites$1.evaluate(TestRuleIgnoreTestSuites.java:55)
[junit4:junit4]   2> 		at com.carrotsearch.randomizedtesting.rules.StatementAdapter.evaluate(StatementAdapter.java:36)
[junit4:junit4]   2> 		at com.carrotsearch.randomizedtesting.ThreadLeakControl$StatementRunner.run(ThreadLeakControl.java:358)
[junit4:junit4]   2> 		at java.lang.Thread.run(Thread.java:722)
[junit4:junit4]   2> 	
[junit4:junit4]   2> 6311 T13 oas.SolrTestCaseJ4.tearDown ###Ending testGetAllFields
[junit4:junit4]   2> NOTE: reproduce with: ant test  -Dtestcase=TestFieldCollectionResource -Dtests.method=testGetAllFields -Dtests.seed=E8D2B859D380A4D3 -Dtests.multiplier=3 -Dtests.slow=true -Dtests.locale=fr_LU -Dtests.timezone=America/Pangnirtung -Dtests.file.encoding=UTF-8
[junit4:junit4] ERROR   2.11s J0 | TestFieldCollectionResource.testGetAllFields <<<
[junit4:junit4]    > Throwable #1: java.lang.RuntimeException: Exception during query
[junit4:junit4]    > 	at __randomizedtesting.SeedInfo.seed([E8D2B859D380A4D3:47CF29D29735D4B]:0)
[junit4:junit4]    > 	at org.apache.solr.util.RestTestBase.assertQ(RestTestBase.java:143)
[junit4:junit4]    > 	at org.apache.solr.rest.TestFieldCollectionResource.testGetAllFields(TestFieldCollectionResource.java:26)
[junit4:junit4]    > 	at sun.reflect.NativeMethodAccessorImpl.invoke0(Native Method)
[junit4:junit4]    > 	at sun.reflect.NativeMethodAccessorImpl.invoke(NativeMethodAccessorImpl.java:57)
[junit4:junit4]    > 	at sun.reflect.DelegatingMethodAccessorImpl.invoke(DelegatingMethodAccessorImpl.java:43)
[junit4:junit4]    > 	at java.lang.reflect.Method.invoke(Method.java:487)
[junit4:junit4]    > 	at com.carrotsearch.randomizedtesting.RandomizedRunner.invoke(RandomizedRunner.java:1559)
[junit4:junit4]    > 	at com.carrotsearch.randomizedtesting.RandomizedRunner.access$600(RandomizedRunner.java:79)
[junit4:junit4]    > 	at com.carrotsearch.randomizedtesting.RandomizedRunner$6.evaluate(RandomizedRunner.java:737)
[junit4:junit4]    > 	at com.carrotsearch.randomizedtesting.RandomizedRunner$7.evaluate(RandomizedRunner.java:773)
[junit4:junit4]    > 	at com.carrotsearch.randomizedtesting.RandomizedRunner$8.evaluate(RandomizedRunner.java:787)
[junit4:junit4]    > 	at com.carrotsearch.randomizedtesting.rules.SystemPropertiesRestoreRule$1.evaluate(SystemPropertiesRestoreRule.java:53)
[junit4:junit4]    > 	at org.apache.lucene.util.TestRuleSetupTeardownChained$1.evaluate(TestRuleSetupTeardownChained.java:50)
[junit4:junit4]    > 	at org.apache.lucene.util.TestRuleFieldCacheSanity$1.evaluate(TestRuleFieldCacheSanity.java:51)
[junit4:junit4]    > 	at org.apache.lucene.util.AbstractBeforeAfterRule$1.evaluate(AbstractBeforeAfterRule.java:46)
[junit4:junit4]    > 	at com.carrotsearch.randomizedtesting.rules.SystemPropertiesInvariantRule$1.evaluate(SystemPropertiesInvariantRule.java:55)
[junit4:junit4]    > 	at org.apache.lucene.util.TestRuleThreadAndTestName$1.evaluate(TestRuleThreadAndTestName.java:49)
[junit4:junit4]    > 	at org.apache.lucene.util.TestRuleIgnoreAfterMaxFailures$1.evaluate(TestRuleIgnoreAfterMaxFailures.java:70)
[junit4:junit4]    > 	at org.apache.lucene.util.TestRuleMarkFailure$1.evaluate(TestRuleMarkFailure.java:48)
[junit4:junit4]    > 	at com.carrotsearch.randomizedtesting.rules.StatementAdapter.evaluate(StatementAdapter.java:36)
[junit4:junit4]    > 	at com.carrotsearch.randomizedtesting.ThreadLeakControl$StatementRunner.run(ThreadLeakControl.java:358)
[junit4:junit4]    > 	at com.carrotsearch.randomizedtesting.ThreadLeakControl.forkTimeoutingTask(ThreadLeakControl.java:782)
[junit4:junit4]    > 	at com.carrotsearch.randomizedtesting.ThreadLeakControl$3.evaluate(ThreadLeakControl.java:442)
[junit4:junit4]    > 	at com.carrotsearch.randomizedtesting.RandomizedRunner.runSingleTest(RandomizedRunner.java:746)
[junit4:junit4]    > 	at com.carrotsearch.randomizedtesting.RandomizedRunner$3.evaluate(RandomizedRunner.java:648)
[junit4:junit4]    > 	at com.carrotsearch.randomizedtesting.RandomizedRunner$4.evaluate(RandomizedRunner.java:682)
[junit4:junit4]    > 	at com.carrotsearch.randomizedtesting.RandomizedRunner$5.evaluate(RandomizedRunner.java:693)
[junit4:junit4]    > 	at com.carrotsearch.randomizedtesting.rules.StatementAdapter.evaluate(StatementAdapter.java:36)
[junit4:junit4]    > 	at com.carrotsearch.randomizedtesting.rules.SystemPropertiesRestoreRule$1.evaluate(SystemPropertiesRestoreRule.java:53)
[junit4:junit4]    > 	at org.apache.lucene.util.AbstractBeforeAfterRule$1.evaluate(AbstractBeforeAfterRule.java:46)
[junit4:junit4]    > 	at org.apache.lucene.util.TestRuleStoreClassName$1.evaluate(TestRuleStoreClassName.java:42)
[junit4:junit4]    > 	at com.carrotsearch.randomizedtesting.rules.SystemPropertiesInvariantRule$1.evaluate(SystemPropertiesInvariantRule.java:55)
[junit4:junit4]    > 	at com.carrotsearch.randomizedtesting.rules.NoShadowingOrOverridesOnMethodsRule$1.evaluate(NoShadowingOrOverridesOnMethodsRule.java:39)
[junit4:junit4]    > 	at com.carrotsearch.randomizedtesting.rules.NoShadowingOrOverridesOnMethodsRule$1.evaluate(NoShadowingOrOverridesOnMethodsRule.java:39)
[junit4:junit4]    > 	at com.carrotsearch.randomizedtesting.rules.StatementAdapter.evaluate(StatementAdapter.java:36)
[junit4:junit4]    > 	at org.apache.lucene.util.TestRuleAssertionsRequired$1.evaluate(TestRuleAssertionsRequired.java:43)
[junit4:junit4]    > 	at org.apache.lucene.util.TestRuleMarkFailure$1.evaluate(TestRuleMarkFailure.java:48)
[junit4:junit4]    > 	at org.apache.lucene.util.TestRuleIgnoreAfterMaxFailures$1.evaluate(TestRuleIgnoreAfterMaxFailures.java:70)
[junit4:junit4]    > 	at org.apache.lucene.util.TestRuleIgnoreTestSuites$1.evaluate(TestRuleIgnoreTestSuites.java:55)
[junit4:junit4]    > 	at com.carrotsearch.randomizedtesting.rules.StatementAdapter.evaluate(StatementAdapter.java:36)
[junit4:junit4]    > 	at com.carrotsearch.randomizedtesting.ThreadLeakControl$StatementRunner.run(ThreadLeakControl.java:358)
[junit4:junit4]    > 	at java.lang.Thread.run(Thread.java:722)
[junit4:junit4]    > Caused by: java.lang.RuntimeException: REQUEST FAILED: xpath=(/response/arr[@name='fields']/lst/str[@name='name'])[1] = 'custstopfilt'
[junit4:junit4]    > 	xml response was: <?xml version="1.0" encoding="UTF-8"?>
[junit4:junit4]    > <response>
[junit4:junit4]    > 
[junit4:junit4]    > <lst name="responseHeader">
[junit4:junit4]    >   <int name="status">0</int>
[junit4:junit4]    >   <int name="QTime">284</int>
[junit4:junit4]    > </lst>
[junit4:junit4]    > <arr name="fields">
[junit4:junit4]    >   <lst>
[junit4:junit4]    >     <str name="name">patternreplacefilt</str>
[junit4:junit4]    >     <str name="type">patternreplacefilt</str>
[junit4:junit4]    >     <bool name="indexed">true</bool>
[junit4:junit4]    >     <bool name="stored">true</bool>
[junit4:junit4]    >   </lst>
[junit4:junit4]    >   <lst>
[junit4:junit4]    >     <str name="name">bday</str>
[junit4:junit4]    >     <str name="type">date</str>
[junit4:junit4]    >     <bool name="indexed">true</bool>
[junit4:junit4]    >     <bool name="stored">true</bool>
[junit4:junit4]    >   </lst>
[junit4:junit4]    >   <lst>
[junit4:junit4]    >     <str name="name">test_notv</str>
[junit4:junit4]    >     <str name="type">text</str>
[junit4:junit4]    >     <bool name="termVectors">false</bool>
[junit4:junit4]    >   </lst>
[junit4:junit4]    >   <lst>
[junit4:junit4]    >     <str name="name">standardtokfilt</str>
[junit4:junit4]    >     <str name="type">standardtokfilt</str>
[junit4:junit4]    >     <bool name="indexed">true</bool>
[junit4:junit4]    >     <bool name="stored">true</bool>
[junit4:junit4]    >   </lst>
[junit4:junit4]    >   <lst>
[junit4:junit4]    >     <str name="name">nouniq</str>
[junit4:junit4]    >     <str name="type">string</str>
[junit4:junit4]    >     <bool name="multiValued">true</bool>
[junit4:junit4]    >     <bool name="indexed">true</bool>
[junit4:junit4]    >     <bool name="stored">true</bool>
[junit4:junit4]    >   </lst>
[junit4:junit4]    >   <lst>
[junit4:junit4]    >     <str name="name">title_stemmed</str>
[junit4:junit4]    >     <str name="type">text</str>
[junit4:junit4]    >     <bool name="indexed">true</bool>
[junit4:junit4]    >     <bool name="stored">false</bool>
[junit4:junit4]    >   </lst>
[junit4:junit4]    >   <lst>
[junit4:junit4]    >     <str name="name">whitetok</str>
[junit4:junit4]    >     <str name="type">whitetok</str>
[junit4:junit4]    >     <bool name="indexed">true</bool>
[junit4:junit4]    >     <bool name="stored">true</bool>
[junit4:junit4]    >   </lst>
[junit4:junit4]    >   <lst>
[junit4:junit4]    >     <str name="name">weight</str>
[junit4:junit4]    >     <str name="type">float</str>
[junit4:junit4]    >     <bool name="indexed">true</bool>
[junit4:junit4]    >     <bool name="stored">true</bool>
[junit4:junit4]    >   </lst>
[junit4:junit4]    >   <lst>
[junit4:junit4]    >     <str name="name">numberpartfail</str>
[junit4:junit4]    >     <str name="type">failtype1</str>
[junit4:junit4]    >     <bool name="indexed">true</bool>
[junit4:junit4]    >     <bool name="stored">true</bool>
[junit4:junit4]    >   </lst>
[junit4:junit4]    >   <lst>
[junit4:junit4]    >     <str name="name">sind</str>
[junit4:junit4]    >     <str name="type">string</str>
[junit4:junit4]    >     <bool name="indexed">true</bool>
[junit4:junit4]    >     <bool name="stored">false</bool>
[junit4:junit4]    >   </lst>
[junit4:junit4]    >   <lst>
[junit4:junit4]    >     <str name="name">lowertok</str>
[junit4:junit4]    >     <str name="type">lowertok</str>
[junit4:junit4]    >     <bool name="indexed">true</bool>
[junit4:junit4]    >     <bool name="stored">true</bool>
[junit4:junit4]    >   </lst>
[junit4:junit4]    >   <lst>
[junit4:junit4]    >     <str name="name">standardtok</str>
[junit4:junit4]    >     <str name="type">standardtok</str>
[junit4:junit4]    >     <bool name="indexed">true</bool>
[junit4:junit4]    >     <bool name="stored">true</bool>
[junit4:junit4]    >   </lst>
[junit4:junit4]    >   <lst>
[junit4:junit4]    >     <str name="name">test_hlt</str>
[junit4:junit4]    >     <str name="type">highlittext</str>
[junit4:junit4]    >     <bool name="indexed">true</bool>
[junit4:junit4]    >     <bool name="compressed">true</bool>
[junit4:junit4]    >   </lst>
[junit4:junit4]    >   <lst>
[junit4:junit4]    >     <str name="name">keywordtok</str>
[junit4:junit4]    >     <str name="type">keywordtok</str>
[junit4:junit4]    >     <bool name="indexed">true</bool>
[junit4:junit4]    >     <bool name="stored">true</bool>
[junit4:junit4]    >   </lst>
[junit4:junit4]    >   <lst>
[junit4:junit4]    >     <str name="name">uniq3</str>
[junit4:junit4]    >     <str name="type">string</str>
[junit4:junit4]    >     <bool name="indexed">true</bool>
[junit4:junit4]    >     <bool name="stored">true</bool>
[junit4:junit4]    >   </lst>
[junit4:junit4]    >   <lst>
[junit4:junit4]    >     <str name="name">bind</str>
[junit4:junit4]    >     <str name="type">boolean</str>
[junit4:junit4]    >     <bool name="indexed">true</bool>
[junit4:junit4]    >     <bool name="stored">false</bool>
[junit4:junit4]    >   </lst>
[junit4:junit4]    >   <lst>
[junit4:junit4]    >     <str name="name">teststop</str>
[junit4:junit4]    >     <str name="type">teststop</str>
[junit4:junit4]    >     <bool name="indexed">true</bool>
[junit4:junit4]    >     <bool name="stored">true</bool>
[junit4:junit4]    >   </lst>
[junit4:junit4]    >   <lst>
[junit4:junit4]    >     <str name="name">uniq</str>
[junit4:junit4]    >     <str name="type">string</str>
[junit4:junit4]    >     <bool name="multiValued">true</bool>
[junit4:junit4]    >     <bool name="indexed">true</bool>
[junit4:junit4]    >     <bool name="stored">true</bool>
[junit4:junit4]    >   </lst>
[junit4:junit4]    >   <lst>
[junit4:junit4]    >     <str name="name">textgap</str>
[junit4:junit4]    >     <str name="type">textgap</str>
[junit4:junit4]    >     <bool name="indexed">true</bool>
[junit4:junit4]    >     <bool name="stored">true</bool>
[junit4:junit4]    >   </lst>
[junit4:junit4]    >   <lst>
[junit4:junit4]    >     <str name="name">test_basictv</str>
[junit4:junit4]    >     <str name="type">text</str>
[junit4:junit4]    >     <bool name="termVectors">true</bool>
[junit4:junit4]    >   </lst>
[junit4:junit4]    >   <lst>
[junit4:junit4]    >     <str name="name">uniq2</str>
[junit4:junit4]    >     <str name="type">string</str>
[junit4:junit4]    >     <bool name="multiValued">true</bool>
[junit4:junit4]    >     <bool name="indexed">true</bool>
[junit4:junit4]    >     <bool name="stored">true</bool>
[junit4:junit4]    >   </lst>
[junit4:junit4]    >   <lst>
[junit4:junit4]    >     <str name="name">iind</str>
[junit4:junit4]    >     <str name="type">int</str>
[junit4:junit4]    >     <bool name="indexed">true</bool>
[junit4:junit4]    >     <bool name="stored">false</bool>
[junit4:junit4]    >   </lst>
[junit4:junit4]    >   <lst>
[junit4:junit4]    >     <str name="name">title_lettertok</str>
[junit4:junit4]    >     <str name="type">lettertok</str>
[junit4:junit4]    >     <bool name="indexed">true</bool>
[junit4:junit4]    >     <bool name="stored">false</bool>
[junit4:junit4]    >   </lst>
[junit4:junit4]    >   <lst>
[junit4:junit4]    >     <str name="name">isto</str>
[junit4:junit4]    >     <str name="type">int</str>
[junit4:junit4]    >     <bool name="indexed">false</bool>
[junit4:junit4]    >     <bool name="stored">true</bool>
[junit4:junit4]    >   </lst>
[junit4:junit4]    >   <lst>
[junit4:junit4]    >     <str name="name">test_hlt_off</str>
[junit4:junit4]    >     <str name="type">highlittext</str>
[junit4:junit4]    >     <bool name="indexed">true</bool>
[junit4:junit4]    >     <bool name="compressed">false</bool>
[junit4:junit4]    >   </lst>
[junit4:junit4]    >   <lst>
[junit4:junit4]    >     <str name="name">sku1</str>
[junit4:junit4]    >     <str name="type">skutype1</str>
[junit4:junit4]    >     <bool name="indexed">true</bool>
[junit4:junit4]    >     <bool name="stored">true</bool>
[junit4:junit4]    >   </lst>
[junit4:junit4]    >   <lst>
[junit4:junit4]    >     <str name="name">custengporterfilt</str>
[junit4:junit4]    >     <str name="type">custengporterfilt</str>
[junit4:junit4]    >     <bool name="indexed">true</bool>
[junit4:junit4]    >     <bool name="stored">true</bool>
[junit4:junit4]    >   </lst>
[junit4:junit4]    >   <lst>
[junit4:junit4]    >     <str name="name">wdf_nocase</str>
[junit4:junit4]    >     <str name="type">wdf_nocase</str>
[junit4:junit4]    >     <bool name="indexed">true</bool>
[junit4:junit4]    >     <bool name="stored">true</bool>
[junit4:junit4]    >   </lst>
[junit4:junit4]    >   <lst>
[junit4:junit4]    >     <str name="name">dedup</str>
[junit4:junit4]    >     <str name="type">dedup</str>
[junit4:junit4]    >     <bool name="indexed">true</bool>
[junit4:junit4]    >     <bool name="stored">true</bool>
[junit4:junit4]    >   </lst>
[junit4:junit4]    >   <lst>
[junit4:junit4]    >     <str name="name">title</str>
[junit4:junit4]    >     <str name="type">nametext</str>
[junit4:junit4]    >     <bool name="indexed">true</bool>
[junit4:junit4]    >     <bool name="stored">true</bool>
[junit4:junit4]    >   </lst>
[junit4:junit4]    >   <lst>
[junit4:junit4]    >     <str name="name">syn</str>
[junit4:junit4]    >     <str name="type">syn</str>
[junit4:junit4]    >     <bool name="indexed">true</bool>
[junit4:junit4]    >     <bool name="stored">true</bool>
[junit4:junit4]    >   </lst>
[junit4:junit4]    >   <lst>
[junit4:junit4]    >     <str name="name">lengthfilt</str>
[junit4:junit4]    >     <str name="type">lengthfilt</str>
[junit4:junit4]    >     <bool name="indexed">true</bool>
[junit4:junit4]    >     <bool name="stored">true</bool>
[junit4:junit4]    >   </lst>
[junit4:junit4]    >   <lst>
[junit4:junit4]    >     <str name="name">pointD</str>
[junit4:junit4]    >     <str name="type">xyd</str>
[junit4:junit4]    >     <bool name="multiValued">false</bool>
[junit4:junit4]    >     <bool name="indexed">true</bool>
[junit4:junit4]    >     <bool name="stored">true</bool>
[junit4:junit4]    >   </lst>
[junit4:junit4]    >   <lst>
[junit4:junit4]    >     <str name="name">engporterfilt</str>
[junit4:junit4]    >     <str name="type">engporterfilt</str>
[junit4:junit4]    >     <bool name="indexed">true</bool>
[junit4:junit4]    >     <bool name="stored">true</bool>
[junit4:junit4]    >   </lst>
[junit4:junit4]    >   <lst>
[junit4:junit4]    >     <str name="name">porterfilt</str>
[junit4:junit4]    >     <str name="type">porterfilt</str>
[junit4:junit4]    >     <bool name="indexed">true</bool>
[junit4:junit4]    >     <bool name="stored">true</bool>
[junit4:junit4]    >   </lst>
[junit4:junit4]    >   <lst>
[junit4:junit4]    >     <str name="name">shouldbestored</str>
[junit4:junit4]    >     <str name="type">unstored</str>
[junit4:junit4]    >     <bool name="stored">true</bool>
[junit4:junit4]    >   </lst>
[junit4:junit4]    >   <lst>
[junit4:junit4]    >     <str name="name">_version_</str>
[junit4:junit4]    >     <str name="type">long</str>
[junit4:junit4]    >     <bool name="indexed">true</bool>
[junit4:junit4]    >     <bool name="stored">true</bool>
[junit4:junit4]    >   </lst>
[junit4:junit4]    >   <lst>
[junit4:junit4]    >     <str name="name">test_offtv</str>
[junit4:junit4]    >     <str name="type">text</str>
[junit4:junit4]    >     <bool name="termVectors">true</bool>
[junit4:junit4]    >     <bool name="termOffsets">true</bool>
[junit4:junit4]    >   </lst>
[junit4:junit4]    >   <lst>
[junit4:junit4]    >     <str name="name">HTMLstandardtok</str>
[junit4:junit4]    >     <str name="type">HTMLstandardtok</str>
[junit4:junit4]    >     <bool name="indexed">true</bool>
[junit4:junit4]    >     <bool name="stored">true</bool>
[junit4:junit4]    >   </lst>
[junit4:junit4]    >   <lst>
[junit4:junit4]    >     <str name="name">bsto</str>
[junit4:junit4]    >     <str name="type">boolean</str>
[junit4:junit4]    >     <bool name="indexed">false</bool>
[junit4:junit4]    >     <bool name="stored">true</bool>
[junit4:junit4]    >   </lst>
[junit4:junit4]    >   <lst>
[junit4:junit4]    >     <str name="name">point</str>
[junit4:junit4]    >     <str name="type">xy</str>
[junit4:junit4]    >     <bool name="multiValued">false</bool>
[junit4:junit4]    >     <bool name="indexed">true</bool>
[junit4:junit4]    >     <bool name="stored">true</bool>
[junit4:junit4]    >   </lst>
[junit4:junit4]    >   <lst>
[junit4:junit4]    >     <str name="name">numericsubword</str>
[junit4:junit4]    >     <str name="type">numericsubword</str>
[junit4:junit4]    >     <bool name="indexed">true</bool>
[junit4:junit4]    >     <bool name="stored">true</bool>
[junit4:junit4]    >   </lst>
[junit4:junit4]    >   <lst>
[junit4:junit4]    >     <str name="name">lowerfilt</str>
[junit4:junit4]    >     <str name="type">lowerfilt</str>
[junit4:junit4]    >     <bool name="indexed">true</bool>
[junit4:junit4]    >     <bool name="stored">true</bool>
[junit4:junit4]    >   </lst>
[junit4:junit4]    >   <lst>
[junit4:junit4]    >     <str name="name">ssto</str>
[junit4:junit4]    >     <str name="type">string</str>
[junit4:junit4]    >     <bool name="indexed">false</bool>
[junit4:junit4]    >     <bool name="stored">true</bool>
[junit4:junit4]    >   </lst>
[junit4:junit4]    >   <lst>
[junit4:junit4]    >     <str name="name">test_posofftv</str>
[junit4:junit4]    >     <str name="type">text</str>
[junit4:junit4]    >     <bool name="termVectors">true</bool>
[junit4:junit4]    >     <bool name="termPositions">true</bool>
[junit4:junit4]    >     <bool name="termOffsets">true</bool>
[junit4:junit4]    >   </lst>
[junit4:junit4]    >   <lst>
[junit4:junit4]    >     <str name="name">point_hash</str>
[junit4:junit4]    >     <str name="type">geohash</str>
[junit4:junit4]    >     <bool name="multiValued">false</bool>
[junit4:junit4]    >     <bool name="indexed">true</bool>
[junit4:junit4]    >     <bool name="stored">true</bool>
[junit4:junit4]    >   </lst>
[junit4:junit4]    >   <lst>
[junit4:junit4]    >     <str name="name">stopfilt</str>
[junit4:junit4]    >     <str name="type">stopfilt</str>
[junit4:junit4]    >     <bool name="indexed">true</bool>
[junit4:junit4]    >     <bool name="stored">true</bool>
[junit4:junit4]    >   </lst>
[junit4:junit4]    >   <lst>
[junit4:junit4]    >     <str name="name">custstopfilt</str>
[junit4:junit4]    >     <str name="type">custstopfilt</str>
[junit4:junit4]    >     <bool name="indexed">true</bool>
[junit4:junit4]    >     <bool name="stored">true</bool>
[junit4:junit4]    >   </lst>
[junit4:junit4]    >   <lst>
[junit4:junit4]    >     <str name="name">HTMLwhitetok</str>
[junit4:junit4]    >     <str name="type">HTMLwhitetok</str>
[junit4:junit4]    >     <bool name="indexed">true</bool>
[junit4:junit4]    >     <bool name="stored">true</bool>
[junit4:junit4]    >   </lst>
[junit4:junit4]    >   <lst>
[junit4:junit4]    >     <str name="name">text_np</str>
[junit4:junit4]    >     <str name="type">text_np</str>
[junit4:junit4]    >     <bool name="indexed">true</bool>
[junit4:junit4]    >     <bool name="stored">false</bool>
[junit4:junit4]    >   </lst>
[junit4:junit4]    >   <lst>
[junit4:junit4]    >     <str name="name">shouldbeunstored</str>
[junit4:junit4]    >     <str name="type">unstored</str>
[junit4:junit4]    >   </lst>
[junit4:junit4]    >   <lst>
[junit4:junit4]    >     <str name="name">text</str>
[junit4:junit4]    >     <str name="type">text</str>
[junit4:junit4]    >     <bool name="multiValued">true</bool>
[junit4:junit4]    >     <bool name="indexed">true</bool>
[junit4:junit4]    >     <bool name="stored">false</bool>
[junit4:junit4]    >   </lst>
[junit4:junit4]    >   <lst>
[junit4:junit4]    >     <str name="name">wdf_preserve</str>
[junit4:junit4]    >     <str name="type">wdf_preserve</str>
[junit4:junit4]    >     <bool name="indexed">true</bool>
[junit4:junit4]    >     <bool name="stored">true</bool>
[junit4:junit4]    >   </lst>
[junit4:junit4]    >   <lst>
[junit4:junit4]    >     <str name="name">store</str>
[junit4:junit4]    >     <str name="type">location</str>
[junit4:junit4]    >     <bool name="indexed">true</bool>
[junit4:junit4]    >     <bool name="stored">true</bool>
[junit4:junit4]    >   </lst>
[junit4:junit4]    >   <lst>
[junit4:junit4]    >     <str name="name">signatureField</str>
[junit4:junit4]    >     <str name="type">string</str>
[junit4:junit4]    >     <bool name="indexed">true</bool>
[junit4:junit4]    >     <bool name="stored">false</bool>
[junit4:junit4]    >   </lst>
[junit4:junit4]    >   <lst>
[junit4:junit4]    >     <str name="name">bindsto</str>
[junit4:junit4]    >     <str name="type">boolean</str>
[junit4:junit4]    >     <bool name="indexed">true</bool>
[junit4:junit4]    >     <bool name="stored">true</bool>
[junit4:junit4]    >   </lst>
[junit4:junit4]    >   <lst>
[junit4:junit4]    >     <str name="name">subject</str>
[junit4:junit4]    >     <str name="type">text</str>
[junit4:junit4]    >     <bool name="indexed">true</bool>
[junit4:junit4]    >     <bool name="stored">true</bool>
[junit4:junit4]    >   </lst>
[junit4:junit4]    >   <lst>
[junit4:junit4]    >     <str name="name">sindsto</str>
[junit4:junit4]    >     <str name="type">string</str>
[junit4:junit4]    >     <bool name="indexed">true</bool>
[junit4:junit4]    >     <bool name="stored">true</bool>
[junit4:junit4]    >   </lst>
[junit4:junit4]    >   <lst>
[junit4:junit4]    >     <str name="name">lettertok</str>
[junit4:junit4]    >     <str name="type">lettertok</str>
[junit4:junit4]    >     <bool name="indexed">true</bool>
[junit4:junit4]    >     <bool name="stored">true</bool>
[junit4:junit4]    >   </lst>
[junit4:junit4]    >   <lst>
[junit4:junit4]    >     <str name="name">uuid</str>
[junit4:junit4]    >     <str name="type">uuid</str>
[junit4:junit4]    >     <bool name="stored">true</bool>
[junit4:junit4]    >   </lst>
[junit4:junit4]    >   <lst>
[junit4:junit4]    >     <str name="name">nullfirst</str>
[junit4:junit4]    >     <str name="type">string</str>
[junit4:junit4]    >     <bool name="sortMissingFirst">true</bool>
[junit4:junit4]    >     <bool name="indexed">true</bool>
[junit4:junit4]    >     <bool name="stored">true</bool>
[junit4:junit4]    >   </lst>
[junit4:junit4]    >   <lst>
[junit4:junit4]    >     <str name="name">subword</str>
[junit4:junit4]    >     <str name="type">subword</str>
[junit4:junit4]    >     <bool name="indexed">true</bool>
[junit4:junit4]    >     <bool name="stored">true</bool>
[junit4:junit4]    >   </lst>
[junit4:junit4]    >   <lst>
[junit4:junit4]    >     <str name="name">test_postv</str>
[junit4:junit4]    >     <str name="type">text</str>
[junit4:junit4]    >     <bool name="termVectors">true</bool>
[junit4:junit4]    >     <bool name="termPositions">true</bool>
[junit4:junit4]    >   </lst>
[junit4:junit4]    >   <lst>
[junit4:junit4]    >     <str name="name">timestamp</str>
[junit4:junit4]    >     <str name="type">date</str>
[junit4:junit4]    >     <bool name="indexed">true</bool>
[junit4:junit4]    >     <bool name="stored">true</bool>
[junit4:junit4]    >   </lst>
[junit4:junit4]    >   <lst>
[junit4:junit4]    >     <str name="name">sku2</str>
[junit4:junit4]    >     <str name="type">skutype2</str>
[junit4:junit4]    >     <bool name="indexed">true</bool>
[junit4:junit4]    >     <bool name="stored">true</bool>
[junit4:junit4]    >   </lst>
[junit4:junit4]    >   <lst>
[junit4:junit4]    >     <str name="name">standardfilt</str>
[junit4:junit4]    >     <str name="type">standardfilt</str>
[junit4:junit4]    >     <bool name="indexed">true</bool>
[junit4:junit4]    >     <bool name="stored">true</bool>
[junit4:junit4]    >   </lst>
[junit4:junit4]    >   <lst>
[junit4:junit4]    >     <str name="name">copyfield_source</str>
[junit4:junit4]    >     <str name="type">string</str>
[junit4:junit4]    >     <bool name="multiValued">true</bool>
[junit4:junit4]    >     <bool name="indexed">true</bool>
[junit4:junit4]    >     <bool name="stored">true</bool>
[junit4:junit4]    >   </lst>
[junit4:junit4]    >   <lst>
[junit4:junit4]    >     <str name="name">id</str>
[junit4:junit4]    >     <str name="type">string</str>
[junit4:junit4]    >     <bool name="multiValued">false</bool>
[junit4:junit4]    >     <bool name="indexed">true</bool>
[junit4:junit4]    >     <bool name="stored">true</bool>
[junit4:junit4]    >     <bool name="required">true</bool>
[junit4:junit4]    >     <bool name="uniqueKey">true</bool>
[junit4:junit4]    >   </lst>
[junit4:junit4]    >   <lst>
[junit4:junit4]    >     <str name="name">name</str>
[junit4:junit4]    >     <str name="type">nametext</str>
[junit4:junit4]    >     <bool name="indexed">true</bool>
[junit4:junit4]    >     <bool name="stored">true</bool>
[junit4:junit4]    >   </lst>
[junit4:junit4]    >   <lst>
[junit4:junit4]    >     <str name="name">shouldbeunindexed</str>
[junit4:junit4]    >     <str name="type">unstored</str>
[junit4:junit4]    >     <bool name="indexed">false</bool>
[junit4:junit4]    >     <bool name="stored">true</bool>
[junit4:junit4]    >   </lst>
[junit4:junit4]    >   <lst>
[junit4:junit4]    >     <str name="name">protectedsubword</str>
[junit4:junit4]    >     <str name="type">protectedsubword</str>
[junit4:junit4]    >     <bool name="indexed">true</bool>
[junit4:junit4]    >     <bool name="stored">true</bool>
[junit4:junit4]    >   </lst>
[junit4:junit4]    > </arr>
[junit4:junit4]    > </response>
[junit4:junit4]    > 
[junit4:junit4]    > 	request was:/schema/fields?indent=on&wt=xml
[junit4:junit4]    > 	at org.apache.solr.util.RestTestBase.assertQ(RestTestBase.java:136)
[junit4:junit4]    > 	... 41 more
[junit4:junit4]   2> 6400 T13 oas.SolrTestCaseJ4.setUp ###Starting testJsonGetTwoFields
[junit4:junit4]   2> 6408 T21 C0 oasr.BaseSchemaResource.handlePostExecution [collection1] webapp=/solr path=/schema/fields params={wt=json&fl=id,_version_&indent=on} status=0 QTime=5 
[junit4:junit4]   2> 6410 T21 C0 orel.LogFilter.afterHandle 2013-03-07	03:47:25	127.0.0.1	-	127.0.0.1	47646	GET	/solr/schema/fields	fl=id,_version_&indent=on&wt=json	200	-	0	2	https://127.0.0.1:47646	Java/1.8.0-ea	-
[junit4:junit4]   2> 6421 T13 oas.SolrTestCaseJ4.tearDown ###Ending testJsonGetTwoFields
[junit4:junit4]   2> 6437 T13 oas.SolrTestCaseJ4.setUp ###Starting testJsonGetAllFields
[junit4:junit4]   2> 6441 T23 C0 oasr.BaseSchemaResource.handlePostExecution [collection1] webapp=/solr path=/schema/fields params={wt=json&indent=on} status=0 QTime=2 
[junit4:junit4]   2> 6442 T23 C0 orel.LogFilter.afterHandle 2013-03-07	03:47:25	127.0.0.1	-	127.0.0.1	47646	GET	/solr/schema/fields	indent=on&wt=json	200	-	0	2	https://127.0.0.1:47646	Java/1.8.0-ea	-
[junit4:junit4]   2> 6458 T13 oasu.RestTestBase.assertJQ SEVERE query failed JSON validation. error=mismatch: 'custstopfilt'!='patternreplacefilt' @ fields/[0]/name
[junit4:junit4]   2> 	 expected =/fields/[0]/name=="custstopfilt"
[junit4:junit4]   2> 	 response = {
[junit4:junit4]   2> 	  "responseHeader":{
[junit4:junit4]   2> 	    "status":0,
[junit4:junit4]   2> 	    "QTime":2},
[junit4:junit4]   2> 	  "fields":[{
[junit4:junit4]   2> 	      "name":"patternreplacefilt",
[junit4:junit4]   2> 	      "type":"patternreplacefilt",
[junit4:junit4]   2> 	      "indexed":true,
[junit4:junit4]   2> 	      "stored":true},
[junit4:junit4]   2> 	    {
[junit4:junit4]   2> 	      "name":"bday",
[junit4:junit4]   2> 	      "type":"date",
[junit4:junit4]   2> 	      "indexed":true,
[junit4:junit4]   2> 	      "stored":true},
[junit4:junit4]   2> 	    {
[junit4:junit4]   2> 	      "name":"test_notv",
[junit4:junit4]   2> 	      "type":"text",
[junit4:junit4]   2> 	      "termVectors":false},
[junit4:junit4]   2> 	    {
[junit4:junit4]   2> 	      "name":"standardtokfilt",
[junit4:junit4]   2> 	      "type":"standardtokfilt",
[junit4:junit4]   2> 	      "indexed":true,
[junit4:junit4]   2> 	      "stored":true},
[junit4:junit4]   2> 	    {
[junit4:junit4]   2> 	      "name":"nouniq",
[junit4:junit4]   2> 	      "type":"string",
[junit4:junit4]   2> 	      "multiValued":true,
[junit4:junit4]   2> 	      "indexed":true,
[junit4:junit4]   2> 	      "stored":true},
[junit4:junit4]   2> 	    {
[junit4:junit4]   2> 	      "name":"title_stemmed",
[junit4:junit4]   2> 	      "type":"text",
[junit4:junit4]   2> 	      "indexed":true,
[junit4:junit4]   2> 	      "stored":false},
[junit4:junit4]   2> 	    {
[junit4:junit4]   2> 	      "name":"whitetok",
[junit4:junit4]   2> 	      "type":"whitetok",
[junit4:junit4]   2> 	      "indexed":true,
[junit4:junit4]   2> 	      "stored":true},
[junit4:junit4]   2> 	    {
[junit4:junit4]   2> 	      "name":"weight",
[junit4:junit4]   2> 	      "type":"float",
[junit4:junit4]   2> 	      "indexed":true,
[junit4:junit4]   2> 	      "stored":true},
[junit4:junit4]   2> 	    {
[junit4:junit4]   2> 	      "name":"numberpartfail",
[junit4:junit4]   2> 	      "type":"failtype1",
[junit4:junit4]   2> 	      "indexed":true,
[junit4:junit4]   2> 	      "stored":true},
[junit4:junit4]   2> 	    {
[junit4:junit4]   2> 	      "name":"sind",
[junit4:junit4]   2> 	      "type":"string",
[junit4:junit4]   2> 	      "indexed":true,
[junit4:junit4]   2> 	      "stored":false},
[junit4:junit4]   2> 	    {
[junit4:junit4]   2> 	      "name":"lowertok",
[junit4:junit4]   2> 	      "type":"lowertok",
[junit4:junit4]   2> 	      "indexed":true,
[junit4:junit4]   2> 	      "stored":true},
[junit4:junit4]   2> 	    {
[junit4:junit4]   2> 	      "name":"standardtok",
[junit4:junit4]   2> 	      "type":"standardtok",
[junit4:junit4]   2> 	      "indexed":true,
[junit4:junit4]   2> 	      "stored":true},
[junit4:junit4]   2> 	    {
[junit4:junit4]   2> 	      "name":"test_hlt",
[junit4:junit4]   2> 	      "type":"highlittext",
[junit4:junit4]   2> 	      "indexed":true,
[junit4:junit4]   2> 	      "compressed":true},
[junit4:junit4]   2> 	    {
[junit4:junit4]   2> 	      "name":"keywordtok",
[junit4:junit4]   2> 	      "type":"keywordtok",
[junit4:junit4]   2> 	      "indexed":true,
[junit4:junit4]   2> 	      "stored":true},
[junit4:junit4]   2> 	    {
[junit4:junit4]   2> 	      "name":"uniq3",
[junit4:junit4]   2> 	      "type":"string",
[junit4:junit4]   2> 	      "indexed":true,
[junit4:junit4]   2> 	      "stored":true},
[junit4:junit4]   2> 	    {
[junit4:junit4]   2> 	      "name":"bind",
[junit4:junit4]   2> 	      "type":"boolean",
[junit4:junit4]   2> 	      "indexed":true,
[junit4:junit4]   2> 	      "stored":false},
[junit4:junit4]   2> 	    {
[junit4:junit4]   2> 	      "name":"teststop",
[junit4:junit4]   2> 	      "type":"teststop",
[junit4:junit4]   2> 	      "indexed":true,
[junit4:junit4]   2> 	      "stored":true},
[junit4:junit4]   2> 	    {
[junit4:junit4]   2> 	      "name":"uniq",
[junit4:junit4]   2> 	      "type":"string",
[junit4:junit4]   2> 	      "multiValued":true,
[junit4:junit4]   2> 	      "indexed":true,
[junit4:junit4]   2> 	      "stored":true},
[junit4:junit4]   2> 	    {
[junit4:junit4]   2> 	      "name":"textgap",
[junit4:junit4]   2> 	      "type":"textgap",
[junit4:junit4]   2> 	      "indexed":true,
[junit4:junit4]   2> 	      "stored":true},
[junit4:junit4]   2> 	    {
[junit4:junit4]   2> 	      "name":"test_basictv",
[junit4:junit4]   2> 	      "type":"text",
[junit4:junit4]   2> 	      "termVectors":true},
[junit4:junit4]   2> 	    {
[junit4:junit4]   2> 	      "name":"uniq2",
[junit4:junit4]   2> 	      "type":"string",
[junit4:junit4]   2> 	      "multiValued":true,
[junit4:junit4]   2> 	      "indexed":true,
[junit4:junit4]   2> 	      "stored":true},
[junit4:junit4]   2> 	    {
[junit4:junit4]   2> 	      "name":"iind",
[junit4:junit4]   2> 	      "type":"int",
[junit4:junit4]   2> 	      "indexed":true,
[junit4:junit4]   2> 	      "stored":false},
[junit4:junit4]   2> 	    {
[junit4:junit4]   2> 	      "name":"title_lettertok",
[junit4:junit4]   2> 	      "type":"lettertok",
[junit4:junit4]   2> 	      "indexed":true,
[junit4:junit4]   2> 	      "stored":false},
[junit4:junit4]   2> 	    {
[junit4:junit4]   2> 	      "name":"isto",
[junit4:junit4]   2> 	      "type":"int",
[junit4:junit4]   2> 	      "indexed":false,
[junit4:junit4]   2> 	      "stored":true},
[junit4:junit4]   2> 	    {
[junit4:junit4]   2> 	      "name":"test_hlt_off",
[junit4:junit4]   2> 	      "type":"highlittext",
[junit4:junit4]   2> 	      "indexed":true,
[junit4:junit4]   2> 	      "compressed":false},
[junit4:junit4]   2> 	    {
[junit4:junit4]   2> 	      "name":"sku1",
[junit4:junit4]   2> 	      "type":"skutype1",
[junit4:junit4]   2> 	      "indexed":true,
[junit4:junit4]   2> 	      "stored":true},
[junit4:junit4]   2> 	    {
[junit4:junit4]   2> 	      "name":"custengporterfilt",
[junit4:junit4]   2> 	      "type":"custengporterfilt",
[junit4:junit4]   2> 	      "indexed":true,
[junit4:junit4]   2> 	      "stored":true},
[junit4:junit4]   2> 	    {
[junit4:junit4]   2> 	      "name":"wdf_nocase",
[junit4:junit4]   2> 	      "type":"wdf_nocase",
[junit4:junit4]   2> 	      "indexed":true,
[junit4:junit4]   2> 	      "stored":true},
[junit4:junit4]   2> 	    {
[junit4:junit4]   2> 	      "name":"dedup",
[junit4:junit4]   2> 	      "type":"dedup",
[junit4:junit4]   2> 	      "indexed":true,
[junit4:junit4]   2> 	      "stored":true},
[junit4:junit4]   2> 	    {
[junit4:junit4]   2> 	      "name":"title",
[junit4:junit4]   2> 	      "type":"nametext",
[junit4:junit4]   2> 	      "indexed":true,
[junit4:junit4]   2> 	      "stored":true},
[junit4:junit4]   2> 	    {
[junit4:junit4]   2> 	      "name":"syn",
[junit4:junit4]   2> 	      "type":"syn",
[junit4:junit4]   2> 	      "indexed":true,
[junit4:junit4]   2> 	      "stored":true},
[junit4:junit4]   2> 	    {
[junit4:junit4]   2> 	      "name":"lengthfilt",
[junit4:junit4]   2> 	      "type":"lengthfilt",
[junit4:junit4]   2> 	      "indexed":true,
[junit4:junit4]   2> 	      "stored":true},
[junit4:junit4]   2> 	    {
[junit4:junit4]   2> 	      "name":"pointD",
[junit4:junit4]   2> 	      "type":"xyd",
[junit4:junit4]   2> 	      "multiValued":false,
[junit4:junit4]   2> 	      "indexed":true,
[junit4:junit4]   2> 	      "stored":true},
[junit4:junit4]   2> 	    {
[junit4:junit4]   2> 	      "name":"engporterfilt",
[junit4:junit4]   2> 	      "type":"engporterfilt",
[junit4:junit4]   2> 	      "indexed":true,
[junit4:junit4]   2> 	      "stored":true},
[junit4:junit4]   2> 	    {
[junit4:junit4]   2> 	      "name":"porterfilt",
[junit4:junit4]   2> 	      "type":"porterfilt",
[junit4:junit4]   2> 	      "indexed":true,
[junit4:junit4]   2> 	      "stored":true},
[junit4:junit4]   2> 	    {
[junit4:junit4]   2> 	      "name":"shouldbestored",
[junit4:junit4]   2> 	      "type":"unstored",
[junit4:junit4]   2> 	      "stored":true},
[junit4:junit4]   2> 	    {
[junit4:junit4]   2> 	      "name":"_version_",
[junit4:junit4]   2> 	      "type":"long",
[junit4:junit4]   2> 	      "indexed":true,
[junit4:junit4]   2> 	      "stored":true},
[junit4:junit4]   2> 	    {
[junit4:junit4]   2> 	      "name":"test_offtv",
[junit4:junit4]   2> 	      "type":"text",
[junit4:junit4]   2> 	      "termVectors":true,
[junit4:junit4]   2> 	      "termOffsets":true},
[junit4:junit4]   2> 	    {
[junit4:junit4]   2> 	      "name":"HTMLstandardtok",
[junit4:junit4]   2> 	      "type":"HTMLstandardtok",
[junit4:junit4]   2> 	      "indexed":true,
[junit4:junit4]   2> 	      "stored":true},
[junit4:junit4]   2> 	    {
[junit4:junit4]   2> 	      "name":"bsto",
[junit4:junit4]   2> 	      "type":"boolean",
[junit4:junit4]   2> 	      "indexed":false,
[junit4:junit4]   2> 	      "stored":true},
[junit4:junit4]   2> 	    {
[junit4:junit4]   2> 	      "name":"point",
[junit4:junit4]   2> 	      "type":"xy",
[junit4:junit4]   2> 	      "multiValued":false,
[junit4:junit4]   2> 	      "indexed":true,
[junit4:junit4]   2> 	      "stored":true},
[junit4:junit4]   2> 	    {
[junit4:junit4]   2> 	      "name":"numericsubword",
[junit4:junit4]   2> 	      "type":"numericsubword",
[junit4:junit4]   2> 	      "indexed":true,
[junit4:junit4]   2> 	      "stored":true},
[junit4:junit4]   2> 	    {
[junit4:junit4]   2> 	      "name":"lowerfilt",
[junit4:junit4]   2> 	      "type":"lowerfilt",
[junit4:junit4]   2> 	      "indexed":true,
[junit4:junit4]   2> 	      "stored":true},
[junit4:junit4]   2> 	    {
[junit4:junit4]   2> 	      "name":"ssto",
[junit4:junit4]   2> 	      "type":"string",
[junit4:junit4]   2> 	      "indexed":false,
[junit4:junit4]   2> 	      "stored":true},
[junit4:junit4]   2> 	    {
[junit4:junit4]   2> 	      "name":"test_posofftv",
[junit4:junit4]   2> 	      "type":"text",
[junit4:junit4]   2> 	      "termVectors":true,
[junit4:junit4]   2> 	      "termPositions":true,
[junit4:junit4]   2> 	      "termOffsets":true},
[junit4:junit4]   2> 	    {
[junit4:junit4]   2> 	      "name":"point_hash",
[junit4:junit4]   2> 	      "type":"geohash",
[junit4:junit4]   2> 	      "multiValued":false,
[junit4:junit4]   2> 	      "indexed":true,
[junit4:junit4]   2> 	      "stored":true},
[junit4:junit4]   2> 	    {
[junit4:junit4]   2> 	      "name":"stopfilt",
[junit4:junit4]   2> 	      "type":"stopfilt",
[junit4:junit4]   2> 	      "indexed":true,
[junit4:junit4]   2> 	      "stored":true},
[junit4:junit4]   2> 	    {
[junit4:junit4]   2> 	      "name":"custstopfilt",
[junit4:junit4]   2> 	      "type":"custstopfilt",
[junit4:junit4]   2> 	      "indexed":true,
[junit4:junit4]   2> 	      "stored":true},
[junit4:junit4]   2> 	    {
[junit4:junit4]   2> 	      "name":"HTMLwhitetok",
[junit4:junit4]   2> 	      "type":"HTMLwhitetok",
[junit4:junit4]   2> 	      "indexed":true,
[junit4:junit4]   2> 	      "stored":true},
[junit4:junit4]   2> 	    {
[junit4:junit4]   2> 	      "name":"text_np",
[junit4:junit4]   2> 	      "type":"text_np",
[junit4:junit4]   2> 	      "indexed":true,
[junit4:junit4]   2> 	      "stored":false},
[junit4:junit4]   2> 	    {
[junit4:junit4]   2> 	      "name":"shouldbeunstored",
[junit4:junit4]   2> 	      "type":"unstored"},
[junit4:junit4]   2> 	    {
[junit4:junit4]   2> 	      "name":"text",
[junit4:junit4]   2> 	      "type":"text",
[junit4:junit4]   2> 	      "multiValued":true,
[junit4:junit4]   2> 	      "indexed":true,
[junit4:junit4]   2> 	      "stored":false},
[junit4:junit4]   2> 	    {
[junit4:junit4]   2> 	      "name":"wdf_preserve",
[junit4:junit4]   2> 	      "type":"wdf_preserve",
[junit4:junit4]   2> 	      "indexed":true,
[junit4:junit4]   2> 	      "stored":true},
[junit4:junit4]   2> 	    {
[junit4:junit4]   2> 	      "name":"store",
[junit4:junit4]   2> 	      "type":"location",
[junit4:junit4]   2> 	      "indexed":true,
[junit4:junit4]   2> 	      "stored":true},
[junit4:junit4]   2> 	    {
[junit4:junit4]   2> 	      "name":"signatureField",
[junit4:junit4]   2> 	      "type":"string",
[junit4:junit4]   2> 	      "indexed":true,
[junit4:junit4]   2> 	      "stored":false},
[junit4:junit4]   2> 	    {
[junit4:junit4]   2> 	      "name":"bindsto",
[junit4:junit4]   2> 	      "type":"boolean",
[junit4:junit4]   2> 	      "indexed":true,
[junit4:junit4]   2> 	      "stored":true},
[junit4:junit4]   2> 	    {
[junit4:junit4]   2> 	      "name":"subject",
[junit4:junit4]   2> 	      "type":"text",
[junit4:junit4]   2> 	      "indexed":true,
[junit4:junit4]   2> 	      "stored":true},
[junit4:junit4]   2> 	    {
[junit4:junit4]   2> 	      "name":"sindsto",
[junit4:junit4]   2> 	      "type":"string",
[junit4:junit4]   2> 	      "indexed":true,
[junit4:junit4]   2> 	      "stored":true},
[junit4:junit4]   2> 	    {
[junit4:junit4]   2> 	      "name":"lettertok",
[junit4:junit4]   2> 	      "type":"lettertok",
[junit4:junit4]   2> 	      "indexed":true,
[junit4:junit4]   2> 	      "stored":true},
[junit4:junit4]   2> 	    {
[junit4:junit4]   2> 	      "name":"uuid",
[junit4:junit4]   2> 	      "type":"uuid",
[junit4:junit4]   2> 	      "stored":true},
[junit4:junit4]   2> 	    {
[junit4:junit4]   2> 	      "name":"nullfirst",
[junit4:junit4]   2> 	      "type":"string",
[junit4:junit4]   2> 	      "sortMissingFirst":true,
[junit4:junit4]   2> 	      "indexed":true,
[junit4:junit4]   2> 	      "stored":true},
[junit4:junit4]   2> 	    {
[junit4:junit4]   2> 	      "name":"subword",
[junit4:junit4]   2> 	      "type":"subword",
[junit4:junit4]   2> 	      "indexed":true,
[junit4:junit4]   2> 	      "stored":true},
[junit4:junit4]   2> 	    {
[junit4:junit4]   2> 	      "name":"test_postv",
[junit4:junit4]   2> 	      "type":"text",
[junit4:junit4]   2> 	      "termVectors":true,
[junit4:junit4]   2> 	      "termPositions":true},
[junit4:junit4]   2> 	    {
[junit4:junit4]   2> 	      "name":"timestamp",
[junit4:junit4]   2> 	      "type":"date",
[junit4:junit4]   2> 	      "indexed":true,
[junit4:junit4]   2> 	      "stored":true},
[junit4:junit4]   2> 	    {
[junit4:junit4]   2> 	      "name":"sku2",
[junit4:junit4]   2> 	      "type":"skutype2",
[junit4:junit4]   2> 	      "indexed":true,
[junit4:junit4]   2> 	      "stored":true},
[junit4:junit4]   2> 	    {
[junit4:junit4]   2> 	      "name":"standardfilt",
[junit4:junit4]   2> 	      "type":"standardfilt",
[junit4:junit4]   2> 	      "indexed":true,
[junit4:junit4]   2> 	      "stored":true},
[junit4:junit4]   2> 	    {
[junit4:junit4]   2> 	      "name":"copyfield_source",
[junit4:junit4]   2> 	      "type":"string",
[junit4:junit4]   2> 	      "multiValued":true,
[junit4:junit4]   2> 	      "indexed":true,
[junit4:junit4]   2> 	      "stored":true},
[junit4:junit4]   2> 	    {
[junit4:junit4]   2> 	      "name":"id",
[junit4:junit4]   2> 	      "type":"string",
[junit4:junit4]   2> 	      "multiValued":false,
[junit4:junit4]   2> 	      "indexed":true,
[junit4:junit4]   2> 	      "stored":true,
[junit4:junit4]   2> 	      "required":true,
[junit4:junit4]   2> 	      "uniqueKey":true},
[junit4:junit4]   2> 	    {
[junit4:junit4]   2> 	      "name":"name",
[junit4:junit4]   2> 	      "type":"nametext",
[junit4:junit4]   2> 	      "indexed":true,
[junit4:junit4]   2> 	      "stored":true},
[junit4:junit4]   2> 	    {
[junit4:junit4]   2> 	      "name":"shouldbeunindexed",
[junit4:junit4]   2> 	      "type":"unstored",
[junit4:junit4]   2> 	      "indexed":false,
[junit4:junit4]   2> 	      "stored":true},
[junit4:junit4]   2> 	    {
[junit4:junit4]   2> 	      "name":"protectedsubword",
[junit4:junit4]   2> 	      "type":"protectedsubword",
[junit4:junit4]   2> 	      "indexed":true,
[junit4:junit4]   2> 	      "stored":true}]}
[junit4:junit4]   2> 	
[junit4:junit4]   2> 	 request = /schema/fields?indent=on&wt=json
[junit4:junit4]   2> 	
[junit4:junit4]   2> 6461 T13 oas.SolrTestCaseJ4.tearDown ###Ending testJsonGetAllFields
[junit4:junit4]   2> NOTE: reproduce with: ant test  -Dtestcase=TestFieldCollectionResource -Dtests.method=testJsonGetAllFields -Dtests.seed=E8D2B859D380A4D3 -Dtests.multiplier=3 -Dtests.slow=true -Dtests.locale=fr_LU -Dtests.timezone=America/Pangnirtung -Dtests.file.encoding=UTF-8
[junit4:junit4] ERROR   0.04s J0 | TestFieldCollectionResource.testJsonGetAllFields <<<
[junit4:junit4]    > Throwable #1: java.lang.RuntimeException: mismatch: 'custstopfilt'!='patternreplacefilt' @ fields/[0]/name
[junit4:junit4]    > 	at __randomizedtesting.SeedInfo.seed([E8D2B859D380A4D3:61D2CAD57333E8F5]:0)
[junit4:junit4]    > 	at org.apache.solr.util.RestTestBase.assertJQ(RestTestBase.java:242)
[junit4:junit4]    > 	at org.apache.solr.util.RestTestBase.assertJQ(RestTestBase.java:186)
[junit4:junit4]    > 	at org.apache.solr.rest.TestFieldCollectionResource.testJsonGetAllFields(TestFieldCollectionResource.java:50)
[junit4:junit4]    > 	at sun.reflect.NativeMethodAccessorImpl.invoke0(Native Method)
[junit4:junit4]    > 	at sun.reflect.NativeMethodAccessorImpl.invoke(NativeMethodAccessorImpl.java:57)
[junit4:junit4]    > 	at sun.reflect.DelegatingMethodAccessorImpl.invoke(DelegatingMethodAccessorImpl.java:43)
[junit4:junit4]    > 	at java.lang.reflect.Method.invoke(Method.java:487)
[junit4:junit4]    > 	at com.carrotsearch.randomizedtesting.RandomizedRunner.invoke(RandomizedRunner.java:1559)
[junit4:junit4]    > 	at com.carrotsearch.randomizedtesting.RandomizedRunner.access$600(RandomizedRunner.java:79)
[junit4:junit4]    > 	at com.carrotsearch.randomizedtesting.RandomizedRunner$6.evaluate(RandomizedRunner.java:737)
[junit4:junit4]    > 	at com.carrotsearch.randomizedtesting.RandomizedRunner$7.evaluate(RandomizedRunner.java:773)
[junit4:junit4]    > 	at com.carrotsearch.randomizedtesting.RandomizedRunner$8.evaluate(RandomizedRunner.java:787)
[junit4:junit4]    > 	at com.carrotsearch.randomizedtesting.rules.SystemPropertiesRestoreRule$1.evaluate(SystemPropertiesRestoreRule.java:53)
[junit4:junit4]    > 	at org.apache.lucene.util.TestRuleSetupTeardownChained$1.evaluate(TestRuleSetupTeardownChained.java:50)
[junit4:junit4]    > 	at org.apache.lucene.util.TestRuleFieldCacheSanity$1.evaluate(TestRuleFieldCacheSanity.java:51)
[junit4:junit4]    > 	at org.apache.lucene.util.AbstractBeforeAfterRule$1.evaluate(AbstractBeforeAfterRule.java:46)
[junit4:junit4]    > 	at com.carrotsearch.randomizedtesting.rules.SystemPropertiesInvariantRule$1.evaluate(SystemPropertiesInvariantRule.java:55)
[junit4:junit4]    > 	at org.apache.lucene.util.TestRuleThreadAndTestName$1.evaluate(TestRuleThreadAndTestName.java:49)
[junit4:junit4]    > 	at org.apache.lucene.util.TestRuleIgnoreAfterMaxFailures$1.evaluate(TestRuleIgnoreAfterMaxFailures.java:70)
[junit4:junit4]    > 	at org.apache.lucene.util.TestRuleMarkFailure$1.evaluate(TestRuleMarkFailure.java:48)
[junit4:junit4]    > 	at com.carrotsearch.randomizedtesting.rules.StatementAdapter.evaluate(StatementAdapter.java:36)
[junit4:junit4]    > 	at com.carrotsearch.randomizedtesting.ThreadLeakControl$StatementRunner.run(ThreadLeakControl.java:358)
[junit4:junit4]    > 	at com.carrotsearch.randomizedtesting.ThreadLeakControl.forkTimeoutingTask(ThreadLeakControl.java:782)
[junit4:junit4]    > 	at com.carrotsearch.randomizedtesting.ThreadLeakControl$3.evaluate(ThreadLeakControl.java:442)
[junit4:junit4]    > 	at com.carrotsearch.randomizedtesting.RandomizedRunner.runSingleTest(RandomizedRunner.java:746)
[junit4:junit4]    > 	at com.carrotsearch.randomizedtesting.RandomizedRunner$3.evaluate(RandomizedRunner.java:648)
[junit4:junit4]    > 	at com.carrotsearch.randomizedtesting.RandomizedRunner$4.evaluate(RandomizedRunner.java:682)
[junit4:junit4]    > 	at com.carrotsearch.randomizedtesting.RandomizedRunner$5.evaluate(RandomizedRunner.java:693)
[junit4:junit4]    > 	at com.carrotsearch.randomizedtesting.rules.StatementAdapter.evaluate(StatementAdapter.java:36)
[junit4:junit4]    > 	at com.carrotsearch.randomizedtesting.rules.SystemPropertiesRestoreRule$1.evaluate(SystemPropertiesRestoreRule.java:53)
[junit4:junit4]    > 	at org.apache.lucene.util.AbstractBeforeAfterRule$1.evaluate(AbstractBeforeAfterRule.java:46)
[junit4:junit4]    > 	at org.apache.lucene.util.TestRuleStoreClassName$1.evaluate(TestRuleStoreClassName.java:42)
[junit4:junit4]    > 	at com.carrotsearch.randomizedtesting.rules.SystemPropertiesInvariantRule$1.evaluate(SystemPropertiesInvariantRule.java:55)
[junit4:junit4]    > 	at com.carrotsearch.randomizedtesting.rules.NoShadowingOrOverridesOnMethodsRule$1.evaluate(NoShadowingOrOverridesOnMethodsRule.java:39)
[junit4:junit4]    > 	at com.carrotsearch.randomizedtesting.rules.NoShadowingOrOverridesOnMethodsRule$1.evaluate(NoShadowingOrOverridesOnMethodsRule.java:39)
[junit4:junit4]    > 	at com.carrotsearch.randomizedtesting.rules.StatementAdapter.evaluate(StatementAdapter.java:36)
[junit4:junit4]    > 	at org.apache.lucene.util.TestRuleAssertionsRequired$1.evaluate(TestRuleAssertionsRequired.java:43)
[junit4:junit4]    > 	at org.apache.lucene.util.TestRuleMarkFailure$1.evaluate(TestRuleMarkFailure.java:48)
[junit4:junit4]    > 	at org.apache.lucene.util.TestRuleIgnoreAfterMaxFailures$1.evaluate(TestRuleIgnoreAfterMaxFailures.java:70)
[junit4:junit4]    > 	at org.apache.lucene.util.TestRuleIgnoreTestSuites$1.evaluate(TestRuleIgnoreTestSuites.java:55)
[junit4:junit4]    > 	at com.carrotsearch.randomizedtesting.rules.StatementAdapter.evaluate(StatementAdapter.java:36)
[junit4:junit4]    > 	at com.carrotsearch.randomizedtesting.ThreadLeakControl$StatementRunner.run(ThreadLeakControl.java:358)
[junit4:junit4]    > 	at java.lang.Thread.run(Thread.java:722)
[junit4:junit4]   2> 6478 T13 oas.SolrTestCaseJ4.setUp ###Starting testGetTwoFields
[junit4:junit4]   2> 6481 T22 C0 oasr.BaseSchemaResource.handlePostExecution [collection1] webapp=/solr path=/schema/fields params={fl=id,_version_&wt=xml&indent=on} status=0 QTime=1 
[junit4:junit4]   2> 6482 T22 C0 orel.LogFilter.afterHandle 2013-03-07	03:47:25	127.0.0.1	-	127.0.0.1	47646	GET	/solr/schema/fields	indent=on&wt=xml&fl=id,_version_	200	-	0	2	https://127.0.0.1:47646	Java/1.8.0-ea	-
[junit4:junit4]   2> 6496 T13 oas.SolrTestCaseJ4.tearDown ###Ending testGetTwoFields
[junit4:junit4]   2> 6509 T13 oas.SolrTestCaseJ4.setUp ###Starting testNotFoundFields
[junit4:junit4]   2> 6512 T21 C0 oasr.BaseSchemaResource.handlePostExecution [collection1] webapp=/solr path=/schema/fields params={fl=not_in_there,this_one_either&wt=xml&indent=on} status=0 QTime=1 
[junit4:junit4]   2> 6513 T21 C0 orel.LogFilter.afterHandle 2013-03-07	03:47:25	127.0.0.1	-	127.0.0.1	47646	GET	/solr/schema/fields	indent=on&wt=xml&fl=not_in_there,this_one_either	200	-	0	2	https://127.0.0.1:47646	Java/1.8.0-ea	-
[junit4:junit4]   2> 6518 T13 oas.SolrTestCaseJ4.tearDown ###Ending testNotFoundFields
[junit4:junit4]   2> 6581 T13 oasc.CoreContainer.shutdown Shutting down CoreContainer instance=408044458
[junit4:junit4]   2> 6582 T13 oasc.SolrCore.close [collection1]  CLOSING SolrCore org.apache.solr.core.SolrCore@6564c37b
[junit4:junit4]   2> 6626 T13 oasu.DirectUpdateHandler2.close closing DirectUpdateHandler2{commits=0,autocommits=0,soft autocommits=0,optimizes=0,rollbacks=0,expungeDeletes=0,docsPending=0,adds=0,deletesById=0,deletesByQuery=0,errors=0,cumulative_adds=0,cumulative_deletesById=0,cumulative_deletesByQuery=0,cumulative_errors=0}
[junit4:junit4]   2> 6627 T13 oasu.SolrCoreState.decrefSolrCoreState Closing SolrCoreState
[junit4:junit4]   2> 6628 T13 oasu.DefaultSolrCoreState.closeIndexWriter SolrCoreState ref count has reached 0 - closing IndexWriter
[junit4:junit4]   2> 6628 T13 oasu.DefaultSolrCoreState.closeIndexWriter closing IndexWriter with IndexWriterCloser
[junit4:junit4]   2> 6630 T13 oasc.SolrCore.closeSearcher [collection1] Closing main searcher on request.
[junit4:junit4]   2> 6631 T13 oasc.CachingDirectoryFactory.close Closing directory when closing factory: /mnt/ssd/jenkins/workspace/Lucene-Solr-4.x-Linux/solr/build/solr-core/test/J0/solrtest-TestFieldCollectionResource-1362646038756
[junit4:junit4]   2> 6631 T13 oasc.CachingDirectoryFactory.closeDirectory Closing directory: /mnt/ssd/jenkins/workspace/Lucene-Solr-4.x-Linux/solr/build/solr-core/test/J0/solrtest-TestFieldCollectionResource-1362646038756
[junit4:junit4]   2> 6632 T13 oasc.CachingDirectoryFactory.close Closing directory when closing factory: /mnt/ssd/jenkins/workspace/Lucene-Solr-4.x-Linux/solr/build/solr-core/test/J0/solrtest-TestFieldCollectionResource-1362646038756/index
[junit4:junit4]   2> 6632 T13 oasc.CachingDirectoryFactory.closeDirectory Closing directory: /mnt/ssd/jenkins/workspace/Lucene-Solr-4.x-Linux/solr/build/solr-core/test/J0/solrtest-TestFieldCollectionResource-1362646038756/index
[junit4:junit4]   2> 6655 T13 oejsh.ContextHandler.doStop stopped o.e.j.s.ServletContextHandler{/solr,null}
[junit4:junit4]   2> 6709 T13 oas.SolrTestCaseJ4.deleteCore ###deleteCore
[junit4:junit4]   2> NOTE: test params are: codec=FastCompressingStoredFields(storedFieldsFormat=CompressingStoredFieldsFormat(compressionMode=FAST, chunkSize=292), termVectorsFormat=CompressingTermVectorsFormat(compressionMode=FAST, chunkSize=292)), sim=RandomSimilarityProvider(queryNorm=true,coord=no): {}, locale=fr_LU, timezone=America/Pangnirtung
[junit4:junit4]   2> NOTE: Linux 3.2.0-38-generic amd64/Oracle Corporation 1.8.0-ea (64-bit)/cpus=8,threads=1,free=16036312,total=48234496
[junit4:junit4]   2> NOTE: All tests run in this JVM: [SystemInfoHandlerTest, TestFieldCollectionResource]
[junit4:junit4] Completed on J0 in 6.89s, 5 tests, 2 errors <<< FAILURES!

[...truncated 158 lines...]
[junit4:junit4] Suite: org.apache.solr.cloud.UnloadDistributedZkTest
[junit4:junit4]   2> 0 T1132 oas.BaseDistributedSearchTestCase.initHostContext Setting hostContext system property: /_o/bv
[junit4:junit4]   2> 4 T1132 oas.SolrTestCaseJ4.setUp ###Starting testDistribSearch
[junit4:junit4]   2> Creating dataDir: /mnt/ssd/jenkins/workspace/Lucene-Solr-4.x-Linux/solr/build/solr-core/test/J0/./solrtest-UnloadDistributedZkTest-1362646216520
[junit4:junit4]   2> 5 T1132 oasc.ZkTestServer.run STARTING ZK TEST SERVER
[junit4:junit4]   2> 5 T1133 oasc.ZkTestServer$ZKServerMain.runFromConfig Starting server
[junit4:junit4]   2> 6 T1133 oazs.ZooKeeperServer.setTickTime tickTime set to 1000
[junit4:junit4]   2> 6 T1133 oazs.ZooKeeperServer.setMinSessionTimeout minSessionTimeout set to -1
[junit4:junit4]   2> 6 T1133 oazs.ZooKeeperServer.setMaxSessionTimeout maxSessionTimeout set to -1
[junit4:junit4]   2> 6 T1133 oazs.NIOServerCnxnFactory.configure binding to port 0.0.0.0/0.0.0.0:0
[junit4:junit4]   2> 7 T1133 oazsp.FileTxnSnapLog.save Snapshotting: 0x0 to /mnt/ssd/jenkins/workspace/Lucene-Solr-4.x-Linux/solr/build/solr-core/test/J0/./org.apache.solr.cloud.UnloadDistributedZkTest-1362646216520/zookeeper/server1/data/version-2/snapshot.0
[junit4:junit4]   2> 105 T1132 oasc.ZkTestServer.run start zk server on port:43981
[junit4:junit4]   2> 106 T1132 oaz.ZooKeeper.<init> Initiating client connection, connectString=127.0.0.1:43981 sessionTimeout=10000 watcher=org.apache.solr.common.cloud.ConnectionManager@52df562a
[junit4:junit4]   2> 106 T1132 oascc.ConnectionManager.waitForConnected Waiting for client to connect to ZooKeeper
[junit4:junit4]   2> 107 T1138 oaz.ClientCnxn$SendThread.logStartConnect Opening socket connection to server localhost.localdomain/127.0.0.1:43981. Will not attempt to authenticate using SASL (access denied ("javax.security.auth.AuthPermission" "getLoginConfiguration"))
[junit4:junit4]   2> 107 T1138 oaz.ClientCnxn$SendThread.primeConnection Socket connection established to localhost.localdomain/127.0.0.1:43981, initiating session
[junit4:junit4]   2> 107 T1134 oazs.NIOServerCnxnFactory.run Accepted socket connection from /127.0.0.1:58908
[junit4:junit4]   2> 108 T1134 oazs.ZooKeeperServer.processConnectRequest Client attempting to establish new session at /127.0.0.1:58908
[junit4:junit4]   2> 108 T1136 oazsp.FileTxnLog.append Creating new log file: log.1
[junit4:junit4]   2> 194 T1136 oazs.ZooKeeperServer.finishSessionInit Established session 0x13d440b2f4a0000 with negotiated timeout 10000 for client /127.0.0.1:58908
[junit4:junit4]   2> 194 T1138 oaz.ClientCnxn$SendThread.onConnected Session establishment complete on server localhost.localdomain/127.0.0.1:43981, sessionid = 0x13d440b2f4a0000, negotiated timeout = 10000
[junit4:junit4]   2> 194 T1139 oascc.ConnectionManager.process Watcher org.apache.solr.common.cloud.ConnectionManager@52df562a name:ZooKeeperConnection Watcher:127.0.0.1:43981 got event WatchedEvent state:SyncConnected type:None path:null path:null type:None
[junit4:junit4]   2> 194 T1132 oascc.ConnectionManager.waitForConnected Client is connected to ZooKeeper
[junit4:junit4]   2> 195 T1132 oascc.SolrZkClient.makePath makePath: /solr
[junit4:junit4]   2> 198 T1137 oazs.PrepRequestProcessor.pRequest2Txn Processed session termination for sessionid: 0x13d440b2f4a0000
[junit4:junit4]   2> 198 T1139 oaz.ClientCnxn$EventThread.run EventThread shut down
[junit4:junit4]   2> 198 T1134 oazs.NIOServerCnxn.closeSock Closed socket connection for client /127.0.0.1:58908 which had sessionid 0x13d440b2f4a0000
[junit4:junit4]   2> 198 T1132 oaz.ZooKeeper.close Session: 0x13d440b2f4a0000 closed
[junit4:junit4]   2> 199 T1132 oaz.ZooKeeper.<init> Initiating client connection, connectString=127.0.0.1:43981/solr sessionTimeout=10000 watcher=org.apache.solr.common.cloud.ConnectionManager@5c18a201
[junit4:junit4]   2> 199 T1132 oascc.ConnectionManager.waitForConnected Waiting for client to connect to ZooKeeper
[junit4:junit4]   2> 200 T1140 oaz.ClientCnxn$SendThread.logStartConnect Opening socket connection to server localhost.localdomain/127.0.0.1:43981. Will not attempt to authenticate using SASL (access denied ("javax.security.auth.AuthPermission" "getLoginConfiguration"))
[junit4:junit4]   2> 200 T1140 oaz.ClientCnxn$SendThread.primeConnection Socket connection established to localhost.localdomain/127.0.0.1:43981, initiating session
[junit4:junit4]   2> 200 T1134 oazs.NIOServerCnxnFactory.run Accepted socket connection from /127.0.0.1:58909
[junit4:junit4]   2> 201 T1134 oazs.ZooKeeperServer.processConnectRequest Client attempting to establish new session at /127.0.0.1:58909
[junit4:junit4]   2> 201 T1136 oazs.ZooKeeperServer.finishSessionInit Established session 0x13d440b2f4a0001 with negotiated timeout 10000 for client /127.0.0.1:58909
[junit4:junit4]   2> 201 T1140 oaz.ClientCnxn$SendThread.onConnected Session establishment complete on server localhost.localdomain/127.0.0.1:43981, sessionid = 0x13d440b2f4a0001, negotiated timeout = 10000
[junit4:junit4]   2> 202 T1141 oascc.ConnectionManager.process Watcher org.apache.solr.common.cloud.ConnectionManager@5c18a201 name:ZooKeeperConnection Watcher:127.0.0.1:43981/solr got event WatchedEvent state:SyncConnected type:None path:null path:null type:None
[junit4:junit4]   2> 202 T1132 oascc.ConnectionManager.waitForConnected Client is connected to ZooKeeper
[junit4:junit4]   2> 202 T1132 oascc.SolrZkClient.makePath makePath: /collections/collection1
[junit4:junit4]   2> 205 T1132 oascc.SolrZkClient.makePath makePath: /collections/collection1/shards
[junit4:junit4]   2> 207 T1132 oascc.SolrZkClient.makePath makePath: /collections/control_collection
[junit4:junit4]   2> 209 T1132 oascc.SolrZkClient.makePath makePath: /collections/control_collection/shards
[junit4:junit4]   2> 211 T1132 oasc.AbstractZkTestCase.putConfig put /mnt/ssd/jenkins/workspace/Lucene-Solr-4.x-Linux/solr/build/solr-core/test-files/solr/collection1/conf/solrconfig-tlog.xml to /configs/conf1/solrconfig.xml
[junit4:junit4]   2> 211 T1132 oascc.SolrZkClient.makePath makePath: /configs/conf1/solrconfig.xml
[junit4:junit4]   2> 215 T1132 oasc.AbstractZkTestCase.putConfig put /mnt/ssd/jenkins/workspace/Lucene-Solr-4.x-Linux/solr/build/solr-core/test-files/solr/collection1/conf/schema.xml to /configs/conf1/schema.xml
[junit4:junit4]   2> 216 T1132 oascc.SolrZkClient.makePath makePath: /configs/conf1/schema.xml
[junit4:junit4]   2> 219 T1132 oasc.AbstractZkTestCase.putConfig put /mnt/ssd/jenkins/workspace/Lucene-Solr-4.x-Linux/solr/build/solr-core/test-files/solr/collection1/conf/stopwords.txt to /configs/conf1/stopwords.txt
[junit4:junit4]   2> 220 T1132 oascc.SolrZkClient.makePath makePath: /configs/conf1/stopwords.txt
[junit4:junit4]   2> 222 T1132 oasc.AbstractZkTestCase.putConfig put /mnt/ssd/jenkins/workspace/Lucene-Solr-4.x-Linux/solr/build/solr-core/test-files/solr/collection1/conf/protwords.txt to /configs/conf1/protwords.txt
[junit4:junit4]   2> 223 T1132 oascc.SolrZkClient.makePath makePath: /configs/conf1/protwords.txt
[junit4:junit4]   2> 225 T1132 oasc.AbstractZkTestCase.putConfig put /mnt/ssd/jenkins/workspace/Lucene-Solr-4.x-Linux/solr/build/solr-core/test-files/solr/collection1/conf/currency.xml to /configs/conf1/currency.xml
[junit4:junit4]   2> 225 T1132 oascc.SolrZkClient.makePath makePath: /configs/conf1/currency.xml
[junit4:junit4]   2> 228 T1132 oasc.AbstractZkTestCase.putConfig put /mnt/ssd/jenkins/workspace/Lucene-Solr-4.x-Linux/solr/build/solr-core/test-files/solr/collection1/conf/open-exchange-rates.json to /configs/conf1/open-exchange-rates.json
[junit4:junit4]   2> 229 T1132 oascc.SolrZkClient.makePath makePath: /configs/conf1/open-exchange-rates.json
[junit4:junit4]   2> 231 T1132 oasc.AbstractZkTestCase.putConfig put /mnt/ssd/jenkins/workspace/Lucene-Solr-4.x-Linux/solr/build/solr-core/test-files/solr/collection1/conf/mapping-ISOLatin1Accent.txt to /configs/conf1/mapping-ISOLatin1Accent.txt
[junit4:junit4]   2> 231 T1132 oascc.SolrZkClient.makePath makePath: /configs/conf1/mapping-ISOLatin1Accent.txt
[junit4:junit4]   2> 234 T1132 oasc.AbstractZkTestCase.putConfig put /mnt/ssd/jenkins/workspace/Lucene-Solr-4.x-Linux/solr/build/solr-core/test-files/solr/collection1/conf/old_synonyms.txt to /configs/conf1/old_synonyms.txt
[junit4:junit4]   2> 234 T1132 oascc.SolrZkClient.makePath makePath: /configs/conf1/old_synonyms.txt
[junit4:junit4]   2> 237 T1132 oasc.AbstractZkTestCase.putConfig put /mnt/ssd/jenkins/workspace/Lucene-Solr-4.x-Linux/solr/build/solr-core/test-files/solr/collection1/conf/synonyms.txt to /configs/conf1/synonyms.txt
[junit4:junit4]   2> 237 T1132 oascc.SolrZkClient.makePath makePath: /configs/conf1/synonyms.txt
[junit4:junit4]   2> 240 T1137 oazs.PrepRequestProcessor.pRequest2Txn Processed session termination for sessionid: 0x13d440b2f4a0001
[junit4:junit4]   2> 240 T1141 oaz.ClientCnxn$EventThread.run EventThread shut down
[junit4:junit4]   2> 240 T1132 oaz.ZooKeeper.close Session: 0x13d440b2f4a0001 closed
[junit4:junit4]   2> 240 T1134 oazs.NIOServerCnxn.closeSock Closed socket connection for client /127.0.0.1:58909 which had sessionid 0x13d440b2f4a0001
[junit4:junit4]   2> 303 T1132 oejs.Server.doStart jetty-8.1.8.v20121106
[junit4:junit4]   2> 306 T1132 oejs.AbstractConnector.doStart Started SelectChannelConnector@127.0.0.1:58264
[junit4:junit4]   2> 307 T1132 oass.SolrDispatchFilter.init SolrDispatchFilter.init()
[junit4:junit4]   2> 307 T1132 oasc.SolrResourceLoader.locateSolrHome JNDI not configured for solr (NoInitialContextEx)
[junit4:junit4]   2> 308 T1132 oasc.SolrResourceLoader.locateSolrHome using system property solr.solr.home: /mnt/ssd/jenkins/workspace/Lucene-Solr-4.x-Linux/solr/build/solr-core/test/J0/./org.apache.solr.cloud.UnloadDistributedZkTest-controljetty-1362646216755
[junit4:junit4]   2> 308 T1132 oasc.CoreContainer$Initializer.initialize looking for solr.xml: /mnt/ssd/jenkins/workspace/Lucene-Solr-4.x-Linux/solr/build/solr-core/test/J0/./org.apache.solr.cloud.UnloadDistributedZkTest-controljetty-1362646216755/solr.xml
[junit4:junit4]   2> 308 T1132 oasc.CoreContainer.<init> New CoreContainer 1306415756
[junit4:junit4]   2> 309 T1132 oasc.CoreContainer.load Loading CoreContainer using Solr Home: '/mnt/ssd/jenkins/workspace/Lucene-Solr-4.x-Linux/solr/build/solr-core/test/J0/./org.apache.solr.cloud.UnloadDistributedZkTest-controljetty-1362646216755/'
[junit4:junit4]   2> 309 T1132 oasc.SolrResourceLoader.<init> new SolrResourceLoader for directory: '/mnt/ssd/jenkins/workspace/Lucene-Solr-4.x-Linux/solr/build/solr-core/test/J0/./org.apache.solr.cloud.UnloadDistributedZkTest-controljetty-1362646216755/'
[junit4:junit4]   2> 325 T1132 oashc.HttpShardHandlerFactory.getParameter Setting socketTimeout to: 120000
[junit4:junit4]   2> 325 T1132 oashc.HttpShardHandlerFactory.getParameter Setting urlScheme to: http://
[junit4:junit4]   2> 325 T1132 oashc.HttpShardHandlerFactory.getParameter Setting connTimeout to: 15000
[junit4:junit4]   2> 326 T1132 oashc.HttpShardHandlerFactory.getParameter Setting maxConnectionsPerHost to: 20
[junit4:junit4]   2> 326 T1132 oashc.HttpShardHandlerFactory.getParameter Setting corePoolSize to: 0
[junit4:junit4]   2> 326 T1132 oashc.HttpShardHandlerFactory.getParameter Setting maximumPoolSize to: 2147483647
[junit4:junit4]   2> 327 T1132 oashc.HttpShardHandlerFactory.getParameter Setting maxThreadIdleTime to: 5
[junit4:junit4]   2> 327 T1132 oashc.HttpShardHandlerFactory.getParameter Setting sizeOfQueue to: -1
[junit4:junit4]   2> 327 T1132 oashc.HttpShardHandlerFactory.getParameter Setting fairnessPolicy to: false
[junit4:junit4]   2> 327 T1132 oascsi.HttpClientUtil.createClient Creating new http client, config:maxConnectionsPerHost=20&maxConnections=10000&socketTimeout=120000&connTimeout=15000&retry=false
[junit4:junit4]   2> 333 T1132 oasc.CoreContainer.load Registering Log Listener
[junit4:junit4]   2> 342 T1132 oasc.CoreContainer.initZooKeeper Zookeeper client=127.0.0.1:43981/solr
[junit4:junit4]   2> 343 T1132 oasc.ZkController.checkChrootPath zkHost includes chroot
[junit4:junit4]   2> 343 T1132 oaz.ZooKeeper.<init> Initiating client connection, connectString=127.0.0.1:43981 sessionTimeout=60000 watcher=org.apache.solr.common.cloud.ConnectionManager@219a854e
[junit4:junit4]   2> 344 T1132 oascc.ConnectionManager.waitForConnected Waiting for client to connect to ZooKeeper
[junit4:junit4]   2> 344 T1151 oaz.ClientCnxn$SendThread.logStartConnect Opening socket connection to server localhost.localdomain/127.0.0.1:43981. Will not attempt to authenticate using SASL (access denied ("javax.security.auth.AuthPermission" "getLoginConfiguration"))
[junit4:junit4]   2> 344 T1151 oaz.ClientCnxn$SendThread.primeConnection Socket connection established to localhost.localdomain/127.0.0.1:43981, initiating session
[junit4:junit4]   2> 344 T1134 oazs.NIOServerCnxnFactory.run Accepted socket connection from /127.0.0.1:58910
[junit4:junit4]   2> 345 T1134 oazs.ZooKeeperServer.processConnectRequest Client attempting to establish new session at /127.0.0.1:58910
[junit4:junit4]   2> 345 T1136 oazs.ZooKeeperServer.finishSessionInit Established session 0x13d440b2f4a0002 with negotiated timeout 20000 for client /127.0.0.1:58910
[junit4:junit4]   2> 345 T1151 oaz.ClientCnxn$SendThread.onConnected Session establishment complete on server localhost.localdomain/127.0.0.1:43981, sessionid = 0x13d440b2f4a0002, negotiated timeout = 20000
[junit4:junit4]   2> 346 T1152 oascc.ConnectionManager.process Watcher org.apache.solr.common.cloud.ConnectionManager@219a854e name:ZooKeeperConnection Watcher:127.0.0.1:43981 got event WatchedEvent state:SyncConnected type:None path:null path:null type:None
[junit4:junit4]   2> 346 T1132 oascc.ConnectionManager.waitForConnected Client is connected to ZooKeeper
[junit4:junit4]   2> 347 T1137 oazs.PrepRequestProcessor.pRequest2Txn Processed session termination for sessionid: 0x13d440b2f4a0002
[junit4:junit4]   2> 347 T1152 oaz.ClientCnxn$EventThread.run EventThread shut down
[junit4:junit4]   2> 347 T1134 oazs.NIOServerCnxn.closeSock Closed socket connection for client /127.0.0.1:58910 which had sessionid 0x13d440b2f4a0002
[junit4:junit4]   2> 347 T1132 oaz.ZooKeeper.close Session: 0x13d440b2f4a0002 closed
[junit4:junit4]   2> 348 T1132 oascsi.HttpClientUtil.createClient Creating new http client, config:maxConnections=500&maxConnectionsPerHost=16&socketTimeout=120000&connTimeout=15000
[junit4:junit4]   2> 350 T1132 oaz.ZooKeeper.<init> Initiating client connection, connectString=127.0.0.1:43981/solr sessionTimeout=30000 watcher=org.apache.solr.common.cloud.ConnectionManager@49d0d5ca
[junit4:junit4]   2> 351 T1132 oascc.ConnectionManager.waitForConnected Waiting for client to connect to ZooKeeper
[junit4:junit4]   2> 351 T1153 oaz.ClientCnxn$SendThread.logStartConnect Opening socket connection to server localhost.localdomain/127.0.0.1:43981. Will not attempt to authenticate using SASL (access denied ("javax.security.auth.AuthPermission" "getLoginConfiguration"))
[junit4:junit4]   2> 352 T1153 oaz.ClientCnxn$SendThread.primeConnection Socket connection established to localhost.localdomain/127.0.0.1:43981, initiating session
[junit4:junit4]   2> 352 T1134 oazs.NIOServerCnxnFactory.run Accepted socket connection from /127.0.0.1:58911
[junit4:junit4]   2> 352 T1134 oazs.ZooKeeperServer.processConnectRequest Client attempting to establish new session at /127.0.0.1:58911
[junit4:junit4]   2> 353 T1136 oazs.ZooKeeperServer.finishSessionInit Established session 0x13d440b2f4a0003 with negotiated timeout 20000 for client /127.0.0.1:58911
[junit4:junit4]   2> 353 T1153 oaz.ClientCnxn$SendThread.onConnected Session establishment complete on server localhost.localdomain/127.0.0.1:43981, sessionid = 0x13d440b2f4a0003, negotiated timeout = 20000
[junit4:junit4]   2> 353 T1154 oascc.ConnectionManager.process Watcher org.apache.solr.common.cloud.ConnectionManager@49d0d5ca name:ZooKeeperConnection Watcher:127.0.0.1:43981/solr got event WatchedEvent state:SyncConnected type:None path:null path:null type:None
[junit4:junit4]   2> 353 T1132 oascc.ConnectionManager.waitForConnected Client is connected to ZooKeeper
[junit4:junit4]   2> 354 T1137 oazs.PrepRequestProcessor.pRequest Got user-level KeeperException when processing sessionid:0x13d440b2f4a0003 type:create cxid:0x2 zxid:0x1a txntype:-1 reqpath:n/a Error Path:/solr/overseer Error:KeeperErrorCode = NodeExists for /solr/overseer
[junit4:junit4]   2> 356 T1132 oascc.SolrZkClient.makePath makePath: /live_nodes
[junit4:junit4]   2> 357 T1132 oasc.ZkController.createEphemeralLiveNode Register node as live in ZooKeeper:/live_nodes/127.0.0.1:58264__o%2Fbv
[junit4:junit4]   2> 358 T1137 oazs.PrepRequestProcessor.pRequest Got user-level KeeperException when processing sessionid:0x13d440b2f4a0003 type:delete cxid:0x8 zxid:0x1c txntype:-1 reqpath:n/a Error Path:/solr/live_nodes/127.0.0.1:58264__o%2Fbv Error:KeeperErrorCode = NoNode for /solr/live_nodes/127.0.0.1:58264__o%2Fbv
[junit4:junit4]   2> 358 T1132 oascc.SolrZkClient.makePath makePath: /live_nodes/127.0.0.1:58264__o%2Fbv
[junit4:junit4]   2> 361 T1132 oascc.SolrZkClient.makePath makePath: /overseer_elect/election
[junit4:junit4]   2> 365 T1137 oazs.PrepRequestProcessor.pRequest Got user-level KeeperException when processing sessionid:0x13d440b2f4a0003 type:delete cxid:0x16 zxid:0x21 txntype:-1 reqpath:n/a Error Path:/solr/overseer_elect/leader Error:KeeperErrorCode = NoNode for /solr/overseer_elect/leader
[junit4:junit4]   2> 365 T1132 oascc.SolrZkClient.makePath makePath: /overseer_elect/leader
[junit4:junit4]   2> 368 T1132 oasc.Overseer.start Overseer (id=89302382445985795-127.0.0.1:58264__o%2Fbv-n_0000000000) starting
[junit4:junit4]   2> 369 T1137 oazs.PrepRequestProcessor.pRequest Got user-level KeeperException when processing sessionid:0x13d440b2f4a0003 type:create cxid:0x1b zxid:0x23 txntype:-1 reqpath:n/a Error Path:/solr/overseer Error:KeeperErrorCode = NodeExists for /solr/overseer
[junit4:junit4]   2> 370 T1137 oazs.PrepRequestProcessor.pRequest Got user-level KeeperException when processing sessionid:0x13d440b2f4a0003 type:create cxid:0x1c zxid:0x24 txntype:-1 reqpath:n/a Error Path:/solr/overseer Error:KeeperErrorCode = NodeExists for /solr/overseer
[junit4:junit4]   2> 370 T1137 oazs.PrepRequestProcessor.pRequest Got user-level KeeperException when processing sessionid:0x13d440b2f4a0003 type:create cxid:0x1d zxid:0x25 txntype:-1 reqpath:n/a Error Path:/solr/overseer Error:KeeperErrorCode = NodeExists for /solr/overseer
[junit4:junit4]   2> 371 T1137 oazs.PrepRequestProcessor.pRequest Got user-level KeeperException when processing sessionid:0x13d440b2f4a0003 type:create cxid:0x1e zxid:0x26 txntype:-1 reqpath:n/a Error Path:/solr/overseer Error:KeeperErrorCode = NodeExists for /solr/overseer
[junit4:junit4]   2> 372 T1156 oasc.OverseerCollectionProcessor.run Process current queue of collection creations
[junit4:junit4]   2> 372 T1132 oascc.SolrZkClient.makePath makePath: /clusterstate.json
[junit4:junit4]   2> 375 T1132 oascc.SolrZkClient.makePath makePath: /aliases.json
[junit4:junit4]   2> 376 T1132 oascc.ZkStateReader.createClusterStateWatchersAndUpdate Updating cluster state from ZooKeeper... 
[junit4:junit4]   2> 378 T1155 oasc.Overseer$ClusterStateUpdater.run Starting to work on the main queue
[junit4:junit4]   2> 380 T1132 oass.SolrDispatchFilter.init user.dir=/mnt/ssd/jenkins/workspace/Lucene-Solr-4.x-Linux/solr/build/solr-core/test/J0
[junit4:junit4]   2> 380 T1132 oass.SolrDispatchFilter.init SolrDispatchFilter.init() done
[junit4:junit4]   2> 381 T1132 oascsi.HttpClientUtil.createClient Creating new http client, config:maxConnections=128&maxConnectionsPerHost=32&followRedirects=false
[junit4:junit4]   2> 383 T1132 oascsi.HttpClientUtil.createClient Creating new http client, config:
[junit4:junit4]   2> 384 T1132 oaz.ZooKeeper.<init> Initiating client connection, connectString=127.0.0.1:43981/solr sessionTimeout=10000 watcher=org.apache.solr.common.cloud.ConnectionManager@7a2016d6
[junit4:junit4]   2> 385 T1132 oascc.ConnectionManager.waitForConnected Waiting for client to connect to ZooKeeper
[junit4:junit4]   2> 385 T1157 oaz.ClientCnxn$SendThread.logStartConnect Opening socket connection to server localhost.localdomain/127.0.0.1:43981. Will not attempt to authenticate using SASL (access denied ("javax.security.auth.AuthPermission" "getLoginConfiguration"))
[junit4:junit4]   2> 385 T1157 oaz.ClientCnxn$SendThread.primeConnection Socket connection established to localhost.localdomain/127.0.0.1:43981, initiating session
[junit4:junit4]   2> 385 T1134 oazs.NIOServerCnxnFactory.run Accepted socket connection from /127.0.0.1:58912
[junit4:junit4]   2> 386 T1134 oazs.ZooKeeperServer.processConnectRequest Client attempting to establish new session at /127.0.0.1:58912
[junit4:junit4]   2> 386 T1136 oazs.ZooKeeperServer.finishSessionInit Established session 0x13d440b2f4a0004 with negotiated timeout 10000 for client /127.0.0.1:58912
[junit4:junit4]   2> 387 T1157 oaz.ClientCnxn$SendThread.onConnected Session establishment complete on server localhost.localdomain/127.0.0.1:43981, sessionid = 0x13d440b2f4a0004, negotiated timeout = 10000
[junit4:junit4]   2> 387 T1158 oascc.ConnectionManager.process Watcher org.apache.solr.common.cloud.ConnectionManager@7a2016d6 name:ZooKeeperConnection Watcher:127.0.0.1:43981/solr got event WatchedEvent state:SyncConnected type:None path:null path:null type:None
[junit4:junit4]   2> 387 T1132 oascc.ConnectionManager.waitForConnected Client is connected to ZooKeeper
[junit4:junit4]   2> 388 T1132 oascc.ZkStateReader.createClusterStateWatchersAndUpdate Updating cluster state from ZooKeeper... 
[junit4:junit4]   2> 390 T1132 oasc.ChaosMonkey.monkeyLog monkey: init - expire sessions:true cause connection loss:true
[junit4:junit4]   2> 454 T1132 oejs.Server.doStart jetty-8.1.8.v20121106
[junit4:junit4]   2> 456 T1132 oejs.AbstractConnector.doStart Started SelectChannelConnector@127.0.0.1:60705
[junit4:junit4]   2> 456 T1132 oass.SolrDispatchFilter.init SolrDispatchFilter.init()
[junit4:junit4]   2> 457 T1132 oasc.SolrResourceLoader.locateSolrHome JNDI not configured for solr (NoInitialContextEx)
[junit4:junit4]   2> 457 T1132 oasc.SolrResourceLoader.locateSolrHome using system property solr.solr.home: /mnt/ssd/jenkins/workspace/Lucene-Solr-4.x-Linux/solr/build/solr-core/test/J0/./org.apache.solr.cloud.UnloadDistributedZkTest-jetty1-1362646216905
[junit4:junit4]   2> 457 T1132 oasc.CoreContainer$Initializer.initialize looking for solr.xml: /mnt/ssd/jenkins/workspace/Lucene-Solr-4.x-Linux/solr/build/solr-core/test/J0/./org.apache.solr.cloud.UnloadDistributedZkTest-jetty1-1362646216905/solr.xml
[junit4:junit4]   2> 458 T1132 oasc.CoreContainer.<init> New CoreContainer 605913816
[junit4:junit4]   2> 458 T1132 oasc.CoreContainer.load Loading CoreContainer using Solr Home: '/mnt/ssd/jenkins/workspace/Lucene-Solr-4.x-Linux/solr/build/solr-core/test/J0/./org.apache.solr.cloud.UnloadDistributedZkTest-jetty1-1362646216905/'
[junit4:junit4]   2> 458 T1132 oasc.SolrResourceLoader.<init> new SolrResourceLoader for directory: '/mnt/ssd/jenkins/workspace/Lucene-Solr-4.x-Linux/solr/build/solr-core/test/J0/./org.apache.solr.cloud.UnloadDistributedZkTest-jetty1-1362646216905/'
[junit4:junit4]   2> 476 T1132 oashc.HttpShardHandlerFactory.getParameter Setting socketTimeout to: 120000
[junit4:junit4]   2> 476 T1132 oashc.HttpShardHandlerFactory.getParameter Setting urlScheme to: http://
[junit4:junit4]   2> 477 T1132 oashc.HttpShardHandlerFactory.getParameter Setting connTimeout to: 15000
[junit4:junit4]   2> 477 T1132 oashc.HttpShardHandlerFactory.getParameter Setting maxConnectionsPerHost to: 20
[junit4:junit4]   2> 477 T1132 oashc.HttpShardHandlerFactory.getParameter Setting corePoolSize to: 0
[junit4:junit4]   2> 477 T1132 oashc.HttpShardHandlerFactory.getParameter Setting maximumPoolSize to: 2147483647
[junit4:junit4]   2> 478 T1132 oashc.HttpShardHandlerFactory.getParameter Setting maxThreadIdleTime to: 5
[junit4:junit4]   2> 478 T1132 oashc.HttpShardHandlerFactory.getParameter Setting sizeOfQueue to: -1
[junit4:junit4]   2> 478 T1132 oashc.HttpShardHandlerFactory.getParameter Setting fairnessPolicy to: false
[junit4:junit4]   2> 479 T1132 oascsi.HttpClientUtil.createClient Creating new http client, config:maxConnectionsPerHost=20&maxConnections=10000&socketTimeout=120000&connTimeout=15000&retry=false
[junit4:junit4]   2> 485 T1132 oasc.CoreContainer.load Registering Log Listener
[junit4:junit4]   2> 495 T1132 oasc.CoreContainer.initZooKeeper Zookeeper client=127.0.0.1:43981/solr
[junit4:junit4]   2> 495 T1132 oasc.ZkController.checkChrootPath zkHost includes chroot
[junit4:junit4]   2> 495 T1132 oaz.ZooKeeper.<init> Initiating client connection, connectString=127.0.0.1:43981 sessionTimeout=60000 watcher=org.apache.solr.common.cloud.ConnectionManager@71238730
[junit4:junit4]   2> 496 T1132 oascc.ConnectionManager.waitForConnected Waiting for client to connect to ZooKeeper
[junit4:junit4]   2> 496 T1168 oaz.ClientCnxn$SendThread.logStartConnect Opening socket connection to server localhost.localdomain/127.0.0.1:43981. Will not attempt to authenticate using SASL (access denied ("javax.security.auth.AuthPermission" "getLoginConfiguration"))
[junit4:junit4]   2> 497 T1168 oaz.ClientCnxn$SendThread.primeConnection Socket connection established to localhost.localdomain/127.0.0.1:43981, initiating session
[junit4:junit4]   2> 497 T1134 oazs.NIOServerCnxnFactory.run Accepted socket connection from /127.0.0.1:58913
[junit4:junit4]   2> 497 T1134 oazs.ZooKeeperServer.processConnectRequest Client attempting to establish new session at /127.0.0.1:58913
[junit4:junit4]   2> 498 T1136 oazs.ZooKeeperServer.finishSessionInit Established session 0x13d440b2f4a0005 with negotiated timeout 20000 for client /127.0.0.1:58913
[junit4:junit4]   2> 498 T1168 oaz.ClientCnxn$SendThread.onConnected Session establishment complete on server localhost.localdomain/127.0.0.1:43981, sessionid = 0x13d440b2f4a0005, negotiated timeout = 20000
[junit4:junit4]   2> 498 T1169 oascc.ConnectionManager.process Watcher org.apache.solr.common.cloud.ConnectionManager@71238730 name:ZooKeeperConnection Watcher:127.0.0.1:43981 got event WatchedEvent state:SyncConnected type:None path:null path:null type:None
[junit4:junit4]   2> 499 T1132 oascc.ConnectionManager.waitForConnected Client is connected to ZooKeeper
[junit4:junit4]   2> 500 T1137 oazs.PrepRequestProcessor.pRequest2Txn Processed session termination for sessionid: 0x13d440b2f4a0005
[junit4:junit4]   2> 500 T1134 oazs.NIOServerCnxn.closeSock Closed socket connection for client /127.0.0.1:58913 which had sessionid 0x13d440b2f4a0005
[junit4:junit4]   2> 500 T1169 oaz.ClientCnxn$EventThread.run EventThread shut down
[junit4:junit4]   2> 500 T1132 oaz.ZooKeeper.close Session: 0x13d440b2f4a0005 closed
[junit4:junit4]   2> 501 T1132 oascsi.HttpClientUtil.createClient Creating new http client, config:maxConnections=500&maxConnectionsPerHost=16&socketTimeout=120000&connTimeout=15000
[junit4:junit4]   2> 503 T1132 oaz.ZooKeeper.<init> Initiating client connection, connectString=127.0.0.1:43981/solr sessionTimeout=30000 watcher=org.apache.solr.common.cloud.ConnectionManager@2384d5be
[junit4:junit4]   2> 504 T1132 oascc.ConnectionManager.waitForConnected Waiting for client to connect to ZooKeeper
[junit4:junit4]   2> 504 T1170 oaz.ClientCnxn$SendThread.logStartConnect Opening socket connection to server localhost.localdomain/127.0.0.1:43981. Will not attempt to authenticate using SASL (access denied ("javax.security.auth.AuthPermission" "getLoginConfiguration"))
[junit4:junit4]   2> 505 T1170 oaz.ClientCnxn$SendThread.primeConnection Socket connection established to localhost.localdomain/127.0.0.1:43981, initiating session
[junit4:junit4]   2> 505 T1134 oazs.NIOServerCnxnFactory.run Accepted socket connection from /127.0.0.1:58914
[junit4:junit4]   2> 505 T1134 oazs.ZooKeeperServer.processConnectRequest Client attempting to establish new session at /127.0.0.1:58914
[junit4:junit4]   2> 506 T1136 oazs.ZooKeeperServer.finishSessionInit Established session 0x13d440b2f4a0006 with negotiated timeout 20000 for client /127.0.0.1:58914
[junit4:junit4]   2> 506 T1170 oaz.ClientCnxn$SendThread.onConnected Session establishment complete on server localhost.localdomain/127.0.0.1:43981, sessionid = 0x13d440b2f4a0006, negotiated timeout = 20000
[junit4:junit4]   2> 507 T1171 oascc.ConnectionManager.process Watcher org.apache.solr.common.cloud.ConnectionManager@2384d5be name:ZooKeeperConnection Watcher:127.0.0.1:43981/solr got event WatchedEvent state:SyncConnected type:None path:null path:null type:None
[junit4:junit4]   2> 507 T1132 oascc.ConnectionManager.waitForConnected Client is connected to ZooKeeper
[junit4:junit4]   2> 508 T1137 oazs.PrepRequestProcessor.pRequest Got user-level KeeperException when processing sessionid:0x13d440b2f4a0006 type:create cxid:0x1 zxid:0x2e txntype:-1 reqpath:n/a Error Path:/solr/overseer Error:KeeperErrorCode = NodeExists for /solr/overseer
[junit4:junit4]   2> 509 T1137 oazs.PrepRequestProcessor.pRequest Got user-level KeeperException when processing sessionid:0x13d440b2f4a0006 type:create cxid:0x2 zxid:0x2f txntype:-1 reqpath:n/a Error Path:/solr/overseer Error:KeeperErrorCode = NodeExists for /solr/overseer
[junit4:junit4]   2> 510 T1132 oascc.ZkStateReader.createClusterStateWatchersAndUpdate Updating cluster state from ZooKeeper... 
[junit4:junit4]   2> 1513 T1132 oasc.ZkController.createEphemeralLiveNode Register node as live in ZooKeeper:/live_nodes/127.0.0.1:60705__o%2Fbv
[junit4:junit4]   2> 1514 T1137 oazs.PrepRequestProcessor.pRequest Got user-level KeeperException when processing sessionid:0x13d440b2f4a0006 type:delete cxid:0xb zxid:0x30 txntype:-1 reqpath:n/a Error Path:/solr/live_nodes/127.0.0.1:60705__o%2Fbv Error:KeeperErrorCode = NoNode for /solr/live_nodes/127.0.0.1:60705__o%2Fbv
[junit4:junit4]   2> 1515 T1132 oascc.SolrZkClient.makePath makePath: /live_nodes/127.0.0.1:60705__o%2Fbv
[junit4:junit4]   2> 1517 T1158 oascc.ZkStateReader$3.process Updating live nodes... (2)
[junit4:junit4]   2> 1518 T1154 oascc.ZkStateReader$3.process Updating live nodes... (2)
[junit4:junit4]   2> 1518 T1171 oascc.ZkStateReader$3.process Updating live nodes... (2)
[junit4:junit4]   2> 1522 T1132 oass.SolrDispatchFilter.init user.dir=/mnt/ssd/jenkins/workspace/Lucene-Solr-4.x-Linux/solr/build/solr-core/test/J0
[junit4:junit4]   2> 1522 T1132 oass.SolrDispatchFilter.init SolrDispatchFilter.init() done
[junit4:junit4]   2> 1523 T1132 oascsi.HttpClientUtil.createClient Creating new http client, config:maxConnections=128&maxConnectionsPerHost=32&followRedirects=false
[junit4:junit4]   2> 1591 T1132 oejs.Server.doStart jetty-8.1.8.v20121106
[junit4:junit4]   2> 1593 T1132 oejs.AbstractConnector.doStart Started SelectChannelConnector@127.0.0.1:51787
[junit4:junit4]   2> 1594 T1132 oass.SolrDispatchFilter.init SolrDispatchFilter.init()
[junit4:junit4]   2> 1594 T1132 oasc.SolrResourceLoader.locateSolrHome JNDI not configured for solr (NoInitialContextEx)
[junit4:junit4]   2> 1594 T1132 oasc.SolrResourceLoader.locateSolrHome using system property solr.solr.home: /mnt/ssd/jenkins/workspace/Lucene-Solr-4.x-Linux/solr/build/solr-core/test/J0/./org.apache.solr.cloud.UnloadDistributedZkTest-jetty2-1362646218040
[junit4:junit4]   2> 1595 T1132 oasc.CoreContainer$Initializer.initialize looking for solr.xml: /mnt/ssd/jenkins/workspace/Lucene-Solr-4.x-Linux/solr/build/solr-core/test/J0/./org.apache.solr.cloud.UnloadDistributedZkTest-jetty2-1362646218040/solr.xml
[junit4:junit4]   2> 1595 T1132 oasc.CoreContainer.<init> New CoreContainer 1144843346
[junit4:junit4]   2> 1595 T1132 oasc.CoreContainer.load Loading CoreContainer using Solr Home: '/mnt/ssd/jenkins/workspace/Lucene-Solr-4.x-Linux/solr/build/solr-core/test/J0/./org.apache.solr.cloud.UnloadDistributedZkTest-jetty2-1362646218040/'
[junit4:junit4]   2> 1596 T1132 oasc.SolrResourceLoader.<init> new SolrResourceLoader for directory: '/mnt/ssd/jenkins/workspace/Lucene-Solr-4.x-Linux/solr/build/solr-core/test/J0/./org.apache.solr.cloud.UnloadDistributedZkTest-jetty2-1362646218040/'
[junit4:junit4]   2> 1615 T1132 oashc.HttpShardHandlerFactory.getParameter Setting socketTimeout to: 120000
[junit4:junit4]   2> 1616 T1132 oashc.HttpShardHandlerFactory.getParameter Setting urlScheme to: http://
[junit4:junit4]   2> 1616 T1132 oashc.HttpShardHandlerFactory.getParameter Setting connTimeout to: 15000
[junit4:junit4]   2> 1616 T1132 oashc.HttpShardHandlerFactory.getParameter Setting maxConnectionsPerHost to: 20
[junit4:junit4]   2> 1617 T1132 oashc.HttpShardHandlerFactory.getParameter Setting corePoolSize to: 0
[junit4:junit4]   2> 1617 T1132 oashc.HttpShardHandlerFactory.getParameter Setting maximumPoolSize to: 2147483647
[junit4:junit4]   2> 1617 T1132 oashc.HttpShardHandlerFactory.getParameter Setting maxThreadIdleTime to: 5
[junit4:junit4]   2> 1618 T1132 oashc.HttpShardHandlerFactory.getParameter Setting sizeOfQueue to: -1
[junit4:junit4]   2> 1618 T1132 oashc.HttpShardHandlerFactory.getParameter Setting fairnessPolicy to: false
[junit4:junit4]   2> 1618 T1132 oascsi.HttpClientUtil.createClient Creating new http client, config:maxConnectionsPerHost=20&maxConnections=10000&socketTimeout=120000&connTimeout=15000&retry=false
[junit4:junit4]   2> 1626 T1132 oasc.CoreContainer.load Registering Log Listener
[junit4:junit4]   2> 1635 T1132 oasc.CoreContainer.initZooKeeper Zookeeper client=127.0.0.1:43981/solr
[junit4:junit4]   2> 1636 T1132 oasc.ZkController.checkChrootPath zkHost includes chroot
[junit4:junit4]   2> 1636 T1132 oaz.ZooKeeper.<init> Initiating client connection, connectString=127.0.0.1:43981 sessionTimeout=60000 watcher=org.apache.solr.common.cloud.ConnectionManager@91a6d6a
[junit4:junit4]   2> 1640 T1132 oascc.ConnectionManager.waitForConnected Waiting for client to connect to ZooKeeper
[junit4:junit4]   2> 1640 T1181 oaz.ClientCnxn$SendThread.logStartConnect Opening socket connection to server localhost.localdomain/127.0.0.1:43981. Will not attempt to authenticate using SASL (access denied ("javax.security.auth.AuthPermission" "getLoginConfiguration"))
[junit4:junit4]   2> 1641 T1181 oaz.ClientCnxn$SendThread.primeConnection Socket connection established to localhost.localdomain/127.0.0.1:43981, initiating session
[junit4:junit4]   2> 1641 T1134 oazs.NIOServerCnxnFactory.run Accepted socket connection from /127.0.0.1:58915
[junit4:junit4]   2> 1641 T1134 oazs.ZooKeeperServer.processConnectRequest Client attempting to establish new session at /127.0.0.1:58915
[junit4:junit4]   2> 1642 T1136 oazs.ZooKeeperServer.finishSessionInit Established session 0x13d440b2f4a0007 with negotiated timeout 20000 for client /127.0.0.1:58915
[junit4:junit4]   2> 1642 T1181 oaz.ClientCnxn$SendThread.onConnected Session establishment complete on server localhost.localdomain/127.0.0.1:43981, sessionid = 0x13d440b2f4a0007, negotiated timeout = 20000
[junit4:junit4]   2> 1642 T1182 oascc.ConnectionManager.process Watcher org.apache.solr.common.cloud.ConnectionManager@91a6d6a name:ZooKeeperConnection Watcher:127.0.0.1:43981 got event WatchedEvent state:SyncConnected type:None path:null path:null type:None
[junit4:junit4]   2> 1642 T1132 oascc.ConnectionManager.waitForConnected Client is connected to ZooKeeper
[junit4:junit4]   2> 1643 T1137 oazs.PrepRequestProcessor.pRequest2Txn Processed session termination for sessionid: 0x13d440b2f4a0007
[junit4:junit4]   2> 1644 T1182 oaz.ClientCnxn$EventThread.run EventThread shut down
[junit4:junit4]   2> 1644 T1134 oazs.NIOServerCnxn.closeSock Closed socket connection for client /127.0.0.1:58915 which had sessionid 0x13d440b2f4a0007
[junit4:junit4]   2> 1644 T1132 oaz.ZooKeeper.close Session: 0x13d440b2f4a0007 closed
[junit4:junit4]   2> 1644 T1132 oascsi.HttpClientUtil.createClient Creating new http client, config:maxConnections=500&maxConnectionsPerHost=16&socketTimeout=120000&connTimeout=15000
[junit4:junit4]   2> 1647 T1132 oaz.ZooKeeper.<init> Initiating client connection, connectString=127.0.0.1:43981/solr sessionTimeout=30000 watcher=org.apache.solr.common.cloud.ConnectionManager@49781c82
[junit4:junit4]   2> 1648 T1132 oascc.ConnectionManager.waitForConnected Waiting for client to connect to ZooKeeper
[junit4:junit4]   2> 1648 T1183 oaz.ClientCnxn$SendThread.logStartConnect Opening socket connection to server localhost.localdomain/127.0.0.1:43981. Will not attempt to authenticate using SASL (access denied ("javax.security.auth.AuthPermission" "getLoginConfiguration"))
[junit4:junit4]   2> 1648 T1183 oaz.ClientCnxn$SendThread.primeConnection Socket connection established to localhost.localdomain/127.0.0.1:43981, initiating session
[junit4:junit4]   2> 1648 T1134 oazs.NIOServerCnxnFactory.run Accepted socket connection from /127.0.0.1:58916
[junit4:junit4]   2> 1649 T1134 oazs.ZooKeeperServer.processConnectRequest Client attempting to establish new session at /127.0.0.1:58916
[junit4:junit4]   2> 1649 T1136 oazs.ZooKeeperServer.finishSessionInit Established session 0x13d440b2f4a0008 with negotiated timeout 20000 for client /127.0.0.1:58916
[junit4:junit4]   2> 1649 T1183 oaz.ClientCnxn$SendThread.onConnected Session establishment complete on server localhost.localdomain/127.0.0.1:43981, sessionid = 0x13d440b2f4a0008, negotiated timeout = 20000
[junit4:junit4]   2> 1650 T1184 oascc.ConnectionManager.process Watcher org.apache.solr.common.cloud.ConnectionManager@49781c82 name:ZooKeeperConnection Watcher:127.0.0.1:43981/solr got event WatchedEvent state:SyncConnected type:None path:null path:null type:None
[junit4:junit4]   2> 1650 T1132 oascc.ConnectionManager.waitForConnected Client is connected to ZooKeeper
[junit4:junit4]   2> 1650 T1137 oazs.PrepRequestProcessor.pRequest Got user-level KeeperException when processing sessionid:0x13d440b2f4a0008 type:create cxid:0x1 zxid:0x36 txntype:-1 reqpath:n/a Error Path:/solr/overseer Error:KeeperErrorCode = NodeExists for /solr/overseer
[junit4:junit4]   2> 1651 T1137 oazs.PrepRequestProcessor.pRequest Got user-level KeeperException when processing sessionid:0x13d440b2f4a0008 type:create cxid:0x2 zxid:0x37 txntype:-1 reqpath:n/a Error Path:/solr/overseer Error:KeeperErrorCode = NodeExists for /solr/overseer
[junit4:junit4]   2> 1652 T1132 oascc.ZkStateReader.createClusterStateWatchersAndUpda

[...truncated too long message...]

 -Dtests.multiplier=3 -Dtests.slow=true -Dtests.locale=bg -Dtests.timezone=America/Nassau -Dtests.file.encoding=UTF-8
[junit4:junit4] ERROR   32.3s J1 | BasicDistributedZk2Test.testDistribSearch <<<
[junit4:junit4]    > Throwable #1: org.apache.solr.common.SolrException: Server at http://127.0.0.1:35097/fhb/f/onenodecollectioncore returned non ok status:404, message:Can not find: /fhb/f/onenodecollectioncore/update
[junit4:junit4]    > 	at __randomizedtesting.SeedInfo.seed([E8D2B859D380A4D3:69343641A4DFC4EF]:0)
[junit4:junit4]    > 	at org.apache.solr.client.solrj.impl.HttpSolrServer.request(HttpSolrServer.java:375)
[junit4:junit4]    > 	at org.apache.solr.client.solrj.impl.HttpSolrServer.request(HttpSolrServer.java:181)
[junit4:junit4]    > 	at org.apache.solr.client.solrj.request.AbstractUpdateRequest.process(AbstractUpdateRequest.java:117)
[junit4:junit4]    > 	at org.apache.solr.client.solrj.SolrServer.add(SolrServer.java:116)
[junit4:junit4]    > 	at org.apache.solr.client.solrj.SolrServer.add(SolrServer.java:102)
[junit4:junit4]    > 	at org.apache.solr.cloud.BasicDistributedZk2Test.testNodeWithoutCollectionForwarding(BasicDistributedZk2Test.java:196)
[junit4:junit4]    > 	at org.apache.solr.cloud.BasicDistributedZk2Test.doTest(BasicDistributedZk2Test.java:85)
[junit4:junit4]    > 	at org.apache.solr.BaseDistributedSearchTestCase.testDistribSearch(BaseDistributedSearchTestCase.java:806)
[junit4:junit4]    > 	at sun.reflect.NativeMethodAccessorImpl.invoke0(Native Method)
[junit4:junit4]    > 	at sun.reflect.NativeMethodAccessorImpl.invoke(NativeMethodAccessorImpl.java:57)
[junit4:junit4]    > 	at sun.reflect.DelegatingMethodAccessorImpl.invoke(DelegatingMethodAccessorImpl.java:43)
[junit4:junit4]    > 	at java.lang.reflect.Method.invoke(Method.java:487)
[junit4:junit4]    > 	at com.carrotsearch.randomizedtesting.RandomizedRunner.invoke(RandomizedRunner.java:1559)
[junit4:junit4]    > 	at com.carrotsearch.randomizedtesting.RandomizedRunner.access$600(RandomizedRunner.java:79)
[junit4:junit4]    > 	at com.carrotsearch.randomizedtesting.RandomizedRunner$6.evaluate(RandomizedRunner.java:737)
[junit4:junit4]    > 	at com.carrotsearch.randomizedtesting.RandomizedRunner$7.evaluate(RandomizedRunner.java:773)
[junit4:junit4]    > 	at com.carrotsearch.randomizedtesting.RandomizedRunner$8.evaluate(RandomizedRunner.java:787)
[junit4:junit4]    > 	at com.carrotsearch.randomizedtesting.rules.SystemPropertiesRestoreRule$1.evaluate(SystemPropertiesRestoreRule.java:53)
[junit4:junit4]    > 	at org.apache.lucene.util.TestRuleSetupTeardownChained$1.evaluate(TestRuleSetupTeardownChained.java:50)
[junit4:junit4]    > 	at org.apache.lucene.util.TestRuleFieldCacheSanity$1.evaluate(TestRuleFieldCacheSanity.java:51)
[junit4:junit4]    > 	at org.apache.lucene.util.AbstractBeforeAfterRule$1.evaluate(AbstractBeforeAfterRule.java:46)
[junit4:junit4]    > 	at com.carrotsearch.randomizedtesting.rules.SystemPropertiesInvariantRule$1.evaluate(SystemPropertiesInvariantRule.java:55)
[junit4:junit4]    > 	at org.apache.lucene.util.TestRuleThreadAndTestName$1.evaluate(TestRuleThreadAndTestName.java:49)
[junit4:junit4]    > 	at org.apache.lucene.util.TestRuleIgnoreAfterMaxFailures$1.evaluate(TestRuleIgnoreAfterMaxFailures.java:70)
[junit4:junit4]    > 	at org.apache.lucene.util.TestRuleMarkFailure$1.evaluate(TestRuleMarkFailure.java:48)
[junit4:junit4]    > 	at com.carrotsearch.randomizedtesting.rules.StatementAdapter.evaluate(StatementAdapter.java:36)
[junit4:junit4]    > 	at com.carrotsearch.randomizedtesting.ThreadLeakControl$StatementRunner.run(ThreadLeakControl.java:358)
[junit4:junit4]    > 	at com.carrotsearch.randomizedtesting.ThreadLeakControl.forkTimeoutingTask(ThreadLeakControl.java:782)
[junit4:junit4]    > 	at com.carrotsearch.randomizedtesting.ThreadLeakControl$3.evaluate(ThreadLeakControl.java:442)
[junit4:junit4]    > 	at com.carrotsearch.randomizedtesting.RandomizedRunner.runSingleTest(RandomizedRunner.java:746)
[junit4:junit4]    > 	at com.carrotsearch.randomizedtesting.RandomizedRunner$3.evaluate(RandomizedRunner.java:648)
[junit4:junit4]    > 	at com.carrotsearch.randomizedtesting.RandomizedRunner$4.evaluate(RandomizedRunner.java:682)
[junit4:junit4]    > 	at com.carrotsearch.randomizedtesting.RandomizedRunner$5.evaluate(RandomizedRunner.java:693)
[junit4:junit4]    > 	at com.carrotsearch.randomizedtesting.rules.StatementAdapter.evaluate(StatementAdapter.java:36)
[junit4:junit4]    > 	at com.carrotsearch.randomizedtesting.rules.SystemPropertiesRestoreRule$1.evaluate(SystemPropertiesRestoreRule.java:53)
[junit4:junit4]    > 	at org.apache.lucene.util.AbstractBeforeAfterRule$1.evaluate(AbstractBeforeAfterRule.java:46)
[junit4:junit4]    > 	at org.apache.lucene.util.TestRuleStoreClassName$1.evaluate(TestRuleStoreClassName.java:42)
[junit4:junit4]    > 	at com.carrotsearch.randomizedtesting.rules.SystemPropertiesInvariantRule$1.evaluate(SystemPropertiesInvariantRule.java:55)
[junit4:junit4]    > 	at com.carrotsearch.randomizedtesting.rules.NoShadowingOrOverridesOnMethodsRule$1.evaluate(NoShadowingOrOverridesOnMethodsRule.java:39)
[junit4:junit4]    > 	at com.carrotsearch.randomizedtesting.rules.NoShadowingOrOverridesOnMethodsRule$1.evaluate(NoShadowingOrOverridesOnMethodsRule.java:39)
[junit4:junit4]    > 	at com.carrotsearch.randomizedtesting.rules.StatementAdapter.evaluate(StatementAdapter.java:36)
[junit4:junit4]    > 	at org.apache.lucene.util.TestRuleAssertionsRequired$1.evaluate(TestRuleAssertionsRequired.java:43)
[junit4:junit4]    > 	at org.apache.lucene.util.TestRuleMarkFailure$1.evaluate(TestRuleMarkFailure.java:48)
[junit4:junit4]    > 	at org.apache.lucene.util.TestRuleIgnoreAfterMaxFailures$1.evaluate(TestRuleIgnoreAfterMaxFailures.java:70)
[junit4:junit4]    > 	at org.apache.lucene.util.TestRuleIgnoreTestSuites$1.evaluate(TestRuleIgnoreTestSuites.java:55)
[junit4:junit4]    > 	at com.carrotsearch.randomizedtesting.rules.StatementAdapter.evaluate(StatementAdapter.java:36)
[junit4:junit4]    > 	at com.carrotsearch.randomizedtesting.ThreadLeakControl$StatementRunner.run(ThreadLeakControl.java:358)
[junit4:junit4]    > 	at java.lang.Thread.run(Thread.java:722)
[junit4:junit4]   2> 32295 T2143 oas.SolrTestCaseJ4.deleteCore ###deleteCore
[junit4:junit4]   2> 32298 T2142 ccr.ThreadLeakControl.checkThreadLeaks WARNING Will linger awaiting termination of 2 leaked thread(s).
[junit4:junit4]   2> 32403 T2214 oascc.ZkStateReader$3.process WARNING ZooKeeper watch triggered, but Solr cannot talk to ZK
[junit4:junit4]   2> 32403 T2214 oascc.ZkStateReader$2.process A cluster state change: WatchedEvent state:SyncConnected type:NodeChildrenChanged path:/live_nodes, has occurred - updating... (live nodes size: 2)
[junit4:junit4]   2> 32403 T2214 oascc.ZkStateReader$2.process WARNING ZooKeeper watch triggered, but Solr cannot talk to ZK
[junit4:junit4]   2> 32403 T2214 oaz.ClientCnxn$EventThread.run EventThread shut down
[junit4:junit4]   2> 32571 T2146 oazs.SessionTrackerImpl.run SessionTrackerImpl exited loop!
[junit4:junit4]   2> NOTE: test params are: codec=Lucene3x, sim=DefaultSimilarity, locale=bg, timezone=America/Nassau
[junit4:junit4]   2> NOTE: Linux 3.2.0-38-generic amd64/Oracle Corporation 1.8.0-ea (64-bit)/cpus=8,threads=2,free=257909832,total=379584512
[junit4:junit4]   2> NOTE: All tests run in this JVM: [TestBinaryResponseWriter, QueryParsingTest, ShardRoutingTest, TestFastOutputStream, TestSolrXMLSerializer, TestPropInject, TestZkChroot, TestWordDelimiterFilterFactory, SliceStateUpdateTest, DirectSolrSpellCheckerTest, TestSolrQueryParser, OverseerTest, TestBinaryField, TestRandomDVFaceting, TestJmxMonitoredMap, LoggingHandlerTest, TestSolrJ, BadIndexSchemaTest, TestSort, TestSuggestSpellingConverter, AutoCommitTest, TestStressLucene, UpdateRequestProcessorFactoryTest, TestFaceting, TestDynamicFieldResource, OverseerCollectionProcessorTest, UpdateParamsTest, TermVectorComponentDistributedTest, TestPostingsSolrHighlighter, PrimitiveFieldTypeTest, TestSolr4Spatial, TestReload, TestStressReorder, TestCollationKeyRangeQueries, TestRTGBase, SpellCheckComponentTest, NoCacheHeaderTest, DocValuesTest, TestCodecSupport, SpellPossibilityIteratorTest, SuggesterTest, DocValuesMultiTest, TestDFRSimilarityFactory, NotRequiredUniqueKeyTest, FileUtilsTest, CopyFieldTest, SignatureUpdateProcessorFactoryTest, TestNumberUtils, SolrCmdDistributorTest, PeerSyncTest, TestMergePolicyConfig, IndexSchemaTest, TestBM25SimilarityFactory, ClusterStateUpdateTest, TestReversedWildcardFilterFactory, PingRequestHandlerTest, TestDefaultSimilarityFactory, ZkNodePropsTest, SolrIndexConfigTest, TestCSVLoader, DirectUpdateHandlerTest, BasicDistributedZkTest, BasicDistributedZk2Test]
[junit4:junit4] Completed on J1 in 32.82s, 1 test, 1 error <<< FAILURES!

[...truncated 415 lines...]
BUILD FAILED
/mnt/ssd/jenkins/workspace/Lucene-Solr-4.x-Linux/build.xml:381: The following error occurred while executing this line:
/mnt/ssd/jenkins/workspace/Lucene-Solr-4.x-Linux/build.xml:361: The following error occurred while executing this line:
/mnt/ssd/jenkins/workspace/Lucene-Solr-4.x-Linux/build.xml:39: The following error occurred while executing this line:
/mnt/ssd/jenkins/workspace/Lucene-Solr-4.x-Linux/solr/build.xml:183: The following error occurred while executing this line:
/mnt/ssd/jenkins/workspace/Lucene-Solr-4.x-Linux/solr/common-build.xml:449: The following error occurred while executing this line:
/mnt/ssd/jenkins/workspace/Lucene-Solr-4.x-Linux/lucene/common-build.xml:1213: The following error occurred while executing this line:
/mnt/ssd/jenkins/workspace/Lucene-Solr-4.x-Linux/lucene/common-build.xml:877: There were test failures: 268 suites, 1128 tests, 3 errors, 1 failure, 9 ignored (3 assumptions)

Total time: 55 minutes 36 seconds
Build step 'Invoke Ant' marked build as failure
Archiving artifacts
Recording test results
Description set: Java: 64bit/jdk1.8.0-ea-b79 -XX:+UseG1GC
Email was triggered for: Failure
Sending email for trigger: Failure



Mime
View raw message