lucene-dev mailing list archives

Site index · List index
Message view « Date » · « Thread »
Top « Date » · « Thread »
From Policeman Jenkins Server <jenk...@thetaphi.de>
Subject [JENKINS] Lucene-Solr-trunk-Linux (32bit/jdk1.8.0-ea-b79) - Build # 4774 - Still Failing!
Date Tue, 19 Mar 2013 09:20:15 GMT
Build: http://jenkins.thetaphi.de/job/Lucene-Solr-trunk-Linux/4774/
Java: 32bit/jdk1.8.0-ea-b79 -client -XX:+UseG1GC -XX:MarkStackSize=256K

2 tests failed.
REGRESSION:  org.apache.solr.cloud.UnloadDistributedZkTest.testDistribSearch

Error Message:
Still found shard2 in collection test_unload_shard_and_collection

Stack Trace:
java.lang.AssertionError: Still found shard2 in collection test_unload_shard_and_collection
	at __randomizedtesting.SeedInfo.seed([99BC8AE810382F7B:185A04F067674F47]:0)
	at org.junit.Assert.fail(Assert.java:93)
	at org.apache.solr.cloud.UnloadDistributedZkTest.testUnloadShardAndCollection(UnloadDistributedZkTest.java:124)
	at org.apache.solr.cloud.UnloadDistributedZkTest.doTest(UnloadDistributedZkTest.java:77)
	at org.apache.solr.BaseDistributedSearchTestCase.testDistribSearch(BaseDistributedSearchTestCase.java:806)
	at sun.reflect.NativeMethodAccessorImpl.invoke0(Native Method)
	at sun.reflect.NativeMethodAccessorImpl.invoke(NativeMethodAccessorImpl.java:57)
	at sun.reflect.DelegatingMethodAccessorImpl.invoke(DelegatingMethodAccessorImpl.java:43)
	at java.lang.reflect.Method.invoke(Method.java:487)
	at com.carrotsearch.randomizedtesting.RandomizedRunner.invoke(RandomizedRunner.java:1559)
	at com.carrotsearch.randomizedtesting.RandomizedRunner.access$600(RandomizedRunner.java:79)
	at com.carrotsearch.randomizedtesting.RandomizedRunner$6.evaluate(RandomizedRunner.java:737)
	at com.carrotsearch.randomizedtesting.RandomizedRunner$7.evaluate(RandomizedRunner.java:773)
	at com.carrotsearch.randomizedtesting.RandomizedRunner$8.evaluate(RandomizedRunner.java:787)
	at com.carrotsearch.randomizedtesting.rules.SystemPropertiesRestoreRule$1.evaluate(SystemPropertiesRestoreRule.java:53)
	at org.apache.lucene.util.TestRuleSetupTeardownChained$1.evaluate(TestRuleSetupTeardownChained.java:50)
	at org.apache.lucene.util.TestRuleFieldCacheSanity$1.evaluate(TestRuleFieldCacheSanity.java:51)
	at org.apache.lucene.util.AbstractBeforeAfterRule$1.evaluate(AbstractBeforeAfterRule.java:46)
	at com.carrotsearch.randomizedtesting.rules.SystemPropertiesInvariantRule$1.evaluate(SystemPropertiesInvariantRule.java:55)
	at org.apache.lucene.util.TestRuleThreadAndTestName$1.evaluate(TestRuleThreadAndTestName.java:49)
	at org.apache.lucene.util.TestRuleIgnoreAfterMaxFailures$1.evaluate(TestRuleIgnoreAfterMaxFailures.java:70)
	at org.apache.lucene.util.TestRuleMarkFailure$1.evaluate(TestRuleMarkFailure.java:48)
	at com.carrotsearch.randomizedtesting.rules.StatementAdapter.evaluate(StatementAdapter.java:36)
	at com.carrotsearch.randomizedtesting.ThreadLeakControl$StatementRunner.run(ThreadLeakControl.java:358)
	at com.carrotsearch.randomizedtesting.ThreadLeakControl.forkTimeoutingTask(ThreadLeakControl.java:782)
	at com.carrotsearch.randomizedtesting.ThreadLeakControl$3.evaluate(ThreadLeakControl.java:442)
	at com.carrotsearch.randomizedtesting.RandomizedRunner.runSingleTest(RandomizedRunner.java:746)
	at com.carrotsearch.randomizedtesting.RandomizedRunner$3.evaluate(RandomizedRunner.java:648)
	at com.carrotsearch.randomizedtesting.RandomizedRunner$4.evaluate(RandomizedRunner.java:682)
	at com.carrotsearch.randomizedtesting.RandomizedRunner$5.evaluate(RandomizedRunner.java:693)
	at com.carrotsearch.randomizedtesting.rules.StatementAdapter.evaluate(StatementAdapter.java:36)
	at com.carrotsearch.randomizedtesting.rules.SystemPropertiesRestoreRule$1.evaluate(SystemPropertiesRestoreRule.java:53)
	at org.apache.lucene.util.AbstractBeforeAfterRule$1.evaluate(AbstractBeforeAfterRule.java:46)
	at org.apache.lucene.util.TestRuleStoreClassName$1.evaluate(TestRuleStoreClassName.java:42)
	at com.carrotsearch.randomizedtesting.rules.SystemPropertiesInvariantRule$1.evaluate(SystemPropertiesInvariantRule.java:55)
	at com.carrotsearch.randomizedtesting.rules.NoShadowingOrOverridesOnMethodsRule$1.evaluate(NoShadowingOrOverridesOnMethodsRule.java:39)
	at com.carrotsearch.randomizedtesting.rules.NoShadowingOrOverridesOnMethodsRule$1.evaluate(NoShadowingOrOverridesOnMethodsRule.java:39)
	at com.carrotsearch.randomizedtesting.rules.StatementAdapter.evaluate(StatementAdapter.java:36)
	at org.apache.lucene.util.TestRuleAssertionsRequired$1.evaluate(TestRuleAssertionsRequired.java:43)
	at org.apache.lucene.util.TestRuleMarkFailure$1.evaluate(TestRuleMarkFailure.java:48)
	at org.apache.lucene.util.TestRuleIgnoreAfterMaxFailures$1.evaluate(TestRuleIgnoreAfterMaxFailures.java:70)
	at org.apache.lucene.util.TestRuleIgnoreTestSuites$1.evaluate(TestRuleIgnoreTestSuites.java:55)
	at com.carrotsearch.randomizedtesting.rules.StatementAdapter.evaluate(StatementAdapter.java:36)
	at com.carrotsearch.randomizedtesting.ThreadLeakControl$StatementRunner.run(ThreadLeakControl.java:358)
	at java.lang.Thread.run(Thread.java:722)


FAILED:  org.apache.solr.cloud.BasicDistributedZk2Test.testDistribSearch

Error Message:
Server at http://127.0.0.1:57845/onenodecollectioncore returned non ok status:404, message:Can not find: /onenodecollectioncore/update

Stack Trace:
org.apache.solr.common.SolrException: Server at http://127.0.0.1:57845/onenodecollectioncore returned non ok status:404, message:Can not find: /onenodecollectioncore/update
	at __randomizedtesting.SeedInfo.seed([99BC8AE810382F7B:185A04F067674F47]:0)
	at org.apache.solr.client.solrj.impl.HttpSolrServer.request(HttpSolrServer.java:375)
	at org.apache.solr.client.solrj.impl.HttpSolrServer.request(HttpSolrServer.java:181)
	at org.apache.solr.client.solrj.request.AbstractUpdateRequest.process(AbstractUpdateRequest.java:117)
	at org.apache.solr.client.solrj.SolrServer.add(SolrServer.java:116)
	at org.apache.solr.client.solrj.SolrServer.add(SolrServer.java:102)
	at org.apache.solr.cloud.BasicDistributedZk2Test.testNodeWithoutCollectionForwarding(BasicDistributedZk2Test.java:196)
	at org.apache.solr.cloud.BasicDistributedZk2Test.doTest(BasicDistributedZk2Test.java:89)
	at org.apache.solr.BaseDistributedSearchTestCase.testDistribSearch(BaseDistributedSearchTestCase.java:806)
	at sun.reflect.NativeMethodAccessorImpl.invoke0(Native Method)
	at sun.reflect.NativeMethodAccessorImpl.invoke(NativeMethodAccessorImpl.java:57)
	at sun.reflect.DelegatingMethodAccessorImpl.invoke(DelegatingMethodAccessorImpl.java:43)
	at java.lang.reflect.Method.invoke(Method.java:487)
	at com.carrotsearch.randomizedtesting.RandomizedRunner.invoke(RandomizedRunner.java:1559)
	at com.carrotsearch.randomizedtesting.RandomizedRunner.access$600(RandomizedRunner.java:79)
	at com.carrotsearch.randomizedtesting.RandomizedRunner$6.evaluate(RandomizedRunner.java:737)
	at com.carrotsearch.randomizedtesting.RandomizedRunner$7.evaluate(RandomizedRunner.java:773)
	at com.carrotsearch.randomizedtesting.RandomizedRunner$8.evaluate(RandomizedRunner.java:787)
	at com.carrotsearch.randomizedtesting.rules.SystemPropertiesRestoreRule$1.evaluate(SystemPropertiesRestoreRule.java:53)
	at org.apache.lucene.util.TestRuleSetupTeardownChained$1.evaluate(TestRuleSetupTeardownChained.java:50)
	at org.apache.lucene.util.TestRuleFieldCacheSanity$1.evaluate(TestRuleFieldCacheSanity.java:51)
	at org.apache.lucene.util.AbstractBeforeAfterRule$1.evaluate(AbstractBeforeAfterRule.java:46)
	at com.carrotsearch.randomizedtesting.rules.SystemPropertiesInvariantRule$1.evaluate(SystemPropertiesInvariantRule.java:55)
	at org.apache.lucene.util.TestRuleThreadAndTestName$1.evaluate(TestRuleThreadAndTestName.java:49)
	at org.apache.lucene.util.TestRuleIgnoreAfterMaxFailures$1.evaluate(TestRuleIgnoreAfterMaxFailures.java:70)
	at org.apache.lucene.util.TestRuleMarkFailure$1.evaluate(TestRuleMarkFailure.java:48)
	at com.carrotsearch.randomizedtesting.rules.StatementAdapter.evaluate(StatementAdapter.java:36)
	at com.carrotsearch.randomizedtesting.ThreadLeakControl$StatementRunner.run(ThreadLeakControl.java:358)
	at com.carrotsearch.randomizedtesting.ThreadLeakControl.forkTimeoutingTask(ThreadLeakControl.java:782)
	at com.carrotsearch.randomizedtesting.ThreadLeakControl$3.evaluate(ThreadLeakControl.java:442)
	at com.carrotsearch.randomizedtesting.RandomizedRunner.runSingleTest(RandomizedRunner.java:746)
	at com.carrotsearch.randomizedtesting.RandomizedRunner$3.evaluate(RandomizedRunner.java:648)
	at com.carrotsearch.randomizedtesting.RandomizedRunner$4.evaluate(RandomizedRunner.java:682)
	at com.carrotsearch.randomizedtesting.RandomizedRunner$5.evaluate(RandomizedRunner.java:693)
	at com.carrotsearch.randomizedtesting.rules.StatementAdapter.evaluate(StatementAdapter.java:36)
	at com.carrotsearch.randomizedtesting.rules.SystemPropertiesRestoreRule$1.evaluate(SystemPropertiesRestoreRule.java:53)
	at org.apache.lucene.util.AbstractBeforeAfterRule$1.evaluate(AbstractBeforeAfterRule.java:46)
	at org.apache.lucene.util.TestRuleStoreClassName$1.evaluate(TestRuleStoreClassName.java:42)
	at com.carrotsearch.randomizedtesting.rules.SystemPropertiesInvariantRule$1.evaluate(SystemPropertiesInvariantRule.java:55)
	at com.carrotsearch.randomizedtesting.rules.NoShadowingOrOverridesOnMethodsRule$1.evaluate(NoShadowingOrOverridesOnMethodsRule.java:39)
	at com.carrotsearch.randomizedtesting.rules.NoShadowingOrOverridesOnMethodsRule$1.evaluate(NoShadowingOrOverridesOnMethodsRule.java:39)
	at com.carrotsearch.randomizedtesting.rules.StatementAdapter.evaluate(StatementAdapter.java:36)
	at org.apache.lucene.util.TestRuleAssertionsRequired$1.evaluate(TestRuleAssertionsRequired.java:43)
	at org.apache.lucene.util.TestRuleMarkFailure$1.evaluate(TestRuleMarkFailure.java:48)
	at org.apache.lucene.util.TestRuleIgnoreAfterMaxFailures$1.evaluate(TestRuleIgnoreAfterMaxFailures.java:70)
	at org.apache.lucene.util.TestRuleIgnoreTestSuites$1.evaluate(TestRuleIgnoreTestSuites.java:55)
	at com.carrotsearch.randomizedtesting.rules.StatementAdapter.evaluate(StatementAdapter.java:36)
	at com.carrotsearch.randomizedtesting.ThreadLeakControl$StatementRunner.run(ThreadLeakControl.java:358)
	at java.lang.Thread.run(Thread.java:722)




Build Log:
[...truncated 8859 lines...]
[junit4:junit4] Suite: org.apache.solr.cloud.BasicDistributedZk2Test
[junit4:junit4]   2> 45 T10 oas.BaseDistributedSearchTestCase.initHostContext Setting hostContext system property: /
[junit4:junit4]   2> 74 T10 oas.SolrTestCaseJ4.setUp ###Starting testDistribSearch
[junit4:junit4]   2> Creating dataDir: /mnt/ssd/jenkins/workspace/Lucene-Solr-trunk-Linux/solr/build/solr-core/test/J1/./solrtest-BasicDistributedZk2Test-1363683628002
[junit4:junit4]   2> 77 T10 oasc.ZkTestServer.run STARTING ZK TEST SERVER
[junit4:junit4]   2> 80 T11 oasc.ZkTestServer$ZKServerMain.runFromConfig Starting server
[junit4:junit4]   2> 106 T11 oaz.Environment.logEnv Server environment:zookeeper.version=3.4.5-1392090, built on 09/30/2012 17:52 GMT
[junit4:junit4]   2> 107 T11 oaz.Environment.logEnv Server environment:host.name=serv1
[junit4:junit4]   2> 108 T11 oaz.Environment.logEnv Server environment:java.version=1.8.0-ea
[junit4:junit4]   2> 108 T11 oaz.Environment.logEnv Server environment:java.vendor=Oracle Corporation
[junit4:junit4]   2> 109 T11 oaz.Environment.logEnv Server environment:java.home=/var/lib/jenkins/tools/java/32bit/jdk1.8.0-ea-b79/jre
[junit4:junit4]   2> 109 T11 oaz.Environment.logEnv Server environment:java.class.path=/mnt/ssd/jenkins/workspace/Lucene-Solr-trunk-Linux/solr/build/solr-core/classes/test:/mnt/ssd/jenkins/workspace/Lucene-Solr-trunk-Linux/solr/build/solr-test-framework/classes/java:/mnt/ssd/jenkins/workspace/Lucene-Solr-trunk-Linux/solr/build/solr-core/test-files:/mnt/ssd/jenkins/workspace/Lucene-Solr-trunk-Linux/lucene/build/test-framework/classes/java:/mnt/ssd/jenkins/workspace/Lucene-Solr-trunk-Linux/lucene/build/codecs/classes/java:/mnt/ssd/jenkins/workspace/Lucene-Solr-trunk-Linux/solr/build/solr-solrj/classes/java:/mnt/ssd/jenkins/workspace/Lucene-Solr-trunk-Linux/solr/build/solr-core/classes/java:/mnt/ssd/jenkins/workspace/Lucene-Solr-trunk-Linux/lucene/build/analysis/common/lucene-analyzers-common-5.0-SNAPSHOT.jar:/mnt/ssd/jenkins/workspace/Lucene-Solr-trunk-Linux/lucene/build/analysis/kuromoji/lucene-analyzers-kuromoji-5.0-SNAPSHOT.jar:/mnt/ssd/jenkins/workspace/Lucene-Solr-trunk-Linux/lucene/build/analysis/phonetic/lucene-analyzers-phonetic-5.0-SNAPSHOT.jar:/mnt/ssd/jenkins/workspace/Lucene-Solr-trunk-Linux/lucene/build/codecs/lucene-codecs-5.0-SNAPSHOT.jar:/mnt/ssd/jenkins/workspace/Lucene-Solr-trunk-Linux/lucene/build/highlighter/lucene-highlighter-5.0-SNAPSHOT.jar:/mnt/ssd/jenkins/workspace/Lucene-Solr-trunk-Linux/lucene/build/memory/lucene-memory-5.0-SNAPSHOT.jar:/mnt/ssd/jenkins/workspace/Lucene-Solr-trunk-Linux/lucene/build/misc/lucene-misc-5.0-SNAPSHOT.jar:/mnt/ssd/jenkins/workspace/Lucene-Solr-trunk-Linux/lucene/build/spatial/lucene-spatial-5.0-SNAPSHOT.jar:/mnt/ssd/jenkins/workspace/Lucene-Solr-trunk-Linux/lucene/build/suggest/lucene-suggest-5.0-SNAPSHOT.jar:/mnt/ssd/jenkins/workspace/Lucene-Solr-trunk-Linux/lucene/build/grouping/lucene-grouping-5.0-SNAPSHOT.jar:/mnt/ssd/jenkins/workspace/Lucene-Solr-trunk-Linux/lucene/build/queries/lucene-queries-5.0-SNAPSHOT.jar:/mnt/ssd/jenkins/workspace/Lucene-Solr-trunk-Linux/lucene/build/queryparser/lucene-queryparser-5.0-SNAPSHOT.jar:/mnt/ssd/jenkins/workspace/Lucene-Solr-trunk-Linux/solr/core/lib/cglib-nodep-2.2.jar:/mnt/ssd/jenkins/workspace/Lucene-Solr-trunk-Linux/solr/core/lib/commons-cli-1.2.jar:/mnt/ssd/jenkins/workspace/Lucene-Solr-trunk-Linux/solr/core/lib/commons-codec-1.7.jar:/mnt/ssd/jenkins/workspace/Lucene-Solr-trunk-Linux/solr/core/lib/commons-fileupload-1.2.1.jar:/mnt/ssd/jenkins/workspace/Lucene-Solr-trunk-Linux/solr/core/lib/commons-lang-2.6.jar:/mnt/ssd/jenkins/workspace/Lucene-Solr-trunk-Linux/solr/core/lib/easymock-3.0.jar:/mnt/ssd/jenkins/workspace/Lucene-Solr-trunk-Linux/solr/core/lib/guava-13.0.1.jar:/mnt/ssd/jenkins/workspace/Lucene-Solr-trunk-Linux/solr/core/lib/javax.servlet-api-3.0.1.jar:/mnt/ssd/jenkins/workspace/Lucene-Solr-trunk-Linux/solr/core/lib/objenesis-1.2.jar:/mnt/ssd/jenkins/workspace/Lucene-Solr-trunk-Linux/solr/core/lib/org.restlet-2.1.1.jar:/mnt/ssd/jenkins/workspace/Lucene-Solr-trunk-Linux/solr/core/lib/org.restlet.ext.servlet-2.1.1.jar:/mnt/ssd/jenkins/workspace/Lucene-Solr-trunk-Linux/solr/core/lib/spatial4j-0.3.jar:/mnt/ssd/jenkins/workspace/Lucene-Solr-trunk-Linux/solr/solrj/lib/commons-io-2.1.jar:/mnt/ssd/jenkins/workspace/Lucene-Solr-trunk-Linux/solr/solrj/lib/httpclient-4.2.3.jar:/mnt/ssd/jenkins/workspace/Lucene-Solr-trunk-Linux/solr/solrj/lib/httpcore-4.2.2.jar:/mnt/ssd/jenkins/workspace/Lucene-Solr-trunk-Linux/solr/solrj/lib/httpmime-4.2.3.jar:/mnt/ssd/jenkins/workspace/Lucene-Solr-trunk-Linux/solr/solrj/lib/jcl-over-slf4j-1.6.4.jar:/mnt/ssd/jenkins/workspace/Lucene-Solr-trunk-Linux/solr/solrj/lib/noggit-0.5.jar:/mnt/ssd/jenkins/workspace/Lucene-Solr-trunk-Linux/solr/solrj/lib/slf4j-api-1.6.4.jar:/mnt/ssd/jenkins/workspace/Lucene-Solr-trunk-Linux/solr/solrj/lib/slf4j-jdk14-1.6.4.jar:/mnt/ssd/jenkins/workspace/Lucene-Solr-trunk-Linux/solr/solrj/lib/wstx-asl-3.2.7.jar:/mnt/ssd/jenkins/workspace/Lucene-Solr-trunk-Linux/solr/solrj/lib/zookeeper-3.4.5.jar:/mnt/ssd/jenkins/workspace/Lucene-Solr-trunk-Linux/solr/example/lib/jetty-continuation-8.1.8.v20121106.jar:/mnt/ssd/jenkins/workspace/Lucene-Solr-trunk-Linux/solr/example/lib/jetty-deploy-8.1.8.v20121106.jar:/mnt/ssd/jenkins/workspace/Lucene-Solr-trunk-Linux/solr/example/lib/jetty-http-8.1.8.v20121106.jar:/mnt/ssd/jenkins/workspace/Lucene-Solr-trunk-Linux/solr/example/lib/jetty-io-8.1.8.v20121106.jar:/mnt/ssd/jenkins/workspace/Lucene-Solr-trunk-Linux/solr/example/lib/jetty-jmx-8.1.8.v20121106.jar:/mnt/ssd/jenkins/workspace/Lucene-Solr-trunk-Linux/solr/example/lib/jetty-security-8.1.8.v20121106.jar:/mnt/ssd/jenkins/workspace/Lucene-Solr-trunk-Linux/solr/example/lib/jetty-server-8.1.8.v20121106.jar:/mnt/ssd/jenkins/workspace/Lucene-Solr-trunk-Linux/solr/example/lib/jetty-servlet-8.1.8.v20121106.jar:/mnt/ssd/jenkins/workspace/Lucene-Solr-trunk-Linux/solr/example/lib/jetty-util-8.1.8.v20121106.jar:/mnt/ssd/jenkins/workspace/Lucene-Solr-trunk-Linux/solr/example/lib/jetty-webapp-8.1.8.v20121106.jar:/mnt/ssd/jenkins/workspace/Lucene-Solr-trunk-Linux/solr/example/lib/jetty-xml-8.1.8.v20121106.jar:/mnt/ssd/jenkins/workspace/Lucene-Solr-trunk-Linux/solr/example/lib/servlet-api-3.0.jar:/mnt/ssd/jenkins/workspace/Lucene-Solr-trunk-Linux/solr/example/example-DIH/solr/db/lib/derby-10.9.1.0.jar:/mnt/ssd/jenkins/workspace/Lucene-Solr-trunk-Linux/solr/example/example-DIH/solr/db/lib/hsqldb-1.8.0.10.jar:/mnt/ssd/jenkins/workspace/Lucene-Solr-trunk-Linux/lucene/build/core/classes/java:/mnt/ssd/jenkins/workspace/Lucene-Solr-trunk-Linux/lucene/test-framework/lib/junit-4.10.jar:/mnt/ssd/jenkins/workspace/Lucene-Solr-trunk-Linux/lucene/test-framework/lib/randomizedtesting-runner-2.0.8.jar:/var/lib/jenkins/tools/hudson.tasks.Ant_AntInstallation/ANT_1.8.2/lib/ant-launcher.jar:/var/lib/jenkins/.ant/lib/ivy-2.3.0.jar:/var/lib/jenkins/tools/hudson.tasks.Ant_AntInstallation/ANT_1.8.2/lib/ant-jai.jar:/var/lib/jenkins/tools/hudson.tasks.Ant_AntInstallation/ANT_1.8.2/lib/ant-swing.jar:/var/lib/jenkins/tools/hudson.tasks.Ant_AntInstallation/ANT_1.8.2/lib/ant-apache-oro.jar:/var/lib/jenkins/tools/hudson.tasks.Ant_AntInstallation/ANT_1.8.2/lib/ant-jmf.jar:/var/lib/jenkins/tools/hudson.tasks.Ant_AntInstallation/ANT_1.8.2/lib/ant-apache-xalan2.jar:/var/lib/jenkins/tools/hudson.tasks.Ant_AntInstallation/ANT_1.8.2/lib/ant-javamail.jar:/var/lib/jenkins/tools/hudson.tasks.Ant_AntInstallation/ANT_1.8.2/lib/ant-apache-resolver.jar:/var/lib/jenkins/tools/hudson.tasks.Ant_AntInstallation/ANT_1.8.2/lib/ant-testutil.jar:/var/lib/jenkins/tools/hudson.tasks.Ant_AntInstallation/ANT_1.8.2/lib/ant-commons-logging.jar:/var/lib/jenkins/tools/hudson.tasks.Ant_AntInstallation/ANT_1.8.2/lib/ant-apache-log4j.jar:/var/lib/jenkins/tools/hudson.tasks.Ant_AntInstallation/ANT_1.8.2/lib/ant-junit.jar:/var/lib/jenkins/tools/hudson.tasks.Ant_AntInstallation/ANT_1.8.2/lib/ant-jsch.jar:/var/lib/jenkins/tools/hudson.tasks.Ant_AntInstallation/ANT_1.8.2/lib/ant-commons-net.jar:/var/lib/jenkins/tools/hudson.tasks.Ant_AntInstallation/ANT_1.8.2/lib/ant-apache-bsf.jar:/var/lib/jenkins/tools/hudson.tasks.Ant_AntInstallation/ANT_1.8.2/lib/ant-jdepend.jar:/var/lib/jenkins/tools/hudson.tasks.Ant_AntInstallation/ANT_1.8.2/lib/ant-netrexx.jar:/var/lib/jenkins/tools/hudson.tasks.Ant_AntInstallation/ANT_1.8.2/lib/ant-apache-regexp.jar:/var/lib/jenkins/tools/hudson.tasks.Ant_AntInstallation/ANT_1.8.2/lib/ant-junit4.jar:/var/lib/jenkins/tools/hudson.tasks.Ant_AntInstallation/ANT_1.8.2/lib/ant.jar:/var/lib/jenkins/tools/hudson.tasks.Ant_AntInstallation/ANT_1.8.2/lib/ant-apache-bcel.jar:/var/lib/jenkins/tools/hudson.tasks.Ant_AntInstallation/ANT_1.8.2/lib/ant-antlr.jar:/var/lib/jenkins/tools/java/32bit/jdk1.8.0-ea-b79/lib/tools.jar:/var/lib/jenkins/.ivy2/cache/com.carrotsearch.randomizedtesting/junit4-ant/jars/junit4-ant-2.0.8.jar
[junit4:junit4]   2> 112 T11 oaz.Environment.logEnv Server environment:java.library.path=/usr/java/packages/lib/i386:/lib:/usr/lib
[junit4:junit4]   2> 112 T11 oaz.Environment.logEnv Server environment:java.io.tmpdir=.
[junit4:junit4]   2> 113 T11 oaz.Environment.logEnv Server environment:java.compiler=<NA>
[junit4:junit4]   2> 113 T11 oaz.Environment.logEnv Server environment:os.name=Linux
[junit4:junit4]   2> 114 T11 oaz.Environment.logEnv Server environment:os.arch=i386
[junit4:junit4]   2> 114 T11 oaz.Environment.logEnv Server environment:os.version=3.2.0-38-generic
[junit4:junit4]   2> 115 T11 oaz.Environment.logEnv Server environment:user.name=jenkins
[junit4:junit4]   2> 115 T11 oaz.Environment.logEnv Server environment:user.home=/var/lib/jenkins
[junit4:junit4]   2> 116 T11 oaz.Environment.logEnv Server environment:user.dir=/mnt/ssd/jenkins/workspace/Lucene-Solr-trunk-Linux/solr/build/solr-core/test/J1
[junit4:junit4]   2> 134 T11 oazs.ZooKeeperServer.setTickTime tickTime set to 1000
[junit4:junit4]   2> 135 T11 oazs.ZooKeeperServer.setMinSessionTimeout minSessionTimeout set to -1
[junit4:junit4]   2> 135 T11 oazs.ZooKeeperServer.setMaxSessionTimeout maxSessionTimeout set to -1
[junit4:junit4]   2> 150 T11 oazs.NIOServerCnxnFactory.configure binding to port 0.0.0.0/0.0.0.0:0
[junit4:junit4]   2> 180 T10 oasc.ZkTestServer.run start zk server on port:35704
[junit4:junit4]   2> 193 T11 oazsp.FileTxnSnapLog.save Snapshotting: 0x0 to /mnt/ssd/jenkins/workspace/Lucene-Solr-trunk-Linux/solr/build/solr-core/test/J1/./org.apache.solr.cloud.BasicDistributedZk2Test-1363683628001/zookeeper/server1/data/version-2/snapshot.0
[junit4:junit4]   2> 213 T10 oaz.Environment.logEnv Client environment:zookeeper.version=3.4.5-1392090, built on 09/30/2012 17:52 GMT
[junit4:junit4]   2> 214 T10 oaz.Environment.logEnv Client environment:host.name=serv1
[junit4:junit4]   2> 217 T10 oaz.Environment.logEnv Client environment:java.version=1.8.0-ea
[junit4:junit4]   2> 218 T10 oaz.Environment.logEnv Client environment:java.vendor=Oracle Corporation
[junit4:junit4]   2> 219 T10 oaz.Environment.logEnv Client environment:java.home=/var/lib/jenkins/tools/java/32bit/jdk1.8.0-ea-b79/jre
[junit4:junit4]   2> 219 T10 oaz.Environment.logEnv Client environment:java.class.path=/mnt/ssd/jenkins/workspace/Lucene-Solr-trunk-Linux/solr/build/solr-core/classes/test:/mnt/ssd/jenkins/workspace/Lucene-Solr-trunk-Linux/solr/build/solr-test-framework/classes/java:/mnt/ssd/jenkins/workspace/Lucene-Solr-trunk-Linux/solr/build/solr-core/test-files:/mnt/ssd/jenkins/workspace/Lucene-Solr-trunk-Linux/lucene/build/test-framework/classes/java:/mnt/ssd/jenkins/workspace/Lucene-Solr-trunk-Linux/lucene/build/codecs/classes/java:/mnt/ssd/jenkins/workspace/Lucene-Solr-trunk-Linux/solr/build/solr-solrj/classes/java:/mnt/ssd/jenkins/workspace/Lucene-Solr-trunk-Linux/solr/build/solr-core/classes/java:/mnt/ssd/jenkins/workspace/Lucene-Solr-trunk-Linux/lucene/build/analysis/common/lucene-analyzers-common-5.0-SNAPSHOT.jar:/mnt/ssd/jenkins/workspace/Lucene-Solr-trunk-Linux/lucene/build/analysis/kuromoji/lucene-analyzers-kuromoji-5.0-SNAPSHOT.jar:/mnt/ssd/jenkins/workspace/Lucene-Solr-trunk-Linux/lucene/build/analysis/phonetic/lucene-analyzers-phonetic-5.0-SNAPSHOT.jar:/mnt/ssd/jenkins/workspace/Lucene-Solr-trunk-Linux/lucene/build/codecs/lucene-codecs-5.0-SNAPSHOT.jar:/mnt/ssd/jenkins/workspace/Lucene-Solr-trunk-Linux/lucene/build/highlighter/lucene-highlighter-5.0-SNAPSHOT.jar:/mnt/ssd/jenkins/workspace/Lucene-Solr-trunk-Linux/lucene/build/memory/lucene-memory-5.0-SNAPSHOT.jar:/mnt/ssd/jenkins/workspace/Lucene-Solr-trunk-Linux/lucene/build/misc/lucene-misc-5.0-SNAPSHOT.jar:/mnt/ssd/jenkins/workspace/Lucene-Solr-trunk-Linux/lucene/build/spatial/lucene-spatial-5.0-SNAPSHOT.jar:/mnt/ssd/jenkins/workspace/Lucene-Solr-trunk-Linux/lucene/build/suggest/lucene-suggest-5.0-SNAPSHOT.jar:/mnt/ssd/jenkins/workspace/Lucene-Solr-trunk-Linux/lucene/build/grouping/lucene-grouping-5.0-SNAPSHOT.jar:/mnt/ssd/jenkins/workspace/Lucene-Solr-trunk-Linux/lucene/build/queries/lucene-queries-5.0-SNAPSHOT.jar:/mnt/ssd/jenkins/workspace/Lucene-Solr-trunk-Linux/lucene/build/queryparser/lucene-queryparser-5.0-SNAPSHOT.jar:/mnt/ssd/jenkins/workspace/Lucene-Solr-trunk-Linux/solr/core/lib/cglib-nodep-2.2.jar:/mnt/ssd/jenkins/workspace/Lucene-Solr-trunk-Linux/solr/core/lib/commons-cli-1.2.jar:/mnt/ssd/jenkins/workspace/Lucene-Solr-trunk-Linux/solr/core/lib/commons-codec-1.7.jar:/mnt/ssd/jenkins/workspace/Lucene-Solr-trunk-Linux/solr/core/lib/commons-fileupload-1.2.1.jar:/mnt/ssd/jenkins/workspace/Lucene-Solr-trunk-Linux/solr/core/lib/commons-lang-2.6.jar:/mnt/ssd/jenkins/workspace/Lucene-Solr-trunk-Linux/solr/core/lib/easymock-3.0.jar:/mnt/ssd/jenkins/workspace/Lucene-Solr-trunk-Linux/solr/core/lib/guava-13.0.1.jar:/mnt/ssd/jenkins/workspace/Lucene-Solr-trunk-Linux/solr/core/lib/javax.servlet-api-3.0.1.jar:/mnt/ssd/jenkins/workspace/Lucene-Solr-trunk-Linux/solr/core/lib/objenesis-1.2.jar:/mnt/ssd/jenkins/workspace/Lucene-Solr-trunk-Linux/solr/core/lib/org.restlet-2.1.1.jar:/mnt/ssd/jenkins/workspace/Lucene-Solr-trunk-Linux/solr/core/lib/org.restlet.ext.servlet-2.1.1.jar:/mnt/ssd/jenkins/workspace/Lucene-Solr-trunk-Linux/solr/core/lib/spatial4j-0.3.jar:/mnt/ssd/jenkins/workspace/Lucene-Solr-trunk-Linux/solr/solrj/lib/commons-io-2.1.jar:/mnt/ssd/jenkins/workspace/Lucene-Solr-trunk-Linux/solr/solrj/lib/httpclient-4.2.3.jar:/mnt/ssd/jenkins/workspace/Lucene-Solr-trunk-Linux/solr/solrj/lib/httpcore-4.2.2.jar:/mnt/ssd/jenkins/workspace/Lucene-Solr-trunk-Linux/solr/solrj/lib/httpmime-4.2.3.jar:/mnt/ssd/jenkins/workspace/Lucene-Solr-trunk-Linux/solr/solrj/lib/jcl-over-slf4j-1.6.4.jar:/mnt/ssd/jenkins/workspace/Lucene-Solr-trunk-Linux/solr/solrj/lib/noggit-0.5.jar:/mnt/ssd/jenkins/workspace/Lucene-Solr-trunk-Linux/solr/solrj/lib/slf4j-api-1.6.4.jar:/mnt/ssd/jenkins/workspace/Lucene-Solr-trunk-Linux/solr/solrj/lib/slf4j-jdk14-1.6.4.jar:/mnt/ssd/jenkins/workspace/Lucene-Solr-trunk-Linux/solr/solrj/lib/wstx-asl-3.2.7.jar:/mnt/ssd/jenkins/workspace/Lucene-Solr-trunk-Linux/solr/solrj/lib/zookeeper-3.4.5.jar:/mnt/ssd/jenkins/workspace/Lucene-Solr-trunk-Linux/solr/example/lib/jetty-continuation-8.1.8.v20121106.jar:/mnt/ssd/jenkins/workspace/Lucene-Solr-trunk-Linux/solr/example/lib/jetty-deploy-8.1.8.v20121106.jar:/mnt/ssd/jenkins/workspace/Lucene-Solr-trunk-Linux/solr/example/lib/jetty-http-8.1.8.v20121106.jar:/mnt/ssd/jenkins/workspace/Lucene-Solr-trunk-Linux/solr/example/lib/jetty-io-8.1.8.v20121106.jar:/mnt/ssd/jenkins/workspace/Lucene-Solr-trunk-Linux/solr/example/lib/jetty-jmx-8.1.8.v20121106.jar:/mnt/ssd/jenkins/workspace/Lucene-Solr-trunk-Linux/solr/example/lib/jetty-security-8.1.8.v20121106.jar:/mnt/ssd/jenkins/workspace/Lucene-Solr-trunk-Linux/solr/example/lib/jetty-server-8.1.8.v20121106.jar:/mnt/ssd/jenkins/workspace/Lucene-Solr-trunk-Linux/solr/example/lib/jetty-servlet-8.1.8.v20121106.jar:/mnt/ssd/jenkins/workspace/Lucene-Solr-trunk-Linux/solr/example/lib/jetty-util-8.1.8.v20121106.jar:/mnt/ssd/jenkins/workspace/Lucene-Solr-trunk-Linux/solr/example/lib/jetty-webapp-8.1.8.v20121106.jar:/mnt/ssd/jenkins/workspace/Lucene-Solr-trunk-Linux/solr/example/lib/jetty-xml-8.1.8.v20121106.jar:/mnt/ssd/jenkins/workspace/Lucene-Solr-trunk-Linux/solr/example/lib/servlet-api-3.0.jar:/mnt/ssd/jenkins/workspace/Lucene-Solr-trunk-Linux/solr/example/example-DIH/solr/db/lib/derby-10.9.1.0.jar:/mnt/ssd/jenkins/workspace/Lucene-Solr-trunk-Linux/solr/example/example-DIH/solr/db/lib/hsqldb-1.8.0.10.jar:/mnt/ssd/jenkins/workspace/Lucene-Solr-trunk-Linux/lucene/build/core/classes/java:/mnt/ssd/jenkins/workspace/Lucene-Solr-trunk-Linux/lucene/test-framework/lib/junit-4.10.jar:/mnt/ssd/jenkins/workspace/Lucene-Solr-trunk-Linux/lucene/test-framework/lib/randomizedtesting-runner-2.0.8.jar:/var/lib/jenkins/tools/hudson.tasks.Ant_AntInstallation/ANT_1.8.2/lib/ant-launcher.jar:/var/lib/jenkins/.ant/lib/ivy-2.3.0.jar:/var/lib/jenkins/tools/hudson.tasks.Ant_AntInstallation/ANT_1.8.2/lib/ant-jai.jar:/var/lib/jenkins/tools/hudson.tasks.Ant_AntInstallation/ANT_1.8.2/lib/ant-swing.jar:/var/lib/jenkins/tools/hudson.tasks.Ant_AntInstallation/ANT_1.8.2/lib/ant-apache-oro.jar:/var/lib/jenkins/tools/hudson.tasks.Ant_AntInstallation/ANT_1.8.2/lib/ant-jmf.jar:/var/lib/jenkins/tools/hudson.tasks.Ant_AntInstallation/ANT_1.8.2/lib/ant-apache-xalan2.jar:/var/lib/jenkins/tools/hudson.tasks.Ant_AntInstallation/ANT_1.8.2/lib/ant-javamail.jar:/var/lib/jenkins/tools/hudson.tasks.Ant_AntInstallation/ANT_1.8.2/lib/ant-apache-resolver.jar:/var/lib/jenkins/tools/hudson.tasks.Ant_AntInstallation/ANT_1.8.2/lib/ant-testutil.jar:/var/lib/jenkins/tools/hudson.tasks.Ant_AntInstallation/ANT_1.8.2/lib/ant-commons-logging.jar:/var/lib/jenkins/tools/hudson.tasks.Ant_AntInstallation/ANT_1.8.2/lib/ant-apache-log4j.jar:/var/lib/jenkins/tools/hudson.tasks.Ant_AntInstallation/ANT_1.8.2/lib/ant-junit.jar:/var/lib/jenkins/tools/hudson.tasks.Ant_AntInstallation/ANT_1.8.2/lib/ant-jsch.jar:/var/lib/jenkins/tools/hudson.tasks.Ant_AntInstallation/ANT_1.8.2/lib/ant-commons-net.jar:/var/lib/jenkins/tools/hudson.tasks.Ant_AntInstallation/ANT_1.8.2/lib/ant-apache-bsf.jar:/var/lib/jenkins/tools/hudson.tasks.Ant_AntInstallation/ANT_1.8.2/lib/ant-jdepend.jar:/var/lib/jenkins/tools/hudson.tasks.Ant_AntInstallation/ANT_1.8.2/lib/ant-netrexx.jar:/var/lib/jenkins/tools/hudson.tasks.Ant_AntInstallation/ANT_1.8.2/lib/ant-apache-regexp.jar:/var/lib/jenkins/tools/hudson.tasks.Ant_AntInstallation/ANT_1.8.2/lib/ant-junit4.jar:/var/lib/jenkins/tools/hudson.tasks.Ant_AntInstallation/ANT_1.8.2/lib/ant.jar:/var/lib/jenkins/tools/hudson.tasks.Ant_AntInstallation/ANT_1.8.2/lib/ant-apache-bcel.jar:/var/lib/jenkins/tools/hudson.tasks.Ant_AntInstallation/ANT_1.8.2/lib/ant-antlr.jar:/var/lib/jenkins/tools/java/32bit/jdk1.8.0-ea-b79/lib/tools.jar:/var/lib/jenkins/.ivy2/cache/com.carrotsearch.randomizedtesting/junit4-ant/jars/junit4-ant-2.0.8.jar
[junit4:junit4]   2> 221 T10 oaz.Environment.logEnv Client environment:java.library.path=/usr/java/packages/lib/i386:/lib:/usr/lib
[junit4:junit4]   2> 225 T10 oaz.Environment.logEnv Client environment:java.io.tmpdir=.
[junit4:junit4]   2> 225 T10 oaz.Environment.logEnv Client environment:java.compiler=<NA>
[junit4:junit4]   2> 226 T10 oaz.Environment.logEnv Client environment:os.name=Linux
[junit4:junit4]   2> 227 T10 oaz.Environment.logEnv Client environment:os.arch=i386
[junit4:junit4]   2> 227 T10 oaz.Environment.logEnv Client environment:os.version=3.2.0-38-generic
[junit4:junit4]   2> 228 T10 oaz.Environment.logEnv Client environment:user.name=jenkins
[junit4:junit4]   2> 229 T10 oaz.Environment.logEnv Client environment:user.home=/var/lib/jenkins
[junit4:junit4]   2> 229 T10 oaz.Environment.logEnv Client environment:user.dir=/mnt/ssd/jenkins/workspace/Lucene-Solr-trunk-Linux/solr/build/solr-core/test/J1
[junit4:junit4]   2> 232 T10 oaz.ZooKeeper.<init> Initiating client connection, connectString=127.0.0.1:35704 sessionTimeout=10000 watcher=org.apache.solr.common.cloud.ConnectionManager@60a68b
[junit4:junit4]   2> 271 T10 oascc.ConnectionManager.waitForConnected Waiting for client to connect to ZooKeeper
[junit4:junit4]   2> 276 T16 oaz.ClientCnxn$SendThread.logStartConnect Opening socket connection to server localhost.localdomain/127.0.0.1:35704. Will not attempt to authenticate using SASL (access denied ("javax.security.auth.AuthPermission" "getLoginConfiguration"))
[junit4:junit4]   2> 279 T16 oaz.ClientCnxn$SendThread.primeConnection Socket connection established to localhost.localdomain/127.0.0.1:35704, initiating session
[junit4:junit4]   2> 1720 T12 oazs.NIOServerCnxnFactory.run Accepted socket connection from /127.0.0.1:54821
[junit4:junit4]   2> 1732 T12 oazs.ZooKeeperServer.processConnectRequest Client attempting to establish new session at /127.0.0.1:54821
[junit4:junit4]   2> 1738 T14 oazsp.FileTxnLog.append Creating new log file: log.1
[junit4:junit4]   2> 1750 T14 oazs.ZooKeeperServer.finishSessionInit Established session 0x13d81e0d4620000 with negotiated timeout 10000 for client /127.0.0.1:54821
[junit4:junit4]   2> 1750 T16 oaz.ClientCnxn$SendThread.onConnected Session establishment complete on server localhost.localdomain/127.0.0.1:35704, sessionid = 0x13d81e0d4620000, negotiated timeout = 10000
[junit4:junit4]   2> 1753 T17 oascc.ConnectionManager.process Watcher org.apache.solr.common.cloud.ConnectionManager@60a68b name:ZooKeeperConnection Watcher:127.0.0.1:35704 got event WatchedEvent state:SyncConnected type:None path:null path:null type:None
[junit4:junit4]   2> 1753 T10 oascc.ConnectionManager.waitForConnected Client is connected to ZooKeeper
[junit4:junit4]   2> 1754 T10 oascc.SolrZkClient.makePath makePath: /solr
[junit4:junit4]   2> 1781 T15 oazs.PrepRequestProcessor.pRequest2Txn Processed session termination for sessionid: 0x13d81e0d4620000
[junit4:junit4]   2> 1782 T17 oaz.ClientCnxn$EventThread.run EventThread shut down
[junit4:junit4]   2> 1782 T10 oaz.ZooKeeper.close Session: 0x13d81e0d4620000 closed
[junit4:junit4]   2> 1782 T10 oaz.ZooKeeper.<init> Initiating client connection, connectString=127.0.0.1:35704/solr sessionTimeout=10000 watcher=org.apache.solr.common.cloud.ConnectionManager@917476
[junit4:junit4]   2> 1783 T12 oazs.NIOServerCnxn.closeSock Closed socket connection for client /127.0.0.1:54821 which had sessionid 0x13d81e0d4620000
[junit4:junit4]   2> 1784 T10 oascc.ConnectionManager.waitForConnected Waiting for client to connect to ZooKeeper
[junit4:junit4]   2> 1784 T18 oaz.ClientCnxn$SendThread.logStartConnect Opening socket connection to server localhost.localdomain/127.0.0.1:35704. Will not attempt to authenticate using SASL (access denied ("javax.security.auth.AuthPermission" "getLoginConfiguration"))
[junit4:junit4]   2> 1785 T18 oaz.ClientCnxn$SendThread.primeConnection Socket connection established to localhost.localdomain/127.0.0.1:35704, initiating session
[junit4:junit4]   2> 1785 T12 oazs.NIOServerCnxnFactory.run Accepted socket connection from /127.0.0.1:54822
[junit4:junit4]   2> 1786 T12 oazs.ZooKeeperServer.processConnectRequest Client attempting to establish new session at /127.0.0.1:54822
[junit4:junit4]   2> 1786 T14 oazs.ZooKeeperServer.finishSessionInit Established session 0x13d81e0d4620001 with negotiated timeout 10000 for client /127.0.0.1:54822
[junit4:junit4]   2> 1787 T18 oaz.ClientCnxn$SendThread.onConnected Session establishment complete on server localhost.localdomain/127.0.0.1:35704, sessionid = 0x13d81e0d4620001, negotiated timeout = 10000
[junit4:junit4]   2> 1787 T19 oascc.ConnectionManager.process Watcher org.apache.solr.common.cloud.ConnectionManager@917476 name:ZooKeeperConnection Watcher:127.0.0.1:35704/solr got event WatchedEvent state:SyncConnected type:None path:null path:null type:None
[junit4:junit4]   2> 1788 T10 oascc.ConnectionManager.waitForConnected Client is connected to ZooKeeper
[junit4:junit4]   2> 1794 T10 oascc.SolrZkClient.makePath makePath: /collections/collection1
[junit4:junit4]   2> 1798 T10 oascc.SolrZkClient.makePath makePath: /collections/collection1/shards
[junit4:junit4]   2> 1802 T10 oascc.SolrZkClient.makePath makePath: /collections/control_collection
[junit4:junit4]   2> 1806 T10 oascc.SolrZkClient.makePath makePath: /collections/control_collection/shards
[junit4:junit4]   2> 1810 T10 oasc.AbstractZkTestCase.putConfig put /mnt/ssd/jenkins/workspace/Lucene-Solr-trunk-Linux/solr/build/solr-core/test-files/solr/collection1/conf/solrconfig-tlog.xml to /configs/conf1/solrconfig.xml
[junit4:junit4]   2> 1824 T10 oascc.SolrZkClient.makePath makePath: /configs/conf1/solrconfig.xml
[junit4:junit4]   2> 1830 T10 oasc.AbstractZkTestCase.putConfig put /mnt/ssd/jenkins/workspace/Lucene-Solr-trunk-Linux/solr/build/solr-core/test-files/solr/collection1/conf/schema.xml to /configs/conf1/schema.xml
[junit4:junit4]   2> 1831 T10 oascc.SolrZkClient.makePath makePath: /configs/conf1/schema.xml
[junit4:junit4]   2> 1841 T10 oasc.AbstractZkTestCase.putConfig put /mnt/ssd/jenkins/workspace/Lucene-Solr-trunk-Linux/solr/build/solr-core/test-files/solr/collection1/conf/stopwords.txt to /configs/conf1/stopwords.txt
[junit4:junit4]   2> 1841 T10 oascc.SolrZkClient.makePath makePath: /configs/conf1/stopwords.txt
[junit4:junit4]   2> 1849 T10 oasc.AbstractZkTestCase.putConfig put /mnt/ssd/jenkins/workspace/Lucene-Solr-trunk-Linux/solr/build/solr-core/test-files/solr/collection1/conf/protwords.txt to /configs/conf1/protwords.txt
[junit4:junit4]   2> 1850 T10 oascc.SolrZkClient.makePath makePath: /configs/conf1/protwords.txt
[junit4:junit4]   2> 1854 T10 oasc.AbstractZkTestCase.putConfig put /mnt/ssd/jenkins/workspace/Lucene-Solr-trunk-Linux/solr/build/solr-core/test-files/solr/collection1/conf/currency.xml to /configs/conf1/currency.xml
[junit4:junit4]   2> 1855 T10 oascc.SolrZkClient.makePath makePath: /configs/conf1/currency.xml
[junit4:junit4]   2> 1859 T10 oasc.AbstractZkTestCase.putConfig put /mnt/ssd/jenkins/workspace/Lucene-Solr-trunk-Linux/solr/build/solr-core/test-files/solr/collection1/conf/open-exchange-rates.json to /configs/conf1/open-exchange-rates.json
[junit4:junit4]   2> 1860 T10 oascc.SolrZkClient.makePath makePath: /configs/conf1/open-exchange-rates.json
[junit4:junit4]   2> 1864 T10 oasc.AbstractZkTestCase.putConfig put /mnt/ssd/jenkins/workspace/Lucene-Solr-trunk-Linux/solr/build/solr-core/test-files/solr/collection1/conf/mapping-ISOLatin1Accent.txt to /configs/conf1/mapping-ISOLatin1Accent.txt
[junit4:junit4]   2> 1865 T10 oascc.SolrZkClient.makePath makePath: /configs/conf1/mapping-ISOLatin1Accent.txt
[junit4:junit4]   2> 1888 T10 oasc.AbstractZkTestCase.putConfig put /mnt/ssd/jenkins/workspace/Lucene-Solr-trunk-Linux/solr/build/solr-core/test-files/solr/collection1/conf/old_synonyms.txt to /configs/conf1/old_synonyms.txt
[junit4:junit4]   2> 1889 T10 oascc.SolrZkClient.makePath makePath: /configs/conf1/old_synonyms.txt
[junit4:junit4]   2> 1895 T10 oasc.AbstractZkTestCase.putConfig put /mnt/ssd/jenkins/workspace/Lucene-Solr-trunk-Linux/solr/build/solr-core/test-files/solr/collection1/conf/synonyms.txt to /configs/conf1/synonyms.txt
[junit4:junit4]   2> 1896 T10 oascc.SolrZkClient.makePath makePath: /configs/conf1/synonyms.txt
[junit4:junit4]   2> 1900 T15 oazs.PrepRequestProcessor.pRequest2Txn Processed session termination for sessionid: 0x13d81e0d4620001
[junit4:junit4]   2> 1901 T19 oaz.ClientCnxn$EventThread.run EventThread shut down
[junit4:junit4]   2> 1901 T12 oazs.NIOServerCnxn.closeSock Closed socket connection for client /127.0.0.1:54822 which had sessionid 0x13d81e0d4620001
[junit4:junit4]   2> 1901 T10 oaz.ZooKeeper.close Session: 0x13d81e0d4620001 closed
[junit4:junit4]   2> 2160 T10 oejs.Server.doStart jetty-8.1.8.v20121106
[junit4:junit4]   2> 2296 T10 oejs.AbstractConnector.doStart Started SelectChannelConnector@127.0.0.1:45597
[junit4:junit4]   2> 2324 T10 oass.SolrDispatchFilter.init SolrDispatchFilter.init()
[junit4:junit4]   2> 2348 T10 oasc.SolrResourceLoader.locateSolrHome JNDI not configured for solr (NoInitialContextEx)
[junit4:junit4]   2> 2349 T10 oasc.SolrResourceLoader.locateSolrHome using system property solr.solr.home: /mnt/ssd/jenkins/workspace/Lucene-Solr-trunk-Linux/solr/build/solr-core/test/J1/./org.apache.solr.cloud.BasicDistributedZk2Test-controljetty-1363683629829
[junit4:junit4]   2> 2360 T10 oasc.CoreContainer$Initializer.initialize looking for solr config file: /mnt/ssd/jenkins/workspace/Lucene-Solr-trunk-Linux/solr/build/solr-core/test/J1/./org.apache.solr.cloud.BasicDistributedZk2Test-controljetty-1363683629829/solr.xml
[junit4:junit4]   2> 2364 T10 oasc.CoreContainer.<init> New CoreContainer 10491844
[junit4:junit4]   2> 2365 T10 oasc.CoreContainer.load Loading CoreContainer using Solr Home: '/mnt/ssd/jenkins/workspace/Lucene-Solr-trunk-Linux/solr/build/solr-core/test/J1/./org.apache.solr.cloud.BasicDistributedZk2Test-controljetty-1363683629829/'
[junit4:junit4]   2> 2365 T10 oasc.SolrResourceLoader.<init> new SolrResourceLoader for directory: '/mnt/ssd/jenkins/workspace/Lucene-Solr-trunk-Linux/solr/build/solr-core/test/J1/./org.apache.solr.cloud.BasicDistributedZk2Test-controljetty-1363683629829/'
[junit4:junit4]   2> 2633 T10 oashc.HttpShardHandlerFactory.getParameter Setting socketTimeout to: 120000
[junit4:junit4]   2> 2634 T10 oashc.HttpShardHandlerFactory.getParameter Setting urlScheme to: http://
[junit4:junit4]   2> 2634 T10 oashc.HttpShardHandlerFactory.getParameter Setting connTimeout to: 15000
[junit4:junit4]   2> 2635 T10 oashc.HttpShardHandlerFactory.getParameter Setting maxConnectionsPerHost to: 20
[junit4:junit4]   2> 2635 T10 oashc.HttpShardHandlerFactory.getParameter Setting corePoolSize to: 0
[junit4:junit4]   2> 2636 T10 oashc.HttpShardHandlerFactory.getParameter Setting maximumPoolSize to: 2147483647
[junit4:junit4]   2> 2636 T10 oashc.HttpShardHandlerFactory.getParameter Setting maxThreadIdleTime to: 5
[junit4:junit4]   2> 2637 T10 oashc.HttpShardHandlerFactory.getParameter Setting sizeOfQueue to: -1
[junit4:junit4]   2> 2637 T10 oashc.HttpShardHandlerFactory.getParameter Setting fairnessPolicy to: false
[junit4:junit4]   2> 2654 T10 oascsi.HttpClientUtil.createClient Creating new http client, config:maxConnectionsPerHost=20&maxConnections=10000&socketTimeout=120000&connTimeout=15000&retry=false
[junit4:junit4]   2> 3137 T10 oasc.CoreContainer.load Registering Log Listener
[junit4:junit4]   2> 3160 T10 oasc.CoreContainer.initZooKeeper Zookeeper client=127.0.0.1:35704/solr
[junit4:junit4]   2> 3168 T10 oasc.ZkController.checkChrootPath zkHost includes chroot
[junit4:junit4]   2> 3169 T10 oaz.ZooKeeper.<init> Initiating client connection, connectString=127.0.0.1:35704 sessionTimeout=60000 watcher=org.apache.solr.common.cloud.ConnectionManager@df3a3c
[junit4:junit4]   2> 3170 T10 oascc.ConnectionManager.waitForConnected Waiting for client to connect to ZooKeeper
[junit4:junit4]   2> 3170 T30 oaz.ClientCnxn$SendThread.logStartConnect Opening socket connection to server localhost.localdomain/127.0.0.1:35704. Will not attempt to authenticate using SASL (access denied ("javax.security.auth.AuthPermission" "getLoginConfiguration"))
[junit4:junit4]   2> 3171 T30 oaz.ClientCnxn$SendThread.primeConnection Socket connection established to localhost.localdomain/127.0.0.1:35704, initiating session
[junit4:junit4]   2> 3171 T12 oazs.NIOServerCnxnFactory.run Accepted socket connection from /127.0.0.1:54823
[junit4:junit4]   2> 3172 T12 oazs.ZooKeeperServer.processConnectRequest Client attempting to establish new session at /127.0.0.1:54823
[junit4:junit4]   2> 3174 T14 oazs.ZooKeeperServer.finishSessionInit Established session 0x13d81e0d4620002 with negotiated timeout 20000 for client /127.0.0.1:54823
[junit4:junit4]   2> 3174 T30 oaz.ClientCnxn$SendThread.onConnected Session establishment complete on server localhost.localdomain/127.0.0.1:35704, sessionid = 0x13d81e0d4620002, negotiated timeout = 20000
[junit4:junit4]   2> 3175 T31 oascc.ConnectionManager.process Watcher org.apache.solr.common.cloud.ConnectionManager@df3a3c name:ZooKeeperConnection Watcher:127.0.0.1:35704 got event WatchedEvent state:SyncConnected type:None path:null path:null type:None
[junit4:junit4]   2> 3175 T10 oascc.ConnectionManager.waitForConnected Client is connected to ZooKeeper
[junit4:junit4]   2> 3177 T15 oazs.PrepRequestProcessor.pRequest2Txn Processed session termination for sessionid: 0x13d81e0d4620002
[junit4:junit4]   2> 3178 T12 oazs.NIOServerCnxn.closeSock Closed socket connection for client /127.0.0.1:54823 which had sessionid 0x13d81e0d4620002
[junit4:junit4]   2> 3178 T10 oaz.ZooKeeper.close Session: 0x13d81e0d4620002 closed
[junit4:junit4]   2> 3178 T31 oaz.ClientCnxn$EventThread.run EventThread shut down
[junit4:junit4]   2> 3180 T10 oascsi.HttpClientUtil.createClient Creating new http client, config:maxConnections=500&maxConnectionsPerHost=16&socketTimeout=120000&connTimeout=15000
[junit4:junit4]   2> 3185 T10 oaz.ZooKeeper.<init> Initiating client connection, connectString=127.0.0.1:35704/solr sessionTimeout=30000 watcher=org.apache.solr.common.cloud.ConnectionManager@9dce5
[junit4:junit4]   2> 3186 T10 oascc.ConnectionManager.waitForConnected Waiting for client to connect to ZooKeeper
[junit4:junit4]   2> 3186 T32 oaz.ClientCnxn$SendThread.logStartConnect Opening socket connection to server localhost.localdomain/127.0.0.1:35704. Will not attempt to authenticate using SASL (access denied ("javax.security.auth.AuthPermission" "getLoginConfiguration"))
[junit4:junit4]   2> 3187 T32 oaz.ClientCnxn$SendThread.primeConnection Socket connection established to localhost.localdomain/127.0.0.1:35704, initiating session
[junit4:junit4]   2> 3187 T12 oazs.NIOServerCnxnFactory.run Accepted socket connection from /127.0.0.1:54824
[junit4:junit4]   2> 3187 T12 oazs.ZooKeeperServer.processConnectRequest Client attempting to establish new session at /127.0.0.1:54824
[junit4:junit4]   2> 3189 T14 oazs.ZooKeeperServer.finishSessionInit Established session 0x13d81e0d4620003 with negotiated timeout 20000 for client /127.0.0.1:54824
[junit4:junit4]   2> 3189 T32 oaz.ClientCnxn$SendThread.onConnected Session establishment complete on server localhost.localdomain/127.0.0.1:35704, sessionid = 0x13d81e0d4620003, negotiated timeout = 20000
[junit4:junit4]   2> 3189 T33 oascc.ConnectionManager.process Watcher org.apache.solr.common.cloud.ConnectionManager@9dce5 name:ZooKeeperConnection Watcher:127.0.0.1:35704/solr got event WatchedEvent state:SyncConnected type:None path:null path:null type:None
[junit4:junit4]   2> 3190 T10 oascc.ConnectionManager.waitForConnected Client is connected to ZooKeeper
[junit4:junit4]   2> 3194 T10 oascc.SolrZkClient.makePath makePath: /overseer/queue
[junit4:junit4]   2> 3201 T15 oazs.PrepRequestProcessor.pRequest Got user-level KeeperException when processing sessionid:0x13d81e0d4620003 type:create cxid:0x7 zxid:0x1b txntype:-1 reqpath:n/a Error Path:/solr/overseer Error:KeeperErrorCode = NodeExists for /solr/overseer
[junit4:junit4]   2> 3203 T10 oascc.SolrZkClient.makePath makePath: /overseer/collection-queue-work
[junit4:junit4]   2> 3211 T10 oascc.SolrZkClient.makePath makePath: /live_nodes
[junit4:junit4]   2> 3213 T10 oasc.ZkController.createEphemeralLiveNode Register node as live in ZooKeeper:/live_nodes/127.0.0.1:45597_
[junit4:junit4]   2> 3216 T15 oazs.PrepRequestProcessor.pRequest Got user-level KeeperException when processing sessionid:0x13d81e0d4620003 type:delete cxid:0x12 zxid:0x1e txntype:-1 reqpath:n/a Error Path:/solr/live_nodes/127.0.0.1:45597_ Error:KeeperErrorCode = NoNode for /solr/live_nodes/127.0.0.1:45597_
[junit4:junit4]   2> 3218 T10 oascc.SolrZkClient.makePath makePath: /live_nodes/127.0.0.1:45597_
[junit4:junit4]   2> 3223 T10 oascc.SolrZkClient.makePath makePath: /overseer_elect/election
[junit4:junit4]   2> 3237 T15 oazs.PrepRequestProcessor.pRequest Got user-level KeeperException when processing sessionid:0x13d81e0d4620003 type:delete cxid:0x20 zxid:0x23 txntype:-1 reqpath:n/a Error Path:/solr/overseer_elect/leader Error:KeeperErrorCode = NoNode for /solr/overseer_elect/leader
[junit4:junit4]   2> 3238 T10 oascc.SolrZkClient.makePath makePath: /overseer_elect/leader
[junit4:junit4]   2> 3241 T10 oasc.Overseer.start Overseer (id=89370370253127683-127.0.0.1:45597_-n_0000000000) starting
[junit4:junit4]   2> 3242 T15 oazs.PrepRequestProcessor.pRequest Got user-level KeeperException when processing sessionid:0x13d81e0d4620003 type:create cxid:0x25 zxid:0x25 txntype:-1 reqpath:n/a Error Path:/solr/overseer Error:KeeperErrorCode = NodeExists for /solr/overseer
[junit4:junit4]   2> 3251 T15 oazs.PrepRequestProcessor.pRequest Got user-level KeeperException when processing sessionid:0x13d81e0d4620003 type:create cxid:0x26 zxid:0x26 txntype:-1 reqpath:n/a Error Path:/solr/overseer Error:KeeperErrorCode = NodeExists for /solr/overseer
[junit4:junit4]   2> 3253 T15 oazs.PrepRequestProcessor.pRequest Got user-level KeeperException when processing sessionid:0x13d81e0d4620003 type:create cxid:0x28 zxid:0x27 txntype:-1 reqpath:n/a Error Path:/solr/overseer Error:KeeperErrorCode = NodeExists for /solr/overseer
[junit4:junit4]   2> 3255 T10 oascc.SolrZkClient.makePath makePath: /overseer/queue-work
[junit4:junit4]   2> 3263 T15 oazs.PrepRequestProcessor.pRequest Got user-level KeeperException when processing sessionid:0x13d81e0d4620003 type:create cxid:0x2e zxid:0x29 txntype:-1 reqpath:n/a Error Path:/solr/overseer Error:KeeperErrorCode = NodeExists for /solr/overseer
[junit4:junit4]   2> 3265 T35 oasc.OverseerCollectionProcessor.run Process current queue of collection creations
[junit4:junit4]   2> 3266 T10 oascc.SolrZkClient.makePath makePath: /clusterstate.json
[junit4:junit4]   2> 3273 T10 oascc.SolrZkClient.makePath makePath: /aliases.json
[junit4:junit4]   2> 3275 T10 oascc.ZkStateReader.createClusterStateWatchersAndUpdate Updating cluster state from ZooKeeper... 
[junit4:junit4]   2> 3286 T34 oasc.Overseer$ClusterStateUpdater.run Starting to work on the main queue
[junit4:junit4]   2> 3318 T36 oasc.CoreContainer.create Creating SolrCore 'collection1' using instanceDir: /mnt/ssd/jenkins/workspace/Lucene-Solr-trunk-Linux/solr/build/solr-core/test/J1/./org.apache.solr.cloud.BasicDistributedZk2Test-controljetty-1363683629829/collection1
[junit4:junit4]   2> 3319 T36 oasc.ZkController.createCollectionZkNode Check for collection zkNode:control_collection
[junit4:junit4]   2> 3320 T36 oasc.ZkController.createCollectionZkNode Collection zkNode exists
[junit4:junit4]   2> 3320 T36 oasc.ZkController.readConfigName Load collection config from:/collections/control_collection
[junit4:junit4]   2> 3325 T36 oasc.SolrResourceLoader.<init> new SolrResourceLoader for directory: '/mnt/ssd/jenkins/workspace/Lucene-Solr-trunk-Linux/solr/build/solr-core/test/J1/./org.apache.solr.cloud.BasicDistributedZk2Test-controljetty-1363683629829/collection1/'
[junit4:junit4]   2> 3325 T36 oasc.SolrResourceLoader.replaceClassLoader Adding 'file:/mnt/ssd/jenkins/workspace/Lucene-Solr-trunk-Linux/solr/build/solr-core/test/J1/org.apache.solr.cloud.BasicDistributedZk2Test-controljetty-1363683629829/collection1/lib/README' to classloader
[junit4:junit4]   2> 3326 T36 oasc.SolrResourceLoader.replaceClassLoader Adding 'file:/mnt/ssd/jenkins/workspace/Lucene-Solr-trunk-Linux/solr/build/solr-core/test/J1/org.apache.solr.cloud.BasicDistributedZk2Test-controljetty-1363683629829/collection1/lib/classes/' to classloader
[junit4:junit4]   2> 3400 T36 oasc.SolrConfig.<init> Using Lucene MatchVersion: LUCENE_50
[junit4:junit4]   2> 3481 T36 oasc.SolrConfig.<init> Loaded SolrConfig: solrconfig.xml
[junit4:junit4]   2> 3488 T36 oass.IndexSchema.readSchema Reading Solr Schema
[junit4:junit4]   2> 3531 T36 oass.IndexSchema.readSchema Schema name=test
[junit4:junit4]   2> 4416 T36 oass.OpenExchangeRatesOrgProvider.init Initialized with rates=open-exchange-rates.json, refreshInterval=1440.
[junit4:junit4]   2> 4436 T36 oass.IndexSchema.readSchema default search field in schema is text
[junit4:junit4]   2> 4439 T36 oass.IndexSchema.readSchema unique key field: id
[junit4:junit4]   2> 4611 T36 oass.FileExchangeRateProvider.reload Reloading exchange rates from file currency.xml
[junit4:junit4]   2> 4618 T36 oass.FileExchangeRateProvider.reload Reloading exchange rates from file currency.xml
[junit4:junit4]   2> 4623 T36 oass.OpenExchangeRatesOrgProvider.reload Reloading exchange rates from open-exchange-rates.json
[junit4:junit4]   2> 4625 T36 oass.OpenExchangeRatesOrgProvider$OpenExchangeRates.<init> WARNING Unknown key IMPORTANT NOTE
[junit4:junit4]   2> 4626 T36 oass.OpenExchangeRatesOrgProvider$OpenExchangeRates.<init> WARNING Expected key, got STRING
[junit4:junit4]   2> 4626 T36 oass.OpenExchangeRatesOrgProvider.reload Reloading exchange rates from open-exchange-rates.json
[junit4:junit4]   2> 4627 T36 oass.OpenExchangeRatesOrgProvider$OpenExchangeRates.<init> WARNING Unknown key IMPORTANT NOTE
[junit4:junit4]   2> 4628 T36 oass.OpenExchangeRatesOrgProvider$OpenExchangeRates.<init> WARNING Expected key, got STRING
[junit4:junit4]   2> 4652 T36 oasc.SolrCore.initDirectoryFactory org.apache.solr.core.MockDirectoryFactory
[junit4:junit4]   2> 4666 T36 oasc.SolrCore.<init> [collection1] Opening new SolrCore at /mnt/ssd/jenkins/workspace/Lucene-Solr-trunk-Linux/solr/build/solr-core/test/J1/./org.apache.solr.cloud.BasicDistributedZk2Test-controljetty-1363683629829/collection1/, dataDir=./org.apache.solr.cloud.BasicDistributedZk2Test-1363683628001/control/data/
[junit4:junit4]   2> 4669 T36 oasc.JmxMonitoredMap.<init> JMX monitoring is enabled. Adding Solr mbeans to JMX Server: com.sun.jmx.mbeanserver.JmxMBeanServer@1967072
[junit4:junit4]   2> 4735 T36 oasc.SolrCore.initDirectoryFactory org.apache.solr.core.MockDirectoryFactory
[junit4:junit4]   2> 4763 T36 oasc.CachingDirectoryFactory.get return new directory for ./org.apache.solr.cloud.BasicDistributedZk2Test-1363683628001/control/data forceNew: false
[junit4:junit4]   2> 4763 T36 oasc.SolrCore.getNewIndexDir New index directory detected: old=null new=./org.apache.solr.cloud.BasicDistributedZk2Test-1363683628001/control/data/index/
[junit4:junit4]   2> 4764 T36 oasc.SolrCore.initIndex WARNING [collection1] Solr index directory './org.apache.solr.cloud.BasicDistributedZk2Test-1363683628001/control/data/index' doesn't exist. Creating new index...
[junit4:junit4]   2> 4777 T36 oasc.CachingDirectoryFactory.get return new directory for ./org.apache.solr.cloud.BasicDistributedZk2Test-1363683628001/control/data/index forceNew: false
[junit4:junit4]   2> 4882 T36 oasc.SolrDeletionPolicy.onCommit SolrDeletionPolicy.onCommit: commits:num=1
[junit4:junit4]   2> 		commit{dir=MockDirWrapper(org.apache.lucene.store.RAMDirectory@14b87ca lockFactory=org.apache.lucene.store.NativeFSLockFactory@1e8b477),segFN=segments_1,generation=1,filenames=[segments_1]
[junit4:junit4]   2> 4882 T36 oasc.SolrDeletionPolicy.updateCommits newest commit = 1[segments_1]
[junit4:junit4]   2> 5135 T36 oasup.UpdateRequestProcessorChain.init inserting DistributedUpdateProcessorFactory into updateRequestProcessorChain "dedupe"
[junit4:junit4]   2> 5135 T36 oasup.UpdateRequestProcessorChain.init inserting DistributedUpdateProcessorFactory into updateRequestProcessorChain "stored_sig"
[junit4:junit4]   2> 5159 T36 oasup.UpdateRequestProcessorChain.init inserting DistributedUpdateProcessorFactory into updateRequestProcessorChain "distrib-dup-test-chain-implicit"
[junit4:junit4]   2> 5171 T36 oasc.RequestHandlers.initHandlersFromConfig created standard: solr.StandardRequestHandler
[junit4:junit4]   2> 5176 T36 oasc.RequestHandlers.initHandlersFromConfig created /get: solr.RealTimeGetHandler
[junit4:junit4]   2> 5177 T36 oasc.RequestHandlers.initHandlersFromConfig adding lazy requestHandler: solr.ReplicationHandler
[junit4:junit4]   2> 5178 T36 oasc.RequestHandlers.initHandlersFromConfig created /replication: solr.ReplicationHandler
[junit4:junit4]   2> 5186 T36 oasc.RequestHandlers.initHandlersFromConfig created /update: solr.UpdateRequestHandler
[junit4:junit4]   2> 5188 T36 oasc.RequestHandlers.initHandlersFromConfig created /admin/: org.apache.solr.handler.admin.AdminHandlers
[junit4:junit4]   2> 5222 T36 oashl.XMLLoader.init xsltCacheLifetimeSeconds=60
[junit4:junit4]   2> 5248 T36 oass.SolrIndexSearcher.<init> Opening Searcher@1308bdf main
[junit4:junit4]   2> 5274 T36 oasu.UpdateHandler.clearLog Clearing tlog files, tlogDir=./org.apache.solr.cloud.BasicDistributedZk2Test-1363683628001/control/data/tlog
[junit4:junit4]   2> 5281 T36 oasu.CommitTracker.<init> Hard AutoCommit: disabled
[junit4:junit4]   2> 5282 T36 oasu.CommitTracker.<init> Soft AutoCommit: disabled
[junit4:junit4]   2> 5330 T37 oasc.SolrCore.registerSearcher [collection1] Registered new searcher Searcher@1308bdf main{StandardDirectoryReader(segments_1:1)}
[junit4:junit4]   2> 5333 T36 oasc.ZkController.publish publishing core=collection1 state=down
[junit4:junit4]   2> 5334 T36 oasc.ZkController.publish numShards not found on descriptor - reading it from system property
[junit4:junit4]   2> 6295 T34 oascc.ZkStateReader.updateClusterState Updating cloud state from ZooKeeper... 
[junit4:junit4]   2> 6296 T34 oasc.Overseer$ClusterStateUpdater.updateState Update state numShards=1 message={
[junit4:junit4]   2> 	  "node_name":"127.0.0.1:45597_",
[junit4:junit4]   2> 	  "roles":null,
[junit4:junit4]   2> 	  "core":"collection1",
[junit4:junit4]   2> 	  "shard":null,
[junit4:junit4]   2> 	  "numShards":"1",
[junit4:junit4]   2> 	  "core_node_name":null,
[junit4:junit4]   2> 	  "state":"down",
[junit4:junit4]   2> 	  "collection":"control_collection",
[junit4:junit4]   2> 	  "base_url":"http://127.0.0.1:45597",
[junit4:junit4]   2> 	  "operation":"state"}
[junit4:junit4]   2> 6296 T34 oasc.Overseer$ClusterStateUpdater.createCollection Create collection control_collection with numShards 1
[junit4:junit4]   2> 6303 T34 oasc.Overseer$ClusterStateUpdater.updateState Assigning new node to shard shard=shard1
[junit4:junit4]   2> 6314 T33 oascc.ZkStateReader$2.process A cluster state change: WatchedEvent state:SyncConnected type:NodeDataChanged path:/clusterstate.json, has occurred - updating... (live nodes size: 1)
[junit4:junit4]   2> 6336 T36 oasc.CoreContainer.registerCore registering core: collection1
[junit4:junit4]   2> 6336 T36 oasc.ZkController.register Register replica - core:collection1 address:http://127.0.0.1:45597 collection:control_collection shard:shard1
[junit4:junit4]   2> 6342 T36 oascsi.HttpClientUtil.createClient Creating new http client, config:maxConnections=10000&maxConnectionsPerHost=20&connTimeout=30000&socketTimeout=30000&retry=false
[junit4:junit4]   2> 6349 T36 oascc.SolrZkClient.makePath makePath: /collections/control_collection/leader_elect/shard1/election
[junit4:junit4]   2> 6358 T15 oazs.PrepRequestProcessor.pRequest Got user-level KeeperException when processing sessionid:0x13d81e0d4620003 type:delete cxid:0x85 zxid:0x35 txntype:-1 reqpath:n/a Error Path:/solr/collections/control_collection/leaders Error:KeeperErrorCode = NoNode for /solr/collections/control_collection/leaders
[junit4:junit4]   2> 6359 T36 oasc.ShardLeaderElectionContext.runLeaderProcess Running the leader process.
[junit4:junit4]   2> 6359 T15 oazs.PrepRequestProcessor.pRequest Got user-level KeeperException when processing sessionid:0x13d81e0d4620003 type:create cxid:0x86 zxid:0x36 txntype:-1 reqpath:n/a Error Path:/solr/overseer Error:KeeperErrorCode = NodeExists for /solr/overseer
[junit4:junit4]   2> 6365 T36 oasc.ShardLeaderElectionContext.waitForReplicasToComeUp Enough replicas found to continue.
[junit4:junit4]   2> 6366 T36 oasc.ShardLeaderElectionContext.runLeaderProcess I may be the new leader - try and sync
[junit4:junit4]   2> 6367 T36 oasc.SyncStrategy.sync Sync replicas to http://127.0.0.1:45597/collection1/
[junit4:junit4]   2> 6368 T36 oasc.SyncStrategy.syncReplicas Sync Success - now sync replicas to me
[junit4:junit4]   2> 6369 T36 oasc.SyncStrategy.syncToMe http://127.0.0.1:45597/collection1/ has no replicas
[junit4:junit4]   2> 6369 T36 oasc.ShardLeaderElectionContext.runLeaderProcess I am the new leader: http://127.0.0.1:45597/collection1/
[junit4:junit4]   2> 6369 T36 oascc.SolrZkClient.makePath makePath: /collections/control_collection/leaders/shard1
[junit4:junit4]   2> 6375 T15 oazs.PrepRequestProcessor.pRequest Got user-level KeeperException when processing sessionid:0x13d81e0d4620003 type:create cxid:0x91 zxid:0x3a txntype:-1 reqpath:n/a Error Path:/solr/overseer Error:KeeperErrorCode = NodeExists for /solr/overseer
[junit4:junit4]   2> 7819 T34 oascc.ZkStateReader.updateClusterState Updating cloud state from ZooKeeper... 
[junit4:junit4]   2> 7829 T33 oascc.ZkStateReader$2.process A cluster state change: WatchedEvent state:SyncConnected type:NodeDataChanged path:/clusterstate.json, has occurred - updating... (live nodes size: 1)
[junit4:junit4]   2> 7881 T36 oasc.ZkController.register We are http://127.0.0.1:45597/collection1/ and leader is http://127.0.0.1:45597/collection1/
[junit4:junit4]   2> 7883 T36 oasc.ZkController.register No LogReplay needed for core=collection1 baseURL=http://127.0.0.1:45597
[junit4:junit4]   2> 7883 T36 oasc.ZkController.checkRecovery I am the leader, no recovery necessary
[junit4:junit4]   2> 7884 T36 oasc.ZkController.publish publishing core=collection1 state=active
[junit4:junit4]   2> 7884 T36 oasc.ZkController.publish numShards not found on descriptor - reading it from system property
[junit4:junit4]   2> 7886 T36 oascc.ZkStateReader.updateClusterState Updating cloud state from ZooKeeper... 
[junit4:junit4]   2> 7890 T10 oass.SolrDispatchFilter.init user.dir=/mnt/ssd/jenkins/workspace/Lucene-Solr-trunk-Linux/solr/build/solr-core/test/J1
[junit4:junit4]   2> 7890 T10 oass.SolrDispatchFilter.init SolrDispatchFilter.init() done
[junit4:junit4]   2> 7905 T10 oascsi.HttpClientUtil.createClient Creating new http client, config:maxConnections=128&maxConnectionsPerHost=32&followRedirects=false
[junit4:junit4]   2> 7912 T10 oascsi.HttpClientUtil.createClient Creating new http client, config:
[junit4:junit4]   2> 7914 T10 oaz.ZooKeeper.<init> Initiating client connection, connectString=127.0.0.1:35704/solr sessionTimeout=10000 watcher=org.apache.solr.common.cloud.ConnectionManager@d350e7
[junit4:junit4]   2> 7915 T10 oascc.ConnectionManager.waitForConnected Waiting for client to connect to ZooKeeper
[junit4:junit4]   2> 7915 T39 oaz.ClientCnxn$SendThread.logStartConnect Opening socket connection to server localhost.localdomain/127.0.0.1:35704. Will not attempt to authenticate using SASL (access denied ("javax.security.auth.AuthPermission" "getLoginConfiguration"))
[junit4:junit4]   2> 7916 T39 oaz.ClientCnxn$SendThread.primeConnection Socket connection established to localhost.localdomain/127.0.0.1:35704, initiating session
[junit4:junit4]   2> 7916 T12 oazs.NIOServerCnxnFactory.run Accepted socket connection from /127.0.0.1:54826
[junit4:junit4]   2> 7917 T12 oazs.ZooKeeperServer.processConnectRequest Client attempting to establish new session at /127.0.0.1:54826
[junit4:junit4]   2> 7918 T14 oazs.ZooKeeperServer.finishSessionInit Established session 0x13d81e0d4620004 with negotiated timeout 10000 for client /127.0.0.1:54826
[junit4:junit4]   2> 7918 T39 oaz.ClientCnxn$SendThread.onConnected Session establishment complete on server localhost.localdomain/127.0.0.1:35704, sessionid = 0x13d81e0d4620004, negotiated timeout = 10000
[junit4:junit4]   2> 7918 T40 oascc.ConnectionManager.process Watcher org.apache.solr.common.cloud.ConnectionManager@d350e7 name:ZooKeeperConnection Watcher:127.0.0.1:35704/solr got event WatchedEvent state:SyncConnected type:None path:null path:null type:None
[junit4:junit4]   2> 7918 T10 oascc.ConnectionManager.waitForConnected Client is connected to ZooKeeper
[junit4:junit4]   2> 7920 T10 oascc.ZkStateReader.createClusterStateWatchersAndUpdate Updating cluster state from ZooKeeper... 
[junit4:junit4]   2> 7923 T10 oasc.ChaosMonkey.monkeyLog monkey: init - expire sessions:true cause connection loss:true
[junit4:junit4]   2> 7990 T10 oejs.Server.doStart jetty-8.1.8.v20121106
[junit4:junit4]   2> 7992 T10 oejs.AbstractConnector.doStart Started SelectChannelConnector@127.0.0.1:52267
[junit4:junit4]   2> 7993 T10 oass.SolrDispatchFilter.init SolrDispatchFilter.init()
[junit4:junit4]   2> 7994 T10 oasc.SolrResourceLoader.locateSolrHome JNDI not configured for solr (NoInitialContextEx)
[junit4:junit4]   2> 7994 T10 oasc.SolrResourceLoader.locateSolrHome using system property solr.solr.home: /mnt/ssd/jenkins/workspace/Lucene-Solr-trunk-Linux/solr/build/solr-core/test/J1/./org.apache.solr.cloud.BasicDistributedZk2Test-jetty1-1363683635851
[junit4:junit4]   2> 7994 T10 oasc.CoreContainer$Initializer.initialize looking for solr config file: /mnt/ssd/jenkins/workspace/Lucene-Solr-trunk-Linux/solr/build/solr-core/test/J1/./org.apache.solr.cloud.BasicDistributedZk2Test-jetty1-1363683635851/solr.xml
[junit4:junit4]   2> 7995 T10 oasc.CoreContainer.<init> New CoreContainer 20033279
[junit4:junit4]   2> 7995 T10 oasc.CoreContainer.load Loading CoreContainer using Solr Home: '/mnt/ssd/jenkins/workspace/Lucene-Solr-trunk-Linux/solr/build/solr-core/test/J1/./org.apache.solr.cloud.BasicDistributedZk2Test-jetty1-1363683635851/'
[junit4:junit4]   2> 7996 T10 oasc.SolrResourceLoader.<init> new SolrResourceLoader for directory: '/mnt/ssd/jenkins/workspace/Lucene-Solr-trunk-Linux/solr/build/solr-core/test/J1/./org.apache.solr.cloud.BasicDistributedZk2Test-jetty1-1363683635851/'
[junit4:junit4]   2> 8025 T10 oashc.HttpShardHandlerFactory.getParameter Setting socketTimeout to: 120000
[junit4:junit4]   2> 8025 T10 oashc.HttpShardHandlerFactory.getParameter Setting urlScheme to: http://
[junit4:junit4]   2> 8026 T10 oashc.HttpShardHandlerFactory.getParameter Setting connTimeout to: 15000
[junit4:junit4]   2> 8026 T10 oashc.HttpShardHandlerFactory.getParameter Setting maxConnectionsPerHost to: 20
[junit4:junit4]   2> 8026 T10 oashc.HttpShardHandlerFactory.getParameter Setting corePoolSize to: 0
[junit4:junit4]   2> 8027 T10 oashc.HttpShardHandlerFactory.getParameter Setting maximumPoolSize to: 2147483647
[junit4:junit4]   2> 8027 T10 oashc.HttpShardHandlerFactory.getParameter Setting maxThreadIdleTime to: 5
[junit4:junit4]   2> 8028 T10 oashc.HttpShardHandlerFactory.getParameter Setting sizeOfQueue to: -1
[junit4:junit4]   2> 8028 T10 oashc.HttpShardHandlerFactory.getParameter Setting fairnessPolicy to: false
[junit4:junit4]   2> 8028 T10 oascsi.HttpClientUtil.createClient Creating new http client, config:maxConnectionsPerHost=20&maxConnections=10000&socketTimeout=120000&connTimeout=15000&retry=false
[junit4:junit4]   2> 8037 T10 oasc.CoreContainer.load Registering Log Listener
[junit4:junit4]   2> 8050 T10 oasc.CoreContainer.initZooKeeper Zookeeper client=127.0.0.1:35704/solr
[junit4:junit4]   2> 8051 T10 oasc.ZkController.checkChrootPath zkHost includes chroot
[junit4:junit4]   2> 8051 T10 oaz.ZooKeeper.<init> Initiating client connection, connectString=127.0.0.1:35704 sessionTimeout=60000 watcher=org.apache.solr.common.cloud.ConnectionManager@b35812
[junit4:junit4]   2> 8052 T10 oascc.ConnectionManager.waitForConnected Waiting for client to connect to ZooKeeper
[junit4:junit4]   2> 8053 T50 oaz.ClientCnxn$SendThread.logStartConnect Opening socket connection to server localhost.localdomain/127.0.0.1:35704. Will not attempt to authenticate using SASL (access denied ("javax.security.auth.AuthPermission" "getLoginConfiguration"))
[junit4:junit4]   2> 8053 T50 oaz.ClientCnxn$SendThread.primeConnection Socket connection established to localhost.localdomain/127.0.0.1:35704, initiating session
[junit4:junit4]   2> 8053 T12 oazs.NIOServerCnxnFactory.run Accepted socket connection from /127.0.0.1:54827
[junit4:junit4]   2> 8054 T12 oazs.ZooKeeperServer.processConnectRequest Client attempting to establish new session at /127.0.0.1:54827
[junit4:junit4]   2> 8055 T14 oazs.ZooKeeperServer.finishSessionInit Established session 0x13d81e0d4620005 with negotiated timeout 20000 for client /127.0.0.1:54827
[junit4:junit4]   2> 8055 T50 oaz.ClientCnxn$SendThread.onConnected Session establishment complete on server localhost.localdomain/127.0.0.1:35704, sessionid = 0x13d81e0d4620005, negotiated timeout = 20000
[junit4:junit4]   2> 8056 T51 oascc.ConnectionManager.process Watcher org.apache.solr.common.cloud.ConnectionManager@b35812 name:ZooKeeperConnection Watcher:127.0.0.1:35704 got event WatchedEvent state:SyncConnected type:None path:null path:null type:None
[junit4:junit4]   2> 8056 T10 oascc.ConnectionManager.waitForConnected Client is connected to ZooKeeper
[junit4:junit4]   2> 8057 T15 oazs.PrepRequestProcessor.pRequest2Txn Processed session termination for sessionid: 0x13d81e0d4620005
[junit4:junit4]   2> 8058 T12 oazs.NIOServerCnxn.closeSock Closed socket connection for client /127.0.0.1:54827 which had sessionid 0x13d81e0d4620005
[junit4:junit4]   2> 8058 T10 oaz.ZooKeeper.close Session: 0x13d81e0d4620005 closed
[junit4:junit4]   2> 8058 T51 oaz.ClientCnxn$EventThread.run EventThread shut down
[junit4:junit4]   2> 8059 T10 oascsi.HttpClientUtil.createClient Creating new http client, config:maxConnections=500&maxConnectionsPerHost=16&socketTimeout=120000&connTimeout=15000
[junit4:junit4]   2> 8063 T10 oaz.ZooKeeper.<init> Initiating client connection, connectString=127.0.0.1:35704/solr sessionTimeout=30000 watcher=org.apache.solr.common.cloud.ConnectionManager@1cc0b8b
[junit4:junit4]   2> 8065 T52 oaz.ClientCnxn$SendThread.logStartConnect Opening socket connection to server localhost.localdomain/127.0.0.1:35704. Will not attempt to authenticate using SASL (access denied ("javax.security.auth.AuthPermission" "getLoginConfiguration"))
[junit4:junit4]   2> 8066 T12 oazs.NIOServerCnxnFactory.run Accepted socket connection from /127.0.0.1:54828
[junit4:junit4]   2> 8066 T52 oaz.ClientCnxn$SendThread.primeConnection Socket connection established to localhost.localdomain/127.0.0.1:35704, initiating session
[junit4:junit4]   2> 8067 T12 oazs.ZooKeeperServer.processConnectRequest Client attempting to establish new session at /127.0.0.1:54828
[junit4:junit4]   2> 8067 T10 oascc.ConnectionManager.waitForConnected Waiting for client to connect to ZooKeeper
[junit4:junit4]   2> 8068 T14 oazs.ZooKeeperServer.finishSessionInit Established session 0x13d81e0d4620006 with negotiated timeout 20000 for client /127.0.0.1:54828
[junit4:junit4]   2> 8068 T52 oaz.ClientCnxn$SendThread.onConnected Session establishment complete on server localhost.localdomain/127.0.0.1:35704, sessionid = 0x13d81e0d4620006, negotiated timeout = 20000
[junit4:junit4]   2> 8068 T53 oascc.ConnectionManager.process Watcher org.apache.solr.common.cloud.ConnectionManager@1cc0b8b name:ZooKeeperConnection Watcher:127.0.0.1:35704/solr got event WatchedEvent state:SyncConnected type:None path:null path:null type:None
[junit4:junit4]   2> 8069 T10 oascc.ConnectionManager.waitForConnected Client is connected to ZooKeeper
[junit4:junit4]   2> 8070 T15 oazs.PrepRequestProcessor.pRequest Got user-level KeeperException when processing sessionid:0x13d81e0d4620006 type:create cxid:0x1 zxid:0x48 txntype:-1 reqpath:n/a Error Path:/solr/overseer Error:KeeperErrorCode = NodeExists for /solr/overseer
[junit4:junit4]   2> 8072 T15 oazs.PrepRequestProcessor.pRequest Got user-level KeeperException when processing sessionid:0x13d81e0d4620006 type:create cxid:0x3 zxid:0x49 txntype:-1 reqpath:n/a Error Path:/solr/overseer Error:KeeperErrorCode = NodeExists for /solr/overseer
[junit4:junit4]   2> 8075 T10 oascc.ZkStateReader.createClusterStateWatchersAndUpdate Updating cluster state from ZooKeeper... 
[junit4:junit4]   2> 9079 T10 oasc.ZkController.createEphemeralLiveNode Register node as live in ZooKeeper:/live_nodes/127.0.0.1:52267_
[junit4:junit4]   2> 9080 T15 oazs.PrepRequestProcessor.pRequest Got user-level KeeperException when processing sessionid:0x13d81e0d4620006 type:delete cxid:0xd zxid:0x4a txntype:-1 reqpath:n/a Error Path:/solr/live_nodes/127.0.0.1:52267_ Error:KeeperErrorCode = NoNode for /solr/live_nodes/127.0.0.1:52267_
[junit4:junit4]   2> 9080 T10 oascc.SolrZkClient.makePath makePath: /live_nodes/127.0.0.1:52267_
[junit4:junit4]   2> 9084 T40 oascc.ZkStateReader$3.process Updating live nodes... (2)
[junit4:junit4]   2> 9084 T53 oascc.ZkStateReader$3.process Updating live nodes... (2)
[junit4:junit4]   2> 9084 T33 oascc.ZkStateReader$3.process Updating live nodes... (2)
[junit4:junit4]   2> 9084 T33 oascc.ZkStateReader$2.process A cluster state change: WatchedEvent state:SyncConnected type:NodeChildrenChanged path:/live_nodes, has occurred - updating... (live nodes size: 2)
[junit4:junit4]   2> 9091 T54 oasc.CoreContainer.create Creating SolrCore 'collection1' using instanceDir: /mnt/ssd/jenkins/workspace/Lucene-Solr-trunk-Linux/solr/build/solr-core/test/J1/./org.apache.solr.cloud.BasicDistributedZk2Test-jetty1-1363683635851/collection1
[junit4:junit4]   2> 9092 T54 oasc.ZkController.createCollectionZkNode Check for collection zkNode:collection1
[junit4:junit4]   2> 9092 T54 oasc.ZkController.createCollectionZkNode Collection zkNode exists
[junit4:junit4]   2> 9093 T54 oasc.ZkController.readConfigName Load collection config from:/collections/collection1
[junit4:junit4]   2> 9094 T54 oasc.SolrResourceLoader.<init> new SolrResourceLoader for directory: '/mnt/ssd/jenkins/workspace/Lucene-Solr-trunk-Linux/solr/build/solr-core/test/J1/./org.apache.solr.cloud.BasicDistributedZk2Test-jetty1-1363683635851/collection1/'
[junit4:junit4]   2> 9094 T54 oasc.SolrResourceLoader.replaceClassLoader Adding 'file:/mnt/ssd/jenkins/workspace/Lucene-Solr-trunk-Linux/solr/build/solr-core/test/J1/org.apache.solr.cloud.BasicDistributedZk2Test-jetty1-1363683635851/collection1/lib/README' to classloader
[junit4:junit4]   2> 9095 T54 oasc.SolrResourceLoader.replaceClassLoader Adding 'file:/mnt/ssd/jenkins/workspace/Lucene-Solr-trunk-Linux/solr/build/solr-core/test/J1/org.apache.solr.cloud.BasicDistributedZk2Test-jetty1-1363683635851/collection1/lib/classes/' to classloader
[junit4:junit4]   2> 9138 T54 oasc.SolrConfig.<init> Using Lucene MatchVersion: LUCENE_50
[junit4:junit4]   2> 9189 T54 oasc.SolrConfig.<init> Loaded SolrConfig: solrconfig.xml
[junit4:junit4]   2> 9190 T54 oass.IndexSchema.readSchema Reading Solr Schema
[junit4:junit4]   2> 9215 T54 oass.IndexSchema.readSchema Schema name=test
[junit4:junit4]   2> 9335 T34 oascc.ZkStateReader.updateClusterState Updating cloud state from ZooKeeper... 
[junit4:junit4]   2> 9336 T34 oasc.Overseer$ClusterStateUpdater.updateState Update state numShards=1 message={
[junit4:junit4]   2> 	  "node_name":"127.0.0.1:45597_",
[junit4:junit4]   2> 	  "roles":null,
[junit4:junit4]   2> 	  "core":"collection1",
[junit4:junit4]   2> 	  "shard":"shard1",
[junit4:junit4]   2> 	  "numShards":"1",
[junit4:junit4]   2> 	  "core_node_name":"127.0.0.1:45597__collection1",
[junit4:junit4]   2> 	  "state":"active",
[junit4:junit4]   2> 	  "collection":"control_collection",
[junit4:junit4]   2> 	  "base_url":"http://127.0.0.1:45597",
[junit4:junit4]   2> 	  "operation":"state"}
[junit4:junit4]   2> 9348 T33 oascc.ZkStateReader$2.process A cluster state change: WatchedEvent state:SyncConnected type:NodeDataChanged path:/clusterstate.json, has occurred - updating... (live nodes size: 2)
[junit4:junit4]   2> 9348 T40 oascc.ZkStateReader$2.process A cluster state change: WatchedEvent state:SyncConnected type:NodeDataChanged path:/clusterstate.json, has occurred - updating... (live nodes size: 2)
[junit4:junit4]   2> 9348 T53 oascc.ZkStateReader$2.process A cluster state change: WatchedEvent state:SyncConnected type:NodeDataChanged path:/clusterstate.json, has occurred - updating... (live nodes size: 2)
[junit4:junit4]   2> 9798 T54 oass.OpenExchangeRatesOrgProvider.init Initialized with rates=open-exchange-rates.json, refreshInterval=1440.
[junit4:junit4]   2> 9807 T54 oass.IndexSchema.readSchema default search field in schema is text
[junit4:junit4]   2> 9811 T54 oass.IndexSchema.readSchema unique key field: id
[junit4:junit4]   2> 9837 T54 oass.FileExchangeRateProvider.reload Reloading exchange rates from file currency.xml
[junit4:junit4]   2> 9842 T54 oass.FileExchangeRateProvider.reload Reloading exchange rates from file currency.xml
[junit4:junit4]   2> 9847 T54 oass.OpenExchangeRatesOrgProvider.reload Reloading exchange rates from open-exchange-rates.json
[junit4:junit4]   2> 9848 T54 oass.OpenExchangeRatesOrgProvider$OpenExchangeRates.<init> WARNING Unknown key IMPORTANT NOTE
[junit4:junit4]   2> 9849 T54 oass.OpenExchangeRatesOrgProvider$OpenExchangeRates.<init> WARNING Expected key, got STRING
[junit4:junit4]   2> 9849 T54 oass.OpenExchangeRatesOrgProvider.reload Reloading exchange rates from open-exchange-rates.json
[junit4:junit4]   2> 9850 T54 oass.OpenExchangeRatesOrgProvider$OpenExchangeRates.<init> WARNING Unknown key IMPORTANT NOTE
[junit4:junit4]   2> 9851 T54 oass.OpenExchangeRatesOrgProvider$OpenExchangeRates.<init> WARNING Expected key, got STRING
[junit4:junit4]   2> 9851 T54 oasc.SolrCore.initDirectoryFactory org.apache.solr.core.MockDirectoryFactory
[junit4:junit4]   2> 9851 T54 oasc.SolrCore.<init> [collection1] Opening new SolrCore at /mnt/ssd/jenkins/workspace/Lucene-Solr-trunk-Linux/solr/build/solr-core/test/J1/./org.apache.solr.cloud.BasicDistributedZk2Test-jetty1-1363683635851/collection1/, dataDir=./org.apache.solr.cloud.BasicDistributedZk2Test-1363683628001/jetty1/
[junit4:junit4]   2> 9852 T54 oasc.JmxMonitoredMap.<init> JMX monitoring is enabled. Adding Solr mbeans to JMX Server: com.sun.jmx.mbeanserver.JmxMBeanServer@1967072
[junit4:junit4]   2> 9852 T54 oasc.SolrCore.initDirectoryFactory org.apache.solr.core.MockDirectoryFactory
[junit4:junit4]   2> 9853 T54 oasc.CachingDirectoryFactory.get return new directory for ./org.apache.solr.cloud.BasicDistributedZk2Test-1363683628001/jetty1 forceNew: false
[junit4:junit4]   2> 9853 T54 oasc.SolrCore.getNewIndexDir New index directory detected: old=null new=./org.apache.solr.cloud.BasicDistributedZk2Test-1363683628001/jetty1/index/
[junit4:junit4]   2> 9853 T54 oasc.SolrCore.initIndex WARNING [collection1] Solr index directory './org.apache.solr.cloud.BasicDistributedZk2Test-1363683628001/jetty1/index' doesn't exist. Creating new index...
[junit4:junit4]   2> 9854 T54 oasc.CachingDirectoryFactory.get return new directory for ./org.apache.solr.cloud.BasicDistributedZk2Test-1363683628001/jetty1/index forceNew: false
[junit4:junit4]   2> 9855 T54 oasc.SolrDeletionPolicy.onCommit SolrDeletionPolicy.onCommit: commits:num=1
[junit4:junit4]   2> 		commit{dir=MockDirWrapper(org.apache.lucene.store.RAMDirectory@1fa9706 lockFactory=org.apache.lucene.store.NativeFSLockFactory@18f4201),segFN=segments_1,generation=1,filenames=[segments_1]
[junit4:junit4]   2> 9855 T54 oasc.SolrDeletionPolicy.updateCommits newest commit = 1[segments_1]
[junit4:junit4]   2> 9858 T54 oasup.UpdateRequestProcessorChain.init inserting DistributedUpdateProcessorFactory into updateRequestProcessorChain "dedupe"
[junit4:junit4]   2> 9858 T54 oasup.UpdateRequestProcessorChain.init inserting DistributedUpdateProcessorFactory into updateRequestProcessorChain "stored_sig"
[junit4:junit4]   2> 9859 T54 oasup.UpdateRequestProcessorChain.init inserting DistributedUpdateProcessorFactory into updateRequestProcessorChain "distrib-dup-test-chain-implicit"
[junit4:junit4]   2> 9861 T54 oasc.RequestHandlers.initHandlersFromConfig created standard: solr.StandardRequestHandler
[junit4:junit4]   2> 9862 T54 oasc.RequestHandlers.initHandlersFromConfig created /get: solr.RealTimeGetHandler
[junit4:junit4]   2> 9862 T54 oasc.RequestHandlers.initHandlersFromConfig adding lazy requestHandler: solr.ReplicationHandler
[junit4:junit4]   2> 9862 T54 oasc.RequestHandlers.initHandlersFromConfig created /replication: solr.ReplicationHandler
[junit4:junit4]   2> 9863 T54 oasc.RequestHandlers.initHandlersFromConfig created /update: solr.UpdateRequestHandler
[junit4:junit4]   2> 9864 T54 oasc.RequestHandlers.initHandlersFromConfig created /admin/: org.apache.solr.handler.admin.AdminHandlers
[junit4:junit4]   2> 9867 T54 oashl.XMLLoader.init xsltCacheLifetimeSeconds=60
[junit4:junit4]   2> 9870 T54 oass.SolrIndexSearcher.<init> Opening Searcher@60c52c main
[junit4:junit4]   2> 9870 T54 oasu.UpdateHandler.clearLog Clearing tlog files, tlogDir=./org.apache.solr.cloud.BasicDistributedZk2Test-1363683628001/jetty1/tlog
[junit4:junit4]   2> 9871 T54 oasu.CommitTracker.<init> Hard AutoCommit: disabled
[junit4:junit4]   2> 9871 T54 oasu.CommitTracker.<init> Soft AutoCommit: disabled
[junit4:junit4]   2> 9879 T55 oasc.SolrCore.registerSearcher [collection1] Registered new searcher Searcher@60c52c main{StandardDirectoryReader(segments_1:1)}
[junit4:junit4]   2> 9884 T54 oasc.ZkController.publish publishing core=collection1 state=down
[junit4:junit4]   2> 9884 T54 oasc.ZkController.publish numShards not found on descriptor - reading it from system property
[junit4:junit4]   2> 10854 T34 oascc.ZkStateReader.updateClusterState Updating cloud state from ZooKeeper... 
[junit4:junit4]   2> 10855 T34 oasc.Overseer$ClusterStateUpdater.updateState Update state numShards=2 message={
[junit4:junit4]   2> 	  "node_name":"127.0.0.1:52267_",
[junit4:junit4]   2> 	  "roles":null,
[junit4:junit4]   2> 	  "core":"collection1",
[junit4:junit4]   2> 	  "shard":null,
[junit4:junit4]   2> 	  "numShards":"2",
[junit4:junit4]   2> 	  "core_node_name":null,
[junit4:junit4]   2> 	  "state":"down",
[junit4:junit4]   2> 	  "collection":"collection1",
[junit4:junit4]   2> 	  "base_url":"http://127.0.0.1:52267",
[junit4:junit4]   2> 	  "operation":"state"}
[junit4:junit4]   2> 10856 T34 oasc.Overseer$ClusterStateUpdater.createCollection Create collection collection1 with numShards 2
[junit4:junit4]   2> 10856 T34 oasc.Overseer$ClusterStateUpdater.updateState Assigning new node to shard shard=shard2
[junit4:junit4]   2> 10861 T53 oascc.ZkStateReader$2.process A cluster state change: WatchedEvent state:SyncConnected type:NodeDataChanged path:/clusterstate.json, has occurred - updating... (live nodes size: 2)
[junit4:junit4]   2> 10861 T40 oascc.ZkStateReader$2.process A cluster state change: WatchedEvent state:SyncConnected type:NodeDataChanged path:/clusterstate.json, has occurred - updating... (live nodes size: 2)
[junit4:junit4]   2> 10861 T33 oascc.ZkStateReader$2.process A cluster state change: WatchedEvent state:SyncConnected type:NodeDataChanged path:/clusterstate.json, has occurred - updating... (live nodes size: 2)
[junit4:junit4]   2> 10886 T54 oasc.CoreContainer.registerCore registering core: collection1
[junit4:junit4]   2> 10886 T54 oasc.ZkController.register Register replica - core:collection1 address:http://127.0.0.1:52267 collection:collection1 shard:shard2
[junit4:junit4]   2> 10887 T54 oascc.SolrZkClient.makePath makePath: /collections/collection1/leader_elect/shard2/election
[junit4:junit4]   2> 10899 T15 oazs.PrepRequestProcessor.pRequest Got user-level KeeperException when processing sessionid:0x13d81e0d4620006 type:delete cxid:0x4a zxid:0x5a txntype:-1 reqpath:n/a Error Path:/solr/collections/collection1/leaders Error:KeeperErrorCode = NoNode for /solr/collections/collection1/leaders
[junit4:junit4]   2> 10899 T54 oasc.ShardLeaderElectionContext.runLeaderProcess Running the leader process.
[junit4:junit4]   2> 10900 T15 oazs.PrepRequestProcessor.pRequest Got user-level KeeperException when processing sessionid:0x13d81e0d4620006 type:create cxid:0x4b zxid:0x5b txntype:-1 reqpath:n/a Error Path:/solr/overseer Error:KeeperErrorCode = NodeExists for /solr/overseer
[junit4:junit4]   2> 10902 T54 oasc.ShardLeaderElectionContext.waitForReplicasToComeUp Enough replicas found to continue.
[junit4:junit4]   2> 10902 T54 oasc.ShardLeaderElectionContext.runLeaderProcess I may be the new leader - try and sync
[junit4:junit4]   2> 10902 T54 oasc.SyncStrategy.sync Sync replicas to http://127.0.0.1:52267/collection1/
[junit4:junit4]   2> 10903 T54 oasc.SyncStrategy.syncReplicas Sync Success - now sync replicas to me
[junit4:junit4]   2> 10903 T54 oasc.SyncStrategy.syncToMe http://127.0.0.1:52267/collection1/ has no replicas
[junit4:junit4]   2> 10903 T54 oasc.ShardLeaderElectionContext.runLeaderProcess I am the new leader: http://127.0.0.1:52267/collection1/
[junit4:junit4]   2> 10903 T54 oascc.SolrZkClient.makePath makePath: /collections/collection1/leaders/shard2
[junit4:junit4]   2> 10907 T15 oazs.PrepRequestProcessor.pRequest Got user-level KeeperException when processing sessionid:0x13d81e0d4620006 type:create cxid:0x56 zxid:0x5f txntype:-1 reqpath:n/a Error Path:/solr/overseer Error:KeeperErrorCode = NodeExists for /solr/overseer
[junit4:junit4]   2> 12367 T34 oascc.ZkStateReader.updateClusterState Updating cloud state from ZooKeeper... 
[junit4:junit4]   2> 12376 T33 oascc.ZkStateReader$2.process A cluster state change: WatchedEvent state:SyncConnected type:NodeDataChanged path:/clusterstate.json, has occurred - updating... (live nodes size: 2)
[junit4:junit4]   2> 12376 T40 oascc.ZkStateReader$2.process A cluster state change: WatchedEvent state:SyncConnected type:NodeDataChanged path:/clusterstate.json, has occurred - updating... (live nodes size: 2)
[junit4:junit4]   2> 12376 T53 oascc.ZkStateReader$2.process A cluster state change: WatchedEvent state:SyncConnected type:NodeDataChanged path:/clusterstate.json, has occurred - updating... (live nodes size: 2)
[junit4:junit4]   2> 12417 T54 oasc.ZkController.register We are http://127.0.0.1:52267/collection1/ and leader is http://127.0.0.1:52267/collection1/
[junit4:junit4]   2> 12418 T54 oasc.ZkController.register No LogReplay needed for core=collection1 baseURL=http://127.0.0.1:52267
[junit4:junit4]   2> 12418 T54 oasc.ZkController.checkRecovery I am the leader, no recovery necessary
[junit4:junit4]   2> 12418 T54 oasc.ZkController.publish publishing core=collection1 state=active
[junit4:junit4]   2> 12418 T54 oasc.ZkController.publish numShards not found on descriptor - reading it from system property
[junit4:junit4]   2> 12420 T54 oascc.ZkStateReader.updateClusterState Updating cloud state from ZooKeeper... 
[junit4:junit4]   2> 12421 T10 oass.SolrDispatchFilter.init user.dir=/mnt/ssd/jenkins/workspace/Lucene-Solr-trunk-Linux/solr/build/solr-core/test/J1
[junit4:junit4]   2> 12422 T10 oass.SolrDispatchFilter.init SolrDispatchFilter.init() done
[junit4:junit4]   2> 12422 T10 oascsi.HttpClientUtil.createClient Creating new http client, config:maxConnections=128&maxConnectionsPerHost=32&followRedirects=false
[junit4:junit4]   2> 12487 T10 oejs.Server.doStart jetty-8.1.8.v20121106
[junit4:junit4]   2> 12498 T10 oejs.AbstractConnector.doStart Started SelectChannelConnector@127.0.0.1:57845
[junit4:junit4]   2> 12498 T10 oass.SolrDispatchFilter.init SolrDispatchFilter.init()
[junit4:junit4]   2> 12499 T10 oasc.SolrResourceLoader.locateSolrHome JNDI not configured for solr (NoInitialContextEx)
[junit4:junit4]   2> 12499 T10 oasc.SolrResourceLoader.locateSolrHome using system property solr.solr.home: /mnt/ssd/jenkins/workspace/Lucene-Solr-trunk-Linux/solr/build/solr-core/test/J1/./org.apache.solr.cloud.BasicDistributedZk2Test-jetty2-1363683640353
[junit4:junit4]   2> 12500 T10 oasc.CoreContainer$Initializer.initialize looking for solr config file: /mnt/ssd/jenkins/workspace/Lucene-Solr-trunk-Linux/solr/build/solr-core/test/J1/./org.apache.solr.cloud.BasicDistributedZk2Test-jetty2-1363683640353/solr.xml
[junit4:junit4]   2> 12500 T10 oasc.CoreContainer.<init> New CoreContainer 23017224
[junit4:junit4]   2> 12500 T10 oasc.CoreContainer.load Loading CoreContainer using Solr Home: '/mnt/ssd/jenkins/workspace/Lucene-Solr-trunk-Linux/solr/build/solr-core/test/J1/./org.apache.solr.cloud.BasicDistributedZk2Test-jetty2-1363683640353/'
[junit4:junit4]   2> 12501 T10 oasc.SolrResourceLoader.<init> new SolrResourceLoader for directory: '/mnt/ssd/jenkins/workspace/Lucene-Solr-trunk-Linux/solr/build/solr-core/test/J1/./org.apache.solr.cloud.BasicDistributedZk2Test-jetty2-1363683640353/'
[junit4:junit4]   2> 12523 T10 oashc.HttpShardHandlerFactory.getParameter Setting socketTimeout to: 120000
[junit4:junit4]   2> 12523 T10 oashc.HttpShardHandlerFactory.getParameter Setting urlScheme to: http://
[junit4:junit4]   2> 12524 T10 oashc.HttpShardHandlerFactory.getParameter Setting connTimeout to: 15000
[junit4:junit4]   2> 12524 T10 oashc.HttpShardHandlerFactory.getParameter Setting maxConnectionsPerHost to: 20
[junit4:junit4]   2> 12525 T10 oashc.HttpShardHandlerFactory.getParameter Setting corePoolSize to: 0
[junit4:junit4]   2> 12525 T10 oashc.HttpShardHandlerFactory.getParameter Setting maximumPoolSize to: 2147483647
[junit4:junit4]   2> 12525 T10 oashc.HttpShardHandlerFactory.getParameter Setting maxThreadIdleTime to: 5
[junit4:junit4]   2> 12526 T10 oashc.HttpShardHandlerFactory.getParameter Setting sizeOfQueue to: -1
[junit4:junit4]   2> 12526 T10 oashc.HttpShardHandlerFactory.getParameter Setting fairnessPolicy to: false
[junit4:junit4]   2> 12527 T10 oascsi.HttpClientUtil.createClient Creating new http client, config:maxConnectionsPerHost=20&maxConnections=10000&socketTimeout=120000&connTimeout=15000&retry=false
[junit4:junit4]   2> 12535 T10 oasc.CoreContainer.load Registering Log Listener
[junit4:junit4]   2> 12549 T10 oasc.CoreContainer.initZooKeeper Zookeeper client=127.0.0.1:35704/solr
[junit4:junit4]   2> 12549 T10 oasc.ZkController.checkChrootPath zkHost includes chroot
[junit4:junit4]   2> 12550 T10 oaz.ZooKeeper.<init> Initiating client connection, connectString=127.0.0.1:35704 sessionTimeout=60000 watcher=org.apache.solr.common.cloud.ConnectionManager@164775a
[junit4:junit4]   2> 12551 T10 oascc.ConnectionManager.waitForConnected Waiting for client to connect to ZooKeeper
[junit4:junit4]   2> 12551 T66 oaz.ClientCnxn$SendThread.logStartConnect Opening socket connection to server localhost.localdomain/127.0.0.1:35704. Will not attempt to authenticate using SASL (access denied ("javax.security.auth.AuthPermission" "getLoginConfiguration"))
[junit4:junit4]   2> 12552 T66 oaz.ClientCnxn$SendThread.primeConnection Socket connection established to localhost.localdomain/127.0.0.1:35704, initiating session
[junit4:junit4]   2> 12552 T12 oazs.NIOServerCnxnFactory.run Accepted socket connection from /127.0.0.1:54830
[junit4:junit4]   2> 12553 T12 oazs.ZooKeeperServer.processConnectRequest Client attempting to establish new session at /127.0.0.1:54830
[junit4:junit4]   2> 12554 T14 oazs.ZooKeeperServer.finishSessionInit Established session 0x13d81e0d4620007 with negotiated timeout 20000 for client /127.0.0.1:54830
[junit4:junit4]   2> 12554 T66 oaz.ClientCnxn$SendThread.onConnected Session establishment complete on server localhost.localdomain/127.0.0.1:35704, sessionid = 0x13d81e0d4620007, negotiated timeout = 20000
[junit4:junit4]   2> 12556 T67 oascc.ConnectionManager.process Watcher org.apache.solr.common.cloud.ConnectionManager@164775a name:ZooKeeperConnection Watcher:127.0.0.1:35704 got event WatchedEvent state:SyncConnected type:None path:null path:null type:None
[junit4:junit4]   2> 12556 T10 oascc.ConnectionManager.waitForConnected Client is connected to ZooKeeper
[junit4:junit4]   2> 12557 T15 oazs.PrepRequestProcessor.pRequest2Txn Processed session termination for sessionid: 0x13d81e0d4620007
[junit4:junit4]   2> 12558 T67 oaz.ClientCnxn$EventThread.run EventThread shut down
[junit4:junit4]   2> 12558 T10 oaz.ZooKeeper.close Session: 0x13d81e0d4620007 closed
[junit4:junit4]   2> 12558 T12 oazs.NIOServerCnxn.closeSock Closed socket connection for client /127.0.0.1:54830 which had sessionid 0x13d81e0d4620007
[junit4:junit4]   2> 12559 T10 oascsi.HttpClientUtil.createClient Creating new http client, config:maxConnections=500&maxConnectionsPerHost=16&socketTimeout=120000&connTimeout=15000
[junit4:junit4]   2> 12563 T10 oaz.ZooKeeper.<init> Initiating client connection, connectString=127.0.0.1:35704/solr sessionTimeout=30000 watcher=org.apache.solr.common.cloud.ConnectionManager@573ea0
[junit4:junit4]   2> 12564 T68 oaz.ClientCnxn$SendThread.logStartConnect Opening socket connection to server localhost.localdomain/127.0.0.1:35704. Will not attempt to authenticate using SASL (access denied ("javax.security.auth.AuthPermission" "getLoginConfiguration"))
[junit4:junit4]   2> 12564 T10 oascc.ConnectionManager.waitForConnected Waiting for client to connect to ZooKeeper
[junit4:junit4]   2> 12565 T68 oaz.ClientCnxn$SendThread.primeConnection Socket connection established to localhost.localdomain/127.0.0.1:35704, initiating session
[junit4:junit4]   2> 12565 T12 oazs.NIOServerCnxnFactory.run Accepted socket connection from /127.0.0.1:54831
[junit4:junit4]   2> 12565 T12 oazs.ZooKeeperServer.processConnectRequest Client attempting to establish new session at /127.0.0.1:54831
[junit4:junit4]   2> 12566 T14 oazs.ZooKeeperServer.finishSessionInit Established session 0x13d81e0d4620008 with negotiated timeout 20000 for client /127.0.0.1:54831
[junit4:junit4]   2> 12566 T68 oaz.ClientCnxn$SendThread.onConnected Session establishment complete on server localhost.localdomain/127.0.0.1:35704, sessionid = 0x13d81e0d4620008, negotiated timeout = 20000
[junit4:junit4]   2> 12567 T69 oascc.ConnectionManager.process Watcher org.apache.solr.common.cloud.ConnectionManager@573ea0 name:ZooKeeperConnection Watcher:127.0.0.1:35704/solr got event WatchedEvent state:SyncConnected type:None path:null path:null type:None
[junit4:junit4]   2> 12567 T10 oascc.ConnectionManager.waitForConnected Client is connected to ZooKeeper
[junit4:junit4]   2> 12568 T15 oazs.PrepRequestProcessor.pRequest Got user-level KeeperException when processing sessionid:0x13d81e0d4620008 type:create cxid:0x1 zxid:0x6c txntype:-1 reqpath:n/a Error Path:/solr/overseer Error:KeeperErrorCode = NodeExists for /solr/overseer
[junit4:junit4]   2> 12569 T15 oazs.PrepRequestProcessor.pRequest Got user-level KeeperException when processing sessionid:0x13d81e0d4620008 type:create cxid:0x3 zxid:0x6d txntype:-1 reqpath:n/a Error Path:/solr/overseer Error:KeeperErrorCode = NodeExists for /solr/overseer
[junit4:junit4]   2> 12571 T10 oascc.ZkStateReader.createClusterStateWatchersAndUpdate Updating cluster state from ZooKeeper... 
[junit4:junit4]   2> 13574 T10 oasc.ZkController.createEphemeralLiveNode Register node as live in ZooKeeper:/live_nodes/127.0.0.1:57845_
[junit4:junit4]   2> 13575 T15 oazs.PrepRequestProcessor.pRequest Got user-level KeeperException when processing sessionid:0x13d81e0d4620008 type:delete cxid:0xd zxid:0x6e txntype:-1 reqpath:n/a Error Path:/solr/live_nodes/127.0.0.1:57845_ Error:KeeperErrorCode = NoNode for /solr/live_nodes/127.0.0.1:57845_
[junit4:junit4]   2> 13575 T10 oascc.SolrZkClient.makePath makePath: /live_nodes/127.0.0.1:57845_
[junit4:junit4]   2> 13578 T33 oascc.ZkStateReader$2.process A cluster state change: WatchedEvent state:SyncConnected type:NodeChildrenChanged path:/live_nodes, has occurred - updating... (live nodes size: 2)
[junit4:junit4]   2> 13578 T53 oascc.ZkStateReader$3.process Updating live nodes... (3)
[junit4:junit4]   2> 13579 T53 oascc.ZkStateReader$2.process A cluster state change: WatchedEvent state:SyncConnected type:NodeChildrenChanged path:/live_nodes, has occurred - updating... (live nodes size: 3)
[junit4:junit4]   2> 13579 T40 oascc.ZkStateReader$3.process Updating live nodes... (3)
[junit4:junit4]   2> 13579 T69 oascc.ZkStateReader$3.process Updating live nodes... (3)
[junit4:junit4]   2> 13579 T40 oascc.ZkStateReader$2.process A cluster state change: WatchedEvent state:SyncConnected type:NodeChildrenChanged path:/live_nodes, has occurred - updating... (live nodes size: 3)
[junit4:junit4]   2> 13580 T33 oascc.ZkStateReader$3.process Updating live nodes... (3)
[junit4:junit4]   2> 13585 T70 oasc.CoreContainer.create Creating SolrCore 'collection1' using instanceDir: /mnt/ssd/jenkins/workspace/Lucene-Solr-trunk-Linux/solr/build/solr-core/test/J1/./org.apache.solr.cloud.BasicDistributedZk2Test-jetty2-1363683640353/collection1
[junit4:junit4]   2> 13585 T70 oasc.ZkController.createCollectionZkNode Check for collection zkNode:collection1
[junit4:junit4]   2> 13586 T70 oasc.ZkController.createCollectionZkNode Collection zkNode exists
[junit4:junit4]   2> 13586 T70 oasc.ZkController.readConfigName Load collection config from:/collections/collection1
[junit4:junit4]   2> 13587 T70 oasc.SolrResourceLoader.<init> new SolrResourceLoader for directory: '/mnt/ssd/jenkins/workspace/Lucene-Solr-trunk-Linux/solr/build/solr-core/test/J1/./org.apache.solr.cloud.BasicDistributedZk2Test-jetty2-1363683640353/collection1/'
[junit4:junit4]   2> 13588 T70 oasc.SolrResourceLoader.replaceClassLoader Adding 'file:/mnt/ssd/jenkins/workspace/Lucene-Solr-trunk-Linux/solr/build/solr-core/test/J1/org.apache.solr.cloud.BasicDistributedZk2Test-jetty2-1363683640353/collection1/lib/README' to classloader
[junit4:junit4]   2> 13588 T70 oasc.SolrResourceLoader.replaceClassLoader Adding 'file:/mnt/ssd/jenkins/workspace/Lucene-Solr-trunk-Linux/solr/build/solr-core/test/J1/org.apache.solr.cloud.BasicDistributedZk2Test-jetty2-1363683640353/collection1/lib/classes/' to classloader
[junit4:junit4]   2> 13634 T70 oasc.SolrConfig.<init> Using Lucene MatchVersion: LUCENE_50
[junit4:junit4]   2> 13674 T70 oasc.SolrConfig.<init> Loaded SolrConfig: solrconfig.xml
[junit4:junit4]   2> 13675 T70 oass.IndexSchema.readSchema Reading Solr Schema
[junit4:junit4]   2> 13683 T70 oass.IndexSchema.readSchema Schema name=test
[junit4:junit4]   2> 13883 T34 oascc.ZkStateReader.updateClusterState Updating cloud state from ZooKeeper... 
[junit4:junit4]   2> 13884 T34 oasc.Overseer$ClusterStateUpdater.updateState Update state numShards=2 message={
[junit4:junit4]   2> 	  "node_name":"127.0.0.1:52267_",
[junit4:junit4]   2> 	  "roles":null,
[junit4:junit4]   2> 	  "core":"collection1",
[junit4:junit4]   2> 	  "shard":"shard2",
[junit4:junit4]   2> 	  "numShards":"2",
[junit4:junit4]   2> 	  "core_node_name":"127.0.0.1:52267__collection1",
[junit4:junit4]   2> 	  "state":"active",
[junit4:junit4]   2> 	  "collection":"collection1",
[junit4:junit4]   2> 	  "base_url":"http://127.0.0.1:52267",
[junit4:junit4]   2> 	  "operation":"state"}
[junit4:junit4]   2> 13888 T40 oascc.ZkStateReader$2.process A cluster state change: WatchedEvent state:SyncConnected type:NodeDataChanged path:/clusterstate.json, has occurred - updating... (live nodes size: 3)
[junit4:junit4]   2> 13888 T69 oascc.ZkStateReader$2.process A cluster state change: WatchedEvent state:SyncConnected type:NodeDataChanged path:/clusterstate.json, has occurred - updating... (live nodes size: 3)
[junit4:junit4]   2> 13888 T53 oascc.ZkStateReader$2.process A cluster state change: WatchedEvent state:SyncConnected type:NodeDataChanged path:/clusterstate.json, has occurred - updating... (live nodes size: 3)
[junit4:junit4]   2> 13889 T33 oascc.ZkStateReader$2.process A cluster state change: WatchedEvent state:SyncConnected type:NodeDataChanged path:/clusterstate.json, has occurred - updating... (live nodes size: 3)
[junit4:junit4]   2> 14154 T70 oass.OpenExchangeRatesOrgProvider.init Initialized with rates=open-exchange-rates.json, refreshInterval=1440.
[junit4:junit4]   2> 14162 T70 oass.IndexSchema.readSchema default search field in schema is text
[junit4:junit4]   2> 14165 T70 oass.IndexSchema.readSchema unique key field: id
[junit4:junit4]   2> 14184 T70 oass.FileExchangeRateProvider.reload Reloading exchange rates from file currency.xml
[junit4:junit4]   2> 14189 T70 oass.FileExchangeRateProvider.reload Reloading exchange rates from file currency.xml
[junit4:junit4]   2> 14192 T70 oass.OpenExchangeRatesOrgProvider.reload Reloading exchange rates from open-exchange-rates.json
[junit4:junit4]   2> 14194 T70 oass.OpenExchangeRatesOrgProvider$OpenExchangeRates.<init> WARNING Unknown key IMPORTANT NOTE
[junit4:junit4]   2> 14194 T70 oass.OpenExchangeRatesOrgProvider$OpenExchangeRates.<init> WARNING Expected key, got STRING
[junit4:junit4]   2> 14194 T70 oass.OpenExchangeRatesOrgProvider.reload Reloading exchange rates from open-exchange-rates.json
[junit4:junit4]   2> 14195 T70 oass.OpenExchangeRatesOrgProvider$OpenExchangeRates.<init> WARNING Unknown key IMPORTANT NOTE
[junit4:junit4]   2> 14196 T70 oass.OpenExchangeRatesOrgProvider$OpenExchangeRates.<init> WARNING Expected key, got STRING
[junit4:junit4]   2> 14196 T70 oasc.SolrCore.initDirectoryFactory org.apache.solr.core.MockDirectoryFactory
[junit4:junit4]   2> 14196 T70 oasc.SolrCore.<init> [collection1] Opening new SolrCore at /mnt/ssd/jenkins/workspace/Lucene-Solr-trunk-Linux/solr/build/solr-core/test/J1/./org.apache.solr.cloud.BasicDistributedZk2Test-jetty2-1363683640353/collection1/, dataDir=./org.apache.solr.cloud.BasicDistributedZk2Test-1363683628001/jetty2/
[junit4:junit4]   2> 14197 T70 oasc.JmxMonitoredMap.<init> JMX monitoring is enabled. Adding Solr mbeans to JMX Server: com.sun.jmx.mbeanserver.JmxMBeanServer@1967072
[junit4:junit4]   2> 14198 T70 oasc.SolrCore.initDirectoryFactory org.apache.solr.core.MockDirectoryFactory
[junit4:junit4]   2> 14199 T70 oasc.CachingDirectoryFactory.get return new directory for ./org.apache.solr.cloud.BasicDistributedZk2Test-1363683628001/jetty2 forceNew: false
[junit4:junit4]   2> 14199 T70 oasc.SolrCore.getNewIndexDir New index directory detected: old=null new=./org.apache.solr.cloud.BasicDistributedZk2Test-1363683628001/jetty2/index/
[junit4:junit4]   2> 14199 T70 oasc.SolrCore.initIndex WARNING [collection1] Solr index directory './org.apache.solr.cloud.BasicDistributedZk2Test-1363683628001/jetty2/index' doesn't exist. Creating new index...
[junit4:junit4]   2> 14200 T70 oasc.CachingDirectoryFactory.get return new directory for ./org.apache.solr.cloud.BasicDistributedZk2Test-1363683628001/jetty2/index forceNew: false
[junit4:junit4]   2> 14201 T70 oasc.SolrDeletionPolicy.onCommit SolrDeletionPolicy.onCommit: commits:num=1
[junit4:junit4]   2> 		commit{dir=MockDirWrapper(org.apache.lucene.store.RAMDirectory@1039a38 lockFactory=org.apache.lucene.store.NativeFSLockFactory@2fb7f0),segFN=segments_1,generation=1,filenames=[segments_1]
[junit4:junit4]   2> 14202 T70 oasc.SolrDeletionPolicy.updateCommits newest commit = 1[segments_1]
[junit4:junit4]   2> 14204 T70 oasup.UpdateRequestProcessorChain.init inserting DistributedUpdateProcessorFactory into updateRequestProcessorChain "dedupe"
[junit4:junit4]   2> 14204 T70 oasup.UpdateRequestProcessorChain.init inserting DistributedUpdateProcessorFactory into updateRequestProcessorChain "stored_sig"
[junit4:junit4]   2> 14205 T70 oasup.UpdateRequestProcessorChain.init inserting DistributedUpdateProcessorFactory into updateRequestProcessorChain "distrib-dup-test-chain-implicit"
[junit4:junit4]   2> 14206 T70 oasc.RequestHandlers.initHandlersFromConfig created standard: solr.StandardRequestHandler
[junit4:junit4]   2> 14207 T70 oasc.RequestHandlers.initHandlersFromConfig created /get: solr.RealTimeGetHandler
[junit4:junit4]   2> 14208 T70 oasc.RequestHandlers.initHandlersFromConfig adding lazy requestHandler: solr.ReplicationHandler
[junit4:junit4]   2> 14208 T70 oasc.RequestHandlers.initHandlersFromConfig created /replication: solr.ReplicationHandler
[junit4:junit4]   2> 14209 T70 oasc.RequestHandlers.initHandlersFromConfig created /update: solr.UpdateRequestHandler
[junit4:junit4]   2> 14210 T70 oasc.RequestHandlers.initHandlersFromConfig created /admin/: org.apache.solr.handler.admin.AdminHandlers
[junit4:junit4]   2> 14212 T70 oashl.XMLLoader.init xsltCacheLifetimeSeconds=60
[junit4:junit4]   2> 14215 T70 oass.SolrIndexSearcher.<init> Opening Searcher@9de032 main
[junit4:junit4]   2> 14215 T70 oasu.UpdateHandler.clearLog Clearing tlog files, tlogDir=./org.apache.solr.cloud.BasicDistributedZk2Test-1363683628001/jetty2/tlog
[junit4:junit4]   2> 14216 T70 oasu.CommitTracker.<init> Hard AutoCommit: disabled
[junit4:junit4]   2> 14216 T70 oasu.CommitTracker.<init> Soft AutoCommit: disabled
[junit4:junit4]   2> 14223 T71 oasc.SolrCore.registerSearcher [collection1] Registered new searcher Searcher@9de032 main{StandardDirectoryReader(segments_1:1)}
[junit4:junit4]   2> 14226 T70 oasc.ZkController.publish publishing core=collection1 state=down
[junit4:junit4]   2> 14226 T70 oasc.ZkController.publish numShards not found on descriptor - reading it from system property
[junit4:junit4]   2> 15395 T34 oascc.ZkStateReader.updateClusterState Updating cloud state from ZooKeeper... 
[junit4:junit4]   2> 15396 T34 oasc.Overseer$ClusterStateUpdater.updateState Update state numShards=2 message={
[junit4:junit4]   2> 	  "node_name":"127.0.0.1:57845_",
[junit4:junit4]   2> 	  "roles":null,
[junit4:junit4]   2> 	  "core":"collection1",
[junit4:junit4]   2> 	  "shard":null,
[junit4:junit4]   2> 	  "numShards":"2",
[junit4:junit4]   2> 	  "core_node_name":null,
[junit4:junit4]   2> 	  "state":"down",
[junit4:junit4]   2> 	  "collection":"collection1",
[junit4:junit4]   2> 	  "base_url":"http://127.0.0.1:57845",
[junit4:junit4]   2> 	  "operation":"state"}
[junit4:junit4]   2> 15396 T34 oasc.Overseer$ClusterStateUpdater.updateState Collection already exists with numShards=2
[junit4:junit4]   2> 15396 T34 oasc.Overseer$ClusterStateUpdater.updateState Assigning new node to shard shard=shard1
[junit4:junit4]   2> 15400 T33 oascc.ZkStateReader$2.process A cluster state change: WatchedEvent state:SyncConnected type:NodeDataChanged path:/clusterstate.json, has occurred - updating... (live nodes size: 3)
[junit4:junit4]   2> 15401 T53 oascc.ZkStateReader$2.process A cluster state change: WatchedEvent state:SyncConnected type:NodeDataChanged path:/clusterstate.json, has occurred - updating... (live nodes size: 3)
[junit4:junit4]   2> 15400 T69 oascc.ZkStateReader$2.process A cluster state change: WatchedEvent state:SyncConnected type:NodeDataChanged path:/clusterstate.json, has occurred - updating... (live nodes size: 3)
[junit4:junit4]   2> 15400 T40 oascc.ZkStateReader$2.process A cluster state change: WatchedEvent state:SyncConnected type:NodeDataChanged path:/clusterstate.json, has occurred - updating... (live nodes size: 3)
[junit4:junit4]   2> 16228 T70 oasc.CoreContainer.registerCore registering core: collection1
[junit4:junit4]   2> 16228 T70 oasc.ZkController.register Register replica - core:collection1 address:http://127.0.0.1:57845 collection:collection1 shard:shard1
[junit4:junit4]   2> 16229 T70 oascc.SolrZkClient.makePath makePath: /collections/collection1/leader_elect/shard1/election
[junit4:junit4]   2> 16235 T15 oazs.PrepRequestProcessor.pRequest Got user-level KeeperException when processing sessionid:0x13d81e0d4620008 type:delete cxid:0x49 zxid:0x7d txntype:-1 reqpath:n/a Error Path:/solr/collections/collection1/leaders/shard1 Error:KeeperErrorCode = NoNode for /solr/collections/collection1/leaders/shard1
[junit4:junit4]   2> 16235 T70 oasc.ShardLeaderElectionContext.runLeaderProcess Running the leader process.
[junit4:junit4]   2> 16236 T15 oazs.PrepRequestProcessor.pRequest Got user-level KeeperException when processing sessionid:0x13d81e0d4620008 type:create cxid:0x4a zxid:0x7e txntype:-1 reqpath:n/a Error Path:/solr/overseer Error:KeeperErrorCode = NodeExists for /solr/overseer
[junit4:junit4]   2> 16238 T70 oasc.ShardLeaderElectionContext.waitForReplicasToComeUp Enough replicas found to continue.
[junit4:junit4]   2> 16238 T70 oasc.ShardLeaderElectionContext.runLeaderProcess I may be the new leader - try and sync
[junit4:junit4]   2> 16238 T70 oasc.SyncStrategy.sync Sync replicas to http://127.0.0.1:57845/collection1/
[junit4:junit4]   2> 16239 T70 oasc.SyncStrategy.syncReplicas Sync Success - now sync replicas to me
[junit4:junit4]   2> 16239 T70 oasc.SyncStrategy.syncToMe http://127.0.0.1:57845/collection1/ has no replicas
[junit4:junit4]   2> 16239 T70 oasc.ShardLeaderElectionContext.runLeaderProcess I am the new leader: http://127.0.0.1:57845/collection1/
[junit4:junit4]   2> 16240 T70 oascc.SolrZkClient.makePath makePath: /collections/collection1/leaders/shard1
[junit4:junit4]   2> 16243 T15 oazs.PrepRequestProcessor.pRequest Got user-level KeeperException when processing sessionid:0x13d81e0d4620008 type:create cxid:0x54 zxid:0x81 txntype:-1 reqpath:n/a Error Path:/solr/overseer Error:KeeperErrorCode = NodeExists for /solr/overseer
[junit4:junit4]   2> 16905 T34 oascc.ZkStateReader.updateClusterState Updating cloud state from ZooKeeper... 
[junit4:junit4]   2> 16957 T53 oascc.ZkStateReader$2.process A cluster state change: WatchedEvent state:SyncConnected type:NodeDataChanged path:/clusterstate.json, has occurred - updating... (live nodes size: 3)
[junit4:junit4]   2> 16957 T40 oascc.ZkStateReader$2.process A cluster state change: WatchedEvent state:SyncConnected type:NodeDataChanged path:/clusterstate.json, has occurred - updating... (live nodes size: 3)
[junit4:junit4]   2> 16957 T33 oascc.ZkStateReader$2.process A cluster state change: WatchedEvent state:SyncConnected type:NodeDataChanged path:/clusterstate.json, has occurred - updating... (live nodes size: 3)
[junit4:junit4]   2> 16957 T69 oascc.ZkStateReader$2.process A cluster state change: WatchedEvent state:SyncConnected type:NodeDataChanged path:/clusterstate.json, has occurred - updating... (live nodes size: 3)
[junit4:junit4]   2> 16996 T70 oasc.ZkController.register We are http://127.0.0.1:57845/collection1/ and leader is http://127.0.0.1:57845/collection1/
[junit4:junit4]   2> 16997 T70 oasc.ZkController.register No LogReplay needed for core=collection1 baseURL=http://127.0.0.1:57845
[junit4:junit4]   2> 16997 T70 oasc.ZkController.checkRecovery I am the leader, no recovery necessary
[junit4:junit4]   2> 16997 T70 oasc.ZkController.publish publishing core=collection1 state=active
[junit4:junit4]   2> 16997 T70 oasc.ZkController.publish numShards not found on descriptor - reading it from system property
[junit4:junit4]   2> 16999 T70 oascc.ZkStateReader.updateClusterState Updating cloud state from ZooKeeper... 
[junit4:junit4]   2> 17000 T10 oass.SolrDispatchFilter.init user.dir=/mnt/ssd/jenkins/workspace/Lucene-Solr-trunk-Linux/solr/build/solr-core/test/J1
[junit4:junit4]   2> 17001 T10 oass.SolrDispatchFilter.init SolrDispatchFilter.init() done
[junit4:junit4]   2> 17001 T10 oascsi.HttpClientUtil.createClient Creating new http client, config:maxConnections=128&maxConnectionsPerHost=32&followRedirects=false
[junit4:junit4]   2> 17086 T10 oejs.Server.doStart jetty-8.1.8.v20121106
[junit4:junit4]   2> 17088 T10 oejs.AbstractConnector.doStart Started SelectChannelConnector@127.0.0.1:44754
[junit4:junit4]   2> 17089 T10 oass.SolrDispatchFilter.init SolrDispatchFilter.init()
[junit4:junit4]   2> 17089 T10 oasc.SolrResourceLoader.locateSolrHome JNDI not configured for solr (NoInitialContextEx)
[junit4:junit4]   2> 17090 T10 oasc.SolrResourceLoader.locateSolrHome using system property solr.solr.home: /mnt/ssd/jenkins/workspace/Lucene-Solr-trunk-Linux/solr/build/solr-core/test/J1/./org.apache.solr.cloud.BasicDistributedZk2Test-jetty3-1363683644932
[junit4:junit4]   2> 17090 T10 oasc.CoreContainer$Initializer.initialize looking for solr config file: /mnt/ssd/jenkins/workspace/Lucene-Solr-trunk-Linux/solr/build/solr-core/test/J1/./org.apache.solr.cloud.BasicDistributedZk2Test-jetty3-1363683644932/solr.xml
[junit4:junit4]   2> 17090 T10 oasc.CoreContainer.<init> New CoreContainer 9255418
[junit4:junit4]   2> 17091 T10 oasc.CoreContainer.load Loading CoreContainer using Solr Home: '/mnt/ssd/jenkins/workspace/Lucene-Solr-trunk-Linux/solr/build/solr-core/test/J1/./org.apache.solr.cloud.BasicDistributedZk2Test-jetty3-1363683644932/'
[junit4:junit4]   2> 17091 T10 oasc.SolrResourceLoader.<init> new SolrResourceLoader for directory: '/mnt/ssd/jenkins/workspace/Lucene-Solr-trunk-Linux/solr/build/solr-core/test/J1/./org.apache.solr.cloud.BasicDistributedZk2Test-jetty3-1363683644932/'
[junit4:junit4]   2> 17115 T10 oashc.HttpShardHandlerFactory.getParameter Setting socketTimeout to: 120000
[junit4:junit4]   2> 17116 T10 oashc.HttpShardHandlerFactory.getParameter Setting urlScheme to: http://
[junit4:junit4]   2> 17116 T10 oashc.HttpShardHandlerFactory.getParameter Setting connTimeout to: 15000
[junit4:junit4]   2> 17117 T10 oashc.HttpShardHandlerFactory.getParameter Setting maxConnectionsPerHost to: 20
[junit4:junit4]   2> 17117 T10 oashc.HttpShardHandlerFactory.getParameter Setting corePoolSize to: 0
[junit4:junit4]   2> 17117 T10 oashc.HttpShardHandlerFactory.getParameter Setting maximumPoolSize to: 2147483647
[junit4:junit4]   2> 17118 T10 oashc.HttpShardHandlerFactory.getParameter Setting maxThreadIdleTime to: 5
[junit4:junit4]   2> 17118 T10 oashc.HttpShardHandlerFactory.getParameter Setting sizeOfQueue to: -1
[junit4:junit4]   2> 17119 T10 oashc.HttpShardHandlerFactory.getParameter Setting fairnessPolicy to: false
[junit4:junit4]   2> 17119 T10 oascsi.HttpClientUtil.createClient Creating new http client, config:maxConnectionsPerHost=20&maxConnections=10000&socketTimeout=120000&connTimeout=15000&retry=false
[junit4:junit4]   2> 17127 T10 oasc.CoreContainer.load Registering Log Listener
[junit4:junit4]   2> 17140 T10 oasc.CoreContainer.initZooKeeper Zookeeper client=127.0.0.1:35704/solr
[junit4:junit4]   2> 17152 T10 oasc.ZkController.checkChrootPath zkHost includes chroot
[junit4:junit4]   2> 17153 T10 oaz.ZooKeeper.<init> Initiating client connection, connectString=127.0.0.1:35704 sessionTimeout=60000 watcher=org.apache.solr.common.cloud.ConnectionManager@14e9ed7
[junit4:junit4]   2> 17154 T82 oaz.ClientCnxn$SendThread.logStartConnect Opening socket connection to server localhost.localdomain/127.0.0.1:35704. Will not attempt to authenticate using SASL (access denied ("javax.security.auth.AuthPermission" "getLoginConfiguration"))
[junit4:junit4]   2> 17154 T10 oascc.ConnectionManager.waitForConnected Waiting for client to connect to ZooKeeper
[junit4:junit4]   2> 17155 T82 oaz.ClientCnxn$SendThread.primeConnection Socket connection established to localhost.localdomain/127.0.0.1:35704, initiating session
[junit4:junit4]   2> 17155 T12 oazs.NIOServerCnxnFactory.run Accepted socket connection from /127.0.0.1:54832
[junit4:junit4]   2> 17155 T12 oazs.ZooKeeperServer.processConnectRequest Client attempting to establish new session at /127.0.0.1:54832
[junit4:junit4]   2> 17157 T14 oazs.ZooKeeperServer.finishSessionInit Established session 0x13d81e0d4620009 with negotiated timeout 20000 for client /127.0.0.1:54832
[junit4:junit4]   2> 17157 T82 oaz.ClientCnxn$SendThread.onConnected Session establishment complete on server localhost.localdomain/127.0.0.1:35704, sessionid = 0x13d81e0d4620009, negotiated timeout = 20000
[junit4:junit4]   2> 17158 T83 oascc.ConnectionManager.process Watcher org.apache.solr.common.cloud.ConnectionManager@14e9ed7 name:ZooKeeperConnection Watcher:127.0.0.1:35704 got event WatchedEvent state:SyncConnected type:None path:null path:null type:None
[junit4:junit4]   2> 17158 T10 oascc.ConnectionManager.waitForConnected Client is connected to ZooKeeper
[junit4:junit4]   2> 17159 T15 oazs.PrepRequestProcessor.pRequest2Txn Processed session termination for sessionid: 0x13d81e0d4620009
[junit4:junit4]   2> 17160 T83 oaz.ClientCnxn$EventThread.run EventThread shut down
[junit4:junit4]   2> 17160 T12 oazs.NIOServerCnxn.closeSock Closed socket connection for client /127.0.0.1:54832 which had sessionid 0x13d81e0d4620009
[junit4:junit4]   2> 17160 T10 oaz.ZooKeeper.close Session: 0x13d81e0d4620009 closed
[junit4:junit4]   2> 17161 T10 oascsi.HttpClientUtil.createClient Creating new http client, config:maxConnections=500&maxConnectionsPerHost=16&socketTimeout=120000&connTimeout=15000
[junit4:junit4]   2> 17164 T10 oaz.ZooKeeper.<init> Initiating client connection, connectString=127.0.0.1:35704/solr sessionTimeout=30000 watcher=org.apache.solr.common.cloud.ConnectionManager@18f8f46
[junit4:junit4]   2> 17165 T10 oascc.ConnectionManager.waitForConnected Waiting for client to connect to ZooKeeper
[junit4:junit4]   2> 17165 T84 oaz.ClientCnxn$SendThread.logStartConnect Opening socket connection to server localhost.localdomain/127.0.0.1:35704. Will not attempt to authenticate using SASL (access denied ("javax.security.auth.AuthPermission" "getLoginConfiguration"))
[junit4:junit4]   2> 17166 T84 oaz.ClientCnxn$SendThread.primeConnection Socket connection established to localhost.localdomain/127.0.0.1:35704, initiating session
[junit4:junit4]   2> 17166 T12 oazs.NIOServerCnxnFactory.run Accepted socket connection from /127.0.0.1:54833
[junit4:junit4]   2> 17166 T12 oazs.ZooKeeperServer.processConnectRequest Client attempting to establish new session at /127.0.0.1:54833
[junit4:junit4]   2> 17167 T14 oazs.ZooKeeperServer.finishSessionInit Established session 0x13d81e0d462000a with negotiated timeout 20000 for client /127.0.0.1:54833
[junit4:junit4]   2> 17167 T84 oaz.ClientCnxn$SendThread.onConnected Session establishment complete on server localhost.localdomain/127.0.0.1:35704, sessionid = 0x13d81e0d462000a, negotiated timeout = 20000
[junit4:junit4]   2> 17168 T85 oascc.ConnectionManager.process Watcher org.apache.solr.common.cloud.ConnectionManager@18f8f46 name:ZooKeeperConnection Watcher:127.0.0.1:35704/solr got event WatchedEvent state:SyncConnected type:None path:null path:null type:None
[junit4:junit4]   2> 17168 T10 oascc.ConnectionManager.waitForConnected Client is connected to ZooKeeper
[junit4:junit4]   2> 17169 T15 oazs.PrepRequestProcessor.pRequest Got user-level KeeperException when processing sessionid:0x13d81e0d462000a type:create cxid:0x1 zxid:0x8e txntype:-1 reqpath:n/a Error Path:/solr/overseer Error:KeeperErrorCode = NodeExists for /solr/overseer
[junit4:junit4]   2> 17171 T15 oazs.PrepRequestProcessor.pRequest Got user-level KeeperException when processing sessionid:0x13d81e0d462000a type:create cxid:0x3 zxid:0x8f txntype:-1 reqpath:n/a Error Path:/solr/overseer Error:KeeperErrorCode = NodeExists for /solr/overseer
[junit4:junit4]   2> 17173 T10 oascc.ZkStateReader.createClusterStateWatchersAndUpdate Updating cluster state from ZooKeeper... 
[junit4:junit4]   2> 18176 T10 oasc.ZkController.createEphemeralLiveNode Register node as live in ZooKeeper:/live_nodes/127.0.0.1:44754_
[junit4:junit4]   2> 18177 T15 oazs.PrepRequestProcessor.pRequest Got user-level KeeperException when processing sessionid:0x13d81e0d462000a type:delete cxid:0xd zxid:0x90 txntype:-1 reqpath:n/a Error Path:/solr/live_nodes/127.0.0.1:44754_ Error:KeeperErrorCode = NoNode for /solr/live_nodes/127.0.0.1:44754_
[junit4:junit4]   2> 18179 T10 oascc.SolrZkClient.makePath makePath: /live_nodes/127.0.0.1:44754_
[junit4:junit4]   2> 18181 T53 oascc.ZkStateReader$2.process A cluster state change: WatchedEvent state:SyncConnected type:NodeChildrenChanged path:/live_nodes, has occurred - updating... (live nodes size: 3)
[junit4:junit4]   2> 18182 T33 oascc.ZkStateReader$2.process A cluster state change: WatchedEvent state:SyncConnected type:NodeChildrenChanged path:/live_nodes, has occurred - updating... (live nodes size: 3)
[junit4:junit4]   2> 18182 T69 oascc.ZkStateReader$3.process Updating live nodes... (4)
[junit4:junit4]   2> 18182 T85 oascc.ZkStateReader$3.process Updating live nodes... (4)
[junit4:junit4]   2> 18182 T40 oascc.ZkStateReader$3.process Updating live nodes... (4)
[junit4:junit4]   2> 18183 T40 oascc.ZkStateReader$2.process A cluster state change: WatchedEvent state:SyncConnected type:NodeChildrenChanged path:/live_nodes, has occurred - updating... (live nodes size: 4)
[junit4:junit4]   2> 18182 T69 oascc.ZkStateReader$2.process A cluster state change: WatchedEvent state:SyncConnected type:NodeChildrenChanged path:/live_nodes, has occurred - updating... (live nodes size: 4)
[junit4:junit4]   2> 18184 T33 oascc.ZkStateReader$3.process Updating live nodes... (4)
[junit4:junit4]   2> 18185 T53 oascc.ZkStateReader$3.process Updating live nodes... (4)
[junit4:junit4]   2> 18190 T86 oasc.CoreContainer.create Creating SolrCore 'collection1' using instanceDir: /mnt/ssd/jenkins/workspace/Lucene-Solr-trunk-Linux/solr/build/solr-core/test/J1/./org.apache.solr.cloud.BasicDistributedZk2Test-jetty3-1363683644932/collection1
[junit4:junit4]   2> 18190 T86 oasc.ZkController.createCollectionZkNode Check for collection zkNode:collection1
[junit4:junit4]   2> 18191 T86 oasc.ZkController.createCollectionZkNode Collection zkNode exists
[junit4:junit4]   2> 18191 T86 oasc.ZkController.readConfigName Load collection config from:/collections/collection1
[junit4:junit4]   2> 18192 T86 oasc.SolrResourceLoader.<init> new SolrResourceLoader for directory: '/mnt/ssd/jenkins/workspace/Lucene-Solr-trunk-Linux/solr/build/solr-core/test/J1/./org.apache.solr.cloud.BasicDistributedZk2Test-jetty3-1363683644932/collection1/'
[junit4:junit4]   2> 18193 T86 oasc.SolrResourceLoader.replaceClassLoader Adding 'file:/mnt/ssd/jenkins/workspace/Lucene-Solr-trunk-Linux/solr/build/solr-core/test/J1/org.apache.solr.cloud.BasicDistributedZk2Test-jetty3-1363683644932/collection1/lib/README' to classloader
[junit4:junit4]   2> 18193 T86 oasc.SolrResourceLoader.replaceClassLoader Adding 'file:/mnt/ssd/jenkins/workspace/Lucene-Solr-trunk-Linux/solr/build/solr-core/test/J1/org.apache.solr.cloud.BasicDistributedZk2Test-jetty3-1363683644932/collection1/lib/classes/' to classloader
[junit4:junit4]   2> 18229 T86 oasc.SolrConfig.<init> Using Lucene MatchVersion: LUCENE_50
[junit4:junit4]   2> 18270 T86 oasc.SolrConfig.<init> Loaded SolrConfig: solrconfig.xml
[junit4:junit4]   2> 18271 T86 oass.IndexSchema.readSchema Reading Solr Schema
[junit4:junit4]   2> 18277 T86 oass.IndexSchema.readSchema Schema name=test
[junit4:junit4]   2> 18467 T34 oascc.ZkStateReader.updateClusterState Updating cloud state from ZooKeeper... 
[junit4:junit4]   2> 18468 T34 oasc.Overseer$ClusterStateUpdater.updateState Update state numShards=2 message={
[junit4:junit4]   2> 	  "node_name":"127.0.0.1:57845_",
[junit4:junit4]   2> 	  "roles":null,
[junit4:junit4]   2> 	  "core":"collection1",
[junit4:junit4]   2> 	  "shard":"shard1",
[junit4:junit4]   2> 	  "numShards":"2",
[junit4:junit4]   2> 	  "core_node_name":"127.0.0.1:57845__collection1",
[junit4:junit4]   2> 	  "state":"active",
[junit4:junit4]   2> 	  "collection":"collection1",
[junit4:junit4]   2> 	  "base_url":"http://127.0.0.1:57845",
[junit4:junit4]   2> 	  "operation":"state"}
[junit4:junit4]   2> 18471 T85 oascc.ZkStateReader$2.process A cluster state change: WatchedEvent state:SyncConnected type:NodeDataChanged path:/clusterstate.json, has occurred - updating... (live nodes size: 4)
[junit4:junit4]   2> 18472 T33 oascc.ZkStateReader$2.process A cluster state change: WatchedEvent state:SyncConnected type:NodeDataChanged path:/clusterstate.json, has occurred - updating... (live nodes size: 4)
[junit4:junit4]   2> 18472 T40 oascc.ZkStateReader$2.process A cluster state change: WatchedEvent state:SyncConnected type:NodeDataChanged path:/clusterstate.json, has occurred - updating... (live nodes size: 4)
[junit4:junit4]   2> 18471 T69 oascc.ZkStateReader$2.process A cluster state change: WatchedEvent state:SyncConnected type:NodeDataChanged path:/clusterstate.json, has occurred - updating... (live nodes size: 4)
[junit4:junit4]   2> 18472 T53 oascc.ZkStateReader$2.process A cluster state change: WatchedEvent state:SyncConnected type:NodeDataChanged path:/clusterstate.json, has occurred - updating... (live nodes size: 4)
[junit4:junit4]   2> 18729 T86 oass.OpenExchangeRatesOrgProvider.init Initialized with rates=open-exchange-rates.json, refreshInterval=1440.
[junit4:junit4]   2> 18737 T86 oass.IndexSchema.readSchema default search field in schema is text
[junit4:junit4]   2> 18740 T86 oass.IndexSchema.readSchema unique key field: id
[junit4:junit4]   2> 18760 T86 oass.FileExchangeRateProvider.reload Reloading exchange rates from file currency.xml
[junit4:junit4]   2> 18764 T86 oass.FileExchangeRateProvider.reload Reloading exchange rates from file currency.xml
[junit4:junit4]   2> 18768 T86 oass.OpenExchangeRatesOrgProvider.reload Reloading exchange rates from open-exchange-rates.json
[junit4:junit4]   2> 18769 T86 oass.OpenExchangeRatesOrgProvider$OpenExchangeRates.<init> WARNING Unknown key IMPORTANT NOTE
[junit4:junit4]   2> 18770 T86 oass.OpenExchangeRatesOrgProvider$OpenExchangeRates.<init> WARNING Expected key, got STRING
[junit4:junit4]   2> 18770 T86 oass.OpenExchangeRatesOrgProvider.reload Reloading exchange rates from open-exchange-rates.json
[junit4:junit4]   2> 18772 T86 oass.OpenExchangeRatesOrgProvider$OpenExchangeRates.<init> WARNING Unknown key IMPORTANT NOTE
[junit4:junit4]   2> 18772 T86 oass.OpenExchangeRatesOrgProvider$OpenExchangeRates.<init> WARNING Expected key, got STRING
[junit4:junit4]   2> 18773 T86 oasc.SolrCore.initDirectoryFactory org.apache.solr.core.MockDirectoryFactory
[junit4:junit4]   2> 18773 T86 oasc.SolrCore.<init> [collection1] Opening new SolrCore at /mnt/ssd/jenkins/workspace/Lucene-Solr-trunk-Linux/solr/build/solr-core/test/J1/./org.apache.solr.cloud.BasicDistributedZk2Test-jetty3-1363683644932/collection1/, dataDir=./org.apache.solr.cloud.BasicDistributedZk2Test-1363683628001/jetty3/
[junit4:junit4]   2> 18773 T86 oasc.JmxMonitoredMap.<init> JMX monitoring is enabled. Adding Solr mbeans to JMX Server: com.sun.jmx.mbeanserver.JmxMBeanServer@1967072
[junit4:junit4]   2> 18774 T86 oasc.SolrCore.initDirectoryFactory org.apache.solr.core.MockDirectoryFactory
[junit4:junit4]   2> 18775 T86 oasc.CachingDirectoryFactory.get return new directory for ./org.apache.solr.cloud.BasicDistributedZk2Test-1363683628001/jetty3 forceNew: false
[junit4:junit4]   2> 18775 T86 oasc.SolrCore.getNewIndexDir New index directory detected: old=null new=./org.apache.solr.cloud.BasicDistributedZk2Test-1363683628001/jetty3/index/
[junit4:junit4]   2> 18775 T86 oasc.SolrCore.initIndex WARNING [collection1] Solr index directory './org.apache.solr.cloud.BasicDistributedZk2Test-1363683628001/jetty3/index' doesn't exist. Creating new index...
[junit4:junit4]   2> 18775 T86 oasc.CachingDirectoryFactory.get return new directory for ./org.apache.solr.cloud.BasicDistributedZk2Test-1363683628001/jetty3/index forceNew: false
[junit4:junit4]   2> 18777 T86 oasc.SolrDeletionPolicy.onCommit SolrDeletionPolicy.onCommit: commits:num=1
[junit4:junit4]   2> 		commit{dir=MockDirWrapper(org.apache.lucene.store.RAMDirectory@187f00b lockFactory=org.apache.lucene.store.NativeFSLockFactory@b4ec91),segFN=segments_1,generation=1,filenames=[segments_1]
[junit4:junit4]   2> 18777 T86 oasc.SolrDeletionPolicy.updateCommits newest commit = 1[segments_1]
[junit4:junit4]   2> 18780 T86 oasup.UpdateRequestProcessorChain.init inserting DistributedUpdateProcessorFactory into updateRequestProcessorChain "dedupe"
[junit4:junit4]   2> 18780 T86 oasup.UpdateRequestProcessorChain.init inserting DistributedUpdateProcessorFactory into updateRequestProcessorChain "stored_sig"
[junit4:junit4]   2> 18781 T86 oasup.UpdateRequestProcessorChain.init inserting DistributedUpdateProcessorFactory into updateRequestProcessorChain "distrib-dup-test-chain-implicit"
[junit4:junit4]   2> 18782 T86 oasc.RequestHandlers.initHandlersFromConfig created standard: solr.StandardRequestHandler
[junit4:junit4]   2> 18783 T86 oasc.RequestHandlers.initHandlersFromConfig created /get: solr.RealTimeGetHandler
[junit4:junit4]   2> 18783 T86 oasc.RequestHandlers.initHandlersFromConfig adding lazy requestHandler: solr.ReplicationHandler
[junit4:junit4]   2> 18784 T86 oasc.RequestHandlers.initHandlersFromConfig created /replication: solr.ReplicationHandler
[junit4:junit4]   2> 18784 T86 oasc.RequestHandlers.initHandlersFromConfig created /update: solr.UpdateRequestHandler
[junit4:junit4]   2> 18785 T86 oasc.RequestHandlers.initHandlersFromConfig created /admin/: org.apache.solr.handler.admin.AdminHandlers
[junit4:junit4]   2> 18787 T86 oashl.XMLLoader.init xsltCacheLifetimeSeconds=60
[junit4:junit4]   2> 18790 T86 oass.SolrIndexSearcher.<init> Opening Searcher@12d76ff main
[junit4:junit4]   2> 18791 T86 oasu.UpdateHandler.clearLog Clearing tlog files, tlogDir=./org.apache.solr.cloud.BasicDistributedZk2Test-1363683628001/jetty3/tlog
[junit4:junit4]   2> 18791 T86 oasu.CommitTracker.<init> Hard AutoCommit: disabled
[junit4:junit4]   2> 18791 T86 oasu.CommitTracker.<init> Soft AutoCommit: disabled
[junit4:junit4]   2> 18799 T87 oasc.SolrCore.registerSearcher [collection1] Registered new searcher Searcher@12d76ff main{StandardDirectoryReader(segments_1:1)}
[junit4:junit4]   2> 18803 T86 oasc.ZkController.publish publishing core=collection1 state=down
[junit4:junit4]   2> 18803 T86 oasc.ZkController.publish numShards not found on descriptor - reading it from system property
[junit4:junit4]   2> 19977 T34 oascc.ZkStateReader.updateClusterState Updating cloud state from ZooKeeper... 
[junit4:junit4]   2> 19978 T34 oasc.Overseer$ClusterStateUpdater.updateState Update state numShards=2 message={
[junit4:junit4]   2> 	  "node_name":"127.0.0.1:44754_",
[junit4:junit4]   2> 	  "roles":null,
[junit4:junit4]   2> 	  "core":"collection1",
[junit4:junit4]   2> 	  "shard":null,
[junit4:junit4]   2> 	  "numShards":"2",
[junit4:junit4]   2> 	  "core_node_name":null,
[junit4:junit4]   2> 	  "state":"down",
[junit4:junit4]   2> 	  "collection":"collection1",
[junit4:junit4]   2> 	  "base_url":"http://127.0.0.1:44754",
[junit4:junit4]   2> 	  "operation":"state"}
[junit4:junit4]   2> 19978 T34 oasc.Overseer$ClusterStateUpdater.updateState Collection already exists with numShards=2
[junit4:junit4]   2> 19978 T34 oasc.Overseer$ClusterStateUpdater.updateState Assigning new node to shard shard=shard2
[junit4:junit4]   2> 20081 T85 oascc.ZkStateReader$2.process A cluster state change: WatchedEvent state:SyncConnected type:NodeDataChanged path:/clusterstate.json, has occurred - updating... (live nodes size: 4)
[junit4:junit4]   2> 20086 T53 oascc.ZkStateReader$2.process A cluster state change: WatchedEvent state:SyncConnected type:NodeDataChanged path:/clusterstate.json, has occurred - updating... (live nodes size: 4)
[junit4:junit4]   2> 20081 T33 oascc.ZkStateReader$2.process A cluster state change: WatchedEvent state:SyncConnected type:NodeDataChanged path:/clusterstate.json, has occurred - updating... (live nodes size: 4)
[junit4:junit4]   2> 20087 T69 oascc.ZkStateReader$2.process A cluster state change: WatchedEvent state:SyncConnected type:NodeDataChanged path:/clusterstate.json, has occurred - updating... (live nodes size: 4)
[junit4:junit4]   2> 20087 T40 oascc.ZkStateReader$2.process A cluster state change: WatchedEvent state:SyncConnected type:NodeDataChanged path:/clusterstate.json, has occurred - updating... (live nodes size: 4)
[junit4:junit4]   2> 20805 T86 oasc.CoreContainer.registerCore registering core: collection1
[junit4:junit4]   2> 20806 T86 oasc.ZkController.register Register replica - core:collection1 address:http://127.0.0.1:44754 collection:collection1 shard:shard2
[junit4:junit4]   2> 20809 T86 oasc.ZkController.register We are http://127.0.0.1:44754/collection1/ and leader is http://127.0.0.1:52267/collection1/
[junit4:junit4]   2> 20809 T86 oasc.ZkController.register No LogReplay needed for core=collection1 baseURL=http://127.0.0.1:44754
[junit4:junit4]   2> 20809 T86 oasc.ZkController.checkRecovery Core needs to recover:collection1
[junit4:junit4]   2> 20809 T86 oasu.DefaultSolrCoreState.doRecovery Running recovery - first canceling any ongoing recovery
[junit4:junit4]   2> 20813 T86 oascc.ZkStateReader.updateClusterState Updating cloud state from ZooKeeper... 
[junit4:junit4]   2> 20814 T10 oass.SolrDispatchFilter.init user.dir=/mnt/ssd/jenkins/workspace/Lucene-Solr-trunk-Linux/solr/build/solr-core/test/J1
[junit4:junit4]   2> 20815 T10 oass.SolrDispatchFilter.init SolrDispatchFilter.init() done
[junit4:junit4]   2> ASYNC  NEW_CORE C0 name=collection1 org.apache.solr.core.SolrCore@15f0bbe url=http://127.0.0.1:44754/collection1 node=127.0.0.1:44754_ C0_STATE=coll:collection1 core:collection1 props:{node_name=127.0.0.1:44754_, core=collection1, state=down, collection=collection1, base_url=http://127.0.0.1:44754}
[junit4:junit4]   2> 20815 T88 C0 P44754 oasc.RecoveryStrategy.run Starting recovery process.  core=collection1 recoveringAfterStartup=true
[junit4:junit4]   2> 20816 T10 oascsi.HttpClientUtil.createClient Creating new http client, config:maxConnections=128&maxConnectionsPerHost=32&followRedirects=false
[junit4:junit4]   2> 20817 T88 C0 P44754 oasc.RecoveryStrategy.doRecovery ###### startupVersions=[]
[junit4:junit4]   2> 20817 T88 C0 P44754 oasc.ZkController.publish publishing core=collection1 state=recovering
[junit4:junit4]   2> 20817 T88 C0 P44754 oasc.ZkController.publish numShards not found on descriptor - reading it from system property
[junit4:junit4]   2> 20820 T88 C0 P44754 oascsi.HttpClientUtil.createClient Creating new http client, config:maxConnections=128&maxConnectionsPerHost=32&followRedirects=false
[junit4:junit4]   2> 20885 T10 oejs.Server.doStart jetty-8.1.8.v20121106
[junit4:junit4]   2> 20887 T10 oejs.AbstractConnector.doStart Started SelectChannelConnector@127.0.0.1:55036
[junit4:junit4]   2> 20888 T10 oass.SolrDispatchFilter.init SolrDispatchFilter.init()
[junit4:junit4]   2> 20888 T10 oasc.SolrResourceLoader.locateSolrHome JNDI not configured for solr (NoInitialContextEx)
[junit4:junit4]   2> 20888 T10 oasc.SolrResourceLoader.locateSolrHome using system property solr.solr.home: /mnt/ssd/jenkins/workspace/Lucene-Solr-trunk-Linux/solr/build/solr-core/test/J1/./org.apache.solr.cloud.BasicDistributedZk2Test-jetty4-1363683648748
[junit4:junit4]   2> 20889 T10 oasc.CoreContainer$Initializer.initialize looking for solr config file: /mnt/ssd/jenkins/workspace/Lucene-Solr-trunk-Linux/solr/build/solr-core/test/J1/./org.apache.solr.cloud.BasicDistributedZk2Test-jetty4-1363683648748/solr.xml
[junit4:junit4]   2> 20889 T10 oasc.CoreContainer.<init> New CoreContainer 20804222
[junit4:junit4]   2> 20890 T10 oasc.CoreContainer.load Loading CoreContainer using Solr Home: '/mnt/ssd/jenkins/workspace/Lucene-Solr-trunk-Linux/solr/build/solr-core/test/J1/./org.apache.solr.cloud.BasicDistributedZk2Test-jetty4-1363683648748/'
[junit4:junit4]   2> 20890 T10 oasc.SolrResourceLoader.<init> new SolrResourceLoader for directory: '/mnt/ssd/jenkins/workspace/Lucene-Solr-trunk-Linux/solr/build/solr-core/test/J1/./org.apache.solr.cloud.BasicDistributedZk2Test-jetty4-1363683648748/'
[junit4:junit4]   2> 20911 T10 oashc.HttpShardHandlerFactory.getParameter Setting socketTimeout to: 120000
[junit4:junit4]   2> 20911 T10 oashc.HttpShardHandlerFactory.getParameter Setting urlScheme to: http://
[junit4:junit4]   2> 20912 T10 oashc.HttpShardHandlerFactory.getParameter Setting connTimeout to: 15000
[junit4:junit4]   2> 20912 T10 oashc.HttpShardHandlerFactory.getParameter Setting maxConnectionsPerHost to: 20
[junit4:junit4]   2> 20912 T10 oashc.HttpShardHandlerFactory.getParameter Setting corePoolSize to: 0
[junit4:junit4]   2> 20913 T10 oashc.HttpShardHandlerFactory.getParameter Setting maximumPoolSize to: 2147483647
[junit4:junit4]   2> 20913 T10 oashc.HttpShardHandlerFactory.getParameter Setting maxThreadIdleTime to: 5
[junit4:junit4]   2> 20913 T10 oashc.HttpShardHandlerFactory.getParameter Setting sizeOfQueue to: -1
[junit4:junit4]   2> 20914 T10 oashc.HttpShardHandlerFactory.getParameter Setting fairnessPolicy to: false
[junit4:junit4]   2> 20914 T10 oascsi.HttpClientUtil.createClient Creating new http client, config:maxConnectionsPerHost=20&maxConnections=10000&socketTimeout=120000&connTimeout=15000&retry=false
[junit4:junit4]   2> 20922 T10 oasc.CoreContainer.load Registering Log Listener
[junit4:junit4]   2> 20935 T10 oasc.CoreContainer.initZooKeeper Zookeeper client=127.0.0.1:35704/solr
[junit4:junit4]   2> 20936 T10 oasc.ZkController.checkChrootPath zkHost includes chroot
[junit4:junit4]   2> 20936 T10 oaz.ZooKeeper.<init> Initiating client connection, connectString=127.0.0.1:35704 sessionTimeout=60000 watcher=org.apache.solr.common.cloud.ConnectionManager@131714f
[junit4:junit4]   2> 20937 T10 oascc.ConnectionManager.waitForConnected Waiting for client to connect to ZooKeeper
[junit4:junit4]   2> 20938 T99 oaz.ClientCnxn$SendThread.logStartConnect Opening socket connection to server localhost.localdomain/127.0.0.1:35704. Will not attempt to authenticate using SASL (access denied ("javax.security.auth.AuthPermission" "getLoginConfiguration"))
[junit4:junit4]   2> 20938 T99 oaz.ClientCnxn$SendThread.primeConnection Socket connection established to localhost.localdomain/127.0.0.1:35704, initiating session
[junit4:junit4]   2> 20939 T12 oazs.NIOServerCnxnFactory.run Accepted socket connection from /127.0.0.1:54835
[junit4:junit4]   2> 20940 T12 oazs.ZooKeeperServer.processConnectRequest Client attempting to establish new session at /127.0.0.1:54835
[junit4:junit4]   2> 20940 T14 oazs.ZooKeeperServer.finishSessionInit Established session 0x13d81e0d462000b with negotiated timeout 20000 for client /127.0.0.1:54835
[junit4:junit4]   2> 20940 T99 oaz.ClientCnxn$SendThread.onConnected Session establishment complete on server localhost.localdomain/127.0.0.1:35704, sessionid = 0x13d81e0d462000b, negotiated timeout = 20000
[junit4:junit4]   2> 20941 T100 oascc.ConnectionManager.process Watcher org.apache.solr.common.cloud.ConnectionManager@131714f name:ZooKeeperConnection Watcher:127.0.0.1:35704 got event WatchedEvent state:SyncConnected type:None path:null path:null type:None
[junit4:junit4]   2> 20941 T10 oascc.ConnectionManager.waitForConnected Client is connected to ZooKeeper
[junit4:junit4]   2> 20942 T15 oazs.PrepRequestProcessor.pRequest2Txn Processed session termination for sessionid: 0x13d81e0d462000b
[junit4:junit4]   2> 20943 T100 oaz.ClientCnxn$EventThread.run EventThread shut down
[junit4:junit4]   2> 20943 T10 oaz.ZooKeeper.close Session: 0x13d81e0d462000b closed
[junit4:junit4]   2> 20943 T12 oazs.NIOServerCnxn.closeSock Closed socket connection for client /127.0.0.1:54835 which had sessionid 0x13d81e0d462000b
[junit4:junit4]   2> 20944 T10 oascsi.HttpClientUtil.createClient Creating new http client, config:maxConnections=500&maxConnectionsPerHost=16&socketTimeout=120000&connTimeout=15000
[junit4:junit4]   2> 20948 T10 oaz.ZooKeeper.<init> Initiating client connection, connectString=127.0.0.1:35704/solr sessionTimeout=30000 watcher=org.apache.solr.common.cloud.ConnectionManager@df218
[junit4:junit4]   2> 20949 T10 oascc.ConnectionManager.waitForConnected Waiting for client to connect to ZooKeeper
[junit4:junit4]   2> 20950 T101 oaz.ClientCnxn$SendThread.logStartConnect Opening socket connection to server localhost.localdomain/127.0.0.1:35704. Will not attempt to authenticate using SASL (access denied ("javax.security.auth.AuthPermission" "getLoginConfiguration"))
[junit4:junit4]   2> 20950 T101 oaz.ClientCnxn$SendThread.primeConnection Socket connection established to localhost.localdomain/127.0.0.1:35704, initiating session
[junit4:junit4]   2> 20950 T12 oazs.NIOServerCnxnFactory.run Accepted socket connection from /127.0.0.1:54836
[junit4:junit4]   2> 20951 T12 oazs.ZooKeeperServer.processConnectRequest Client attempting to establish new session at /127.0.0.1:54836
[junit4:junit4]   2> 20952 T14 oazs.ZooKeeperServer.finishSessionInit Established session 0x13d81e0d462000c with negotiated timeout 20000 for client /127.0.0.1:54836
[junit4:junit4]   2> 20952 T101 oaz.ClientCnxn$SendThread.onConnected Session establishment complete on server localhost.localdomain/127.0.0.1:35704, sessionid = 0x13d81e0d462000c, negotiated timeout = 20000
[junit4:junit4]   2> 20952 T102 oascc.ConnectionManager.process Watcher org.apache.solr.common.cloud.ConnectionManager@df218 name:ZooKeeperConnection Watcher:127.0.0.1:35704/solr got event WatchedEvent state:SyncConnected type:None path:null path:null type:None
[junit4:junit4]   2> 20953 T10 oascc.ConnectionManager.waitForConnected Client is connected to ZooKeeper
[junit4:junit4]   2> 20954 T15 oazs.PrepRequestProcessor.pRequest Got user-level KeeperException when processing sessionid:0x13d81e0d462000c type:create cxid:0x1 zxid:0xa1 txntype:-1 reqpath:n/a Error Path:/solr/overseer Error:KeeperErrorCode = NodeExists for /solr/overseer
[junit4:junit4]   2> 20955 T15 oazs.PrepRequestProcessor.pRequest Got user-level KeeperException when processing sessionid:0x13d81e0d462000c type:create cxid:0x3 zxid:0xa2 txntype:-1 reqpath:n/a Error Path:/solr/overseer Error:KeeperErrorCode = NodeExists for /solr/overseer
[junit4:junit4]   2> 20957 T10 oascc.ZkStateReader.createClusterStateWatchersAndUpdate Updating cluster state from ZooKeeper... 
[junit4:junit4]   2> 21591 T34 oascc.ZkStateReader.updateClusterState Updating cloud state from ZooKeeper... 
[junit4:junit4]   2> 21592 T34 oasc.Overseer$ClusterStateUpdater.updateState Update state numShards=2 message={
[junit4:junit4]   2> 	  "node_name":"127.0.0.1:44754_",
[junit4:junit4]   2> 	  "roles":null,
[junit4:junit4]   2> 	  "core":"collection1",
[junit4:junit4]   2> 	  "shard":"shard2",
[junit4:junit4]   2> 	  "numShards":"2",
[junit4:junit4]   2> 	  "core_node_name":"127.0.0.1:44754__collection1",
[junit4:junit4]   2> 	  "state":"recovering",
[junit4:junit4]   2> 	  "collection":"collection1",
[junit4:junit4]   2> 	  "base_url":"http://127.0.0.1:44754",
[junit4:junit4]   2> 	  "operation":"state"}
[junit4:junit4]   2> 21596 T102 oascc.ZkStateReader$2.process A cluster state change: WatchedEvent state:SyncConnected type:NodeDataChanged path:/clusterstate.json, has occurred - updating... (live nodes size: 4)
[junit4:junit4]   2> 21596 T85 oascc.ZkStateReader$2.process A cluster state change: WatchedEvent state:SyncConnected type:NodeDataChanged path:/clusterstate.json, has occurred - updating... (live nodes size: 4)
[junit4:junit4]   2> 21596 T40 oascc.ZkStateReader$2.process A cluster state change: WatchedEvent state:SyncConnected type:NodeDataChanged path:/clusterstate.json, has occurred - updating... (live nodes size: 4)
[junit4:junit4]   2> 21596 T69 oascc.ZkStateReader$2.process A cluster state change: WatchedEvent state:SyncConnected type:NodeDataChanged path:/clusterstate.json, has occurred - updating... (live nodes size: 4)
[junit4:junit4]   2> 21597 T33 oascc.ZkStateReader$2.process A cluster state change: WatchedEvent state:SyncConnected type:NodeDataChanged path:/clusterstate.json, has occurred - updating... (live nodes size: 4)
[junit4:junit4]   2> 21596 T53 oascc.ZkStateReader$2.process A cluster state change: WatchedEvent state:SyncConnected type:NodeDataChanged path:/clusterstate.json, has occurred - updating... (live nodes size: 4)
[junit4:junit4]   2> 21960 T10 oasc.ZkController.createEphemeralLiveNode Register node as live in ZooKeeper:/live_nodes/127.0.0.1:55036_
[junit4:junit4]   2> 21961 T15 oazs.PrepRequestProcessor.pRequest Got user-level KeeperException when processing sessionid:0x13d81e0d462000c type:delete cxid:0xf zxid:0xa7 txntype:-1 reqpath:n/a Error Path:/solr/live_nodes/127.0.0.1:55036_ Error:KeeperErrorCode = NoNode for /solr/live_nodes/127.0.0.1:55036_
[junit4:junit4]   2> 21962 T10 oascc.SolrZkClient.makePath makePath: /live_nodes/127.0.0.1:55036_
[junit4:junit4]   2> 21964 T85 oascc.ZkStateReader$2.process A cluster state change: WatchedEvent state:SyncConnected type:NodeChildrenChanged path:/live_nodes, has occurred - updating... (live nodes size: 4)
[junit4:junit4]   2> 21964 T33 oascc.ZkStateReader$2.process A cluster state change: WatchedEvent state:SyncConnected type:NodeChildrenChanged path:/live_nodes, has occurred - updating... (live nodes size: 4)
[junit4:junit4]   2> 21964 T53 oascc.ZkStateReader$3.process Updating live nodes... (5)
[junit4:junit4]   2> 21964 T102 oascc.ZkStateReader$3.process Updating live nodes... (5)
[junit4:junit4]   2> 21965 T53 oascc.ZkStateReader$2.process A cluster state change: WatchedEvent state:SyncConnected type:NodeChildrenChanged path:/live_nodes, has occurred - updating... (live nodes size: 5)
[junit4:junit4]   2> 21965 T102 oascc.ZkStateReader$2.process A cluster state change: WatchedEvent state:SyncConnected type:NodeChildrenChanged path:/live_nodes, has occurred - updating... (live nodes size: 5)
[junit4:junit4]   2> 21965 T69 oascc.ZkStateReader$3.process Updating live nodes... (5)
[junit4:junit4]   2> 21965 T40 oascc.ZkStateReader$3.process Updating live nodes... (5)
[junit4:junit4]   2> 21966 T69 oascc.ZkStateReader$2.process A cluster state change: WatchedEvent state:SyncConnected type:NodeChildrenChanged path:/live_nodes, has occurred - updating... (live nodes size: 5)
[junit4:junit4]   2> 21966 T40 oascc.ZkStateReader$2.process A cluster state change: WatchedEvent state:SyncConnected type:NodeChildrenChanged path:/live_nodes, has occurred - updating... (live nodes size: 5)
[junit4:junit4]   2> 21967 T33 oascc.ZkStateReader$3.process Updating live nodes... (5)
[junit4:junit4]   2> 21967 T85 oascc.ZkStateReader$3.process Updating live nodes... (5)
[junit4:junit4]   2> 21973 T103 oasc.CoreContainer.create Creating SolrCore 'collection1' using instanceDir: /mnt/ssd/jenkins/workspace/Lucene-Solr-trunk-Linux/solr/build/solr-core/test/J1/./org.apache.solr.cloud.BasicDistributedZk2Test-jetty4-1363683648748/collection1
[junit4:junit4]   2> 21973 T103 oasc.ZkController.createCollectionZkNode Check for collection zkNode:collection1
[junit4:junit4]   2> 21974 T103 oasc.ZkController.createCollectionZkNode Collection zkNode exists
[junit4:junit4]   2> 21974 T103 oasc.ZkController.readConfigName Load collection config from:/collections/collection1
[junit4:junit4]   2> 21976 T103 oasc.SolrResourceLoader.<init> new SolrResourceLoader for directory: '/mnt/ssd/jenkins/workspace/Lucene-Solr-trunk-Linux/solr/build/solr-core/test/J1/./org.apache.solr.cloud.BasicDistributedZk2Test-jetty4-1363683648748/collection1/'
[junit4:junit4]   2> 21976 T103 oasc.SolrResourceLoader.replaceClassLoader Adding 'file:/mnt/ssd/jenkins/workspace/Lucene-Solr-trunk-Linux/solr/build/solr-core/test/J1/org.apache.solr.cloud.BasicDistributedZk2Test-jetty4-1363683648748/collection1/lib/README' to classloader
[junit4:junit4]   2> 21976 T103 oasc.SolrResourceLoader.replaceClassLoader Adding 'file:/mnt/ssd/jenkins/workspace/Lucene-Solr-trunk-Linux/solr/build/solr-core/test/J1/org.apache.solr.cloud.BasicDistributedZk2Test-jetty4-1363683648748/collection1/lib/classes/' to classloader
[junit4:junit4]   2> 22009 T103 oasc.SolrConfig.<init> Using Lucene MatchVersion: LUCENE_50
[junit4:junit4]   2> 22047 T103 oasc.SolrConfig.<init> Loaded SolrConfig: solrconfig.xml
[junit4:junit4]   2> 22049 T103 oass.IndexSchema.readSchema Reading Solr Schema
[junit4:junit4]   2> 22054 T103 oass.IndexSchema.readSchema Schema name=test
[junit4:junit4]   2> 22130 T47 oass.SolrDispatchFilter.handleAdminRequest /admin/cores {action=PREPRECOVERY&checkLive=true&coreNodeName=127.0.0.1:44754__collection1&nodeName=127.0.0.1:44754_&core=collection1&onlyIfLeader=true&state=recovering&wt=javabin&version=2} status=0 QTime=1004 
[junit4:junit4]   2> 22498 T103 oass.OpenExchangeRatesOrgProvider.init Initialized with rates=open-exchange-rates.json, refreshInterval=1440.
[junit4:junit4]   2> 22505 T103 oass.IndexSchema.readSchema default search field in schema is text
[junit4:junit4]   2> 22508 T103 oass.IndexSchema.readSchema unique key field: id
[junit4:junit4]   2> 22525 T103 oass.FileExchangeRateProvider.reload Reloading exchange rates from file currency.xml
[junit4:junit4]   2> 22530 T103 oass.FileExchangeRateProvider.reload Reloading exchange rates from file currency.xml
[junit4:junit4]   2> 22534 T103 oass.OpenExchangeRatesOrgProvider.reload Reloading exchange rates from open-exchange-rates.json
[junit4:junit4]   2> 22535 T103 oass.OpenExchangeRatesOrgProvider$OpenExchangeRates.<init> WARNING Unknown key IMPORTANT NOTE
[junit4:junit4]   2> 22536 T103 oass.OpenExchangeRatesOrgProvider$OpenExchangeRates.<init> WARNING Expected key, got STRING
[junit4:junit4]   2> 22536 T103 oass.OpenExchangeRatesOrgProvider.reload Reloading exchange rates from open-exchange-rates.json
[junit4:junit4]   2> 22537 T103 oass.OpenExchangeRatesOrgProvider$OpenExchangeRates.<init> WARNING Unknown key IMPORTANT NOTE
[junit4:junit4]   2> 22537 T103 oass.OpenExchangeRatesOrgProvider$OpenExchangeRates.<init> WARNING Expected key, got STRING
[junit4:junit4]   2> 22537 T103 oasc.SolrCore.initDirectoryFactory org.apache.solr.core.MockDirectoryFactory
[junit4:junit4]   2> 22538 T103 oasc.SolrCore.<init> [collection1] Opening new SolrCore at /mnt/ssd/jenkins/workspace/Lucene-Solr-trunk-Linux/solr/build/solr-core/test/J1/./org.apache.solr.cloud.BasicDistributedZk2Test-jetty4-1363683648748/collection1/, dataDir=./org.apache.solr.cloud.BasicDistributedZk2Test-1363683628001/jetty4/
[junit4:junit4]   2> 22538 T103 oasc.JmxMonitoredMap.<init> JMX monitoring is enabled. Adding Solr mbeans to JMX Server: com.sun.jmx.mbeanserver.JmxMBeanServer@1967072
[junit4:junit4]   2> 22538 T103 oasc.SolrCore.initDirectoryFactory org.apache.solr.core.MockDirectoryFactory
[junit4:junit4]   2> 22539 T103 oasc.CachingDirectoryFactory.get return new directory for ./org.apache.solr.cloud.BasicDistributedZk2Test-1363683628001/jetty4 forceNew: false
[junit4:junit4]   2> 22539 T103 oasc.SolrCore.getNewIndexDir New index directory detected: old=null new=./org.apache.solr.cloud.BasicDistributedZk2Test-1363683628001/jetty4/index/
[junit4:junit4]   2> 22539 T103 oasc.SolrCore.initIndex WARNING [collection1] Solr index directory './org.apache.solr.cloud.BasicDistributedZk2Test-1363683628001/jetty4/index' doesn't exist. Creating new index...
[junit4:junit4]   2> 22540 T103 oasc.CachingDirectoryFactory.get return new directory for ./org.apache.solr.cloud.BasicDistributedZk2Test-1363683628001/jetty4/index forceNew: false
[junit4:junit4]   2> 22541 T103 oasc.SolrDeletionPolicy.onCommit SolrDeletionPolicy.onCommit: commits:num=1
[junit4:junit4]   2> 		commit{dir=MockDirWrapper(org.apache.lucene.store.RAMDirectory@1684402 lockFactory=org.apache.lucene.store.NativeFSLockFactory@1823404),segFN=segments_1,generation=1,filenames=[segments_1]
[junit4:junit4]   2> 22541 T103 oasc.SolrDeletionPolicy.updateCommits newest commit = 1[segments_1]
[junit4:junit4]   2> 22543 T103 oasup.UpdateRequestProcessorChain.init inserting DistributedUpdateProcessorFactory into updateRequestProcessorChain "dedupe"
[junit4:junit4]   2> 22544 T103 oasup.UpdateRequestProcessorChain.init inserting DistributedUpdateProcessorFactory into updateRequestProcessorChain "stored_sig"
[junit4:junit4]   2> 22544 T103 oasup.UpdateRequestProcessorChain.init inserting DistributedUpdateProcessorFactory into updateRequestProcessorChain "distrib-dup-test-chain-implicit"
[junit4:junit4]   2> 22545 T103 oasc.RequestHandlers.initHandlersFromConfig created standard: solr.StandardRequestHandler
[junit4:junit4]   2> 22545 T103 oasc.RequestHandlers.initHandlersFromConfig created /get: solr.RealTimeGetHandler
[junit4:junit4]   2> 22546 T103 oasc.RequestHandlers.initHandlersFromConfig adding lazy requestHandler: solr.ReplicationHandler
[junit4:junit4]   2> 22546 T103 oasc.RequestHandlers.initHandlersFromConfig created /replication: solr.ReplicationHandler
[junit4:junit4]   2> 22547 T103 oasc.RequestHandlers.initHandlersFromConfig created /update: solr.UpdateRequestHandler
[junit4:junit4]   2> 22547 T103 oasc.RequestHandlers.initHandlersFromConfig created /admin/: org.apache.solr.handler.admin.AdminHandlers
[junit4:junit4]   2> 22550 T103 oashl.XMLLoader.init xsltCacheLifetimeSeconds=60
[junit4:junit4]   2> 22552 T103 oass.SolrIndexSearcher.<init> Opening Searcher@1183c43 main
[junit4:junit4]   2> 22553 T103 oasu.UpdateHandler.clearLog Clearing tlog files, tlogDir=./org.apache.solr.cloud.BasicDistributedZk2Test-1363683628001/jetty4/tlog
[junit4:junit4]   2> 22553 T103 oasu.CommitTracker.<init> Hard AutoCommit: disabled
[junit4:junit4]   2> 22553 T103 oasu.CommitTracker.<init> Soft AutoCommit: disabled
[junit4:junit4]   2> 22559 T104 oasc.SolrCore.registerSearcher [collection1] Registered new searcher Searcher@1183c43 main{StandardDirectoryReader(segments_1:1)}
[junit4:junit4]   2> 22561 T103 oasc.ZkController.publish publishing core=collection1 state=down
[junit4:junit4]   2> 22561 T103 oasc.ZkController.publish numShards not found on descriptor - reading it from system property
[junit4:junit4]   2> 23101 T34 oascc.ZkStateReader.updateClusterState Updating cloud state from ZooKeeper... 
[junit4:junit4]   2> 23102 T34 oasc.Overseer$ClusterStateUpdater.updateState Update state numShards=2 message={
[junit4:junit4]   2> 	  "node_name":"127.0.0.1:55036_",
[junit4:junit4]   2> 	  "roles":null,
[junit4:junit4]   2> 	  "core":"collection1",
[junit4:junit4]   2> 	  "shard":null,
[junit4:junit4]   2> 	  "numShards":"2",
[junit4:junit4]   2> 	  "core_node_name":null,
[junit4:junit4]   2> 	  "state":"down",
[junit4:junit4]   2> 	  "collection":"collection1",
[junit4:junit4]   2> 	  "base_url":"http://127.0.0.1:55036",
[junit4:junit4]   2> 	  "operation":"state"}
[junit4:junit4]   2> 23102 T34 oasc.Overseer$ClusterStateUpdater.updateState Collection already exists with numShards=2
[junit4:junit4]   2> 23102 T34 oasc.Overseer$ClusterStateUpdater.updateState Assigning new node to shard shard=shard1
[junit4:junit4]   2> 23106 T53 oascc.ZkStateReader$2.process A cluster state change: WatchedEvent state:SyncConnected type:NodeDataChanged path:/clusterstate.json, has occurred - updating... (live nodes size: 5)
[junit4:junit4]   2> 23106 T40 oascc.ZkStateReader$2.process A cluster state change: WatchedEvent state:SyncConnected type:NodeDataChanged path:/clusterstate.json, has occurred - updating... (live nodes size: 5)
[junit4:junit4]   2> 23106 T69 oascc.ZkStateReader$2.process A cluster state change: WatchedEvent state:SyncConnected type:NodeDataChanged path:/clusterstate.json, has occurred - updating... (live nodes size: 5)
[junit4:junit4]   2> 23106 T85 oascc.ZkStateReader$2.process A cluster state change: WatchedEvent state:SyncConnected type:NodeDataChanged path:/clusterstate.json, has occurred - updating... (live nodes size: 5)
[junit4:junit4]   2> 23106 T33 oascc.ZkStateReader$2.process A cluster state change: WatchedEvent state:SyncConnected type:NodeDataChanged path:/clusterstate.json, has occurred - updating... (live nodes size: 5)
[junit4:junit4]   2> 23106 T102 oascc.ZkStateReader$2.process A cluster state change: WatchedEvent state:SyncConnected type:NodeDataChanged path:/clusterstate.json, has occurred - updating... (live nodes size: 5)
[junit4:junit4]   2> 23563 T103 oasc.CoreContainer.registerCore registering core: collection1
[junit4:junit4]   2> 23563 T103 oasc.ZkController.register Register replica - core:collection1 address:http://127.0.0.1:55036 collection:collection1 shard:shard1
[junit4:junit4]   2> 23567 T103 oasc.ZkController.register We are http://127.0.0.1:55036/collection1/ and leader is http://127.0.0.1:57845/collection1/
[junit4:junit4]   2> 23567 T103 oasc.ZkController.register No LogReplay needed for core=collection1 baseURL=http://127.0.0.1:55036
[junit4:junit4]   2> 23567 T103 oasc.ZkController.checkRecovery Core needs to recover:collection1
[junit4:junit4]   2> 23567 T103 oasu.DefaultSolrCoreState.doRecovery Running recovery - first canceling any ongoing recovery
[junit4:junit4]   2> ASYNC  NEW_CORE C1 name=collection1 org.apache.solr.core.SolrCore@1683abb url=http://127.0.0.1:55036/collection1 node=127.0.0.1:55036_ C1_STATE=coll:collection1 core:collection1 props:{node_name=127.0.0.1:55036_, core=collection1, state=down, collection=collection1, base_url=http://127.0.0.1:55036}
[junit4:junit4]   2> 23568 T105 C1 P55036 oasc.RecoveryStrategy.run Starting recovery process.  core=collection1 recoveringAfterStartup=true
[junit4:junit4]   2> 23568 T105 C1 P55036 oasc.RecoveryStrategy.doRecovery ###### startupVersions=[]
[junit4:junit4]   2> 23568 T103 oascc.ZkStateReader.updateClusterState Updating cloud state from ZooKeeper... 
[junit4:junit4]   2> 23568 T105 C1 P55036 oasc.ZkController.publish publishing core=collection1 state=recovering
[junit4:junit4]   2> 23569 T105 C1 P55036 oasc.ZkController.publish numShards not found on descriptor - reading it from system property
[junit4:junit4]   2> 23570 T105 C1 P55036 oascsi.HttpClientUtil.createClient Creating new http client, config:maxConnections=128&maxConnectionsPerHost=32&followRedirects=false
[junit4:junit4]   2> 23571 T10 oass.SolrDispatchFilter.init user.dir=/mnt/ssd/jenkins/workspace/Lucene-Solr-trunk-Linux/solr/build/solr-core/test/J1
[junit4:junit4]   2> 23571 T10 oass.SolrDispatchFilter.init SolrDispatchFilter.init() done
[junit4:junit4]   2> 23572 T10 oascsi.HttpClientUtil.createClient Creating new http client, config:maxConnections=128&maxConnectionsPerHost=32&followRedirects=false
[junit4:junit4]   2> 23577 T10 oascc.ZkStateReader.updateClusterState Updating cloud state from ZooKeeper... 
[junit4:junit4]   2> 23578 T10 oascsi.HttpClientUtil.createClient Creating new http client, config:maxConnections=128&maxConnectionsPerHost=32&followRedirects=false
[junit4:junit4]   2> 23592 T48 oasc.CoreContainer.create Creating SolrCore 'onenodecollectioncore' using instanceDir: /mnt/ssd/jenkins/workspace/Lucene-Solr-trunk-Linux/solr/build/solr-core/test/J1/./org.apache.solr.cloud.BasicDistributedZk2Test-jetty1-1363683635851/onenodecollectioncore
[junit4:junit4]   2> 23592 T48 oasc.ZkController.createCollectionZkNode Check for collection zkNode:onenodecollection
[junit4:junit4]   2> 23593 T48 oasc.ZkController.createCollectionZkNode Creating collection in ZooKeeper:onenodecollection
[junit4:junit4]   2> 23594 T48 oasc.ZkController.getConfName Looking for collection configName
[junit4:junit4]   2> 23595 T48 oasc.ZkController.getConfName Only one config set found in zk - using it:conf1
[junit4:junit4]   2> 23595 T48 oascc.SolrZkClient.makePath makePath: /collections/onenodecollection
[junit4:junit4]   2> 23597 T48 oasc.ZkController.readConfigName Load collection config from:/collections/onenodecollection
[junit4:junit4]   2> 23598 T48 oasc.SolrResourceLoader.<init> new SolrResourceLoader for directory: '/mnt/ssd/jenkins/workspace/Lucene-Solr-trunk-Linux/solr/build/solr-core/test/J1/./org.apache.solr.cloud.BasicDistributedZk2Test-jetty1-1363683635851/onenodecollectioncore/'
[junit4:junit4]   2> 23631 T48 oasc.SolrConfig.<init> Using Lucene MatchVersion: LUCENE_50
[junit4:junit4]   2> 23676 T48 oasc.SolrConfig.<init> Loaded SolrConfig: solrconfig.xml
[junit4:junit4]   2> 23677 T48 oass.IndexSchema.readSchema Reading Solr Schema
[junit4:junit4]   2> 23683 T48 oass.IndexSchema.readSchema Schema name=test
[junit4:junit4]   2> 24122 T48 oass.OpenExchangeRatesOrgProvider.init Initialized with rates=open-exchange-rates.json, refreshInterval=1440.
[junit4:junit4]   2> 24130 T48 oass.IndexSchema.readSchema default search field in schema is text
[junit4:junit4]   2> 24133 T48 oass.IndexSchema.readSchema unique key field: id
[junit4:junit4]   2> 24149 T48 oass.FileExchangeRateProvider.reload Reloading exchange rates from file currency.xml
[junit4:junit4]   2> 24153 T48 oass.FileExchangeRateProvider.reload Reloading exchange rates from file currency.xml
[junit4:junit4]   2> 24157 T48 oass.OpenExchangeRatesOrgProvider.reload Reloading exchange rates from open-exchange-rates.json
[junit4:junit4]   2> 24159 T48 oass.OpenExchangeRatesOrgProvider$OpenExchangeRates.<init> WARNING Unknown key IMPORTANT NOTE
[junit4:junit4]   2> 24159 T48 oass.OpenExchangeRatesOrgProvider$OpenExchangeRates.<init> WARNING Expected key, got STRING
[junit4:junit4]   2> 24159 T48 oass.OpenExchangeRatesOrgProvider.reload Reloading exchange rates from open-exchange-rates.json
[junit4:junit4]   2> 24161 T48 oass.OpenExchangeRatesOrgProvider$OpenExchangeRates.<init> WARNING Unknown key IMPORTANT NOTE
[junit4:junit4]   2> 24161 T48 oass.OpenExchangeRatesOrgProvider$OpenExchangeRates.<init> WARNING Expected key, got STRING
[junit4:junit4]   2> 24162 T48 oasc.SolrCore.initDirectoryFactory org.apache.solr.core.MockDirectoryFactory
[junit4:junit4]   2> 24162 T48 oasc.SolrCore.<init> [onenodecollectioncore] Opening new SolrCore at /mnt/ssd/jenkins/workspace/Lucene-Solr-trunk-Linux/solr/build/solr-core/test/J1/./org.apache.solr.cloud.BasicDistributedZk2Test-jetty1-1363683635851/onenodecollectioncore/, dataDir=/mnt/ssd/jenkins/workspace/Lucene-Solr-trunk-Linux/solr/build/solr-core/test/J1/./solrtest-BasicDistributedZk2Test-1363683628002/onenodecollection/
[junit4:junit4]   2> 24163 T48 oasc.JmxMonitoredMap.<init> JMX monitoring is enabled. Adding Solr mbeans to JMX Server: com.sun.jmx.mbeanserver.JmxMBeanServer@1967072
[junit4:junit4]   2> 24163 T48 oasc.SolrCore.initDirectoryFactory org.apache.solr.core.MockDirectoryFactory
[junit4:junit4]   2> 24164 T48 oasc.CachingDirectoryFactory.get return new directory for /mnt/ssd/jenkins/workspace/Lucene-Solr-trunk-Linux/solr/build/solr-core/test/J1/./solrtest-BasicDistributedZk2Test-1363683628002/onenodecollection forceNew: false
[junit4:junit4]   2> 24165 T48 oasc.SolrCore.getNewIndexDir New index directory detected: old=null new=/mnt/ssd/jenkins/workspace/Lucene-Solr-trunk-Linux/solr/build/solr-core/test/J1/./solrtest-BasicDistributedZk2Test-1363683628002/onenodecollection/index/
[junit4:junit4]   2> 24165 T48 oasc.SolrCore.initIndex WARNING [onenodecollectioncore] Solr index directory '/mnt/ssd/jenkins/workspace/Lucene-Solr-trunk-Linux/solr/build/solr-core/test/J1/./solrtest-BasicDistributedZk2Test-1363683628002/onenodecollection/index' doesn't exist. Creating new index...
[junit4:junit4]   2> 24165 T48 oasc.CachingDirectoryFactory.get return new directory for /mnt/ssd/jenkins/workspace/Lucene-Solr-trunk-Linux/solr/build/solr-core/test/J1/./solrtest-BasicDistributedZk2Test-1363683628002/onenodecollection/index forceNew: false
[junit4:junit4]   2> 24167 T48 oasc.SolrDeletionPolicy.onCommit SolrDeletionPolicy.onCommit: commits:num=1
[junit4:junit4]   2> 		commit{dir=MockDirWrapper(org.apache.lucene.store.RAMDirectory@e524fa lockFactory=org.apache.lucene.store.NativeFSLockFactory@1bef49c),segFN=segments_1,generation=1,filenames=[segments_1]
[junit4:junit4]   2> 24167 T48 oasc.SolrDeletionPolicy.updateCommits newest commit = 1[segments_1]
[junit4:junit4]   2> 24169 T48 oasup.UpdateRequestProcessorChain.init inserting DistributedUpdateProcessorFactory into updateRequestProcessorChain "dedupe"
[junit4:junit4]   2> 24170 T48 oasup.UpdateRequestProcessorChain.init inserting DistributedUpdateProcessorFactory into updateRequestProcessorChain "stored_sig"
[junit4:junit4]   2> 24170 T48 oasup.UpdateRequestProcessorChain.init inserting DistributedUpdateProcessorFactory into updateRequestProcessorChain "distrib-dup-test-chain-implicit"
[junit4:junit4]   2> 24171 T48 oasc.RequestHandlers.initHandlersFromConfig created standard: solr.StandardRequestHandler
[junit4:junit4]   2> 24172 T48 oasc.RequestHandlers.initHandlersFromConfig created /get: solr.RealTimeGetHandler
[junit4:junit4]   2> 24172 T48 oasc.RequestHandlers.initHandlersFromConfig adding lazy requestHandler: solr.ReplicationHandler
[junit4:junit4]   2> 24173 T48 oasc.RequestHandlers.initHandlersFromConfig created /replication: solr.ReplicationHandler
[junit4:junit4]   2> 24173 T48 oasc.RequestHandlers.initHandlersFromConfig created /update: solr.UpdateRequestHandler
[junit4:junit4]   2> 24174 T48 oasc.RequestHandlers.initHandlersFromConfig created /admin/: org.apache.solr.handler.admin.AdminHandlers
[junit4:junit4]   2>  C0_STATE=coll:collection1 core:collection1 props:{node_name=127.0.0.1:44754_, core=collection1, shard=shard2, state=recovering, collection=collection1, base_url=http://127.0.0.1:44754}
[junit4:junit4]   2> 24174 T88 C0 P44754 oasc.RecoveryStrategy.doRecovery Attempting to PeerSync from http://127.0.0.1:52267/collection1/ core=collection1 - recoveringAfterStartup=true
[junit4:junit4]   2> 24177 T48 oashl.XMLLoader.init xsltCacheLifetimeSeconds=60
[junit4:junit4]   2> 24177 T88 C0 P44754 oascsi.HttpClientUtil.createClient Creating new http client, config:maxConnectionsPerHost=20&maxConnections=10000&connTimeout=30000&socketTimeout=30000&retry=false
[junit4:junit4]   2> 24180 T48 oass.SolrIndexSearcher.<init> Opening Searcher@11e452 main
[junit4:junit4]   2> 24180 T48 oasu.UpdateHandler.clearLog Clearing tlog files, tlogDir=/mnt/ssd/jenkins/workspace/Lucene-Solr-trunk-Linux/solr/build/solr-core/test/J1/./solrtest-BasicDistributedZk2Test-1363683628002/onenodecollection/tlog
[junit4:junit4]   2> 24181 T48 oasu.CommitTracker.<init> Hard AutoCommit: disabled
[junit4:junit4]   2> 24181 T48 oasu.CommitTracker.<init> Soft AutoCommit: disabled
[junit4:junit4]   2> 24185 T88 C0 P44754 oasu.PeerSync.sync PeerSync: core=collection1 url=http://127.0.0.1:44754 START replicas=[http://127.0.0.1:52267/collection1/] nUpdates=100
[junit4:junit4]   2> 24186 T107 oasc.SolrCore.registerSearcher [onenodecollectioncore] Registered new searcher Searcher@11e452 main{StandardDirectoryReader(segments_1:1)}
[junit4:junit4]   2> 24187 T88 C0 P44754 oasu.PeerSync.sync WARNING no frame of reference to tell of we've missed updates
[junit4:junit4]   2> 24187 T88 C0 P44754 oasc.RecoveryStrategy.doRecovery PeerSync Recovery was not successful - trying replication. core=collection1
[junit4:junit4]   2> 24187 T88 C0 P44754 oasc.RecoveryStrategy.doRecovery Starting Replication Recovery. core=collection1
[junit4:junit4]   2> 24187 T88 C0 P44754 oasc.RecoveryStrategy.doRecovery Begin buffering updates. core=collection1
[junit4:junit4]   2> 24188 T88 C0 P44754 oasu.UpdateLog.bufferUpdates Starting to buffer updates. FSUpdateLog{state=ACTIVE, tlog=null}
[junit4:junit4]   2> 24188 T88 C0 P44754 oasc.RecoveryStrategy.replicate Attempting to replicate from http://127.0.0.1:52267/collection1/. core=collection1
[junit4:junit4]   2> 24188 T88 C0 P44754 oascsi.HttpClientUtil.createClient Creating new http client, config:maxConnections=128&maxConnectionsPerHost=32&followRedirects=false
[junit4:junit4]   2> 24188 T48 oasc.ZkController.publish publishing core=onenodecollectioncore state=down
[junit4:junit4]   2> ASYNC  NEW_CORE C2 name=collection1 org.apache.solr.core.SolrCore@dba332 url=http://127.0.0.1:52267/collection1 node=127.0.0.1:52267_ C2_STATE=coll:collection1 core:collection1 props:{node_name=127.0.0.1:52267_, core=collection1, shard=shard2, state=active, collection=collection1, base_url=http://127.0.0.1:52267, leader=true}
[junit4:junit4]   2> 24205 T49 C2 P52267 REQ /get {qt=/get&distrib=false&getVersions=100&wt=javabin&version=2} status=0 QTime=4 
[junit4:junit4]   2> 24215 T46 C2 P52267 oasu.DirectUpdateHandler2.commit start commit{,optimize=false,openSearcher=false,waitSearcher=true,expungeDeletes=false,softCommit=false,prepareCommit=false}
[junit4:junit4]   2> 24218 T46 C2 P52267 oasc.SolrDeletionPolicy.onInit SolrDeletionPolicy.onInit: commits:num=1
[junit4:junit4]   2> 		commit{dir=MockDirWrapper(org.apache.lucene.store.RAMDirectory@1fa9706 lockFactory=org.apache.lucene.store.NativeFSLockFactory@18f4201),segFN=segments_1,generation=1,filenames=[segments_1]
[junit4:junit4]   2> 24218 T46 C2 P52267 oasc.SolrDeletionPolicy.updateCommits newest commit = 1[segments_1]
[junit4:junit4]   2> 24221 T46 C2 P52267 oasc.SolrDeletionPolicy.onCommit SolrDeletionPolicy.onCommit: commits:num=2
[junit4:junit4]   2> 		commit{dir=MockDirWrapper(org.apache.lucene.store.RAMDirectory@1fa9706 lockFactory=org.apache.lucene.store.NativeFSLockFactory@18f4201),segFN=segments_1,generation=1,filenames=[segments_1]
[junit4:junit4]   2> 		commit{dir=MockDirWrapper(org.apache.lucene.store.RAMDirectory@1fa9706 lockFactory=org.apache.lucene.store.NativeFSLockFactory@18f4201),segFN=segments_2,generation=2,filenames=[segments_2]
[junit4:junit4]   2> 24222 T46 C2 P52267 oasc.SolrDeletionPolicy.updateCommits newest commit = 2[segments_2]
[junit4:junit4]   2> 24223 T46 C2 P52267 oass.SolrIndexSearcher.<init> Opening Searcher@790278 realtime
[junit4:junit4]   2> 24224 T46 C2 P52267 oasu.DirectUpdateHandler2.commit end_commit_flush
[junit4:junit4]   2> 24224 T46 C2 P52267 /update {openSearcher=false&commit_end_point=true&waitSearcher=true&wt=javabin&commit=true&version=2&softCommit=false} {commit=} 0 22
[junit4:junit4]   2> 24245 T88 C0 P44754 oash.ReplicationHandler.inform Commits will be reserved for  10000
[junit4:junit4]   2> 24246 T88 C0 P44754 oascsi.HttpClientUtil.createClient Creating new http client, config:connTimeout=5000&socketTimeout=20000&allowCompression=false&maxConnections=10000&maxConnectionsPerHost=10000
[junit4:junit4]   2> 24252 T88 C0 P44754 oash.SnapPuller.<init>  No value set for 'pollInterval'. Timer Task not started.
[junit4:junit4]   2> 24264 T49 C2 P52267 oash.ReplicationHandler.inform Commits will be reserved for  10000
[junit4:junit4]   2> 24265 T49 C2 P52267 REQ /replication {qt=/replication&command=indexversion&wt=javabin&version=2} status=0 QTime=12 
[junit4:junit4]   2> 24266 T88 C0 P44754 oash.SnapPuller.fetchLatestIndex Master's generation: 2
[junit4:junit4]   2> 24266 T88 C0 P44754 oash.SnapPuller.fetchLatestIndex Slave's generation: 1
[junit4:junit4]   2> 24266 T88 C0 P44754 oash.SnapPuller.fetchLatestIndex Starting replication process
[junit4:junit4]   2> 24269 T46 C2 P52267 REQ /replication {qt=/replication&generation=2&command=filelist&wt=javabin&version=2} status=0 QTime=0 
[junit4:junit4]   2> 24270 T88 C0 P44754 oash.SnapPuller.fetchLatestIndex Number of files in latest index in master: 1
[junit4:junit4]   2> 24272 T88 C0 P44754 oasc.CachingDirectoryFactory.get return new directory for ./org.apache.solr.cloud.BasicDistributedZk2Test-1363683628001/jetty3/index.20130319030052197 forceNew: false
[junit4:junit4]   2> 24272 T88 C0 P44754 oash.SnapPuller.fetchLatestIndex Starting download to MockDirWrapper(NRTCachingDirectory(org.apache.lucene.store.RAMDirectory@121a82d lockFactory=org.apache.lucene.store.NativeFSLockFactory@9c70fd; maxCacheMB=0.2939453125 maxMergeSizeMB=0.048828125)) fullCopy=false
[junit4:junit4]   2> 24279 T47 C2 P52267 REQ /replication {qt=/replication&generation=2&checksum=true&file=segments_2&command=filecontent&wt=filestream} status=0 QTime=2 
[junit4:junit4]   2> 24286 T88 C0 P44754 oash.SnapPuller.fetchLatestIndex Total time taken for download : 0 secs
[junit4:junit4]   2> 24297 T88 C0 P44754 oasu.DefaultSolrCoreState.newIndexWriter Creating new IndexWriter...
[junit4:junit4]   2> 24297 T88 C0 P44754 oasu.DefaultSolrCoreState.newIndexWriter Waiting until IndexWriter is unused... core=collection1
[junit4:junit4]   2> 24300 T88 C0 P44754 oasc.SolrDeletionPolicy.onInit SolrDeletionPolicy.onInit: commits:num=2
[junit4:junit4]   2> 		commit{dir=MockDirWrapper(org.apache.lucene.store.RAMDirectory@187f00b lockFactory=org.apache.lucene.store.NativeFSLockFactory@b4ec91),segFN=segments_1,generation=1,filenames=[segments_1]
[junit4:junit4]   2> 		commit{dir=MockDirWrapper(org.apache.lucene.store.RAMDirectory@187f00b lockFactory=org.apache.lucene.store.NativeFSLockFactory@b4ec91),segFN=segments_2,generation=2,filenames=[segments_2]
[junit4:junit4]   2> 24300 T88 C0 P44754 oasc.SolrDeletionPolicy.updateCommits newest commit = 2[segments_2]
[junit4:junit4]   2> 24301 T88 C0 P44754 oasu.DefaultSolrCoreState.newIndexWriter New IndexWriter is ready to be used.
[junit4:junit4]   2> 24301 T88 C0 P44754 oass.SolrIndexSearcher.<init> Opening Searcher@67278a main
[junit4:junit4]   2> 24305 T87 oasc.SolrCore.registerSearcher [collection1] Registered new searcher Searcher@67278a main{StandardDirectoryReader(segments_2:1:nrt)}
[junit4:junit4]   2> 24306 T88 C0 P44754 oasc.RecoveryStrategy.replay No replay needed. core=collection1
[junit4:junit4]   2> 24306 T88 C0 P44754 oasc.RecoveryStrategy.doRecovery Replication Recovery was successful - registering as Active. core=collection1
[junit4:junit4]   2> 24307 T88 C0 P44754 oasc.ZkController.publish publishing core=collection1 state=active
[junit4:junit4]   2> 24307 T88 C0 P44754 oasc.ZkController.publish numShards not found on descriptor - reading it from system property
[junit4:junit4]   2> 24308 T88 C0 P44754 oasc.RecoveryStrategy.doRecovery Finished recovery process. core=collection1
[junit4:junit4]   2> 24611 T34 oascc.ZkStateReader.updateClusterState Updating cloud state from ZooKeeper... 
[junit4:junit4]   2> 24612 T34 oasc.Overseer$ClusterStateUpdater.updateState Update state numShards=2 message={
[junit4:junit4]   2> 	  "node_name":"127.0.0.1:55036_",
[junit4:junit4]   2> 	  "roles":null,
[junit4:junit4]   2> 	  "core":"collection1",
[junit4:junit4]   2> 	  "shard":"shard1",
[junit4:junit4]   2> 	  "numShards":"2",
[junit4:junit4]   2> 	  "core_node_name":"127.0.0.1:55036__collection1",
[junit4:junit4]   2> 	  "state":"recovering",
[junit4:junit4]   2> 	  "collection":"collection1",
[junit4:junit4]   2> 	  "base_url":"http://127.0.0.1:55036",
[junit4:junit4]   2> 	  "operation":"state"}
[junit4:junit4]   2> 24615 T34 oasc.Overseer$ClusterStateUpdater.updateState Update state numShards=1 message={
[junit4:junit4]   2> 	  "node_name":"127.0.0.1:52267_",
[junit4:junit4]   2> 	  "roles":"none",
[junit4:junit4]   2> 	  "core":"onenodecollectioncore",
[junit4:junit4]   2> 	  "shard":null,
[junit4:junit4]   2> 	  "numShards":"1",
[junit4:junit4]   2> 	  "core_node_name":null,
[junit4:junit4]   2> 	  "state":"down",
[junit4:junit4]   2> 	  "collection":"onenodecollection",
[junit4:junit4]   2> 	  "base_url":"http://127.0.0.1:52267",
[junit4:junit4]   2> 	  "operation":"state"}
[junit4:junit4]   2> 24616 T34 oasc.Overseer$ClusterStateUpdater.createCollection Create collection onenodecollection with numShards 1
[junit4:junit4]   2> 24616 T34 oasc.Overseer$ClusterStateUpdater.updateState Assigning new node to shard shard=shard1
[junit4:junit4]   2> 24619 T34 oasc.Overseer$ClusterStateUpdater.updateState Update state numShards=2 message={
[junit4:junit4]   2> 	  "node_name":"127.0.0.1:44754_",
[junit4:junit4]   2> 	  "roles":null,
[junit4:junit4]   2> 	  "core":"collection1",
[junit4:junit4]   2> 	  "shard":"shard2",
[junit4:junit4]   2> 	  "numShards":"2",
[junit4:junit4]   2> 	  "core_node_name":"127.0.0.1:44754__collection1",
[junit4:junit4]   2> 	  "state":"active",
[junit4:junit4]   2> 	  "collection":"collection1",
[junit4:junit4]   2> 	  "base_url":"http://127.0.0.1:44754",
[junit4:junit4]   2> 	  "operation":"state"}
[junit4:junit4]   2> 24627 T85 oascc.ZkStateReader$2.process A cluster state change: WatchedEvent state:SyncConnected type:NodeDataChanged path:/clusterstate.json, has occurred - updating... (live nodes size: 5)
[junit4:junit4]   2> 24627 T33 oascc.ZkStateReader$2.process A cluster state change: WatchedEvent state:SyncConnected type:NodeDataChanged path:/clusterstate.json, has occurred - updating... (live nodes size: 5)
[junit4:junit4]   2> 24627 T102 oascc.ZkStateReader$2.process A cluster state change: WatchedEvent state:SyncConnected type:NodeDataChanged path:/clusterstate.json, has occurred - updating... (live nodes size: 5)
[junit4:junit4]   2> 24627 T40 oascc.ZkStateReader$2.process A cluster state change: WatchedEvent state:SyncConnected type:NodeDataChanged path:/clusterstate.json, has occurred - updating... (live nodes size: 5)
[junit4:junit4]   2> 24628 T69 oascc.ZkStateReader$2.process A cluster state change: WatchedEvent state:SyncConnected type:NodeDataChanged path:/clusterstate.json, has occurred - updating... (live nodes size: 5)
[junit4:junit4]   2> 24628 T53 oascc.ZkStateReader$2.process A cluster state change: WatchedEvent state:SyncConnected type:NodeDataChanged path:/clusterstate.json, has occurred - updating... (live nodes size: 5)
[junit4:junit4]   2> 25190 T48 oasc.CoreContainer.registerCore registering core: onenodecollectioncore
[junit4:junit4]   2> 25191 T48 oasc.ZkController.register Register replica - core:onenodecollectioncore address:http://127.0.0.1:52267 collection:onenodecollection shard:shard1
[junit4:junit4]   2> 25192 T48 oascc.SolrZkClient.makePath makePath: /collections/onenodecollection/leader_elect/shard1/election
[junit4:junit4]   2> 25198 T15 oazs.PrepRequestProcessor.pRequest Got user-level KeeperException when processing sessionid:0x13d81e0d4620006 type:delete cxid:0xac zxid:0xc2 txntype:-1 reqpath:n/a Error Path:/solr/collections/onenodecollection/leaders Error:KeeperErrorCode = NoNode for /solr/collections/onenodecollection/leaders
[junit4:junit4]   2> 25198 T48 oasc.ShardLeaderElectionContext.runLeaderProcess Running the leader process.
[junit4:junit4]   2> 25199 T15 oazs.PrepRequestProcessor.pRequest Got user-level KeeperException when processing sessionid:0x13d81e0d4620006 type:create cxid:0xad zxid:0xc3 txntype:-1 reqpath:n/a Error Path:/solr/overseer Error:KeeperErrorCode = NodeExists for /solr/overseer
[junit4:junit4]   2> 25200 T48 oasc.ShardLeaderElectionContext.waitForReplicasToComeUp Enough replicas found to continue.
[junit4:junit4]   2> 25201 T48 oasc.ShardLeaderElectionContext.runLeaderProcess I may be the new leader - try and sync
[junit4:junit4]   2> 25201 T48 oasc.SyncStrategy.sync Sync replicas to http://127.0.0.1:52267/onenodecollectioncore/
[junit4:junit4]   2> 25201 T48 oasc.SyncStrategy.syncReplicas Sync Success - now sync replicas to me
[junit4:junit4]   2> 25202 T48 oasc.SyncStrategy.syncToMe http://127.0.0.1:52267/onenodecollectioncore/ has no replicas
[junit4:junit4]   2> 25202 T48 oasc.ShardLeaderElectionContext.runLeaderProcess I am the new leader: http://127.0.0.1:52267/onenodecollectioncore/
[junit4:junit4]   2> 25202 T48 oascc.SolrZkClient.makePath makePath: /collections/onenodecollection/leaders/shard1
[junit4:junit4]   2> 25205 T15 oazs.PrepRequestProcessor.pRequest Got user-level KeeperException when processing sessionid:0x13d81e0d4620006 type:create cxid:0xb8 zxid:0xc7 txntype:-1 reqpath:n/a Error Path:/solr/overseer Error:KeeperErrorCode = NodeExists for /solr/overseer
[junit4:junit4]   2> 25577 T63 oass.SolrDispatchFilter.handleAdminRequest /admin/cores {action=PREPRECOVERY&checkLive=true&coreNodeName=127.0.0.1:55036__collection1&nodeName=127.0.0.1:55036_&core=collection1&onlyIfLeader=true&state=recovering&wt=javabin&version=2} status=0 QTime=2001 
[junit4:junit4]   2> 26141 T34 oascc.ZkStateReader.updateClusterState Updating cloud state from ZooKeeper... 
[junit4:junit4]   2> 26150 T33 oascc.ZkStateReader$2.process A cluster state change: WatchedEvent state:SyncConnected type:NodeDataChanged path:/clusterstate.json, has occurred - updating... (live nodes size: 5)
[junit4:junit4]   2> 26150 T102 oascc.ZkStateReader$2.process A cluster state change: WatchedEvent state:SyncConnected type:NodeDataChanged path:/clusterstate.json, has occurred - updating... (live nodes size: 5)
[junit4:junit4]   2> 26152 T85 oascc.ZkStateReader$2.process A cluster state change: WatchedEvent state:SyncConnected type:NodeDataChanged path:/clusterstate.json, has occurred - updating... (live nodes size: 5)
[junit4:junit4]   2> 26152 T53 oascc.ZkStateReader$2.process A cluster state change: WatchedEvent state:SyncConnected type:NodeDataChanged path:/clusterstate.json, has occurred - updating... (live nodes size: 5)
[junit4:junit4]   2> 26152 T40 oascc.ZkStateReader$2.process A cluster state change: WatchedEvent state:SyncConnected type:NodeDataChanged path:/clusterstate.json, has occurred - updating... (live nodes size: 5)
[junit4:junit4]   2> 26153 T69 oascc.ZkStateReader$2.process A cluster state change: WatchedEvent state:SyncConnected type:NodeDataChanged path:/clusterstate.json, has occurred - updating... (live nodes size: 5)
[junit4:junit4]   2> 26159 T48 oasc.ZkController.register We are http://127.0.0.1:52267/onenodecollectioncore/ and leader is http://127.0.0.1:52267/onenodecollectioncore/
[junit4:junit4]   2> 26159 T48 oasc.ZkController.register No LogReplay needed for core=onenodecollectioncore baseURL=http://127.0.0.1:52267
[junit4:junit4]   2> 26160 T48 oasc.ZkController.checkRecovery I am the leader, no recovery necessary
[junit4:junit4]   2> 26160 T48 oasc.ZkController.publish publishing core=onenodecollectioncore state=active
[junit4:junit4]   2> 26162 T48 oascc.ZkStateReader.updateClusterState Updating cloud state from ZooKeeper... 
[junit4:junit4]   2> 26163 T48 oass.SolrDispatchFilter.handleAdminRequest /admin/cores {dataDir=/mnt/ssd/jenkins/workspace/Lucene-Solr-trunk-Linux/solr/build/solr-core/test/J1/./solrtest-BasicDistributedZk2Test-1363683628002/onenodecollection&action=CREATE&roles=none&numShards=1&wt=javabin&version=2&collection=onenodecollection&name=onenodecollectioncore} status=0 QTime=2579 
[junit4:junit4]   2> 26164 T10 oasc.AbstractDistribZkTestBase.waitForRecoveriesToFinish Wait for recoveries to finish - collection: onenodecollection failOnTimeout:true timeout (sec):230
[junit4:junit4]   2> 26165 T10 oascc.ZkStateReader.updateClusterState Updating cloud state from ZooKeeper... 
[junit4:junit4]   2> 27166 T10 oascc.ZkStateReader.updateClusterState Updating cloud state from ZooKeeper... 
[junit4:junit4]   2>  C1_STATE=coll:collection1 core:collection1 props:{node_name=127.0.0.1:55036_, core=collection1, shard=shard1, state=recovering, collection=collection1, base_url=http://127.0.0.1:55036}
[junit4:junit4]   2> 27578 T105 C1 P55036 oasc.RecoveryStrategy.doRecovery Attempting to PeerSync from http://127.0.0.1:57845/collection1/ core=collection1 - recoveringAfterStartup=true
[junit4:junit4]   2> 27579 T105 C1 P55036 oasu.PeerSync.sync PeerSync: core=collection1 url=http://127.0.0.1:55036 START replicas=[http://127.0.0.1:57845/collection1/] nUpdates=100
[junit4:junit4]   2> 27579 T105 C1 P55036 oasu.PeerSync.sync WARNING no frame of reference to tell of we've missed updates
[junit4:junit4]   2> 27579 T105 C1 P55036 oasc.RecoveryStrategy.doRecovery PeerSync Recovery was not successful - trying replication. core=collection1
[junit4:junit4]   2> 27579 T105 C1 P55036 oasc.RecoveryStrategy.doRecovery Starting Replication Recovery. core=collection1
[junit4:junit4]   2> 27580 T105 C1 P55036 oasc.RecoveryStrategy.doRecovery Begin buffering updates. core=collection1
[junit4:junit4]   2> 27580 T105 C1 P55036 oasu.UpdateLog.bufferUpdates Starting to buffer updates. FSUpdateLog{state=ACTIVE, tlog=null}
[junit4:junit4]   2> 27580 T105 C1 P55036 oasc.RecoveryStrategy.replicate Attempting to replicate from http://127.0.0.1:57845/collection1/. core=collection1
[junit4:junit4]   2> 27581 T105 C1 P55036 oascsi.HttpClientUtil.createClient Creating new http client, config:maxConnections=128&maxConnectionsPerHost=32&followRedirects=false
[junit4:junit4]   2> ASYNC  NEW_CORE C3 name=collection1 org.apache.solr.core.SolrCore@1db8f1c url=http://127.0.0.1:57845/collection1 node=127.0.0.1:57845_ C3_STATE=coll:collection1 core:collection1 props:{node_name=127.0.0.1:57845_, core=collection1, shard=shard1, state=active, collection=collection1, base_url=http://127.0.0.1:57845, leader=true}
[junit4:junit4]   2> 27591 T65 C3 P57845 oasu.DirectUpdateHandler2.commit start commit{,optimize=false,openSearcher=false,waitSearcher=true,expungeDeletes=false,softCommit=false,prepareCommit=false}
[junit4:junit4]   2> 27593 T65 C3 P57845 oasc.SolrDeletionPolicy.onInit SolrDeletionPolicy.onInit: commits:num=1
[junit4:junit4]   2> 		commit{dir=MockDirWrapper(org.apache.lucene.store.RAMDirectory@1039a38 lockFactory=org.apache.lucene.store.NativeFSLockFactory@2fb7f0),segFN=segments_1,generation=1,filenames=[segments_1]
[junit4:junit4]   2> 27593 T65 C3 P57845 oasc.SolrDeletionPolicy.updateCommits newest commit = 1[segments_1]
[junit4:junit4]   2> 27594 T65 C3 P57845 oasc.SolrDeletionPolicy.onCommit SolrDeletionPolicy.onCommit: commits:num=2
[junit4:junit4]   2> 		commit{dir=MockDirWrapper(org.apache.lucene.store.RAMDirectory@1039a38 lockFactory=org.apache.lucene.store.NativeFSLockFactory@2fb7f0),segFN=segments_1,generation=1,filenames=[segments_1]
[junit4:junit4]   2> 		commit{dir=MockDirWrapper(org.apache.lucene.store.RAMDirectory@1039a38 lockFactory=org.apache.lucene.store.NativeFSLockFactory@2fb7f0),segFN=segments_2,generation=2,filenames=[segments_2]
[junit4:junit4]   2> 27595 T62 C3 P57845 REQ /get {qt=/get&distrib=false&getVersions=100&wt=javabin&version=2} status=0 QTime=0 
[junit4:junit4]   2> 27595 T65 C3 P57845 oasc.SolrDeletionPolicy.updateCommits newest commit = 2[segments_2]
[junit4:junit4]   2> 27595 T65 C3 P57845 oass.SolrIndexSearcher.<init> Opening Searcher@15179f8 realtime
[junit4:junit4]   2> 27595 T65 C3 P57845 oasu.DirectUpdateHandler2.commit end_commit_flush
[junit4:junit4]   2> 27596 T65 C3 P57845 /update {openSearcher=false&commit_end_point=true&waitSearcher=true&wt=javabin&commit=true&version=2&softCommit=false} {commit=} 0 5
[junit4:junit4]   2> 27597 T105 C1 P55036 oash.ReplicationHandler.inform Commits will be reserved for  10000
[junit4:junit4]   2> 27597 T105 C1 P55036 oash.SnapPuller.<init>  No value set for 'pollInterval'. Timer Task not started.
[junit4:junit4]   2> 27599 T63 C3 P57845 oash.ReplicationHandler.inform Commits will be reserved for  10000
[junit4:junit4]   2> 27600 T63 C3 P57845 REQ /replication {qt=/replication&command=indexversion&wt=javabin&version=2} status=0 QTime=1 
[junit4:junit4]   2> 27601 T105 C1 P55036 oash.SnapPuller.fetchLatestIndex Master's generation: 2
[junit4:junit4]   2> 27601 T105 C1 P55036 oash.SnapPuller.fetchLatestIndex Slave's generation: 1
[junit4:junit4]   2> 27601 T105 C1 P55036 oash.SnapPuller.fetchLatestIndex Starting replication process
[junit4:junit4]   2> 27604 T62 C3 P57845 REQ /replication {qt=/replication&generation=2&command=filelist&wt=javabin&version=2} status=0 QTime=1 
[junit4:junit4]   2> 27605 T105 C1 P55036 oash.SnapPuller.fetchLatestIndex Number of files in latest index in master: 1
[junit4:junit4]   2> 27606 T105 C1 P55036 oasc.CachingDirectoryFactory.get return new directory for ./org.apache.solr.cloud.BasicDistributedZk2Test-1363683628001/jetty4/index.20130319030055532 forceNew: false
[junit4:junit4]   2> 27606 T105 C1 P55036 oash.SnapPuller.fetchLatestIndex Starting download to MockDirWrapper(NRTCachingDirectory(org.apache.lucene.store.RAMDirectory@1f8db5f lockFactory=org.apache.lucene.store.NativeFSLockFactory@1e8250f; maxCacheMB=0.2939453125 maxMergeSizeMB=0.048828125)) fullCopy=false
[junit4:junit4]   2> 27609 T65 C3 P57845 REQ /replication {qt=/replication&generation=2&checksum=true&file=segments_2&command=filecontent&wt=filestream} status=0 QTime=0 
[junit4:junit4]   2> 27611 T105 C1 P55036 oash.SnapPuller.fetchLatestIndex Total time taken for download : 0 secs
[junit4:junit4]   2> 27613 T105 C1 P55036 oasu.DefaultSolrCoreState.newIndexWriter Creating new IndexWriter...
[junit4:junit4]   2> 27613 T105 C1 P55036 oasu.DefaultSolrCoreState.newIndexWriter Waiting until IndexWriter is unused... core=collection1
[junit4:junit4]   2> 27615 T105 C1 P55036 oasc.SolrDeletionPolicy.onInit SolrDeletionPolicy.onInit: commits:num=2
[junit4:junit4]   2> 		commit{dir=MockDirWrapper(org.apache.lucene.store.RAMDirectory@1684402 lockFactory=org.apache.lucene.store.NativeFSLockFactory@1823404),segFN=segments_1,generation=1,filenames=[segments_1]
[junit4:junit4]   2> 		commit{dir=MockDirWrapper(org.apache.lucene.store.RAMDirectory@1684402 lockFactory=org.apache.lucene.store.NativeFSLockFactory@1823404),segFN=segments_2,generation=2,filenames=[segments_2]
[junit4:junit4]   2> 27615 T105 C1 P55036 oasc.SolrDeletionPolicy.updateCommits newest commit = 2[segments_2]
[junit4:junit4]   2> 27615 T105 C1 P55036 oasu.DefaultSolrCoreState.newIndexWriter New IndexWriter is ready to be used.
[junit4:junit4]   2> 27616 T105 C1 P55036 oass.SolrIndexSearcher.<init> Opening Searcher@162bcb9 main
[junit4:junit4]   2> 27617 T104 oasc.SolrCore.registerSearcher [collection1] Registered new searcher Searcher@162bcb9 main{StandardDirectoryReader(segments_2:1:nrt)}
[junit4:junit4]   2> 27618 T105 C1 P55036 oasc.RecoveryStrategy.replay No replay needed. core=collection1
[junit4:junit4]   2> 27618 T105 C1 P55036 oasc.RecoveryStrategy.doRecovery Replication Recovery was successful - registering as Active. core=collection1
[junit4:junit4]   2> 27618 T105 C1 P55036 oasc.ZkController.publish publishing core=collection1 state=active
[junit4:junit4]   2> 27618 T105 C1 P55036 oasc.ZkController.publish numShards not found on descriptor - reading it from system property
[junit4:junit4]   2> 27619 T105 C1 P55036 oasc.RecoveryStrategy.doRecovery Finished recovery process. core=collection1
[junit4:junit4]   2> 27660 T34 oascc.ZkStateReader.updateClusterState Updating cloud state from ZooKeeper... 
[junit4:junit4]   2> 27661 T34 oasc.Overseer$ClusterStateUpdater.updateState Update state numShards=1 message={
[junit4:junit4]   2> 	  "node_name":"127.0.0.1:52267_",
[junit4:junit4]   2> 	  "roles":"none",
[junit4:junit4]   2> 	  "core":"onenodecollectioncore",
[junit4:junit4]   2> 	  "shard":"shard1",
[junit4:junit4]   2> 	  "numShards":"1",
[junit4:junit4]   2> 	  "core_node_name":"127.0.0.1:52267__onenodecollectioncore",
[junit4:junit4]   2> 	  "state":"active",
[junit4:junit4]   2> 	  "collection":"onenodecollection",
[junit4:junit4]   2> 	  "base_url":"http://127.0.0.1:52267",
[junit4:junit4]   2> 	  "operation":"state"}
[junit4:junit4]   2> 27664 T34 oasc.Overseer$ClusterStateUpdater.updateState Update state numShards=2 message={
[junit4:junit4]   2> 	  "node_name":"127.0.0.1:55036_",
[junit4:junit4]   2> 	  "roles":null,
[junit4:junit4]   2> 	  "core":"collection1",
[junit4:junit4]   2> 	  "shard":"shard1",
[junit4:junit4]   2> 	  "numShards":"2",
[junit4:junit4]   2> 	  "core_node_name":"127.0.0.1:55036__collection1",
[junit4:junit4]   2> 	  "state":"active",
[junit4:junit4]   2> 	  "collection":"collection1",
[junit4:junit4]   2> 	  "base_url":"http://127.0.0.1:55036",
[junit4:junit4]   2> 	  "operation":"state"}
[junit4:junit4]   2> 27681 T33 oascc.ZkStateReader$2.process A cluster state change: WatchedEvent state:SyncConnected type:NodeDataChanged path:/clusterstate.json, has occurred - updating... (live nodes size: 5)
[junit4:junit4]   2> 27681 T69 oascc.ZkStateReader$2.process A cluster state change: WatchedEvent state:SyncConnected type:NodeDataChanged path:/clusterstate.json, has occurred - updating... (live nodes size: 5)
[junit4:junit4]   2> 27681 T102 oascc.ZkStateReader$2.process A cluster state change: WatchedEvent state:SyncConnected type:NodeDataChanged path:/clusterstate.json, has occurred - updating... (live nodes size: 5)
[junit4:junit4]   2> 27681 T53 oascc.ZkStateReader$2.process A cluster state change: WatchedEvent state:SyncConnected type:NodeDataChanged path:/clusterstate.json, has occurred - updating... (live nodes size: 5)
[junit4:junit4]   2> 27681 T85 oascc.ZkStateReader$2.process A cluster state change: WatchedEvent state:SyncConnected type:NodeDataChanged path:/clusterstate.json, has occurred - updating... (live nodes size: 5)
[junit4:junit4]   2> 27681 T40 oascc.ZkStateReader$2.process A cluster state change: WatchedEvent state:SyncConnected type:NodeDataChanged path:/clusterstate.json, has occurred - updating... (live nodes size: 5)
[junit4:junit4]   2> 28168 T10 oascc.ZkStateReader.updateClusterState Updating cloud state from ZooKeeper... 
[junit4:junit4]   2> 28169 T10 oasc.AbstractDistribZkTestBase.waitForRecoveriesToFinish Recoveries finished - collection: onenodecollection
[junit4:junit4]   2> 28170 T10 oascsi.HttpClientUtil.createClient Creating new http client, config:maxConnections=128&maxConnectionsPerHost=32&followRedirects=false
[junit4:junit4]   2> 28199 T10 oaz.ZooKeeper.<init> Initiating client connection, connectString=127.0.0.1:35704 sessionTimeout=10000 watcher=org.apache.solr.common.cloud.ConnectionManager@46d7c1
[junit4:junit4]   2> 28200 T10 oascc.ConnectionManager.waitForConnected Waiting for client to connect to ZooKeeper
[junit4:junit4]   2> 28200 T112 oaz.ClientCnxn$SendThread.logStartConnect Opening socket connection to server localhost.localdomain/127.0.0.1:35704. Will not attempt to authenticate using SASL (access denied ("javax.security.auth.AuthPermission" "getLoginConfiguration"))
[junit4:junit4]   2> 

[...truncated too long message...]

junit4:junit4]   1> 
[junit4:junit4]   2> NOTE: reproduce with: ant test  -Dtestcase=UnloadDistributedZkTest -Dtests.method=testDistribSearch -Dtests.seed=99BC8AE810382F7B -Dtests.multiplier=3 -Dtests.slow=true -Dtests.locale=tr_TR -Dtests.timezone=Europe/Stockholm -Dtests.file.encoding=UTF-8
[junit4:junit4] FAILURE  139s J1 | UnloadDistributedZkTest.testDistribSearch <<<
[junit4:junit4]    > Throwable #1: java.lang.AssertionError: Still found shard2 in collection test_unload_shard_and_collection
[junit4:junit4]    > 	at __randomizedtesting.SeedInfo.seed([99BC8AE810382F7B:185A04F067674F47]:0)
[junit4:junit4]    > 	at org.junit.Assert.fail(Assert.java:93)
[junit4:junit4]    > 	at org.apache.solr.cloud.UnloadDistributedZkTest.testUnloadShardAndCollection(UnloadDistributedZkTest.java:124)
[junit4:junit4]    > 	at org.apache.solr.cloud.UnloadDistributedZkTest.doTest(UnloadDistributedZkTest.java:77)
[junit4:junit4]    > 	at org.apache.solr.BaseDistributedSearchTestCase.testDistribSearch(BaseDistributedSearchTestCase.java:806)
[junit4:junit4]    > 	at sun.reflect.NativeMethodAccessorImpl.invoke0(Native Method)
[junit4:junit4]    > 	at sun.reflect.NativeMethodAccessorImpl.invoke(NativeMethodAccessorImpl.java:57)
[junit4:junit4]    > 	at sun.reflect.DelegatingMethodAccessorImpl.invoke(DelegatingMethodAccessorImpl.java:43)
[junit4:junit4]    > 	at java.lang.reflect.Method.invoke(Method.java:487)
[junit4:junit4]    > 	at com.carrotsearch.randomizedtesting.RandomizedRunner.invoke(RandomizedRunner.java:1559)
[junit4:junit4]    > 	at com.carrotsearch.randomizedtesting.RandomizedRunner.access$600(RandomizedRunner.java:79)
[junit4:junit4]    > 	at com.carrotsearch.randomizedtesting.RandomizedRunner$6.evaluate(RandomizedRunner.java:737)
[junit4:junit4]    > 	at com.carrotsearch.randomizedtesting.RandomizedRunner$7.evaluate(RandomizedRunner.java:773)
[junit4:junit4]    > 	at com.carrotsearch.randomizedtesting.RandomizedRunner$8.evaluate(RandomizedRunner.java:787)
[junit4:junit4]    > 	at com.carrotsearch.randomizedtesting.rules.SystemPropertiesRestoreRule$1.evaluate(SystemPropertiesRestoreRule.java:53)
[junit4:junit4]    > 	at org.apache.lucene.util.TestRuleSetupTeardownChained$1.evaluate(TestRuleSetupTeardownChained.java:50)
[junit4:junit4]    > 	at org.apache.lucene.util.TestRuleFieldCacheSanity$1.evaluate(TestRuleFieldCacheSanity.java:51)
[junit4:junit4]    > 	at org.apache.lucene.util.AbstractBeforeAfterRule$1.evaluate(AbstractBeforeAfterRule.java:46)
[junit4:junit4]    > 	at com.carrotsearch.randomizedtesting.rules.SystemPropertiesInvariantRule$1.evaluate(SystemPropertiesInvariantRule.java:55)
[junit4:junit4]    > 	at org.apache.lucene.util.TestRuleThreadAndTestName$1.evaluate(TestRuleThreadAndTestName.java:49)
[junit4:junit4]    > 	at org.apache.lucene.util.TestRuleIgnoreAfterMaxFailures$1.evaluate(TestRuleIgnoreAfterMaxFailures.java:70)
[junit4:junit4]    > 	at org.apache.lucene.util.TestRuleMarkFailure$1.evaluate(TestRuleMarkFailure.java:48)
[junit4:junit4]    > 	at com.carrotsearch.randomizedtesting.rules.StatementAdapter.evaluate(StatementAdapter.java:36)
[junit4:junit4]    > 	at com.carrotsearch.randomizedtesting.ThreadLeakControl$StatementRunner.run(ThreadLeakControl.java:358)
[junit4:junit4]    > 	at com.carrotsearch.randomizedtesting.ThreadLeakControl.forkTimeoutingTask(ThreadLeakControl.java:782)
[junit4:junit4]    > 	at com.carrotsearch.randomizedtesting.ThreadLeakControl$3.evaluate(ThreadLeakControl.java:442)
[junit4:junit4]    > 	at com.carrotsearch.randomizedtesting.RandomizedRunner.runSingleTest(RandomizedRunner.java:746)
[junit4:junit4]    > 	at com.carrotsearch.randomizedtesting.RandomizedRunner$3.evaluate(RandomizedRunner.java:648)
[junit4:junit4]    > 	at com.carrotsearch.randomizedtesting.RandomizedRunner$4.evaluate(RandomizedRunner.java:682)
[junit4:junit4]    > 	at com.carrotsearch.randomizedtesting.RandomizedRunner$5.evaluate(RandomizedRunner.java:693)
[junit4:junit4]    > 	at com.carrotsearch.randomizedtesting.rules.StatementAdapter.evaluate(StatementAdapter.java:36)
[junit4:junit4]    > 	at com.carrotsearch.randomizedtesting.rules.SystemPropertiesRestoreRule$1.evaluate(SystemPropertiesRestoreRule.java:53)
[junit4:junit4]    > 	at org.apache.lucene.util.AbstractBeforeAfterRule$1.evaluate(AbstractBeforeAfterRule.java:46)
[junit4:junit4]    > 	at org.apache.lucene.util.TestRuleStoreClassName$1.evaluate(TestRuleStoreClassName.java:42)
[junit4:junit4]    > 	at com.carrotsearch.randomizedtesting.rules.SystemPropertiesInvariantRule$1.evaluate(SystemPropertiesInvariantRule.java:55)
[junit4:junit4]    > 	at com.carrotsearch.randomizedtesting.rules.NoShadowingOrOverridesOnMethodsRule$1.evaluate(NoShadowingOrOverridesOnMethodsRule.java:39)
[junit4:junit4]    > 	at com.carrotsearch.randomizedtesting.rules.NoShadowingOrOverridesOnMethodsRule$1.evaluate(NoShadowingOrOverridesOnMethodsRule.java:39)
[junit4:junit4]    > 	at com.carrotsearch.randomizedtesting.rules.StatementAdapter.evaluate(StatementAdapter.java:36)
[junit4:junit4]    > 	at org.apache.lucene.util.TestRuleAssertionsRequired$1.evaluate(TestRuleAssertionsRequired.java:43)
[junit4:junit4]    > 	at org.apache.lucene.util.TestRuleMarkFailure$1.evaluate(TestRuleMarkFailure.java:48)
[junit4:junit4]    > 	at org.apache.lucene.util.TestRuleIgnoreAfterMaxFailures$1.evaluate(TestRuleIgnoreAfterMaxFailures.java:70)
[junit4:junit4]    > 	at org.apache.lucene.util.TestRuleIgnoreTestSuites$1.evaluate(TestRuleIgnoreTestSuites.java:55)
[junit4:junit4]    > 	at com.carrotsearch.randomizedtesting.rules.StatementAdapter.evaluate(StatementAdapter.java:36)
[junit4:junit4]    > 	at com.carrotsearch.randomizedtesting.ThreadLeakControl$StatementRunner.run(ThreadLeakControl.java:358)
[junit4:junit4]    > 	at java.lang.Thread.run(Thread.java:722)
[junit4:junit4]   2> 139212 T1989 oas.SolrTestCaseJ4.deleteCore ###deleteCore
[junit4:junit4]   2> 139224 T1988 ccr.ThreadLeakControl.checkThreadLeaks WARNING Will linger awaiting termination of 3 leaked thread(s).
[junit4:junit4]   2> 139344 T1992 oazs.SessionTrackerImpl.run SessionTrackerImpl exited loop!
[junit4:junit4]   2> 140318 T2071 oascc.ZkStateReader$3.process WARNING ZooKeeper watch triggered, but Solr cannot talk to ZK
[junit4:junit4]   2> 140318 T2071 oascc.ZkStateReader$2.process A cluster state change: WatchedEvent state:SyncConnected type:NodeChildrenChanged path:/live_nodes, has occurred - updating... (live nodes size: 1)
[junit4:junit4]   2> 140318 T2071 oascc.ZkStateReader$2.process WARNING ZooKeeper watch triggered, but Solr cannot talk to ZK
[junit4:junit4]   2> 140318 T2071 oaz.ClientCnxn$EventThread.run EventThread shut down
[junit4:junit4]   2> NOTE: test params are: codec=FastDecompressionCompressingStoredFields(storedFieldsFormat=CompressingStoredFieldsFormat(compressionMode=FAST_DECOMPRESSION, chunkSize=370), termVectorsFormat=CompressingTermVectorsFormat(compressionMode=FAST_DECOMPRESSION, chunkSize=370)), sim=RandomSimilarityProvider(queryNorm=true,coord=yes): {}, locale=tr_TR, timezone=Europe/Stockholm
[junit4:junit4]   2> NOTE: Linux 3.2.0-38-generic i386/Oracle Corporation 1.8.0-ea (32-bit)/cpus=8,threads=1,free=219218168,total=536870912
[junit4:junit4]   2> NOTE: All tests run in this JVM: [BasicDistributedZk2Test, BadIndexSchemaTest, TestMergePolicyConfig, DefaultValueUpdateProcessorTest, SpellCheckCollatorTest, TestCSVLoader, TestBinaryField, TestStressLucene, TimeZoneUtilsTest, TestSystemIdResolver, SimplePostToolTest, SolrTestCaseJ4Test, TestNumberUtils, TestJmxIntegration, TestJmxMonitoredMap, TestUtils, ZkNodePropsTest, PingRequestHandlerTest, SolrIndexConfigTest, DirectSolrSpellCheckerTest, TestComponentsName, IndexReaderFactoryTest, TestPartialUpdateDeduplication, FileUtilsTest, TestRecovery, CopyFieldTest, TestLazyCores, CurrencyFieldOpenExchangeTest, SpellPossibilityIteratorTest, ChaosMonkeySafeLeaderTest, TestOmitPositions, IndexBasedSpellCheckerTest, URLClassifyProcessorTest, TestSolrJ, TermVectorComponentDistributedTest, ConvertedLegacyTest, XmlUpdateRequestHandlerTest, TestDFRSimilarityFactory, DistanceFunctionTest, DebugComponentTest, FullSolrCloudDistribCmdsTest, TestMultiCoreConfBootstrap, JSONWriterTest, ZkSolrClientTest, RequestHandlersTest, HighlighterConfigTest, TestReload, SolrRequestParserTest, TestIndexingPerformance, TestBM25SimilarityFactory, XsltUpdateRequestHandlerTest, TestArbitraryIndexDir, CollectionsAPIDistributedZkTest, SpellCheckComponentTest, TestSolr4Spatial, CurrencyFieldXmlFileTest, TestElisionMultitermQuery, TestDistributedSearch, TestStressReorder, SolrCoreCheckLockOnStartupTest, TestFastOutputStream, UpdateParamsTest, UnloadDistributedZkTest]
[junit4:junit4] Completed on J1 in 140.51s, 1 test, 1 failure <<< FAILURES!

[...truncated 427 lines...]
BUILD FAILED
/mnt/ssd/jenkins/workspace/Lucene-Solr-trunk-Linux/build.xml:375: The following error occurred while executing this line:
/mnt/ssd/jenkins/workspace/Lucene-Solr-trunk-Linux/build.xml:355: The following error occurred while executing this line:
/mnt/ssd/jenkins/workspace/Lucene-Solr-trunk-Linux/build.xml:39: The following error occurred while executing this line:
/mnt/ssd/jenkins/workspace/Lucene-Solr-trunk-Linux/solr/build.xml:183: The following error occurred while executing this line:
/mnt/ssd/jenkins/workspace/Lucene-Solr-trunk-Linux/solr/common-build.xml:449: The following error occurred while executing this line:
/mnt/ssd/jenkins/workspace/Lucene-Solr-trunk-Linux/lucene/common-build.xml:1210: The following error occurred while executing this line:
/mnt/ssd/jenkins/workspace/Lucene-Solr-trunk-Linux/lucene/common-build.xml:874: There were test failures: 272 suites, 1144 tests, 1 error, 1 failure, 13 ignored (7 assumptions)

Total time: 46 minutes 55 seconds
Build step 'Invoke Ant' marked build as failure
Archiving artifacts
Recording test results
Description set: Java: 32bit/jdk1.8.0-ea-b79 -client -XX:+UseG1GC -XX:MarkStackSize=256K
Email was triggered for: Failure
Sending email for trigger: Failure



Mime
View raw message