lucene-dev mailing list archives

Site index · List index
Message view « Date » · « Thread »
Top « Date » · « Thread »
From Apache Jenkins Server <jenk...@builds.apache.org>
Subject [JENKINS] Lucene-Solr-NightlyTests-4.x - Build # 205 - Failure
Date Mon, 11 Mar 2013 19:18:25 GMT
Build: https://builds.apache.org/job/Lucene-Solr-NightlyTests-4.x/205/

2 tests failed.
REGRESSION:  org.apache.lucene.search.TestDocTermOrdsRewriteMethod.testRegexps

Error Message:
Test abandoned because suite timeout was reached.

Stack Trace:
java.lang.Exception: Test abandoned because suite timeout was reached.
	at __randomizedtesting.SeedInfo.seed([2923E24EEDCF7E1F]:0)


FAILED:  junit.framework.TestSuite.org.apache.lucene.search.TestDocTermOrdsRewriteMethod

Error Message:
Suite timeout exceeded (>= 7200000 msec).

Stack Trace:
java.lang.Exception: Suite timeout exceeded (>= 7200000 msec).
	at __randomizedtesting.SeedInfo.seed([2923E24EEDCF7E1F]:0)




Build Log:
[...truncated 1605 lines...]
[junit4:junit4] Suite: org.apache.lucene.search.TestDocTermOrdsRewriteMethod
[junit4:junit4]   2> NOTE: download the large Jenkins line-docs file by running 'ant get-jenkins-line-docs'
in the lucene directory.
[junit4:junit4]   2> NOTE: reproduce with: ant test  -Dtestcase=TestDocTermOrdsRewriteMethod
-Dtests.method=testRegexps -Dtests.seed=2923E24EEDCF7E1F -Dtests.multiplier=2 -Dtests.nightly=true
-Dtests.slow=true -Dtests.linedocsfile=/home/hudson/lucene-data/enwiki.random.lines.txt -Dtests.locale=tr
-Dtests.timezone=Etc/GMT -Dtests.file.encoding=ISO8859-1
[junit4:junit4] ERROR   7200s J0 | TestDocTermOrdsRewriteMethod.testRegexps <<<
[junit4:junit4]    > Throwable #1: java.lang.Exception: Test abandoned because suite timeout
was reached.
[junit4:junit4]    > 	at __randomizedtesting.SeedInfo.seed([2923E24EEDCF7E1F]:0)
[junit4:junit4]   2> NOTE: test params are: codec=Lucene3x, sim=DefaultSimilarity, locale=tr,
timezone=Etc/GMT
[junit4:junit4]   2> NOTE: FreeBSD 9.0-RELEASE amd64/Sun Microsystems Inc. 1.6.0_32 (64-bit)/cpus=16,threads=2,free=159567728,total=266862592
[junit4:junit4]   2> NOTE: All tests run in this JVM: [TestSearchForDuplicates, TestSegmentTermDocs,
TestRegexpRandom2, InBeforeClass, InAfterClass, InTestMethod, NonStringProperties, TestIndexWriterConfig,
TestBlockPostingsFormat3, TestSearchAfter, TestNumericRangeQuery32, TestCopyBytes, TestDateTools,
TestPayloadTermQuery, TestPriorityQueue, TestExternalCodecs, TestRamUsageEstimator, TestNoMergeScheduler,
TestFieldCacheTermsFilter, Nested1, TestCachingCollector, TestRecyclingByteBlockAllocator,
TestNumericRangeQuery64, TestPrefixInBooleanQuery, TestTimeLimitingCollector, TestSimpleAttributeImpl,
TestSimpleSearchEquivalence, TestDocumentWriter, TestLucene40PostingsReader, TestWildcardRandom,
TestIndexableField, TestSort, TestAllFilesHaveCodecHeader, TestLevenshteinAutomata, TestRandomStoredFields,
TestDoubleBarrelLRUCache, TestSpansAdvanced2, TestSimilarityBase, TestSloppyPhraseQuery2,
TestMultiTermQueryRewrites, TestIndexWriterUnicode, TestRollingUpdates, TestTwoPhaseCommitTool,
TestIndexInput, TestBytesRef, TestSimpleExplanations, TestRegexpQuery, Test2BDocs, TestForTooMuchCloning,
TestBagOfPostings, TestCollectionUtil, TestMultiValuedNumericRangeQuery, TestToken, TestParallelReaderEmptyIndex,
TestLazyProxSkipping, TestStressIndexing, TestCustomNorms, TestShardSearching, TestMockCharFilter,
TestCompiledAutomaton, TestSubScorerFreqs, TestPersistentSnapshotDeletionPolicy, TestLookaheadTokenFilter,
TestPrefixFilter, TestDocValuesWithThreads, TestRamUsageEstimatorOnWildAnimals, TestSurrogates,
TestLucene42DocValuesFormat, TestLucene40DocValuesFormat, Nested1, Nested2, Nested3, TestComplexExplanationsOfNonMatches,
TestBlockPostingsFormat2, TestIndexWriterMerging, Test2BPositions, TestSegmentReader, TestWildcard,
TestConstantScoreQuery, TestSpanExplanationsOfNonMatches, TestFilterIterator, TestSloppyPhraseQuery,
TestTermsEnum2, Nested1, TestTopScoreDocCollector, TestForceMergeForever, TestIndexWriter,
TestScoreCachingWrappingScorer, Nested1, TestSetOnce, TestDemo, TestTermRangeQuery, TestDocValuesFormat,
TestIndexWriterReader, TestBytesStore, TestIndexWriterExceptions, TestDeletionPolicy, TestBooleanOr,
TestBasics, TestFlushByRamOrCountsPolicy, TestIndexWriterDelete, TestNRTThreads, TestStressAdvance,
TestConcurrentMergeScheduler, TestHighCompressionMode, TestDocumentsWriterStallControl, TestTopDocsMerge,
TestCompoundFile, TestLongPostings, TestMinimize, TestDocTermOrdsRewriteMethod]
[junit4:junit4]   2> NOTE: download the large Jenkins line-docs file by running 'ant get-jenkins-line-docs'
in the lucene directory.
[junit4:junit4]   2> NOTE: reproduce with: ant test  -Dtestcase=TestDocTermOrdsRewriteMethod
-Dtests.seed=2923E24EEDCF7E1F -Dtests.multiplier=2 -Dtests.nightly=true -Dtests.slow=true
-Dtests.linedocsfile=/home/hudson/lucene-data/enwiki.random.lines.txt -Dtests.locale=tr -Dtests.timezone=Etc/GMT
-Dtests.file.encoding=ISO8859-1
[junit4:junit4] ERROR   0.00s J0 | TestDocTermOrdsRewriteMethod (suite) <<<
[junit4:junit4]    > Throwable #1: java.lang.Exception: Suite timeout exceeded (>= 7200000
msec).
[junit4:junit4]    > 	at __randomizedtesting.SeedInfo.seed([2923E24EEDCF7E1F]:0)
[junit4:junit4] Completed on J0 in 7223.18s, 2 tests, 2 errors <<< FAILURES!

[...truncated 11 lines...]
BUILD FAILED
/usr/home/hudson/hudson-slave/workspace/Lucene-Solr-NightlyTests-4.x/build.xml:388: The following
error occurred while executing this line:
/usr/home/hudson/hudson-slave/workspace/Lucene-Solr-NightlyTests-4.x/build.xml:361: The following
error occurred while executing this line:
/usr/home/hudson/hudson-slave/workspace/Lucene-Solr-NightlyTests-4.x/build.xml:39: The following
error occurred while executing this line:
/usr/home/hudson/hudson-slave/workspace/Lucene-Solr-NightlyTests-4.x/lucene/build.xml:50:
The following error occurred while executing this line:
/usr/home/hudson/hudson-slave/workspace/Lucene-Solr-NightlyTests-4.x/lucene/common-build.xml:1213:
The following error occurred while executing this line:
/usr/home/hudson/hudson-slave/workspace/Lucene-Solr-NightlyTests-4.x/lucene/common-build.xml:877:
There were test failures: 351 suites, 2183 tests, 1 suite-level error, 1 error, 29 ignored
(17 assumptions)

Total time: 144 minutes 26 seconds
Build step 'Invoke Ant' marked build as failure
Archiving artifacts
Recording test results
Email was triggered for: Failure
Sending email for trigger: Failure



Mime
View raw message