lucene-dev mailing list archives

Site index · List index
Message view « Date » · « Thread »
Top « Date » · « Thread »
From Policeman Jenkins Server <jenk...@thetaphi.de>
Subject [JENKINS] Lucene-Solr-4.x-MacOSX (64bit/jdk1.6.0) - Build # 333 - Still Failing!
Date Fri, 22 Mar 2013 22:21:19 GMT
Build: http://jenkins.thetaphi.de/job/Lucene-Solr-4.x-MacOSX/333/
Java: 64bit/jdk1.6.0 -XX:+UseConcMarkSweepGC

2 tests failed.
REGRESSION:  org.apache.solr.core.TestSolrDiscoveryProperties.testPropertiesFile

Error Message:
Test abandoned because suite timeout was reached.

Stack Trace:
java.lang.Exception: Test abandoned because suite timeout was reached.
	at __randomizedtesting.SeedInfo.seed([908B1657BC25F243]:0)


FAILED:  junit.framework.TestSuite.org.apache.solr.core.TestSolrDiscoveryProperties

Error Message:
Suite timeout exceeded (>= 7200000 msec).

Stack Trace:
java.lang.Exception: Suite timeout exceeded (>= 7200000 msec).
	at __randomizedtesting.SeedInfo.seed([908B1657BC25F243]:0)




Build Log:
[...truncated 8698 lines...]
[junit4:junit4] Suite: org.apache.solr.core.TestSolrDiscoveryProperties
[junit4:junit4]   2> 0 T3276 oas.SolrTestCaseJ4.initCore ####initCore
[junit4:junit4]   2> Creating dataDir: /Users/jenkins/jenkins-slave/workspace/Lucene-Solr-4.x-MacOSX/solr/build/solr-core/test/J0/./solrtest-TestSolrDiscoveryProperties-1363983581809
[junit4:junit4]   2> 2 T3276 oas.SolrTestCaseJ4.initCore ####initCore end
[junit4:junit4]   2> 11 T3276 oas.SolrTestCaseJ4.setUp ###Starting testPersistTrue
[junit4:junit4]   2> 56 T3276 oasc.SolrResourceLoader.locateSolrHome JNDI not configured for solr (NoInitialContextEx)
[junit4:junit4]   2> 56 T3276 oasc.SolrResourceLoader.locateSolrHome using system property solr.solr.home: /Users/jenkins/jenkins-slave/workspace/Lucene-Solr-4.x-MacOSX/solr/build/solr-core/test/J0/./org.apache.solr.core.TestSolrDiscoveryProperties/solrHome
[junit4:junit4]   2> 57 T3276 oasc.CoreContainer$Initializer.initialize looking for solr config file: /Users/jenkins/jenkins-slave/workspace/Lucene-Solr-4.x-MacOSX/solr/build/solr-core/test/J0/./org.apache.solr.core.TestSolrDiscoveryProperties/solrHome/solr.xml
[junit4:junit4]   2> 57 T3276 oasc.CoreContainer.<init> New CoreContainer 1911997983
[junit4:junit4]   2> 58 T3276 oasc.CoreContainer.load Loading CoreContainer using Solr Home: '/Users/jenkins/jenkins-slave/workspace/Lucene-Solr-4.x-MacOSX/solr/build/solr-core/test/J0/./org.apache.solr.core.TestSolrDiscoveryProperties/solrHome/'
[junit4:junit4]   2> 59 T3276 oasc.SolrResourceLoader.<init> new SolrResourceLoader for directory: '/Users/jenkins/jenkins-slave/workspace/Lucene-Solr-4.x-MacOSX/solr/build/solr-core/test/J0/./org.apache.solr.core.TestSolrDiscoveryProperties/solrHome/'
[junit4:junit4]   2> 103 T3276 oasc.SolrProperties.walkFromHere Looking for cores in /Users/jenkins/jenkins-slave/workspace/Lucene-Solr-4.x-MacOSX/solr/build/solr-core/test/J0/./org.apache.solr.core.TestSolrDiscoveryProperties/solrHome
[junit4:junit4]   2> 104 T3276 oasc.SolrProperties.walkFromHere Discovered properties file /Users/jenkins/jenkins-slave/workspace/Lucene-Solr-4.x-MacOSX/solr/build/solr-core/test/J0/./org.apache.solr.core.TestSolrDiscoveryProperties/solrHome/core1/core.properties, adding to cores
[junit4:junit4]   2> 106 T3276 oasc.SolrProperties.walkFromHere Discovered properties file /Users/jenkins/jenkins-slave/workspace/Lucene-Solr-4.x-MacOSX/solr/build/solr-core/test/J0/./org.apache.solr.core.TestSolrDiscoveryProperties/solrHome/core2/core.properties, adding to cores
[junit4:junit4]   2> 107 T3276 oasc.SolrProperties.walkFromHere Discovered properties file /Users/jenkins/jenkins-slave/workspace/Lucene-Solr-4.x-MacOSX/solr/build/solr-core/test/J0/./org.apache.solr.core.TestSolrDiscoveryProperties/solrHome/lazy1/core.properties, adding to cores
[junit4:junit4]   2> 108 T3276 oasc.SolrProperties.walkFromHere Discovered properties file /Users/jenkins/jenkins-slave/workspace/Lucene-Solr-4.x-MacOSX/solr/build/solr-core/test/J0/./org.apache.solr.core.TestSolrDiscoveryProperties/solrHome/lazy2/core.properties, adding to cores
[junit4:junit4]   2> 110 T3276 oasc.SolrProperties.walkFromHere Discovered properties file /Users/jenkins/jenkins-slave/workspace/Lucene-Solr-4.x-MacOSX/solr/build/solr-core/test/J0/./org.apache.solr.core.TestSolrDiscoveryProperties/solrHome/lazy3/core.properties, adding to cores
[junit4:junit4]   2> 112 T3276 oasc.SolrProperties.walkFromHere Looking for cores in /Users/jenkins/jenkins-slave/workspace/Lucene-Solr-4.x-MacOSX/solr/build/solr-core/test/J0/./org.apache.solr.core.TestSolrDiscoveryProperties/solrHome
[junit4:junit4]   2> 113 T3276 oasc.SolrProperties.walkFromHere Discovered properties file /Users/jenkins/jenkins-slave/workspace/Lucene-Solr-4.x-MacOSX/solr/build/solr-core/test/J0/./org.apache.solr.core.TestSolrDiscoveryProperties/solrHome/core1/core.properties, adding to cores
[junit4:junit4]   2> 114 T3276 oasc.SolrProperties.walkFromHere Discovered properties file /Users/jenkins/jenkins-slave/workspace/Lucene-Solr-4.x-MacOSX/solr/build/solr-core/test/J0/./org.apache.solr.core.TestSolrDiscoveryProperties/solrHome/core2/core.properties, adding to cores
[junit4:junit4]   2> 116 T3276 oasc.SolrProperties.walkFromHere Discovered properties file /Users/jenkins/jenkins-slave/workspace/Lucene-Solr-4.x-MacOSX/solr/build/solr-core/test/J0/./org.apache.solr.core.TestSolrDiscoveryProperties/solrHome/lazy1/core.properties, adding to cores
[junit4:junit4]   2> 117 T3276 oasc.SolrProperties.walkFromHere Discovered properties file /Users/jenkins/jenkins-slave/workspace/Lucene-Solr-4.x-MacOSX/solr/build/solr-core/test/J0/./org.apache.solr.core.TestSolrDiscoveryProperties/solrHome/lazy2/core.properties, adding to cores
[junit4:junit4]   2> 118 T3276 oasc.SolrProperties.walkFromHere Discovered properties file /Users/jenkins/jenkins-slave/workspace/Lucene-Solr-4.x-MacOSX/solr/build/solr-core/test/J0/./org.apache.solr.core.TestSolrDiscoveryProperties/solrHome/lazy3/core.properties, adding to cores
[junit4:junit4]   2> 120 T3276 oashc.HttpShardHandlerFactory.getParameter Setting socketTimeout to: 0
[junit4:junit4]   2> 121 T3276 oashc.HttpShardHandlerFactory.getParameter Setting urlScheme to: http://
[junit4:junit4]   2> 122 T3276 oashc.HttpShardHandlerFactory.getParameter Setting connTimeout to: 0
[junit4:junit4]   2> 123 T3276 oashc.HttpShardHandlerFactory.getParameter Setting maxConnectionsPerHost to: 20
[junit4:junit4]   2> 123 T3276 oashc.HttpShardHandlerFactory.getParameter Setting corePoolSize to: 0
[junit4:junit4]   2> 124 T3276 oashc.HttpShardHandlerFactory.getParameter Setting maximumPoolSize to: 2147483647
[junit4:junit4]   2> 125 T3276 oashc.HttpShardHandlerFactory.getParameter Setting maxThreadIdleTime to: 5
[junit4:junit4]   2> 125 T3276 oashc.HttpShardHandlerFactory.getParameter Setting sizeOfQueue to: -1
[junit4:junit4]   2> 126 T3276 oashc.HttpShardHandlerFactory.getParameter Setting fairnessPolicy to: false
[junit4:junit4]   2> 127 T3276 oascsi.HttpClientUtil.createClient Creating new http client, config:maxConnectionsPerHost=20&maxConnections=10000&socketTimeout=0&connTimeout=0&retry=false
[junit4:junit4]   2> 143 T3276 oasc.CoreMaps.allocateLazyCores Allocating transient cache for 2 transient cores
[junit4:junit4]   2> 144 T3276 oasc.CoreContainer.load Registering Log Listener
[junit4:junit4]   2> 156 T3277 oasc.CoreContainer.create Creating SolrCore 'core1' using instanceDir: /Users/jenkins/jenkins-slave/workspace/Lucene-Solr-4.x-MacOSX/solr/build/solr-core/test/J0/./org.apache.solr.core.TestSolrDiscoveryProperties/solrHome/core1
[junit4:junit4]   2> 159 T3277 oasc.SolrResourceLoader.<init> new SolrResourceLoader for directory: '/Users/jenkins/jenkins-slave/workspace/Lucene-Solr-4.x-MacOSX/solr/build/solr-core/test/J0/./org.apache.solr.core.TestSolrDiscoveryProperties/solrHome/core1/'
[junit4:junit4]   2> 179 T3278 oasc.CoreContainer.create Creating SolrCore 'lazy2' using instanceDir: /Users/jenkins/jenkins-slave/workspace/Lucene-Solr-4.x-MacOSX/solr/build/solr-core/test/J0/./org.apache.solr.core.TestSolrDiscoveryProperties/solrHome/lazy2
[junit4:junit4]   2> 180 T3278 oasc.SolrResourceLoader.<init> new SolrResourceLoader for directory: '/Users/jenkins/jenkins-slave/workspace/Lucene-Solr-4.x-MacOSX/solr/build/solr-core/test/J0/./org.apache.solr.core.TestSolrDiscoveryProperties/solrHome/lazy2/'
[junit4:junit4]   2> 183 T3279 oasc.CoreContainer.create Creating SolrCore 'lazy1' using instanceDir: /Users/jenkins/jenkins-slave/workspace/Lucene-Solr-4.x-MacOSX/solr/build/solr-core/test/J0/./org.apache.solr.core.TestSolrDiscoveryProperties/solrHome/lazy1
[junit4:junit4]   2> 183 T3279 oasc.SolrResourceLoader.<init> new SolrResourceLoader for directory: '/Users/jenkins/jenkins-slave/workspace/Lucene-Solr-4.x-MacOSX/solr/build/solr-core/test/J0/./org.apache.solr.core.TestSolrDiscoveryProperties/solrHome/lazy1/'
[junit4:junit4]   2> 388 T3277 oasc.SolrConfig.<init> Using Lucene MatchVersion: LUCENE_41
[junit4:junit4]   2> 422 T3278 oasc.SolrConfig.<init> Using Lucene MatchVersion: LUCENE_41
[junit4:junit4]   2> 491 T3279 oasc.SolrConfig.<init> Using Lucene MatchVersion: LUCENE_41
[junit4:junit4]   2> 664 T3278 oasc.SolrConfig.<init> Loaded SolrConfig: solrconfig-minimal.xml
[junit4:junit4]   2> 665 T3278 oass.IndexSchema.readSchema Reading Solr Schema
[junit4:junit4]   2> 724 T3277 oasc.SolrConfig.<init> Loaded SolrConfig: solrconfig-minimal.xml
[junit4:junit4]   2> 725 T3277 oass.IndexSchema.readSchema Reading Solr Schema
[junit4:junit4]   2> 729 T3277 oass.IndexSchema.readSchema Schema name=tiny
[junit4:junit4]   2> 731 T3278 oass.IndexSchema.readSchema Schema name=tiny
[junit4:junit4]   2> 831 T3279 oasc.SolrConfig.<init> Loaded SolrConfig: solrconfig-minimal.xml
[junit4:junit4]   2> 832 T3279 oass.IndexSchema.readSchema Reading Solr Schema
[junit4:junit4]   2> 837 T3279 oass.IndexSchema.readSchema Schema name=tiny
[junit4:junit4]   2> 904 T3279 oass.IndexSchema.readSchema unique key field: id
[junit4:junit4]   2> 928 T3278 oass.IndexSchema.readSchema unique key field: id
[junit4:junit4]   2> 930 T3278 oasc.SolrCore.initDirectoryFactory org.apache.solr.core.MockDirectoryFactory
[junit4:junit4]   2> 935 T3278 oasc.SolrCore.<init> [lazy2] Opening new SolrCore at /Users/jenkins/jenkins-slave/workspace/Lucene-Solr-4.x-MacOSX/solr/build/solr-core/test/J0/./org.apache.solr.core.TestSolrDiscoveryProperties/solrHome/lazy2/, dataDir=/Users/jenkins/jenkins-slave/workspace/Lucene-Solr-4.x-MacOSX/solr/build/solr-core/test/J0/./org.apache.solr.core.TestSolrDiscoveryProperties/solrHome/lazy2/stuffandnonsense/
[junit4:junit4]   2> 935 T3278 oasc.JmxMonitoredMap.<init> JMX monitoring is enabled. Adding Solr mbeans to JMX Server: com.sun.jmx.mbeanserver.JmxMBeanServer@6e20f237
[junit4:junit4]   2> 938 T3278 oasc.SolrCore.initDirectoryFactory org.apache.solr.core.MockDirectoryFactory
[junit4:junit4]   2> 938 T3278 oasc.CachingDirectoryFactory.get return new directory for /Users/jenkins/jenkins-slave/workspace/Lucene-Solr-4.x-MacOSX/solr/build/solr-core/test/J0/./org.apache.solr.core.TestSolrDiscoveryProperties/solrHome/lazy2/stuffandnonsense
[junit4:junit4]   2> 939 T3278 oasc.SolrCore.getNewIndexDir New index directory detected: old=null new=/Users/jenkins/jenkins-slave/workspace/Lucene-Solr-4.x-MacOSX/solr/build/solr-core/test/J0/./org.apache.solr.core.TestSolrDiscoveryProperties/solrHome/lazy2/stuffandnonsense/index/
[junit4:junit4]   2> 939 T3278 oasc.SolrCore.initIndex WARNING [lazy2] Solr index directory '/Users/jenkins/jenkins-slave/workspace/Lucene-Solr-4.x-MacOSX/solr/build/solr-core/test/J0/./org.apache.solr.core.TestSolrDiscoveryProperties/solrHome/lazy2/stuffandnonsense/index' doesn't exist. Creating new index...
[junit4:junit4]   2> 937 T3277 oass.IndexSchema.readSchema unique key field: id
[junit4:junit4]   2> 936 T3279 oasc.SolrCore.initDirectoryFactory org.apache.solr.core.MockDirectoryFactory
[junit4:junit4]   2> 944 T3279 oasc.SolrCore.<init> [lazy1] Opening new SolrCore at /Users/jenkins/jenkins-slave/workspace/Lucene-Solr-4.x-MacOSX/solr/build/solr-core/test/J0/./org.apache.solr.core.TestSolrDiscoveryProperties/solrHome/lazy1/, dataDir=/Users/jenkins/jenkins-slave/workspace/Lucene-Solr-4.x-MacOSX/solr/build/solr-core/test/J0/./org.apache.solr.core.TestSolrDiscoveryProperties/solrHome/lazy1/stuffandnonsense/
[junit4:junit4]   2> 945 T3279 oasc.JmxMonitoredMap.<init> JMX monitoring is enabled. Adding Solr mbeans to JMX Server: com.sun.jmx.mbeanserver.JmxMBeanServer@6e20f237
[junit4:junit4]   2> 945 T3279 oasc.SolrCore.initDirectoryFactory org.apache.solr.core.MockDirectoryFactory
[junit4:junit4]   2> 946 T3279 oasc.CachingDirectoryFactory.get return new directory for /Users/jenkins/jenkins-slave/workspace/Lucene-Solr-4.x-MacOSX/solr/build/solr-core/test/J0/./org.apache.solr.core.TestSolrDiscoveryProperties/solrHome/lazy1/stuffandnonsense
[junit4:junit4]   2> 947 T3279 oasc.SolrCore.getNewIndexDir New index directory detected: old=null new=/Users/jenkins/jenkins-slave/workspace/Lucene-Solr-4.x-MacOSX/solr/build/solr-core/test/J0/./org.apache.solr.core.TestSolrDiscoveryProperties/solrHome/lazy1/stuffandnonsense/index/
[junit4:junit4]   2> 947 T3279 oasc.SolrCore.initIndex WARNING [lazy1] Solr index directory '/Users/jenkins/jenkins-slave/workspace/Lucene-Solr-4.x-MacOSX/solr/build/solr-core/test/J0/./org.apache.solr.core.TestSolrDiscoveryProperties/solrHome/lazy1/stuffandnonsense/index' doesn't exist. Creating new index...
[junit4:junit4]   2> 948 T3277 oasc.SolrCore.initDirectoryFactory org.apache.solr.core.MockDirectoryFactory
[junit4:junit4]   2> 949 T3277 oasc.SolrCore.<init> [core1] Opening new SolrCore at /Users/jenkins/jenkins-slave/workspace/Lucene-Solr-4.x-MacOSX/solr/build/solr-core/test/J0/./org.apache.solr.core.TestSolrDiscoveryProperties/solrHome/core1/, dataDir=/Users/jenkins/jenkins-slave/workspace/Lucene-Solr-4.x-MacOSX/solr/build/solr-core/test/J0/./org.apache.solr.core.TestSolrDiscoveryProperties/solrHome/core1/stuffandnonsense/
[junit4:junit4]   2> 950 T3277 oasc.JmxMonitoredMap.<init> JMX monitoring is enabled. Adding Solr mbeans to JMX Server: com.sun.jmx.mbeanserver.JmxMBeanServer@6e20f237
[junit4:junit4]   2> 950 T3277 oasc.SolrCore.initDirectoryFactory org.apache.solr.core.MockDirectoryFactory
[junit4:junit4]   2> 951 T3277 oasc.CachingDirectoryFactory.get return new directory for /Users/jenkins/jenkins-slave/workspace/Lucene-Solr-4.x-MacOSX/solr/build/solr-core/test/J0/./org.apache.solr.core.TestSolrDiscoveryProperties/solrHome/core1/stuffandnonsense
[junit4:junit4]   2> 952 T3277 oasc.SolrCore.getNewIndexDir New index directory detected: old=null new=/Users/jenkins/jenkins-slave/workspace/Lucene-Solr-4.x-MacOSX/solr/build/solr-core/test/J0/./org.apache.solr.core.TestSolrDiscoveryProperties/solrHome/core1/stuffandnonsense/index/
[junit4:junit4]   2> 952 T3277 oasc.SolrCore.initIndex WARNING [core1] Solr index directory '/Users/jenkins/jenkins-slave/workspace/Lucene-Solr-4.x-MacOSX/solr/build/solr-core/test/J0/./org.apache.solr.core.TestSolrDiscoveryProperties/solrHome/core1/stuffandnonsense/index' doesn't exist. Creating new index...
[junit4:junit4]   2> 954 T3279 oasc.CachingDirectoryFactory.get return new directory for /Users/jenkins/jenkins-slave/workspace/Lucene-Solr-4.x-MacOSX/solr/build/solr-core/test/J0/./org.apache.solr.core.TestSolrDiscoveryProperties/solrHome/lazy1/stuffandnonsense/index
[junit4:junit4]   2> 957 T3279 oasc.SolrDeletionPolicy.onCommit SolrDeletionPolicy.onCommit: commits:num=1
[junit4:junit4]   2> 		commit{dir=MockDirWrapper(org.apache.lucene.store.RAMDirectory@fd75344 lockFactory=org.apache.lucene.store.NativeFSLockFactory@73350a24),segFN=segments_1,generation=1,filenames=[segments_1]
[junit4:junit4]   2> 958 T3279 oasc.SolrDeletionPolicy.updateCommits newest commit = 1[segments_1]
[junit4:junit4]   2> 959 T3279 oasc.SolrCore.initWriters created json: solr.JSONResponseWriter
[junit4:junit4]   2> 961 T3279 oasc.RequestHandlers.initHandlersFromConfig created /admin/: solr.admin.AdminHandlers
[junit4:junit4]   2> 961 T3279 oasc.RequestHandlers.initHandlersFromConfig created /select: solr.SearchHandler
[junit4:junit4]   2> 962 T3279 oasc.RequestHandlers.initHandlersFromConfig created /update: solr.UpdateRequestHandler
[junit4:junit4]   2> 967 T3279 oashl.XMLLoader.init xsltCacheLifetimeSeconds=60
[junit4:junit4]   2> 970 T3277 oasc.CachingDirectoryFactory.get return new directory for /Users/jenkins/jenkins-slave/workspace/Lucene-Solr-4.x-MacOSX/solr/build/solr-core/test/J0/./org.apache.solr.core.TestSolrDiscoveryProperties/solrHome/core1/stuffandnonsense/index
[junit4:junit4]   2> 975 T3279 oass.SolrIndexSearcher.<init> Opening Searcher@4af8bc2e main
[junit4:junit4]   2> 976 T3279 oasc.SolrCore.registerSearcher [lazy1] Registered new searcher Searcher@4af8bc2e main{StandardDirectoryReader(segments_1:1)}
[junit4:junit4]   2> 977 T3279 oasu.CommitTracker.<init> Hard AutoCommit: disabled
[junit4:junit4]   2> 977 T3279 oasu.CommitTracker.<init> Soft AutoCommit: disabled
[junit4:junit4]   2> 982 T3279 oasc.CoreMaps.putTransientCore Opening transient core lazy1
[junit4:junit4]   2> 982 T3279 oasc.CoreContainer.registerCore registering core: lazy1
[junit4:junit4]   2> 983 T3277 oasc.SolrDeletionPolicy.onCommit SolrDeletionPolicy.onCommit: commits:num=1
[junit4:junit4]   2> 		commit{dir=MockDirWrapper(org.apache.lucene.store.RAMDirectory@1c43f8de lockFactory=org.apache.lucene.store.NativeFSLockFactory@5ce0a62d),segFN=segments_1,generation=1,filenames=[segments_1]
[junit4:junit4]   2> 983 T3277 oasc.SolrDeletionPolicy.updateCommits newest commit = 1[segments_1]
[junit4:junit4]   2> 984 T3277 oasc.SolrCore.initWriters created json: solr.JSONResponseWriter
[junit4:junit4]   2> 984 T3278 oasc.CachingDirectoryFactory.get return new directory for /Users/jenkins/jenkins-slave/workspace/Lucene-Solr-4.x-MacOSX/solr/build/solr-core/test/J0/./org.apache.solr.core.TestSolrDiscoveryProperties/solrHome/lazy2/stuffandnonsense/index
[junit4:junit4]   2> 989 T3278 oasc.SolrDeletionPolicy.onCommit SolrDeletionPolicy.onCommit: commits:num=1
[junit4:junit4]   2> 		commit{dir=MockDirWrapper(org.apache.lucene.store.RAMDirectory@6a2cc777 lockFactory=org.apache.lucene.store.NativeFSLockFactory@254ca1ff),segFN=segments_1,generation=1,filenames=[segments_1]
[junit4:junit4]   2> 989 T3278 oasc.SolrDeletionPolicy.updateCommits newest commit = 1[segments_1]
[junit4:junit4]   2> 990 T3278 oasc.SolrCore.initWriters created json: solr.JSONResponseWriter
[junit4:junit4]   2> 990 T3277 oasc.RequestHandlers.initHandlersFromConfig created /admin/: solr.admin.AdminHandlers
[junit4:junit4]   2> 991 T3277 oasc.RequestHandlers.initHandlersFromConfig created /select: solr.SearchHandler
[junit4:junit4]   2> 992 T3277 oasc.RequestHandlers.initHandlersFromConfig created /update: solr.UpdateRequestHandler
[junit4:junit4]   2> 992 T3278 oasc.RequestHandlers.initHandlersFromConfig created /admin/: solr.admin.AdminHandlers
[junit4:junit4]   2> 993 T3278 oasc.RequestHandlers.initHandlersFromConfig created /select: solr.SearchHandler
[junit4:junit4]   2> 993 T3278 oasc.RequestHandlers.initHandlersFromConfig created /update: solr.UpdateRequestHandler
[junit4:junit4]   2> 996 T3278 oashl.XMLLoader.init xsltCacheLifetimeSeconds=60
[junit4:junit4]   2> 999 T3277 oashl.XMLLoader.init xsltCacheLifetimeSeconds=60
[junit4:junit4]   2> 1005 T3277 oass.SolrIndexSearcher.<init> Opening Searcher@6d471f2d main
[junit4:junit4]   2> 1007 T3278 oass.SolrIndexSearcher.<init> Opening Searcher@32110477 main
[junit4:junit4]   2> 1008 T3278 oasc.SolrCore.registerSearcher [lazy2] Registered new searcher Searcher@32110477 main{StandardDirectoryReader(segments_1:1)}
[junit4:junit4]   2> 1008 T3278 oasu.CommitTracker.<init> Hard AutoCommit: disabled
[junit4:junit4]   2> 1008 T3278 oasu.CommitTracker.<init> Soft AutoCommit: disabled
[junit4:junit4]   2> 1010 T3277 oasc.SolrCore.registerSearcher [core1] Registered new searcher Searcher@6d471f2d main{StandardDirectoryReader(segments_1:1)}
[junit4:junit4]   2> 1010 T3277 oasu.CommitTracker.<init> Hard AutoCommit: disabled
[junit4:junit4]   2> 1010 T3277 oasu.CommitTracker.<init> Soft AutoCommit: disabled
[junit4:junit4]   2> 1015 T3277 oasc.CoreContainer.registerCore registering core: core1
[junit4:junit4]   2> 1017 T3278 oasc.CoreMaps.putTransientCore Opening transient core lazy2
[junit4:junit4]   2> 1017 T3278 oasc.CoreContainer.registerCore registering core: lazy2
[junit4:junit4]   2> 1018 T3276 oasc.CoreContainer.create Creating SolrCore 'core2' using instanceDir: /Users/jenkins/jenkins-slave/workspace/Lucene-Solr-4.x-MacOSX/solr/build/solr-core/test/J0/./org.apache.solr.core.TestSolrDiscoveryProperties/solrHome/core2
[junit4:junit4]   2> 1019 T3276 oasc.SolrResourceLoader.<init> new SolrResourceLoader for directory: '/Users/jenkins/jenkins-slave/workspace/Lucene-Solr-4.x-MacOSX/solr/build/solr-core/test/J0/./org.apache.solr.core.TestSolrDiscoveryProperties/solrHome/core2/'
[junit4:junit4]   2> 1095 T3276 oasc.SolrConfig.<init> Using Lucene MatchVersion: LUCENE_41
[junit4:junit4]   2> 1185 T3276 oasc.SolrConfig.<init> Loaded SolrConfig: solrconfig-minimal.xml
[junit4:junit4]   2> 1186 T3276 oass.IndexSchema.readSchema Reading Solr Schema
[junit4:junit4]   2> 1190 T3276 oass.IndexSchema.readSchema Schema name=tiny
[junit4:junit4]   2> 1231 T3276 oass.IndexSchema.readSchema unique key field: id
[junit4:junit4]   2> 1233 T3276 oasc.SolrCore.initDirectoryFactory org.apache.solr.core.MockDirectoryFactory
[junit4:junit4]   2> 1234 T3276 oasc.SolrCore.<init> [core2] Opening new SolrCore at /Users/jenkins/jenkins-slave/workspace/Lucene-Solr-4.x-MacOSX/solr/build/solr-core/test/J0/./org.apache.solr.core.TestSolrDiscoveryProperties/solrHome/core2/, dataDir=/Users/jenkins/jenkins-slave/workspace/Lucene-Solr-4.x-MacOSX/solr/build/solr-core/test/J0/./org.apache.solr.core.TestSolrDiscoveryProperties/solrHome/core2/stuffandnonsense/
[junit4:junit4]   2> 1235 T3276 oasc.JmxMonitoredMap.<init> JMX monitoring is enabled. Adding Solr mbeans to JMX Server: com.sun.jmx.mbeanserver.JmxMBeanServer@6e20f237
[junit4:junit4]   2> 1235 T3276 oasc.SolrCore.initDirectoryFactory org.apache.solr.core.MockDirectoryFactory
[junit4:junit4]   2> 1236 T3276 oasc.CachingDirectoryFactory.get return new directory for /Users/jenkins/jenkins-slave/workspace/Lucene-Solr-4.x-MacOSX/solr/build/solr-core/test/J0/./org.apache.solr.core.TestSolrDiscoveryProperties/solrHome/core2/stuffandnonsense
[junit4:junit4]   2> 1237 T3276 oasc.SolrCore.getNewIndexDir New index directory detected: old=null new=/Users/jenkins/jenkins-slave/workspace/Lucene-Solr-4.x-MacOSX/solr/build/solr-core/test/J0/./org.apache.solr.core.TestSolrDiscoveryProperties/solrHome/core2/stuffandnonsense/index/
[junit4:junit4]   2> 1237 T3276 oasc.SolrCore.initIndex WARNING [core2] Solr index directory '/Users/jenkins/jenkins-slave/workspace/Lucene-Solr-4.x-MacOSX/solr/build/solr-core/test/J0/./org.apache.solr.core.TestSolrDiscoveryProperties/solrHome/core2/stuffandnonsense/index' doesn't exist. Creating new index...
[junit4:junit4]   2> 1238 T3276 oasc.CachingDirectoryFactory.get return new directory for /Users/jenkins/jenkins-slave/workspace/Lucene-Solr-4.x-MacOSX/solr/build/solr-core/test/J0/./org.apache.solr.core.TestSolrDiscoveryProperties/solrHome/core2/stuffandnonsense/index
[junit4:junit4]   2> 1241 T3276 oasc.SolrDeletionPolicy.onCommit SolrDeletionPolicy.onCommit: commits:num=1
[junit4:junit4]   2> 		commit{dir=MockDirWrapper(org.apache.lucene.store.RAMDirectory@47cf1cde lockFactory=org.apache.lucene.store.NativeFSLockFactory@1ee900e8),segFN=segments_1,generation=1,filenames=[segments_1]
[junit4:junit4]   2> 1241 T3276 oasc.SolrDeletionPolicy.updateCommits newest commit = 1[segments_1]
[junit4:junit4]   2> 1242 T3276 oasc.SolrCore.initWriters created json: solr.JSONResponseWriter
[junit4:junit4]   2> 1245 T3276 oasc.RequestHandlers.initHandlersFromConfig created /admin/: solr.admin.AdminHandlers
[junit4:junit4]   2> 1246 T3276 oasc.RequestHandlers.initHandlersFromConfig created /select: solr.SearchHandler
[junit4:junit4]   2> 1247 T3276 oasc.RequestHandlers.initHandlersFromConfig created /update: solr.UpdateRequestHandler
[junit4:junit4]   2> 1252 T3276 oashl.XMLLoader.init xsltCacheLifetimeSeconds=60
[junit4:junit4]   2> 1263 T3276 oass.SolrIndexSearcher.<init> Opening Searcher@206ad689 main
[junit4:junit4]   2> 1264 T3276 oasc.SolrCore.registerSearcher [core2] Registered new searcher Searcher@206ad689 main{StandardDirectoryReader(segments_1:1)}
[junit4:junit4]   2> 1265 T3276 oasu.CommitTracker.<init> Hard AutoCommit: disabled
[junit4:junit4]   2> 1265 T3276 oasu.CommitTracker.<init> Soft AutoCommit: disabled
[junit4:junit4]   2> 1270 T3276 oasc.CoreContainer.registerCore registering core: core2
[junit4:junit4]   2> 1271 T3276 oasc.CoreContainer.create Creating SolrCore 'lazy3' using instanceDir: /Users/jenkins/jenkins-slave/workspace/Lucene-Solr-4.x-MacOSX/solr/build/solr-core/test/J0/./org.apache.solr.core.TestSolrDiscoveryProperties/solrHome/lazy3
[junit4:junit4]   2> 1271 T3276 oasc.SolrResourceLoader.<init> new SolrResourceLoader for directory: '/Users/jenkins/jenkins-slave/workspace/Lucene-Solr-4.x-MacOSX/solr/build/solr-core/test/J0/./org.apache.solr.core.TestSolrDiscoveryProperties/solrHome/lazy3/'
[junit4:junit4]   2> 1355 T3276 oasc.SolrConfig.<init> Using Lucene MatchVersion: LUCENE_41
[junit4:junit4]   2> 1445 T3276 oasc.SolrConfig.<init> Loaded SolrConfig: solrconfig-minimal.xml
[junit4:junit4]   2> 1446 T3276 oass.IndexSchema.readSchema Reading Solr Schema
[junit4:junit4]   2> 1451 T3276 oass.IndexSchema.readSchema Schema name=tiny
[junit4:junit4]   2> 1495 T3276 oass.IndexSchema.readSchema unique key field: id
[junit4:junit4]   2> 1497 T3276 oasc.SolrCore.initDirectoryFactory org.apache.solr.core.MockDirectoryFactory
[junit4:junit4]   2> 1497 T3276 oasc.SolrCore.<init> [lazy3] Opening new SolrCore at /Users/jenkins/jenkins-slave/workspace/Lucene-Solr-4.x-MacOSX/solr/build/solr-core/test/J0/./org.apache.solr.core.TestSolrDiscoveryProperties/solrHome/lazy3/, dataDir=/Users/jenkins/jenkins-slave/workspace/Lucene-Solr-4.x-MacOSX/solr/build/solr-core/test/J0/./org.apache.solr.core.TestSolrDiscoveryProperties/solrHome/lazy3/stuffandnonsense/
[junit4:junit4]   2> 1498 T3276 oasc.JmxMonitoredMap.<init> JMX monitoring is enabled. Adding Solr mbeans to JMX Server: com.sun.jmx.mbeanserver.JmxMBeanServer@6e20f237
[junit4:junit4]   2> 1499 T3276 oasc.SolrCore.initDirectoryFactory org.apache.solr.core.MockDirectoryFactory
[junit4:junit4]   2> 1500 T3276 oasc.CachingDirectoryFactory.get return new directory for /Users/jenkins/jenkins-slave/workspace/Lucene-Solr-4.x-MacOSX/solr/build/solr-core/test/J0/./org.apache.solr.core.TestSolrDiscoveryProperties/solrHome/lazy3/stuffandnonsense
[junit4:junit4]   2> 1500 T3276 oasc.SolrCore.getNewIndexDir New index directory detected: old=null new=/Users/jenkins/jenkins-slave/workspace/Lucene-Solr-4.x-MacOSX/solr/build/solr-core/test/J0/./org.apache.solr.core.TestSolrDiscoveryProperties/solrHome/lazy3/stuffandnonsense/index/
[junit4:junit4]   2> 1501 T3276 oasc.SolrCore.initIndex WARNING [lazy3] Solr index directory '/Users/jenkins/jenkins-slave/workspace/Lucene-Solr-4.x-MacOSX/solr/build/solr-core/test/J0/./org.apache.solr.core.TestSolrDiscoveryProperties/solrHome/lazy3/stuffandnonsense/index' doesn't exist. Creating new index...
[junit4:junit4]   2> 1502 T3276 oasc.CachingDirectoryFactory.get return new directory for /Users/jenkins/jenkins-slave/workspace/Lucene-Solr-4.x-MacOSX/solr/build/solr-core/test/J0/./org.apache.solr.core.TestSolrDiscoveryProperties/solrHome/lazy3/stuffandnonsense/index
[junit4:junit4]   2> 1504 T3276 oasc.SolrDeletionPolicy.onCommit SolrDeletionPolicy.onCommit: commits:num=1
[junit4:junit4]   2> 		commit{dir=MockDirWrapper(org.apache.lucene.store.RAMDirectory@324789e0 lockFactory=org.apache.lucene.store.NativeFSLockFactory@64642c74),segFN=segments_1,generation=1,filenames=[segments_1]
[junit4:junit4]   2> 1505 T3276 oasc.SolrDeletionPolicy.updateCommits newest commit = 1[segments_1]
[junit4:junit4]   2> 1506 T3276 oasc.SolrCore.initWriters created json: solr.JSONResponseWriter
[junit4:junit4]   2> 1509 T3276 oasc.RequestHandlers.initHandlersFromConfig created /admin/: solr.admin.AdminHandlers
[junit4:junit4]   2> 1510 T3276 oasc.RequestHandlers.initHandlersFromConfig created /select: solr.SearchHandler
[junit4:junit4]   2> 1511 T3276 oasc.RequestHandlers.initHandlersFromConfig created /update: solr.UpdateRequestHandler
[junit4:junit4]   2> 1516 T3276 oashl.XMLLoader.init xsltCacheLifetimeSeconds=60
[junit4:junit4]   2> 1532 T3276 oass.SolrIndexSearcher.<init> Opening Searcher@66defcc5 main
[junit4:junit4]   2> 1533 T3276 oasc.SolrCore.registerSearcher [lazy3] Registered new searcher Searcher@66defcc5 main{StandardDirectoryReader(segments_1:1)}
[junit4:junit4]   2> 1534 T3276 oasu.CommitTracker.<init> Hard AutoCommit: disabled
[junit4:junit4]   2> 1534 T3276 oasu.CommitTracker.<init> Soft AutoCommit: disabled
[junit4:junit4]   2> 1548 T3276 oasc.CoreMaps.putTransientCore Opening transient core lazy3
[junit4:junit4]   2> 1556 T3276 oasc.CoreContainer.registerCore registering core: lazy3
[junit4:junit4]   2> 1556 T3276 oasc.CoreContainer.persistFile Persisting cores config to /Users/jenkins/jenkins-slave/workspace/Lucene-Solr-4.x-MacOSX/solr/build/solr-core/test/J0/./org.apache.solr.core.TestSolrDiscoveryProperties/solrHome/solr.properties
[junit4:junit4]   2> 1559 T3276 oasc.CoreContainer.shutdown Shutting down CoreContainer instance=1911997983
[junit4:junit4]   2> 1560 T3276 oasc.SolrCore.close [core1]  CLOSING SolrCore org.apache.solr.core.SolrCore@2b0b7e54
[junit4:junit4]   2> 1568 T3276 oasu.DirectUpdateHandler2.close closing DirectUpdateHandler2{commits=0,autocommits=0,soft autocommits=0,optimizes=0,rollbacks=0,expungeDeletes=0,docsPending=0,adds=0,deletesById=0,deletesByQuery=0,errors=0,cumulative_adds=0,cumulative_deletesById=0,cumulative_deletesByQuery=0,cumulative_errors=0}
[junit4:junit4]   2> 1568 T3276 oasu.SolrCoreState.decrefSolrCoreState Closing SolrCoreState
[junit4:junit4]   2> 1569 T3276 oasu.DefaultSolrCoreState.closeIndexWriter SolrCoreState ref count has reached 0 - closing IndexWriter
[junit4:junit4]   2> 1569 T3276 oasu.DefaultSolrCoreState.closeIndexWriter closing IndexWriter with IndexWriterCloser
[junit4:junit4]   2> 1570 T3276 oasc.SolrCore.closeSearcher [core1] Closing main searcher on request.
[junit4:junit4]   2> 1571 T3276 oasc.CachingDirectoryFactory.close Closing directory when closing factory: /Users/jenkins/jenkins-slave/workspace/Lucene-Solr-4.x-MacOSX/solr/build/solr-core/test/J0/./org.apache.solr.core.TestSolrDiscoveryProperties/solrHome/core1/stuffandnonsense/index
[junit4:junit4]   2> 1571 T3276 oasc.CachingDirectoryFactory.closeDirectory Closing directory: /Users/jenkins/jenkins-slave/workspace/Lucene-Solr-4.x-MacOSX/solr/build/solr-core/test/J0/./org.apache.solr.core.TestSolrDiscoveryProperties/solrHome/core1/stuffandnonsense/index
[junit4:junit4]   2> 1572 T3276 oasc.CachingDirectoryFactory.close Closing directory when closing factory: /Users/jenkins/jenkins-slave/workspace/Lucene-Solr-4.x-MacOSX/solr/build/solr-core/test/J0/./org.apache.solr.core.TestSolrDiscoveryProperties/solrHome/core1/stuffandnonsense
[junit4:junit4]   2> 1572 T3276 oasc.CachingDirectoryFactory.closeDirectory Closing directory: /Users/jenkins/jenkins-slave/workspace/Lucene-Solr-4.x-MacOSX/solr/build/solr-core/test/J0/./org.apache.solr.core.TestSolrDiscoveryProperties/solrHome/core1/stuffandnonsense
[junit4:junit4]   2> 1573 T3276 oasc.SolrCore.close [core2]  CLOSING SolrCore org.apache.solr.core.SolrCore@5f888a65
[junit4:junit4]   2> 1579 T3276 oasu.DirectUpdateHandler2.close closing DirectUpdateHandler2{commits=0,autocommits=0,soft autocommits=0,optimizes=0,rollbacks=0,expungeDeletes=0,docsPending=0,adds=0,deletesById=0,deletesByQuery=0,errors=0,cumulative_adds=0,cumulative_deletesById=0,cumulative_deletesByQuery=0,cumulative_errors=0}
[junit4:junit4]   2> 1580 T3276 oasu.SolrCoreState.decrefSolrCoreState Closing SolrCoreState
[junit4:junit4]   2> 1581 T3276 oasu.DefaultSolrCoreState.closeIndexWriter SolrCoreState ref count has reached 0 - closing IndexWriter
[junit4:junit4]   2> 1581 T3276 oasu.DefaultSolrCoreState.closeIndexWriter closing IndexWriter with IndexWriterCloser
[junit4:junit4]   2> 1582 T3276 oasc.SolrCore.closeSearcher [core2] Closing main searcher on request.
[junit4:junit4]   2> 1582 T3276 oasc.CachingDirectoryFactory.close Closing directory when closing factory: /Users/jenkins/jenkins-slave/workspace/Lucene-Solr-4.x-MacOSX/solr/build/solr-core/test/J0/./org.apache.solr.core.TestSolrDiscoveryProperties/solrHome/core2/stuffandnonsense
[junit4:junit4]   2> 1583 T3276 oasc.CachingDirectoryFactory.closeDirectory Closing directory: /Users/jenkins/jenkins-slave/workspace/Lucene-Solr-4.x-MacOSX/solr/build/solr-core/test/J0/./org.apache.solr.core.TestSolrDiscoveryProperties/solrHome/core2/stuffandnonsense
[junit4:junit4]   2> 1583 T3276 oasc.CachingDirectoryFactory.close Closing directory when closing factory: /Users/jenkins/jenkins-slave/workspace/Lucene-Solr-4.x-MacOSX/solr/build/solr-core/test/J0/./org.apache.solr.core.TestSolrDiscoveryProperties/solrHome/core2/stuffandnonsense/index
[junit4:junit4]   2> 1584 T3276 oasc.CachingDirectoryFactory.closeDirectory Closing directory: /Users/jenkins/jenkins-slave/workspace/Lucene-Solr-4.x-MacOSX/solr/build/solr-core/test/J0/./org.apache.solr.core.TestSolrDiscoveryProperties/solrHome/core2/stuffandnonsense/index
[junit4:junit4]   2> 1584 T3276 oasc.SolrCore.close [lazy2]  CLOSING SolrCore org.apache.solr.core.SolrCore@30e1b77a
[junit4:junit4]   2> 1590 T3276 oasu.DirectUpdateHandler2.close closing DirectUpdateHandler2{commits=0,autocommits=0,soft autocommits=0,optimizes=0,rollbacks=0,expungeDeletes=0,docsPending=0,adds=0,deletesById=0,deletesByQuery=0,errors=0,cumulative_adds=0,cumulative_deletesById=0,cumulative_deletesByQuery=0,cumulative_errors=0}
[junit4:junit4]   2> 1591 T3276 oasu.SolrCoreState.decrefSolrCoreState Closing SolrCoreState
[junit4:junit4]   2> 1591 T3276 oasu.DefaultSolrCoreState.closeIndexWriter SolrCoreState ref count has reached 0 - closing IndexWriter
[junit4:junit4]   2> 1593 T3276 oasu.DefaultSolrCoreState.closeIndexWriter closing IndexWriter with IndexWriterCloser
[junit4:junit4]   2> 1593 T3276 oasc.SolrCore.closeSearcher [lazy2] Closing main searcher on request.
[junit4:junit4]   2> 1594 T3276 oasc.CachingDirectoryFactory.close Closing directory when closing factory: /Users/jenkins/jenkins-slave/workspace/Lucene-Solr-4.x-MacOSX/solr/build/solr-core/test/J0/./org.apache.solr.core.TestSolrDiscoveryProperties/solrHome/lazy2/stuffandnonsense
[junit4:junit4]   2> 1595 T3276 oasc.CachingDirectoryFactory.closeDirectory Closing directory: /Users/jenkins/jenkins-slave/workspace/Lucene-Solr-4.x-MacOSX/solr/build/solr-core/test/J0/./org.apache.solr.core.TestSolrDiscoveryProperties/solrHome/lazy2/stuffandnonsense
[junit4:junit4]   2> 1595 T3276 oasc.CachingDirectoryFactory.close Closing directory when closing factory: /Users/jenkins/jenkins-slave/workspace/Lucene-Solr-4.x-MacOSX/solr/build/solr-core/test/J0/./org.apache.solr.core.TestSolrDiscoveryProperties/solrHome/lazy2/stuffandnonsense/index
[junit4:junit4]   2> 1596 T3276 oasc.CachingDirectoryFactory.closeDirectory Closing directory: /Users/jenkins/jenkins-slave/workspace/Lucene-Solr-4.x-MacOSX/solr/build/solr-core/test/J0/./org.apache.solr.core.TestSolrDiscoveryProperties/solrHome/lazy2/stuffandnonsense/index
[junit4:junit4]   2> 1596 T3276 oasc.SolrCore.close [lazy3]  CLOSING SolrCore org.apache.solr.core.SolrCore@6405587a
[junit4:junit4]   2> 1625 T3276 oasu.DirectUpdateHandler2.close closing DirectUpdateHandler2{commits=0,autocommits=0,soft autocommits=0,optimizes=0,rollbacks=0,expungeDeletes=0,docsPending=0,adds=0,deletesById=0,deletesByQuery=0,errors=0,cumulative_adds=0,cumulative_deletesById=0,cumulative_deletesByQuery=0,cumulative_errors=0}
[junit4:junit4]   2> 1626 T3276 oasu.SolrCoreState.decrefSolrCoreState Closing SolrCoreState
[junit4:junit4]   2> 1626 T3276 oasu.DefaultSolrCoreState.closeIndexWriter SolrCoreState ref count has reached 0 - closing IndexWriter
[junit4:junit4]   2> 1627 T3276 oasu.DefaultSolrCoreState.closeIndexWriter closing IndexWriter with IndexWriterCloser
[junit4:junit4]   2> 1627 T3276 oasc.SolrCore.closeSearcher [lazy3] Closing main searcher on request.
[junit4:junit4]   2> 1628 T3276 oasc.CachingDirectoryFactory.close Closing directory when closing factory: /Users/jenkins/jenkins-slave/workspace/Lucene-Solr-4.x-MacOSX/solr/build/solr-core/test/J0/./org.apache.solr.core.TestSolrDiscoveryProperties/solrHome/lazy3/stuffandnonsense
[junit4:junit4]   2> 1628 T3276 oasc.CachingDirectoryFactory.closeDirectory Closing directory: /Users/jenkins/jenkins-slave/workspace/Lucene-Solr-4.x-MacOSX/solr/build/solr-core/test/J0/./org.apache.solr.core.TestSolrDiscoveryProperties/solrHome/lazy3/stuffandnonsense
[junit4:junit4]   2> 1629 T3276 oasc.CachingDirectoryFactory.close Closing directory when closing factory: /Users/jenkins/jenkins-slave/workspace/Lucene-Solr-4.x-MacOSX/solr/build/solr-core/test/J0/./org.apache.solr.core.TestSolrDiscoveryProperties/solrHome/lazy3/stuffandnonsense/index
[junit4:junit4]   2> 1630 T3276 oasc.CachingDirectoryFactory.closeDirectory Closing directory: /Users/jenkins/jenkins-slave/workspace/Lucene-Solr-4.x-MacOSX/solr/build/solr-core/test/J0/./org.apache.solr.core.TestSolrDiscoveryProperties/solrHome/lazy3/stuffandnonsense/index
[junit4:junit4]   2> 1649 T3276 oas.SolrTestCaseJ4.tearDown ###Ending testPersistTrue
[junit4:junit4]   2> 1659 T3276 oas.SolrTestCaseJ4.setUp ###Starting testBackCompatXml
[junit4:junit4]   2> 1666 T3276 oasc.SolrResourceLoader.locateSolrHome JNDI not configured for solr (NoInitialContextEx)
[junit4:junit4]   2> 1666 T3276 oasc.SolrResourceLoader.locateSolrHome using system property solr.solr.home: /Users/jenkins/jenkins-slave/workspace/Lucene-Solr-4.x-MacOSX/solr/build/solr-core/test/J0/./org.apache.solr.core.TestSolrDiscoveryProperties/solrHome
[junit4:junit4]   2> 1666 T3276 oasc.CoreContainer$Initializer.initialize looking for solr config file: /Users/jenkins/jenkins-slave/workspace/Lucene-Solr-4.x-MacOSX/solr/build/solr-core/test/J0/./org.apache.solr.core.TestSolrDiscoveryProperties/solrHome/solr.xml
[junit4:junit4]   2> 1667 T3276 oasc.CoreContainer.<init> New CoreContainer 717523963
[junit4:junit4]   2> 1668 T3276 oasc.CoreContainer.load Loading CoreContainer using Solr Home: '/Users/jenkins/jenkins-slave/workspace/Lucene-Solr-4.x-MacOSX/solr/build/solr-core/test/J0/./org.apache.solr.core.TestSolrDiscoveryProperties/solrHome/'
[junit4:junit4]   2> 1668 T3276 oasc.SolrResourceLoader.<init> new SolrResourceLoader for directory: '/Users/jenkins/jenkins-slave/workspace/Lucene-Solr-4.x-MacOSX/solr/build/solr-core/test/J0/./org.apache.solr.core.TestSolrDiscoveryProperties/solrHome/'
[junit4:junit4]   2> 1727 T3276 oashc.HttpShardHandlerFactory.getParameter Setting socketTimeout to: 0
[junit4:junit4]   2> 1728 T3276 oashc.HttpShardHandlerFactory.getParameter Setting urlScheme to: http://
[junit4:junit4]   2> 1729 T3276 oashc.HttpShardHandlerFactory.getParameter Setting connTimeout to: 0
[junit4:junit4]   2> 1729 T3276 oashc.HttpShardHandlerFactory.getParameter Setting maxConnectionsPerHost to: 20
[junit4:junit4]   2> 1730 T3276 oashc.HttpShardHandlerFactory.getParameter Setting corePoolSize to: 0
[junit4:junit4]   2> 1730 T3276 oashc.HttpShardHandlerFactory.getParameter Setting maximumPoolSize to: 2147483647
[junit4:junit4]   2> 1731 T3276 oashc.HttpShardHandlerFactory.getParameter Setting maxThreadIdleTime to: 5
[junit4:junit4]   2> 1731 T3276 oashc.HttpShardHandlerFactory.getParameter Setting sizeOfQueue to: -1
[junit4:junit4]   2> 1731 T3276 oashc.HttpShardHandlerFactory.getParameter Setting fairnessPolicy to: false
[junit4:junit4]   2> 1732 T3276 oascsi.HttpClientUtil.createClient Creating new http client, config:maxConnectionsPerHost=20&maxConnections=10000&socketTimeout=0&connTimeout=0&retry=false
[junit4:junit4]   2> 1761 T3276 oasc.CoreMaps.allocateLazyCores Allocating transient cache for 4 transient cores
[junit4:junit4]   2> 1766 T3276 oasc.CoreContainer.load Registering Log Listener
[junit4:junit4]   2> 1802 T3286 oasc.CoreContainer.create Creating SolrCore 'collection1' using instanceDir: /Users/jenkins/jenkins-slave/workspace/Lucene-Solr-4.x-MacOSX/solr/build/solr-core/test/J0/./org.apache.solr.core.TestSolrDiscoveryProperties/solrHome/collection1
[junit4:junit4]   2> 1803 T3286 oasc.SolrResourceLoader.<init> new SolrResourceLoader for directory: '/Users/jenkins/jenkins-slave/workspace/Lucene-Solr-4.x-MacOSX/solr/build/solr-core/test/J0/./org.apache.solr.core.TestSolrDiscoveryProperties/solrHome/collection1/'
[junit4:junit4]   2> 1868 T3286 oasc.SolrConfig.<init> Using Lucene MatchVersion: LUCENE_41
[junit4:junit4]   2> 1948 T3286 oasc.SolrConfig.<init> Loaded SolrConfig: solrconfig-minimal.xml
[junit4:junit4]   2> 1948 T3286 oass.IndexSchema.readSchema Reading Solr Schema
[junit4:junit4]   2> 1952 T3286 oass.IndexSchema.readSchema Schema name=tiny
[junit4:junit4]   2> 1978 T3286 oass.IndexSchema.readSchema unique key field: id
[junit4:junit4]   2> 1980 T3286 oasc.SolrCore.initDirectoryFactory org.apache.solr.core.MockDirectoryFactory
[junit4:junit4]   2> 1980 T3286 oasc.SolrCore.<init> [collection1] Opening new SolrCore at /Users/jenkins/jenkins-slave/workspace/Lucene-Solr-4.x-MacOSX/solr/build/solr-core/test/J0/./org.apache.solr.core.TestSolrDiscoveryProperties/solrHome/collection1/, dataDir=/Users/jenkins/jenkins-slave/workspace/Lucene-Solr-4.x-MacOSX/solr/build/solr-core/test/J0/./org.apache.solr.core.TestSolrDiscoveryProperties/solrHome/collection1/data/
[junit4:junit4]   2> 1980 T3286 oasc.JmxMonitoredMap.<init> JMX monitoring is enabled. Adding Solr mbeans to JMX Server: com.sun.jmx.mbeanserver.JmxMBeanServer@6e20f237
[junit4:junit4]   2> 1981 T3286 oasc.SolrCore.initDirectoryFactory org.apache.solr.core.MockDirectoryFactory
[junit4:junit4]   2> 1982 T3286 oasc.CachingDirectoryFactory.get return new directory for /Users/jenkins/jenkins-slave/workspace/Lucene-Solr-4.x-MacOSX/solr/build/solr-core/test/J0/./org.apache.solr.core.TestSolrDiscoveryProperties/solrHome/collection1/data
[junit4:junit4]   2> 1982 T3286 oasc.SolrCore.getNewIndexDir New index directory detected: old=null new=/Users/jenkins/jenkins-slave/workspace/Lucene-Solr-4.x-MacOSX/solr/build/solr-core/test/J0/./org.apache.solr.core.TestSolrDiscoveryProperties/solrHome/collection1/data/index/
[junit4:junit4]   2> 1982 T3286 oasc.SolrCore.initIndex WARNING [collection1] Solr index directory '/Users/jenkins/jenkins-slave/workspace/Lucene-Solr-4.x-MacOSX/solr/build/solr-core/test/J0/./org.apache.solr.core.TestSolrDiscoveryProperties/solrHome/collection1/data/index' doesn't exist. Creating new index...
[junit4:junit4]   2> 1983 T3286 oasc.CachingDirectoryFactory.get return new directory for /Users/jenkins/jenkins-slave/workspace/Lucene-Solr-4.x-MacOSX/solr/build/solr-core/test/J0/./org.apache.solr.core.TestSolrDiscoveryProperties/solrHome/collection1/data/index
[junit4:junit4]   2> 1986 T3286 oasc.SolrDeletionPolicy.onCommit SolrDeletionPolicy.onCommit: commits:num=1
[junit4:junit4]   2> 		commit{dir=MockDirWrapper(org.apache.lucene.store.RAMDirectory@22af258 lockFactory=org.apache.lucene.store.NativeFSLockFactory@6fc5dead),segFN=segments_1,generation=1,filenames=[segments_1]
[junit4:junit4]   2> 1986 T3286 oasc.SolrDeletionPolicy.updateCommits newest commit = 1[segments_1]
[junit4:junit4]   2> 1987 T3286 oasc.SolrCore.initWriters created json: solr.JSONResponseWriter
[junit4:junit4]   2> 1990 T3286 oasc.RequestHandlers.initHandlersFromConfig created /admin/: solr.admin.AdminHandlers
[junit4:junit4]   2> 1990 T3286 oasc.RequestHandlers.initHandlersFromConfig created /select: solr.SearchHandler
[junit4:junit4]   2> 1991 T3286 oasc.RequestHandlers.initHandlersFromConfig created /update: solr.UpdateRequestHandler
[junit4:junit4]   2> 1996 T3286 oashl.XMLLoader.init xsltCacheLifetimeSeconds=60
[junit4:junit4]   2> 2002 T3286 oass.SolrIndexSearcher.<init> Opening Searcher@1b05d1a5 main
[junit4:junit4]   2> 2003 T3286 oasc.SolrCore.registerSearcher [collection1] Registered new searcher Searcher@1b05d1a5 main{StandardDirectoryReader(segments_1:1)}
[junit4:junit4]   2> 2004 T3286 oasu.CommitTracker.<init> Hard AutoCommit: disabled
[junit4:junit4]   2> 2004 T3286 oasu.CommitTracker.<init> Soft AutoCommit: disabled
[junit4:junit4]   2> 2018 T3286 oasc.CoreContainer.registerCore registering core: collection1
[junit4:junit4]   2> 2019 T3276 oasc.CoreContainer.shutdown Shutting down CoreContainer instance=717523963
[junit4:junit4]   2> 2022 T3276 oasc.SolrCore.close [collection1]  CLOSING SolrCore org.apache.solr.core.SolrCore@69ff92d2
[junit4:junit4]   2> 2029 T3276 oasu.DirectUpdateHandler2.close closing DirectUpdateHandler2{commits=0,autocommits=0,soft autocommits=0,optimizes=0,rollbacks=0,expungeDeletes=0,docsPending=0,adds=0,deletesById=0,deletesByQuery=0,errors=0,cumulative_adds=0,cumulative_deletesById=0,cumulative_deletesByQuery=0,cumulative_errors=0}
[junit4:junit4]   2> 2030 T3276 oasu.SolrCoreState.decrefSolrCoreState Closing SolrCoreState
[junit4:junit4]   2> 2030 T3276 oasu.DefaultSolrCoreState.closeIndexWriter SolrCoreState ref count has reached 0 - closing IndexWriter
[junit4:junit4]   2> 2031 T3276 oasu.DefaultSolrCoreState.closeIndexWriter closing IndexWriter with IndexWriterCloser
[junit4:junit4]   2> 2031 T3276 oasc.SolrCore.closeSearcher [collection1] Closing main searcher on request.
[junit4:junit4]   2> 2032 T3276 oasc.CachingDirectoryFactory.close Closing directory when closing factory: /Users/jenkins/jenkins-slave/workspace/Lucene-Solr-4.x-MacOSX/solr/build/solr-core/test/J0/./org.apache.solr.core.TestSolrDiscoveryProperties/solrHome/collection1/data/index
[junit4:junit4]   2> 2034 T3276 oasc.CachingDirectoryFactory.closeDirectory Closing directory: /Users/jenkins/jenkins-slave/workspace/Lucene-Solr-4.x-MacOSX/solr/build/solr-core/test/J0/./org.apache.solr.core.TestSolrDiscoveryProperties/solrHome/collection1/data/index
[junit4:junit4]   2> 2034 T3276 oasc.CachingDirectoryFactory.close Closing directory when closing factory: /Users/jenkins/jenkins-slave/workspace/Lucene-Solr-4.x-MacOSX/solr/build/solr-core/test/J0/./org.apache.solr.core.TestSolrDiscoveryProperties/solrHome/collection1/data
[junit4:junit4]   2> 2034 T3276 oasc.CachingDirectoryFactory.closeDirectory Closing directory: /Users/jenkins/jenkins-slave/workspace/Lucene-Solr-4.x-MacOSX/solr/build/solr-core/test/J0/./org.apache.solr.core.TestSolrDiscoveryProperties/solrHome/collection1/data
[junit4:junit4]   2> 2040 T3276 oas.SolrTestCaseJ4.tearDown ###Ending testBackCompatXml
[junit4:junit4]   2> 2048 T3276 oas.SolrTestCaseJ4.setUp ###Starting testPropertiesFile
[junit4:junit4]   2> 2062 T3276 oasc.SolrResourceLoader.locateSolrHome JNDI not configured for solr (NoInitialContextEx)
[junit4:junit4]   2> 2062 T3276 oasc.SolrResourceLoader.locateSolrHome using system property solr.solr.home: /Users/jenkins/jenkins-slave/workspace/Lucene-Solr-4.x-MacOSX/solr/build/solr-core/test/J0/./org.apache.solr.core.TestSolrDiscoveryProperties/solrHome
[junit4:junit4]   2> 2063 T3276 oasc.CoreContainer$Initializer.initialize looking for solr config file: /Users/jenkins/jenkins-slave/workspace/Lucene-Solr-4.x-MacOSX/solr/build/solr-core/test/J0/./org.apache.solr.core.TestSolrDiscoveryProperties/solrHome/solr.xml
[junit4:junit4]   2> 2064 T3276 oasc.CoreContainer.<init> New CoreContainer 2047246913
[junit4:junit4]   2> 2065 T3276 oasc.CoreContainer.load Loading CoreContainer using Solr Home: '/Users/jenkins/jenkins-slave/workspace/Lucene-Solr-4.x-MacOSX/solr/build/solr-core/test/J0/./org.apache.solr.core.TestSolrDiscoveryProperties/solrHome/'
[junit4:junit4]   2> 2065 T3276 oasc.SolrResourceLoader.<init> new SolrResourceLoader for directory: '/Users/jenkins/jenkins-slave/workspace/Lucene-Solr-4.x-MacOSX/solr/build/solr-core/test/J0/./org.apache.solr.core.TestSolrDiscoveryProperties/solrHome/'
[junit4:junit4]   2> 2092 T3276 oasc.SolrProperties.walkFromHere Looking for cores in /Users/jenkins/jenkins-slave/workspace/Lucene-Solr-4.x-MacOSX/solr/build/solr-core/test/J0/./org.apache.solr.core.TestSolrDiscoveryProperties/solrHome
[junit4:junit4]   2> 2093 T3276 oasc.SolrProperties.walkFromHere Discovered properties file /Users/jenkins/jenkins-slave/workspace/Lucene-Solr-4.x-MacOSX/solr/build/solr-core/test/J0/./org.apache.solr.core.TestSolrDiscoveryProperties/solrHome/core1/core.properties, adding to cores
[junit4:junit4]   2> 2094 T3276 oasc.SolrProperties.walkFromHere Discovered properties file /Users/jenkins/jenkins-slave/workspace/Lucene-Solr-4.x-MacOSX/solr/build/solr-core/test/J0/./org.apache.solr.core.TestSolrDiscoveryProperties/solrHome/core2/core.properties, adding to cores
[junit4:junit4]   2> 2095 T3276 oasc.SolrProperties.walkFromHere Discovered properties file /Users/jenkins/jenkins-slave/workspace/Lucene-Solr-4.x-MacOSX/solr/build/solr-core/test/J0/./org.apache.solr.core.TestSolrDiscoveryProperties/solrHome/lazy1/core.properties, adding to cores
[junit4:junit4]   2> 2096 T3276 oasc.SolrProperties.walkFromHere Looking for cores in /Users/jenkins/jenkins-slave/workspace/Lucene-Solr-4.x-MacOSX/solr/build/solr-core/test/J0/./org.apache.solr.core.TestSolrDiscoveryProperties/solrHome
[junit4:junit4]   2> 2097 T3276 oasc.SolrProperties.walkFromHere Discovered properties file /Users/jenkins/jenkins-slave/workspace/Lucene-Solr-4.x-MacOSX/solr/build/solr-core/test/J0/./org.apache.solr.core.TestSolrDiscoveryProperties/solrHome/core1/core.properties, adding to cores
[junit4:junit4]   2> 2097 T3276 oasc.SolrProperties.walkFromHere Discovered properties file /Users/jenkins/jenkins-slave/workspace/Lucene-Solr-4.x-MacOSX/solr/build/solr-core/test/J0/./org.apache.solr.core.TestSolrDiscoveryProperties/solrHome/core2/core.properties, adding to cores
[junit4:junit4]   2> 2099 T3276 oasc.SolrProperties.walkFromHere Discovered properties file /Users/jenkins/jenkins-slave/workspace/Lucene-Solr-4.x-MacOSX/solr/build/solr-core/test/J0/./org.apache.solr.core.TestSolrDiscoveryProperties/solrHome/lazy1/core.properties, adding to cores
[junit4:junit4]   2> 2100 T3276 oashc.HttpShardHandlerFactory.getParameter Setting socketTimeout to: 0
[junit4:junit4]   2> 2100 T3276 oashc.HttpShardHandlerFactory.getParameter Setting urlScheme to: http://
[junit4:junit4]   2> 2101 T3276 oashc.HttpShardHandlerFactory.getParameter Setting connTimeout to: 0
[junit4:junit4]   2> 2101 T3276 oashc.HttpShardHandlerFactory.getParameter Setting maxConnectionsPerHost to: 20
[junit4:junit4]   2> 2102 T3276 oashc.HttpShardHandlerFactory.getParameter Setting corePoolSize to: 0
[junit4:junit4]   2> 2102 T3276 oashc.HttpShardHandlerFactory.getParameter Setting maximumPoolSize to: 2147483647
[junit4:junit4]   2> 2102 T3276 oashc.HttpShardHandlerFactory.getParameter Setting maxThreadIdleTime to: 5
[junit4:junit4]   2> 2103 T3276 oashc.HttpShardHandlerFactory.getParameter Setting sizeOfQueue to: -1
[junit4:junit4]   2> 2103 T3276 oashc.HttpShardHandlerFactory.getParameter Setting fairnessPolicy to: false
[junit4:junit4]   2> 2104 T3276 oascsi.HttpClientUtil.createClient Creating new http client, config:maxConnectionsPerHost=20&maxConnections=10000&socketTimeout=0&connTimeout=0&retry=false
[junit4:junit4]   2> 2118 T3276 oasc.CoreMaps.allocateLazyCores Allocating transient cache for 2 transient cores
[junit4:junit4]   2> 2118 T3276 oasc.CoreContainer.load Registering Log Listener
[junit4:junit4]   2> 2122 T3289 oasc.CoreContainer.create Creating SolrCore 'core1' using instanceDir: /Users/jenkins/jenkins-slave/workspace/Lucene-Solr-4.x-MacOSX/solr/build/solr-core/test/J0/./org.apache.solr.core.TestSolrDiscoveryProperties/solrHome/core1
[junit4:junit4]   2> 2128 T3289 oasc.SolrResourceLoader.<init> new SolrResourceLoader for directory: '/Users/jenkins/jenkins-slave/workspace/Lucene-Solr-4.x-MacOSX/solr/build/solr-core/test/J0/./org.apache.solr.core.TestSolrDiscoveryProperties/solrHome/core1/'
[junit4:junit4]   2> 2210 T3289 oasc.SolrConfig.<init> Using Lucene MatchVersion: LUCENE_41
[junit4:junit4]   2> 2290 T3289 oasc.SolrConfig.<init> Loaded SolrConfig: solrconfig-minimal.xml
[junit4:junit4]   2> 2290 T3289 oass.IndexSchema.readSchema Reading Solr Schema
[junit4:junit4]   2> 2294 T3289 oass.IndexSchema.readSchema Schema name=tiny
[junit4:junit4]   2> 2331 T3289 oass.IndexSchema.readSchema unique key field: id
[junit4:junit4]   2> 2332 T3289 oasc.SolrCore.initDirectoryFactory org.apache.solr.core.MockDirectoryFactory
[junit4:junit4]   2> 2333 T3289 oasc.SolrCore.<init> [core1] Opening new SolrCore at /Users/jenkins/jenkins-slave/workspace/Lucene-Solr-4.x-MacOSX/solr/build/solr-core/test/J0/./org.apache.solr.core.TestSolrDiscoveryProperties/solrHome/core1/, dataDir=/Users/jenkins/jenkins-slave/workspace/Lucene-Solr-4.x-MacOSX/solr/build/solr-core/test/J0/./org.apache.solr.core.TestSolrDiscoveryProperties/solrHome/core1/stuffandnonsense/
[junit4:junit4]   2> 2333 T3289 oasc.JmxMonitoredMap.<init> JMX monitoring is enabled. Adding Solr mbeans to JMX Server: com.sun.jmx.mbeanserver.JmxMBeanServer@6e20f237
[junit4:junit4]   2> 2334 T3289 oasc.SolrCore.initDirectoryFactory org.apache.solr.core.MockDirectoryFactory
[junit4:junit4]   2> 2335 T3289 oasc.CachingDirectoryFactory.get return new directory for /Users/jenkins/jenkins-slave/workspace/Lucene-Solr-4.x-MacOSX/solr/build/solr-core/test/J0/./org.apache.solr.core.TestSolrDiscoveryProperties/solrHome/core1/stuffandnonsense
[junit4:junit4]   2> 2336 T3289 oasc.SolrCore.getNewIndexDir New index directory detected: old=null new=/Users/jenkins/jenkins-slave/workspace/Lucene-Solr-4.x-MacOSX/solr/build/solr-core/test/J0/./org.apache.solr.core.TestSolrDiscoveryProperties/solrHome/core1/stuffandnonsense/index/
[junit4:junit4]   2> 2336 T3289 oasc.SolrCore.initIndex WARNING [core1] Solr index directory '/Users/jenkins/jenkins-slave/workspace/Lucene-Solr-4.x-MacOSX/solr/build/solr-core/test/J0/./org.apache.solr.core.TestSolrDiscoveryProperties/solrHome/core1/stuffandnonsense/index' doesn't exist. Creating new index...
[junit4:junit4]   2> 2337 T3289 oasc.CachingDirectoryFactory.get return new directory for /Users/jenkins/jenkins-slave/workspace/Lucene-Solr-4.x-MacOSX/solr/build/solr-core/test/J0/./org.apache.solr.core.TestSolrDiscoveryProperties/solrHome/core1/stuffandnonsense/index
[junit4:junit4]   2> 2340 T3289 oasc.SolrDeletionPolicy.onCommit SolrDeletionPolicy.onCommit: commits:num=1
[junit4:junit4]   2> 		commit{dir=MockDirWrapper(org.apache.lucene.store.RAMDirectory@33b12ee3 lockFactory=org.apache.lucene.store.NativeFSLockFactory@280552b4),segFN=segments_1,generation=1,filenames=[segments_1]
[junit4:junit4]   2> 2340 T3289 oasc.SolrDeletionPolicy.updateCommits newest commit = 1[segments_1]
[junit4:junit4]   2> 2341 T3289 oasc.SolrCore.initWriters created json: solr.JSONResponseWriter
[junit4:junit4]   2> 2344 T3289 oasc.RequestHandlers.initHandlersFromConfig created /admin/: solr.admin.AdminHandlers
[junit4:junit4]   2> 2345 T3289 oasc.RequestHandlers.initHandlersFromConfig created /select: solr.SearchHandler
[junit4:junit4]   2> 2345 T3289 oasc.RequestHandlers.initHandlersFromConfig created /update: solr.UpdateRequestHandler
[junit4:junit4]   2> 2350 T3289 oashl.XMLLoader.init xsltCacheLifetimeSeconds=60
[junit4:junit4]   2> 2355 T3289 oass.SolrIndexSearcher.<init> Opening Searcher@17c532bb main
[junit4:junit4]   2> 2356 T3289 oasc.SolrCore.registerSearcher [core1] Registered new searcher Searcher@17c532bb main{StandardDirectoryReader(segments_1:1)}
[junit4:junit4]   2> 2356 T3289 oasu.CommitTracker.<init> Hard AutoCommit: disabled
[junit4:junit4]   2> 2357 T3289 oasu.CommitTracker.<init> Soft AutoCommit: disabled
[junit4:junit4]   2> 2362 T3289 oasc.CoreContainer.registerCore registering core: core1
[junit4:junit4]   2> 2363 T3276 oasc.CoreContainer.create Creating SolrCore 'core2' using instanceDir: /Users/jenkins/jenkins-slave/workspace/Lucene-Solr-4.x-MacOSX/solr/build/solr-core/test/J0/./org.apache.solr.core.TestSolrDiscoveryProperties/solrHome/core2
[junit4:junit4]   2> 2364 T3276 oasc.SolrResourceLoader.<init> new SolrResourceLoader for directory: '/Users/jenkins/jenkins-slave/workspace/Lucene-Solr-4.x-MacOSX/solr/build/solr-core/test/J0/./org.apache.solr.core.TestSolrDiscoveryProperties/solrHome/core2/'
[junit4:junit4]   2> 2452 T3276 oasc.SolrConfig.<init> Using Lucene MatchVersion: LUCENE_41
[junit4:junit4]   2> 2559 T3276 oasc.SolrConfig.<init> Loaded SolrConfig: solrconfig-minimal.xml
[junit4:junit4]   2> 2560 T3276 oass.IndexSchema.readSchema Reading Solr Schema
[junit4:junit4]   2> 2564 T3276 oass.IndexSchema.readSchema Schema name=tiny
[junit4:junit4]   2> 2590 T3276 oass.IndexSchema.readSchema unique key field: id
[junit4:junit4]   2> 2593 T3276 oasc.SolrCore.initDirectoryFactory org.apache.solr.core.MockDirectoryFactory
[junit4:junit4]   2> 2594 T3276 oasc.SolrCore.<init> [core2] Opening new SolrCore at /Users/jenkins/jenkins-slave/workspace/Lucene-Solr-4.x-MacOSX/solr/build/solr-core/test/J0/./org.apache.solr.core.TestSolrDiscoveryProperties/solrHome/core2/, dataDir=/Users/jenkins/jenkins-slave/workspace/Lucene-Solr-4.x-MacOSX/solr/build/solr-core/test/J0/./org.apache.solr.core.TestSolrDiscoveryProperties/solrHome/core2/stuffandnonsense/
[junit4:junit4]   2> 2594 T3276 oasc.JmxMonitoredMap.<init> JMX monitoring is enabled. Adding Solr mbeans to JMX Server: com.sun.jmx.mbeanserver.JmxMBeanServer@6e20f237
[junit4:junit4]   2> 2595 T3276 oasc.SolrCore.initDirectoryFactory org.apache.solr.core.MockDirectoryFactory
[junit4:junit4]   2> 2596 T3276 oasc.CachingDirectoryFactory.get return new directory for /Users/jenkins/jenkins-slave/workspace/Lucene-Solr-4.x-MacOSX/solr/build/solr-core/test/J0/./org.apache.solr.core.TestSolrDiscoveryProperties/solrHome/core2/stuffandnonsense
[junit4:junit4]   2> 2597 T3276 oasc.SolrCore.getNewIndexDir New index directory detected: old=null new=/Users/jenkins/jenkins-slave/workspace/Lucene-Solr-4.x-MacOSX/solr/build/solr-core/test/J0/./org.apache.solr.core.TestSolrDiscoveryProperties/solrHome/core2/stuffandnonsense/index/
[junit4:junit4]   2> 2616 T3276 oasc.SolrCore.initIndex WARNING [core2] Solr index directory '/Users/jenkins/jenkins-slave/workspace/Lucene-Solr-4.x-MacOSX/solr/build/solr-core/test/J0/./org.apache.solr.core.TestSolrDiscoveryProperties/solrHome/core2/stuffandnonsense/index' doesn't exist. Creating new index...
[junit4:junit4]   2> 2618 T3276 oasc.CachingDirectoryFactory.get return new directory for /Users/jenkins/jenkins-slave/workspace/Lucene-Solr-4.x-MacOSX/solr/build/solr-core/test/J0/./org.apache.solr.core.TestSolrDiscoveryProperties/solrHome/core2/stuffandnonsense/index
[junit4:junit4]   2> 2621 T3276 oasc.SolrDeletionPolicy.onCommit SolrDeletionPolicy.onCommit: commits:num=1
[junit4:junit4]   2> 		commit{dir=MockDirWrapper(org.apache.lucene.store.RAMDirectory@6ab8b90b lockFactory=org.apache.lucene.store.NativeFSLockFactory@4a68ed51),segFN=segments_1,generation=1,filenames=[segments_1]
[junit4:junit4]   2> 2622 T3276 oasc.SolrDeletionPolicy.updateCommits newest commit = 1[segments_1]
[junit4:junit4]   2> 2623 T3276 oasc.SolrCore.initWriters created json: solr.JSONResponseWriter
[junit4:junit4]   2> 2626 T3276 oasc.RequestHandlers.initHandlersFromConfig created /admin/: solr.admin.AdminHandlers
[junit4:junit4]   2> 2627 T3276 oasc.RequestHandlers.initHandlersFromConfig created /select: solr.SearchHandler
[junit4:junit4]   2> 2628 T3276 oasc.RequestHandlers.initHandlersFromConfig created /update: solr.UpdateRequestHandler
[junit4:junit4]   2> 2633 T3276 oashl.XMLLoader.init xsltCacheLifetimeSeconds=60
[junit4:junit4]   2> 2661 T3276 oass.SolrIndexSearcher.<init> Opening Searcher@58645c47 main
[junit4:junit4]   2> 2663 T3276 oasc.SolrCore.registerSearcher [core2] Registered new searcher Searcher@58645c47 main{StandardDirectoryReader(segments_1:1)}
[junit4:junit4]   2> 2663 T3276 oasu.CommitTracker.<init> Hard AutoCommit: disabled
[junit4:junit4]   2> 2664 T3276 oasu.CommitTracker.<init> Soft AutoCommit: disabled
[junit4:junit4]   2> 2670 T3276 oasc.CoreContainer.registerCore registering core: core2
[junit4:junit4]   2> 6358 T2030 oasc.OverseerCollectionProcessor.run WARNING Overseer cannot talk to ZK
[junit4:junit4]   2> 10509 T2034 oasc.OverseerCollectionProcessor.run WARNING Overseer cannot talk to ZK
[junit4:junit4]   2> 13933 T2051 oasc.OverseerCollectionProcessor.run WARNING Overseer cannot talk to ZK
[junit4:junit4]   2> 17353 T2068 oasc.OverseerCollectionProcessor.run WARNING Overseer cannot talk to ZK
[junit4:junit4]   2> 22290 T2083 oasc.OverseerCollectionProcessor.run WARNING Overseer cannot talk to ZK
[junit4:junit4]   2> 48711 T2355 oasc.OverseerCollectionProcessor.run WARNING Overseer cannot talk to ZK
[junit4:junit4]   2> 7200120 T3275 ccr.ThreadLeakControl$2.evaluate WARNING Suite execution timed out: org.apache.solr.core.TestSolrDiscoveryProperties
[junit4:junit4]   2> 	==== jstack at approximately timeout time ====
[junit4:junit4]   2> 	"searcherExecutor-2216-thread-1" ID=3292 WAITING on java.util.concurrent.locks.AbstractQueuedSynchronizer$ConditionObject@18bb6eb4
[junit4:junit4]   2> 		at sun.misc.Unsafe.park(Native Method)
[junit4:junit4]   2> 		- waiting on java.util.concurrent.locks.AbstractQueuedSynchronizer$ConditionObject@18bb6eb4
[junit4:junit4]   2> 		at java.util.concurrent.locks.LockSupport.park(LockSupport.java:156)
[junit4:junit4]   2> 		at java.util.concurrent.locks.AbstractQueuedSynchronizer$ConditionObject.await(AbstractQueuedSynchronizer.java:1987)
[junit4:junit4]   2> 		at java.util.concurrent.LinkedBlockingQueue.take(LinkedBlockingQueue.java:399)
[junit4:junit4]   2> 		at java.util.concurrent.ThreadPoolExecutor.getTask(ThreadPoolExecutor.java:957)
[junit4:junit4]   2> 		at java.util.concurrent.ThreadPoolExecutor$Worker.run(ThreadPoolExecutor.java:917)
[junit4:junit4]   2> 		at java.lang.Thread.run(Thread.java:680)
[junit4:junit4]   2> 	
[junit4:junit4]   2> 	"Thread-998" ID=3291 WAITING on java.lang.Object@3960f81b
[junit4:junit4]   2> 		at java.lang.Object.wait(Native Method)
[junit4:junit4]   2> 		- waiting on java.lang.Object@3960f81b
[junit4:junit4]   2> 		at java.lang.Object.wait(Object.java:485)
[junit4:junit4]   2> 		at org.apache.solr.core.CloserThread.run(CoreContainer.java:1920)
[junit4:junit4]   2> 	
[junit4:junit4]   2> 	"searcherExecutor-2213-thread-1" ID=3290 WAITING on java.util.concurrent.locks.AbstractQueuedSynchronizer$ConditionObject@d40d20b
[junit4:junit4]   2> 		at sun.misc.Unsafe.park(Native Method)
[junit4:junit4]   2> 		- waiting on java.util.concurrent.locks.AbstractQueuedSynchronizer$ConditionObject@d40d20b
[junit4:junit4]   2> 		at java.util.concurrent.locks.LockSupport.park(LockSupport.java:156)
[junit4:junit4]   2> 		at java.util.concurrent.locks.AbstractQueuedSynchronizer$ConditionObject.await(AbstractQueuedSynchronizer.java:1987)
[junit4:junit4]   2> 		at java.util.concurrent.LinkedBlockingQueue.take(LinkedBlockingQueue.java:399)
[junit4:junit4]   2> 		at java.util.concurrent.ThreadPoolExecutor.getTask(ThreadPoolExecutor.java:957)
[junit4:junit4]   2> 		at java.util.concurrent.ThreadPoolExecutor$Worker.run(ThreadPoolExecutor.java:917)
[junit4:junit4]   2> 		at java.lang.Thread.run(Thread.java:680)
[junit4:junit4]   2> 	
[junit4:junit4]   2> 	"searcherExecutor-2190-thread-1" ID=3280 WAITING on java.util.concurrent.locks.AbstractQueuedSynchronizer$ConditionObject@1a9dd6f9
[junit4:junit4]   2> 		at sun.misc.Unsafe.park(Native Method)
[junit4:junit4]   2> 		- waiting on java.util.concurrent.locks.AbstractQueuedSynchronizer$ConditionObject@1a9dd6f9
[junit4:junit4]   2> 		at java.util.concurrent.locks.LockSupport.park(LockSupport.java:156)
[junit4:junit4]   2> 		at java.util.concurrent.locks.AbstractQueuedSynchronizer$ConditionObject.await(AbstractQueuedSynchronizer.java:1987)
[junit4:junit4]   2> 		at java.util.concurrent.LinkedBlockingQueue.take(LinkedBlockingQueue.java:399)
[junit4:junit4]   2> 		at java.util.concurrent.ThreadPoolExecutor.getTask(ThreadPoolExecutor.java:957)
[junit4:junit4]   2> 		at java.util.concurrent.ThreadPoolExecutor$Worker.run(ThreadPoolExecutor.java:917)
[junit4:junit4]   2> 		at java.lang.Thread.run(Thread.java:680)
[junit4:junit4]   2> 	
[junit4:junit4]   2> 	"TEST-TestSolrDiscoveryProperties.testPropertiesFile-seed#[908B1657BC25F243]" ID=3276 WAITING on java.lang.Object@3960f81b
[junit4:junit4]   2> 		at java.lang.Object.wait(Native Method)
[junit4:junit4]   2> 		- waiting on java.lang.Object@3960f81b
[junit4:junit4]   2> 		at java.lang.Object.wait(Object.java:485)
[junit4:junit4]   2> 		at org.apache.solr.core.CoreMaps.waitAddPendingCoreOps(CoreContainer.java:1744)
[junit4:junit4]   2> 		at org.apache.solr.core.CoreContainer.getCore(CoreContainer.java:1152)
[junit4:junit4]   2> 		at org.apache.solr.core.TestSolrDiscoveryProperties.testPropertiesFile(TestSolrDiscoveryProperties.java:179)
[junit4:junit4]   2> 		at sun.reflect.NativeMethodAccessorImpl.invoke0(Native Method)
[junit4:junit4]   2> 		at sun.reflect.NativeMethodAccessorImpl.invoke(NativeMethodAccessorImpl.java:39)
[junit4:junit4]   2> 		at sun.reflect.DelegatingMethodAccessorImpl.invoke(DelegatingMethodAccessorImpl.java:25)
[junit4:junit4]   2> 		at java.lang.reflect.Method.invoke(Method.java:597)
[junit4:junit4]   2> 		at com.carrotsearch.randomizedtesting.RandomizedRunner.invoke(RandomizedRunner.java:1559)
[junit4:junit4]   2> 		at com.carrotsearch.randomizedtesting.RandomizedRunner.access$600(RandomizedRunner.java:79)
[junit4:junit4]   2> 		at com.carrotsearch.randomizedtesting.RandomizedRunner$6.evaluate(RandomizedRunner.java:737)
[junit4:junit4]   2> 		at com.carrotsearch.randomizedtesting.RandomizedRunner$7.evaluate(RandomizedRunner.java:773)
[junit4:junit4]   2> 		at com.carrotsearch.randomizedtesting.RandomizedRunner$8.evaluate(RandomizedRunner.java:787)
[junit4:junit4]   2> 		at com.carrotsearch.randomizedtesting.rules.SystemPropertiesRestoreRule$1.evaluate(SystemPropertiesRestoreRule.java:53)
[junit4:junit4]   2> 		at org.apache.lucene.util.TestRuleSetupTeardownChained$1.evaluate(TestRuleSetupTeardownChained.java:50)
[junit4:junit4]   2> 		at org.apache.lucene.util.TestRuleFieldCacheSanity$1.evaluate(TestRuleFieldCacheSanity.java:51)
[junit4:junit4]   2> 		at org.apache.lucene.util.AbstractBeforeAfterRule$1.evaluate(AbstractBeforeAfterRule.java:46)
[junit4:junit4]   2> 		at com.carrotsearch.randomizedtesting.rules.SystemPropertiesInvariantRule$1.evaluate(SystemPropertiesInvariantRule.java:55)
[junit4:junit4]   2> 		at org.apache.lucene.util.TestRuleThreadAndTestName$1.evaluate(TestRuleThreadAndTestName.java:49)
[junit4:junit4]   2> 		at org.apache.lucene.util.TestRuleIgnoreAfterMaxFailures$1.evaluate(TestRuleIgnoreAfterMaxFailures.java:70)
[junit4:junit4]   2> 		at org.apache.lucene.util.TestRuleMarkFailure$1.evaluate(TestRuleMarkFailure.java:48)
[junit4:junit4]   2> 		at com.carrotsearch.randomizedtesting.rules.StatementAdapter.evaluate(StatementAdapter.java:36)
[junit4:junit4]   2> 		at com.carrotsearch.randomizedtesting.ThreadLeakControl$StatementRunner.run(ThreadLeakControl.java:358)
[junit4:junit4]   2> 		at com.carrotsearch.randomizedtesting.ThreadLeakControl.forkTimeoutingTask(ThreadLeakControl.java:782)
[junit4:junit4]   2> 		at com.carrotsearch.randomizedtesting.ThreadLeakControl$3.evaluate(ThreadLeakControl.java:442)
[junit4:junit4]   2> 		at com.carrotsearch.randomizedtesting.RandomizedRunner.runSingleTest(RandomizedRunner.java:746)
[junit4:junit4]   2> 		at com.carrotsearch.randomizedtesting.RandomizedRunner$3.evaluate(RandomizedRunner.java:648)
[junit4:junit4]   2> 		at com.carrotsearch.randomizedtesting.RandomizedRunner$4.evaluate(RandomizedRunner.java:682)
[junit4:junit4]   2> 		at com.carrotsearch.randomizedtesting.RandomizedRunner$5.evaluate(RandomizedRunner.java:693)
[junit4:junit4]   2> 		at com.carrotsearch.randomizedtesting.rules.StatementAdapter.evaluate(StatementAdapter.java:36)
[junit4:junit4]   2> 		at com.carrotsearch.randomizedtesting.rules.SystemPropertiesRestoreRule$1.evaluate(SystemPropertiesRestoreRule.java:53)
[junit4:junit4]   2> 		at org.apache.lucene.util.AbstractBeforeAfterRule$1.evaluate(AbstractBeforeAfterRule.java:46)
[junit4:junit4]   2> 		at org.apache.lucene.util.TestRuleStoreClassName$1.evaluate(TestRuleStoreClassName.java:42)
[junit4:junit4]   2> 		at com.carrotsearch.randomizedtesting.rules.SystemPropertiesInvariantRule$1.evaluate(SystemPropertiesInvariantRule.java:55)
[junit4:junit4]   2> 		at com.carrotsearch.randomizedtesting.rules.NoShadowingOrOverridesOnMethodsRule$1.evaluate(NoShadowingOrOverridesOnMethodsRule.java:39)
[junit4:junit4]   2> 		at com.carrotsearch.randomizedtesting.rules.NoShadowingOrOverridesOnMethodsRule$1.evaluate(NoShadowingOrOverridesOnMethodsRule.java:39)
[junit4:junit4]   2> 		at com.carrotsearch.randomizedtesting.rules.StatementAdapter.evaluate(StatementAdapter.java:36)
[junit4:junit4]   2> 		at org.apache.lucene.util.TestRuleAssertionsRequired$1.evaluate(TestRuleAssertionsRequired.java:43)
[junit4:junit4]   2> 		at org.apache.lucene.util.TestRuleMarkFailure$1.evaluate(TestRuleMarkFailure.java:48)
[junit4:junit4]   2> 		at org.apache.lucene.util.TestRuleIgnoreAfterMaxFailures$1.evaluate(TestRuleIgnoreAfterMaxFailures.java:70)
[junit4:junit4]   2> 		at org.apache.lucene.util.TestRuleIgnoreTestSuites$1.evaluate(TestRuleIgnoreTestSuites.java:55)
[junit4:junit4]   2> 		at com.carrotsearch.randomizedtesting.rules.StatementAdapter.evaluate(StatementAdapter.java:36)
[junit4:junit4]   2> 		at com.carrotsearch.randomizedtesting.ThreadLeakControl$StatementRunner.run(ThreadLeakControl.java:358)
[junit4:junit4]   2> 		at java.lang.Thread.run(Thread.java:680)
[junit4:junit4]   2> 	
[junit4:junit4]   2> 	"SUITE-TestSolrDiscoveryProperties-seed#[908B1657BC25F243]" ID=3275 RUNNABLE
[junit4:junit4]   2> 		at sun.management.ThreadImpl.dumpThreads0(Native Method)
[junit4:junit4]   2> 		at sun.management.ThreadImpl.dumpAllThreads(ThreadImpl.java:433)
[junit4:junit4]   2> 		at com.carrotsearch.randomizedtesting.ThreadLeakControl.formatThreadStacksFull(ThreadLeakControl.java:655)
[junit4:junit4]   2> 		at com.carrotsearch.randomizedtesting.ThreadLeakControl.access$800(ThreadLeakControl.java:60)
[junit4:junit4]   2> 		at com.carrotsearch.randomizedtesting.ThreadLeakControl$2.evaluate(ThreadLeakControl.java:396)
[junit4:junit4]   2> 		- locked java.lang.Object@708c8315
[junit4:junit4]   2> 		at com.carrotsearch.randomizedtesting.RandomizedRunner.runSuite(RandomizedRunner.java:556)
[junit4:junit4]   2> 		at com.carrotsearch.randomizedtesting.RandomizedRunner.access$200(RandomizedRunner.java:79)
[junit4:junit4]   2> 		at com.carrotsearch.randomizedtesting.RandomizedRunner$1.run(RandomizedRunner.java:492)
[junit4:junit4]   2> 	
[junit4:junit4]   2> 	"Signal Dispatcher" ID=6 RUNNABLE
[junit4:junit4]   2> 	
[junit4:junit4]   2> 	"Finalizer" ID=3 WAITING on java.lang.ref.ReferenceQueue$Lock@18f2116d
[junit4:junit4]   2> 		at java.lang.Object.wait(Native Method)
[junit4:junit4]   2> 		- waiting on java.lang.ref.ReferenceQueue$Lock@18f2116d
[junit4:junit4]   2> 		at java.lang.ref.ReferenceQueue.remove(ReferenceQueue.java:118)
[junit4:junit4]   2> 		at java.lang.ref.ReferenceQueue.remove(ReferenceQueue.java:134)
[junit4:junit4]   2> 		at java.lang.ref.Finalizer$FinalizerThread.run(Finalizer.java:159)
[junit4:junit4]   2> 	
[junit4:junit4]   2> 	"Reference Handler" ID=2 WAITING on java.lang.ref.Reference$Lock@3c5617e6
[junit4:junit4]   2> 		at java.lang.Object.wait(Native Method)
[junit4:junit4]   2> 		- waiting on java.lang.ref.Reference$Lock@3c5617e6
[junit4:junit4]   2> 		at java.lang.Object.wait(Object.java:485)
[junit4:junit4]   2> 		at java.lang.ref.Reference$ReferenceHandler.run(Reference.java:116)
[junit4:junit4]   2> 	
[junit4:junit4]   2> 	"main" ID=1 WAITING on com.carrotsearch.randomizedtesting.RandomizedRunner$1@7ea732c8
[junit4:junit4]   2> 		at java.lang.Object.wait(Native Method)
[junit4:junit4]   2> 		- waiting on com.carrotsearch.randomizedtesting.RandomizedRunner$1@7ea732c8
[junit4:junit4]   2> 		at java.lang.Thread.join(Thread.java:1210)
[junit4:junit4]   2> 		at java.lang.Thread.join(Thread.java:1263)
[junit4:junit4]   2> 		at com.carrotsearch.randomizedtesting.RandomizedRunner.runSuite(RandomizedRunner.java:502)
[junit4:junit4]   2> 		at com.carrotsearch.randomizedtesting.RandomizedRunner.run(RandomizedRunner.java:399)
[junit4:junit4]   2> 		at com.carrotsearch.ant.tasks.junit4.slave.SlaveMain.execute(SlaveMain.java:180)
[junit4:junit4]   2> 		at com.carrotsearch.ant.tasks.junit4.slave.SlaveMain.main(SlaveMain.java:275)
[junit4:junit4]   2> 		at com.carrotsearch.ant.tasks.junit4.slave.SlaveMainSafe.main(SlaveMainSafe.java:12)
[junit4:junit4]   2> 	
[junit4:junit4]   2> 	^^==============================================
[junit4:junit4]   2> 	
[junit4:junit4]   2> NOTE: reproduce with: ant test  -Dtestcase=TestSolrDiscoveryProperties -Dtests.method=testPropertiesFile -Dtests.seed=908B1657BC25F243 -Dtests.slow=true -Dtests.locale=ar_MA -Dtests.timezone=Asia/Kamchatka -Dtests.file.encoding=US-ASCII
[junit4:junit4] ERROR   7198s | TestSolrDiscoveryProperties.testPropertiesFile <<<
[junit4:junit4]    > Throwable #1: java.lang.Exception: Test abandoned because suite timeout was reached.
[junit4:junit4]    > 	at __randomizedtesting.SeedInfo.seed([908B1657BC25F243]:0)
[junit4:junit4]   2> 7200135 T3275 ccr.ThreadLeakControl.checkThreadLeaks WARNING Will linger awaiting termination of 5 leaked thread(s).
[junit4:junit4]   2> 7220179 T3275 ccr.ThreadLeakControl.checkThreadLeaks SEVERE 5 threads leaked from SUITE scope at org.apache.solr.core.TestSolrDiscoveryProperties: 
[junit4:junit4]   2> 	   1) Thread[id=3292, name=searcherExecutor-2216-thread-1, state=WAITING, group=TGRP-TestSolrDiscoveryProperties]
[junit4:junit4]   2> 	        at sun.misc.Unsafe.park(Native Method)
[junit4:junit4]   2> 	        at java.util.concurrent.locks.LockSupport.park(LockSupport.java:156)
[junit4:junit4]   2> 	        at java.util.concurrent.locks.AbstractQueuedSynchronizer$ConditionObject.await(AbstractQueuedSynchronizer.java:1987)
[junit4:junit4]   2> 	        at java.util.concurrent.LinkedBlockingQueue.take(LinkedBlockingQueue.java:399)
[junit4:junit4]   2> 	        at java.util.concurrent.ThreadPoolExecutor.getTask(ThreadPoolExecutor.java:957)
[junit4:junit4]   2> 	        at java.util.concurrent.ThreadPoolExecutor$Worker.run(ThreadPoolExecutor.java:917)
[junit4:junit4]   2> 	        at java.lang.Thread.run(Thread.java:680)
[junit4:junit4]   2> 	   2) Thread[id=3280, name=searcherExecutor-2190-thread-1, state=WAITING, group=TGRP-TestSolrDiscoveryProperties]
[junit4:junit4]   2> 	        at sun.misc.Unsafe.park(Native Method)
[junit4:junit4]   2> 	        at java.util.concurrent.locks.LockSupport.park(LockSupport.java:156)
[junit4:junit4]   2> 	        at java.util.concurrent.locks.AbstractQueuedSynchronizer$ConditionObject.await(AbstractQueuedSynchronizer.java:1987)
[junit4:junit4]   2> 	        at java.util.concurrent.LinkedBlockingQueue.take(LinkedBlockingQueue.java:399)
[junit4:junit4]   2> 	        at java.util.concurrent.ThreadPoolExecutor.getTask(ThreadPoolExecutor.java:957)
[junit4:junit4]   2> 	        at java.util.concurrent.ThreadPoolExecutor$Worker.run(ThreadPoolExecutor.java:917)
[junit4:junit4]   2> 	        at java.lang.Thread.run(Thread.java:680)
[junit4:junit4]   2> 	   3) Thread[id=3290, name=searcherExecutor-2213-thread-1, state=WAITING, group=TGRP-TestSolrDiscoveryProperties]
[junit4:junit4]   2> 	        at sun.misc.Unsafe.park(Native Method)
[junit4:junit4]   2> 	        at java.util.concurrent.locks.LockSupport.park(LockSupport.java:156)
[junit4:junit4]   2> 	        at java.util.concurrent.locks.AbstractQueuedSynchronizer$ConditionObject.await(AbstractQueuedSynchronizer.java:1987)
[junit4:junit4]   2> 	        at java.util.concurrent.LinkedBlockingQueue.take(LinkedBlockingQueue.java:399)
[junit4:junit4]   2> 	        at java.util.concurrent.ThreadPoolExecutor.getTask(ThreadPoolExecutor.java:957)
[junit4:junit4]   2> 	        at java.util.concurrent.ThreadPoolExecutor$Worker.run(ThreadPoolExecutor.java:917)
[junit4:junit4]   2> 	        at java.lang.Thread.run(Thread.java:680)
[junit4:junit4]   2> 	   4) Thread[id=3291, name=Thread-998, state=WAITING, group=TGRP-TestSolrDiscoveryProperties]
[junit4:junit4]   2> 	        at java.lang.Object.wait(Native Method)
[junit4:junit4]   2> 	        at java.lang.Object.wait(Object.java:485)
[junit4:junit4]   2> 	        at org.apache.solr.core.CloserThread.run(CoreContainer.java:1920)
[junit4:junit4]   2> 	   5) Thread[id=3276, name=TEST-TestSolrDiscoveryProperties.testPropertiesFile-seed#[908B1657BC25F243], state=WAITING, group=TGRP-TestSolrDiscoveryProperties]
[junit4:junit4]   2> 	        at java.lang.Object.wait(Native Method)
[junit4:junit4]   2> 	        at java.lang.Object.wait(Object.java:485)
[junit4:junit4]   2> 	        at org.apache.solr.core.CoreMaps.waitAddPendingCoreOps(CoreContainer.java:1744)
[junit4:junit4]   2> 	        at org.apache.solr.core.CoreContainer.getCore(CoreContainer.java:1152)
[junit4:junit4]   2> 	        at org.apache.solr.core.TestSolrDiscoveryProperties.testPropertiesFile(TestSolrDiscoveryProperties.java:179)
[junit4:junit4]   2> 	        at sun.reflect.NativeMethodAccessorImpl.invoke0(Native Method)
[junit4:junit4]   2> 	        at sun.reflect.NativeMethodAccessorImpl.invoke(NativeMethodAccessorImpl.java:39)
[junit4:junit4]   2> 	        at sun.reflect.DelegatingMethodAccessorImpl.invoke(DelegatingMethodAccessorImpl.java:25)
[junit4:junit4]   2> 	        at java.lang.reflect.Method.invoke(Method.java:597)
[junit4:junit4]   2> 	        at com.carrotsearch.randomizedtesting.RandomizedRunner.invoke(RandomizedRunner.java:1559)
[junit4:junit4]   2> 	        at com.carrotsearch.randomizedtesting.RandomizedRunner.access$600(RandomizedRunner.java:79)
[junit4:junit4]   2> 	        at com.carrotsearch.randomizedtesting.RandomizedRunner$6.evaluate(RandomizedRunner.java:737)
[junit4:junit4]   2> 	        at com.carrotsearch.randomizedtesting.RandomizedRunner$7.evaluate(RandomizedRunner.java:773)
[junit4:junit4]   2> 	        at com.carrotsearch.randomizedtesting.RandomizedRunner$8.evaluate(RandomizedRunner.java:787)
[junit4:junit4]   2> 	        at com.carrotsearch.randomizedtesting.rules.SystemPropertiesRestoreRule$1.evaluate(SystemPropertiesRestoreRule.java:53)
[junit4:junit4]   2> 	        at org.apache.lucene.util.TestRuleSetupTeardownChained$1.evaluate(TestRuleSetupTeardownChained.java:50)
[junit4:junit4]   2> 	        at org.apache.lucene.util.TestRuleFieldCacheSanity$1.evaluate(TestRuleFieldCacheSanity.java:51)
[junit4:junit4]   2> 	        at org.apache.lucene.util.AbstractBeforeAfterRule$1.evaluate(AbstractBeforeAfterRule.java:46)
[junit4:junit4]   2> 	        at com.carrotsearch.randomizedtesting.rules.SystemPropertiesInvariantRule$1.evaluate(SystemPropertiesInvariantRule.java:55)
[junit4:junit4]   2> 	        at org.apache.lucene.util.TestRuleThreadAndTestName$1.evaluate(TestRuleThreadAndTestName.java:49)
[junit4:junit4]   2> 	        at org.apache.lucene.util.TestRuleIgnoreAfterMaxFailures$1.evaluate(TestRuleIgnoreAfterMaxFailures.java:70)
[junit4:junit4]   2> 	        at org.apache.lucene.util.TestRuleMarkFailure$1.evaluate(TestRuleMarkFailure.java:48)
[junit4:junit4]   2> 	        at com.carrotsearch.randomizedtesting.rules.StatementAdapter.evaluate(StatementAdapter.java:36)
[junit4:junit4]   2> 	        at com.carrotsearch.randomizedtesting.ThreadLeakControl$StatementRunner.run(ThreadLeakControl.java:358)
[junit4:junit4]   2> 	        at com.carrotsearch.randomizedtesting.ThreadLeakControl.forkTimeoutingTask(ThreadLeakControl.java:782)
[junit4:junit4]   2> 	        at com.carrotsearch.randomizedtesting.ThreadLeakControl$3.evaluate(ThreadLeakControl.java:442)
[junit4:junit4]   2> 	        at com.carrotsearch.randomizedtesting.RandomizedRunner.runSingleTest(RandomizedRunner.java:746)
[junit4:junit4]   2> 	        at com.carrotsearch.randomizedtesting.RandomizedRunner$3.evaluate(RandomizedRunner.java:648)
[junit4:junit4]   2> 	        at com.carrotsearch.randomizedtesting.RandomizedRunner$4.evaluate(RandomizedRunner.java:682)
[junit4:junit4]   2> 	        at com.carrotsearch.randomizedtesting.RandomizedRunner$5.evaluate(RandomizedRunner.java:693)
[junit4:junit4]   2> 	        at com.carrotsearch.randomizedtesting.rules.StatementAdapter.evaluate(StatementAdapter.java:36)
[junit4:junit4]   2> 	        at com.carrotsearch.randomizedtesting.rules.SystemPropertiesRestoreRule$1.evaluate(SystemPropertiesRestoreRule.java:53)
[junit4:junit4]   2> 	        at org.apache.lucene.util.AbstractBeforeAfterRule$1.evaluate(AbstractBeforeAfterRule.java:46)
[junit4:junit4]   2> 	        at org.apache.lucene.util.TestRuleStoreClassName$1.evaluate(TestRuleStoreClassName.java:42)
[junit4:junit4]   2> 	        at com.carrotsearch.randomizedtesting.rules.SystemPropertiesInvariantRule$1.evaluate(SystemPropertiesInvariantRule.java:55)
[junit4:junit4]   2> 	        at com.carrotsearch.randomizedtesting.rules.NoShadowingOrOverridesOnMethodsRule$1.evaluate(NoShadowingOrOverridesOnMethodsRule.java:39)
[junit4:junit4]   2> 	        at com.carrotsearch.randomizedtesting.rules.NoShadowingOrOverridesOnMethodsRule$1.evaluate(NoShadowingOrOverridesOnMethodsRule.java:39)
[junit4:junit4]   2> 	        at com.carrotsearch.randomizedtesting.rules.StatementAdapter.evaluate(StatementAdapter.java:36)
[junit4:junit4]   2> 	        at org.apache.lucene.util.TestRuleAssertionsRequired$1.evaluate(TestRuleAssertionsRequired.java:43)
[junit4:junit4]   2> 	        at org.apache.lucene.util.TestRuleMarkFailure$1.evaluate(TestRuleMarkFailure.java:48)
[junit4:junit4]   2> 	        at org.apache.lucene.util.TestRuleIgnoreAfterMaxFailures$1.evaluate(TestRuleIgnoreAfterMaxFailures.java:70)
[junit4:junit4]   2> 	        at org.apache.lucene.util.TestRuleIgnoreTestSuites$1.evaluate(TestRuleIgnoreTestSuites.java:55)
[junit4:junit4]   2> 	        at com.carrotsearch.randomizedtesting.rules.StatementAdapter.evaluate(StatementAdapter.java:36)
[junit4:junit4]   2> 	        at com.carrotsearch.randomizedtesting.ThreadLeakControl$StatementRunner.run(ThreadLeakControl.java:358)
[junit4:junit4]   2> 	        at java.lang.Thread.run(Thread.java:680)
[junit4:junit4]   2> 7220182 T3275 ccr.ThreadLeakControl.tryToInterruptAll Starting to interrupt leaked threads:
[junit4:junit4]   2> 	   1) Thread[id=3292, name=searcherExecutor-2216-thread-1, state=WAITING, group=TGRP-TestSolrDiscoveryProperties]
[junit4:junit4]   2> 	   2) Thread[id=3280, name=searcherExecutor-2190-thread-1, state=WAITING, group=TGRP-TestSolrDiscoveryProperties]
[junit4:junit4]   2> 	   3) Thread[id=3290, name=searcherExecutor-2213-thread-1, state=WAITING, group=TGRP-TestSolrDiscoveryProperties]
[junit4:junit4]   2> 	   4) Thread[id=3291, name=Thread-998, state=WAITING, group=TGRP-TestSolrDiscoveryProperties]
[junit4:junit4]   2> 	   5) Thread[id=3276, name=TEST-TestSolrDiscoveryProperties.testPropertiesFile-seed#[908B1657BC25F243], state=WAITING, group=TGRP-TestSolrDiscoveryProperties]
[junit4:junit4]   2> 7220183 T3276 oasc.CoreContainer.create Creating SolrCore 'lazy1' using instanceDir: /Users/jenkins/jenkins-slave/workspace/Lucene-Solr-4.x-MacOSX/solr/build/solr-core/test/J0/./org.apache.solr.core.TestSolrDiscoveryProperties/solrHome/lazy1
[junit4:junit4]   2> 7220184 T3276 oasc.SolrResourceLoader.<init> new SolrResourceLoader for directory: '/Users/jenkins/jenkins-slave/workspace/Lucene-Solr-4.x-MacOSX/solr/build/solr-core/test/J0/./org.apache.solr.core.TestSolrDiscoveryProperties/solrHome/lazy1/'
[junit4:junit4]   2> 7220258 T3276 oasc.SolrConfig.<init> Using Lucene MatchVersion: LUCENE_41
[junit4:junit4]   2> 7220314 T3276 oasc.SolrConfig.<init> Loaded SolrConfig: solrconfig-minimal.xml
[junit4:junit4]   2> 7220315 T3276 oass.IndexSchema.readSchema Reading Solr Schema
[junit4:junit4]   2> 7220319 T3276 oass.IndexSchema.readSchema Schema name=tiny
[junit4:junit4]   2> 7220360 T3276 oass.IndexSchema.readSchema unique key field: id
[junit4:junit4]   2> 7220362 T3276 oasc.SolrCore.initDirectoryFactory org.apache.solr.core.MockDirectoryFactory
[junit4:junit4]   2> 7220362 T3276 oasc.SolrCore.<init> [lazy1] Opening new SolrCore at /Users/jenkins/jenkins-slave/workspace/Lucene-Solr-4.x-MacOSX/solr/build/solr-core/test/J0/./org.apache.solr.core.TestSolrDiscoveryProperties/solrHome/lazy1/, dataDir=/Users/jenkins/jenkins-slave/workspace/Lucene-Solr-4.x-MacOSX/solr/build/solr-core/test/J0/./org.apache.solr.core.TestSolrDiscoveryProperties/solrHome/lazy1/stuffandnonsense/
[junit4:junit4]   2> 7220363 T3276 oasc.JmxMonitoredMap.<init> JMX monitoring is enabled. Adding Solr mbeans to JMX Server: com.sun.jmx.mbeanserver.JmxMBeanServer@6e20f237
[junit4:junit4]   2> 7220364 T3276 oasc.SolrCore.initDirectoryFactory org.apache.solr.core.MockDirectoryFactory
[junit4:junit4]   2> 7220365 T3276 oasc.CachingDirectoryFactory.get return new directory for /Users/jenkins/jenkins-slave/workspace/Lucene-Solr-4.x-MacOSX/solr/build/solr-core/test/J0/./org.apache.solr.core.TestSolrDiscoveryProperties/solrHome/lazy1/stuffandnonsense
[junit4:junit4]   2> 7220365 T3276 oasc.SolrCore.getNewIndexDir New index directory detected: old=null new=/Users/jenkins/jenkins-slave/workspace/Lucene-Solr-4.x-MacOSX/solr/build/solr-core/test/J0/./org.apache.solr.core.TestSolrDiscoveryProperties/solrHome/lazy1/stuffandnonsense/index/
[junit4:junit4]   2> 7220366 T3276 oasc.SolrCore.initIndex WARNING [lazy1] Solr index directory '/Users/jenkins/jenkins-slave/workspace/Lucene-Solr-4.x-MacOSX/solr/build/solr-core/test/J0/./org.apache.solr.core.TestSolrDiscoveryProperties/solrHome/lazy1/stuffandnonsense/index' doesn't exist. Creating new index...
[junit4:junit4]   2> 7220367 T3276 oasc.CachingDirectoryFactory.get return new directory for /Users/jenkins/jenkins-slave/workspace/Lucene-Solr-4.x-MacOSX/solr/build/solr-core/test/J0/./org.apache.solr.core.TestSolrDiscoveryProperties/solrHome/lazy1/stuffandnonsense/index
[junit4:junit4]   2> 7220371 T3276 oasc.SolrDeletionPolicy.onCommit SolrDeletionPolicy.onCommit: commits:num=1
[junit4:junit4]   2> 		commit{dir=MockDirWrapper(org.apache.lucene.store.RAMDirectory@330cfe88 lockFactory=org.apache.lucene.store.NativeFSLockFactory@1ad221b2),segFN=segments_1,generation=1,filenames=[segments_1]
[junit4:junit4]   2> 7220372 T3276 oasc.SolrDeletionPolicy.updateCommits newest commit = 1[segments_1]
[junit4:junit4]   2> 7220373 T3276 oasc.SolrCore.initWriters created json: solr.JSONResponseWriter
[junit4:junit4]   2> 7220377 T3276 oasc.RequestHandlers.initHandlersFromConfig created /admin/: solr.admin.AdminHandlers
[junit4:junit4]   2> 7220381 T3276 oasc.RequestHandlers.initHandlersFromConfig created /select: solr.SearchHandler
[junit4:junit4]   2> 7220384 T3276 oasc.RequestHandlers.initHandlersFromConfig created /update: solr.UpdateRequestHandler
[junit4:junit4]   2> 7220390 T3276 oashl.XMLLoader.init xsltCacheLifetimeSeconds=60
[junit4:junit4]   2> 7220399 T3276 oass.SolrIndexSearcher.<init> Opening Searcher@705a6590 main
[junit4:junit4]   2> 7220402 T3276 oasc.SolrCore.registerSearcher [lazy1] Registered new searcher Searcher@705a6590 main{StandardDirectoryReader(segments_1:1)}
[junit4:junit4]   2> 7220402 T3276 oasu.CommitTracker.<init> Hard AutoCommit: disabled
[junit4:junit4]   2> 7220403 T3276 oasu.CommitTracker.<init> Soft AutoCommit: disabled
[junit4:junit4]   2> 7220415 T3276 oasc.CoreMaps.putTransientCore Opening transient core lazy1
[junit4:junit4]   2> 7220416 T3276 oasc.CoreContainer.registerCore registering core: lazy1
[junit4:junit4]   2> 7220417 T3276 oasc.CoreContainer.shutdown Shutting down CoreContainer instance=2047246913
[junit4:junit4]   2> 7220418 T3276 oasc.SolrCore.close [core1]  CLOSING SolrCore org.apache.solr.core.SolrCore@2295f70c
[junit4:junit4]   2> 7220426 T3276 oasu.DirectUpdateHandler2.close closing DirectUpdateHandler2{commits=0,autocommits=0,soft autocommits=0,optimizes=0,rollbacks=0,expungeDeletes=0,docsPending=0,adds=0,deletesById=0,deletesByQuery=0,errors=0,cumulative_adds=0,cumulative_deletesById=0,cumulative_deletesByQuery=0,cumulative_errors=0}
[junit4:junit4]   2> 7220427 T3276 oasu.SolrCoreState.decrefSolrCoreState Closing SolrCoreState
[junit4:junit4]   2> 7220427 T3276 oasu.DefaultSolrCoreState.closeIndexWriter SolrCoreState ref count has reached 0 - closing IndexWriter
[junit4:junit4]   2> 7220428 T3276 oasu.DefaultSolrCoreState.closeIndexWriter closing IndexWriter with IndexWriterCloser
[junit4:junit4]   2> 7220429 T3276 oasc.SolrCore.closeSearcher [core1] Closing main searcher on request.
[junit4:junit4]   2> 7220430 T3276 oasc.CachingDirectoryFactory.close Closing directory when closing factory: /Users/jenkins/jenkins-slave/workspace/Lucene-Solr-4.x-MacOSX/solr/build/solr-core/test/J0/./org.apache.solr.core.TestSolrDiscoveryProperties/solrHome/core1/stuffandnonsense
[junit4:junit4]   2> 7220430 T3276 oasc.CachingDirectoryFactory.closeDirectory Closing directory: /Users/jenkins/jenkins-slave/workspace/Lucene-Solr-4.x-MacOSX/solr/build/solr-core/test/J0/./org.apache.solr.core.TestSolrDiscoveryProperties/solrHome/core1/stuffandnonsense
[junit4:junit4]   2> 7220431 T3276 oasc.CachingDirectoryFactory.close Closing directory when closing factory: /Users/jenkins/jenkins-slave/workspace/Lucene-Solr-4.x-MacOSX/solr/build/solr-core/test/J0/./org.apache.solr.core.TestSolrDiscoveryProperties/solrHome/core1/stuffandnonsense/index
[junit4:junit4]   2> 7220431 T3276 oasc.CachingDirectoryFactory.closeDirectory Closing directory: /Users/jenkins/jenkins-slave/workspace/Lucene-Solr-4.x-MacOSX/solr/build/solr-core/test/J0/./org.apache.solr.core.TestSolrDiscoveryProperties/solrHome/core1/stuffandnonsense/index
[junit4:junit4]   2> 7220432 T3276 oasc.SolrCore.close [core2]  CLOSING SolrCore org.apache.solr.core.SolrCore@6364d6ae
[junit4:junit4]   2> 7220440 T3276 oasu.DirectUpdateHandler2.close closing DirectUpdateHandler2{commits=0,autocommits=0,soft autocommits=0,optimizes=0,rollbacks=0,expungeDeletes=0,docsPending=0,adds=0,deletesById=0,deletesByQuery=0,errors=0,cumulative_adds=0,cumulative_deletesById=0,cumulative_deletesByQuery=0,cumulative_errors=0}
[junit4:junit4]   2> 7220441 T3276 oasu.SolrCoreState.decrefSolrCoreState Closing SolrCoreState
[junit4:junit4]   2> 7220441 T3276 oasu.DefaultSolrCoreState.closeIndexWriter SolrCoreState ref count has reached 0 - closing IndexWriter
[junit4:junit4]   2> 7220442 T3276 oasu.DefaultSolrCoreState.closeIndexWriter closing IndexWriter with IndexWriterCloser
[junit4:junit4]   2> 7220443 T3276 oasc.SolrCore.closeSearcher [core2] Closing main searcher on request.
[junit4:junit4]   2> 7220443 T3276 oasc.CachingDirectoryFactory.close Closing directory when closing factory: /Users/jenkins/jenkins-slave/workspace/Lucene-Solr-4.x-MacOSX/solr/build/solr-core/test/J0/./org.apache.solr.core.TestSolrDiscoveryProperties/solrHome/core2/stuffandnonsense/index
[junit4:junit4]   2> 7220444 T3276 oasc.CachingDirectoryFactory.closeDirectory Closing directory: /Users/jenkins/jenkins-slave/workspace/Lucene-Solr-4.x-MacOSX/solr/build/solr-core/test/J0/./org.apache.solr.core.TestSolrDiscoveryProperties/solrHome/core2/stuffandnonsense/index
[junit4:junit4]   2> 7220444 T3276 oasc.CachingDirectoryFactory.close Closing directory when closing factory: /Users/jenkins/jenkins-slave/workspace/Lucene-Solr-4.x-MacOSX/solr/build/solr-core/test/J0/./org.apache.solr.core.TestSolrDiscoveryProperties/solrHome/core2/stuffandnonsense
[junit4:junit4]   2> 7220444 T3276 oasc.CachingDirectoryFactory.closeDirectory Closing directory: /Users/jenkins/jenkins-slave/workspace/Lucene-Solr-4.x-MacOSX/solr/build/solr-core/test/J0/./org.apache.solr.core.TestSolrDiscoveryProperties/solrHome/core2/stuffandnonsense
[junit4:junit4]   2> 7220445 T3276 oasc.SolrCore.close [lazy1]  CLOSING SolrCore org.apache.solr.core.SolrCore@b067e0a
[junit4:junit4]   2> 7220451 T3276 oasu.DirectUpdateHandler2.close closing DirectUpdateHandler2{commits=0,autocommits=0,soft autocommits=0,optimizes=0,rollbacks=0,expungeDeletes=0,docsPending=0,adds=0,deletesById=0,deletesByQuery=0,errors=0,cumulative_adds=0,cumulative_deletesById=0,cumulative_deletesByQuery=0,cumulative_errors=0}
[junit4:junit4]   2> 7220452 T3276 oasu.SolrCoreState.decrefSolrCoreState Closing SolrCoreState
[junit4:junit4]   2> 7220454 T3276 oasu.DefaultSolrCoreState.closeIndexWriter SolrCoreState ref count has reached 0 - closing IndexWriter
[junit4:junit4]   2> 7220454 T3276 oasu.DefaultSolrCoreState.closeIndexWriter closing IndexWriter with IndexWriterCloser
[junit4:junit4]   2> 7220455 T3276 oasc.SolrCore.closeSearcher [lazy1] Closing main searcher on request.
[junit4:junit4]   2> 7220455 T3276 oasc.CachingDirectoryFactory.close Closing directory when closing factory: /Users/jenkins/jenkins-slave/workspace/Lucene-Solr-4.x-MacOSX/solr/build/solr-core/test/J0/./org.apache.solr.core.TestSolrDiscoveryProperties/solrHome/lazy1/stuffandnonsense
[junit4:junit4]   2> 7220455 T3276 oasc.CachingDirectoryFactory.closeDirectory Closing directory: /Users/jenkins/jenkins-slave/workspace/Lucene-Solr-4.x-MacOSX/solr/build/solr-core/test/J0/./org.apache.solr.core.TestSolrDiscoveryProperties/solrHome/lazy1/stuffandnonsense
[junit4:junit4]   2> 7220456 T3276 oasc.CachingDirectoryFactory.close Closing directory when closing factory: /Users/jenkins/jenkins-slave/workspace/Lucene-Solr-4.x-MacOSX/solr/build/solr-core/test/J0/./org.apache.solr.core.TestSolrDiscoveryProperties/solrHome/lazy1/stuffandnonsense/index
[junit4:junit4]   2> 7220456 T3276 oasc.CachingDirectoryFactory.closeDirectory Closing directory: /Users/jenkins/jenkins-slave/workspace/Lucene-Solr-4.x-MacOSX/solr/build/solr-core/test/J0/./org.apache.solr.core.TestSolrDiscoveryProperties/solrHome/lazy1/stuffandnonsense/index
[junit4:junit4]   2> 7220465 T3276 oas.SolrTestCaseJ4.tearDown ###Ending testPropertiesFile
[junit4:junit4]   2> 7220471 T3276 oas.SolrTestCaseJ4.setUp ###Starting testPersistFalse
[junit4:junit4]   2> 7220493 T3276 oasc.SolrResourceLoader.locateSolrHome JNDI not configured for solr (NoInitialContextEx)
[junit4:junit4]   2> 7220494 T3276 oasc.SolrResourceLoader.locateSolrHome using system property solr.solr.home: /Users/jenkins/jenkins-slave/workspace/Lucene-Solr-4.x-MacOSX/solr/build/solr-core/test/J0/./org.apache.solr.core.TestSolrDiscoveryProperties/solrHome
[junit4:junit4]   2> 7220494 T3276 oasc.CoreContainer$Initializer.initialize looking for solr config file: /Users/jenkins/jenkins-slave/workspace/Lucene-Solr-4.x-MacOSX/solr/build/solr-core/test/J0/./org.apache.solr.core.TestSolrDiscoveryProperties/solrHome/solr.xml
[junit4:junit4]   2> 7220495 T3276 oasc.CoreContainer.<init> New CoreContainer 504024661
[junit4:junit4]   2> 7220495 T3276 oasc.CoreContainer.load Loading CoreContainer using Solr Home: '/Users/jenkins/jenkins-slave/workspace/Lucene-Solr-4.x-MacOSX/solr/build/solr-core/test/J0/./org.apache.solr.core.TestSolrDiscoveryProperties/solrHome/'
[junit4:junit4]   2> 7220496 T3276 oasc.SolrResourceLoader.<init> new SolrResourceLoader for directory: '/Users/jenkins/jenkins-slave/workspace/Lucene-Solr-4.x-MacOSX/solr/build/solr-core/test/J0/./org.apache.solr.core.TestSolrDiscoveryProperties/solrHome/'
[junit4:junit4]   2> 7220533 T3276 oasc.SolrProperties.walkFromHere Looking for cores in /Users/jenkins/jenkins-slave/workspace/Lucene-Solr-4.x-MacOSX/solr/build/solr-core/test/J0/./org.apache.solr.core.TestSolrDiscoveryProperties/solrHome
[junit4:junit4]   2> 7220534 T3276 oasc.SolrProperties.walkFromHere Discovered properties file /Users/jenkins/jenkins-slave/workspace/Lucene-Solr-4.x-MacOSX/solr/build/solr-core/test/J0/./org.apache.solr.core.TestSolrDiscoveryProperties/solrHome/core1/core.properties, adding to cores
[junit4:junit4]   2> 7220534 T3276 oasc.SolrProperties.walkFromHere Discovered properties file /Users/jenkins/jenkins-slave/workspace/Lucene-Solr-4.x-MacOSX/solr/build/solr-core/test/J0/./org.apache.solr.core.TestSolrDiscoveryProperties/solrHome/core2/core.properties, adding to cores
[junit4:junit4]   2> 7220535 T3276 oasc.SolrProperties.walkFromHere Discovered properties file /Users/jenkins/jenkins-slave/workspace/Lucene-Solr-4.x-MacOSX/solr/build/solr-core/test/J0/./org.apache.solr.core.TestSolrDiscoveryProperties/solrHome/lazy1/core.properties, adding to cores
[junit4:junit4]   2> 7220535 T3276 oasc.SolrProperties.walkFromHere Discovered properties file /Users/jenkins/jenkins-slave/workspace/Lucene-Solr-4.x-MacOSX/solr/build/solr-core/test/J0/./org.apache.solr.core.TestSolrDiscoveryProperties/solrHome/lazy2/core.properties, adding to cores
[junit4:junit4]   2> 7220536 T3276 oasc.SolrProperties.walkFromHere Looking for cores in /Users/jenkins/jenkins-slave/workspace/Lucene-Solr-4.x-MacOSX/solr/build/solr-core/test/J0/./org.apache.solr.core.TestSolrDiscoveryProperties/solrHome
[junit4:junit4]   2> 7220537 T3276 oasc.SolrProperties.walkFromHere Discovered properties file /Users/jenkins/jenkins-slave/workspace/Lucene-Solr-4.x-MacOSX/solr/build/solr-core/test/J0/./org.apache.solr.core.TestSolrDiscoveryProperties/solrHome/core1/core.properties, adding to cores
[junit4:junit4]   2> 7220537 T3276 oasc.SolrProperties.walkFromHere Discovered properties file /Users/jenkins/jenkins-slave/workspace/Lucene-Solr-4.x-MacOSX/solr/build/solr-core/test/J0/./org.apache.solr.core.TestSolrDiscoveryProperties/solrHome/core2/core.properties, adding to cores
[junit4:junit4]   2> 7220538 T3276 oasc.SolrProperties.walkFromHere Discovered properties file /Users/jenkins/jenkins-slave/workspace/Lucene-Solr-4.x-MacOSX/solr/build/solr-core/test/J0/./org.apache.solr.core.TestSolrDiscoveryProperties/solrHome/lazy1/core.properties, adding to cores
[junit4:junit4]   2> 7220538 T3276 oasc.SolrProperties.walkFromHere Discovered properties file /Users/jenkins/jenkins-slave/workspace/Lucene-Solr-4.x-MacOSX/solr/build/solr-core/test/J0/./org.apache.solr.core.TestSolrDiscoveryProperties/solrHome/lazy2/core.properties, adding to cores
[junit4:junit4]   2> 7220539 T3276 oashc.HttpShardHandlerFactory.getParameter Setting socketTimeout to: 0
[junit4:junit4]   2> 7220539 T3276 oashc.HttpShardHandlerFactory.getParameter Setting urlScheme to: http://
[junit4:junit4]   2> 7220539 T3276 oashc.HttpShardHandlerFactory.getParameter Setting connTimeout to: 0
[junit4:junit4]   2> 7220540 T3276 oashc.HttpShardHandlerFactory.getParameter Setting maxConnectionsPerHost to: 20
[junit4:junit4]   2> 7220540 T3276 oashc.HttpShardHandlerFactory.getParameter Setting corePoolSize to: 0
[junit4:junit4]   2> 7220541 T3276 oashc.HttpShardHandlerFactory.getParameter Setting maximumPoolSize to: 2147483647
[junit4:junit4]   2> 7220541 T3276 oashc.HttpShardHandlerFactory.getParameter Setting maxThreadIdleTime to: 5
[junit4:junit4]   2> 7220541 T3276 oashc.HttpShardHandlerFactory.getParameter Setting sizeOfQueue to: -1
[junit4:junit4]   2> 7220542 T3276 oashc.HttpShardHandlerFactory.getParameter Setting fairnessPolicy to: false
[junit4:junit4]   2> 7220542 T3276 oascsi.HttpClientUtil.createClient Creating new http client, config:maxConnectionsPerHost=20&maxConnections=10000&socketTimeout=0&connTimeout=0&retry=false
[junit4:junit4]   2> 7220551 T3276 oasc.CoreMaps.allocateLazyCores Allocating transient cache for 2 transient cores
[junit4:junit4]   2> 7220552 T3276 oasc.CoreContainer.load Registering Log Listener
[junit4:junit4]   2> 7220557 T3295 oasc.CoreContainer.create Creating SolrCore 'lazy2' using instanceDir: /Users/jenkins/jenkins-slave/workspace/Lucene-Solr-4.x-MacOSX/solr/build/solr-core/test/J0/./org.apache.solr.core.TestSolrDiscoveryProperties/solrHome/lazy2
[junit4:junit4]   2> 7220555 T3294 oasc.CoreContainer.create Creating SolrCore 'core1' using instanceDir: /Users/jenkins/jenkins-slave/workspace/Lucene-Solr-4.x-MacOSX/solr/build/solr-core/test/J0/./org.apache.solr.core.TestSolrDiscoveryProperties/solrHome/core1
[junit4:junit4]   2> 7220562 T3296 oasc.CoreContainer.create Creating SolrCore 'lazy1' using instanceDir: /Users/jenkins/jenkins-slave/workspace/Lucene-Solr-4.x-MacOSX/solr/build/solr-core/test/J0/./org.apache.solr.core.TestSolrDiscoveryProperties/solrHome/lazy1
[junit4:junit4]   2> 7220562 T3294 oasc.SolrResourceLoader.<init> new SolrResourceLoader for directory: '/Users/jenkins/jenkins-slave/workspace/Lucene-Solr-4.x-MacOSX/solr/build/solr-core/test/J0/./org.apache.solr.core.TestSolrDiscoveryProperties/solrHome/core1/'
[junit4:junit4]   2> 7220563 T3295 oasc.SolrResourceLoader.<init> new SolrResourceLoader for directory: '/Users/jenkins/jenkins-slave/workspace/Lucene-Solr-4.x-MacOSX/solr/build/solr-core/test/J0/./org.apache.solr.core.TestSolrDiscoveryProperties/solrHome/lazy2/'
[junit4:junit4]   2> 7220562 T3296 oasc.SolrResourceLoader.<init> new SolrResourceLoader for directory: '/Users/jenkins/jenkins-slave/workspace/Lucene-Solr-4.x-MacOSX/solr/build/solr-core/test/J0/./org.apache.solr.core.TestSolrDiscoveryProperties/solrHome/lazy1/'
[junit4:junit4]   2> 7220660 T3294 oasc.SolrConfig.<init> Using Lucene MatchVersion: LUCENE_41
[junit4:junit4]   2> 7220660 T3296 oasc.SolrConfig.<init> Using Lucene MatchVersion: LUCENE_41
[junit4:junit4]   2> 7220683 T3295 oasc.SolrConfig.<init> Using Lucene MatchVersion: LUCENE_41
[junit4:junit4]   2> 7220830 T3294 oasc.SolrConfig.<init> Loaded SolrConfig: solrconfig-minimal.xml
[junit4:junit4]   2> 7220830 T3294 oass.IndexSchema.readSchema Reading Solr Schema
[junit4:junit4]   2> 7220835 T3294 oass.IndexSchema.readSchema Schema name=tiny
[junit4:junit4]   2> 7220871 T3295 oasc.SolrConfig.<init> Loaded SolrConfig: solrconfig-minimal.xml
[junit4:junit4]   2> 7220873 T3295 oass.IndexSchema.readSchema Reading Solr Schema
[junit4:junit4]   2> 7220874 T3296 oasc.SolrConfig.<init> Loaded SolrConfig: solrconfig-minimal.xml
[junit4:junit4]   2> 7220874 T3296 oass.IndexSchema.readSchema Reading Solr Schema
[junit4:junit4]   2> 7220878 T3295 oass.IndexSchema.readSchema Schema name=tiny
[junit4:junit4]   2> 7220879 T3296 oass.IndexSchema.readSchema Schema name=tiny
[junit4:junit4]   2> 7220935 T3296 oass.IndexSchema.readSchema unique key field: id
[junit4:junit4]   2> 7220936 T3296 oasc.SolrCore.initDirectoryFactory org.apache.solr.core.MockDirectoryFactory
[junit4:junit4]   2> 7220937 T3296 oasc.SolrCore.<init> [lazy1] Opening new SolrCore at /Users/jenkins/jenkins-slave/workspace/Lucene-Solr-4.x-MacOSX/solr/build/solr-core/test/J0/./org.apache.solr.core.TestSolrDiscoveryProperties/solrHome/lazy1/, dataDir=/Users/jenkins/jenkins-slave/workspace/Lucene-Solr-4.x-MacOSX/solr/build/solr-core/test/J0/./org.apache.solr.core.TestSolrDiscoveryProperties/solrHome/lazy1/stuffandnonsense/
[junit4:junit4]   2> 7220937 T3296 oasc.JmxMonitoredMap.<init> JMX monitoring is enabled. Adding Solr mbeans to JMX Server: com.sun.jmx.mbeanserver.JmxMBeanServer@6e20f237
[junit4:junit4]   2> 7220938 T3296 oasc.SolrCore.initDirectoryFactory org.apache.solr.core.MockDirectoryFactory
[junit4:junit4]   2> 7220939 T3296 oasc.CachingDirectoryFactory.get return new directory for /Users/jenkins/jenkins-slave/workspace/Lucene-Solr-4.x-MacOSX/solr/build/solr-core/test/J0/./org.apache.solr.core.TestSolrDiscoveryProperties/solrHome/lazy1/stuffandnonsense
[junit4:junit4]   2> 7220939 T3296 oasc.SolrCore.getNewIndexDir New index directory detected: old=null new=/Users/jenkins/jenkins-slave/workspace/Lucene-Solr-4.x-MacOSX/solr/build/solr-core/test/J0/./org.apache.solr.core.TestSolrDiscoveryProperties/solrHome/lazy1/stuffandnonsense/index/
[junit4:junit4]   2> 7220939 T3296 oasc.SolrCore.initIndex WARNING [lazy1] Solr index directory '/Users/jenkins/jenkins-slave/workspace/Lucene-Solr-4.x-MacOSX/solr/build/solr-core/test/J0/./org.apache.solr.core.TestSolrDiscoveryProperties/solrHome/lazy1/stuffandnonsense/index' doesn't exist. Creating new index...
[junit4:junit4]   2> 7220943 T3294 oass.IndexSchema.readSchema unique key field: id
[junit4:junit4]   2> 7220951 T3296 oasc.CachingDirectoryFactory.get return new directory for /Users/jenkins/jenkins-slave/workspace/Lucene-Solr-4.x-MacOSX/solr/build/solr-core/test/J0/./org.apache.solr.core.TestSolrDiscoveryProperties/solrHome/lazy1/stuffandnonsense/index
[junit4:junit4]   2> 7220953 T3294 oasc.SolrCore.initDirectoryFactory org.apache.solr.core.MockDirectoryFactory
[junit4:junit4]   2> 7220954 T3296 oasc.SolrDeletionPolicy.onCommit SolrDeletionPolicy.onCommit: commits:num=1
[junit4:junit4]   2> 		commit{dir=MockDirWrapper(org.apache.lucene.store.RAMDirectory@7656e376 lockFactory=org.apache.lucene.store.NativeFSLockFactory@633f11a5),segFN=segments_1,generation=1,filenames=[segments_1]
[junit4:junit4]   2> 7220954 T3296 oasc.SolrDeletionPolicy.updateCommits newest commit = 1[segments_1]
[junit4:junit4]   2> 7220954 T3294 oasc.SolrCore.<init> [core1] Opening new SolrCore at /Users/jenkins/jenkins-slave/workspace/Lucene-Solr-4.x-MacOSX/solr/build/solr-core/test/J0/./org.apache.solr.core.TestSolrDiscoveryProperties/solrHome/core1/, dataDir=/Users/jenkins/jenkins-slave/workspace/Lucene-Solr-4.x-MacOSX/solr/build/solr-core/test/J0/./org.apache.solr.core.TestSolrDiscoveryProperties/solrHome/core1/stuffandnonsense/
[junit4:junit4]   2> 7220955 T3294 oasc.JmxMonitoredMap.<init> JMX monitoring is enabled. Adding Solr mbeans to JMX Server: com.sun.jmx.mbeanserver.JmxMBeanServer@6e20f237
[junit4:junit4]   2> 7220956 T3294 oasc.SolrCore.initDirectoryFactory org.apache.solr.core.MockDirectoryFactory
[junit4:junit4]   2> 7220957 T3294 oasc.CachingDirectoryFactory.get return new directory for /Users/jenkins/jenkins-slave/workspace/Lucene-Solr-4.x-MacOSX/solr/build/solr-core/test/J0/./org.apache.solr.core.TestSolrDiscoveryProperties/solrHome/core1/stuffandnonsense
[junit4:junit4]   2> 7220957 T3294 oasc.SolrCore.getNewIndexDir New index directory detected: old=null new=/Users/jenkins/jenkins-slave/workspace/Lucene-Solr-4.x-MacOSX/solr/build/solr-core/test/J0/./org.apache.solr.core.TestSolrDiscoveryProperties/solrHome/core1/stuffandnonsense/index/
[junit4:junit4]   2> 7220957 T3294 oasc.SolrCore.initIndex WARNING [core1] Solr index directory '/Users/jenkins/jenkins-slave/workspace/Lucene-Solr-4.x-MacOSX/solr/build/solr-core/test/J0/./org.apache.solr.core.TestSolrDiscoveryProperties/solrHome/core1/stuffandnonsense/index' doesn't exist. Creating new index...
[junit4:junit4]   2> 7220975 T3296 oasc.SolrCore.initWriters created json: solr.JSONResponseWriter
[junit4:junit4]   2> 7220979 T3296 oasc.RequestHandlers.initHandlersFromConfig created /admin/: solr.admin.AdminHandlers
[junit4:junit4]   2> 7220980 T3296 oasc.RequestHandlers.initHandlersFromConfig created /select: solr.SearchHandler
[junit4:junit4]   2> 7220981 T3296 oasc.RequestHandlers.initHandlersFromConfig created /update: solr.UpdateRequestHandler
[junit4:junit4]   2> 7220982 T3294 oasc.CachingDirectoryFactory.get return new directory for /Users/jenkins/jenkins-slave/workspace/Lucene-Solr-4.x-MacOSX/solr/build/solr-core/test/J0/./org.apache.solr.core.TestSolrDiscoveryProperties/solrHome/core1/stuffandnonsense/index
[junit4:junit4]   2> 7220981 T3295 oass.IndexSchema.readSchema unique key field: id
[junit4:junit4]   2> 7220986 T3295 oasc.SolrCore.initDirectoryFactory org.apache.solr.core.MockDirectoryFactory
[junit4:junit4]   2> 7220986 T3295 oasc.SolrCore.<init> [lazy2] Opening new SolrCore at /Users/jenkins/jenkins-slave/workspace/Lucene-Solr-4.x-MacOSX/solr/build/solr-core/test/J0/./org.apache.solr.core.TestSolrDiscoveryProperties/solrHome/lazy2/, dataDir=/Users/jenkins/jenkins-slave/workspace/Lucene-Solr-4.x-MacOSX/solr/build/solr-core/test/J0/./org.apache.solr.core.TestSolrDiscoveryProperties/solrHome/lazy2/stuffandnonsense/
[junit4:junit4]   2> 7220987 T3295 oasc.JmxMonitoredMap.<init> JMX monitoring is enabled. Adding Solr mbeans to JMX Server: com.sun.jmx.mbeanserver.JmxMBeanServer@6e20f237
[junit4:junit4]   2> 7220987 T3295 oasc.SolrCore.initDirectoryFactory org.apache.solr.core.MockDirectoryFactory
[junit4:junit4]   2> 7220989 T3295 oasc.CachingDirectoryFactory.get return new directory for /Users/jenkins/jenkins-slave/workspace/Lucene-Solr-4.x-MacOSX/solr/build/solr-core/test/J0/./org.apache.solr.core.TestSolrDiscoveryProperties/solrHome/lazy2/stuffandnonsense
[junit4:junit4]   2> 7220989 T3295 oasc.SolrCore.getNewIndexDir New index directory detected: old=null new=/Users/jenkins/jenkins-slave/workspace/Lucene-Solr-4.x-MacOSX/solr/build/solr-core/test/J0/./org.apache.solr.core.TestSolrDiscoveryProperties/solrHome/lazy2/stuffandnonsense/index/
[junit4:junit4]   2> 7220990 T3296 oashl.XMLLoader.init xsltCacheLifetimeSeconds=60
[junit4:junit4]   2> 7220990 T3295 oasc.SolrCore.initIndex WARNING [lazy2] Solr index directory '/Users/jenkins/jenkins-slave/workspace/Lucene-Solr-4.x-MacOSX/solr/build/solr-core/test/J0/./org.apache.solr.core.TestSolrDiscoveryProperties/solrHome/lazy2/stuffandnonsense/index' doesn't exist. Creating new index...
[junit4:junit4]   2> 7220991 T3295 oasc.CachingDirectoryFactory.get return new directory for /Users/jenkins/jenkins-slave/workspace/Lucene-Solr-4.x-MacOSX/solr/build/solr-core/test/J0/./org.apache.solr.core.TestSolrDiscoveryProperties/solrHome/lazy2/stuffandnonsense/index
[junit4:junit4]   2> 7220993 T3296 oass.SolrIndexSearcher.<init> Opening Searcher@523fe731 main
[junit4:junit4]   2> 7220994 T3294 oasc.SolrDeletionPolicy.onCommit SolrDeletionPolicy.onCommit: commits:num=1
[junit4:junit4]   2> 		commit{dir=MockDirWrapper(org.apache.lucene.store.RAMDirectory@17fb78de lockFactory=org.apache.lucene.store.NativeFSLockFactory@4aaff390),segFN=segments_1,generation=1,filenames=[segments_1]
[junit4:junit4]   2> 7220995 T3296 oasc.SolrCore.registerSearcher [lazy1] Registered new searcher Searcher@523fe731 main{StandardDirectoryReader(segments_1:1)}
[junit4:junit4]   2> 7220995 T3295 oasc.SolrDeletionPolicy.onCommit SolrDeletionPolicy.onCommit: commits:num=1
[junit4:junit4]   2> 		commit{dir=MockDirWrapper(org.apache.lucene.store.RAMDirectory@74c9cab2 lockFactory=org.apache.lucene.store.NativeFSLockFactory@10b9571d),segFN=segments_1,generation=1,filenames=[segments_1]
[junit4:junit4]   2> 7220995 T3294 oasc.SolrDeletionPolicy.updateCommits newest commit = 1[segments_1]
[junit4:junit4]   2> 7220995 T3296 oasu.CommitTracker.<init> Hard AutoCommit: disabled
[junit4:junit4]   2> 7220996 T3296 oasu.CommitTracker.<init> Soft AutoCommit: disabled
[junit4:junit4]   2> 7221001 T3296 oasc.CoreMaps.putTransientCore Opening transient core lazy1
[junit4:junit4]   2> 7221001 T3296 oasc.CoreContainer.registerCore registering core: lazy1
[junit4:junit4]   2> 7220995 T3295 oasc.SolrDeletionPolicy.updateCommits newest commit = 1[segments_1]
[junit4:junit4]   2> 7221002 T3294 oasc.SolrCore.initWriters created json: solr.JSONResponseWriter
[junit4:junit4]   2> 7221003 T3295 oasc.SolrCore.initWriters created json: solr.JSONResponseWriter
[junit4:junit4]   2> 7221005 T3294 oasc.RequestHandlers.initHandlersFromConfig created /admin/: solr.admin.AdminHandlers
[junit4:junit4]   2> 7221005 T3295 oasc.RequestHandlers.initHandlersFromConfig created /admin/: solr.admin.AdminHandlers
[junit4:junit4]   2> 7221005 T3294 oasc.RequestHandlers.initHandlersFromConfig created /select: solr.SearchHandler
[junit4:junit4]   2> 7221006 T3295 oasc.RequestHandlers.initHandlersFromConfig created /select: solr.SearchHandler
[junit4:junit4]   2> 7221006 T3294 oasc.RequestHandlers.initHandlersFromConfig created /update: solr.UpdateRequestHandler
[junit4:junit4]   2> 7221006 T3295 oasc.RequestHandlers.initHandlersFromConfig created /update: solr.UpdateRequestHandler
[junit4:junit4]   2> 7221012 T3295 oashl.XMLLoader.init xsltCacheLifetimeSeconds=60
[junit4:junit4]   2> 7221012 T3294 oashl.XMLLoader.init xsltCacheLifetimeSeconds=60
[junit4:junit4]   2> 7221018 T3294 oass.SolrIndexSearcher.<init> Opening Searcher@12b0d705 main
[junit4:junit4]   2> 7221018 T3295 oass.SolrIndexSearcher.<init> Opening Searcher@39d4f0d8 main
[junit4:junit4]   2> 7221020 T3294 oasc.SolrCore.registerSearcher [core1] Registered new searcher Searcher@12b0d705 main{StandardDirectoryReader(segments_1:1)}
[junit4:junit4]   2> 7221020 T3295 oasc.SolrCore.registerSearcher [lazy2] Registered new searcher Searcher@39d4f0d8 main{StandardDirectoryReader(segments_1:1)}
[junit4:junit4]   2> 7221020 T3294 oasu.CommitTracker.<init> Hard AutoCommit: disabled
[junit4:junit4]   2> 7221020 T3295 oasu.CommitTracker.<init> Hard AutoCommit: disabled
[junit4:junit4]   2> 7221020 T3294 oasu.CommitTracker.<init> Soft AutoCommit: disabled
[junit4:junit4]   2> 7221021 T3295 oasu.CommitTracker.<init> Soft AutoCommit: disabled
[junit4:junit4]   2> 7221029 T3294 oasc.CoreContainer.registerCore registering core: core1
[junit4:junit4]   2> 7221029 T3295 oasc.CoreContainer.registerCore registering core: lazy2
[junit4:junit4]   2> 7221056 T3276 oas.SolrTestCaseJ4.tearDown ###Ending testPersistFalse
[junit4:junit4]   2> 7221060 T3276 oas.SolrTestCaseJ4.deleteCore ###deleteCore
[junit4:junit4]   2> 7223213 T3275 ccr.ThreadLeakControl.tryToInterruptAll SEVERE There are still zombie threads that couldn't be terminated:
[junit4:junit4]   2> 	   1) Thread[id=3280, name=searcherExecutor-2190-thread-1, state=WAITING, group=TGRP-TestSolrDiscoveryProperties]
[junit4:junit4]   2> 	        at sun.misc.Unsafe.park(Native Method)
[junit4:junit4]   2> 	        at java.util.concurrent.locks.LockSupport.park(LockSupport.java:156)
[junit4:junit4]   2> 	        at java.util.concurrent.locks.AbstractQueuedSynchronizer$ConditionObject.await(AbstractQueuedSynchronizer.java:1987)
[junit4:junit4]   2> 	        at java.util.concurrent.LinkedBlockingQueue.take(LinkedBlockingQueue.java:399)
[junit4:junit4]   2> 	        at java.util.concurrent.ThreadPoolExecutor.getTask(ThreadPoolExecutor.java:957)
[junit4:junit4]   2> 	        at java.util.concurrent.ThreadPoolExecutor$Worker.run(ThreadPoolExecutor.java:917)
[junit4:junit4]   2> 	        at java.lang.Thread.run(Thread.java:680)
[junit4:junit4]   2> 	   2) Thread[id=3276, name=SUITE-TestSolrDiscoveryProperties-seed#[908B1657BC25F243]-worker, state=TIMED_WAITING, group=TGRP-TestSolrDiscoveryProperties]
[junit4:junit4]   2> 	        at java.lang.Thread.sleep(Native Method)
[junit4:junit4]   2> 	        at org.apache.solr.SolrTestCaseJ4.endTrackingSearchers(SolrTestCaseJ4.java:235)
[junit4:junit4]   2> 	        at org.apache.solr.SolrTestCaseJ4.afterClass(SolrTestCaseJ4.java:100)
[junit4:junit4]   2> 	        at sun.reflect.GeneratedMethodAccessor18.invoke(Unknown Source)
[junit4:junit4]   2> 	        at sun.reflect.DelegatingMethodAccessorImpl.invoke(DelegatingMethodAccessorImpl.java:25)
[junit4:junit4]   2> 	        at java.lang.reflect.Method.invoke(Method.java:597)
[junit4:junit4]   2> 	        at com.carrotsearch.randomizedtesting.RandomizedRunner.invoke(RandomizedRunner.java:1559)
[junit4:junit4]   2> 	        at com.carrotsearch.randomizedtesting.RandomizedRunner.access$600(RandomizedRunner.java:79)
[junit4:junit4]   2> 	        at com.carrotsearch.randomizedtesting.RandomizedRunner$5.evaluate(RandomizedRunner.java:700)
[junit4:junit4]   2> 	        at com.carrotsearch.randomizedtesting.rules.StatementAdapter.evaluate(StatementAdapter.java:36)
[junit4:junit4]   2> 	        at com.carrotsearch.randomizedtesting.rules.SystemPropertiesRestoreRule$1.evaluate(SystemPropertiesRestoreRule.java:53)
[junit4:junit4]   2> 	        at org.apache.lucene.util.AbstractBeforeAfterRule$1.evaluate(AbstractBeforeAfterRule.java:46)
[junit4:junit4]   2> 	        at org.apache.lucene.util.TestRuleStoreClassName$1.evaluate(TestRuleStoreClassName.java:42)
[junit4:junit4]   2> 	        at com.carrotsearch.randomizedtesting.rules.SystemPropertiesInvariantRule$1.evaluate(SystemPropertiesInvariantRule.java:55)
[junit4:junit4]   2> 	        at com.carrotsearch.randomizedtesting.rules.NoShadowingOrOverridesOnMethodsRule$1.evaluate(NoShadowingOrOverridesOnMethodsRule.java:39)
[junit4:junit4]   2> 	        at com.carrotsearch.randomizedtesting.rules.NoShadowingOrOverridesOnMethodsRule$1.evaluate(NoShadowingOrOverridesOnMethodsRule.java:39)
[junit4:junit4]   2> 	        at com.carrotsearch.randomizedtesting.rules.StatementAdapter.evaluate(StatementAdapter.java:36)
[junit4:junit4]   2> 	        at org.apache.lucene.util.TestRuleAssertionsRequired$1.evaluate(TestRuleAssertionsRequired.java:43)
[junit4:junit4]   2> 	        at org.apache.lucene.util.TestRuleMarkFailure$1.evaluate(TestRuleMarkFailure.java:48)
[junit4:junit4]   2> 	        at org.apache.lucene.util.TestRuleIgnoreAfterMaxFailures$1.evaluate(TestRuleIgnoreAfterMaxFailures.java:70)
[junit4:junit4]   2> 	        at org.apache.lucene.util.TestRuleIgnoreTestSuites$1.evaluate(TestRuleIgnoreTestSuites.java:55)
[junit4:junit4]   2> 	        at com.carrotsearch.randomizedtesting.rules.StatementAdapter.evaluate(StatementAdapter.java:36)
[junit4:junit4]   2> 	        at com.carrotsearch.randomizedtesting.ThreadLeakControl$StatementRunner.run(ThreadLeakControl.java:358)
[junit4:junit4]   2> 	        at java.lang.Thread.run(Thread.java:680)
[junit4:junit4]   2> NOTE: test params are: codec=Lucene3x, sim=DefaultSimilarity, locale=ar_MA, timezone=Asia/Kamchatka
[junit4:junit4]   2> NOTE: Mac OS X 10.8.2 x86_64/Apple Inc. 1.6.0_41 (64-bit)/cpus=2,threads=6,free=220784752,total=337633280
[junit4:junit4]   2> NOTE: All tests run in this JVM: [LeaderElectionTest, SpellCheckComponentTest, SolrCoreTest, TestCollationField, SoftAutoCommitTest, TermVectorComponentDistributedTest, TestUtils, ZkCLITest, TestMergePolicyConfig, ShowFileRequestHandlerTest, SliceStateTest, SystemInfoHandlerTest, TestPseudoReturnFields, LoggingHandlerTest, ChaosMonkeySafeLeaderTest, TestReload, SyncSliceTest, ShardRoutingCustomTest, TestWriterPerf, FieldMutatingUpdateProcessorTest, UnloadDistributedZkTest, IndexSchemaRuntimeFieldTest, SOLR749Test, ZkNodePropsTest, RAMDirectoryFactoryTest, ClusterStateUpdateTest, SimpleFacetsTest, AlternateDirectoryTest, CollectionsAPIDistributedZkTest, TestArbitraryIndexDir, TestStressRecovery, TestBinaryField, DocValuesMultiTest, TestRTGBase, TestHashPartitioner, MoreLikeThisHandlerTest, JsonLoaderTest, FieldAnalysisRequestHandlerTest, TestCoreContainer, TestFuzzyAnalyzedSuggestions, ChaosMonkeyNothingIsSafeTest, DateMathParserTest, BasicDistributedZkTest, TestIBSimilarityFactory, OverseerTest, HighlighterTest, TestDocumentBuilder, TestTrie, BasicFunctionalityTest, PathHierarchyTokenizerFactoryTest, OpenCloseCoreStressTest, TestIndexingPerformance, SolrCmdDistributorTest, LeaderElectionIntegrationTest, TermVectorComponentTest, TestStressVersions, TestQueryUtils, NoCacheHeaderTest, TestBM25SimilarityFactory, StatelessScriptUpdateProcessorFactoryTest, TestLazyCores, CurrencyFieldOpenExchangeTest, TestSolrDeletionPolicy2, HardAutoCommitTest, SolrTestCaseJ4Test, TestSolrDeletionPolicy1, TestSurroundQueryParser, DisMaxRequestHandlerTest, TestQuerySenderListener, TestDynamicFieldCollectionResource, DistanceFunctionTest, TestSolrDiscoveryProperties]
[junit4:junit4]   2> NOTE: reproduce with: ant test  -Dtestcase=TestSolrDiscoveryProperties -Dtests.seed=908B1657BC25F243 -Dtests.slow=true -Dtests.locale=ar_MA -Dtests.timezone=Asia/Kamchatka -Dtests.file.encoding=US-ASCII
[junit4:junit4] ERROR   0.00s | TestSolrDiscoveryProperties (suite) <<<
[junit4:junit4]    > Throwable #1: java.lang.Exception: Suite timeout exceeded (>= 7200000 msec).
[junit4:junit4]    > 	at __randomizedtesting.SeedInfo.seed([908B1657BC25F243]:0)
[junit4:junit4] Completed in 7223.27s, 3 tests, 2 errors <<< FAILURES!

[...truncated 607 lines...]
BUILD FAILED
/Users/jenkins/jenkins-slave/workspace/Lucene-Solr-4.x-MacOSX/build.xml:381: The following error occurred while executing this line:
/Users/jenkins/jenkins-slave/workspace/Lucene-Solr-4.x-MacOSX/build.xml:361: The following error occurred while executing this line:
/Users/jenkins/jenkins-slave/workspace/Lucene-Solr-4.x-MacOSX/build.xml:39: The following error occurred while executing this line:
/Users/jenkins/jenkins-slave/workspace/Lucene-Solr-4.x-MacOSX/solr/build.xml:183: The following error occurred while executing this line:
/Users/jenkins/jenkins-slave/workspace/Lucene-Solr-4.x-MacOSX/solr/common-build.xml:449: The following error occurred while executing this line:
/Users/jenkins/jenkins-slave/workspace/Lucene-Solr-4.x-MacOSX/lucene/common-build.xml:1213: The following error occurred while executing this line:
/Users/jenkins/jenkins-slave/workspace/Lucene-Solr-4.x-MacOSX/lucene/common-build.xml:877: There were test failures: 273 suites, 1148 tests, 1 suite-level error, 1 error, 761 ignored (5 assumptions)

Total time: 179 minutes 49 seconds
Build step 'Invoke Ant' marked build as failure
Archiving artifacts
Recording test results
Description set: Java: 64bit/jdk1.6.0 -XX:+UseConcMarkSweepGC
Email was triggered for: Failure
Sending email for trigger: Failure



Mime
View raw message