lucene-dev mailing list archives

Site index · List index
Message view « Date » · « Thread »
Top « Date » · « Thread »
From Policeman Jenkins Server <jenk...@thetaphi.de>
Subject [JENKINS] Lucene-Solr-trunk-Linux (64bit/jdk1.8.0-ea-b79) - Build # 4596 - Failure!
Date Wed, 06 Mar 2013 16:31:16 GMT
Build: http://jenkins.thetaphi.de/job/Lucene-Solr-trunk-Linux/4596/
Java: 64bit/jdk1.8.0-ea-b79 -XX:+UseParallelGC

4 tests failed.
REGRESSION:  org.apache.solr.cloud.BasicDistributedZk2Test.testDistribSearch

Error Message:
Server at http://127.0.0.1:33334/onenodecollectioncore returned non ok status:404, message:Can not find: /onenodecollectioncore/update

Stack Trace:
org.apache.solr.common.SolrException: Server at http://127.0.0.1:33334/onenodecollectioncore returned non ok status:404, message:Can not find: /onenodecollectioncore/update
	at __randomizedtesting.SeedInfo.seed([187A56FCA9BB0EAD:999CD8E4DEE46E91]:0)
	at org.apache.solr.client.solrj.impl.HttpSolrServer.request(HttpSolrServer.java:375)
	at org.apache.solr.client.solrj.impl.HttpSolrServer.request(HttpSolrServer.java:181)
	at org.apache.solr.client.solrj.request.AbstractUpdateRequest.process(AbstractUpdateRequest.java:117)
	at org.apache.solr.client.solrj.SolrServer.add(SolrServer.java:116)
	at org.apache.solr.client.solrj.SolrServer.add(SolrServer.java:102)
	at org.apache.solr.cloud.BasicDistributedZk2Test.testNodeWithoutCollectionForwarding(BasicDistributedZk2Test.java:200)
	at org.apache.solr.cloud.BasicDistributedZk2Test.doTest(BasicDistributedZk2Test.java:89)
	at org.apache.solr.BaseDistributedSearchTestCase.testDistribSearch(BaseDistributedSearchTestCase.java:806)
	at sun.reflect.NativeMethodAccessorImpl.invoke0(Native Method)
	at sun.reflect.NativeMethodAccessorImpl.invoke(NativeMethodAccessorImpl.java:57)
	at sun.reflect.DelegatingMethodAccessorImpl.invoke(DelegatingMethodAccessorImpl.java:43)
	at java.lang.reflect.Method.invoke(Method.java:487)
	at com.carrotsearch.randomizedtesting.RandomizedRunner.invoke(RandomizedRunner.java:1559)
	at com.carrotsearch.randomizedtesting.RandomizedRunner.access$600(RandomizedRunner.java:79)
	at com.carrotsearch.randomizedtesting.RandomizedRunner$6.evaluate(RandomizedRunner.java:737)
	at com.carrotsearch.randomizedtesting.RandomizedRunner$7.evaluate(RandomizedRunner.java:773)
	at com.carrotsearch.randomizedtesting.RandomizedRunner$8.evaluate(RandomizedRunner.java:787)
	at com.carrotsearch.randomizedtesting.rules.SystemPropertiesRestoreRule$1.evaluate(SystemPropertiesRestoreRule.java:53)
	at org.apache.lucene.util.TestRuleSetupTeardownChained$1.evaluate(TestRuleSetupTeardownChained.java:50)
	at org.apache.lucene.util.TestRuleFieldCacheSanity$1.evaluate(TestRuleFieldCacheSanity.java:51)
	at org.apache.lucene.util.AbstractBeforeAfterRule$1.evaluate(AbstractBeforeAfterRule.java:46)
	at com.carrotsearch.randomizedtesting.rules.SystemPropertiesInvariantRule$1.evaluate(SystemPropertiesInvariantRule.java:55)
	at org.apache.lucene.util.TestRuleThreadAndTestName$1.evaluate(TestRuleThreadAndTestName.java:49)
	at org.apache.lucene.util.TestRuleIgnoreAfterMaxFailures$1.evaluate(TestRuleIgnoreAfterMaxFailures.java:70)
	at org.apache.lucene.util.TestRuleMarkFailure$1.evaluate(TestRuleMarkFailure.java:48)
	at com.carrotsearch.randomizedtesting.rules.StatementAdapter.evaluate(StatementAdapter.java:36)
	at com.carrotsearch.randomizedtesting.ThreadLeakControl$StatementRunner.run(ThreadLeakControl.java:358)
	at com.carrotsearch.randomizedtesting.ThreadLeakControl.forkTimeoutingTask(ThreadLeakControl.java:782)
	at com.carrotsearch.randomizedtesting.ThreadLeakControl$3.evaluate(ThreadLeakControl.java:442)
	at com.carrotsearch.randomizedtesting.RandomizedRunner.runSingleTest(RandomizedRunner.java:746)
	at com.carrotsearch.randomizedtesting.RandomizedRunner$3.evaluate(RandomizedRunner.java:648)
	at com.carrotsearch.randomizedtesting.RandomizedRunner$4.evaluate(RandomizedRunner.java:682)
	at com.carrotsearch.randomizedtesting.RandomizedRunner$5.evaluate(RandomizedRunner.java:693)
	at com.carrotsearch.randomizedtesting.rules.StatementAdapter.evaluate(StatementAdapter.java:36)
	at com.carrotsearch.randomizedtesting.rules.SystemPropertiesRestoreRule$1.evaluate(SystemPropertiesRestoreRule.java:53)
	at org.apache.lucene.util.AbstractBeforeAfterRule$1.evaluate(AbstractBeforeAfterRule.java:46)
	at org.apache.lucene.util.TestRuleStoreClassName$1.evaluate(TestRuleStoreClassName.java:42)
	at com.carrotsearch.randomizedtesting.rules.SystemPropertiesInvariantRule$1.evaluate(SystemPropertiesInvariantRule.java:55)
	at com.carrotsearch.randomizedtesting.rules.NoShadowingOrOverridesOnMethodsRule$1.evaluate(NoShadowingOrOverridesOnMethodsRule.java:39)
	at com.carrotsearch.randomizedtesting.rules.NoShadowingOrOverridesOnMethodsRule$1.evaluate(NoShadowingOrOverridesOnMethodsRule.java:39)
	at com.carrotsearch.randomizedtesting.rules.StatementAdapter.evaluate(StatementAdapter.java:36)
	at org.apache.lucene.util.TestRuleAssertionsRequired$1.evaluate(TestRuleAssertionsRequired.java:43)
	at org.apache.lucene.util.TestRuleMarkFailure$1.evaluate(TestRuleMarkFailure.java:48)
	at org.apache.lucene.util.TestRuleIgnoreAfterMaxFailures$1.evaluate(TestRuleIgnoreAfterMaxFailures.java:70)
	at org.apache.lucene.util.TestRuleIgnoreTestSuites$1.evaluate(TestRuleIgnoreTestSuites.java:55)
	at com.carrotsearch.randomizedtesting.rules.StatementAdapter.evaluate(StatementAdapter.java:36)
	at com.carrotsearch.randomizedtesting.ThreadLeakControl$StatementRunner.run(ThreadLeakControl.java:358)
	at java.lang.Thread.run(Thread.java:722)


REGRESSION:  org.apache.solr.cloud.UnloadDistributedZkTest.testDistribSearch

Error Message:
Still found shard

Stack Trace:
java.lang.AssertionError: Still found shard
	at __randomizedtesting.SeedInfo.seed([187A56FCA9BB0EAD:999CD8E4DEE46E91]:0)
	at org.junit.Assert.fail(Assert.java:93)
	at org.apache.solr.cloud.UnloadDistributedZkTest.testUnloadShardAndCollection(UnloadDistributedZkTest.java:124)
	at org.apache.solr.cloud.UnloadDistributedZkTest.doTest(UnloadDistributedZkTest.java:77)
	at org.apache.solr.BaseDistributedSearchTestCase.testDistribSearch(BaseDistributedSearchTestCase.java:806)
	at sun.reflect.NativeMethodAccessorImpl.invoke0(Native Method)
	at sun.reflect.NativeMethodAccessorImpl.invoke(NativeMethodAccessorImpl.java:57)
	at sun.reflect.DelegatingMethodAccessorImpl.invoke(DelegatingMethodAccessorImpl.java:43)
	at java.lang.reflect.Method.invoke(Method.java:487)
	at com.carrotsearch.randomizedtesting.RandomizedRunner.invoke(RandomizedRunner.java:1559)
	at com.carrotsearch.randomizedtesting.RandomizedRunner.access$600(RandomizedRunner.java:79)
	at com.carrotsearch.randomizedtesting.RandomizedRunner$6.evaluate(RandomizedRunner.java:737)
	at com.carrotsearch.randomizedtesting.RandomizedRunner$7.evaluate(RandomizedRunner.java:773)
	at com.carrotsearch.randomizedtesting.RandomizedRunner$8.evaluate(RandomizedRunner.java:787)
	at com.carrotsearch.randomizedtesting.rules.SystemPropertiesRestoreRule$1.evaluate(SystemPropertiesRestoreRule.java:53)
	at org.apache.lucene.util.TestRuleSetupTeardownChained$1.evaluate(TestRuleSetupTeardownChained.java:50)
	at org.apache.lucene.util.TestRuleFieldCacheSanity$1.evaluate(TestRuleFieldCacheSanity.java:51)
	at org.apache.lucene.util.AbstractBeforeAfterRule$1.evaluate(AbstractBeforeAfterRule.java:46)
	at com.carrotsearch.randomizedtesting.rules.SystemPropertiesInvariantRule$1.evaluate(SystemPropertiesInvariantRule.java:55)
	at org.apache.lucene.util.TestRuleThreadAndTestName$1.evaluate(TestRuleThreadAndTestName.java:49)
	at org.apache.lucene.util.TestRuleIgnoreAfterMaxFailures$1.evaluate(TestRuleIgnoreAfterMaxFailures.java:70)
	at org.apache.lucene.util.TestRuleMarkFailure$1.evaluate(TestRuleMarkFailure.java:48)
	at com.carrotsearch.randomizedtesting.rules.StatementAdapter.evaluate(StatementAdapter.java:36)
	at com.carrotsearch.randomizedtesting.ThreadLeakControl$StatementRunner.run(ThreadLeakControl.java:358)
	at com.carrotsearch.randomizedtesting.ThreadLeakControl.forkTimeoutingTask(ThreadLeakControl.java:782)
	at com.carrotsearch.randomizedtesting.ThreadLeakControl$3.evaluate(ThreadLeakControl.java:442)
	at com.carrotsearch.randomizedtesting.RandomizedRunner.runSingleTest(RandomizedRunner.java:746)
	at com.carrotsearch.randomizedtesting.RandomizedRunner$3.evaluate(RandomizedRunner.java:648)
	at com.carrotsearch.randomizedtesting.RandomizedRunner$4.evaluate(RandomizedRunner.java:682)
	at com.carrotsearch.randomizedtesting.RandomizedRunner$5.evaluate(RandomizedRunner.java:693)
	at com.carrotsearch.randomizedtesting.rules.StatementAdapter.evaluate(StatementAdapter.java:36)
	at com.carrotsearch.randomizedtesting.rules.SystemPropertiesRestoreRule$1.evaluate(SystemPropertiesRestoreRule.java:53)
	at org.apache.lucene.util.AbstractBeforeAfterRule$1.evaluate(AbstractBeforeAfterRule.java:46)
	at org.apache.lucene.util.TestRuleStoreClassName$1.evaluate(TestRuleStoreClassName.java:42)
	at com.carrotsearch.randomizedtesting.rules.SystemPropertiesInvariantRule$1.evaluate(SystemPropertiesInvariantRule.java:55)
	at com.carrotsearch.randomizedtesting.rules.NoShadowingOrOverridesOnMethodsRule$1.evaluate(NoShadowingOrOverridesOnMethodsRule.java:39)
	at com.carrotsearch.randomizedtesting.rules.NoShadowingOrOverridesOnMethodsRule$1.evaluate(NoShadowingOrOverridesOnMethodsRule.java:39)
	at com.carrotsearch.randomizedtesting.rules.StatementAdapter.evaluate(StatementAdapter.java:36)
	at org.apache.lucene.util.TestRuleAssertionsRequired$1.evaluate(TestRuleAssertionsRequired.java:43)
	at org.apache.lucene.util.TestRuleMarkFailure$1.evaluate(TestRuleMarkFailure.java:48)
	at org.apache.lucene.util.TestRuleIgnoreAfterMaxFailures$1.evaluate(TestRuleIgnoreAfterMaxFailures.java:70)
	at org.apache.lucene.util.TestRuleIgnoreTestSuites$1.evaluate(TestRuleIgnoreTestSuites.java:55)
	at com.carrotsearch.randomizedtesting.rules.StatementAdapter.evaluate(StatementAdapter.java:36)
	at com.carrotsearch.randomizedtesting.ThreadLeakControl$StatementRunner.run(ThreadLeakControl.java:358)
	at java.lang.Thread.run(Thread.java:722)


REGRESSION:  org.apache.solr.rest.TestFieldCollectionResource.testJsonGetAllFields

Error Message:
mismatch: 'custstopfilt'!='porterfilt' @ fields/[0]/name

Stack Trace:
java.lang.RuntimeException: mismatch: 'custstopfilt'!='porterfilt' @ fields/[0]/name
	at __randomizedtesting.SeedInfo.seed([187A56FCA9BB0EAD:917A24700908428B]:0)
	at org.apache.solr.util.RestTestBase.assertJQ(RestTestBase.java:242)
	at org.apache.solr.util.RestTestBase.assertJQ(RestTestBase.java:186)
	at org.apache.solr.rest.TestFieldCollectionResource.testJsonGetAllFields(TestFieldCollectionResource.java:50)
	at sun.reflect.NativeMethodAccessorImpl.invoke0(Native Method)
	at sun.reflect.NativeMethodAccessorImpl.invoke(NativeMethodAccessorImpl.java:57)
	at sun.reflect.DelegatingMethodAccessorImpl.invoke(DelegatingMethodAccessorImpl.java:43)
	at java.lang.reflect.Method.invoke(Method.java:487)
	at com.carrotsearch.randomizedtesting.RandomizedRunner.invoke(RandomizedRunner.java:1559)
	at com.carrotsearch.randomizedtesting.RandomizedRunner.access$600(RandomizedRunner.java:79)
	at com.carrotsearch.randomizedtesting.RandomizedRunner$6.evaluate(RandomizedRunner.java:737)
	at com.carrotsearch.randomizedtesting.RandomizedRunner$7.evaluate(RandomizedRunner.java:773)
	at com.carrotsearch.randomizedtesting.RandomizedRunner$8.evaluate(RandomizedRunner.java:787)
	at com.carrotsearch.randomizedtesting.rules.SystemPropertiesRestoreRule$1.evaluate(SystemPropertiesRestoreRule.java:53)
	at org.apache.lucene.util.TestRuleSetupTeardownChained$1.evaluate(TestRuleSetupTeardownChained.java:50)
	at org.apache.lucene.util.TestRuleFieldCacheSanity$1.evaluate(TestRuleFieldCacheSanity.java:51)
	at org.apache.lucene.util.AbstractBeforeAfterRule$1.evaluate(AbstractBeforeAfterRule.java:46)
	at com.carrotsearch.randomizedtesting.rules.SystemPropertiesInvariantRule$1.evaluate(SystemPropertiesInvariantRule.java:55)
	at org.apache.lucene.util.TestRuleThreadAndTestName$1.evaluate(TestRuleThreadAndTestName.java:49)
	at org.apache.lucene.util.TestRuleIgnoreAfterMaxFailures$1.evaluate(TestRuleIgnoreAfterMaxFailures.java:70)
	at org.apache.lucene.util.TestRuleMarkFailure$1.evaluate(TestRuleMarkFailure.java:48)
	at com.carrotsearch.randomizedtesting.rules.StatementAdapter.evaluate(StatementAdapter.java:36)
	at com.carrotsearch.randomizedtesting.ThreadLeakControl$StatementRunner.run(ThreadLeakControl.java:358)
	at com.carrotsearch.randomizedtesting.ThreadLeakControl.forkTimeoutingTask(ThreadLeakControl.java:782)
	at com.carrotsearch.randomizedtesting.ThreadLeakControl$3.evaluate(ThreadLeakControl.java:442)
	at com.carrotsearch.randomizedtesting.RandomizedRunner.runSingleTest(RandomizedRunner.java:746)
	at com.carrotsearch.randomizedtesting.RandomizedRunner$3.evaluate(RandomizedRunner.java:648)
	at com.carrotsearch.randomizedtesting.RandomizedRunner$4.evaluate(RandomizedRunner.java:682)
	at com.carrotsearch.randomizedtesting.RandomizedRunner$5.evaluate(RandomizedRunner.java:693)
	at com.carrotsearch.randomizedtesting.rules.StatementAdapter.evaluate(StatementAdapter.java:36)
	at com.carrotsearch.randomizedtesting.rules.SystemPropertiesRestoreRule$1.evaluate(SystemPropertiesRestoreRule.java:53)
	at org.apache.lucene.util.AbstractBeforeAfterRule$1.evaluate(AbstractBeforeAfterRule.java:46)
	at org.apache.lucene.util.TestRuleStoreClassName$1.evaluate(TestRuleStoreClassName.java:42)
	at com.carrotsearch.randomizedtesting.rules.SystemPropertiesInvariantRule$1.evaluate(SystemPropertiesInvariantRule.java:55)
	at com.carrotsearch.randomizedtesting.rules.NoShadowingOrOverridesOnMethodsRule$1.evaluate(NoShadowingOrOverridesOnMethodsRule.java:39)
	at com.carrotsearch.randomizedtesting.rules.NoShadowingOrOverridesOnMethodsRule$1.evaluate(NoShadowingOrOverridesOnMethodsRule.java:39)
	at com.carrotsearch.randomizedtesting.rules.StatementAdapter.evaluate(StatementAdapter.java:36)
	at org.apache.lucene.util.TestRuleAssertionsRequired$1.evaluate(TestRuleAssertionsRequired.java:43)
	at org.apache.lucene.util.TestRuleMarkFailure$1.evaluate(TestRuleMarkFailure.java:48)
	at org.apache.lucene.util.TestRuleIgnoreAfterMaxFailures$1.evaluate(TestRuleIgnoreAfterMaxFailures.java:70)
	at org.apache.lucene.util.TestRuleIgnoreTestSuites$1.evaluate(TestRuleIgnoreTestSuites.java:55)
	at com.carrotsearch.randomizedtesting.rules.StatementAdapter.evaluate(StatementAdapter.java:36)
	at com.carrotsearch.randomizedtesting.ThreadLeakControl$StatementRunner.run(ThreadLeakControl.java:358)
	at java.lang.Thread.run(Thread.java:722)


REGRESSION:  org.apache.solr.rest.TestFieldCollectionResource.testGetAllFields

Error Message:
Exception during query

Stack Trace:
java.lang.RuntimeException: Exception during query
	at __randomizedtesting.SeedInfo.seed([187A56FCA9BB0EAD:F4D41C385348F735]:0)
	at org.apache.solr.util.RestTestBase.assertQ(RestTestBase.java:143)
	at org.apache.solr.rest.TestFieldCollectionResource.testGetAllFields(TestFieldCollectionResource.java:26)
	at sun.reflect.NativeMethodAccessorImpl.invoke0(Native Method)
	at sun.reflect.NativeMethodAccessorImpl.invoke(NativeMethodAccessorImpl.java:57)
	at sun.reflect.DelegatingMethodAccessorImpl.invoke(DelegatingMethodAccessorImpl.java:43)
	at java.lang.reflect.Method.invoke(Method.java:487)
	at com.carrotsearch.randomizedtesting.RandomizedRunner.invoke(RandomizedRunner.java:1559)
	at com.carrotsearch.randomizedtesting.RandomizedRunner.access$600(RandomizedRunner.java:79)
	at com.carrotsearch.randomizedtesting.RandomizedRunner$6.evaluate(RandomizedRunner.java:737)
	at com.carrotsearch.randomizedtesting.RandomizedRunner$7.evaluate(RandomizedRunner.java:773)
	at com.carrotsearch.randomizedtesting.RandomizedRunner$8.evaluate(RandomizedRunner.java:787)
	at com.carrotsearch.randomizedtesting.rules.SystemPropertiesRestoreRule$1.evaluate(SystemPropertiesRestoreRule.java:53)
	at org.apache.lucene.util.TestRuleSetupTeardownChained$1.evaluate(TestRuleSetupTeardownChained.java:50)
	at org.apache.lucene.util.TestRuleFieldCacheSanity$1.evaluate(TestRuleFieldCacheSanity.java:51)
	at org.apache.lucene.util.AbstractBeforeAfterRule$1.evaluate(AbstractBeforeAfterRule.java:46)
	at com.carrotsearch.randomizedtesting.rules.SystemPropertiesInvariantRule$1.evaluate(SystemPropertiesInvariantRule.java:55)
	at org.apache.lucene.util.TestRuleThreadAndTestName$1.evaluate(TestRuleThreadAndTestName.java:49)
	at org.apache.lucene.util.TestRuleIgnoreAfterMaxFailures$1.evaluate(TestRuleIgnoreAfterMaxFailures.java:70)
	at org.apache.lucene.util.TestRuleMarkFailure$1.evaluate(TestRuleMarkFailure.java:48)
	at com.carrotsearch.randomizedtesting.rules.StatementAdapter.evaluate(StatementAdapter.java:36)
	at com.carrotsearch.randomizedtesting.ThreadLeakControl$StatementRunner.run(ThreadLeakControl.java:358)
	at com.carrotsearch.randomizedtesting.ThreadLeakControl.forkTimeoutingTask(ThreadLeakControl.java:782)
	at com.carrotsearch.randomizedtesting.ThreadLeakControl$3.evaluate(ThreadLeakControl.java:442)
	at com.carrotsearch.randomizedtesting.RandomizedRunner.runSingleTest(RandomizedRunner.java:746)
	at com.carrotsearch.randomizedtesting.RandomizedRunner$3.evaluate(RandomizedRunner.java:648)
	at com.carrotsearch.randomizedtesting.RandomizedRunner$4.evaluate(RandomizedRunner.java:682)
	at com.carrotsearch.randomizedtesting.RandomizedRunner$5.evaluate(RandomizedRunner.java:693)
	at com.carrotsearch.randomizedtesting.rules.StatementAdapter.evaluate(StatementAdapter.java:36)
	at com.carrotsearch.randomizedtesting.rules.SystemPropertiesRestoreRule$1.evaluate(SystemPropertiesRestoreRule.java:53)
	at org.apache.lucene.util.AbstractBeforeAfterRule$1.evaluate(AbstractBeforeAfterRule.java:46)
	at org.apache.lucene.util.TestRuleStoreClassName$1.evaluate(TestRuleStoreClassName.java:42)
	at com.carrotsearch.randomizedtesting.rules.SystemPropertiesInvariantRule$1.evaluate(SystemPropertiesInvariantRule.java:55)
	at com.carrotsearch.randomizedtesting.rules.NoShadowingOrOverridesOnMethodsRule$1.evaluate(NoShadowingOrOverridesOnMethodsRule.java:39)
	at com.carrotsearch.randomizedtesting.rules.NoShadowingOrOverridesOnMethodsRule$1.evaluate(NoShadowingOrOverridesOnMethodsRule.java:39)
	at com.carrotsearch.randomizedtesting.rules.StatementAdapter.evaluate(StatementAdapter.java:36)
	at org.apache.lucene.util.TestRuleAssertionsRequired$1.evaluate(TestRuleAssertionsRequired.java:43)
	at org.apache.lucene.util.TestRuleMarkFailure$1.evaluate(TestRuleMarkFailure.java:48)
	at org.apache.lucene.util.TestRuleIgnoreAfterMaxFailures$1.evaluate(TestRuleIgnoreAfterMaxFailures.java:70)
	at org.apache.lucene.util.TestRuleIgnoreTestSuites$1.evaluate(TestRuleIgnoreTestSuites.java:55)
	at com.carrotsearch.randomizedtesting.rules.StatementAdapter.evaluate(StatementAdapter.java:36)
	at com.carrotsearch.randomizedtesting.ThreadLeakControl$StatementRunner.run(ThreadLeakControl.java:358)
	at java.lang.Thread.run(Thread.java:722)
Caused by: java.lang.RuntimeException: REQUEST FAILED: xpath=(/response/arr[@name='fields']/lst/str[@name='name'])[1] = 'custstopfilt'
	xml response was: <?xml version="1.0" encoding="UTF-8"?>
<response>

<lst name="responseHeader">
  <int name="status">0</int>
  <int name="QTime">3</int>
</lst>
<arr name="fields">
  <lst>
    <str name="name">porterfilt</str>
    <str name="type">porterfilt</str>
    <bool name="stored">true</bool>
    <bool name="indexed">true</bool>
  </lst>
  <lst>
    <str name="name">copyfield_source</str>
    <str name="type">string</str>
    <bool name="stored">true</bool>
    <bool name="indexed">true</bool>
    <bool name="multiValued">true</bool>
  </lst>
  <lst>
    <str name="name">uniq2</str>
    <str name="type">string</str>
    <bool name="stored">true</bool>
    <bool name="indexed">true</bool>
    <bool name="multiValued">true</bool>
  </lst>
  <lst>
    <str name="name">custengporterfilt</str>
    <str name="type">custengporterfilt</str>
    <bool name="stored">true</bool>
    <bool name="indexed">true</bool>
  </lst>
  <lst>
    <str name="name">weight</str>
    <str name="type">float</str>
    <bool name="stored">true</bool>
    <bool name="indexed">true</bool>
  </lst>
  <lst>
    <str name="name">uniq3</str>
    <str name="type">string</str>
    <bool name="stored">true</bool>
    <bool name="indexed">true</bool>
  </lst>
  <lst>
    <str name="name">lowertok</str>
    <str name="type">lowertok</str>
    <bool name="stored">true</bool>
    <bool name="indexed">true</bool>
  </lst>
  <lst>
    <str name="name">bsto</str>
    <str name="type">boolean</str>
    <bool name="stored">true</bool>
    <bool name="indexed">false</bool>
  </lst>
  <lst>
    <str name="name">numericsubword</str>
    <str name="type">numericsubword</str>
    <bool name="stored">true</bool>
    <bool name="indexed">true</bool>
  </lst>
  <lst>
    <str name="name">nouniq</str>
    <str name="type">string</str>
    <bool name="stored">true</bool>
    <bool name="indexed">true</bool>
    <bool name="multiValued">true</bool>
  </lst>
  <lst>
    <str name="name">nullfirst</str>
    <str name="type">string</str>
    <bool name="stored">true</bool>
    <bool name="sortMissingFirst">true</bool>
    <bool name="indexed">true</bool>
  </lst>
  <lst>
    <str name="name">name</str>
    <str name="type">nametext</str>
    <bool name="stored">true</bool>
    <bool name="indexed">true</bool>
  </lst>
  <lst>
    <str name="name">wdf_nocase</str>
    <str name="type">wdf_nocase</str>
    <bool name="stored">true</bool>
    <bool name="indexed">true</bool>
  </lst>
  <lst>
    <str name="name">numberpartfail</str>
    <str name="type">failtype1</str>
    <bool name="stored">true</bool>
    <bool name="indexed">true</bool>
  </lst>
  <lst>
    <str name="name">ssto</str>
    <str name="type">string</str>
    <bool name="stored">true</bool>
    <bool name="indexed">false</bool>
  </lst>
  <lst>
    <str name="name">sku2</str>
    <str name="type">skutype2</str>
    <bool name="stored">true</bool>
    <bool name="indexed">true</bool>
  </lst>
  <lst>
    <str name="name">wdf_preserve</str>
    <str name="type">wdf_preserve</str>
    <bool name="stored">true</bool>
    <bool name="indexed">true</bool>
  </lst>
  <lst>
    <str name="name">keywordtok</str>
    <str name="type">keywordtok</str>
    <bool name="stored">true</bool>
    <bool name="indexed">true</bool>
  </lst>
  <lst>
    <str name="name">store</str>
    <str name="type">location</str>
    <bool name="stored">true</bool>
    <bool name="indexed">true</bool>
  </lst>
  <lst>
    <str name="name">HTMLwhitetok</str>
    <str name="type">HTMLwhitetok</str>
    <bool name="stored">true</bool>
    <bool name="indexed">true</bool>
  </lst>
  <lst>
    <str name="name">sind</str>
    <str name="type">string</str>
    <bool name="stored">false</bool>
    <bool name="indexed">true</bool>
  </lst>
  <lst>
    <str name="name">title_stemmed</str>
    <str name="type">text</str>
    <bool name="stored">false</bool>
    <bool name="indexed">true</bool>
  </lst>
  <lst>
    <str name="name">custstopfilt</str>
    <str name="type">custstopfilt</str>
    <bool name="stored">true</bool>
    <bool name="indexed">true</bool>
  </lst>
  <lst>
    <str name="name">test_notv</str>
    <str name="type">text</str>
    <bool name="termVectors">false</bool>
  </lst>
  <lst>
    <str name="name">bday</str>
    <str name="type">date</str>
    <bool name="stored">true</bool>
    <bool name="indexed">true</bool>
  </lst>
  <lst>
    <str name="name">test_postv</str>
    <str name="type">text</str>
    <bool name="termPositions">true</bool>
    <bool name="termVectors">true</bool>
  </lst>
  <lst>
    <str name="name">title</str>
    <str name="type">nametext</str>
    <bool name="stored">true</bool>
    <bool name="indexed">true</bool>
  </lst>
  <lst>
    <str name="name">point</str>
    <str name="type">xy</str>
    <bool name="stored">true</bool>
    <bool name="indexed">true</bool>
    <bool name="multiValued">false</bool>
  </lst>
  <lst>
    <str name="name">shouldbeunstored</str>
    <str name="type">unstored</str>
  </lst>
  <lst>
    <str name="name">isto</str>
    <str name="type">int</str>
    <bool name="stored">true</bool>
    <bool name="indexed">false</bool>
  </lst>
  <lst>
    <str name="name">standardfilt</str>
    <str name="type">standardfilt</str>
    <bool name="stored">true</bool>
    <bool name="indexed">true</bool>
  </lst>
  <lst>
    <str name="name">standardtokfilt</str>
    <str name="type">standardtokfilt</str>
    <bool name="stored">true</bool>
    <bool name="indexed">true</bool>
  </lst>
  <lst>
    <str name="name">test_posofftv</str>
    <str name="type">text</str>
    <bool name="termOffsets">true</bool>
    <bool name="termPositions">true</bool>
    <bool name="termVectors">true</bool>
  </lst>
  <lst>
    <str name="name">id</str>
    <str name="type">string</str>
    <bool name="stored">true</bool>
    <bool name="required">true</bool>
    <bool name="indexed">true</bool>
    <bool name="multiValued">false</bool>
    <bool name="uniqueKey">true</bool>
  </lst>
  <lst>
    <str name="name">pointD</str>
    <str name="type">xyd</str>
    <bool name="stored">true</bool>
    <bool name="indexed">true</bool>
    <bool name="multiValued">false</bool>
  </lst>
  <lst>
    <str name="name">timestamp</str>
    <str name="type">date</str>
    <bool name="stored">true</bool>
    <bool name="indexed">true</bool>
  </lst>
  <lst>
    <str name="name">subject</str>
    <str name="type">text</str>
    <bool name="stored">true</bool>
    <bool name="indexed">true</bool>
  </lst>
  <lst>
    <str name="name">lowerfilt</str>
    <str name="type">lowerfilt</str>
    <bool name="stored">true</bool>
    <bool name="indexed">true</bool>
  </lst>
  <lst>
    <str name="name">iind</str>
    <str name="type">int</str>
    <bool name="stored">false</bool>
    <bool name="indexed">true</bool>
  </lst>
  <lst>
    <str name="name">text_np</str>
    <str name="type">text_np</str>
    <bool name="stored">false</bool>
    <bool name="indexed">true</bool>
  </lst>
  <lst>
    <str name="name">test_basictv</str>
    <str name="type">text</str>
    <bool name="termVectors">true</bool>
  </lst>
  <lst>
    <str name="name">sindsto</str>
    <str name="type">string</str>
    <bool name="stored">true</bool>
    <bool name="indexed">true</bool>
  </lst>
  <lst>
    <str name="name">syn</str>
    <str name="type">syn</str>
    <bool name="stored">true</bool>
    <bool name="indexed">true</bool>
  </lst>
  <lst>
    <str name="name">stopfilt</str>
    <str name="type">stopfilt</str>
    <bool name="stored">true</bool>
    <bool name="indexed">true</bool>
  </lst>
  <lst>
    <str name="name">HTMLstandardtok</str>
    <str name="type">HTMLstandardtok</str>
    <bool name="stored">true</bool>
    <bool name="indexed">true</bool>
  </lst>
  <lst>
    <str name="name">whitetok</str>
    <str name="type">whitetok</str>
    <bool name="stored">true</bool>
    <bool name="indexed">true</bool>
  </lst>
  <lst>
    <str name="name">test_hlt_off</str>
    <str name="type">highlittext</str>
    <bool name="compressed">false</bool>
    <bool name="indexed">true</bool>
  </lst>
  <lst>
    <str name="name">signatureField</str>
    <str name="type">string</str>
    <bool name="stored">false</bool>
    <bool name="indexed">true</bool>
  </lst>
  <lst>
    <str name="name">title_lettertok</str>
    <str name="type">lettertok</str>
    <bool name="stored">false</bool>
    <bool name="indexed">true</bool>
  </lst>
  <lst>
    <str name="name">sku1</str>
    <str name="type">skutype1</str>
    <bool name="stored">true</bool>
    <bool name="indexed">true</bool>
  </lst>
  <lst>
    <str name="name">textgap</str>
    <str name="type">textgap</str>
    <bool name="stored">true</bool>
    <bool name="indexed">true</bool>
  </lst>
  <lst>
    <str name="name">test_offtv</str>
    <str name="type">text</str>
    <bool name="termOffsets">true</bool>
    <bool name="termVectors">true</bool>
  </lst>
  <lst>
    <str name="name">uniq</str>
    <str name="type">string</str>
    <bool name="stored">true</bool>
    <bool name="indexed">true</bool>
    <bool name="multiValued">true</bool>
  </lst>
  <lst>
    <str name="name">uuid</str>
    <str name="type">uuid</str>
    <bool name="stored">true</bool>
  </lst>
  <lst>
    <str name="name">shouldbeunindexed</str>
    <str name="type">unstored</str>
    <bool name="stored">true</bool>
    <bool name="indexed">false</bool>
  </lst>
  <lst>
    <str name="name">teststop</str>
    <str name="type">teststop</str>
    <bool name="stored">true</bool>
    <bool name="indexed">true</bool>
  </lst>
  <lst>
    <str name="name">point_hash</str>
    <str name="type">geohash</str>
    <bool name="stored">true</bool>
    <bool name="indexed">true</bool>
    <bool name="multiValued">false</bool>
  </lst>
  <lst>
    <str name="name">lengthfilt</str>
    <str name="type">lengthfilt</str>
    <bool name="stored">true</bool>
    <bool name="indexed">true</bool>
  </lst>
  <lst>
    <str name="name">patternreplacefilt</str>
    <str name="type">patternreplacefilt</str>
    <bool name="stored">true</bool>
    <bool name="indexed">true</bool>
  </lst>
  <lst>
    <str name="name">subword</str>
    <str name="type">subword</str>
    <bool name="stored">true</bool>
    <bool name="indexed">true</bool>
  </lst>
  <lst>
    <str name="name">bind</str>
    <str name="type">boolean</str>
    <bool name="stored">false</bool>
    <bool name="indexed">true</bool>
  </lst>
  <lst>
    <str name="name">_version_</str>
    <str name="type">long</str>
    <bool name="stored">true</bool>
    <bool name="indexed">true</bool>
  </lst>
  <lst>
    <str name="name">standardtok</str>
    <str name="type">standardtok</str>
    <bool name="stored">true</bool>
    <bool name="indexed">true</bool>
  </lst>
  <lst>
    <str name="name">shouldbestored</str>
    <str name="type">unstored</str>
    <bool name="stored">true</bool>
  </lst>
  <lst>
    <str name="name">lettertok</str>
    <str name="type">lettertok</str>
    <bool name="stored">true</bool>
    <bool name="indexed">true</bool>
  </lst>
  <lst>
    <str name="name">dedup</str>
    <str name="type">dedup</str>
    <bool name="stored">true</bool>
    <bool name="indexed">true</bool>
  </lst>
  <lst>
    <str name="name">engporterfilt</str>
    <str name="type">engporterfilt</str>
    <bool name="stored">true</bool>
    <bool name="indexed">true</bool>
  </lst>
  <lst>
    <str name="name">bindsto</str>
    <str name="type">boolean</str>
    <bool name="stored">true</bool>
    <bool name="indexed">true</bool>
  </lst>
  <lst>
    <str name="name">protectedsubword</str>
    <str name="type">protectedsubword</str>
    <bool name="stored">true</bool>
    <bool name="indexed">true</bool>
  </lst>
  <lst>
    <str name="name">test_hlt</str>
    <str name="type">highlittext</str>
    <bool name="compressed">true</bool>
    <bool name="indexed">true</bool>
  </lst>
  <lst>
    <str name="name">text</str>
    <str name="type">text</str>
    <bool name="stored">false</bool>
    <bool name="indexed">true</bool>
    <bool name="multiValued">true</bool>
  </lst>
</arr>
</response>

	request was:/schema/fields?indent=on&wt=xml
	at org.apache.solr.util.RestTestBase.assertQ(RestTestBase.java:136)
	... 41 more




Build Log:
[...truncated 8957 lines...]
[junit4:junit4] Suite: org.apache.solr.rest.TestFieldCollectionResource
[junit4:junit4]   2> 1 T144 oas.SolrJettyTestBase.beforeSolrJettyTestBase Randomized ssl (false) and clientAuth (false)
[junit4:junit4]   2> 3 T144 oas.SolrTestCaseJ4.initCore ####initCore
[junit4:junit4]   2> Creating dataDir: /mnt/ssd/jenkins/workspace/Lucene-Solr-trunk-Linux/solr/build/solr-core/test/J1/./solrtest-TestFieldCollectionResource-1362586541941
[junit4:junit4]   2> 3 T144 oas.SolrTestCaseJ4.initCore ####initCore end
[junit4:junit4]   2> 4 T144 oejs.Server.doStart jetty-8.1.8.v20121106
[junit4:junit4]   2> 9 T144 oejs.AbstractConnector.doStart Started SelectChannelConnector@127.0.0.1:35064
[junit4:junit4]   2> 10 T144 oass.SolrDispatchFilter.init SolrDispatchFilter.init()
[junit4:junit4]   2> 10 T144 oasc.SolrResourceLoader.locateSolrHome JNDI not configured for solr (NoInitialContextEx)
[junit4:junit4]   2> 11 T144 oasc.SolrResourceLoader.locateSolrHome using system property solr.solr.home: /mnt/ssd/jenkins/workspace/Lucene-Solr-trunk-Linux/solr/build/solr-core/test-files/solr
[junit4:junit4]   2> 11 T144 oasc.CoreContainer$Initializer.initialize looking for solr config file: /mnt/ssd/jenkins/workspace/Lucene-Solr-trunk-Linux/solr/build/solr-core/test-files/solr/solr.xml
[junit4:junit4]   2> 11 T144 oasc.CoreContainer.<init> New CoreContainer 1317710472
[junit4:junit4]   2> 11 T144 oasc.CoreContainer.load Loading CoreContainer using Solr Home: '/mnt/ssd/jenkins/workspace/Lucene-Solr-trunk-Linux/solr/build/solr-core/test-files/solr/'
[junit4:junit4]   2> 12 T144 oasc.SolrResourceLoader.<init> new SolrResourceLoader for directory: '/mnt/ssd/jenkins/workspace/Lucene-Solr-trunk-Linux/solr/build/solr-core/test-files/solr/'
[junit4:junit4]   2> 30 T144 oashc.HttpShardHandlerFactory.getParameter Setting socketTimeout to: 120000
[junit4:junit4]   2> 31 T144 oashc.HttpShardHandlerFactory.getParameter Setting urlScheme to: http://
[junit4:junit4]   2> 31 T144 oashc.HttpShardHandlerFactory.getParameter Setting connTimeout to: 15000
[junit4:junit4]   2> 31 T144 oashc.HttpShardHandlerFactory.getParameter Setting maxConnectionsPerHost to: 20
[junit4:junit4]   2> 31 T144 oashc.HttpShardHandlerFactory.getParameter Setting corePoolSize to: 0
[junit4:junit4]   2> 32 T144 oashc.HttpShardHandlerFactory.getParameter Setting maximumPoolSize to: 2147483647
[junit4:junit4]   2> 32 T144 oashc.HttpShardHandlerFactory.getParameter Setting maxThreadIdleTime to: 5
[junit4:junit4]   2> 32 T144 oashc.HttpShardHandlerFactory.getParameter Setting sizeOfQueue to: -1
[junit4:junit4]   2> 32 T144 oashc.HttpShardHandlerFactory.getParameter Setting fairnessPolicy to: false
[junit4:junit4]   2> 33 T144 oascsi.HttpClientUtil.createClient Creating new http client, config:maxConnectionsPerHost=20&maxConnections=10000&socketTimeout=120000&connTimeout=15000&retry=false
[junit4:junit4]   2> 45 T144 oasc.CoreContainer.load Registering Log Listener
[junit4:junit4]   2> 65 T154 oasc.CoreContainer.create Creating SolrCore 'collection1' using instanceDir: /mnt/ssd/jenkins/workspace/Lucene-Solr-trunk-Linux/solr/build/solr-core/test-files/solr/collection1
[junit4:junit4]   2> 65 T154 oasc.SolrResourceLoader.<init> new SolrResourceLoader for directory: '/mnt/ssd/jenkins/workspace/Lucene-Solr-trunk-Linux/solr/build/solr-core/test-files/solr/collection1/'
[junit4:junit4]   2> 66 T154 oasc.SolrResourceLoader.replaceClassLoader Adding 'file:/mnt/ssd/jenkins/workspace/Lucene-Solr-trunk-Linux/solr/build/solr-core/test-files/solr/collection1/lib/README' to classloader
[junit4:junit4]   2> 66 T154 oasc.SolrResourceLoader.replaceClassLoader Adding 'file:/mnt/ssd/jenkins/workspace/Lucene-Solr-trunk-Linux/solr/build/solr-core/test-files/solr/collection1/lib/classes/' to classloader
[junit4:junit4]   2> 110 T154 oasc.SolrConfig.<init> Using Lucene MatchVersion: LUCENE_50
[junit4:junit4]   2> 149 T154 oasc.SolrConfig.<init> Loaded SolrConfig: solrconfig.xml
[junit4:junit4]   2> 150 T154 oass.IndexSchema.readSchema Reading Solr Schema
[junit4:junit4]   2> 154 T154 oass.IndexSchema.readSchema Schema name=test-rest
[junit4:junit4]   2> 436 T154 oass.IndexSchema.readSchema default search field in schema is text
[junit4:junit4]   2> 438 T154 oass.IndexSchema.readSchema unique key field: id
[junit4:junit4]   2> 440 T154 oass.IndexSchema.readSchema WARNING Field title is not multivalued and destination for multiple copyFields (3)
[junit4:junit4]   2> 453 T154 oasc.SolrCore.<init> [collection1] Opening new SolrCore at /mnt/ssd/jenkins/workspace/Lucene-Solr-trunk-Linux/solr/build/solr-core/test-files/solr/collection1/, dataDir=/mnt/ssd/jenkins/workspace/Lucene-Solr-trunk-Linux/solr/build/solr-core/test/J1/solrtest-TestFieldCollectionResource-1362586541941/
[junit4:junit4]   2> 453 T154 oasc.JmxMonitoredMap.<init> JMX monitoring is enabled. Adding Solr mbeans to JMX Server: com.sun.jmx.mbeanserver.JmxMBeanServer@39a1c73b
[junit4:junit4]   2> 454 T154 oasc.SolrCore.initDirectoryFactory org.apache.solr.core.MockDirectoryFactory
[junit4:junit4]   2> 454 T154 oasc.CachingDirectoryFactory.get return new directory for /mnt/ssd/jenkins/workspace/Lucene-Solr-trunk-Linux/solr/build/solr-core/test/J1/solrtest-TestFieldCollectionResource-1362586541941 forceNew:false
[junit4:junit4]   2> 455 T154 oasc.CachingDirectoryFactory.close Releasing directory:/mnt/ssd/jenkins/workspace/Lucene-Solr-trunk-Linux/solr/build/solr-core/test/J1/solrtest-TestFieldCollectionResource-1362586541941
[junit4:junit4]   2> 455 T154 oasc.SolrCore.getNewIndexDir New index directory detected: old=null new=/mnt/ssd/jenkins/workspace/Lucene-Solr-trunk-Linux/solr/build/solr-core/test/J1/solrtest-TestFieldCollectionResource-1362586541941/index/
[junit4:junit4]   2> 455 T154 oasc.SolrCore.initIndex WARNING [collection1] Solr index directory '/mnt/ssd/jenkins/workspace/Lucene-Solr-trunk-Linux/solr/build/solr-core/test/J1/solrtest-TestFieldCollectionResource-1362586541941/index' doesn't exist. Creating new index...
[junit4:junit4]   2> 456 T154 oasc.CachingDirectoryFactory.get return new directory for /mnt/ssd/jenkins/workspace/Lucene-Solr-trunk-Linux/solr/build/solr-core/test/J1/solrtest-TestFieldCollectionResource-1362586541941/index forceNew:false
[junit4:junit4]   2> 457 T154 oasc.SolrDeletionPolicy.onCommit SolrDeletionPolicy.onCommit: commits:num=1
[junit4:junit4]   2> 		commit{dir=RateLimitedDirectoryWrapper(MockDirWrapper(org.apache.lucene.store.RAMDirectory@11032d07 lockFactory=org.apache.lucene.store.NativeFSLockFactory@5d37a749)),segFN=segments_1,generation=1,filenames=[segments_1]
[junit4:junit4]   2> 458 T154 oasc.SolrDeletionPolicy.updateCommits newest commit = 1[segments_1]
[junit4:junit4]   2> 458 T154 oasc.CachingDirectoryFactory.close Releasing directory:/mnt/ssd/jenkins/workspace/Lucene-Solr-trunk-Linux/solr/build/solr-core/test/J1/solrtest-TestFieldCollectionResource-1362586541941/index
[junit4:junit4]   2> 458 T154 oasc.SolrCore.initWriters created xml: solr.XMLResponseWriter
[junit4:junit4]   2> 460 T154 oasup.UpdateRequestProcessorChain.init inserting DistributedUpdateProcessorFactory into updateRequestProcessorChain "dedupe"
[junit4:junit4]   2> 461 T154 oasup.UpdateRequestProcessorChain.init inserting DistributedUpdateProcessorFactory into updateRequestProcessorChain "dedupe-allfields"
[junit4:junit4]   2> 461 T154 oasup.UpdateRequestProcessorChain.init inserting DistributedUpdateProcessorFactory into updateRequestProcessorChain "stored_sig"
[junit4:junit4]   2> 461 T154 oasup.UpdateRequestProcessorChain.init inserting DistributedUpdateProcessorFactory into updateRequestProcessorChain "uniq-fields"
[junit4:junit4]   2> 462 T154 oasup.UpdateRequestProcessorChain.init inserting DistributedUpdateProcessorFactory into updateRequestProcessorChain "distrib-dup-test-chain-implicit"
[junit4:junit4]   2> 462 T154 oasc.RequestHandlers.initHandlersFromConfig adding lazy requestHandler: solr.ReplicationHandler
[junit4:junit4]   2> 462 T154 oasc.RequestHandlers.initHandlersFromConfig created /replication: solr.ReplicationHandler
[junit4:junit4]   2> 463 T154 oasc.RequestHandlers.initHandlersFromConfig created standard: solr.StandardRequestHandler
[junit4:junit4]   2> 463 T154 oasc.RequestHandlers.initHandlersFromConfig created /get: solr.RealTimeGetHandler
[junit4:junit4]   2> 464 T154 oasc.RequestHandlers.initHandlersFromConfig created dismax: solr.SearchHandler
[junit4:junit4]   2> 464 T154 oasc.RequestHandlers.initHandlersFromConfig created mock: org.apache.solr.core.MockQuerySenderListenerReqHandler
[junit4:junit4]   2> 465 T154 oasc.RequestHandlers.initHandlersFromConfig created /admin/: org.apache.solr.handler.admin.AdminHandlers
[junit4:junit4]   2> 465 T154 oasc.RequestHandlers.initHandlersFromConfig created defaults: solr.StandardRequestHandler
[junit4:junit4]   2> 465 T154 oasc.RequestHandlers.initHandlersFromConfig adding lazy requestHandler: solr.StandardRequestHandler
[junit4:junit4]   2> 466 T154 oasc.RequestHandlers.initHandlersFromConfig created lazy: solr.StandardRequestHandler
[junit4:junit4]   2> 466 T154 oasc.RequestHandlers.initHandlersFromConfig created /update: solr.UpdateRequestHandler
[junit4:junit4]   2> 467 T154 oasc.RequestHandlers.initHandlersFromConfig created /terms: org.apache.solr.handler.component.SearchHandler
[junit4:junit4]   2> 467 T154 oasc.RequestHandlers.initHandlersFromConfig created spellCheckCompRH: org.apache.solr.handler.component.SearchHandler
[junit4:junit4]   2> 467 T154 oasc.RequestHandlers.initHandlersFromConfig created spellCheckCompRH_Direct: org.apache.solr.handler.component.SearchHandler
[junit4:junit4]   2> 468 T154 oasc.RequestHandlers.initHandlersFromConfig created spellCheckWithWordbreak: org.apache.solr.handler.component.SearchHandler
[junit4:junit4]   2> 468 T154 oasc.RequestHandlers.initHandlersFromConfig created spellCheckWithWordbreak_Direct: org.apache.solr.handler.component.SearchHandler
[junit4:junit4]   2> 469 T154 oasc.RequestHandlers.initHandlersFromConfig created spellCheckCompRH1: org.apache.solr.handler.component.SearchHandler
[junit4:junit4]   2> 469 T154 oasc.RequestHandlers.initHandlersFromConfig created mltrh: org.apache.solr.handler.component.SearchHandler
[junit4:junit4]   2> 470 T154 oasc.RequestHandlers.initHandlersFromConfig created tvrh: org.apache.solr.handler.component.SearchHandler
[junit4:junit4]   2> 470 T154 oasc.RequestHandlers.initHandlersFromConfig created /mlt: solr.MoreLikeThisHandler
[junit4:junit4]   2> 471 T154 oasc.RequestHandlers.initHandlersFromConfig created /debug/dump: solr.DumpRequestHandler
[junit4:junit4]   2> 474 T154 oashl.XMLLoader.init xsltCacheLifetimeSeconds=60
[junit4:junit4]   2> 476 T154 oasc.SolrCore.initDeprecatedSupport WARNING solrconfig.xml uses deprecated <admin/gettableFiles>, Please update your config to use the ShowFileRequestHandler.
[junit4:junit4]   2> 478 T154 oasc.SolrCore.initDeprecatedSupport WARNING adding ShowFileRequestHandler with hidden files: [SCHEMA-BINARYFIELD.XML, STOP-2.TXT, HUNSPELL-TEST.AFF, SOLRCONFIG-FUNCTIONQUERY.XML, BAD-SCHEMA-CURRENCY-FT-MULTIVALUED.XML, SCHEMA-SNIPPET-FIELD.XML, STOPWORDS.TXT, BAD-SCHEMA-UNIQUEKEY-MULTIVALUED.XML, SOLRCONFIG-ENABLEPLUGIN.XML, FUZZYSUGGEST.TXT, SCHEMA-DOCVALUES.XML, ADDFIELDS.UPDATEPROCESSOR.JS, BAD-SCHEMA-ANALYZER-CLASS-AND-NESTED.XML, SCHEMA-REPLICATION1.XML, BAD-SCHEMA-UNIQUEKEY-IS-COPYFIELD-DEST.XML, BAD-SCHEMA-NOT-INDEXED-BUT-POS.XML, STOPTYPES-1.TXT, HUNSPELL-TEST.DIC, SOLRCONFIG-LAZYWRITER.XML, XSLT, BAD-SCHEMA-OMIT-TF-BUT-NOT-POS.XML, SCHEMASURROUND.XML, SOLRCONFIG-SLAVE.XML, BAD-CURRENCY.XML, SOLRCONFIG-SIMPLELOCK.XML, BAD-SCHEMA-DUP-FIELDTYPE.XML, BAD-SOLRCONFIG-INVALID-SCRIPTFILE.XML, SOLRCONFIG-TRANSFORMERS.XML, SOLRCONFIG-MASTER2.XML, PHRASESUGGEST.TXT, BAD-SCHEMA-UNSUPPORTED-DOCVALUES.XML, MISSING.FUNCTIONS.UPDATEPROCESSOR.JS, SOLRCONFIG-INDEXCONFIG.XML, SOLRCONFIG-SPELLCHECKER.XML, SCHEMA15.XML, SOLRCONFIG-QUERYSENDER-NOQUERY.XML, STOPWORDSWRONGENCODING.TXT, HYPHENATION.DTD, BAD-SCHEMA-SWEETSPOT-PARTIAL-BASELINE.XML, SCHEMA-DOCVALUESMULTI.XML, SCHEMA-DFR.XML, BAD-SCHEMA-CURRENCY-FT-OER-NORATES.XML, CONDITIONAL.UPDATEPROCESSOR.JS, BAD-SCHEMA-NOT-INDEXED-BUT-NORMS.XML, STOP-1.TXT, SOLRCONFIG-SCRIPT-UPDATEPROCESSOR.XML, BAD-SCHEMA-SWEETSPOT-BOTH-TF.XML, SOLRCONFIG-DELPOLICY2.XML, SOLRCONFIG-HIGHLIGHT.XML, SOLRCONFIG_CODEC.XML, SOLRCONFIG-ALTDIRECTORY.XML, SOLRCONFIG-XINCLUDE.XML, STOPTYPES-2.TXT, STOP-SNOWBALL.TXT, KEEP-1.TXT, BAD-SCHEMA-CODEC-GLOBAL-VS-FT-MISMATCH.XML, MAPPING-ISOLATIN1ACCENT.TXT, BAD-SCHEMA-NOT-INDEXED-BUT-TF.XML, SOLRCONFIG-SOLR-749.XML, SCHEMA-SNIPPET-TYPE.XML, SCHEMA-SYNONYM-TOKENIZER.XML, BAD-SCHEMA-NONTEXT-ANALYZER.XML, SOLRCONFIG-ELEVATE.XML, COMPOUNDDICTIONARY.TXT, SOLRCONFIG-SOLCOREPROPERTIES.XML, SOLRCONFIG-MASTER1-KEEPONEBACKUP.XML, SOLRCONFIG-PHRASESUGGEST.XML, SOLRCONFIG-TERMINDEX.XML, SCHEMA-DOCVALUESFACETING.XML, BAD-SCHEMA-CURRENCY-FT-BOGUS-DEFAULT-CODE.XML, SCHEMA-MINIMAL.XML, SOLRCONFIG-RESPONSE-LOG-COMPONENT.XML, SOLRCONFIG-COMPONENTS-NAME.XML, THROW.ERROR.ON.ADD.UPDATEPROCESSOR.JS, BAD-SCHEMA-DUP-DYNAMICFIELD.XML, SCHEMA-SPATIAL.XML, REGEX-BOOST-PROCESSOR-TEST.TXT, SOLRCONFIG-MASTER.XML, SCHEMA-CHARFILTERS.XML, TRIVIAL.UPDATEPROCESSOR0.JS, SCHEMA-SIM.XML, SCHEMA-NUMERIC.XML, ELEVATE.XML, SOLRCONFIG-MERGEPOLICY.XML, SCHEMA-LMDIRICHLET.XML, SOLRCONFIG-SPELLCHECKCOMPONENT.XML, SCHEMA-SWEETSPOT.XML, SCHEMA-LMJELINEKMERCER.XML, SOLRCONFIG_PERF.XML, SOLRCONFIG-SLAVE1.XML, SCHEMA-REPLICATION2.XML, SOLRCONFIG-REQHANDLER.INCL, SCHEMA12.XML, SCHEMA-PHRASESUGGEST.XML, SCHEMA_CODEC.XML, WDFTYPES.TXT, SCHEMA-BEHAVIOR.XML, BAD-MP-SOLRCONFIG.XML, SOLRCONFIG-NOCACHE.XML, BAD-SCHEMA-UNIQUEKEY-USES-DEFAULT.XML, SOLRCONFIG-TLOG.XML, SCHEMA11.XML, SCHEMA-IB.XML, SCHEMA-NOT-REQUIRED-UNIQUE-KEY.XML, OPEN-EXCHANGE-RATES.JSON, SCHEMA-TFIDF.XML, SCHEMA-COLLATE.XML, BAD-SCHEMA-SIM-GLOBAL-VS-FT-MISMATCH.XML, OLD_SYNONYMS.TXT, SOLRCONFIG-DELPOLICY1.XML, SCHEMA-SPELLCHECKER.XML, CURRENCY.XML, SCHEMA-FOLDING.XML, SCHEMA-REVERSED.XML, SOLRCONFIG-CACHING.XML, SCHEMA-STOP-KEEP.XML, SCHEMA-TRIE.XML, BAD-SCHEMA-DUP-FIELD.XML, BAD_SOLRCONFIG.XML, BAD-SCHEMA-DOCVALUES-NOT-REQUIRED-NO-DEFAULT.XML, SCHEMA-POSTINGSHIGHLIGHT.XML, DA_COMPOUNDDICTIONARY.TXT, BAD-SCHEMA-CURRENCY-FT-BOGUS-CODE-IN-XML.XML, BAD-SCHEMA-CURRENCY-MULTIVALUED.XML, SOLRCONFIG-POSTINGSHIGHLIGHT.XML, SOLRCONFIG-UPDATE-PROCESSOR-CHAINS.XML, DA_UTF8.XML, BAD-SCHEMA-EXTERNAL-FILEFIELD.XML, SCHEMA-TINY.XML, JASUGGEST.TXT, SOLRCONFIG-REPEATER.XML, BAD-SCHEMA-SWEETSPOT-PARTIAL-HYPERBOLIC.XML, TRIVIAL.UPDATEPROCESSOR1.JS, BAD-SOLRCONFIG-BOGUS-SCRIPTENGINE-NAME.XML, SOLRCONFIG-NATIVELOCK.XML, SYNONYMS.TXT, STEMDICT.TXT, BAD-SCHEMA-CURRENCY-DYNAMIC-MULTIVALUED.XML, SCHEMA-BM25.XML, SOLRCONFIG-PROPINJECT-INDEXDEFAULT.XML, SCHEMA-EFF.XML, SOLRCONFIG-SNIPPET-PROCESSOR.XML, SOLRCONFIG-QUERYSENDER.XML, SCHEMA-COPYFIELD-TEST.XML, SCHEMA-LUCENEMATCHVERSION.XML, SOLRCONFIG-MASTER3.XML, PROTWORDS.TXT, KEEP-2.TXT, STOPWITHBOM.TXT, SCHEMA-REST.XML, MISSLEADING.EXTENSION.UPDATEPROCESSOR.JS.TXT, BAD-SOLRCONFIG-MISSING-SCRIPTFILE.XML, SCHEMA-REQUIRED-FIELDS.XML, FRENCHARTICLES.TXT, SCHEMA-XINCLUDE.XML, SOLRCONFIG-MINIMAL.XML, SOLRCONFIG-MASTER1.XML, SOLRCONFIG-PROPINJECT.XML, SOLRCONFIG-BASIC.XML, BAD-SCHEMA-SWEETSPOT-PARTIAL-NORMS.XML]
[junit4:junit4]   2> 480 T154 oasc.CachingDirectoryFactory.close Releasing directory:/mnt/ssd/jenkins/workspace/Lucene-Solr-trunk-Linux/solr/build/solr-core/test/J1/solrtest-TestFieldCollectionResource-1362586541941
[junit4:junit4]   2> 480 T154 oass.SolrIndexSearcher.<init> Opening Searcher@4a1a3e3f main
[junit4:junit4]   2> 480 T154 oasu.CommitTracker.<init> Hard AutoCommit: disabled
[junit4:junit4]   2> 481 T154 oasu.CommitTracker.<init> Soft AutoCommit: disabled
[junit4:junit4]   2> 481 T154 oashc.SpellCheckComponent.inform Initializing spell checkers
[junit4:junit4]   2> 624 T154 oass.DirectSolrSpellChecker.init init: {name=direct,classname=DirectSolrSpellChecker,field=lowerfilt,minQueryLength=3}
[junit4:junit4]   2> 652 T155 oasc.SolrCore.registerSearcher [collection1] Registered new searcher Searcher@4a1a3e3f main{StandardDirectoryReader(segments_1:1)}
[junit4:junit4]   2> 658 T154 oasc.CoreContainer.registerCore registering core: collection1
[junit4:junit4]   2> 658 T144 oass.SolrDispatchFilter.init user.dir=/mnt/ssd/jenkins/workspace/Lucene-Solr-trunk-Linux/solr/build/solr-core/test/J1
[junit4:junit4]   2> 659 T144 oass.SolrDispatchFilter.init SolrDispatchFilter.init() done
[junit4:junit4]   2> 659 T144 oas.SolrJettyTestBase.createJetty Jetty Assigned Port#35064
[junit4:junit4]   2> 665 T144 oas.SolrTestCaseJ4.setUp ###Starting testJsonGetAllFields
[junit4:junit4]   2> ASYNC  NEW_CORE C30 name=collection1 org.apache.solr.core.SolrCore@4bec3040
[junit4:junit4]   2> 896 T151 C30 oejsh.ContextHandler$Context.log SchemaRestApi: [Restlet] Attaching application: org.apache.solr.rest.SchemaRestApi@454d6eeb to URI: /solr/schema
[junit4:junit4]   2> 925 T151 C30 oasr.SchemaRestApi.createInboundRoot createInboundRoot started
[junit4:junit4]   2> 938 T151 C30 oasr.SchemaRestApi.createInboundRoot createInboundRoot complete
[junit4:junit4]   2> 964 T151 C30 oasr.BaseSchemaResource.handlePostExecution [collection1] webapp=/solr path=/schema/fields params={indent=on&wt=json} status=0 QTime=293 
[junit4:junit4]   2> 988 T151 C30 orel.LogFilter.afterHandle 2013-03-07	00:15:42	127.0.0.1	-	127.0.0.1	35064	GET	/solr/schema/fields	indent=on&wt=json	200	-	0	51	http://127.0.0.1:35064	Java/1.8.0-ea	-
[junit4:junit4]   2> 1073 T144 oasu.RestTestBase.assertJQ SEVERE query failed JSON validation. error=mismatch: 'custstopfilt'!='porterfilt' @ fields/[0]/name
[junit4:junit4]   2> 	 expected =/fields/[0]/name=="custstopfilt"
[junit4:junit4]   2> 	 response = {
[junit4:junit4]   2> 	  "responseHeader":{
[junit4:junit4]   2> 	    "status":0,
[junit4:junit4]   2> 	    "QTime":293},
[junit4:junit4]   2> 	  "fields":[{
[junit4:junit4]   2> 	      "name":"porterfilt",
[junit4:junit4]   2> 	      "type":"porterfilt",
[junit4:junit4]   2> 	      "stored":true,
[junit4:junit4]   2> 	      "indexed":true},
[junit4:junit4]   2> 	    {
[junit4:junit4]   2> 	      "name":"copyfield_source",
[junit4:junit4]   2> 	      "type":"string",
[junit4:junit4]   2> 	      "stored":true,
[junit4:junit4]   2> 	      "indexed":true,
[junit4:junit4]   2> 	      "multiValued":true},
[junit4:junit4]   2> 	    {
[junit4:junit4]   2> 	      "name":"uniq2",
[junit4:junit4]   2> 	      "type":"string",
[junit4:junit4]   2> 	      "stored":true,
[junit4:junit4]   2> 	      "indexed":true,
[junit4:junit4]   2> 	      "multiValued":true},
[junit4:junit4]   2> 	    {
[junit4:junit4]   2> 	      "name":"custengporterfilt",
[junit4:junit4]   2> 	      "type":"custengporterfilt",
[junit4:junit4]   2> 	      "stored":true,
[junit4:junit4]   2> 	      "indexed":true},
[junit4:junit4]   2> 	    {
[junit4:junit4]   2> 	      "name":"weight",
[junit4:junit4]   2> 	      "type":"float",
[junit4:junit4]   2> 	      "stored":true,
[junit4:junit4]   2> 	      "indexed":true},
[junit4:junit4]   2> 	    {
[junit4:junit4]   2> 	      "name":"uniq3",
[junit4:junit4]   2> 	      "type":"string",
[junit4:junit4]   2> 	      "stored":true,
[junit4:junit4]   2> 	      "indexed":true},
[junit4:junit4]   2> 	    {
[junit4:junit4]   2> 	      "name":"lowertok",
[junit4:junit4]   2> 	      "type":"lowertok",
[junit4:junit4]   2> 	      "stored":true,
[junit4:junit4]   2> 	      "indexed":true},
[junit4:junit4]   2> 	    {
[junit4:junit4]   2> 	      "name":"bsto",
[junit4:junit4]   2> 	      "type":"boolean",
[junit4:junit4]   2> 	      "stored":true,
[junit4:junit4]   2> 	      "indexed":false},
[junit4:junit4]   2> 	    {
[junit4:junit4]   2> 	      "name":"numericsubword",
[junit4:junit4]   2> 	      "type":"numericsubword",
[junit4:junit4]   2> 	      "stored":true,
[junit4:junit4]   2> 	      "indexed":true},
[junit4:junit4]   2> 	    {
[junit4:junit4]   2> 	      "name":"nouniq",
[junit4:junit4]   2> 	      "type":"string",
[junit4:junit4]   2> 	      "stored":true,
[junit4:junit4]   2> 	      "indexed":true,
[junit4:junit4]   2> 	      "multiValued":true},
[junit4:junit4]   2> 	    {
[junit4:junit4]   2> 	      "name":"nullfirst",
[junit4:junit4]   2> 	      "type":"string",
[junit4:junit4]   2> 	      "stored":true,
[junit4:junit4]   2> 	      "sortMissingFirst":true,
[junit4:junit4]   2> 	      "indexed":true},
[junit4:junit4]   2> 	    {
[junit4:junit4]   2> 	      "name":"name",
[junit4:junit4]   2> 	      "type":"nametext",
[junit4:junit4]   2> 	      "stored":true,
[junit4:junit4]   2> 	      "indexed":true},
[junit4:junit4]   2> 	    {
[junit4:junit4]   2> 	      "name":"wdf_nocase",
[junit4:junit4]   2> 	      "type":"wdf_nocase",
[junit4:junit4]   2> 	      "stored":true,
[junit4:junit4]   2> 	      "indexed":true},
[junit4:junit4]   2> 	    {
[junit4:junit4]   2> 	      "name":"numberpartfail",
[junit4:junit4]   2> 	      "type":"failtype1",
[junit4:junit4]   2> 	      "stored":true,
[junit4:junit4]   2> 	      "indexed":true},
[junit4:junit4]   2> 	    {
[junit4:junit4]   2> 	      "name":"ssto",
[junit4:junit4]   2> 	      "type":"string",
[junit4:junit4]   2> 	      "stored":true,
[junit4:junit4]   2> 	      "indexed":false},
[junit4:junit4]   2> 	    {
[junit4:junit4]   2> 	      "name":"sku2",
[junit4:junit4]   2> 	      "type":"skutype2",
[junit4:junit4]   2> 	      "stored":true,
[junit4:junit4]   2> 	      "indexed":true},
[junit4:junit4]   2> 	    {
[junit4:junit4]   2> 	      "name":"wdf_preserve",
[junit4:junit4]   2> 	      "type":"wdf_preserve",
[junit4:junit4]   2> 	      "stored":true,
[junit4:junit4]   2> 	      "indexed":true},
[junit4:junit4]   2> 	    {
[junit4:junit4]   2> 	      "name":"keywordtok",
[junit4:junit4]   2> 	      "type":"keywordtok",
[junit4:junit4]   2> 	      "stored":true,
[junit4:junit4]   2> 	      "indexed":true},
[junit4:junit4]   2> 	    {
[junit4:junit4]   2> 	      "name":"store",
[junit4:junit4]   2> 	      "type":"location",
[junit4:junit4]   2> 	      "stored":true,
[junit4:junit4]   2> 	      "indexed":true},
[junit4:junit4]   2> 	    {
[junit4:junit4]   2> 	      "name":"HTMLwhitetok",
[junit4:junit4]   2> 	      "type":"HTMLwhitetok",
[junit4:junit4]   2> 	      "stored":true,
[junit4:junit4]   2> 	      "indexed":true},
[junit4:junit4]   2> 	    {
[junit4:junit4]   2> 	      "name":"sind",
[junit4:junit4]   2> 	      "type":"string",
[junit4:junit4]   2> 	      "stored":false,
[junit4:junit4]   2> 	      "indexed":true},
[junit4:junit4]   2> 	    {
[junit4:junit4]   2> 	      "name":"title_stemmed",
[junit4:junit4]   2> 	      "type":"text",
[junit4:junit4]   2> 	      "stored":false,
[junit4:junit4]   2> 	      "indexed":true},
[junit4:junit4]   2> 	    {
[junit4:junit4]   2> 	      "name":"custstopfilt",
[junit4:junit4]   2> 	      "type":"custstopfilt",
[junit4:junit4]   2> 	      "stored":true,
[junit4:junit4]   2> 	      "indexed":true},
[junit4:junit4]   2> 	    {
[junit4:junit4]   2> 	      "name":"test_notv",
[junit4:junit4]   2> 	      "type":"text",
[junit4:junit4]   2> 	      "termVectors":false},
[junit4:junit4]   2> 	    {
[junit4:junit4]   2> 	      "name":"bday",
[junit4:junit4]   2> 	      "type":"date",
[junit4:junit4]   2> 	      "stored":true,
[junit4:junit4]   2> 	      "indexed":true},
[junit4:junit4]   2> 	    {
[junit4:junit4]   2> 	      "name":"test_postv",
[junit4:junit4]   2> 	      "type":"text",
[junit4:junit4]   2> 	      "termPositions":true,
[junit4:junit4]   2> 	      "termVectors":true},
[junit4:junit4]   2> 	    {
[junit4:junit4]   2> 	      "name":"title",
[junit4:junit4]   2> 	      "type":"nametext",
[junit4:junit4]   2> 	      "stored":true,
[junit4:junit4]   2> 	      "indexed":true},
[junit4:junit4]   2> 	    {
[junit4:junit4]   2> 	      "name":"point",
[junit4:junit4]   2> 	      "type":"xy",
[junit4:junit4]   2> 	      "stored":true,
[junit4:junit4]   2> 	      "indexed":true,
[junit4:junit4]   2> 	      "multiValued":false},
[junit4:junit4]   2> 	    {
[junit4:junit4]   2> 	      "name":"shouldbeunstored",
[junit4:junit4]   2> 	      "type":"unstored"},
[junit4:junit4]   2> 	    {
[junit4:junit4]   2> 	      "name":"isto",
[junit4:junit4]   2> 	      "type":"int",
[junit4:junit4]   2> 	      "stored":true,
[junit4:junit4]   2> 	      "indexed":false},
[junit4:junit4]   2> 	    {
[junit4:junit4]   2> 	      "name":"standardfilt",
[junit4:junit4]   2> 	      "type":"standardfilt",
[junit4:junit4]   2> 	      "stored":true,
[junit4:junit4]   2> 	      "indexed":true},
[junit4:junit4]   2> 	    {
[junit4:junit4]   2> 	      "name":"standardtokfilt",
[junit4:junit4]   2> 	      "type":"standardtokfilt",
[junit4:junit4]   2> 	      "stored":true,
[junit4:junit4]   2> 	      "indexed":true},
[junit4:junit4]   2> 	    {
[junit4:junit4]   2> 	      "name":"test_posofftv",
[junit4:junit4]   2> 	      "type":"text",
[junit4:junit4]   2> 	      "termOffsets":true,
[junit4:junit4]   2> 	      "termPositions":true,
[junit4:junit4]   2> 	      "termVectors":true},
[junit4:junit4]   2> 	    {
[junit4:junit4]   2> 	      "name":"id",
[junit4:junit4]   2> 	      "type":"string",
[junit4:junit4]   2> 	      "stored":true,
[junit4:junit4]   2> 	      "required":true,
[junit4:junit4]   2> 	      "indexed":true,
[junit4:junit4]   2> 	      "multiValued":false,
[junit4:junit4]   2> 	      "uniqueKey":true},
[junit4:junit4]   2> 	    {
[junit4:junit4]   2> 	      "name":"pointD",
[junit4:junit4]   2> 	      "type":"xyd",
[junit4:junit4]   2> 	      "stored":true,
[junit4:junit4]   2> 	      "indexed":true,
[junit4:junit4]   2> 	      "multiValued":false},
[junit4:junit4]   2> 	    {
[junit4:junit4]   2> 	      "name":"timestamp",
[junit4:junit4]   2> 	      "type":"date",
[junit4:junit4]   2> 	      "stored":true,
[junit4:junit4]   2> 	      "indexed":true},
[junit4:junit4]   2> 	    {
[junit4:junit4]   2> 	      "name":"subject",
[junit4:junit4]   2> 	      "type":"text",
[junit4:junit4]   2> 	      "stored":true,
[junit4:junit4]   2> 	      "indexed":true},
[junit4:junit4]   2> 	    {
[junit4:junit4]   2> 	      "name":"lowerfilt",
[junit4:junit4]   2> 	      "type":"lowerfilt",
[junit4:junit4]   2> 	      "stored":true,
[junit4:junit4]   2> 	      "indexed":true},
[junit4:junit4]   2> 	    {
[junit4:junit4]   2> 	      "name":"iind",
[junit4:junit4]   2> 	      "type":"int",
[junit4:junit4]   2> 	      "stored":false,
[junit4:junit4]   2> 	      "indexed":true},
[junit4:junit4]   2> 	    {
[junit4:junit4]   2> 	      "name":"text_np",
[junit4:junit4]   2> 	      "type":"text_np",
[junit4:junit4]   2> 	      "stored":false,
[junit4:junit4]   2> 	      "indexed":true},
[junit4:junit4]   2> 	    {
[junit4:junit4]   2> 	      "name":"test_basictv",
[junit4:junit4]   2> 	      "type":"text",
[junit4:junit4]   2> 	      "termVectors":true},
[junit4:junit4]   2> 	    {
[junit4:junit4]   2> 	      "name":"sindsto",
[junit4:junit4]   2> 	      "type":"string",
[junit4:junit4]   2> 	      "stored":true,
[junit4:junit4]   2> 	      "indexed":true},
[junit4:junit4]   2> 	    {
[junit4:junit4]   2> 	      "name":"syn",
[junit4:junit4]   2> 	      "type":"syn",
[junit4:junit4]   2> 	      "stored":true,
[junit4:junit4]   2> 	      "indexed":true},
[junit4:junit4]   2> 	    {
[junit4:junit4]   2> 	      "name":"stopfilt",
[junit4:junit4]   2> 	      "type":"stopfilt",
[junit4:junit4]   2> 	      "stored":true,
[junit4:junit4]   2> 	      "indexed":true},
[junit4:junit4]   2> 	    {
[junit4:junit4]   2> 	      "name":"HTMLstandardtok",
[junit4:junit4]   2> 	      "type":"HTMLstandardtok",
[junit4:junit4]   2> 	      "stored":true,
[junit4:junit4]   2> 	      "indexed":true},
[junit4:junit4]   2> 	    {
[junit4:junit4]   2> 	      "name":"whitetok",
[junit4:junit4]   2> 	      "type":"whitetok",
[junit4:junit4]   2> 	      "stored":true,
[junit4:junit4]   2> 	      "indexed":true},
[junit4:junit4]   2> 	    {
[junit4:junit4]   2> 	      "name":"test_hlt_off",
[junit4:junit4]   2> 	      "type":"highlittext",
[junit4:junit4]   2> 	      "compressed":false,
[junit4:junit4]   2> 	      "indexed":true},
[junit4:junit4]   2> 	    {
[junit4:junit4]   2> 	      "name":"signatureField",
[junit4:junit4]   2> 	      "type":"string",
[junit4:junit4]   2> 	      "stored":false,
[junit4:junit4]   2> 	      "indexed":true},
[junit4:junit4]   2> 	    {
[junit4:junit4]   2> 	      "name":"title_lettertok",
[junit4:junit4]   2> 	      "type":"lettertok",
[junit4:junit4]   2> 	      "stored":false,
[junit4:junit4]   2> 	      "indexed":true},
[junit4:junit4]   2> 	    {
[junit4:junit4]   2> 	      "name":"sku1",
[junit4:junit4]   2> 	      "type":"skutype1",
[junit4:junit4]   2> 	      "stored":true,
[junit4:junit4]   2> 	      "indexed":true},
[junit4:junit4]   2> 	    {
[junit4:junit4]   2> 	      "name":"textgap",
[junit4:junit4]   2> 	      "type":"textgap",
[junit4:junit4]   2> 	      "stored":true,
[junit4:junit4]   2> 	      "indexed":true},
[junit4:junit4]   2> 	    {
[junit4:junit4]   2> 	      "name":"test_offtv",
[junit4:junit4]   2> 	      "type":"text",
[junit4:junit4]   2> 	      "termOffsets":true,
[junit4:junit4]   2> 	      "termVectors":true},
[junit4:junit4]   2> 	    {
[junit4:junit4]   2> 	      "name":"uniq",
[junit4:junit4]   2> 	      "type":"string",
[junit4:junit4]   2> 	      "stored":true,
[junit4:junit4]   2> 	      "indexed":true,
[junit4:junit4]   2> 	      "multiValued":true},
[junit4:junit4]   2> 	    {
[junit4:junit4]   2> 	      "name":"uuid",
[junit4:junit4]   2> 	      "type":"uuid",
[junit4:junit4]   2> 	      "stored":true},
[junit4:junit4]   2> 	    {
[junit4:junit4]   2> 	      "name":"shouldbeunindexed",
[junit4:junit4]   2> 	      "type":"unstored",
[junit4:junit4]   2> 	      "stored":true,
[junit4:junit4]   2> 	      "indexed":false},
[junit4:junit4]   2> 	    {
[junit4:junit4]   2> 	      "name":"teststop",
[junit4:junit4]   2> 	      "type":"teststop",
[junit4:junit4]   2> 	      "stored":true,
[junit4:junit4]   2> 	      "indexed":true},
[junit4:junit4]   2> 	    {
[junit4:junit4]   2> 	      "name":"point_hash",
[junit4:junit4]   2> 	      "type":"geohash",
[junit4:junit4]   2> 	      "stored":true,
[junit4:junit4]   2> 	      "indexed":true,
[junit4:junit4]   2> 	      "multiValued":false},
[junit4:junit4]   2> 	    {
[junit4:junit4]   2> 	      "name":"lengthfilt",
[junit4:junit4]   2> 	      "type":"lengthfilt",
[junit4:junit4]   2> 	      "stored":true,
[junit4:junit4]   2> 	      "indexed":true},
[junit4:junit4]   2> 	    {
[junit4:junit4]   2> 	      "name":"patternreplacefilt",
[junit4:junit4]   2> 	      "type":"patternreplacefilt",
[junit4:junit4]   2> 	      "stored":true,
[junit4:junit4]   2> 	      "indexed":true},
[junit4:junit4]   2> 	    {
[junit4:junit4]   2> 	      "name":"subword",
[junit4:junit4]   2> 	      "type":"subword",
[junit4:junit4]   2> 	      "stored":true,
[junit4:junit4]   2> 	      "indexed":true},
[junit4:junit4]   2> 	    {
[junit4:junit4]   2> 	      "name":"bind",
[junit4:junit4]   2> 	      "type":"boolean",
[junit4:junit4]   2> 	      "stored":false,
[junit4:junit4]   2> 	      "indexed":true},
[junit4:junit4]   2> 	    {
[junit4:junit4]   2> 	      "name":"_version_",
[junit4:junit4]   2> 	      "type":"long",
[junit4:junit4]   2> 	      "stored":true,
[junit4:junit4]   2> 	      "indexed":true},
[junit4:junit4]   2> 	    {
[junit4:junit4]   2> 	      "name":"standardtok",
[junit4:junit4]   2> 	      "type":"standardtok",
[junit4:junit4]   2> 	      "stored":true,
[junit4:junit4]   2> 	      "indexed":true},
[junit4:junit4]   2> 	    {
[junit4:junit4]   2> 	      "name":"shouldbestored",
[junit4:junit4]   2> 	      "type":"unstored",
[junit4:junit4]   2> 	      "stored":true},
[junit4:junit4]   2> 	    {
[junit4:junit4]   2> 	      "name":"lettertok",
[junit4:junit4]   2> 	      "type":"lettertok",
[junit4:junit4]   2> 	      "stored":true,
[junit4:junit4]   2> 	      "indexed":true},
[junit4:junit4]   2> 	    {
[junit4:junit4]   2> 	      "name":"dedup",
[junit4:junit4]   2> 	      "type":"dedup",
[junit4:junit4]   2> 	      "stored":true,
[junit4:junit4]   2> 	      "indexed":true},
[junit4:junit4]   2> 	    {
[junit4:junit4]   2> 	      "name":"engporterfilt",
[junit4:junit4]   2> 	      "type":"engporterfilt",
[junit4:junit4]   2> 	      "stored":true,
[junit4:junit4]   2> 	      "indexed":true},
[junit4:junit4]   2> 	    {
[junit4:junit4]   2> 	      "name":"bindsto",
[junit4:junit4]   2> 	      "type":"boolean",
[junit4:junit4]   2> 	      "stored":true,
[junit4:junit4]   2> 	      "indexed":true},
[junit4:junit4]   2> 	    {
[junit4:junit4]   2> 	      "name":"protectedsubword",
[junit4:junit4]   2> 	      "type":"protectedsubword",
[junit4:junit4]   2> 	      "stored":true,
[junit4:junit4]   2> 	      "indexed":true},
[junit4:junit4]   2> 	    {
[junit4:junit4]   2> 	      "name":"test_hlt",
[junit4:junit4]   2> 	      "type":"highlittext",
[junit4:junit4]   2> 	      "compressed":true,
[junit4:junit4]   2> 	      "indexed":true},
[junit4:junit4]   2> 	    {
[junit4:junit4]   2> 	      "name":"text",
[junit4:junit4]   2> 	      "type":"text",
[junit4:junit4]   2> 	      "stored":false,
[junit4:junit4]   2> 	      "indexed":true,
[junit4:junit4]   2> 	      "multiValued":true}]}
[junit4:junit4]   2> 	
[junit4:junit4]   2> 	 request = /schema/fields?indent=on&wt=json
[junit4:junit4]   2> 	
[junit4:junit4]   2> 1075 T144 oas.SolrTestCaseJ4.tearDown ###Ending testJsonGetAllFields
[junit4:junit4]   2> NOTE: reproduce with: ant test  -Dtestcase=TestFieldCollectionResource -Dtests.method=testJsonGetAllFields -Dtests.seed=187A56FCA9BB0EAD -Dtests.multiplier=3 -Dtests.slow=true -Dtests.locale=en_IE -Dtests.timezone=Asia/Macao -Dtests.file.encoding=UTF-8
[junit4:junit4] ERROR   0.42s J1 | TestFieldCollectionResource.testJsonGetAllFields <<<
[junit4:junit4]    > Throwable #1: java.lang.RuntimeException: mismatch: 'custstopfilt'!='porterfilt' @ fields/[0]/name
[junit4:junit4]    > 	at __randomizedtesting.SeedInfo.seed([187A56FCA9BB0EAD:917A24700908428B]:0)
[junit4:junit4]    > 	at org.apache.solr.util.RestTestBase.assertJQ(RestTestBase.java:242)
[junit4:junit4]    > 	at org.apache.solr.util.RestTestBase.assertJQ(RestTestBase.java:186)
[junit4:junit4]    > 	at org.apache.solr.rest.TestFieldCollectionResource.testJsonGetAllFields(TestFieldCollectionResource.java:50)
[junit4:junit4]    > 	at sun.reflect.NativeMethodAccessorImpl.invoke0(Native Method)
[junit4:junit4]    > 	at sun.reflect.NativeMethodAccessorImpl.invoke(NativeMethodAccessorImpl.java:57)
[junit4:junit4]    > 	at sun.reflect.DelegatingMethodAccessorImpl.invoke(DelegatingMethodAccessorImpl.java:43)
[junit4:junit4]    > 	at java.lang.reflect.Method.invoke(Method.java:487)
[junit4:junit4]    > 	at com.carrotsearch.randomizedtesting.RandomizedRunner.invoke(RandomizedRunner.java:1559)
[junit4:junit4]    > 	at com.carrotsearch.randomizedtesting.RandomizedRunner.access$600(RandomizedRunner.java:79)
[junit4:junit4]    > 	at com.carrotsearch.randomizedtesting.RandomizedRunner$6.evaluate(RandomizedRunner.java:737)
[junit4:junit4]    > 	at com.carrotsearch.randomizedtesting.RandomizedRunner$7.evaluate(RandomizedRunner.java:773)
[junit4:junit4]    > 	at com.carrotsearch.randomizedtesting.RandomizedRunner$8.evaluate(RandomizedRunner.java:787)
[junit4:junit4]    > 	at com.carrotsearch.randomizedtesting.rules.SystemPropertiesRestoreRule$1.evaluate(SystemPropertiesRestoreRule.java:53)
[junit4:junit4]    > 	at org.apache.lucene.util.TestRuleSetupTeardownChained$1.evaluate(TestRuleSetupTeardownChained.java:50)
[junit4:junit4]    > 	at org.apache.lucene.util.TestRuleFieldCacheSanity$1.evaluate(TestRuleFieldCacheSanity.java:51)
[junit4:junit4]    > 	at org.apache.lucene.util.AbstractBeforeAfterRule$1.evaluate(AbstractBeforeAfterRule.java:46)
[junit4:junit4]    > 	at com.carrotsearch.randomizedtesting.rules.SystemPropertiesInvariantRule$1.evaluate(SystemPropertiesInvariantRule.java:55)
[junit4:junit4]    > 	at org.apache.lucene.util.TestRuleThreadAndTestName$1.evaluate(TestRuleThreadAndTestName.java:49)
[junit4:junit4]    > 	at org.apache.lucene.util.TestRuleIgnoreAfterMaxFailures$1.evaluate(TestRuleIgnoreAfterMaxFailures.java:70)
[junit4:junit4]    > 	at org.apache.lucene.util.TestRuleMarkFailure$1.evaluate(TestRuleMarkFailure.java:48)
[junit4:junit4]    > 	at com.carrotsearch.randomizedtesting.rules.StatementAdapter.evaluate(StatementAdapter.java:36)
[junit4:junit4]    > 	at com.carrotsearch.randomizedtesting.ThreadLeakControl$StatementRunner.run(ThreadLeakControl.java:358)
[junit4:junit4]    > 	at com.carrotsearch.randomizedtesting.ThreadLeakControl.forkTimeoutingTask(ThreadLeakControl.java:782)
[junit4:junit4]    > 	at com.carrotsearch.randomizedtesting.ThreadLeakControl$3.evaluate(ThreadLeakControl.java:442)
[junit4:junit4]    > 	at com.carrotsearch.randomizedtesting.RandomizedRunner.runSingleTest(RandomizedRunner.java:746)
[junit4:junit4]    > 	at com.carrotsearch.randomizedtesting.RandomizedRunner$3.evaluate(RandomizedRunner.java:648)
[junit4:junit4]    > 	at com.carrotsearch.randomizedtesting.RandomizedRunner$4.evaluate(RandomizedRunner.java:682)
[junit4:junit4]    > 	at com.carrotsearch.randomizedtesting.RandomizedRunner$5.evaluate(RandomizedRunner.java:693)
[junit4:junit4]    > 	at com.carrotsearch.randomizedtesting.rules.StatementAdapter.evaluate(StatementAdapter.java:36)
[junit4:junit4]    > 	at com.carrotsearch.randomizedtesting.rules.SystemPropertiesRestoreRule$1.evaluate(SystemPropertiesRestoreRule.java:53)
[junit4:junit4]    > 	at org.apache.lucene.util.AbstractBeforeAfterRule$1.evaluate(AbstractBeforeAfterRule.java:46)
[junit4:junit4]    > 	at org.apache.lucene.util.TestRuleStoreClassName$1.evaluate(TestRuleStoreClassName.java:42)
[junit4:junit4]    > 	at com.carrotsearch.randomizedtesting.rules.SystemPropertiesInvariantRule$1.evaluate(SystemPropertiesInvariantRule.java:55)
[junit4:junit4]    > 	at com.carrotsearch.randomizedtesting.rules.NoShadowingOrOverridesOnMethodsRule$1.evaluate(NoShadowingOrOverridesOnMethodsRule.java:39)
[junit4:junit4]    > 	at com.carrotsearch.randomizedtesting.rules.NoShadowingOrOverridesOnMethodsRule$1.evaluate(NoShadowingOrOverridesOnMethodsRule.java:39)
[junit4:junit4]    > 	at com.carrotsearch.randomizedtesting.rules.StatementAdapter.evaluate(StatementAdapter.java:36)
[junit4:junit4]    > 	at org.apache.lucene.util.TestRuleAssertionsRequired$1.evaluate(TestRuleAssertionsRequired.java:43)
[junit4:junit4]    > 	at org.apache.lucene.util.TestRuleMarkFailure$1.evaluate(TestRuleMarkFailure.java:48)
[junit4:junit4]    > 	at org.apache.lucene.util.TestRuleIgnoreAfterMaxFailures$1.evaluate(TestRuleIgnoreAfterMaxFailures.java:70)
[junit4:junit4]    > 	at org.apache.lucene.util.TestRuleIgnoreTestSuites$1.evaluate(TestRuleIgnoreTestSuites.java:55)
[junit4:junit4]    > 	at com.carrotsearch.randomizedtesting.rules.StatementAdapter.evaluate(StatementAdapter.java:36)
[junit4:junit4]    > 	at com.carrotsearch.randomizedtesting.ThreadLeakControl$StatementRunner.run(ThreadLeakControl.java:358)
[junit4:junit4]    > 	at java.lang.Thread.run(Thread.java:722)
[junit4:junit4]   2> 1088 T144 oas.SolrTestCaseJ4.setUp ###Starting testGetAllFields
[junit4:junit4]   2> 1093 T150 C30 oasr.BaseSchemaResource.handlePostExecution [collection1] webapp=/solr path=/schema/fields params={indent=on&wt=xml} status=0 QTime=3 
[junit4:junit4]   2> 1094 T150 C30 orel.LogFilter.afterHandle 2013-03-07	00:15:43	127.0.0.1	-	127.0.0.1	35064	GET	/solr/schema/fields	indent=on&wt=xml	200	-	0	4	http://127.0.0.1:35064	Java/1.8.0-ea	-
[junit4:junit4]   2> 1146 T144 oasu.RestTestBase.assertQ SEVERE REQUEST FAILED: xpath=(/response/arr[@name='fields']/lst/str[@name='name'])[1] = 'custstopfilt'
[junit4:junit4]   2> 		xml response was: <?xml version="1.0" encoding="UTF-8"?>
[junit4:junit4]   2> 	<response>
[junit4:junit4]   2> 	
[junit4:junit4]   2> 	<lst name="responseHeader">
[junit4:junit4]   2> 	  <int name="status">0</int>
[junit4:junit4]   2> 	  <int name="QTime">3</int>
[junit4:junit4]   2> 	</lst>
[junit4:junit4]   2> 	<arr name="fields">
[junit4:junit4]   2> 	  <lst>
[junit4:junit4]   2> 	    <str name="name">porterfilt</str>
[junit4:junit4]   2> 	    <str name="type">porterfilt</str>
[junit4:junit4]   2> 	    <bool name="stored">true</bool>
[junit4:junit4]   2> 	    <bool name="indexed">true</bool>
[junit4:junit4]   2> 	  </lst>
[junit4:junit4]   2> 	  <lst>
[junit4:junit4]   2> 	    <str name="name">copyfield_source</str>
[junit4:junit4]   2> 	    <str name="type">string</str>
[junit4:junit4]   2> 	    <bool name="stored">true</bool>
[junit4:junit4]   2> 	    <bool name="indexed">true</bool>
[junit4:junit4]   2> 	    <bool name="multiValued">true</bool>
[junit4:junit4]   2> 	  </lst>
[junit4:junit4]   2> 	  <lst>
[junit4:junit4]   2> 	    <str name="name">uniq2</str>
[junit4:junit4]   2> 	    <str name="type">string</str>
[junit4:junit4]   2> 	    <bool name="stored">true</bool>
[junit4:junit4]   2> 	    <bool name="indexed">true</bool>
[junit4:junit4]   2> 	    <bool name="multiValued">true</bool>
[junit4:junit4]   2> 	  </lst>
[junit4:junit4]   2> 	  <lst>
[junit4:junit4]   2> 	    <str name="name">custengporterfilt</str>
[junit4:junit4]   2> 	    <str name="type">custengporterfilt</str>
[junit4:junit4]   2> 	    <bool name="stored">true</bool>
[junit4:junit4]   2> 	    <bool name="indexed">true</bool>
[junit4:junit4]   2> 	  </lst>
[junit4:junit4]   2> 	  <lst>
[junit4:junit4]   2> 	    <str name="name">weight</str>
[junit4:junit4]   2> 	    <str name="type">float</str>
[junit4:junit4]   2> 	    <bool name="stored">true</bool>
[junit4:junit4]   2> 	    <bool name="indexed">true</bool>
[junit4:junit4]   2> 	  </lst>
[junit4:junit4]   2> 	  <lst>
[junit4:junit4]   2> 	    <str name="name">uniq3</str>
[junit4:junit4]   2> 	    <str name="type">string</str>
[junit4:junit4]   2> 	    <bool name="stored">true</bool>
[junit4:junit4]   2> 	    <bool name="indexed">true</bool>
[junit4:junit4]   2> 	  </lst>
[junit4:junit4]   2> 	  <lst>
[junit4:junit4]   2> 	    <str name="name">lowertok</str>
[junit4:junit4]   2> 	    <str name="type">lowertok</str>
[junit4:junit4]   2> 	    <bool name="stored">true</bool>
[junit4:junit4]   2> 	    <bool name="indexed">true</bool>
[junit4:junit4]   2> 	  </lst>
[junit4:junit4]   2> 	  <lst>
[junit4:junit4]   2> 	    <str name="name">bsto</str>
[junit4:junit4]   2> 	    <str name="type">boolean</str>
[junit4:junit4]   2> 	    <bool name="stored">true</bool>
[junit4:junit4]   2> 	    <bool name="indexed">false</bool>
[junit4:junit4]   2> 	  </lst>
[junit4:junit4]   2> 	  <lst>
[junit4:junit4]   2> 	    <str name="name">numericsubword</str>
[junit4:junit4]   2> 	    <str name="type">numericsubword</str>
[junit4:junit4]   2> 	    <bool name="stored">true</bool>
[junit4:junit4]   2> 	    <bool name="indexed">true</bool>
[junit4:junit4]   2> 	  </lst>
[junit4:junit4]   2> 	  <lst>
[junit4:junit4]   2> 	    <str name="name">nouniq</str>
[junit4:junit4]   2> 	    <str name="type">string</str>
[junit4:junit4]   2> 	    <bool name="stored">true</bool>
[junit4:junit4]   2> 	    <bool name="indexed">true</bool>
[junit4:junit4]   2> 	    <bool name="multiValued">true</bool>
[junit4:junit4]   2> 	  </lst>
[junit4:junit4]   2> 	  <lst>
[junit4:junit4]   2> 	    <str name="name">nullfirst</str>
[junit4:junit4]   2> 	    <str name="type">string</str>
[junit4:junit4]   2> 	    <bool name="stored">true</bool>
[junit4:junit4]   2> 	    <bool name="sortMissingFirst">true</bool>
[junit4:junit4]   2> 	    <bool name="indexed">true</bool>
[junit4:junit4]   2> 	  </lst>
[junit4:junit4]   2> 	  <lst>
[junit4:junit4]   2> 	    <str name="name">name</str>
[junit4:junit4]   2> 	    <str name="type">nametext</str>
[junit4:junit4]   2> 	    <bool name="stored">true</bool>
[junit4:junit4]   2> 	    <bool name="indexed">true</bool>
[junit4:junit4]   2> 	  </lst>
[junit4:junit4]   2> 	  <lst>
[junit4:junit4]   2> 	    <str name="name">wdf_nocase</str>
[junit4:junit4]   2> 	    <str name="type">wdf_nocase</str>
[junit4:junit4]   2> 	    <bool name="stored">true</bool>
[junit4:junit4]   2> 	    <bool name="indexed">true</bool>
[junit4:junit4]   2> 	  </lst>
[junit4:junit4]   2> 	  <lst>
[junit4:junit4]   2> 	    <str name="name">numberpartfail</str>
[junit4:junit4]   2> 	    <str name="type">failtype1</str>
[junit4:junit4]   2> 	    <bool name="stored">true</bool>
[junit4:junit4]   2> 	    <bool name="indexed">true</bool>
[junit4:junit4]   2> 	  </lst>
[junit4:junit4]   2> 	  <lst>
[junit4:junit4]   2> 	    <str name="name">ssto</str>
[junit4:junit4]   2> 	    <str name="type">string</str>
[junit4:junit4]   2> 	    <bool name="stored">true</bool>
[junit4:junit4]   2> 	    <bool name="indexed">false</bool>
[junit4:junit4]   2> 	  </lst>
[junit4:junit4]   2> 	  <lst>
[junit4:junit4]   2> 	    <str name="name">sku2</str>
[junit4:junit4]   2> 	    <str name="type">skutype2</str>
[junit4:junit4]   2> 	    <bool name="stored">true</bool>
[junit4:junit4]   2> 	    <bool name="indexed">true</bool>
[junit4:junit4]   2> 	  </lst>
[junit4:junit4]   2> 	  <lst>
[junit4:junit4]   2> 	    <str name="name">wdf_preserve</str>
[junit4:junit4]   2> 	    <str name="type">wdf_preserve</str>
[junit4:junit4]   2> 	    <bool name="stored">true</bool>
[junit4:junit4]   2> 	    <bool name="indexed">true</bool>
[junit4:junit4]   2> 	  </lst>
[junit4:junit4]   2> 	  <lst>
[junit4:junit4]   2> 	    <str name="name">keywordtok</str>
[junit4:junit4]   2> 	    <str name="type">keywordtok</str>
[junit4:junit4]   2> 	    <bool name="stored">true</bool>
[junit4:junit4]   2> 	    <bool name="indexed">true</bool>
[junit4:junit4]   2> 	  </lst>
[junit4:junit4]   2> 	  <lst>
[junit4:junit4]   2> 	    <str name="name">store</str>
[junit4:junit4]   2> 	    <str name="type">location</str>
[junit4:junit4]   2> 	    <bool name="stored">true</bool>
[junit4:junit4]   2> 	    <bool name="indexed">true</bool>
[junit4:junit4]   2> 	  </lst>
[junit4:junit4]   2> 	  <lst>
[junit4:junit4]   2> 	    <str name="name">HTMLwhitetok</str>
[junit4:junit4]   2> 	    <str name="type">HTMLwhitetok</str>
[junit4:junit4]   2> 	    <bool name="stored">true</bool>
[junit4:junit4]   2> 	    <bool name="indexed">true</bool>
[junit4:junit4]   2> 	  </lst>
[junit4:junit4]   2> 	  <lst>
[junit4:junit4]   2> 	    <str name="name">sind</str>
[junit4:junit4]   2> 	    <str name="type">string</str>
[junit4:junit4]   2> 	    <bool name="stored">false</bool>
[junit4:junit4]   2> 	    <bool name="indexed">true</bool>
[junit4:junit4]   2> 	  </lst>
[junit4:junit4]   2> 	  <lst>
[junit4:junit4]   2> 	    <str name="name">title_stemmed</str>
[junit4:junit4]   2> 	    <str name="type">text</str>
[junit4:junit4]   2> 	    <bool name="stored">false</bool>
[junit4:junit4]   2> 	    <bool name="indexed">true</bool>
[junit4:junit4]   2> 	  </lst>
[junit4:junit4]   2> 	  <lst>
[junit4:junit4]   2> 	    <str name="name">custstopfilt</str>
[junit4:junit4]   2> 	    <str name="type">custstopfilt</str>
[junit4:junit4]   2> 	    <bool name="stored">true</bool>
[junit4:junit4]   2> 	    <bool name="indexed">true</bool>
[junit4:junit4]   2> 	  </lst>
[junit4:junit4]   2> 	  <lst>
[junit4:junit4]   2> 	    <str name="name">test_notv</str>
[junit4:junit4]   2> 	    <str name="type">text</str>
[junit4:junit4]   2> 	    <bool name="termVectors">false</bool>
[junit4:junit4]   2> 	  </lst>
[junit4:junit4]   2> 	  <lst>
[junit4:junit4]   2> 	    <str name="name">bday</str>
[junit4:junit4]   2> 	    <str name="type">date</str>
[junit4:junit4]   2> 	    <bool name="stored">true</bool>
[junit4:junit4]   2> 	    <bool name="indexed">true</bool>
[junit4:junit4]   2> 	  </lst>
[junit4:junit4]   2> 	  <lst>
[junit4:junit4]   2> 	    <str name="name">test_postv</str>
[junit4:junit4]   2> 	    <str name="type">text</str>
[junit4:junit4]   2> 	    <bool name="termPositions">true</bool>
[junit4:junit4]   2> 	    <bool name="termVectors">true</bool>
[junit4:junit4]   2> 	  </lst>
[junit4:junit4]   2> 	  <lst>
[junit4:junit4]   2> 	    <str name="name">title</str>
[junit4:junit4]   2> 	    <str name="type">nametext</str>
[junit4:junit4]   2> 	    <bool name="stored">true</bool>
[junit4:junit4]   2> 	    <bool name="indexed">true</bool>
[junit4:junit4]   2> 	  </lst>
[junit4:junit4]   2> 	  <lst>
[junit4:junit4]   2> 	    <str name="name">point</str>
[junit4:junit4]   2> 	    <str name="type">xy</str>
[junit4:junit4]   2> 	    <bool name="stored">true</bool>
[junit4:junit4]   2> 	    <bool name="indexed">true</bool>
[junit4:junit4]   2> 	    <bool name="multiValued">false</bool>
[junit4:junit4]   2> 	  </lst>
[junit4:junit4]   2> 	  <lst>
[junit4:junit4]   2> 	    <str name="name">shouldbeunstored</str>
[junit4:junit4]   2> 	    <str name="type">unstored</str>
[junit4:junit4]   2> 	  </lst>
[junit4:junit4]   2> 	  <lst>
[junit4:junit4]   2> 	    <str name="name">isto</str>
[junit4:junit4]   2> 	    <str name="type">int</str>
[junit4:junit4]   2> 	    <bool name="stored">true</bool>
[junit4:junit4]   2> 	    <bool name="indexed">false</bool>
[junit4:junit4]   2> 	  </lst>
[junit4:junit4]   2> 	  <lst>
[junit4:junit4]   2> 	    <str name="name">standardfilt</str>
[junit4:junit4]   2> 	    <str name="type">standardfilt</str>
[junit4:junit4]   2> 	    <bool name="stored">true</bool>
[junit4:junit4]   2> 	    <bool name="indexed">true</bool>
[junit4:junit4]   2> 	  </lst>
[junit4:junit4]   2> 	  <lst>
[junit4:junit4]   2> 	    <str name="name">standardtokfilt</str>
[junit4:junit4]   2> 	    <str name="type">standardtokfilt</str>
[junit4:junit4]   2> 	    <bool name="stored">true</bool>
[junit4:junit4]   2> 	    <bool name="indexed">true</bool>
[junit4:junit4]   2> 	  </lst>
[junit4:junit4]   2> 	  <lst>
[junit4:junit4]   2> 	    <str name="name">test_posofftv</str>
[junit4:junit4]   2> 	    <str name="type">text</str>
[junit4:junit4]   2> 	    <bool name="termOffsets">true</bool>
[junit4:junit4]   2> 	    <bool name="termPositions">true</bool>
[junit4:junit4]   2> 	    <bool name="termVectors">true</bool>
[junit4:junit4]   2> 	  </lst>
[junit4:junit4]   2> 	  <lst>
[junit4:junit4]   2> 	    <str name="name">id</str>
[junit4:junit4]   2> 	    <str name="type">string</str>
[junit4:junit4]   2> 	    <bool name="stored">true</bool>
[junit4:junit4]   2> 	    <bool name="required">true</bool>
[junit4:junit4]   2> 	    <bool name="indexed">true</bool>
[junit4:junit4]   2> 	    <bool name="multiValued">false</bool>
[junit4:junit4]   2> 	    <bool name="uniqueKey">true</bool>
[junit4:junit4]   2> 	  </lst>
[junit4:junit4]   2> 	  <lst>
[junit4:junit4]   2> 	    <str name="name">pointD</str>
[junit4:junit4]   2> 	    <str name="type">xyd</str>
[junit4:junit4]   2> 	    <bool name="stored">true</bool>
[junit4:junit4]   2> 	    <bool name="indexed">true</bool>
[junit4:junit4]   2> 	    <bool name="multiValued">false</bool>
[junit4:junit4]   2> 	  </lst>
[junit4:junit4]   2> 	  <lst>
[junit4:junit4]   2> 	    <str name="name">timestamp</str>
[junit4:junit4]   2> 	    <str name="type">date</str>
[junit4:junit4]   2> 	    <bool name="stored">true</bool>
[junit4:junit4]   2> 	    <bool name="indexed">true</bool>
[junit4:junit4]   2> 	  </lst>
[junit4:junit4]   2> 	  <lst>
[junit4:junit4]   2> 	    <str name="name">subject</str>
[junit4:junit4]   2> 	    <str name="type">text</str>
[junit4:junit4]   2> 	    <bool name="stored">true</bool>
[junit4:junit4]   2> 	    <bool name="indexed">true</bool>
[junit4:junit4]   2> 	  </lst>
[junit4:junit4]   2> 	  <lst>
[junit4:junit4]   2> 	    <str name="name">lowerfilt</str>
[junit4:junit4]   2> 	    <str name="type">lowerfilt</str>
[junit4:junit4]   2> 	    <bool name="stored">true</bool>
[junit4:junit4]   2> 	    <bool name="indexed">true</bool>
[junit4:junit4]   2> 	  </lst>
[junit4:junit4]   2> 	  <lst>
[junit4:junit4]   2> 	    <str name="name">iind</str>
[junit4:junit4]   2> 	    <str name="type">int</str>
[junit4:junit4]   2> 	    <bool name="stored">false</bool>
[junit4:junit4]   2> 	    <bool name="indexed">true</bool>
[junit4:junit4]   2> 	  </lst>
[junit4:junit4]   2> 	  <lst>
[junit4:junit4]   2> 	    <str name="name">text_np</str>
[junit4:junit4]   2> 	    <str name="type">text_np</str>
[junit4:junit4]   2> 	    <bool name="stored">false</bool>
[junit4:junit4]   2> 	    <bool name="indexed">true</bool>
[junit4:junit4]   2> 	  </lst>
[junit4:junit4]   2> 	  <lst>
[junit4:junit4]   2> 	    <str name="name">test_basictv</str>
[junit4:junit4]   2> 	    <str name="type">text</str>
[junit4:junit4]   2> 	    <bool name="termVectors">true</bool>
[junit4:junit4]   2> 	  </lst>
[junit4:junit4]   2> 	  <lst>
[junit4:junit4]   2> 	    <str name="name">sindsto</str>
[junit4:junit4]   2> 	    <str name="type">string</str>
[junit4:junit4]   2> 	    <bool name="stored">true</bool>
[junit4:junit4]   2> 	    <bool name="indexed">true</bool>
[junit4:junit4]   2> 	  </lst>
[junit4:junit4]   2> 	  <lst>
[junit4:junit4]   2> 	    <str name="name">syn</str>
[junit4:junit4]   2> 	    <str name="type">syn</str>
[junit4:junit4]   2> 	    <bool name="stored">true</bool>
[junit4:junit4]   2> 	    <bool name="indexed">true</bool>
[junit4:junit4]   2> 	  </lst>
[junit4:junit4]   2> 	  <lst>
[junit4:junit4]   2> 	    <str name="name">stopfilt</str>
[junit4:junit4]   2> 	    <str name="type">stopfilt</str>
[junit4:junit4]   2> 	    <bool name="stored">true</bool>
[junit4:junit4]   2> 	    <bool name="indexed">true</bool>
[junit4:junit4]   2> 	  </lst>
[junit4:junit4]   2> 	  <lst>
[junit4:junit4]   2> 	    <str name="name">HTMLstandardtok</str>
[junit4:junit4]   2> 	    <str name="type">HTMLstandardtok</str>
[junit4:junit4]   2> 	    <bool name="stored">true</bool>
[junit4:junit4]   2> 	    <bool name="indexed">true</bool>
[junit4:junit4]   2> 	  </lst>
[junit4:junit4]   2> 	  <lst>
[junit4:junit4]   2> 	    <str name="name">whitetok</str>
[junit4:junit4]   2> 	    <str name="type">whitetok</str>
[junit4:junit4]   2> 	    <bool name="stored">true</bool>
[junit4:junit4]   2> 	    <bool name="indexed">true</bool>
[junit4:junit4]   2> 	  </lst>
[junit4:junit4]   2> 	  <lst>
[junit4:junit4]   2> 	    <str name="name">test_hlt_off</str>
[junit4:junit4]   2> 	    <str name="type">highlittext</str>
[junit4:junit4]   2> 	    <bool name="compressed">false</bool>
[junit4:junit4]   2> 	    <bool name="indexed">true</bool>
[junit4:junit4]   2> 	  </lst>
[junit4:junit4]   2> 	  <lst>
[junit4:junit4]   2> 	    <str name="name">signatureField</str>
[junit4:junit4]   2> 	    <str name="type">string</str>
[junit4:junit4]   2> 	    <bool name="stored">false</bool>
[junit4:junit4]   2> 	    <bool name="indexed">true</bool>
[junit4:junit4]   2> 	  </lst>
[junit4:junit4]   2> 	  <lst>
[junit4:junit4]   2> 	    <str name="name">title_lettertok</str>
[junit4:junit4]   2> 	    <str name="type">lettertok</str>
[junit4:junit4]   2> 	    <bool name="stored">false</bool>
[junit4:junit4]   2> 	    <bool name="indexed">true</bool>
[junit4:junit4]   2> 	  </lst>
[junit4:junit4]   2> 	  <lst>
[junit4:junit4]   2> 	    <str name="name">sku1</str>
[junit4:junit4]   2> 	    <str name="type">skutype1</str>
[junit4:junit4]   2> 	    <bool name="stored">true</bool>
[junit4:junit4]   2> 	    <bool name="indexed">true</bool>
[junit4:junit4]   2> 	  </lst>
[junit4:junit4]   2> 	  <lst>
[junit4:junit4]   2> 	    <str name="name">textgap</str>
[junit4:junit4]   2> 	    <str name="type">textgap</str>
[junit4:junit4]   2> 	    <bool name="stored">true</bool>
[junit4:junit4]   2> 	    <bool name="indexed">true</bool>
[junit4:junit4]   2> 	  </lst>
[junit4:junit4]   2> 	  <lst>
[junit4:junit4]   2> 	    <str name="name">test_offtv</str>
[junit4:junit4]   2> 	    <str name="type">text</str>
[junit4:junit4]   2> 	    <bool name="termOffsets">true</bool>
[junit4:junit4]   2> 	    <bool name="termVectors">true</bool>
[junit4:junit4]   2> 	  </lst>
[junit4:junit4]   2> 	  <lst>
[junit4:junit4]   2> 	    <str name="name">uniq</str>
[junit4:junit4]   2> 	    <str name="type">string</str>
[junit4:junit4]   2> 	    <bool name="stored">true</bool>
[junit4:junit4]   2> 	    <bool name="indexed">true</bool>
[junit4:junit4]   2> 	    <bool name="multiValued">true</bool>
[junit4:junit4]   2> 	  </lst>
[junit4:junit4]   2> 	  <lst>
[junit4:junit4]   2> 	    <str name="name">uuid</str>
[junit4:junit4]   2> 	    <str name="type">uuid</str>
[junit4:junit4]   2> 	    <bool name="stored">true</bool>
[junit4:junit4]   2> 	  </lst>
[junit4:junit4]   2> 	  <lst>
[junit4:junit4]   2> 	    <str name="name">shouldbeunindexed</str>
[junit4:junit4]   2> 	    <str name="type">unstored</str>
[junit4:junit4]   2> 	    <bool name="stored">true</bool>
[junit4:junit4]   2> 	    <bool name="indexed">false</bool>
[junit4:junit4]   2> 	  </lst>
[junit4:junit4]   2> 	  <lst>
[junit4:junit4]   2> 	    <str name="name">teststop</str>
[junit4:junit4]   2> 	    <str name="type">teststop</str>
[junit4:junit4]   2> 	    <bool name="stored">true</bool>
[junit4:junit4]   2> 	    <bool name="indexed">true</bool>
[junit4:junit4]   2> 	  </lst>
[junit4:junit4]   2> 	  <lst>
[junit4:junit4]   2> 	    <str name="name">point_hash</str>
[junit4:junit4]   2> 	    <str name="type">geohash</str>
[junit4:junit4]   2> 	    <bool name="stored">true</bool>
[junit4:junit4]   2> 	    <bool name="indexed">true</bool>
[junit4:junit4]   2> 	    <bool name="multiValued">false</bool>
[junit4:junit4]   2> 	  </lst>
[junit4:junit4]   2> 	  <lst>
[junit4:junit4]   2> 	    <str name="name">lengthfilt</str>
[junit4:junit4]   2> 	    <str name="type">lengthfilt</str>
[junit4:junit4]   2> 	    <bool name="stored">true</bool>
[junit4:junit4]   2> 	    <bool name="indexed">true</bool>
[junit4:junit4]   2> 	  </lst>
[junit4:junit4]   2> 	  <lst>
[junit4:junit4]   2> 	    <str name="name">patternreplacefilt</str>
[junit4:junit4]   2> 	    <str name="type">patternreplacefilt</str>
[junit4:junit4]   2> 	    <bool name="stored">true</bool>
[junit4:junit4]   2> 	    <bool name="indexed">true</bool>
[junit4:junit4]   2> 	  </lst>
[junit4:junit4]   2> 	  <lst>
[junit4:junit4]   2> 	    <str name="name">subword</str>
[junit4:junit4]   2> 	    <str name="type">subword</str>
[junit4:junit4]   2> 	    <bool name="stored">true</bool>
[junit4:junit4]   2> 	    <bool name="indexed">true</bool>
[junit4:junit4]   2> 	  </lst>
[junit4:junit4]   2> 	  <lst>
[junit4:junit4]   2> 	    <str name="name">bind</str>
[junit4:junit4]   2> 	    <str name="type">boolean</str>
[junit4:junit4]   2> 	    <bool name="stored">false</bool>
[junit4:junit4]   2> 	    <bool name="indexed">true</bool>
[junit4:junit4]   2> 	  </lst>
[junit4:junit4]   2> 	  <lst>
[junit4:junit4]   2> 	    <str name="name">_version_</str>
[junit4:junit4]   2> 	    <str name="type">long</str>
[junit4:junit4]   2> 	    <bool name="stored">true</bool>
[junit4:junit4]   2> 	    <bool name="indexed">true</bool>
[junit4:junit4]   2> 	  </lst>
[junit4:junit4]   2> 	  <lst>
[junit4:junit4]   2> 	    <str name="name">standardtok</str>
[junit4:junit4]   2> 	    <str name="type">standardtok</str>
[junit4:junit4]   2> 	    <bool name="stored">true</bool>
[junit4:junit4]   2> 	    <bool name="indexed">true</bool>
[junit4:junit4]   2> 	  </lst>
[junit4:junit4]   2> 	  <lst>
[junit4:junit4]   2> 	    <str name="name">shouldbestored</str>
[junit4:junit4]   2> 	    <str name="type">unstored</str>
[junit4:junit4]   2> 	    <bool name="stored">true</bool>
[junit4:junit4]   2> 	  </lst>
[junit4:junit4]   2> 	  <lst>
[junit4:junit4]   2> 	    <str name="name">lettertok</str>
[junit4:junit4]   2> 	    <str name="type">lettertok</str>
[junit4:junit4]   2> 	    <bool name="stored">true</bool>
[junit4:junit4]   2> 	    <bool name="indexed">true</bool>
[junit4:junit4]   2> 	  </lst>
[junit4:junit4]   2> 	  <lst>
[junit4:junit4]   2> 	    <str name="name">dedup</str>
[junit4:junit4]   2> 	    <str name="type">dedup</str>
[junit4:junit4]   2> 	    <bool name="stored">true</bool>
[junit4:junit4]   2> 	    <bool name="indexed">true</bool>
[junit4:junit4]   2> 	  </lst>
[junit4:junit4]   2> 	  <lst>
[junit4:junit4]   2> 	    <str name="name">engporterfilt</str>
[junit4:junit4]   2> 	    <str name="type">engporterfilt</str>
[junit4:junit4]   2> 	    <bool name="stored">true</bool>
[junit4:junit4]   2> 	    <bool name="indexed">true</bool>
[junit4:junit4]   2> 	  </lst>
[junit4:junit4]   2> 	  <lst>
[junit4:junit4]   2> 	    <str name="name">bindsto</str>
[junit4:junit4]   2> 	    <str name="type">boolean</str>
[junit4:junit4]   2> 	    <bool name="stored">true</bool>
[junit4:junit4]   2> 	    <bool name="indexed">true</bool>
[junit4:junit4]   2> 	  </lst>
[junit4:junit4]   2> 	  <lst>
[junit4:junit4]   2> 	    <str name="name">protectedsubword</str>
[junit4:junit4]   2> 	    <str name="type">protectedsubword</str>
[junit4:junit4]   2> 	    <bool name="stored">true</bool>
[junit4:junit4]   2> 	    <bool name="indexed">true</bool>
[junit4:junit4]   2> 	  </lst>
[junit4:junit4]   2> 	  <lst>
[junit4:junit4]   2> 	    <str name="name">test_hlt</str>
[junit4:junit4]   2> 	    <str name="type">highlittext</str>
[junit4:junit4]   2> 	    <bool name="compressed">true</bool>
[junit4:junit4]   2> 	    <bool name="indexed">true</bool>
[junit4:junit4]   2> 	  </lst>
[junit4:junit4]   2> 	  <lst>
[junit4:junit4]   2> 	    <str name="name">text</str>
[junit4:junit4]   2> 	    <str name="type">text</str>
[junit4:junit4]   2> 	    <bool name="stored">false</bool>
[junit4:junit4]   2> 	    <bool name="indexed">true</bool>
[junit4:junit4]   2> 	    <bool name="multiValued">true</bool>
[junit4:junit4]   2> 	  </lst>
[junit4:junit4]   2> 	</arr>
[junit4:junit4]   2> 	</response>
[junit4:junit4]   2> 	
[junit4:junit4]   2> 		request was:/schema/fields?indent=on&wt=xml
[junit4:junit4]   2> 1149 T144 oasc.SolrException.log SEVERE REQUEST FAILED: /schema/fields?indent=on&wt=xml:java.lang.RuntimeException: REQUEST FAILED: xpath=(/response/arr[@name='fields']/lst/str[@name='name'])[1] = 'custstopfilt'
[junit4:junit4]   2> 		xml response was: <?xml version="1.0" encoding="UTF-8"?>
[junit4:junit4]   2> 	<response>
[junit4:junit4]   2> 	
[junit4:junit4]   2> 	<lst name="responseHeader">
[junit4:junit4]   2> 	  <int name="status">0</int>
[junit4:junit4]   2> 	  <int name="QTime">3</int>
[junit4:junit4]   2> 	</lst>
[junit4:junit4]   2> 	<arr name="fields">
[junit4:junit4]   2> 	  <lst>
[junit4:junit4]   2> 	    <str name="name">porterfilt</str>
[junit4:junit4]   2> 	    <str name="type">porterfilt</str>
[junit4:junit4]   2> 	    <bool name="stored">true</bool>
[junit4:junit4]   2> 	    <bool name="indexed">true</bool>
[junit4:junit4]   2> 	  </lst>
[junit4:junit4]   2> 	  <lst>
[junit4:junit4]   2> 	    <str name="name">copyfield_source</str>
[junit4:junit4]   2> 	    <str name="type">string</str>
[junit4:junit4]   2> 	    <bool name="stored">true</bool>
[junit4:junit4]   2> 	    <bool name="indexed">true</bool>
[junit4:junit4]   2> 	    <bool name="multiValued">true</bool>
[junit4:junit4]   2> 	  </lst>
[junit4:junit4]   2> 	  <lst>
[junit4:junit4]   2> 	    <str name="name">uniq2</str>
[junit4:junit4]   2> 	    <str name="type">string</str>
[junit4:junit4]   2> 	    <bool name="stored">true</bool>
[junit4:junit4]   2> 	    <bool name="indexed">true</bool>
[junit4:junit4]   2> 	    <bool name="multiValued">true</bool>
[junit4:junit4]   2> 	  </lst>
[junit4:junit4]   2> 	  <lst>
[junit4:junit4]   2> 	    <str name="name">custengporterfilt</str>
[junit4:junit4]   2> 	    <str name="type">custengporterfilt</str>
[junit4:junit4]   2> 	    <bool name="stored">true</bool>
[junit4:junit4]   2> 	    <bool name="indexed">true</bool>
[junit4:junit4]   2> 	  </lst>
[junit4:junit4]   2> 	  <lst>
[junit4:junit4]   2> 	    <str name="name">weight</str>
[junit4:junit4]   2> 	    <str name="type">float</str>
[junit4:junit4]   2> 	    <bool name="stored">true</bool>
[junit4:junit4]   2> 	    <bool name="indexed">true</bool>
[junit4:junit4]   2> 	  </lst>
[junit4:junit4]   2> 	  <lst>
[junit4:junit4]   2> 	    <str name="name">uniq3</str>
[junit4:junit4]   2> 	    <str name="type">string</str>
[junit4:junit4]   2> 	    <bool name="stored">true</bool>
[junit4:junit4]   2> 	    <bool name="indexed">true</bool>
[junit4:junit4]   2> 	  </lst>
[junit4:junit4]   2> 	  <lst>
[junit4:junit4]   2> 	    <str name="name">lowertok</str>
[junit4:junit4]   2> 	    <str name="type">lowertok</str>
[junit4:junit4]   2> 	    <bool name="stored">true</bool>
[junit4:junit4]   2> 	    <bool name="indexed">true</bool>
[junit4:junit4]   2> 	  </lst>
[junit4:junit4]   2> 	  <lst>
[junit4:junit4]   2> 	    <str name="name">bsto</str>
[junit4:junit4]   2> 	    <str name="type">boolean</str>
[junit4:junit4]   2> 	    <bool name="stored">true</bool>
[junit4:junit4]   2> 	    <bool name="indexed">false</bool>
[junit4:junit4]   2> 	  </lst>
[junit4:junit4]   2> 	  <lst>
[junit4:junit4]   2> 	    <str name="name">numericsubword</str>
[junit4:junit4]   2> 	    <str name="type">numericsubword</str>
[junit4:junit4]   2> 	    <bool name="stored">true</bool>
[junit4:junit4]   2> 	    <bool name="indexed">true</bool>
[junit4:junit4]   2> 	  </lst>
[junit4:junit4]   2> 	  <lst>
[junit4:junit4]   2> 	    <str name="name">nouniq</str>
[junit4:junit4]   2> 	    <str name="type">string</str>
[junit4:junit4]   2> 	    <bool name="stored">true</bool>
[junit4:junit4]   2> 	    <bool name="indexed">true</bool>
[junit4:junit4]   2> 	    <bool name="multiValued">true</bool>
[junit4:junit4]   2> 	  </lst>
[junit4:junit4]   2> 	  <lst>
[junit4:junit4]   2> 	    <str name="name">nullfirst</str>
[junit4:junit4]   2> 	    <str name="type">string</str>
[junit4:junit4]   2> 	    <bool name="stored">true</bool>
[junit4:junit4]   2> 	    <bool name="sortMissingFirst">true</bool>
[junit4:junit4]   2> 	    <bool name="indexed">true</bool>
[junit4:junit4]   2> 	  </lst>
[junit4:junit4]   2> 	  <lst>
[junit4:junit4]   2> 	    <str name="name">name</str>
[junit4:junit4]   2> 	    <str name="type">nametext</str>
[junit4:junit4]   2> 	    <bool name="stored">true</bool>
[junit4:junit4]   2> 	    <bool name="indexed">true</bool>
[junit4:junit4]   2> 	  </lst>
[junit4:junit4]   2> 	  <lst>
[junit4:junit4]   2> 	    <str name="name">wdf_nocase</str>
[junit4:junit4]   2> 	    <str name="type">wdf_nocase</str>
[junit4:junit4]   2> 	    <bool name="stored">true</bool>
[junit4:junit4]   2> 	    <bool name="indexed">true</bool>
[junit4:junit4]   2> 	  </lst>
[junit4:junit4]   2> 	  <lst>
[junit4:junit4]   2> 	    <str name="name">numberpartfail</str>
[junit4:junit4]   2> 	    <str name="type">failtype1</str>
[junit4:junit4]   2> 	    <bool name="stored">true</bool>
[junit4:junit4]   2> 	    <bool name="indexed">true</bool>
[junit4:junit4]   2> 	  </lst>
[junit4:junit4]   2> 	  <lst>
[junit4:junit4]   2> 	    <str name="name">ssto</str>
[junit4:junit4]   2> 	    <str name="type">string</str>
[junit4:junit4]   2> 	    <bool name="stored">true</bool>
[junit4:junit4]   2> 	    <bool name="indexed">false</bool>
[junit4:junit4]   2> 	  </lst>
[junit4:junit4]   2> 	  <lst>
[junit4:junit4]   2> 	    <str name="name">sku2</str>
[junit4:junit4]   2> 	    <str name="type">skutype2</str>
[junit4:junit4]   2> 	    <bool name="stored">true</bool>
[junit4:junit4]   2> 	    <bool name="indexed">true</bool>
[junit4:junit4]   2> 	  </lst>
[junit4:junit4]   2> 	  <lst>
[junit4:junit4]   2> 	    <str name="name">wdf_preserve</str>
[junit4:junit4]   2> 	    <str name="type">wdf_preserve</str>
[junit4:junit4]   2> 	    <bool name="stored">true</bool>
[junit4:junit4]   2> 	    <bool name="indexed">true</bool>
[junit4:junit4]   2> 	  </lst>
[junit4:junit4]   2> 	  <lst>
[junit4:junit4]   2> 	    <str name="name">keywordtok</str>
[junit4:junit4]   2> 	    <str name="type">keywordtok</str>
[junit4:junit4]   2> 	    <bool name="stored">true</bool>
[junit4:junit4]   2> 	    <bool name="indexed">true</bool>
[junit4:junit4]   2> 	  </lst>
[junit4:junit4]   2> 	  <lst>
[junit4:junit4]   2> 	    <str name="name">store</str>
[junit4:junit4]   2> 	    <str name="type">location</str>
[junit4:junit4]   2> 	    <bool name="stored">true</bool>
[junit4:junit4]   2> 	    <bool name="indexed">true</bool>
[junit4:junit4]   2> 	  </lst>
[junit4:junit4]   2> 	  <lst>
[junit4:junit4]   2> 	    <str name="name">HTMLwhitetok</str>
[junit4:junit4]   2> 	    <str name="type">HTMLwhitetok</str>
[junit4:junit4]   2> 	    <bool name="stored">true</bool>
[junit4:junit4]   2> 	    <bool name="indexed">true</bool>
[junit4:junit4]   2> 	  </lst>
[junit4:junit4]   2> 	  <lst>
[junit4:junit4]   2> 	    <str name="name">sind</str>
[junit4:junit4]   2> 	    <str name="type">string</str>
[junit4:junit4]   2> 	    <bool name="stored">false</bool>
[junit4:junit4]   2> 	    <bool name="indexed">true</bool>
[junit4:junit4]   2> 	  </lst>
[junit4:junit4]   2> 	  <lst>
[junit4:junit4]   2> 	    <str name="name">title_stemmed</str>
[junit4:junit4]   2> 	    <str name="type">text</str>
[junit4:junit4]   2> 	    <bool name="stored">false</bool>
[junit4:junit4]   2> 	    <bool name="indexed">true</bool>
[junit4:junit4]   2> 	  </lst>
[junit4:junit4]   2> 	  <lst>
[junit4:junit4]   2> 	    <str name="name">custstopfilt</str>
[junit4:junit4]   2> 	    <str name="type">custstopfilt</str>
[junit4:junit4]   2> 	    <bool name="stored">true</bool>
[junit4:junit4]   2> 	    <bool name="indexed">true</bool>
[junit4:junit4]   2> 	  </lst>
[junit4:junit4]   2> 	  <lst>
[junit4:junit4]   2> 	    <str name="name">test_notv</str>
[junit4:junit4]   2> 	    <str name="type">text</str>
[junit4:junit4]   2> 	    <bool name="termVectors">false</bool>
[junit4:junit4]   2> 	  </lst>
[junit4:junit4]   2> 	  <lst>
[junit4:junit4]   2> 	    <str name="name">bday</str>
[junit4:junit4]   2> 	    <str name="type">date</str>
[junit4:junit4]   2> 	    <bool name="stored">true</bool>
[junit4:junit4]   2> 	    <bool name="indexed">true</bool>
[junit4:junit4]   2> 	  </lst>
[junit4:junit4]   2> 	  <lst>
[junit4:junit4]   2> 	    <str name="name">test_postv</str>
[junit4:junit4]   2> 	    <str name="type">text</str>
[junit4:junit4]   2> 	    <bool name="termPositions">true</bool>
[junit4:junit4]   2> 	    <bool name="termVectors">true</bool>
[junit4:junit4]   2> 	  </lst>
[junit4:junit4]   2> 	  <lst>
[junit4:junit4]   2> 	    <str name="name">title</str>
[junit4:junit4]   2> 	    <str name="type">nametext</str>
[junit4:junit4]   2> 	    <bool name="stored">true</bool>
[junit4:junit4]   2> 	    <bool name="indexed">true</bool>
[junit4:junit4]   2> 	  </lst>
[junit4:junit4]   2> 	  <lst>
[junit4:junit4]   2> 	    <str name="name">point</str>
[junit4:junit4]   2> 	    <str name="type">xy</str>
[junit4:junit4]   2> 	    <bool name="stored">true</bool>
[junit4:junit4]   2> 	    <bool name="indexed">true</bool>
[junit4:junit4]   2> 	    <bool name="multiValued">false</bool>
[junit4:junit4]   2> 	  </lst>
[junit4:junit4]   2> 	  <lst>
[junit4:junit4]   2> 	    <str name="name">shouldbeunstored</str>
[junit4:junit4]   2> 	    <str name="type">unstored</str>
[junit4:junit4]   2> 	  </lst>
[junit4:junit4]   2> 	  <lst>
[junit4:junit4]   2> 	    <str name="name">isto</str>
[junit4:junit4]   2> 	    <str name="type">int</str>
[junit4:junit4]   2> 	    <bool name="stored">true</bool>
[junit4:junit4]   2> 	    <bool name="indexed">false</bool>
[junit4:junit4]   2> 	  </lst>
[junit4:junit4]   2> 	  <lst>
[junit4:junit4]   2> 	    <str name="name">standardfilt</str>
[junit4:junit4]   2> 	    <str name="type">standardfilt</str>
[junit4:junit4]   2> 	    <bool name="stored">true</bool>
[junit4:junit4]   2> 	    <bool name="indexed">true</bool>
[junit4:junit4]   2> 	  </lst>
[junit4:junit4]   2> 	  <lst>
[junit4:junit4]   2> 	    <str name="name">standardtokfilt</str>
[junit4:junit4]   2> 	    <str name="type">standardtokfilt</str>
[junit4:junit4]   2> 	    <bool name="stored">true</bool>
[junit4:junit4]   2> 	    <bool name="indexed">true</bool>
[junit4:junit4]   2> 	  </lst>
[junit4:junit4]   2> 	  <lst>
[junit4:junit4]   2> 	    <str name="name">test_posofftv</str>
[junit4:junit4]   2> 	    <str name="type">text</str>
[junit4:junit4]   2> 	    <bool name="termOffsets">true</bool>
[junit4:junit4]   2> 	    <bool name="termPositions">true</bool>
[junit4:junit4]   2> 	    <bool name="termVectors">true</bool>
[junit4:junit4]   2> 	  </lst>
[junit4:junit4]   2> 	  <lst>
[junit4:junit4]   2> 	    <str name="name">id</str>
[junit4:junit4]   2> 	    <str name="type">string</str>
[junit4:junit4]   2> 	    <bool name="stored">true</bool>
[junit4:junit4]   2> 	    <bool name="required">true</bool>
[junit4:junit4]   2> 	    <bool name="indexed">true</bool>
[junit4:junit4]   2> 	    <bool name="multiValued">false</bool>
[junit4:junit4]   2> 	    <bool name="uniqueKey">true</bool>
[junit4:junit4]   2> 	  </lst>
[junit4:junit4]   2> 	  <lst>
[junit4:junit4]   2> 	    <str name="name">pointD</str>
[junit4:junit4]   2> 	    <str name="type">xyd</str>
[junit4:junit4]   2> 	    <bool name="stored">true</bool>
[junit4:junit4]   2> 	    <bool name="indexed">true</bool>
[junit4:junit4]   2> 	    <bool name="multiValued">false</bool>
[junit4:junit4]   2> 	  </lst>
[junit4:junit4]   2> 	  <lst>
[junit4:junit4]   2> 	    <str name="name">timestamp</str>
[junit4:junit4]   2> 	    <str name="type">date</str>
[junit4:junit4]   2> 	    <bool name="stored">true</bool>
[junit4:junit4]   2> 	    <bool name="indexed">true</bool>
[junit4:junit4]   2> 	  </lst>
[junit4:junit4]   2> 	  <lst>
[junit4:junit4]   2> 	    <str name="name">subject</str>
[junit4:junit4]   2> 	    <str name="type">text</str>
[junit4:junit4]   2> 	    <bool name="stored">true</bool>
[junit4:junit4]   2> 	    <bool name="indexed">true</bool>
[junit4:junit4]   2> 	  </lst>
[junit4:junit4]   2> 	  <lst>
[junit4:junit4]   2> 	    <str name="name">lowerfilt</str>
[junit4:junit4]   2> 	    <str name="type">lowerfilt</str>
[junit4:junit4]   2> 	    <bool name="stored">true</bool>
[junit4:junit4]   2> 	    <bool name="indexed">true</bool>
[junit4:junit4]   2> 	  </lst>
[junit4:junit4]   2> 	  <lst>
[junit4:junit4]   2> 	    <str name="name">iind</str>
[junit4:junit4]   2> 	    <str name="type">int</str>
[junit4:junit4]   2> 	    <bool name="stored">false</bool>
[junit4:junit4]   2> 	    <bool name="indexed">true</bool>
[junit4:junit4]   2> 	  </lst>
[junit4:junit4]   2> 	  <lst>
[junit4:junit4]   2> 	    <str name="name">text_np</str>
[junit4:junit4]   2> 	    <str name="type">text_np</str>
[junit4:junit4]   2> 	    <bool name="stored">false</bool>
[junit4:junit4]   2> 	    <bool name="indexed">true</bool>
[junit4:junit4]   2> 	  </lst>
[junit4:junit4]   2> 	  <lst>
[junit4:junit4]   2> 	    <str name="name">test_basictv</str>
[junit4:junit4]   2> 	    <str name="type">text</str>
[junit4:junit4]   2> 	    <bool name="termVectors">true</bool>
[junit4:junit4]   2> 	  </lst>
[junit4:junit4]   2> 	  <lst>
[junit4:junit4]   2> 	    <str name="name">sindsto</str>
[junit4:junit4]   2> 	    <str name="type">string</str>
[junit4:junit4]   2> 	    <bool name="stored">true</bool>
[junit4:junit4]   2> 	    <bool name="indexed">true</bool>
[junit4:junit4]   2> 	  </lst>
[junit4:junit4]   2> 	  <lst>
[junit4:junit4]   2> 	    <str name="name">syn</str>
[junit4:junit4]   2> 	    <str name="type">syn</str>
[junit4:junit4]   2> 	    <bool name="stored">true</bool>
[junit4:junit4]   2> 	    <bool name="indexed">true</bool>
[junit4:junit4]   2> 	  </lst>
[junit4:junit4]   2> 	  <lst>
[junit4:junit4]   2> 	    <str name="name">stopfilt</str>
[junit4:junit4]   2> 	    <str name="type">stopfilt</str>
[junit4:junit4]   2> 	    <bool name="stored">true</bool>
[junit4:junit4]   2> 	    <bool name="indexed">true</bool>
[junit4:junit4]   2> 	  </lst>
[junit4:junit4]   2> 	  <lst>
[junit4:junit4]   2> 	    <str name="name">HTMLstandardtok</str>
[junit4:junit4]   2> 	    <str name="type">HTMLstandardtok</str>
[junit4:junit4]   2> 	    <bool name="stored">true</bool>
[junit4:junit4]   2> 	    <bool name="indexed">true</bool>
[junit4:junit4]   2> 	  </lst>
[junit4:junit4]   2> 	  <lst>
[junit4:junit4]   2> 	    <str name="name">whitetok</str>
[junit4:junit4]   2> 	    <str name="type">whitetok</str>
[junit4:junit4]   2> 	    <bool name="stored">true</bool>
[junit4:junit4]   2> 	    <bool name="indexed">true</bool>
[junit4:junit4]   2> 	  </lst>
[junit4:junit4]   2> 	  <lst>
[junit4:junit4]   2> 	    <str name="name">test_hlt_off</str>
[junit4:junit4]   2> 	    <str name="type">highlittext</str>
[junit4:junit4]   2> 	    <bool name="compressed">false</bool>
[junit4:junit4]   2> 	    <bool name="indexed">true</bool>
[junit4:junit4]   2> 	  </lst>
[junit4:junit4]   2> 	  <lst>
[junit4:junit4]   2> 	    <str name="name">signatureField</str>
[junit4:junit4]   2> 	    <str name="type">string</str>
[junit4:junit4]   2> 	    <bool name="stored">false</bool>
[junit4:junit4]   2> 	    <bool name="indexed">true</bool>
[junit4:junit4]   2> 	  </lst>
[junit4:junit4]   2> 	  <lst>
[junit4:junit4]   2> 	    <str name="name">title_lettertok</str>
[junit4:junit4]   2> 	    <str name="type">lettertok</str>
[junit4:junit4]   2> 	    <bool name="stored">false</bool>
[junit4:junit4]   2> 	    <bool name="indexed">true</bool>
[junit4:junit4]   2> 	  </lst>
[junit4:junit4]   2> 	  <lst>
[junit4:junit4]   2> 	    <str name="name">sku1</str>
[junit4:junit4]   2> 	    <str name="type">skutype1</str>
[junit4:junit4]   2> 	    <bool name="stored">true</bool>
[junit4:junit4]   2> 	    <bool name="indexed">true</bool>
[junit4:junit4]   2> 	  </lst>
[junit4:junit4]   2> 	  <lst>
[junit4:junit4]   2> 	    <str name="name">textgap</str>
[junit4:junit4]   2> 	    <str name="type">textgap</str>
[junit4:junit4]   2> 	    <bool name="stored">true</bool>
[junit4:junit4]   2> 	    <bool name="indexed">true</bool>
[junit4:junit4]   2> 	  </lst>
[junit4:junit4]   2> 	  <lst>
[junit4:junit4]   2> 	    <str name="name">test_offtv</str>
[junit4:junit4]   2> 	    <str name="type">text</str>
[junit4:junit4]   2> 	    <bool name="termOffsets">true</bool>
[junit4:junit4]   2> 	    <bool name="termVectors">true</bool>
[junit4:junit4]   2> 	  </lst>
[junit4:junit4]   2> 	  <lst>
[junit4:junit4]   2> 	    <str name="name">uniq</str>
[junit4:junit4]   2> 	    <str name="type">string</str>
[junit4:junit4]   2> 	    <bool name="stored">true</bool>
[junit4:junit4]   2> 	    <bool name="indexed">true</bool>
[junit4:junit4]   2> 	    <bool name="multiValued">true</bool>
[junit4:junit4]   2> 	  </lst>
[junit4:junit4]   2> 	  <lst>
[junit4:junit4]   2> 	    <str name="name">uuid</str>
[junit4:junit4]   2> 	    <str name="type">uuid</str>
[junit4:junit4]   2> 	    <bool name="stored">true</bool>
[junit4:junit4]   2> 	  </lst>
[junit4:junit4]   2> 	  <lst>
[junit4:junit4]   2> 	    <str name="name">shouldbeunindexed</str>
[junit4:junit4]   2> 	    <str name="type">unstored</str>
[junit4:junit4]   2> 	    <bool name="stored">true</bool>
[junit4:junit4]   2> 	    <bool name="indexed">false</bool>
[junit4:junit4]   2> 	  </lst>
[junit4:junit4]   2> 	  <lst>
[junit4:junit4]   2> 	    <str name="name">teststop</str>
[junit4:junit4]   2> 	    <str name="type">teststop</str>
[junit4:junit4]   2> 	    <bool name="stored">true</bool>
[junit4:junit4]   2> 	    <bool name="indexed">true</bool>
[junit4:junit4]   2> 	  </lst>
[junit4:junit4]   2> 	  <lst>
[junit4:junit4]   2> 	    <str name="name">point_hash</str>
[junit4:junit4]   2> 	    <str name="type">geohash</str>
[junit4:junit4]   2> 	    <bool name="stored">true</bool>
[junit4:junit4]   2> 	    <bool name="indexed">true</bool>
[junit4:junit4]   2> 	    <bool name="multiValued">false</bool>
[junit4:junit4]   2> 	  </lst>
[junit4:junit4]   2> 	  <lst>
[junit4:junit4]   2> 	    <str name="name">lengthfilt</str>
[junit4:junit4]   2> 	    <str name="type">lengthfilt</str>
[junit4:junit4]   2> 	    <bool name="stored">true</bool>
[junit4:junit4]   2> 	    <bool name="indexed">true</bool>
[junit4:junit4]   2> 	  </lst>
[junit4:junit4]   2> 	  <lst>
[junit4:junit4]   2> 	    <str name="name">patternreplacefilt</str>
[junit4:junit4]   2> 	    <str name="type">patternreplacefilt</str>
[junit4:junit4]   2> 	    <bool name="stored">true</bool>
[junit4:junit4]   2> 	    <bool name="indexed">true</bool>
[junit4:junit4]   2> 	  </lst>
[junit4:junit4]   2> 	  <lst>
[junit4:junit4]   2> 	    <str name="name">subword</str>
[junit4:junit4]   2> 	    <str name="type">subword</str>
[junit4:junit4]   2> 	    <bool name="stored">true</bool>
[junit4:junit4]   2> 	    <bool name="indexed">true</bool>
[junit4:junit4]   2> 	  </lst>
[junit4:junit4]   2> 	  <lst>
[junit4:junit4]   2> 	    <str name="name">bind</str>
[junit4:junit4]   2> 	    <str name="type">boolean</str>
[junit4:junit4]   2> 	    <bool name="stored">false</bool>
[junit4:junit4]   2> 	    <bool name="indexed">true</bool>
[junit4:junit4]   2> 	  </lst>
[junit4:junit4]   2> 	  <lst>
[junit4:junit4]   2> 	    <str name="name">_version_</str>
[junit4:junit4]   2> 	    <str name="type">long</str>
[junit4:junit4]   2> 	    <bool name="stored">true</bool>
[junit4:junit4]   2> 	    <bool name="indexed">true</bool>
[junit4:junit4]   2> 	  </lst>
[junit4:junit4]   2> 	  <lst>
[junit4:junit4]   2> 	    <str name="name">standardtok</str>
[junit4:junit4]   2> 	    <str name="type">standardtok</str>
[junit4:junit4]   2> 	    <bool name="stored">true</bool>
[junit4:junit4]   2> 	    <bool name="indexed">true</bool>
[junit4:junit4]   2> 	  </lst>
[junit4:junit4]   2> 	  <lst>
[junit4:junit4]   2> 	    <str name="name">shouldbestored</str>
[junit4:junit4]   2> 	    <str name="type">unstored</str>
[junit4:junit4]   2> 	    <bool name="stored">true</bool>
[junit4:junit4]   2> 	  </lst>
[junit4:junit4]   2> 	  <lst>
[junit4:junit4]   2> 	    <str name="name">lettertok</str>
[junit4:junit4]   2> 	    <str name="type">lettertok</str>
[junit4:junit4]   2> 	    <bool name="stored">true</bool>
[junit4:junit4]   2> 	    <bool name="indexed">true</bool>
[junit4:junit4]   2> 	  </lst>
[junit4:junit4]   2> 	  <lst>
[junit4:junit4]   2> 	    <str name="name">dedup</str>
[junit4:junit4]   2> 	    <str name="type">dedup</str>
[junit4:junit4]   2> 	    <bool name="stored">true</bool>
[junit4:junit4]   2> 	    <bool name="indexed">true</bool>
[junit4:junit4]   2> 	  </lst>
[junit4:junit4]   2> 	  <lst>
[junit4:junit4]   2> 	    <str name="name">engporterfilt</str>
[junit4:junit4]   2> 	    <str name="type">engporterfilt</str>
[junit4:junit4]   2> 	    <bool name="stored">true</bool>
[junit4:junit4]   2> 	    <bool name="indexed">true</bool>
[junit4:junit4]   2> 	  </lst>
[junit4:junit4]   2> 	  <lst>
[junit4:junit4]   2> 	    <str name="name">bindsto</str>
[junit4:junit4]   2> 	    <str name="type">boolean</str>
[junit4:junit4]   2> 	    <bool name="stored">true</bool>
[junit4:junit4]   2> 	    <bool name="indexed">true</bool>
[junit4:junit4]   2> 	  </lst>
[junit4:junit4]   2> 	  <lst>
[junit4:junit4]   2> 	    <str name="name">protectedsubword</str>
[junit4:junit4]   2> 	    <str name="type">protectedsubword</str>
[junit4:junit4]   2> 	    <bool name="stored">true</bool>
[junit4:junit4]   2> 	    <bool name="indexed">true</bool>
[junit4:junit4]   2> 	  </lst>
[junit4:junit4]   2> 	  <lst>
[junit4:junit4]   2> 	    <str name="name">test_hlt</str>
[junit4:junit4]   2> 	    <str name="type">highlittext</str>
[junit4:junit4]   2> 	    <bool name="compressed">true</bool>
[junit4:junit4]   2> 	    <bool name="indexed">true</bool>
[junit4:junit4]   2> 	  </lst>
[junit4:junit4]   2> 	  <lst>
[junit4:junit4]   2> 	    <str name="name">text</str>
[junit4:junit4]   2> 	    <str name="type">text</str>
[junit4:junit4]   2> 	    <bool name="stored">false</bool>
[junit4:junit4]   2> 	    <bool name="indexed">true</bool>
[junit4:junit4]   2> 	    <bool name="multiValued">true</bool>
[junit4:junit4]   2> 	  </lst>
[junit4:junit4]   2> 	</arr>
[junit4:junit4]   2> 	</response>
[junit4:junit4]   2> 	
[junit4:junit4]   2> 		request was:/schema/fields?indent=on&wt=xml
[junit4:junit4]   2> 		at org.apache.solr.util.RestTestBase.assertQ(RestTestBase.java:136)
[junit4:junit4]   2> 		at org.apache.solr.rest.TestFieldCollectionResource.testGetAllFields(TestFieldCollectionResource.java:26)
[junit4:junit4]   2> 		at sun.reflect.NativeMethodAccessorImpl.invoke0(Native Method)
[junit4:junit4]   2> 		at sun.reflect.NativeMethodAccessorImpl.invoke(NativeMethodAccessorImpl.java:57)
[junit4:junit4]   2> 		at sun.reflect.DelegatingMethodAccessorImpl.invoke(DelegatingMethodAccessorImpl.java:43)
[junit4:junit4]   2> 		at java.lang.reflect.Method.invoke(Method.java:487)
[junit4:junit4]   2> 		at com.carrotsearch.randomizedtesting.RandomizedRunner.invoke(RandomizedRunner.java:1559)
[junit4:junit4]   2> 		at com.carrotsearch.randomizedtesting.RandomizedRunner.access$600(RandomizedRunner.java:79)
[junit4:junit4]   2> 		at com.carrotsearch.randomizedtesting.RandomizedRunner$6.evaluate(RandomizedRunner.java:737)
[junit4:junit4]   2> 		at com.carrotsearch.randomizedtesting.RandomizedRunner$7.evaluate(RandomizedRunner.java:773)
[junit4:junit4]   2> 		at com.carrotsearch.randomizedtesting.RandomizedRunner$8.evaluate(RandomizedRunner.java:787)
[junit4:junit4]   2> 		at com.carrotsearch.randomizedtesting.rules.SystemPropertiesRestoreRule$1.evaluate(SystemPropertiesRestoreRule.java:53)
[junit4:junit4]   2> 		at org.apache.lucene.util.TestRuleSetupTeardownChained$1.evaluate(TestRuleSetupTeardownChained.java:50)
[junit4:junit4]   2> 		at org.apache.lucene.util.TestRuleFieldCacheSanity$1.evaluate(TestRuleFieldCacheSanity.java:51)
[junit4:junit4]   2> 		at org.apache.lucene.util.AbstractBeforeAfterRule$1.evaluate(AbstractBeforeAfterRule.java:46)
[junit4:junit4]   2> 		at com.carrotsearch.randomizedtesting.rules.SystemPropertiesInvariantRule$1.evaluate(SystemPropertiesInvariantRule.java:55)
[junit4:junit4]   2> 		at org.apache.lucene.util.TestRuleThreadAndTestName$1.evaluate(TestRuleThreadAndTestName.java:49)
[junit4:junit4]   2> 		at org.apache.lucene.util.TestRuleIgnoreAfterMaxFailures$1.evaluate(TestRuleIgnoreAfterMaxFailures.java:70)
[junit4:junit4]   2> 		at org.apache.lucene.util.TestRuleMarkFailure$1.evaluate(TestRuleMarkFailure.java:48)
[junit4:junit4]   2> 		at com.carrotsearch.randomizedtesting.rules.StatementAdapter.evaluate(StatementAdapter.java:36)
[junit4:junit4]   2> 		at com.carrotsearch.randomizedtesting.ThreadLeakControl$StatementRunner.run(ThreadLeakControl.java:358)
[junit4:junit4]   2> 		at com.carrotsearch.randomizedtesting.ThreadLeakControl.forkTimeoutingTask(ThreadLeakControl.java:782)
[junit4:junit4]   2> 		at com.carrotsearch.randomizedtesting.ThreadLeakControl$3.evaluate(ThreadLeakControl.java:442)
[junit4:junit4]   2> 		at com.carrotsearch.randomizedtesting.RandomizedRunner.runSingleTest(RandomizedRunner.java:746)
[junit4:junit4]   2> 		at com.carrotsearch.randomizedtesting.RandomizedRunner$3.evaluate(RandomizedRunner.java:648)
[junit4:junit4]   2> 		at com.carrotsearch.randomizedtesting.RandomizedRunner$4.evaluate(RandomizedRunner.java:682)
[junit4:junit4]   2> 		at com.carrotsearch.randomizedtesting.RandomizedRunner$5.evaluate(RandomizedRunner.java:693)
[junit4:junit4]   2> 		at com.carrotsearch.randomizedtesting.rules.StatementAdapter.evaluate(StatementAdapter.java:36)
[junit4:junit4]   2> 		at com.carrotsearch.randomizedtesting.rules.SystemPropertiesRestoreRule$1.evaluate(SystemPropertiesRestoreRule.java:53)
[junit4:junit4]   2> 		at org.apache.lucene.util.AbstractBeforeAfterRule$1.evaluate(AbstractBeforeAfterRule.java:46)
[junit4:junit4]   2> 		at org.apache.lucene.util.TestRuleStoreClassName$1.evaluate(TestRuleStoreClassName.java:42)
[junit4:junit4]   2> 		at com.carrotsearch.randomizedtesting.rules.SystemPropertiesInvariantRule$1.evaluate(SystemPropertiesInvariantRule.java:55)
[junit4:junit4]   2> 		at com.carrotsearch.randomizedtesting.rules.NoShadowingOrOverridesOnMethodsRule$1.evaluate(NoShadowingOrOverridesOnMethodsRule.java:39)
[junit4:junit4]   2> 		at com.carrotsearch.randomizedtesting.rules.NoShadowingOrOverridesOnMethodsRule$1.evaluate(NoShadowingOrOverridesOnMethodsRule.java:39)
[junit4:junit4]   2> 		at com.carrotsearch.randomizedtesting.rules.StatementAdapter.evaluate(StatementAdapter.java:36)
[junit4:junit4]   2> 		at org.apache.lucene.util.TestRuleAssertionsRequired$1.evaluate(TestRuleAssertionsRequired.java:43)
[junit4:junit4]   2> 		at org.apache.lucene.util.TestRuleMarkFailure$1.evaluate(TestRuleMarkFailure.java:48)
[junit4:junit4]   2> 		at org.apache.lucene.util.TestRuleIgnoreAfterMaxFailures$1.evaluate(TestRuleIgnoreAfterMaxFailures.java:70)
[junit4:junit4]   2> 		at org.apache.lucene.util.TestRuleIgnoreTestSuites$1.evaluate(TestRuleIgnoreTestSuites.java:55)
[junit4:junit4]   2> 		at com.carrotsearch.randomizedtesting.rules.StatementAdapter.evaluate(StatementAdapter.java:36)
[junit4:junit4]   2> 		at com.carrotsearch.randomizedtesting.ThreadLeakControl$StatementRunner.run(ThreadLeakControl.java:358)
[junit4:junit4]   2> 		at java.lang.Thread.run(Thread.java:722)
[junit4:junit4]   2> 	
[junit4:junit4]   2> 1151 T144 oas.SolrTestCaseJ4.tearDown ###Ending testGetAllFields
[junit4:junit4]   2> NOTE: reproduce with: ant test  -Dtestcase=TestFieldCollectionResource -Dtests.method=testGetAllFields -Dtests.seed=187A56FCA9BB0EAD -Dtests.multiplier=3 -Dtests.slow=true -Dtests.locale=en_IE -Dtests.timezone=Asia/Macao -Dtests.file.encoding=UTF-8
[junit4:junit4] ERROR   0.08s J1 | TestFieldCollectionResource.testGetAllFields <<<
[junit4:junit4]    > Throwable #1: java.lang.RuntimeException: Exception during query
[junit4:junit4]    > 	at __randomizedtesting.SeedInfo.seed([187A56FCA9BB0EAD:F4D41C385348F735]:0)
[junit4:junit4]    > 	at org.apache.solr.util.RestTestBase.assertQ(RestTestBase.java:143)
[junit4:junit4]    > 	at org.apache.solr.rest.TestFieldCollectionResource.testGetAllFields(TestFieldCollectionResource.java:26)
[junit4:junit4]    > 	at sun.reflect.NativeMethodAccessorImpl.invoke0(Native Method)
[junit4:junit4]    > 	at sun.reflect.NativeMethodAccessorImpl.invoke(NativeMethodAccessorImpl.java:57)
[junit4:junit4]    > 	at sun.reflect.DelegatingMethodAccessorImpl.invoke(DelegatingMethodAccessorImpl.java:43)
[junit4:junit4]    > 	at java.lang.reflect.Method.invoke(Method.java:487)
[junit4:junit4]    > 	at com.carrotsearch.randomizedtesting.RandomizedRunner.invoke(RandomizedRunner.java:1559)
[junit4:junit4]    > 	at com.carrotsearch.randomizedtesting.RandomizedRunner.access$600(RandomizedRunner.java:79)
[junit4:junit4]    > 	at com.carrotsearch.randomizedtesting.RandomizedRunner$6.evaluate(RandomizedRunner.java:737)
[junit4:junit4]    > 	at com.carrotsearch.randomizedtesting.RandomizedRunner$7.evaluate(RandomizedRunner.java:773)
[junit4:junit4]    > 	at com.carrotsearch.randomizedtesting.RandomizedRunner$8.evaluate(RandomizedRunner.java:787)
[junit4:junit4]    > 	at com.carrotsearch.randomizedtesting.rules.SystemPropertiesRestoreRule$1.evaluate(SystemPropertiesRestoreRule.java:53)
[junit4:junit4]    > 	at org.apache.lucene.util.TestRuleSetupTeardownChained$1.evaluate(TestRuleSetupTeardownChained.java:50)
[junit4:junit4]    > 	at org.apache.lucene.util.TestRuleFieldCacheSanity$1.evaluate(TestRuleFieldCacheSanity.java:51)
[junit4:junit4]    > 	at org.apache.lucene.util.AbstractBeforeAfterRule$1.evaluate(AbstractBeforeAfterRule.java:46)
[junit4:junit4]    > 	at com.carrotsearch.randomizedtesting.rules.SystemPropertiesInvariantRule$1.evaluate(SystemPropertiesInvariantRule.java:55)
[junit4:junit4]    > 	at org.apache.lucene.util.TestRuleThreadAndTestName$1.evaluate(TestRuleThreadAndTestName.java:49)
[junit4:junit4]    > 	at org.apache.lucene.util.TestRuleIgnoreAfterMaxFailures$1.evaluate(TestRuleIgnoreAfterMaxFailures.java:70)
[junit4:junit4]    > 	at org.apache.lucene.util.TestRuleMarkFailure$1.evaluate(TestRuleMarkFailure.java:48)
[junit4:junit4]    > 	at com.carrotsearch.randomizedtesting.rules.StatementAdapter.evaluate(StatementAdapter.java:36)
[junit4:junit4]    > 	at com.carrotsearch.randomizedtesting.ThreadLeakControl$StatementRunner.run(ThreadLeakControl.java:358)
[junit4:junit4]    > 	at com.carrotsearch.randomizedtesting.ThreadLeakControl.forkTimeoutingTask(ThreadLeakControl.java:782)
[junit4:junit4]    > 	at com.carrotsearch.randomizedtesting.ThreadLeakControl$3.evaluate(ThreadLeakControl.java:442)
[junit4:junit4]    > 	at com.carrotsearch.randomizedtesting.RandomizedRunner.runSingleTest(RandomizedRunner.java:746)
[junit4:junit4]    > 	at com.carrotsearch.randomizedtesting.RandomizedRunner$3.evaluate(RandomizedRunner.java:648)
[junit4:junit4]    > 	at com.carrotsearch.randomizedtesting.RandomizedRunner$4.evaluate(RandomizedRunner.java:682)
[junit4:junit4]    > 	at com.carrotsearch.randomizedtesting.RandomizedRunner$5.evaluate(RandomizedRunner.java:693)
[junit4:junit4]    > 	at com.carrotsearch.randomizedtesting.rules.StatementAdapter.evaluate(StatementAdapter.java:36)
[junit4:junit4]    > 	at com.carrotsearch.randomizedtesting.rules.SystemPropertiesRestoreRule$1.evaluate(SystemPropertiesRestoreRule.java:53)
[junit4:junit4]    > 	at org.apache.lucene.util.AbstractBeforeAfterRule$1.evaluate(AbstractBeforeAfterRule.java:46)
[junit4:junit4]    > 	at org.apache.lucene.util.TestRuleStoreClassName$1.evaluate(TestRuleStoreClassName.java:42)
[junit4:junit4]    > 	at com.carrotsearch.randomizedtesting.rules.SystemPropertiesInvariantRule$1.evaluate(SystemPropertiesInvariantRule.java:55)
[junit4:junit4]    > 	at com.carrotsearch.randomizedtesting.rules.NoShadowingOrOverridesOnMethodsRule$1.evaluate(NoShadowingOrOverridesOnMethodsRule.java:39)
[junit4:junit4]    > 	at com.carrotsearch.randomizedtesting.rules.NoShadowingOrOverridesOnMethodsRule$1.evaluate(NoShadowingOrOverridesOnMethodsRule.java:39)
[junit4:junit4]    > 	at com.carrotsearch.randomizedtesting.rules.StatementAdapter.evaluate(StatementAdapter.java:36)
[junit4:junit4]    > 	at org.apache.lucene.util.TestRuleAssertionsRequired$1.evaluate(TestRuleAssertionsRequired.java:43)
[junit4:junit4]    > 	at org.apache.lucene.util.TestRuleMarkFailure$1.evaluate(TestRuleMarkFailure.java:48)
[junit4:junit4]    > 	at org.apache.lucene.util.TestRuleIgnoreAfterMaxFailures$1.evaluate(TestRuleIgnoreAfterMaxFailures.java:70)
[junit4:junit4]    > 	at org.apache.lucene.util.TestRuleIgnoreTestSuites$1.evaluate(TestRuleIgnoreTestSuites.java:55)
[junit4:junit4]    > 	at com.carrotsearch.randomizedtesting.rules.StatementAdapter.evaluate(StatementAdapter.java:36)
[junit4:junit4]    > 	at com.carrotsearch.randomizedtesting.ThreadLeakControl$StatementRunner.run(ThreadLeakControl.java:358)
[junit4:junit4]    > 	at java.lang.Thread.run(Thread.java:722)
[junit4:junit4]    > Caused by: java.lang.RuntimeException: REQUEST FAILED: xpath=(/response/arr[@name='fields']/lst/str[@name='name'])[1] = 'custstopfilt'
[junit4:junit4]    > 	xml response was: <?xml version="1.0" encoding="UTF-8"?>
[junit4:junit4]    > <response>
[junit4:junit4]    > 
[junit4:junit4]    > <lst name="responseHeader">
[junit4:junit4]    >   <int name="status">0</int>
[junit4:junit4]    >   <int name="QTime">3</int>
[junit4:junit4]    > </lst>
[junit4:junit4]    > <arr name="fields">
[junit4:junit4]    >   <lst>
[junit4:junit4]    >     <str name="name">porterfilt</str>
[junit4:junit4]    >     <str name="type">porterfilt</str>
[junit4:junit4]    >     <bool name="stored">true</bool>
[junit4:junit4]    >     <bool name="indexed">true</bool>
[junit4:junit4]    >   </lst>
[junit4:junit4]    >   <lst>
[junit4:junit4]    >     <str name="name">copyfield_source</str>
[junit4:junit4]    >     <str name="type">string</str>
[junit4:junit4]    >     <bool name="stored">true</bool>
[junit4:junit4]    >     <bool name="indexed">true</bool>
[junit4:junit4]    >     <bool name="multiValued">true</bool>
[junit4:junit4]    >   </lst>
[junit4:junit4]    >   <lst>
[junit4:junit4]    >     <str name="name">uniq2</str>
[junit4:junit4]    >     <str name="type">string</str>
[junit4:junit4]    >     <bool name="stored">true</bool>
[junit4:junit4]    >     <bool name="indexed">true</bool>
[junit4:junit4]    >     <bool name="multiValued">true</bool>
[junit4:junit4]    >   </lst>
[junit4:junit4]    >   <lst>
[junit4:junit4]    >     <str name="name">custengporterfilt</str>
[junit4:junit4]    >     <str name="type">custengporterfilt</str>
[junit4:junit4]    >     <bool name="stored">true</bool>
[junit4:junit4]    >     <bool name="indexed">true</bool>
[junit4:junit4]    >   </lst>
[junit4:junit4]    >   <lst>
[junit4:junit4]    >     <str name="name">weight</str>
[junit4:junit4]    >     <str name="type">float</str>
[junit4:junit4]    >     <bool name="stored">true</bool>
[junit4:junit4]    >     <bool name="indexed">true</bool>
[junit4:junit4]    >   </lst>
[junit4:junit4]    >   <lst>
[junit4:junit4]    >     <str name="name">uniq3</str>
[junit4:junit4]    >     <str name="type">string</str>
[junit4:junit4]    >     <bool name="stored">true</bool>
[junit4:junit4]    >     <bool name="indexed">true</bool>
[junit4:junit4]    >   </lst>
[junit4:junit4]    >   <lst>
[junit4:junit4]    >     <str name="name">lowertok</str>
[junit4:junit4]    >     <str name="type">lowertok</str>
[junit4:junit4]    >     <bool name="stored">true</bool>
[junit4:junit4]    >     <bool name="indexed">true</bool>
[junit4:junit4]    >   </lst>
[junit4:junit4]    >   <lst>
[junit4:junit4]    >     <str name="name">bsto</str>
[junit4:junit4]    >     <str name="type">boolean</str>
[junit4:junit4]    >     <bool name="stored">true</bool>
[junit4:junit4]    >     <bool name="indexed">false</bool>
[junit4:junit4]    >   </lst>
[junit4:junit4]    >   <lst>
[junit4:junit4]    >     <str name="name">numericsubword</str>
[junit4:junit4]    >     <str name="type">numericsubword</str>
[junit4:junit4]    >     <bool name="stored">true</bool>
[junit4:junit4]    >     <bool name="indexed">true</bool>
[junit4:junit4]    >   </lst>
[junit4:junit4]    >   <lst>
[junit4:junit4]    >     <str name="name">nouniq</str>
[junit4:junit4]    >     <str name="type">string</str>
[junit4:junit4]    >     <bool name="stored">true</bool>
[junit4:junit4]    >     <bool name="indexed">true</bool>
[junit4:junit4]    >     <bool name="multiValued">true</bool>
[junit4:junit4]    >   </lst>
[junit4:junit4]    >   <lst>
[junit4:junit4]    >     <str name="name">nullfirst</str>
[junit4:junit4]    >     <str name="type">string</str>
[junit4:junit4]    >     <bool name="stored">true</bool>
[junit4:junit4]    >     <bool name="sortMissingFirst">true</bool>
[junit4:junit4]    >     <bool name="indexed">true</bool>
[junit4:junit4]    >   </lst>
[junit4:junit4]    >   <lst>
[junit4:junit4]    >     <str name="name">name</str>
[junit4:junit4]    >     <str name="type">nametext</str>
[junit4:junit4]    >     <bool name="stored">true</bool>
[junit4:junit4]    >     <bool name="indexed">true</bool>
[junit4:junit4]    >   </lst>
[junit4:junit4]    >   <lst>
[junit4:junit4]    >     <str name="name">wdf_nocase</str>
[junit4:junit4]    >     <str name="type">wdf_nocase</str>
[junit4:junit4]    >     <bool name="stored">true</bool>
[junit4:junit4]    >     <bool name="indexed">true</bool>
[junit4:junit4]    >   </lst>
[junit4:junit4]    >   <lst>
[junit4:junit4]    >     <str name="name">numberpartfail</str>
[junit4:junit4]    >     <str name="type">failtype1</str>
[junit4:junit4]    >     <bool name="stored">true</bool>
[junit4:junit4]    >     <bool name="indexed">true</bool>
[junit4:junit4]    >   </lst>
[junit4:junit4]    >   <lst>
[junit4:junit4]    >     <str name="name">ssto</str>
[junit4:junit4]    >     <str name="type">string</str>
[junit4:junit4]    >     <bool name="stored">true</bool>
[junit4:junit4]    >     <bool name="indexed">false</bool>
[junit4:junit4]    >   </lst>
[junit4:junit4]    >   <lst>
[junit4:junit4]    >     <str name="name">sku2</str>
[junit4:junit4]    >     <str name="type">skutype2</str>
[junit4:junit4]    >     <bool name="stored">true</bool>
[junit4:junit4]    >     <bool name="indexed">true</bool>
[junit4:junit4]    >   </lst>
[junit4:junit4]    >   <lst>
[junit4:junit4]    >     <str name="name">wdf_preserve</str>
[junit4:junit4]    >     <str name="type">wdf_preserve</str>
[junit4:junit4]    >     <bool name="stored">true</bool>
[junit4:junit4]    >     <bool name="indexed">true</bool>
[junit4:junit4]    >   </lst>
[junit4:junit4]    >   <lst>
[junit4:junit4]    >     <str name="name">keywordtok</str>
[junit4:junit4]    >     <str name="type">keywordtok</str>
[junit4:junit4]    >     <bool name="stored">true</bool>
[junit4:junit4]    >     <bool name="indexed">true</bool>
[junit4:junit4]    >   </lst>
[junit4:junit4]    >   <lst>
[junit4:junit4]    >     <str name="name">store</str>
[junit4:junit4]    >     <str name="type">location</str>
[junit4:junit4]    >     <bool name="stored">true</bool>
[junit4:junit4]    >     <bool name="indexed">true</bool>
[junit4:junit4]    >   </lst>
[junit4:junit4]    >   <lst>
[junit4:junit4]    >     <str name="name">HTMLwhitetok</str>
[junit4:junit4]    >     <str name="type">HTMLwhitetok</str>
[junit4:junit4]    >     <bool name="stored">true</bool>
[junit4:junit4]    >     <bool name="indexed">true</bool>
[junit4:junit4]    >   </lst>
[junit4:junit4]    >   <lst>
[junit4:junit4]    >     <str name="name">sind</str>
[junit4:junit4]    >     <str name="type">string</str>
[junit4:junit4]    >     <bool name="stored">false</bool>
[junit4:junit4]    >     <bool name="indexed">true</bool>
[junit4:junit4]    >   </lst>
[junit4:junit4]    >   <lst>
[junit4:junit4]    >     <str name="name">title_stemmed</str>
[junit4:junit4]    >     <str name="type">text</str>
[junit4:junit4]    >     <bool name="stored">false</bool>
[junit4:junit4]    >     <bool name="indexed">true</bool>
[junit4:junit4]    >   </lst>
[junit4:junit4]    >   <lst>
[junit4:junit4]    >     <str name="name">custstopfilt</str>
[junit4:junit4]    >     <str name="type">custstopfilt</str>
[junit4:junit4]    >     <bool name="stored">true</bool>
[junit4:junit4]    >     <bool name="indexed">true</bool>
[junit4:junit4]    >   </lst>
[junit4:junit4]    >   <lst>
[junit4:junit4]    >     <str name="name">test_notv</str>
[junit4:junit4]    >     <str name="type">text</str>
[junit4:junit4]    >     <bool name="termVectors">false</bool>
[junit4:junit4]    >   </lst>
[junit4:junit4]    >   <lst>
[junit4:junit4]    >     <str name="name">bday</str>
[junit4:junit4]    >     <str name="type">date</str>
[junit4:junit4]    >     <bool name="stored">true</bool>
[junit4:junit4]    >     <bool name="indexed">true</bool>
[junit4:junit4]    >   </lst>
[junit4:junit4]    >   <lst>
[junit4:junit4]    >     <str name="name">test_postv</str>
[junit4:junit4]    >     <str name="type">text</str>
[junit4:junit4]    >     <bool name="termPositions">true</bool>
[junit4:junit4]    >     <bool name="termVectors">true</bool>
[junit4:junit4]    >   </lst>
[junit4:junit4]    >   <lst>
[junit4:junit4]    >     <str name="name">title</str>
[junit4:junit4]    >     <str name="type">nametext</str>
[junit4:junit4]    >     <bool name="stored">true</bool>
[junit4:junit4]    >     <bool name="indexed">true</bool>
[junit4:junit4]    >   </lst>
[junit4:junit4]    >   <lst>
[junit4:junit4]    >     <str name="name">point</str>
[junit4:junit4]    >     <str name="type">xy</str>
[junit4:junit4]    >     <bool name="stored">true</bool>
[junit4:junit4]    >     <bool name="indexed">true</bool>
[junit4:junit4]    >     <bool name="multiValued">false</bool>
[junit4:junit4]    >   </lst>
[junit4:junit4]    >   <lst>
[junit4:junit4]    >     <str name="name">shouldbeunstored</str>
[junit4:junit4]    >     <str name="type">unstored</str>
[junit4:junit4]    >   </lst>
[junit4:junit4]    >   <lst>
[junit4:junit4]    >     <str name="name">isto</str>
[junit4:junit4]    >     <str name="type">int</str>
[junit4:junit4]    >     <bool name="stored">true</bool>
[junit4:junit4]    >     <bool name="indexed">false</bool>
[junit4:junit4]    >   </lst>
[junit4:junit4]    >   <lst>
[junit4:junit4]    >     <str name="name">standardfilt</str>
[junit4:junit4]    >     <str name="type">standardfilt</str>
[junit4:junit4]    >     <bool name="stored">true</bool>
[junit4:junit4]    >     <bool name="indexed">true</bool>
[junit4:junit4]    >   </lst>
[junit4:junit4]    >   <lst>
[junit4:junit4]    >     <str name="name">standardtokfilt</str>
[junit4:junit4]    >     <str name="type">standardtokfilt</str>
[junit4:junit4]    >     <bool name="stored">true</bool>
[junit4:junit4]    >     <bool name="indexed">true</bool>
[junit4:junit4]    >   </lst>
[junit4:junit4]    >   <lst>
[junit4:junit4]    >     <str name="name">test_posofftv</str>
[junit4:junit4]    >     <str name="type">text</str>
[junit4:junit4]    >     <bool name="termOffsets">true</bool>
[junit4:junit4]    >     <bool name="termPositions">true</bool>
[junit4:junit4]    >     <bool name="termVectors">true</bool>
[junit4:junit4]    >   </lst>
[junit4:junit4]    >   <lst>
[junit4:junit4]    >     <str name="name">id</str>
[junit4:junit4]    >     <str name="type">string</str>
[junit4:junit4]    >     <bool name="stored">true</bool>
[junit4:junit4]    >     <bool name="required">true</bool>
[junit4:junit4]    >     <bool name="indexed">true</bool>
[junit4:junit4]    >     <bool name="multiValued">false</bool>
[junit4:junit4]    >     <bool name="uniqueKey">true</bool>
[junit4:junit4]    >   </lst>
[junit4:junit4]    >   <lst>
[junit4:junit4]    >     <str name="name">pointD</str>
[junit4:junit4]    >     <str name="type">xyd</str>
[junit4:junit4]    >     <bool name="stored">true</bool>
[junit4:junit4]    >     <bool name="indexed">true</bool>
[junit4:junit4]    >     <bool name="multiValued">false</bool>
[junit4:junit4]    >   </lst>
[junit4:junit4]    >   <lst>
[junit4:junit4]    >     <str name="name">timestamp</str>
[junit4:junit4]    >     <str name="type">date</str>
[junit4:junit4]    >     <bool name="stored">true</bool>
[junit4:junit4]    >     <bool name="indexed">true</bool>
[junit4:junit4]    >   </lst>
[junit4:junit4]    >   <lst>
[junit4:junit4]    >     <str name="name">subject</str>
[junit4:junit4]    >     <str name="type">text</str>
[junit4:junit4]    >     <bool name="stored">true</bool>
[junit4:junit4]    >     <bool name="indexed">true</bool>
[junit4:junit4]    >   </lst>
[junit4:junit4]    >   <lst>
[junit4:junit4]    >     <str name="name">lowerfilt</str>
[junit4:junit4]    >     <str name="type">lowerfilt</str>
[junit4:junit4]    >     <bool name="stored">true</bool>
[junit4:junit4]    >     <bool name="indexed">true</bool>
[junit4:junit4]    >   </lst>
[junit4:junit4]    >   <lst>
[junit4:junit4]    >     <str name="name">iind</str>
[junit4:junit4]    >     <str name="type">int</str>
[junit4:junit4]    >     <bool name="stored">false</bool>
[junit4:junit4]    >     <bool name="indexed">true</bool>
[junit4:junit4]    >   </lst>
[junit4:junit4]    >   <lst>
[junit4:junit4]    >     <str name="name">text_np</str>
[junit4:junit4]    >     <str name="type">text_np</str>
[junit4:junit4]    >     <bool name="stored">false</bool>
[junit4:junit4]    >     <bool name="indexed">true</bool>
[junit4:junit4]    >   </lst>
[junit4:junit4]    >   <lst>
[junit4:junit4]    >     <str name="name">test_basictv</str>
[junit4:junit4]    >     <str name="type">text</str>
[junit4:junit4]    >     <bool name="termVectors">true</bool>
[junit4:junit4]    >   </lst>
[junit4:junit4]    >   <lst>
[junit4:junit4]    >     <str name="name">sindsto</str>
[junit4:junit4]    >     <str name="type">string</str>
[junit4:junit4]    >     <bool name="stored">true</bool>
[junit4:junit4]    >     <bool name="indexed">true</bool>
[junit4:junit4]    >   </lst>
[junit4:junit4]    >   <lst>
[junit4:junit4]    >     <str name="name">syn</str>
[junit4:junit4]    >     <str name="type">syn</str>
[junit4:junit4]    >     <bool name="stored">true</bool>
[junit4:junit4]    >     <bool name="indexed">true</bool>
[junit4:junit4]    >   </lst>
[junit4:junit4]    >   <lst>
[junit4:junit4]    >     <str name="name">stopfilt</str>
[junit4:junit4]    >     <str name="type">stopfilt</str>
[junit4:junit4]    >     <bool name="stored">true</bool>
[junit4:junit4]    >     <bool name="indexed">true</bool>
[junit4:junit4]    >   </lst>
[junit4:junit4]    >   <lst>
[junit4:junit4]    >     <str name="name">HTMLstandardtok</str>
[junit4:junit4]    >     <str name="type">HTMLstandardtok</str>
[junit4:junit4]    >     <bool name="stored">true</bool>
[junit4:junit4]    >     <bool name="indexed">true</bool>
[junit4:junit4]    >   </lst>
[junit4:junit4]    >   <lst>
[junit4:junit4]    >     <str name="name">whitetok</str>
[junit4:junit4]    >     <str name="type">whitetok</str>
[junit4:junit4]    >     <bool name="stored">true</bool>
[junit4:junit4]    >     <bool name="indexed">true</bool>
[junit4:junit4]    >   </lst>
[junit4:junit4]    >   <lst>
[junit4:junit4]    >     <str name="name">test_hlt_off</str>
[junit4:junit4]    >     <str name="type">highlittext</str>
[junit4:junit4]    >     <bool name="compressed">false</bool>
[junit4:junit4]    >     <bool name="indexed">true</bool>
[junit4:junit4]    >   </lst>
[junit4:junit4]    >   <lst>
[junit4:junit4]    >     <str name="name">signatureField</str>
[junit4:junit4]    >     <str name="type">string</str>
[junit4:junit4]    >     <bool name="stored">false</bool>
[junit4:junit4]    >     <bool name="indexed">true</bool>
[junit4:junit4]    >   </lst>
[junit4:junit4]    >   <lst>
[junit4:junit4]    >     <str name="name">title_lettertok</str>
[junit4:junit4]    >     <str name="type">lettertok</str>
[junit4:junit4]    >     <bool name="stored">false</bool>
[junit4:junit4]    >     <bool name="indexed">true</bool>
[junit4:junit4]    >   </lst>
[junit4:junit4]    >   <lst>
[junit4:junit4]    >     <str name="name">sku1</str>
[junit4:junit4]    >     <str name="type">skutype1</str>
[junit4:junit4]    >     <bool name="stored">true</bool>
[junit4:junit4]    >     <bool name="indexed">true</bool>
[junit4:junit4]    >   </lst>
[junit4:junit4]    >   <lst>
[junit4:junit4]    >     <str name="name">textgap</str>
[junit4:junit4]    >     <str name="type">textgap</str>
[junit4:junit4]    >     <bool name="stored">true</bool>
[junit4:junit4]    >     <bool name="indexed">true</bool>
[junit4:junit4]    >   </lst>
[junit4:junit4]    >   <lst>
[junit4:junit4]    >     <str name="name">test_offtv</str>
[junit4:junit4]    >     <str name="type">text</str>
[junit4:junit4]    >     <bool name="termOffsets">true</bool>
[junit4:junit4]    >     <bool name="termVectors">true</bool>
[junit4:junit4]    >   </lst>
[junit4:junit4]    >   <lst>
[junit4:junit4]    >     <str name="name">uniq</str>
[junit4:junit4]    >     <str name="type">string</str>
[junit4:junit4]    >     <bool name="stored">true</bool>
[junit4:junit4]    >     <bool name="indexed">true</bool>
[junit4:junit4]    >     <bool name="multiValued">true</bool>
[junit4:junit4]    >   </lst>
[junit4:junit4]    >   <lst>
[junit4:junit4]    >     <str name="name">uuid</str>
[junit4:junit4]    >     <str name="type">uuid</str>
[junit4:junit4]    >     <bool name="stored">true</bool>
[junit4:junit4]    >   </lst>
[junit4:junit4]    >   <lst>
[junit4:junit4]    >     <str name="name">shouldbeunindexed</str>
[junit4:junit4]    >     <str name="type">unstored</str>
[junit4:junit4]    >     <bool name="stored">true</bool>
[junit4:junit4]    >     <bool name="indexed">false</bool>
[junit4:junit4]    >   </lst>
[junit4:junit4]    >   <lst>
[junit4:junit4]    >     <str name="name">teststop</str>
[junit4:junit4]    >     <str name="type">teststop</str>
[junit4:junit4]    >     <bool name="stored">true</bool>
[junit4:junit4]    >     <bool name="indexed">true</bool>
[junit4:junit4]    >   </lst>
[junit4:junit4]    >   <lst>
[junit4:junit4]    >     <str name="name">point_hash</str>
[junit4:junit4]    >     <str name="type">geohash</str>
[junit4:junit4]    >     <bool name="stored">true</bool>
[junit4:junit4]    >     <bool name="indexed">true</bool>
[junit4:junit4]    >     <bool name="multiValued">false</bool>
[junit4:junit4]    >   </lst>
[junit4:junit4]    >   <lst>
[junit4:junit4]    >     <str name="name">lengthfilt</str>
[junit4:junit4]    >     <str name="type">lengthfilt</str>
[junit4:junit4]    >     <bool name="stored">true</bool>
[junit4:junit4]    >     <bool name="indexed">true</bool>
[junit4:junit4]    >   </lst>
[junit4:junit4]    >   <lst>
[junit4:junit4]    >     <str name="name">patternreplacefilt</str>
[junit4:junit4]    >     <str name="type">patternreplacefilt</str>
[junit4:junit4]    >     <bool name="stored">true</bool>
[junit4:junit4]    >     <bool name="indexed">true</bool>
[junit4:junit4]    >   </lst>
[junit4:junit4]    >   <lst>
[junit4:junit4]    >     <str name="name">subword</str>
[junit4:junit4]    >     <str name="type">subword</str>
[junit4:junit4]    >     <bool name="stored">true</bool>
[junit4:junit4]    >     <bool name="indexed">true</bool>
[junit4:junit4]    >   </lst>
[junit4:junit4]    >   <lst>
[junit4:junit4]    >     <str name="name">bind</str>
[junit4:junit4]    >     <str name="type">boolean</str>
[junit4:junit4]    >     <bool name="stored">false</bool>
[junit4:junit4]    >     <bool name="indexed">true</bool>
[junit4:junit4]    >   </lst>
[junit4:junit4]    >   <lst>
[junit4:junit4]    >     <str name="name">_version_</str>
[junit4:junit4]    >     <str name="type">long</str>
[junit4:junit4]    >     <bool name="stored">true</bool>
[junit4:junit4]    >     <bool name="indexed">true</bool>
[junit4:junit4]    >   </lst>
[junit4:junit4]    >   <lst>
[junit4:junit4]    >     <str name="name">standardtok</str>
[junit4:junit4]    >     <str name="type">standardtok</str>
[junit4:junit4]    >     <bool name="stored">true</bool>
[junit4:junit4]    >     <bool name="indexed">true</bool>
[junit4:junit4]    >   </lst>
[junit4:junit4]    >   <lst>
[junit4:junit4]    >     <str name="name">shouldbestored</str>
[junit4:junit4]    >     <str name="type">unstored</str>
[junit4:junit4]    >     <bool name="stored">true</bool>
[junit4:junit4]    >   </lst>
[junit4:junit4]    >   <lst>
[junit4:junit4]    >     <str name="name">lettertok</str>
[junit4:junit4]    >     <str name="type">lettertok</str>
[junit4:junit4]    >     <bool name="stored">true</bool>
[junit4:junit4]    >     <bool name="indexed">true</bool>
[junit4:junit4]    >   </lst>
[junit4:junit4]    >   <lst>
[junit4:junit4]    >     <str name="name">dedup</str>
[junit4:junit4]    >     <str name="type">dedup</str>
[junit4:junit4]    >     <bool name="stored">true</bool>
[junit4:junit4]    >     <bool name="indexed">true</bool>
[junit4:junit4]    >   </lst>
[junit4:junit4]    >   <lst>
[junit4:junit4]    >     <str name="name">engporterfilt</str>
[junit4:junit4]    >     <str name="type">engporterfilt</str>
[junit4:junit4]    >     <bool name="stored">true</bool>
[junit4:junit4]    >     <bool name="indexed">true</bool>
[junit4:junit4]    >   </lst>
[junit4:junit4]    >   <lst>
[junit4:junit4]    >     <str name="name">bindsto</str>
[junit4:junit4]    >     <str name="type">boolean</str>
[junit4:junit4]    >     <bool name="stored">true</bool>
[junit4:junit4]    >     <bool name="indexed">true</bool>
[junit4:junit4]    >   </lst>
[junit4:junit4]    >   <lst>
[junit4:junit4]    >     <str name="name">protectedsubword</str>
[junit4:junit4]    >     <str name="type">protectedsubword</str>
[junit4:junit4]    >     <bool name="stored">true</bool>
[junit4:junit4]    >     <bool name="indexed">true</bool>
[junit4:junit4]    >   </lst>
[junit4:junit4]    >   <lst>
[junit4:junit4]    >     <str name="name">test_hlt</str>
[junit4:junit4]    >     <str name="type">highlittext</str>
[junit4:junit4]    >     <bool name="compressed">true</bool>
[junit4:junit4]    >     <bool name="indexed">true</bool>
[junit4:junit4]    >   </lst>
[junit4:junit4]    >   <lst>
[junit4:junit4]    >     <str name="name">text</str>
[junit4:junit4]    >     <str name="type">text</str>
[junit4:junit4]    >     <bool name="stored">false</bool>
[junit4:junit4]    >     <bool name="indexed">true</bool>
[junit4:junit4]    >     <bool name="multiValued">true</bool>
[junit4:junit4]    >   </lst>
[junit4:junit4]    > </arr>
[junit4:junit4]    > </response>
[junit4:junit4]    > 
[junit4:junit4]    > 	request was:/schema/fields?indent=on&wt=xml
[junit4:junit4]    > 	at org.apache.solr.util.RestTestBase.assertQ(RestTestBase.java:136)
[junit4:junit4]    > 	... 41 more
[junit4:junit4]   2> 1165 T144 oas.SolrTestCaseJ4.setUp ###Starting testNotFoundFields
[junit4:junit4]   2> 1168 T152 C30 oasr.BaseSchemaResource.handlePostExecution [collection1] webapp=/solr path=/schema/fields params={indent=on&fl=not_in_there,this_one_either&wt=xml} status=0 QTime=1 
[junit4:junit4]   2> 1168 T152 C30 orel.LogFilter.afterHandle 2013-03-07	00:15:43	127.0.0.1	-	127.0.0.1	35064	GET	/solr/schema/fields	indent=on&wt=xml&fl=not_in_there,this_one_either	200	-	0	1	http://127.0.0.1:35064	Java/1.8.0-ea	-
[junit4:junit4]   2> 1172 T144 oas.SolrTestCaseJ4.tearDown ###Ending testNotFoundFields
[junit4:junit4]   2> 1177 T144 oas.SolrTestCaseJ4.setUp ###Starting testGetTwoFields
[junit4:junit4]   2> 1179 T153 C30 oasr.BaseSchemaResource.handlePostExecution [collection1] webapp=/solr path=/schema/fields params={indent=on&fl=id,_version_&wt=xml} status=0 QTime=1 
[junit4:junit4]   2> 1180 T153 C30 orel.LogFilter.afterHandle 2013-03-07	00:15:43	127.0.0.1	-	127.0.0.1	35064	GET	/solr/schema/fields	indent=on&wt=xml&fl=id,_version_	200	-	0	1	http://127.0.0.1:35064	Java/1.8.0-ea	-
[junit4:junit4]   2> 1184 T144 oas.SolrTestCaseJ4.tearDown ###Ending testGetTwoFields
[junit4:junit4]   2> 1189 T144 oas.SolrTestCaseJ4.setUp ###Starting testJsonGetTwoFields
[junit4:junit4]   2> 1191 T151 C30 oasr.BaseSchemaResource.handlePostExecution [collection1] webapp=/solr path=/schema/fields params={indent=on&fl=id,_version_&wt=json} status=0 QTime=1 
[junit4:junit4]   2> 1192 T151 C30 orel.LogFilter.afterHandle 2013-03-07	00:15:43	127.0.0.1	-	127.0.0.1	35064	GET	/solr/schema/fields	indent=on&fl=id,_version_&wt=json	200	-	0	1	http://127.0.0.1:35064	Java/1.8.0-ea	-
[junit4:junit4]   2> 1193 T144 oas.SolrTestCaseJ4.tearDown ###Ending testJsonGetTwoFields
[junit4:junit4]   2> 1215 T144 oasc.CoreContainer.shutdown Shutting down CoreContainer instance=1317710472
[junit4:junit4]   2> 1218 T144 oasc.SolrCore.close [collection1]  CLOSING SolrCore org.apache.solr.core.SolrCore@4bec3040
[junit4:junit4]   2> 1235 T144 oasu.DirectUpdateHandler2.close closing DirectUpdateHandler2{commits=0,autocommits=0,soft autocommits=0,optimizes=0,rollbacks=0,expungeDeletes=0,docsPending=0,adds=0,deletesById=0,deletesByQuery=0,errors=0,cumulative_adds=0,cumulative_deletesById=0,cumulative_deletesByQuery=0,cumulative_errors=0}
[junit4:junit4]   2> 1235 T144 oasu.SolrCoreState.decrefSolrCoreState Closing SolrCoreState
[junit4:junit4]   2> 1235 T144 oasu.DefaultSolrCoreState.closeIndexWriter SolrCoreState ref count has reached 0 - closing IndexWriter
[junit4:junit4]   2> 1235 T144 oasu.DefaultSolrCoreState.closeIndexWriter closing IndexWriter with IndexWriterCloser
[junit4:junit4]   2> 1236 T144 oasc.SolrCore.closeSearcher [collection1] Closing main searcher on request.
[junit4:junit4]   2> 1236 T144 oasc.CachingDirectoryFactory.close Releasing directory:/mnt/ssd/jenkins/workspace/Lucene-Solr-trunk-Linux/solr/build/solr-core/test/J1/solrtest-TestFieldCollectionResource-1362586541941/index
[junit4:junit4]   2> 1236 T144 oasc.CachingDirectoryFactory.close Closing directory when closing factory:/mnt/ssd/jenkins/workspace/Lucene-Solr-trunk-Linux/solr/build/solr-core/test/J1/solrtest-TestFieldCollectionResource-1362586541941
[junit4:junit4]   2> 1237 T144 oasc.CachingDirectoryFactory.closeDirectory Closing directory:/mnt/ssd/jenkins/workspace/Lucene-Solr-trunk-Linux/solr/build/solr-core/test/J1/solrtest-TestFieldCollectionResource-1362586541941
[junit4:junit4]   2> 1237 T144 oasc.CachingDirectoryFactory.close Closing directory when closing factory:/mnt/ssd/jenkins/workspace/Lucene-Solr-trunk-Linux/solr/build/solr-core/test/J1/solrtest-TestFieldCollectionResource-1362586541941/index
[junit4:junit4]   2> 1237 T144 oasc.CachingDirectoryFactory.closeDirectory Closing directory:/mnt/ssd/jenkins/workspace/Lucene-Solr-trunk-Linux/solr/build/solr-core/test/J1/solrtest-TestFieldCollectionResource-1362586541941/index
[junit4:junit4]   2> 1239 T144 oejsh.ContextHandler.doStop stopped o.e.j.s.ServletContextHandler{/solr,null}
[junit4:junit4]   2> 1291 T144 oas.SolrTestCaseJ4.deleteCore ###deleteCore
[junit4:junit4]   2> NOTE: test params are: codec=Lucene42: {}, docValues:{}, sim=RandomSimilarityProvider(queryNorm=true,coord=yes): {}, locale=en_IE, timezone=Asia/Macao
[junit4:junit4]   2> NOTE: Linux 3.2.0-38-generic amd64/Oracle Corporation 1.8.0-ea (64-bit)/cpus=8,threads=1,free=126993824,total=261160960
[junit4:junit4]   2> NOTE: All tests run in this JVM: [TestBinaryField, TestRecovery, TestFiltering, StandardRequestHandlerTest, RequiredFieldsTest, SpellPossibilityIteratorTest, TestQuerySenderNoQuery, HighlighterConfigTest, TestMultiCoreConfBootstrap, CurrencyFieldXmlFileTest, SolrRequestParserTest, OutputWriterTest, DefaultValueUpdateProcessorTest, TestLMJelinekMercerSimilarityFactory, TestSolr4Spatial, TestCollationField, RequestHandlersTest, NumericFieldsTest, IndexBasedSpellCheckerTest, TestSolrXMLSerializer, XmlUpdateRequestHandlerTest, UpdateParamsTest, NotRequiredUniqueKeyTest, DocumentAnalysisRequestHandlerTest, TestFieldCollectionResource]
[junit4:junit4] Completed on J1 in 1.32s, 5 tests, 2 errors <<< FAILURES!

[...truncated 293 lines...]
[junit4:junit4] Suite: org.apache.solr.cloud.BasicDistributedZk2Test
[junit4:junit4]   2> 0 T1270 oas.BaseDistributedSearchTestCase.initHostContext Setting hostContext system property: /
[junit4:junit4]   2> 3 T1270 oas.SolrTestCaseJ4.setUp ###Starting testDistribSearch
[junit4:junit4]   2> Creating dataDir: /mnt/ssd/jenkins/workspace/Lucene-Solr-trunk-Linux/solr/build/solr-core/test/J1/./solrtest-BasicDistributedZk2Test-1362586929975
[junit4:junit4]   2> 4 T1270 oasc.ZkTestServer.run STARTING ZK TEST SERVER
[junit4:junit4]   2> 4 T1271 oasc.ZkTestServer$ZKServerMain.runFromConfig Starting server
[junit4:junit4]   2> 5 T1271 oazs.ZooKeeperServer.setTickTime tickTime set to 1000
[junit4:junit4]   2> 5 T1271 oazs.ZooKeeperServer.setMinSessionTimeout minSessionTimeout set to -1
[junit4:junit4]   2> 5 T1271 oazs.ZooKeeperServer.setMaxSessionTimeout maxSessionTimeout set to -1
[junit4:junit4]   2> 6 T1271 oazs.NIOServerCnxnFactory.configure binding to port 0.0.0.0/0.0.0.0:0
[junit4:junit4]   2> 6 T1271 oazsp.FileTxnSnapLog.save Snapshotting: 0x0 to /mnt/ssd/jenkins/workspace/Lucene-Solr-trunk-Linux/solr/build/solr-core/test/J1/./org.apache.solr.cloud.BasicDistributedZk2Test-1362586929974/zookeeper/server1/data/version-2/snapshot.0
[junit4:junit4]   2> 104 T1270 oasc.ZkTestServer.run start zk server on port:38035
[junit4:junit4]   2> 105 T1270 oaz.ZooKeeper.<init> Initiating client connection, connectString=127.0.0.1:38035 sessionTimeout=10000 watcher=org.apache.solr.common.cloud.ConnectionManager@c501de4
[junit4:junit4]   2> 106 T1270 oascc.ConnectionManager.waitForConnected Waiting for client to connect to ZooKeeper
[junit4:junit4]   2> 106 T1276 oaz.ClientCnxn$SendThread.logStartConnect Opening socket connection to server localhost.localdomain/127.0.0.1:38035. Will not attempt to authenticate using SASL (access denied ("javax.security.auth.AuthPermission" "getLoginConfiguration"))
[junit4:junit4]   2> 106 T1276 oaz.ClientCnxn$SendThread.primeConnection Socket connection established to localhost.localdomain/127.0.0.1:38035, initiating session
[junit4:junit4]   2> 107 T1272 oazs.NIOServerCnxnFactory.run Accepted socket connection from /127.0.0.1:58802
[junit4:junit4]   2> 107 T1272 oazs.ZooKeeperServer.processConnectRequest Client attempting to establish new session at /127.0.0.1:58802
[junit4:junit4]   2> 107 T1274 oazsp.FileTxnLog.append Creating new log file: log.1
[junit4:junit4]   2> 1423 T1274 oazsp.FileTxnLog.commit WARNING fsync-ing the write ahead log in SyncThread:0 took 1314ms which will adversely effect operation latency. See the ZooKeeper troubleshooting guide
[junit4:junit4]   2> 1424 T1274 oazs.ZooKeeperServer.finishSessionInit Established session 0x13d40828b3a0000 with negotiated timeout 10000 for client /127.0.0.1:58802
[junit4:junit4]   2> 1424 T1276 oaz.ClientCnxn$SendThread.onConnected Session establishment complete on server localhost.localdomain/127.0.0.1:38035, sessionid = 0x13d40828b3a0000, negotiated timeout = 10000
[junit4:junit4]   2> 1425 T1277 oascc.ConnectionManager.process Watcher org.apache.solr.common.cloud.ConnectionManager@c501de4 name:ZooKeeperConnection Watcher:127.0.0.1:38035 got event WatchedEvent state:SyncConnected type:None path:null path:null type:None
[junit4:junit4]   2> 1425 T1270 oascc.ConnectionManager.waitForConnected Client is connected to ZooKeeper
[junit4:junit4]   2> 1426 T1270 oascc.SolrZkClient.makePath makePath: /solr
[junit4:junit4]   2> 1430 T1275 oazs.PrepRequestProcessor.pRequest2Txn Processed session termination for sessionid: 0x13d40828b3a0000
[junit4:junit4]   2> 1431 T1277 oaz.ClientCnxn$EventThread.run EventThread shut down
[junit4:junit4]   2> 1431 T1270 oaz.ZooKeeper.close Session: 0x13d40828b3a0000 closed
[junit4:junit4]   2> 1432 T1272 oazs.NIOServerCnxn.closeSock Closed socket connection for client /127.0.0.1:58802 which had sessionid 0x13d40828b3a0000
[junit4:junit4]   2> 1432 T1270 oaz.ZooKeeper.<init> Initiating client connection, connectString=127.0.0.1:38035/solr sessionTimeout=10000 watcher=org.apache.solr.common.cloud.ConnectionManager@297e21e
[junit4:junit4]   2> 1433 T1270 oascc.ConnectionManager.waitForConnected Waiting for client to connect to ZooKeeper
[junit4:junit4]   2> 1434 T1278 oaz.ClientCnxn$SendThread.logStartConnect Opening socket connection to server localhost.localdomain/127.0.0.1:38035. Will not attempt to authenticate using SASL (access denied ("javax.security.auth.AuthPermission" "getLoginConfiguration"))
[junit4:junit4]   2> 1435 T1278 oaz.ClientCnxn$SendThread.primeConnection Socket connection established to localhost.localdomain/127.0.0.1:38035, initiating session
[junit4:junit4]   2> 1435 T1272 oazs.NIOServerCnxnFactory.run Accepted socket connection from /127.0.0.1:58803
[junit4:junit4]   2> 1436 T1272 oazs.ZooKeeperServer.processConnectRequest Client attempting to establish new session at /127.0.0.1:58803
[junit4:junit4]   2> 1437 T1274 oazs.ZooKeeperServer.finishSessionInit Established session 0x13d40828b3a0001 with negotiated timeout 10000 for client /127.0.0.1:58803
[junit4:junit4]   2> 1437 T1278 oaz.ClientCnxn$SendThread.onConnected Session establishment complete on server localhost.localdomain/127.0.0.1:38035, sessionid = 0x13d40828b3a0001, negotiated timeout = 10000
[junit4:junit4]   2> 1438 T1279 oascc.ConnectionManager.process Watcher org.apache.solr.common.cloud.ConnectionManager@297e21e name:ZooKeeperConnection Watcher:127.0.0.1:38035/solr got event WatchedEvent state:SyncConnected type:None path:null path:null type:None
[junit4:junit4]   2> 1438 T1270 oascc.ConnectionManager.waitForConnected Client is connected to ZooKeeper
[junit4:junit4]   2> 1439 T1270 oascc.SolrZkClient.makePath makePath: /collections/collection1
[junit4:junit4]   2> 1446 T1270 oascc.SolrZkClient.makePath makePath: /collections/collection1/shards
[junit4:junit4]   2> 1450 T1270 oascc.SolrZkClient.makePath makePath: /collections/control_collection
[junit4:junit4]   2> 1455 T1270 oascc.SolrZkClient.makePath makePath: /collections/control_collection/shards
[junit4:junit4]   2> 1465 T1270 oasc.AbstractZkTestCase.putConfig put /mnt/ssd/jenkins/workspace/Lucene-Solr-trunk-Linux/solr/build/solr-core/test-files/solr/collection1/conf/solrconfig-tlog.xml to /configs/conf1/solrconfig.xml
[junit4:junit4]   2> 1465 T1270 oascc.SolrZkClient.makePath makePath: /configs/conf1/solrconfig.xml
[junit4:junit4]   2> 1473 T1270 oasc.AbstractZkTestCase.putConfig put /mnt/ssd/jenkins/workspace/Lucene-Solr-trunk-Linux/solr/build/solr-core/test-files/solr/collection1/conf/schema.xml to /configs/conf1/schema.xml
[junit4:junit4]   2> 1474 T1270 oascc.SolrZkClient.makePath makePath: /configs/conf1/schema.xml
[junit4:junit4]   2> 1513 T1270 oasc.AbstractZkTestCase.putConfig put /mnt/ssd/jenkins/workspace/Lucene-Solr-trunk-Linux/solr/build/solr-core/test-files/solr/collection1/conf/stopwords.txt to /configs/conf1/stopwords.txt
[junit4:junit4]   2> 1514 T1270 oascc.SolrZkClient.makePath makePath: /configs/conf1/stopwords.txt
[junit4:junit4]   2> 1516 T1270 oasc.AbstractZkTestCase.putConfig put /mnt/ssd/jenkins/workspace/Lucene-Solr-trunk-Linux/solr/build/solr-core/test-files/solr/collection1/conf/protwords.txt to /configs/conf1/protwords.txt
[junit4:junit4]   2> 1516 T1270 oascc.SolrZkClient.makePath makePath: /configs/conf1/protwords.txt
[junit4:junit4]   2> 1518 T1270 oasc.AbstractZkTestCase.putConfig put /mnt/ssd/jenkins/workspace/Lucene-Solr-trunk-Linux/solr/build/solr-core/test-files/solr/collection1/conf/currency.xml to /configs/conf1/currency.xml
[junit4:junit4]   2> 1519 T1270 oascc.SolrZkClient.makePath makePath: /configs/conf1/currency.xml
[junit4:junit4]   2> 1524 T1270 oasc.AbstractZkTestCase.putConfig put /mnt/ssd/jenkins/workspace/Lucene-Solr-trunk-Linux/solr/build/solr-core/test-files/solr/collection1/conf/open-exchange-rates.json to /configs/conf1/open-exchange-rates.json
[junit4:junit4]   2> 1525 T1270 oascc.SolrZkClient.makePath makePath: /configs/conf1/open-exchange-rates.json
[junit4:junit4]   2> 1531 T1270 oasc.AbstractZkTestCase.putConfig put /mnt/ssd/jenkins/workspace/Lucene-Solr-trunk-Linux/solr/build/solr-core/test-files/solr/collection1/conf/mapping-ISOLatin1Accent.txt to /configs/conf1/mapping-ISOLatin1Accent.txt
[junit4:junit4]   2> 1532 T1270 oascc.SolrZkClient.makePath makePath: /configs/conf1/mapping-ISOLatin1Accent.txt
[junit4:junit4]   2> 1553 T1270 oasc.AbstractZkTestCase.putConfig put /mnt/ssd/jenkins/workspace/Lucene-Solr-trunk-Linux/solr/build/solr-core/test-files/solr/collection1/conf/old_synonyms.txt to /configs/conf1/old_synonyms.txt
[junit4:junit4]   2> 1554 T1270 oascc.SolrZkClient.makePath makePath: /configs/conf1/old_synonyms.txt
[junit4:junit4]   2> 1557 T1270 oasc.AbstractZkTestCase.putConfig put /mnt/ssd/jenkins/workspace/Lucene-Solr-trunk-Linux/solr/build/solr-core/test-files/solr/collection1/conf/synonyms.txt to /configs/conf1/synonyms.txt
[junit4:junit4]   2> 1558 T1270 oascc.SolrZkClient.makePath makePath: /configs/conf1/synonyms.txt
[junit4:junit4]   2> 1560 T1275 oazs.PrepRequestProcessor.pRequest2Txn Processed session termination for sessionid: 0x13d40828b3a0001
[junit4:junit4]   2> 1561 T1279 oaz.ClientCnxn$EventThread.run EventThread shut down
[junit4:junit4]   2> 1561 T1272 oazs.NIOServerCnxn.closeSock Closed socket connection for client /127.0.0.1:58803 which had sessionid 0x13d40828b3a0001
[junit4:junit4]   2> 1561 T1270 oaz.ZooKeeper.close Session: 0x13d40828b3a0001 closed
[junit4:junit4]   2> 1618 T1270 oejs.Server.doStart jetty-8.1.8.v20121106
[junit4:junit4]   2> 1622 T1270 oejs.AbstractConnector.doStart Started SelectChannelConnector@127.0.0.1:60217
[junit4:junit4]   2> 1622 T1270 oass.SolrDispatchFilter.init SolrDispatchFilter.init()
[junit4:junit4]   2> 1623 T1270 oasc.SolrResourceLoader.locateSolrHome JNDI not configured for solr (NoInitialContextEx)
[junit4:junit4]   2> 1623 T1270 oasc.SolrResourceLoader.locateSolrHome using system property solr.solr.home: /mnt/ssd/jenkins/workspace/Lucene-Solr-trunk-Linux/solr/build/solr-core/test/J1/./org.apache.solr.cloud.BasicDistributedZk2Test-controljetty-1362586931533
[junit4:junit4]   2> 1623 T1270 oasc.CoreContainer$Initializer.initialize looking for solr config file: /mnt/ssd/jenkins/workspace/Lucene-Solr-trunk-Linux/solr/build/solr-core/test/J1/./org.apache.solr.cloud.BasicDistributedZk2Test-controljetty-1362586931533/solr.xml
[junit4:junit4]   2> 1624 T1270 oasc.CoreContainer.<init> New CoreContainer 655107241
[junit4:junit4]   2> 1624 T1270 oasc.CoreContainer.load Loading CoreContainer using Solr Home: '/mnt/ssd/jenkins/workspace/Lucene-Solr-trunk-Linux/solr/build/solr-core/test/J1/./org.apache.solr.cloud.BasicDistributedZk2Test-controljetty-1362586931533/'
[junit4:junit4]   2> 1624 T1270 oasc.SolrResourceLoader.<init> new SolrResourceLoader for directory: '/mnt/ssd/jenkins/workspace/Lucene-Solr-trunk-Linux/solr/build/solr-core/test/J1/./org.apache.solr.cloud.BasicDistributedZk2Test-controljetty-1362586931533/'
[junit4:junit4]   2> 1641 T1270 oashc.HttpShardHandlerFactory.getParameter Setting socketTimeout to: 120000
[junit4:junit4]   2> 1641 T1270 oashc.HttpShardHandlerFactory.getParameter Setting urlScheme to: http://
[junit4:junit4]   2> 1641 T1270 oashc.HttpShardHandlerFactory.getParameter Setting connTimeout to: 15000
[junit4:junit4]   2> 1642 T1270 oashc.HttpShardHandlerFactory.getParameter Setting maxConnectionsPerHost to: 20
[junit4:junit4]   2> 1643 T1270 oashc.HttpShardHandlerFactory.getParameter Setting corePoolSize to: 0
[junit4:junit4]   2> 1643 T1270 oashc.HttpShardHandlerFactory.getParameter Setting maximumPoolSize to: 2147483647
[junit4:junit4]   2> 1643 T1270 oashc.HttpShardHandlerFactory.getParameter Setting maxThreadIdleTime to: 5
[junit4:junit4]   2> 1644 T1270 oashc.HttpShardHandlerFactory.getParameter Setting sizeOfQueue to: -1
[junit4:junit4]   2> 1644 T1270 oashc.HttpShardHandlerFactory.getParameter Setting fairnessPolicy to: false
[junit4:junit4]   2> 1644 T1270 oascsi.HttpClientUtil.createClient Creating new http client, config:maxConnectionsPerHost=20&maxConnections=10000&socketTimeout=120000&connTimeout=15000&retry=false
[junit4:junit4]   2> 1650 T1270 oasc.CoreContainer.load Registering Log Listener
[junit4:junit4]   2> 1658 T1270 oasc.CoreContainer.initZooKeeper Zookeeper client=127.0.0.1:38035/solr
[junit4:junit4]   2> 1659 T1270 oasc.ZkController.checkChrootPath zkHost includes chroot
[junit4:junit4]   2> 1659 T1270 oaz.ZooKeeper.<init> Initiating client connection, connectString=127.0.0.1:38035 sessionTimeout=60000 watcher=org.apache.solr.common.cloud.ConnectionManager@431e84bb
[junit4:junit4]   2> 1660 T1270 oascc.ConnectionManager.waitForConnected Waiting for client to connect to ZooKeeper
[junit4:junit4]   2> 1660 T1289 oaz.ClientCnxn$SendThread.logStartConnect Opening socket connection to server localhost.localdomain/127.0.0.1:38035. Will not attempt to authenticate using SASL (access denied ("javax.security.auth.AuthPermission" "getLoginConfiguration"))
[junit4:junit4]   2> 1660 T1289 oaz.ClientCnxn$SendThread.primeConnection Socket connection established to localhost.localdomain/127.0.0.1:38035, initiating session
[junit4:junit4]   2> 1661 T1272 oazs.NIOServerCnxnFactory.run Accepted socket connection from /127.0.0.1:58804
[junit4:junit4]   2> 1661 T1272 oazs.ZooKeeperServer.processConnectRequest Client attempting to establish new session at /127.0.0.1:58804
[junit4:junit4]   2> 1662 T1274 oazs.ZooKeeperServer.finishSessionInit Established session 0x13d40828b3a0002 with negotiated timeout 20000 for client /127.0.0.1:58804
[junit4:junit4]   2> 1662 T1289 oaz.ClientCnxn$SendThread.onConnected Session establishment complete on server localhost.localdomain/127.0.0.1:38035, sessionid = 0x13d40828b3a0002, negotiated timeout = 20000
[junit4:junit4]   2> 1663 T1290 oascc.ConnectionManager.process Watcher org.apache.solr.common.cloud.ConnectionManager@431e84bb name:ZooKeeperConnection Watcher:127.0.0.1:38035 got event WatchedEvent state:SyncConnected type:None path:null path:null type:None
[junit4:junit4]   2> 1663 T1270 oascc.ConnectionManager.waitForConnected Client is connected to ZooKeeper
[junit4:junit4]   2> 1664 T1275 oazs.PrepRequestProcessor.pRequest2Txn Processed session termination for sessionid: 0x13d40828b3a0002
[junit4:junit4]   2> 1664 T1290 oaz.ClientCnxn$EventThread.run EventThread shut down
[junit4:junit4]   2> 1664 T1272 oazs.NIOServerCnxn.closeSock Closed socket connection for client /127.0.0.1:58804 which had sessionid 0x13d40828b3a0002
[junit4:junit4]   2> 1664 T1270 oaz.ZooKeeper.close Session: 0x13d40828b3a0002 closed
[junit4:junit4]   2> 1665 T1270 oascsi.HttpClientUtil.createClient Creating new http client, config:maxConnections=500&maxConnectionsPerHost=16&socketTimeout=120000&connTimeout=15000
[junit4:junit4]   2> 1667 T1270 oaz.ZooKeeper.<init> Initiating client connection, connectString=127.0.0.1:38035/solr sessionTimeout=30000 watcher=org.apache.solr.common.cloud.ConnectionManager@1cfc601f
[junit4:junit4]   2> 1668 T1270 oascc.ConnectionManager.waitForConnected Waiting for client to connect to ZooKeeper
[junit4:junit4]   2> 1668 T1291 oaz.ClientCnxn$SendThread.logStartConnect Opening socket connection to server localhost.localdomain/127.0.0.1:38035. Will not attempt to authenticate using SASL (access denied ("javax.security.auth.AuthPermission" "getLoginConfiguration"))
[junit4:junit4]   2> 1668 T1291 oaz.ClientCnxn$SendThread.primeConnection Socket connection established to localhost.localdomain/127.0.0.1:38035, initiating session
[junit4:junit4]   2> 1668 T1272 oazs.NIOServerCnxnFactory.run Accepted socket connection from /127.0.0.1:58805
[junit4:junit4]   2> 1669 T1272 oazs.ZooKeeperServer.processConnectRequest Client attempting to establish new session at /127.0.0.1:58805
[junit4:junit4]   2> 1669 T1274 oazs.ZooKeeperServer.finishSessionInit Established session 0x13d40828b3a0003 with negotiated timeout 20000 for client /127.0.0.1:58805
[junit4:junit4]   2> 1669 T1291 oaz.ClientCnxn$SendThread.onConnected Session establishment complete on server localhost.localdomain/127.0.0.1:38035, sessionid = 0x13d40828b3a0003, negotiated timeout = 20000
[junit4:junit4]   2> 1670 T1292 oascc.ConnectionManager.process Watcher org.apache.solr.common.cloud.ConnectionManager@1cfc601f name:ZooKeeperConnection Watcher:127.0.0.1:38035/solr got event WatchedEvent state:SyncConnected type:None path:null path:null type:None
[junit4:junit4]   2> 1670 T1270 oascc.ConnectionManager.waitForConnected Client is connected to ZooKeeper
[junit4:junit4]   2> 1672 T1275 oazs.PrepRequestProcessor.pRequest Got user-level KeeperException when processing sessionid:0x13d40828b3a0003 type:create cxid:0x2 zxid:0x1a txntype:-1 reqpath:n/a Error Path:/solr/overseer Error:KeeperErrorCode = NodeExists for /solr/overseer
[junit4:junit4]   2> 1673 T1270 oascc.SolrZkClient.makePath makePath: /live_nodes
[junit4:junit4]   2> 1675 T1270 oasc.ZkController.createEphemeralLiveNode Register node as live in ZooKeeper:/live_nodes/127.0.0.1:60217_
[junit4:junit4]   2> 1675 T1275 oazs.PrepRequestProcessor.pRequest Got user-level KeeperException when processing sessionid:0x13d40828b3a0003 type:delete cxid:0x8 zxid:0x1c txntype:-1 reqpath:n/a Error Path:/solr/live_nodes/127.0.0.1:60217_ Error:KeeperErrorCode = NoNode for /solr/live_nodes/127.0.0.1:60217_
[junit4:junit4]   2> 1676 T1270 oascc.SolrZkClient.makePath makePath: /live_nodes/127.0.0.1:60217_
[junit4:junit4]   2> 1678 T1270 oascc.SolrZkClient.makePath makePath: /overseer_elect/election
[junit4:junit4]   2> 1681 T1275 oazs.PrepRequestProcessor.pRequest Got user-level KeeperException when processing sessionid:0x13d40828b3a0003 type:delete cxid:0x16 zxid:0x21 txntype:-1 reqpath:n/a Error Path:/solr/overseer_elect/leader Error:KeeperErrorCode = NoNode for /solr/overseer_elect/leader
[junit4:junit4]   2> 1682 T1270 oascc.SolrZkClient.makePath makePath: /overseer_elect/leader
[junit4:junit4]   2> 1685 T1270 oasc.Overseer.start Overseer (id=89298497043038211-127.0.0.1:60217_-n_0000000000) starting
[junit4:junit4]   2> 1685 T1275 oazs.PrepRequestProcessor.pRequest Got user-level KeeperException when processing sessionid:0x13d40828b3a0003 type:create cxid:0x1b zxid:0x23 txntype:-1 reqpath:n/a Error Path:/solr/overseer Error:KeeperErrorCode = NodeExists for /solr/overseer
[junit4:junit4]   2> 1686 T1275 oazs.PrepRequestProcessor.pRequest Got user-level KeeperException when processing sessionid:0x13d40828b3a0003 type:create cxid:0x1c zxid:0x24 txntype:-1 reqpath:n/a Error Path:/solr/overseer Error:KeeperErrorCode = NodeExists for /solr/overseer
[junit4:junit4]   2> 1687 T1275 oazs.PrepRequestProcessor.pRequest Got user-level KeeperException when processing sessionid:0x13d40828b3a0003 type:create cxid:0x1d zxid:0x25 txntype:-1 reqpath:n/a Error Path:/solr/overseer Error:KeeperErrorCode = NodeExists for /solr/overseer
[junit4:junit4]   2> 1687 T1275 oazs.PrepRequestProcessor.pRequest Got user-level KeeperException when processing sessionid:0x13d40828b3a0003 type:create cxid:0x1e zxid:0x26 txntype:-1 reqpath:n/a Error Path:/solr/overseer Error:KeeperErrorCode = NodeExists for /solr/overseer
[junit4:junit4]   2> 1688 T1294 oasc.OverseerCollectionProcessor.run Process current queue of collection creations
[junit4:junit4]   2> 1688 T1270 oascc.SolrZkClient.makePath makePath: /clusterstate.json
[junit4:junit4]   2> 1697 T1270 oascc.ZkStateReader.createClusterStateWatchersAndUpdate Updating cluster state from ZooKeeper... 
[junit4:junit4]   2> 1699 T1293 oasc.Overseer$ClusterStateUpdater.run Starting to work on the main queue
[junit4:junit4]   2> 1701 T1295 oasc.CoreContainer.create Creating SolrCore 'collection1' using instanceDir: /mnt/ssd/jenkins/workspace/Lucene-Solr-trunk-Linux/solr/build/solr-core/test/J1/./org.apache.solr.cloud.BasicDistributedZk2Test-controljetty-1362586931533/collection1
[junit4:junit4]   2> 1701 T1295 oasc.ZkController.createCollectionZkNode Check for collection zkNode:control_collection
[junit4:junit4]   2> 1702 T1295 oasc.ZkController.createCollectionZkNode Collection zkNode exists
[junit4:junit4]   2> 1702 T1295 oasc.ZkController.readConfigName Load collection config from:/collections/control_collection
[junit4:junit4]   2> 1703 T1295 oasc.SolrResourceLoader.<init> new SolrResourceLoader for directory: '/mnt/ssd/jenkins/workspace/Lucene-Solr-trunk-Linux/solr/build/solr-core/test/J1/./org.apache.solr.cloud.BasicDistributedZk2Test-controljetty-1362586931533/collection1/'
[junit4:junit4]   2> 1703 T1295 oasc.SolrResourceLoader.replaceClassLoader Adding 'file:/mnt/ssd/jenkins/workspace/Lucene-Solr-trunk-Linux/solr/build/solr-core/test/J1/org.apache.solr.cloud.BasicDistributedZk2Test-controljetty-1362586931533/collection1/lib/README' to classloader
[junit4:junit4]   2> 1703 T1295 oasc.SolrResourceLoader.replaceClassLoader Adding 'file:/mnt/ssd/jenkins/workspace/Lucene-Solr-trunk-Linux/solr/build/solr-core/test/J1/org.apache.solr.cloud.BasicDistributedZk2Test-controljetty-1362586931533/collection1/lib/classes/' to classloader
[junit4:junit4]   2> 1725 T1295 oasc.SolrConfig.<init> Using Lucene MatchVersion: LUCENE_50
[junit4:junit4]   2> 1760 T1295 oasc.SolrConfig.<init> Loaded SolrConfig: solrconfig.xml
[junit4:junit4]   2> 1761 T1295 oass.IndexSchema.readSchema Reading Solr Schema
[junit4:junit4]   2> 1765 T1295 oass.IndexSchema.readSchema Schema name=test
[junit4:junit4]   2> 2067 T1295 oass.OpenExchangeRatesOrgProvider.init Initialized with rates=open-exchange-rates.json, refreshInterval=1440.
[junit4:junit4]   2> 2072 T1295 oass.IndexSchema.readSchema default search field in schema is text
[junit4:junit4]   2> 2074 T1295 oass.IndexSchema.readSchema unique key field: id
[junit4:junit4]   2> 2083 T1295 oass.FileExchangeRateProvider.reload Reloading exchange rates from file currency.xml
[junit4:junit4]   2> 2086 T1295 oass.FileExchangeRateProvider.reload Reloading exchange rates from file currency.xml
[junit4:junit4]   2> 2089 T1295 oass.OpenExchangeRatesOrgProvider.reload Reloading exchange rates from open-exchange-rates.json
[junit4:junit4]   2> 2089 T1295 oass.OpenExchangeRatesOrgProvider$OpenExchangeRates.<init> WARNING Unknown key IMPORTANT NOTE
[junit4:junit4]   2> 2090 T1295 oass.OpenExchangeRatesOrgProvider$OpenExchangeRates.<init> WARNING Expected key, got STRING
[junit4:junit4]   2> 2090 T1295 oass.OpenExchangeRatesOrgProvider.reload Reloading exchange rates from open-exchange-rates.json
[junit4:junit4]   2> 2091 T1295 oass.OpenExchangeRatesOrgProvider$OpenExchangeRates.<init> WARNING Unknown key IMPORTANT NOTE
[junit4:junit4]   2> 2091 T1295 oass.OpenExchangeRatesOrgProvider$OpenExchangeRates.<init> WARNING Expected key, got STRING
[junit4:junit4]   2> 2091 T1295 oasc.SolrCore.<init> [collection1] Opening new SolrCore at /mnt/ssd/jenkins/workspace/Lucene-Solr-trunk-Linux/solr/build/solr-core/test/J1/./org.apache.solr.cloud.BasicDistributedZk2Test-controljetty-1362586931533/collection1/, dataDir=./org.apache.solr.cloud.BasicDistributedZk2Test-1362586929974/control/data/
[junit4:junit4]   2> 2091 T1295 oasc.JmxMonitoredMap.<init> JMX monitoring is enabled. Adding Solr mbeans to JMX Server: com.sun.jmx.mbeanserver.JmxMBeanServer@39a1c73b
[junit4:junit4]   2> 2092 T1295 oasc.SolrCore.initDirectoryFactory org.apache.solr.core.MockDirectoryFactory
[junit4:junit4]   2> 2092 T1295 oasc.CachingDirectoryFactory.get return new directory for /mnt/ssd/jenkins/workspace/Lucene-Solr-trunk-Linux/solr/build/solr-core/test/J1/./org.apache.solr.cloud.BasicDistributedZk2Test-1362586929974/control/data forceNew:false
[junit4:junit4]   2> 2092 T1295 oasc.CachingDirectoryFactory.close Releasing directory:/mnt/ssd/jenkins/workspace/Lucene-Solr-trunk-Linux/solr/build/solr-core/test/J1/./org.apache.solr.cloud.BasicDistributedZk2Test-1362586929974/control/data
[junit4:junit4]   2> 2092 T1295 oasc.SolrCore.getNewIndexDir New index directory detected: old=null new=./org.apache.solr.cloud.BasicDistributedZk2Test-1362586929974/control/data/index/
[junit4:junit4]   2> 2093 T1295 oasc.SolrCore.initIndex WARNING [collection1] Solr index directory './org.apache.solr.cloud.BasicDistributedZk2Test-1362586929974/control/data/index' doesn't exist. Creating new index...
[junit4:junit4]   2> 2093 T1295 oasc.CachingDirectoryFactory.get return new directory for /mnt/ssd/jenkins/workspace/Lucene-Solr-trunk-Linux/solr/build/solr-core/test/J1/./org.apache.solr.cloud.BasicDistributedZk2Test-1362586929974/control/data/index forceNew:false
[junit4:junit4]   2> 2095 T1295 oasc.SolrDeletionPolicy.onCommit SolrDeletionPolicy.onCommit: commits:num=1
[junit4:junit4]   2> 		commit{dir=BaseDirectoryWrapper(NRTCachingDirectory(org.apache.lucene.store.RAMDirectory@445fdb8a lockFactory=org.apache.lucene.store.NativeFSLockFactory@78f0a875; maxCacheMB=0.107421875 maxMergeSizeMB=0.1240234375)),segFN=segments_1,generation=1,filenames=[segments_1]
[junit4:junit4]   2> 2095 T1295 oasc.SolrDeletionPolicy.updateCommits newest commit = 1[segments_1]
[junit4:junit4]   2> 2095 T1295 oasc.CachingDirectoryFactory.close Releasing directory:/mnt/ssd/jenkins/workspace/Lucene-Solr-trunk-Linux/solr/build/solr-core/test/J1/./org.apache.solr.cloud.BasicDistributedZk2Test-1362586929974/control/data/index
[junit4:junit4]   2> 2097 T1295 oasup.UpdateRequestProcessorChain.init inserting DistributedUpdateProcessorFactory into updateRequestProcessorChain "dedupe"
[junit4:junit4]   2> 2097 T1295 oasup.UpdateRequestProcessorChain.init inserting DistributedUpdateProcessorFactory into updateRequestProcessorChain "stored_sig"
[junit4:junit4]   2> 2097 T1295 oasup.UpdateRequestProcessorChain.init inserting DistributedUpdateProcessorFactory into updateRequestProcessorChain "distrib-dup-test-chain-implicit"
[junit4:junit4]   2> 2098 T1295 oasc.RequestHandlers.initHandlersFromConfig created standard: solr.StandardRequestHandler
[junit4:junit4]   2> 2098 T1295 oasc.RequestHandlers.initHandlersFromConfig created /get: solr.RealTimeGetHandler
[junit4:junit4]   2> 2098 T1295 oasc.RequestHandlers.initHandlersFromConfig adding lazy requestHandler: solr.ReplicationHandler
[junit4:junit4]   2> 2098 T1295 oasc.RequestHandlers.initHandlersFromConfig created /replication: solr.ReplicationHandler
[junit4:junit4]   2> 2099 T1295 oasc.RequestHandlers.initHandlersFromConfig created /update: solr.UpdateRequestHandler
[junit4:junit4]   2> 2099 T1295 oasc.RequestHandlers.initHandlersFromConfig created /admin/: org.apache.solr.handler.admin.AdminHandlers
[junit4:junit4]   2> 2102 T1295 oashl.XMLLoader.init xsltCacheLifetimeSeconds=60
[junit4:junit4]   2> 2104 T1295 oasc.CachingDirectoryFactory.close Releasing directory:/mnt/ssd/jenkins/workspace/Lucene-Solr-trunk-Linux/solr/build/solr-core/test/J1/./org.apache.solr.cloud.BasicDistributedZk2Test-1362586929974/control/data
[junit4:junit4]   2> 2105 T1295 oass.SolrIndexSearcher.<init> Opening Searcher@51b6ca43 main
[junit4:junit4]   2> 2105 T1295 oasu.UpdateHandler.clearLog Clearing tlog files, tlogDir=./org.apache.solr.cloud.BasicDistributedZk2Test-1362586929974/control/data/tlog
[junit4:junit4]   2> 2105 T1295 oasu.CommitTracker.<init> Hard AutoCommit: disabled
[junit4:junit4]   2> 2106 T1295 oasu.CommitTracker.<init> Soft AutoCommit: disabled
[junit4:junit4]   2> 2108 T1295 oasc.CachingDirectoryFactory.close Releasing directory:/mnt/ssd/jenkins/workspace/Lucene-Solr-trunk-Linux/solr/build/solr-core/test/J1/./org.apache.solr.cloud.BasicDistributedZk2Test-1362586929974/control/data
[junit4:junit4]   2> 2109 T1296 oasc.SolrCore.registerSearcher [collection1] Registered new searcher Searcher@51b6ca43 main{StandardDirectoryReader(segments_1:1)}
[junit4:junit4]   2> 2109 T1295 oasc.ZkController.publish publishing core=collection1 state=down
[junit4:junit4]   2> 2110 T1295 oasc.ZkController.publish numShards not found on descriptor - reading it from system property
[junit4:junit4]   2> 2110 T1275 oazs.PrepRequestProcessor.pRequest Got user-level KeeperException when processing sessionid:0x13d40828b3a0003 type:create cxid:0x50 zxid:0x29 txntype:-1 reqpath:n/a Error Path:/solr/overseer/queue Error:KeeperErrorCode = NoNode for /solr/overseer/queue
[junit4:junit4]   2> 3203 T1293 oascc.ZkStateReader.updateClusterState Updating cloud state from ZooKeeper... 
[junit4:junit4]   2> 3204 T1293 oasc.Overseer$ClusterStateUpdater.updateState Update state numShards=1 message={
[junit4:junit4]   2> 	  "core":"collection1",
[junit4:junit4]   2> 	  "state":"down",
[junit4:junit4]   2> 	  "operation":"state",
[junit4:junit4]   2> 	  "base_url":"http://127.0.0.1:60217",
[junit4:junit4]   2> 	  "core_node_name":"1",
[junit4:junit4]   2> 	  "numShards":"1",
[junit4:junit4]   2> 	  "roles":null,
[junit4:junit4]   2> 	  "shard":null,
[junit4:junit4]   2> 	  "node_name":"127.0.0.1:60217_",
[junit4:junit4]   2> 	  "collection":"control_collection"}
[junit4:junit4]   2> 3205 T1293 oasc.Overseer$ClusterStateUpdater.createCollection Create collection control_collection with numShards 1
[junit4:junit4]   2> 3205 T1293 oasc.Overseer$ClusterStateUpdater.updateState Assigning new node to shard shard=shard1
[junit4:junit4]   2> 3206 T1275 oazs.PrepRequestProcessor.pRequest Got user-level KeeperException when processing sessionid:0x13d40828b3a0003 type:create cxid:0x58 zxid:0x2c txntype:-1 reqpath:n/a Error Path:/solr/overseer/queue-work Error:KeeperErrorCode = NoNode for /solr/overseer/queue-work
[junit4:junit4]   2> 3212 T1292 oascc.ZkStateReader$2.process A cluster state change: WatchedEvent state:SyncConnected type:NodeDataChanged path:/clusterstate.json, has occurred - updating... (live nodes size: 1)
[junit4:junit4]   2> 4112 T1295 oasc.CoreContainer.registerCore registering core: collection1
[junit4:junit4]   2> 4112 T1295 oasc.ZkController.register Register replica - core:collection1 address:http://127.0.0.1:60217 collection:control_collection shard:shard1
[junit4:junit4]   2> 4113 T1295 oascc.SolrZkClient.makePath makePath: /collections/control_collection/leader_elect/shard1/election
[junit4:junit4]   2> 4122 T1275 oazs.PrepRequestProcessor.pRequest Got user-level KeeperException when processing sessionid:0x13d40828b3a0003 type:delete cxid:0x72 zxid:0x36 txntype:-1 reqpath:n/a Error Path:/solr/collections/control_collection/leaders Error:KeeperErrorCode = NoNode for /solr/collections/control_collection/leaders
[junit4:junit4]   2> 4123 T1295 oasc.ShardLeaderElectionContext.runLeaderProcess Running the leader process.
[junit4:junit4]   2> 4124 T1275 oazs.PrepRequestProcessor.pRequest Got user-level KeeperException when processing sessionid:0x13d40828b3a0003 type:create cxid:0x73 zxid:0x37 txntype:-1 reqpath:n/a Error Path:/solr/overseer Error:KeeperErrorCode = NodeExists for /solr/overseer
[junit4:junit4]   2> 4126 T1295 oasc.ShardLeaderElectionContext.waitForReplicasToComeUp Enough replicas found to continue.
[junit4:junit4]   2> 4127 T1295 oasc.ShardLeaderElectionContext.runLeaderProcess I may be the new leader - try and sync
[junit4:junit4]   2> 4127 T1295 oasc.SyncStrategy.sync Sync replicas to http://127.0.0.1:60217/collection1/
[junit4:junit4]   2> 4127 T1295 oasc.SyncStrategy.syncReplicas Sync Success - now sync replicas to me
[junit4:junit4]   2> 4128 T1295 oasc.SyncStrategy.syncToMe http://127.0.0.1:60217/collection1/ has no replicas
[junit4:junit4]   2> 4128 T1295 oasc.ShardLeaderElectionContext.runLeaderProcess I am the new leader: http://127.0.0.1:60217/collection1/
[junit4:junit4]   2> 4129 T1295 oascc.SolrZkClient.makePath makePath: /collections/control_collection/leaders/shard1
[junit4:junit4]   2> 4134 T1275 oazs.PrepRequestProcessor.pRequest Got user-level KeeperException when processing sessionid:0x13d40828b3a0003 type:create cxid:0x7d zxid:0x3b txntype:-1 reqpath:n/a Error Path:/solr/overseer Error:KeeperErrorCode = NodeExists for /solr/overseer
[junit4:junit4]   2> 4717 T1293 oascc.ZkStateReader.updateClusterState Updating cloud state from ZooKeeper... 
[junit4:junit4]   2> 4723 T1292 oascc.ZkStateReader$2.process A cluster state change: WatchedEvent state:SyncConnected type:NodeDataChanged path:/clusterstate.json, has occurred - updating... (live nodes size: 1)
[junit4:junit4]   2> 4738 T1295 oasc.ZkController.register We are http://127.0.0.1:60217/collection1/ and leader is http://127.0.0.1:60217/collection1/
[junit4:junit4]   2> 4738 T1295 oasc.ZkController.register No LogReplay needed for core=collection1 baseURL=http://127.0.0.1:60217
[junit4:junit4]   2> 4738 T1295 oasc.ZkController.checkRecovery I am the leader, no recovery necessary
[junit4:junit4]   2> 4738 T1295 oasc.ZkController.publish publishing core=collection1 state=active
[junit4:junit4]   2> 4739 T1295 oasc.ZkController.publish numShards not found on descriptor - reading it from system property
[junit4:junit4]   2> 4741 T1295 oascc.ZkStateReader.updateClusterState Updating cloud state from ZooKeeper... 
[junit4:junit4]   2> 4742 T1270 oass.SolrDispatchFilter.init user.dir=/mnt/ssd/jenkins/workspace/Lucene-Solr-trunk-Linux/solr/build/solr-core/test/J1
[junit4:junit4]   2> 4743 T1270 oass.SolrDispatchFilter.init SolrDispatchFilter.init() done
[junit4:junit4]   2> 4743 T1270 oascsi.HttpClientUtil.createClient Creating new http client, config:maxConnections=128&maxConnectionsPerHost=32&followRedirects=false
[junit4:junit4]   2> 4749 T1270 oascsi.HttpClientUtil.createClient Creating new http client, config:
[junit4:junit4]   2> 4750 T1270 oaz.ZooKeeper.<init> Initiating client connection, connectString=127.0.0.1:38035/solr sessionTimeout=10000 watcher=org.apache.solr.common.cloud.ConnectionManager@2341c975
[junit4:junit4]   2> 4751 T1270 oascc.ConnectionManager.waitForConnected Waiting for client to connect to ZooKeeper
[junit4:junit4]   2> 4751 T1298 oaz.ClientCnxn$SendThread.logStartConnect Opening socket connection to server localhost.localdomain/127.0.0.1:38035. Will not attempt to authenticate using SASL (access denied ("javax.security.auth.AuthPermission" "getLoginConfiguration"))
[junit4:junit4]   2> 4752 T1298 oaz.ClientCnxn$SendThread.primeConnection Socket connection established to localhost.localdomain/127.0.0.1:38035, initiating session
[junit4:junit4]   2> 4752 T1272 oazs.NIOServerCnxnFactory.run Accepted socket connection from /127.0.0.1:58806
[junit4:junit4]   2> 4753 T1272 oazs.ZooKeeperServer.processConnectRequest Client attempting to establish new session at /127.0.0.1:58806
[junit4:junit4]   2> 4755 T1274 oazs.ZooKeeperServer.finishSessionInit Established session 0x13d40828b3a0004 with negotiated timeout 10000 for client /127.0.0.1:58806
[junit4:junit4]   2> 4755 T1298 oaz.ClientCnxn$SendThread.onConnected Session establishment complete on server localhost.localdomain/127.0.0.1:38035, sessionid = 0x13d40828b3a0004, negotiated timeout = 10000
[junit4:junit4]   2> 4755 T1299 oascc.ConnectionManager.process Watcher org.apache.solr.common.cloud.ConnectionManager@2341c975 name:ZooKeeperConnection Watcher:127.0.0.1:38035/solr got event WatchedEvent state:SyncConnected type:None path:null path:null type:None
[junit4:junit4]   2> 4756 T1270 oascc.ConnectionManager.waitForConnected Client is connected to ZooKeeper
[junit4:junit4]   2> 4757 T1270 oascc.ZkStateReader.createClusterStateWatchersAndUpdate Updating cluster state from ZooKeeper... 
[junit4:junit4]   2> 4760 T1270 oasc.ChaosMonkey.monkeyLog monkey: init - expire sessions:true cause connection loss:true
[junit4:junit4]   2> 4827 T1270 oejs.Server.doStart jetty-8.1.8.v20121106
[junit4:junit4]   2> 4829 T1270 oejs.AbstractConnector.doStart Started SelectChannelConnector@127.0.0.1:37277
[junit4:junit4]   2> 4830 T1270 oass.SolrDispatchFilter.init SolrDispatchFilter.init()
[junit4:junit4]   2> 4830 T1270 oasc.SolrResourceLoader.locateSolrHome JNDI not configured for solr (NoInitialContextEx)
[junit4:junit4]   2> 4830 T1270 oasc.SolrResourceLoader.locateSolrHome using system property solr.solr.home: /mnt/ssd/jenkins/workspace/Lucene-Solr-trunk-Linux/solr/build/solr-core/test/J1/./org.apache.solr.cloud.BasicDistributedZk2Test-jetty1-1362586934731
[junit4:junit4]   2> 4831 T1270 oasc.CoreContainer$Initializer.initialize looking for solr config file: /mnt/ssd/jenkins/workspace/Lucene-Solr-trunk-Linux/solr/build/solr-core/test/J1/./org.apache.solr.cloud.BasicDistributedZk2Test-jetty1-1362586934731/solr.xml
[junit4:junit4]   2> 4831 T1270 oasc.CoreContainer.<init> New CoreContainer 932064746
[junit4:junit4]   2> 4831 T1270 oasc.CoreContainer.load Loading CoreContainer using Solr Home: '/mnt/ssd/jenkins/workspace/Lucene-Solr-trunk-Linux/solr/build/solr-core/test/J1/./org.apache.solr.cloud.BasicDistributedZk2Test-jetty1-1362586934731/'
[junit4:junit4]   2> 4831 T1270 oasc.SolrResourceLoader.<init> new SolrResourceLoader for directory: '/mnt/ssd/jenkins/workspace/Lucene-Solr-trunk-Linux/solr/build/solr-core/test/J1/./org.apache.solr.cloud.BasicDistributedZk2Test-jetty1-1362586934731/'
[junit4:junit4]   2> 4847 T1270 oashc.HttpShardHandlerFactory.getParameter Setting socketTimeout to: 120000
[junit4:junit4]   2> 4848 T1270 oashc.HttpShardHandlerFactory.getParameter Setting urlScheme to: http://
[junit4:junit4]   2> 4848 T1270 oashc.HttpShardHandlerFactory.getParameter Setting connTimeout to: 15000
[junit4:junit4]   2> 4848 T1270 oashc.HttpShardHandlerFactory.getParameter Setting maxConnectionsPerHost to: 20
[junit4:junit4]   2> 4849 T1270 oashc.HttpShardHandlerFactory.getParameter Setting corePoolSize to: 0
[junit4:junit4]   2

[...truncated too long message...]

n/89298499231809544-127.0.0.1:42783_rhab-n_0000000002 (0)
[junit4:junit4]   1>     /solr/overseer_elect/election/89298499231809548-127.0.0.1:36930_rhab-n_0000000004 (0)
[junit4:junit4]   1>    /solr/overseer_elect/leader (0)
[junit4:junit4]   1>    DATA:
[junit4:junit4]   1>        {"id":"89298499231809539-127.0.0.1:60168_rhab-n_0000000000"}
[junit4:junit4]   1>  /zookeeper (1)
[junit4:junit4]   1>  DATA:
[junit4:junit4]   1>      
[junit4:junit4]   1> 
[junit4:junit4]   2> NOTE: reproduce with: ant test  -Dtestcase=UnloadDistributedZkTest -Dtests.method=testDistribSearch -Dtests.seed=187A56FCA9BB0EAD -Dtests.multiplier=3 -Dtests.slow=true -Dtests.locale=ar_LB -Dtests.timezone=America/Tegucigalpa -Dtests.file.encoding=UTF-8
[junit4:junit4] FAILURE  143s J1 | UnloadDistributedZkTest.testDistribSearch <<<
[junit4:junit4]    > Throwable #1: java.lang.AssertionError: Still found shard
[junit4:junit4]    > 	at __randomizedtesting.SeedInfo.seed([187A56FCA9BB0EAD:999CD8E4DEE46E91]:0)
[junit4:junit4]    > 	at org.junit.Assert.fail(Assert.java:93)
[junit4:junit4]    > 	at org.apache.solr.cloud.UnloadDistributedZkTest.testUnloadShardAndCollection(UnloadDistributedZkTest.java:124)
[junit4:junit4]    > 	at org.apache.solr.cloud.UnloadDistributedZkTest.doTest(UnloadDistributedZkTest.java:77)
[junit4:junit4]    > 	at org.apache.solr.BaseDistributedSearchTestCase.testDistribSearch(BaseDistributedSearchTestCase.java:806)
[junit4:junit4]    > 	at sun.reflect.NativeMethodAccessorImpl.invoke0(Native Method)
[junit4:junit4]    > 	at sun.reflect.NativeMethodAccessorImpl.invoke(NativeMethodAccessorImpl.java:57)
[junit4:junit4]    > 	at sun.reflect.DelegatingMethodAccessorImpl.invoke(DelegatingMethodAccessorImpl.java:43)
[junit4:junit4]    > 	at java.lang.reflect.Method.invoke(Method.java:487)
[junit4:junit4]    > 	at com.carrotsearch.randomizedtesting.RandomizedRunner.invoke(RandomizedRunner.java:1559)
[junit4:junit4]    > 	at com.carrotsearch.randomizedtesting.RandomizedRunner.access$600(RandomizedRunner.java:79)
[junit4:junit4]    > 	at com.carrotsearch.randomizedtesting.RandomizedRunner$6.evaluate(RandomizedRunner.java:737)
[junit4:junit4]    > 	at com.carrotsearch.randomizedtesting.RandomizedRunner$7.evaluate(RandomizedRunner.java:773)
[junit4:junit4]    > 	at com.carrotsearch.randomizedtesting.RandomizedRunner$8.evaluate(RandomizedRunner.java:787)
[junit4:junit4]    > 	at com.carrotsearch.randomizedtesting.rules.SystemPropertiesRestoreRule$1.evaluate(SystemPropertiesRestoreRule.java:53)
[junit4:junit4]    > 	at org.apache.lucene.util.TestRuleSetupTeardownChained$1.evaluate(TestRuleSetupTeardownChained.java:50)
[junit4:junit4]    > 	at org.apache.lucene.util.TestRuleFieldCacheSanity$1.evaluate(TestRuleFieldCacheSanity.java:51)
[junit4:junit4]    > 	at org.apache.lucene.util.AbstractBeforeAfterRule$1.evaluate(AbstractBeforeAfterRule.java:46)
[junit4:junit4]    > 	at com.carrotsearch.randomizedtesting.rules.SystemPropertiesInvariantRule$1.evaluate(SystemPropertiesInvariantRule.java:55)
[junit4:junit4]    > 	at org.apache.lucene.util.TestRuleThreadAndTestName$1.evaluate(TestRuleThreadAndTestName.java:49)
[junit4:junit4]    > 	at org.apache.lucene.util.TestRuleIgnoreAfterMaxFailures$1.evaluate(TestRuleIgnoreAfterMaxFailures.java:70)
[junit4:junit4]    > 	at org.apache.lucene.util.TestRuleMarkFailure$1.evaluate(TestRuleMarkFailure.java:48)
[junit4:junit4]    > 	at com.carrotsearch.randomizedtesting.rules.StatementAdapter.evaluate(StatementAdapter.java:36)
[junit4:junit4]    > 	at com.carrotsearch.randomizedtesting.ThreadLeakControl$StatementRunner.run(ThreadLeakControl.java:358)
[junit4:junit4]    > 	at com.carrotsearch.randomizedtesting.ThreadLeakControl.forkTimeoutingTask(ThreadLeakControl.java:782)
[junit4:junit4]    > 	at com.carrotsearch.randomizedtesting.ThreadLeakControl$3.evaluate(ThreadLeakControl.java:442)
[junit4:junit4]    > 	at com.carrotsearch.randomizedtesting.RandomizedRunner.runSingleTest(RandomizedRunner.java:746)
[junit4:junit4]    > 	at com.carrotsearch.randomizedtesting.RandomizedRunner$3.evaluate(RandomizedRunner.java:648)
[junit4:junit4]    > 	at com.carrotsearch.randomizedtesting.RandomizedRunner$4.evaluate(RandomizedRunner.java:682)
[junit4:junit4]    > 	at com.carrotsearch.randomizedtesting.RandomizedRunner$5.evaluate(RandomizedRunner.java:693)
[junit4:junit4]    > 	at com.carrotsearch.randomizedtesting.rules.StatementAdapter.evaluate(StatementAdapter.java:36)
[junit4:junit4]    > 	at com.carrotsearch.randomizedtesting.rules.SystemPropertiesRestoreRule$1.evaluate(SystemPropertiesRestoreRule.java:53)
[junit4:junit4]    > 	at org.apache.lucene.util.AbstractBeforeAfterRule$1.evaluate(AbstractBeforeAfterRule.java:46)
[junit4:junit4]    > 	at org.apache.lucene.util.TestRuleStoreClassName$1.evaluate(TestRuleStoreClassName.java:42)
[junit4:junit4]    > 	at com.carrotsearch.randomizedtesting.rules.SystemPropertiesInvariantRule$1.evaluate(SystemPropertiesInvariantRule.java:55)
[junit4:junit4]    > 	at com.carrotsearch.randomizedtesting.rules.NoShadowingOrOverridesOnMethodsRule$1.evaluate(NoShadowingOrOverridesOnMethodsRule.java:39)
[junit4:junit4]    > 	at com.carrotsearch.randomizedtesting.rules.NoShadowingOrOverridesOnMethodsRule$1.evaluate(NoShadowingOrOverridesOnMethodsRule.java:39)
[junit4:junit4]    > 	at com.carrotsearch.randomizedtesting.rules.StatementAdapter.evaluate(StatementAdapter.java:36)
[junit4:junit4]    > 	at org.apache.lucene.util.TestRuleAssertionsRequired$1.evaluate(TestRuleAssertionsRequired.java:43)
[junit4:junit4]    > 	at org.apache.lucene.util.TestRuleMarkFailure$1.evaluate(TestRuleMarkFailure.java:48)
[junit4:junit4]    > 	at org.apache.lucene.util.TestRuleIgnoreAfterMaxFailures$1.evaluate(TestRuleIgnoreAfterMaxFailures.java:70)
[junit4:junit4]    > 	at org.apache.lucene.util.TestRuleIgnoreTestSuites$1.evaluate(TestRuleIgnoreTestSuites.java:55)
[junit4:junit4]    > 	at com.carrotsearch.randomizedtesting.rules.StatementAdapter.evaluate(StatementAdapter.java:36)
[junit4:junit4]    > 	at com.carrotsearch.randomizedtesting.ThreadLeakControl$StatementRunner.run(ThreadLeakControl.java:358)
[junit4:junit4]    > 	at java.lang.Thread.run(Thread.java:722)
[junit4:junit4]   2> 142819 T1362 oas.SolrTestCaseJ4.deleteCore ###deleteCore
[junit4:junit4]   2> 142833 T1361 ccr.ThreadLeakControl.checkThreadLeaks WARNING Will linger awaiting termination of 3 leaked thread(s).
[junit4:junit4]   2> 143634 T1365 oazs.SessionTrackerImpl.run SessionTrackerImpl exited loop!
[junit4:junit4]   2> 143917 T1444 oascc.ZkStateReader$2.process WARNING ZooKeeper watch triggered, but Solr cannot talk to ZK
[junit4:junit4]   2> 143917 T1444 oascc.ZkStateReader$3.process WARNING ZooKeeper watch triggered, but Solr cannot talk to ZK
[junit4:junit4]   2> 143917 T1444 oaz.ClientCnxn$EventThread.run EventThread shut down
[junit4:junit4]   2> NOTE: test params are: codec=SimpleText, sim=DefaultSimilarity, locale=ar_LB, timezone=America/Tegucigalpa
[junit4:junit4]   2> NOTE: Linux 3.2.0-38-generic amd64/Oracle Corporation 1.8.0-ea (64-bit)/cpus=8,threads=2,free=146878952,total=340787200
[junit4:junit4]   2> NOTE: All tests run in this JVM: [TestBinaryField, TestRecovery, TestFiltering, StandardRequestHandlerTest, RequiredFieldsTest, SpellPossibilityIteratorTest, TestQuerySenderNoQuery, HighlighterConfigTest, TestMultiCoreConfBootstrap, CurrencyFieldXmlFileTest, SolrRequestParserTest, OutputWriterTest, DefaultValueUpdateProcessorTest, TestLMJelinekMercerSimilarityFactory, TestSolr4Spatial, TestCollationField, RequestHandlersTest, NumericFieldsTest, IndexBasedSpellCheckerTest, TestSolrXMLSerializer, XmlUpdateRequestHandlerTest, UpdateParamsTest, NotRequiredUniqueKeyTest, DocumentAnalysisRequestHandlerTest, TestFieldCollectionResource, TimeZoneUtilsTest, TestSolrDiscoveryProperties, DocValuesMultiTest, IndexSchemaRuntimeFieldTest, TestPartialUpdateDeduplication, SortByFunctionTest, TestHashPartitioner, TestLuceneMatchVersion, TestJmxIntegration, TestDynamicFieldResource, TestElisionMultitermQuery, TestFastOutputStream, JSONWriterTest, TestAtomicUpdateErrorCases, CoreContainerCoreInitFailuresTest, SolrPluginUtilsTest, TestPropInject, CollectionsAPIDistributedZkTest, TestAnalyzedSuggestions, SimplePostToolTest, TestDefaultSimilarityFactory, TestQueryTypes, TestDFRSimilarityFactory, HardAutoCommitTest, URLClassifyProcessorTest, CopyFieldTest, TestIndexSearcher, SolrCoreCheckLockOnStartupTest, TestDistributedSearch, EchoParamsTest, SampleTest, SolrCmdDistributorTest, TestIndexingPerformance, TestCSVLoader, TestPostingsSolrHighlighter, TestReload, TestFoldingMultitermQuery, BasicDistributedZkTest, BasicDistributedZk2Test, UnloadDistributedZkTest]
[junit4:junit4] Completed on J1 in 144.11s, 1 test, 1 failure <<< FAILURES!

[...truncated 411 lines...]
BUILD FAILED
/mnt/ssd/jenkins/workspace/Lucene-Solr-trunk-Linux/build.xml:381: The following error occurred while executing this line:
/mnt/ssd/jenkins/workspace/Lucene-Solr-trunk-Linux/build.xml:361: The following error occurred while executing this line:
/mnt/ssd/jenkins/workspace/Lucene-Solr-trunk-Linux/build.xml:39: The following error occurred while executing this line:
/mnt/ssd/jenkins/workspace/Lucene-Solr-trunk-Linux/solr/build.xml:183: The following error occurred while executing this line:
/mnt/ssd/jenkins/workspace/Lucene-Solr-trunk-Linux/solr/common-build.xml:449: The following error occurred while executing this line:
/mnt/ssd/jenkins/workspace/Lucene-Solr-trunk-Linux/lucene/common-build.xml:1213: The following error occurred while executing this line:
/mnt/ssd/jenkins/workspace/Lucene-Solr-trunk-Linux/lucene/common-build.xml:877: There were test failures: 268 suites, 1134 tests, 3 errors, 1 failure, 13 ignored (7 assumptions)

Total time: 50 minutes 0 seconds
Build step 'Invoke Ant' marked build as failure
Archiving artifacts
Recording test results
Description set: Java: 64bit/jdk1.8.0-ea-b79 -XX:+UseParallelGC
Email was triggered for: Failure
Sending email for trigger: Failure



Mime
View raw message