lucene-dev mailing list archives

Site index · List index
Message view « Date » · « Thread »
Top « Date » · « Thread »
From Apache Jenkins Server <jenk...@builds.apache.org>
Subject [JENKINS] Lucene-Solr-NightlyTests-4.x - Build # 215 - Failure
Date Sat, 23 Mar 2013 02:52:52 GMT
Build: https://builds.apache.org/job/Lucene-Solr-NightlyTests-4.x/215/

8 tests failed.
FAILED:  org.apache.lucene.index.sorter.TestSortingMergePolicy.testSortingMP

Error Message:
Test abandoned because suite timeout was reached.

Stack Trace:
java.lang.Exception: Test abandoned because suite timeout was reached.
	at __randomizedtesting.SeedInfo.seed([43888FACCAEA6BE9]:0)


FAILED:  junit.framework.TestSuite.org.apache.lucene.index.sorter.TestSortingMergePolicy

Error Message:
Suite timeout exceeded (>= 7200000 msec).

Stack Trace:
java.lang.Exception: Suite timeout exceeded (>= 7200000 msec).
	at __randomizedtesting.SeedInfo.seed([43888FACCAEA6BE9]:0)


FAILED:  junit.framework.TestSuite.org.apache.lucene.index.sorter.TestSortingMergePolicy

Error Message:
Captured an uncaught exception in thread: Thread[id=15, name=Lucene Merge Thread #4, state=RUNNABLE, group=TGRP-TestSortingMergePolicy]

Stack Trace:
com.carrotsearch.randomizedtesting.UncaughtExceptionError: Captured an uncaught exception in thread: Thread[id=15, name=Lucene Merge Thread #4, state=RUNNABLE, group=TGRP-TestSortingMergePolicy]
Caused by: org.apache.lucene.index.MergePolicy$MergeException: java.lang.AssertionError: info.dir=MockDirWrapper(org.apache.lucene.store.RAMDirectory@6ab30913 lockFactory=org.apache.lucene.store.SingleInstanceLockFactory@1018f51f) vs BaseDirectoryWrapper(org.apache.lucene.store.RAMDirectory@755c62bc lockFactory=org.apache.lucene.store.SingleInstanceLockFactory@45660d6)
	at __randomizedtesting.SeedInfo.seed([43888FACCAEA6BE9]:0)
	at org.apache.lucene.index.ConcurrentMergeScheduler.handleMergeException(ConcurrentMergeScheduler.java:541)
	at org.apache.lucene.index.ConcurrentMergeScheduler$MergeThread.run(ConcurrentMergeScheduler.java:514)
Caused by: java.lang.AssertionError: info.dir=MockDirWrapper(org.apache.lucene.store.RAMDirectory@6ab30913 lockFactory=org.apache.lucene.store.SingleInstanceLockFactory@1018f51f) vs BaseDirectoryWrapper(org.apache.lucene.store.RAMDirectory@755c62bc lockFactory=org.apache.lucene.store.SingleInstanceLockFactory@45660d6)
	at org.apache.lucene.index.IndexWriter$ReaderPool.get(IndexWriter.java:531)
	at org.apache.lucene.index.IndexWriter.mergeMiddle(IndexWriter.java:3626)
	at org.apache.lucene.index.IndexWriter.merge(IndexWriter.java:3296)
	at org.apache.lucene.index.ConcurrentMergeScheduler.doMerge(ConcurrentMergeScheduler.java:401)
	at org.apache.lucene.index.ConcurrentMergeScheduler$MergeThread.run(ConcurrentMergeScheduler.java:478)


FAILED:  junit.framework.TestSuite.org.apache.lucene.index.sorter.TestSortingMergePolicy

Error Message:
Captured an uncaught exception in thread: Thread[id=16, name=Lucene Merge Thread #5, state=RUNNABLE, group=TGRP-TestSortingMergePolicy]

Stack Trace:
com.carrotsearch.randomizedtesting.UncaughtExceptionError: Captured an uncaught exception in thread: Thread[id=16, name=Lucene Merge Thread #5, state=RUNNABLE, group=TGRP-TestSortingMergePolicy]
Caused by: org.apache.lucene.index.MergePolicy$MergeException: java.lang.AssertionError: info.dir=MockDirWrapper(org.apache.lucene.store.RAMDirectory@6ab30913 lockFactory=org.apache.lucene.store.SingleInstanceLockFactory@1018f51f) vs BaseDirectoryWrapper(org.apache.lucene.store.RAMDirectory@755c62bc lockFactory=org.apache.lucene.store.SingleInstanceLockFactory@45660d6)
	at __randomizedtesting.SeedInfo.seed([43888FACCAEA6BE9]:0)
	at org.apache.lucene.index.ConcurrentMergeScheduler.handleMergeException(ConcurrentMergeScheduler.java:541)
	at org.apache.lucene.index.ConcurrentMergeScheduler$MergeThread.run(ConcurrentMergeScheduler.java:514)
Caused by: java.lang.AssertionError: info.dir=MockDirWrapper(org.apache.lucene.store.RAMDirectory@6ab30913 lockFactory=org.apache.lucene.store.SingleInstanceLockFactory@1018f51f) vs BaseDirectoryWrapper(org.apache.lucene.store.RAMDirectory@755c62bc lockFactory=org.apache.lucene.store.SingleInstanceLockFactory@45660d6)
	at org.apache.lucene.index.IndexWriter$ReaderPool.get(IndexWriter.java:531)
	at org.apache.lucene.index.IndexWriter.mergeMiddle(IndexWriter.java:3626)
	at org.apache.lucene.index.IndexWriter.merge(IndexWriter.java:3296)
	at org.apache.lucene.index.ConcurrentMergeScheduler.doMerge(ConcurrentMergeScheduler.java:401)
	at org.apache.lucene.index.ConcurrentMergeScheduler$MergeThread.run(ConcurrentMergeScheduler.java:478)


FAILED:  junit.framework.TestSuite.org.apache.lucene.index.sorter.TestSortingMergePolicy

Error Message:
Captured an uncaught exception in thread: Thread[id=19, name=Lucene Merge Thread #8, state=RUNNABLE, group=TGRP-TestSortingMergePolicy]

Stack Trace:
com.carrotsearch.randomizedtesting.UncaughtExceptionError: Captured an uncaught exception in thread: Thread[id=19, name=Lucene Merge Thread #8, state=RUNNABLE, group=TGRP-TestSortingMergePolicy]
Caused by: org.apache.lucene.index.MergePolicy$MergeException: java.lang.AssertionError: info.dir=MockDirWrapper(org.apache.lucene.store.RAMDirectory@6ab30913 lockFactory=org.apache.lucene.store.SingleInstanceLockFactory@1018f51f) vs BaseDirectoryWrapper(org.apache.lucene.store.RAMDirectory@755c62bc lockFactory=org.apache.lucene.store.SingleInstanceLockFactory@45660d6)
	at __randomizedtesting.SeedInfo.seed([43888FACCAEA6BE9]:0)
	at org.apache.lucene.index.ConcurrentMergeScheduler.handleMergeException(ConcurrentMergeScheduler.java:541)
	at org.apache.lucene.index.ConcurrentMergeScheduler$MergeThread.run(ConcurrentMergeScheduler.java:514)
Caused by: java.lang.AssertionError: info.dir=MockDirWrapper(org.apache.lucene.store.RAMDirectory@6ab30913 lockFactory=org.apache.lucene.store.SingleInstanceLockFactory@1018f51f) vs BaseDirectoryWrapper(org.apache.lucene.store.RAMDirectory@755c62bc lockFactory=org.apache.lucene.store.SingleInstanceLockFactory@45660d6)
	at org.apache.lucene.index.IndexWriter$ReaderPool.get(IndexWriter.java:531)
	at org.apache.lucene.index.IndexWriter.mergeMiddle(IndexWriter.java:3626)
	at org.apache.lucene.index.IndexWriter.merge(IndexWriter.java:3296)
	at org.apache.lucene.index.ConcurrentMergeScheduler.doMerge(ConcurrentMergeScheduler.java:401)
	at org.apache.lucene.index.ConcurrentMergeScheduler$MergeThread.run(ConcurrentMergeScheduler.java:478)


FAILED:  junit.framework.TestSuite.org.apache.lucene.index.sorter.TestSortingMergePolicy

Error Message:
Captured an uncaught exception in thread: Thread[id=20, name=Lucene Merge Thread #9, state=RUNNABLE, group=TGRP-TestSortingMergePolicy]

Stack Trace:
com.carrotsearch.randomizedtesting.UncaughtExceptionError: Captured an uncaught exception in thread: Thread[id=20, name=Lucene Merge Thread #9, state=RUNNABLE, group=TGRP-TestSortingMergePolicy]
Caused by: org.apache.lucene.index.MergePolicy$MergeException: java.lang.AssertionError: info.dir=BaseDirectoryWrapper(org.apache.lucene.store.RAMDirectory@755c62bc lockFactory=org.apache.lucene.store.SingleInstanceLockFactory@45660d6) vs MockDirWrapper(org.apache.lucene.store.RAMDirectory@6ab30913 lockFactory=org.apache.lucene.store.SingleInstanceLockFactory@1018f51f)
	at __randomizedtesting.SeedInfo.seed([43888FACCAEA6BE9]:0)
	at org.apache.lucene.index.ConcurrentMergeScheduler.handleMergeException(ConcurrentMergeScheduler.java:541)
	at org.apache.lucene.index.ConcurrentMergeScheduler$MergeThread.run(ConcurrentMergeScheduler.java:514)
Caused by: java.lang.AssertionError: info.dir=BaseDirectoryWrapper(org.apache.lucene.store.RAMDirectory@755c62bc lockFactory=org.apache.lucene.store.SingleInstanceLockFactory@45660d6) vs MockDirWrapper(org.apache.lucene.store.RAMDirectory@6ab30913 lockFactory=org.apache.lucene.store.SingleInstanceLockFactory@1018f51f)
	at org.apache.lucene.index.IndexWriter$ReaderPool.get(IndexWriter.java:531)
	at org.apache.lucene.index.IndexWriter.mergeMiddle(IndexWriter.java:3626)
	at org.apache.lucene.index.IndexWriter.merge(IndexWriter.java:3296)
	at org.apache.lucene.index.ConcurrentMergeScheduler.doMerge(ConcurrentMergeScheduler.java:401)
	at org.apache.lucene.index.ConcurrentMergeScheduler$MergeThread.run(ConcurrentMergeScheduler.java:478)


FAILED:  junit.framework.TestSuite.org.apache.lucene.index.sorter.TestSortingMergePolicy

Error Message:
Captured an uncaught exception in thread: Thread[id=21, name=Lucene Merge Thread #10, state=RUNNABLE, group=TGRP-TestSortingMergePolicy]

Stack Trace:
com.carrotsearch.randomizedtesting.UncaughtExceptionError: Captured an uncaught exception in thread: Thread[id=21, name=Lucene Merge Thread #10, state=RUNNABLE, group=TGRP-TestSortingMergePolicy]
Caused by: org.apache.lucene.index.MergePolicy$MergeException: java.lang.AssertionError: info.dir=BaseDirectoryWrapper(org.apache.lucene.store.RAMDirectory@755c62bc lockFactory=org.apache.lucene.store.SingleInstanceLockFactory@45660d6) vs MockDirWrapper(org.apache.lucene.store.RAMDirectory@6ab30913 lockFactory=org.apache.lucene.store.SingleInstanceLockFactory@1018f51f)
	at __randomizedtesting.SeedInfo.seed([43888FACCAEA6BE9]:0)
	at org.apache.lucene.index.ConcurrentMergeScheduler.handleMergeException(ConcurrentMergeScheduler.java:541)
	at org.apache.lucene.index.ConcurrentMergeScheduler$MergeThread.run(ConcurrentMergeScheduler.java:514)
Caused by: java.lang.AssertionError: info.dir=BaseDirectoryWrapper(org.apache.lucene.store.RAMDirectory@755c62bc lockFactory=org.apache.lucene.store.SingleInstanceLockFactory@45660d6) vs MockDirWrapper(org.apache.lucene.store.RAMDirectory@6ab30913 lockFactory=org.apache.lucene.store.SingleInstanceLockFactory@1018f51f)
	at org.apache.lucene.index.IndexWriter$ReaderPool.get(IndexWriter.java:531)
	at org.apache.lucene.index.IndexWriter.mergeMiddle(IndexWriter.java:3626)
	at org.apache.lucene.index.IndexWriter.merge(IndexWriter.java:3296)
	at org.apache.lucene.index.ConcurrentMergeScheduler.doMerge(ConcurrentMergeScheduler.java:401)
	at org.apache.lucene.index.ConcurrentMergeScheduler$MergeThread.run(ConcurrentMergeScheduler.java:478)


FAILED:  junit.framework.TestSuite.org.apache.lucene.index.sorter.TestSortingMergePolicy

Error Message:
Captured an uncaught exception in thread: Thread[id=27, name=Lucene Merge Thread #16, state=RUNNABLE, group=TGRP-TestSortingMergePolicy]

Stack Trace:
com.carrotsearch.randomizedtesting.UncaughtExceptionError: Captured an uncaught exception in thread: Thread[id=27, name=Lucene Merge Thread #16, state=RUNNABLE, group=TGRP-TestSortingMergePolicy]
Caused by: org.apache.lucene.index.MergePolicy$MergeException: java.lang.AssertionError: info.dir=MockDirWrapper(org.apache.lucene.store.RAMDirectory@6ab30913 lockFactory=org.apache.lucene.store.SingleInstanceLockFactory@1018f51f) vs BaseDirectoryWrapper(org.apache.lucene.store.RAMDirectory@755c62bc lockFactory=org.apache.lucene.store.SingleInstanceLockFactory@45660d6)
	at __randomizedtesting.SeedInfo.seed([43888FACCAEA6BE9]:0)
	at org.apache.lucene.index.ConcurrentMergeScheduler.handleMergeException(ConcurrentMergeScheduler.java:541)
	at org.apache.lucene.index.ConcurrentMergeScheduler$MergeThread.run(ConcurrentMergeScheduler.java:514)
Caused by: java.lang.AssertionError: info.dir=MockDirWrapper(org.apache.lucene.store.RAMDirectory@6ab30913 lockFactory=org.apache.lucene.store.SingleInstanceLockFactory@1018f51f) vs BaseDirectoryWrapper(org.apache.lucene.store.RAMDirectory@755c62bc lockFactory=org.apache.lucene.store.SingleInstanceLockFactory@45660d6)
	at org.apache.lucene.index.IndexWriter$ReaderPool.get(IndexWriter.java:531)
	at org.apache.lucene.index.IndexWriter.mergeMiddle(IndexWriter.java:3626)
	at org.apache.lucene.index.IndexWriter.merge(IndexWriter.java:3296)
	at org.apache.lucene.index.ConcurrentMergeScheduler.doMerge(ConcurrentMergeScheduler.java:401)
	at org.apache.lucene.index.ConcurrentMergeScheduler$MergeThread.run(ConcurrentMergeScheduler.java:478)




Build Log:
[...truncated 7132 lines...]
[junit4:junit4] Suite: org.apache.lucene.index.sorter.TestSortingMergePolicy
[junit4:junit4]   2> 23.3.2013 01:52: com.carrotsearch.randomizedtesting.RandomizedRunner$QueueUncaughtExceptionsHandler uncaughtException
[junit4:junit4]   2> WARNING: Uncaught exception in thread: Thread[Lucene Merge Thread #4,6,TGRP-TestSortingMergePolicy]
[junit4:junit4]   2> org.apache.lucene.index.MergePolicy$MergeException: java.lang.AssertionError: info.dir=MockDirWrapper(org.apache.lucene.store.RAMDirectory@6ab30913 lockFactory=org.apache.lucene.store.SingleInstanceLockFactory@1018f51f) vs BaseDirectoryWrapper(org.apache.lucene.store.RAMDirectory@755c62bc lockFactory=org.apache.lucene.store.SingleInstanceLockFactory@45660d6)
[junit4:junit4]   2> 	at __randomizedtesting.SeedInfo.seed([43888FACCAEA6BE9]:0)
[junit4:junit4]   2> 	at org.apache.lucene.index.ConcurrentMergeScheduler.handleMergeException(ConcurrentMergeScheduler.java:541)
[junit4:junit4]   2> 	at org.apache.lucene.index.ConcurrentMergeScheduler$MergeThread.run(ConcurrentMergeScheduler.java:514)
[junit4:junit4]   2> Caused by: java.lang.AssertionError: info.dir=MockDirWrapper(org.apache.lucene.store.RAMDirectory@6ab30913 lockFactory=org.apache.lucene.store.SingleInstanceLockFactory@1018f51f) vs BaseDirectoryWrapper(org.apache.lucene.store.RAMDirectory@755c62bc lockFactory=org.apache.lucene.store.SingleInstanceLockFactory@45660d6)
[junit4:junit4]   2> 	at org.apache.lucene.index.IndexWriter$ReaderPool.get(IndexWriter.java:531)
[junit4:junit4]   2> 	at org.apache.lucene.index.IndexWriter.mergeMiddle(IndexWriter.java:3626)
[junit4:junit4]   2> 	at org.apache.lucene.index.IndexWriter.merge(IndexWriter.java:3296)
[junit4:junit4]   2> 	at org.apache.lucene.index.ConcurrentMergeScheduler.doMerge(ConcurrentMergeScheduler.java:401)
[junit4:junit4]   2> 	at org.apache.lucene.index.ConcurrentMergeScheduler$MergeThread.run(ConcurrentMergeScheduler.java:478)
[junit4:junit4]   2> 23.3.2013 01:52: com.carrotsearch.randomizedtesting.RandomizedRunner$QueueUncaughtExceptionsHandler uncaughtException
[junit4:junit4]   2> WARNING: Uncaught exception in thread: Thread[Lucene Merge Thread #5,6,TGRP-TestSortingMergePolicy]
[junit4:junit4]   2> org.apache.lucene.index.MergePolicy$MergeException: java.lang.AssertionError: info.dir=MockDirWrapper(org.apache.lucene.store.RAMDirectory@6ab30913 lockFactory=org.apache.lucene.store.SingleInstanceLockFactory@1018f51f) vs BaseDirectoryWrapper(org.apache.lucene.store.RAMDirectory@755c62bc lockFactory=org.apache.lucene.store.SingleInstanceLockFactory@45660d6)
[junit4:junit4]   2> 	at __randomizedtesting.SeedInfo.seed([43888FACCAEA6BE9]:0)
[junit4:junit4]   2> 	at org.apache.lucene.index.ConcurrentMergeScheduler.handleMergeException(ConcurrentMergeScheduler.java:541)
[junit4:junit4]   2> 	at org.apache.lucene.index.ConcurrentMergeScheduler$MergeThread.run(ConcurrentMergeScheduler.java:514)
[junit4:junit4]   2> Caused by: java.lang.AssertionError: info.dir=MockDirWrapper(org.apache.lucene.store.RAMDirectory@6ab30913 lockFactory=org.apache.lucene.store.SingleInstanceLockFactory@1018f51f) vs BaseDirectoryWrapper(org.apache.lucene.store.RAMDirectory@755c62bc lockFactory=org.apache.lucene.store.SingleInstanceLockFactory@45660d6)
[junit4:junit4]   2> 	at org.apache.lucene.index.IndexWriter$ReaderPool.get(IndexWriter.java:531)
[junit4:junit4]   2> 	at org.apache.lucene.index.IndexWriter.mergeMiddle(IndexWriter.java:3626)
[junit4:junit4]   2> 	at org.apache.lucene.index.IndexWriter.merge(IndexWriter.java:3296)
[junit4:junit4]   2> 	at org.apache.lucene.index.ConcurrentMergeScheduler.doMerge(ConcurrentMergeScheduler.java:401)
[junit4:junit4]   2> 	at org.apache.lucene.index.ConcurrentMergeScheduler$MergeThread.run(ConcurrentMergeScheduler.java:478)
[junit4:junit4]   2> 23.3.2013 01:52: com.carrotsearch.randomizedtesting.RandomizedRunner$QueueUncaughtExceptionsHandler uncaughtException
[junit4:junit4]   2> WARNING: Uncaught exception in thread: Thread[Lucene Merge Thread #8,6,TGRP-TestSortingMergePolicy]
[junit4:junit4]   2> org.apache.lucene.index.MergePolicy$MergeException: java.lang.AssertionError: info.dir=MockDirWrapper(org.apache.lucene.store.RAMDirectory@6ab30913 lockFactory=org.apache.lucene.store.SingleInstanceLockFactory@1018f51f) vs BaseDirectoryWrapper(org.apache.lucene.store.RAMDirectory@755c62bc lockFactory=org.apache.lucene.store.SingleInstanceLockFactory@45660d6)
[junit4:junit4]   2> 	at __randomizedtesting.SeedInfo.seed([43888FACCAEA6BE9]:0)
[junit4:junit4]   2> 	at org.apache.lucene.index.ConcurrentMergeScheduler.handleMergeException(ConcurrentMergeScheduler.java:541)
[junit4:junit4]   2> 	at org.apache.lucene.index.ConcurrentMergeScheduler$MergeThread.run(ConcurrentMergeScheduler.java:514)
[junit4:junit4]   2> Caused by: java.lang.AssertionError: info.dir=MockDirWrapper(org.apache.lucene.store.RAMDirectory@6ab30913 lockFactory=org.apache.lucene.store.SingleInstanceLockFactory@1018f51f) vs BaseDirectoryWrapper(org.apache.lucene.store.RAMDirectory@755c62bc lockFactory=org.apache.lucene.store.SingleInstanceLockFactory@45660d6)
[junit4:junit4]   2> 	at org.apache.lucene.index.IndexWriter$ReaderPool.get(IndexWriter.java:531)
[junit4:junit4]   2> 	at org.apache.lucene.index.IndexWriter.mergeMiddle(IndexWriter.java:3626)
[junit4:junit4]   2> 	at org.apache.lucene.index.IndexWriter.merge(IndexWriter.java:3296)
[junit4:junit4]   2> 	at org.apache.lucene.index.ConcurrentMergeScheduler.doMerge(ConcurrentMergeScheduler.java:401)
[junit4:junit4]   2> 	at org.apache.lucene.index.ConcurrentMergeScheduler$MergeThread.run(ConcurrentMergeScheduler.java:478)
[junit4:junit4]   2> 23.3.2013 01:52: com.carrotsearch.randomizedtesting.RandomizedRunner$QueueUncaughtExceptionsHandler uncaughtException
[junit4:junit4]   2> WARNING: Uncaught exception in thread: Thread[Lucene Merge Thread #9,6,TGRP-TestSortingMergePolicy]
[junit4:junit4]   2> org.apache.lucene.index.MergePolicy$MergeException: java.lang.AssertionError: info.dir=BaseDirectoryWrapper(org.apache.lucene.store.RAMDirectory@755c62bc lockFactory=org.apache.lucene.store.SingleInstanceLockFactory@45660d6) vs MockDirWrapper(org.apache.lucene.store.RAMDirectory@6ab30913 lockFactory=org.apache.lucene.store.SingleInstanceLockFactory@1018f51f)
[junit4:junit4]   2> 	at __randomizedtesting.SeedInfo.seed([43888FACCAEA6BE9]:0)
[junit4:junit4]   2> 	at org.apache.lucene.index.ConcurrentMergeScheduler.handleMergeException(ConcurrentMergeScheduler.java:541)
[junit4:junit4]   2> 	at org.apache.lucene.index.ConcurrentMergeScheduler$MergeThread.run(ConcurrentMergeScheduler.java:514)
[junit4:junit4]   2> Caused by: java.lang.AssertionError: info.dir=BaseDirectoryWrapper(org.apache.lucene.store.RAMDirectory@755c62bc lockFactory=org.apache.lucene.store.SingleInstanceLockFactory@45660d6) vs MockDirWrapper(org.apache.lucene.store.RAMDirectory@6ab30913 lockFactory=org.apache.lucene.store.SingleInstanceLockFactory@1018f51f)
[junit4:junit4]   2> 	at org.apache.lucene.index.IndexWriter$ReaderPool.get(IndexWriter.java:531)
[junit4:junit4]   2> 	at org.apache.lucene.index.IndexWriter.mergeMiddle(IndexWriter.java:3626)
[junit4:junit4]   2> 	at org.apache.lucene.index.IndexWriter.merge(IndexWriter.java:3296)
[junit4:junit4]   2> 	at org.apache.lucene.index.ConcurrentMergeScheduler.doMerge(ConcurrentMergeScheduler.java:401)
[junit4:junit4]   2> 	at org.apache.lucene.index.ConcurrentMergeScheduler$MergeThread.run(ConcurrentMergeScheduler.java:478)
[junit4:junit4]   2> 23.3.2013 01:52: com.carrotsearch.randomizedtesting.RandomizedRunner$QueueUncaughtExceptionsHandler uncaughtException
[junit4:junit4]   2> WARNING: Uncaught exception in thread: Thread[Lucene Merge Thread #10,6,TGRP-TestSortingMergePolicy]
[junit4:junit4]   2> org.apache.lucene.index.MergePolicy$MergeException: java.lang.AssertionError: info.dir=BaseDirectoryWrapper(org.apache.lucene.store.RAMDirectory@755c62bc lockFactory=org.apache.lucene.store.SingleInstanceLockFactory@45660d6) vs MockDirWrapper(org.apache.lucene.store.RAMDirectory@6ab30913 lockFactory=org.apache.lucene.store.SingleInstanceLockFactory@1018f51f)
[junit4:junit4]   2> 	at __randomizedtesting.SeedInfo.seed([43888FACCAEA6BE9]:0)
[junit4:junit4]   2> 	at org.apache.lucene.index.ConcurrentMergeScheduler.handleMergeException(ConcurrentMergeScheduler.java:541)
[junit4:junit4]   2> 	at org.apache.lucene.index.ConcurrentMergeScheduler$MergeThread.run(ConcurrentMergeScheduler.java:514)
[junit4:junit4]   2> Caused by: java.lang.AssertionError: info.dir=BaseDirectoryWrapper(org.apache.lucene.store.RAMDirectory@755c62bc lockFactory=org.apache.lucene.store.SingleInstanceLockFactory@45660d6) vs MockDirWrapper(org.apache.lucene.store.RAMDirectory@6ab30913 lockFactory=org.apache.lucene.store.SingleInstanceLockFactory@1018f51f)
[junit4:junit4]   2> 	at org.apache.lucene.index.IndexWriter$ReaderPool.get(IndexWriter.java:531)
[junit4:junit4]   2> 	at org.apache.lucene.index.IndexWriter.mergeMiddle(IndexWriter.java:3626)
[junit4:junit4]   2> 	at org.apache.lucene.index.IndexWriter.merge(IndexWriter.java:3296)
[junit4:junit4]   2> 	at org.apache.lucene.index.ConcurrentMergeScheduler.doMerge(ConcurrentMergeScheduler.java:401)
[junit4:junit4]   2> 	at org.apache.lucene.index.ConcurrentMergeScheduler$MergeThread.run(ConcurrentMergeScheduler.java:478)
[junit4:junit4]   2> 23.3.2013 01:52: com.carrotsearch.randomizedtesting.RandomizedRunner$QueueUncaughtExceptionsHandler uncaughtException
[junit4:junit4]   2> WARNING: Uncaught exception in thread: Thread[Lucene Merge Thread #16,6,TGRP-TestSortingMergePolicy]
[junit4:junit4]   2> org.apache.lucene.index.MergePolicy$MergeException: java.lang.AssertionError: info.dir=MockDirWrapper(org.apache.lucene.store.RAMDirectory@6ab30913 lockFactory=org.apache.lucene.store.SingleInstanceLockFactory@1018f51f) vs BaseDirectoryWrapper(org.apache.lucene.store.RAMDirectory@755c62bc lockFactory=org.apache.lucene.store.SingleInstanceLockFactory@45660d6)
[junit4:junit4]   2> 	at __randomizedtesting.SeedInfo.seed([43888FACCAEA6BE9]:0)
[junit4:junit4]   2> 	at org.apache.lucene.index.ConcurrentMergeScheduler.handleMergeException(ConcurrentMergeScheduler.java:541)
[junit4:junit4]   2> 	at org.apache.lucene.index.ConcurrentMergeScheduler$MergeThread.run(ConcurrentMergeScheduler.java:514)
[junit4:junit4]   2> Caused by: java.lang.AssertionError: info.dir=MockDirWrapper(org.apache.lucene.store.RAMDirectory@6ab30913 lockFactory=org.apache.lucene.store.SingleInstanceLockFactory@1018f51f) vs BaseDirectoryWrapper(org.apache.lucene.store.RAMDirectory@755c62bc lockFactory=org.apache.lucene.store.SingleInstanceLockFactory@45660d6)
[junit4:junit4]   2> 	at org.apache.lucene.index.IndexWriter$ReaderPool.get(IndexWriter.java:531)
[junit4:junit4]   2> 	at org.apache.lucene.index.IndexWriter.mergeMiddle(IndexWriter.java:3626)
[junit4:junit4]   2> 	at org.apache.lucene.index.IndexWriter.merge(IndexWriter.java:3296)
[junit4:junit4]   2> 	at org.apache.lucene.index.ConcurrentMergeScheduler.doMerge(ConcurrentMergeScheduler.java:401)
[junit4:junit4]   2> 	at org.apache.lucene.index.ConcurrentMergeScheduler$MergeThread.run(ConcurrentMergeScheduler.java:478)
[junit4:junit4]   2> 23.3.2013 03:52: com.carrotsearch.randomizedtesting.ThreadLeakControl$2 evaluate
[junit4:junit4]   2> WARNING: Suite execution timed out: org.apache.lucene.index.sorter.TestSortingMergePolicy
[junit4:junit4]   2> ==== jstack at approximately timeout time ====
[junit4:junit4]   2> "TEST-TestSortingMergePolicy.testSortingMP-seed#[43888FACCAEA6BE9]" ID=10 TIMED_WAITING on org.apache.lucene.index.IndexWriter@5a10c276
[junit4:junit4]   2> 	at java.lang.Object.wait(Native Method)
[junit4:junit4]   2> 	- timed waiting on org.apache.lucene.index.IndexWriter@5a10c276
[junit4:junit4]   2> 	at org.apache.lucene.index.IndexWriter.doWait(IndexWriter.java:3907)
[junit4:junit4]   2> 	at org.apache.lucene.index.IndexWriter.forceMerge(IndexWriter.java:1684)
[junit4:junit4]   2> 	at org.apache.lucene.index.IndexWriter.forceMerge(IndexWriter.java:1610)
[junit4:junit4]   2> 	at org.apache.lucene.index.sorter.TestSortingMergePolicy.createRandomIndexes(TestSortingMergePolicy.java:81)
[junit4:junit4]   2> 	at org.apache.lucene.index.sorter.TestSortingMergePolicy.setUp(TestSortingMergePolicy.java:51)
[junit4:junit4]   2> 	at sun.reflect.NativeMethodAccessorImpl.invoke0(Native Method)
[junit4:junit4]   2> 	at sun.reflect.NativeMethodAccessorImpl.invoke(NativeMethodAccessorImpl.java:57)
[junit4:junit4]   2> 	at sun.reflect.DelegatingMethodAccessorImpl.invoke(DelegatingMethodAccessorImpl.java:43)
[junit4:junit4]   2> 	at java.lang.reflect.Method.invoke(Method.java:616)
[junit4:junit4]   2> 	at com.carrotsearch.randomizedtesting.RandomizedRunner.invoke(RandomizedRunner.java:1559)
[junit4:junit4]   2> 	at com.carrotsearch.randomizedtesting.RandomizedRunner.access$600(RandomizedRunner.java:79)
[junit4:junit4]   2> 	at com.carrotsearch.randomizedtesting.RandomizedRunner$7.evaluate(RandomizedRunner.java:771)
[junit4:junit4]   2> 	at com.carrotsearch.randomizedtesting.RandomizedRunner$8.evaluate(RandomizedRunner.java:787)
[junit4:junit4]   2> 	at org.apache.lucene.util.TestRuleSetupTeardownChained$1.evaluate(TestRuleSetupTeardownChained.java:50)
[junit4:junit4]   2> 	at org.apache.lucene.util.TestRuleFieldCacheSanity$1.evaluate(TestRuleFieldCacheSanity.java:51)
[junit4:junit4]   2> 	at org.apache.lucene.util.AbstractBeforeAfterRule$1.evaluate(AbstractBeforeAfterRule.java:46)
[junit4:junit4]   2> 	at com.carrotsearch.randomizedtesting.rules.SystemPropertiesInvariantRule$1.evaluate(SystemPropertiesInvariantRule.java:55)
[junit4:junit4]   2> 	at org.apache.lucene.util.TestRuleThreadAndTestName$1.evaluate(TestRuleThreadAndTestName.java:49)
[junit4:junit4]   2> 	at org.apache.lucene.util.TestRuleIgnoreAfterMaxFailures$1.evaluate(TestRuleIgnoreAfterMaxFailures.java:70)
[junit4:junit4]   2> 	at org.apache.lucene.util.TestRuleMarkFailure$1.evaluate(TestRuleMarkFailure.java:48)
[junit4:junit4]   2> 	at com.carrotsearch.randomizedtesting.rules.StatementAdapter.evaluate(StatementAdapter.java:36)
[junit4:junit4]   2> 	at com.carrotsearch.randomizedtesting.ThreadLeakControl$StatementRunner.run(ThreadLeakControl.java:358)
[junit4:junit4]   2> 	at com.carrotsearch.randomizedtesting.ThreadLeakControl.forkTimeoutingTask(ThreadLeakControl.java:782)
[junit4:junit4]   2> 	at com.carrotsearch.randomizedtesting.ThreadLeakControl$3.evaluate(ThreadLeakControl.java:442)
[junit4:junit4]   2> 	at com.carrotsearch.randomizedtesting.RandomizedRunner.runSingleTest(RandomizedRunner.java:746)
[junit4:junit4]   2> 	at com.carrotsearch.randomizedtesting.RandomizedRunner$3.evaluate(RandomizedRunner.java:648)
[junit4:junit4]   2> 	at com.carrotsearch.randomizedtesting.RandomizedRunner$4.evaluate(RandomizedRunner.java:682)
[junit4:junit4]   2> 	at com.carrotsearch.randomizedtesting.RandomizedRunner$5.evaluate(RandomizedRunner.java:693)
[junit4:junit4]   2> 	at org.apache.lucene.util.AbstractBeforeAfterRule$1.evaluate(AbstractBeforeAfterRule.java:46)
[junit4:junit4]   2> 	at org.apache.lucene.util.TestRuleStoreClassName$1.evaluate(TestRuleStoreClassName.java:42)
[junit4:junit4]   2> 	at com.carrotsearch.randomizedtesting.rules.SystemPropertiesInvariantRule$1.evaluate(SystemPropertiesInvariantRule.java:55)
[junit4:junit4]   2> 	at com.carrotsearch.randomizedtesting.rules.NoShadowingOrOverridesOnMethodsRule$1.evaluate(NoShadowingOrOverridesOnMethodsRule.java:39)
[junit4:junit4]   2> 	at com.carrotsearch.randomizedtesting.rules.NoShadowingOrOverridesOnMethodsRule$1.evaluate(NoShadowingOrOverridesOnMethodsRule.java:39)
[junit4:junit4]   2> 	at com.carrotsearch.randomizedtesting.rules.StatementAdapter.evaluate(StatementAdapter.java:36)
[junit4:junit4]   2> 	at org.apache.lucene.util.TestRuleAssertionsRequired$1.evaluate(TestRuleAssertionsRequired.java:43)
[junit4:junit4]   2> 	at org.apache.lucene.util.TestRuleMarkFailure$1.evaluate(TestRuleMarkFailure.java:48)
[junit4:junit4]   2> 	at org.apache.lucene.util.TestRuleIgnoreAfterMaxFailures$1.evaluate(TestRuleIgnoreAfterMaxFailures.java:70)
[junit4:junit4]   2> 	at org.apache.lucene.util.TestRuleIgnoreTestSuites$1.evaluate(TestRuleIgnoreTestSuites.java:55)
[junit4:junit4]   2> 	at com.carrotsearch.randomizedtesting.rules.StatementAdapter.evaluate(StatementAdapter.java:36)
[junit4:junit4]   2> 	at com.carrotsearch.randomizedtesting.ThreadLeakControl$StatementRunner.run(ThreadLeakControl.java:358)
[junit4:junit4]   2> 	at java.lang.Thread.run(Thread.java:679)
[junit4:junit4]   2> 
[junit4:junit4]   2> "SUITE-TestSortingMergePolicy-seed#[43888FACCAEA6BE9]" ID=9 RUNNABLE
[junit4:junit4]   2> 	at sun.management.ThreadImpl.dumpThreads0(Native Method)
[junit4:junit4]   2> 	at sun.management.ThreadImpl.dumpAllThreads(ThreadImpl.java:392)
[junit4:junit4]   2> 	at com.carrotsearch.randomizedtesting.ThreadLeakControl.formatThreadStacksFull(ThreadLeakControl.java:655)
[junit4:junit4]   2> 	at com.carrotsearch.randomizedtesting.ThreadLeakControl.access$800(ThreadLeakControl.java:60)
[junit4:junit4]   2> 	at com.carrotsearch.randomizedtesting.ThreadLeakControl$2.evaluate(ThreadLeakControl.java:396)
[junit4:junit4]   2> 	- locked java.lang.Object@24eff2c
[junit4:junit4]   2> 	at com.carrotsearch.randomizedtesting.RandomizedRunner.runSuite(RandomizedRunner.java:556)
[junit4:junit4]   2> 	at com.carrotsearch.randomizedtesting.RandomizedRunner.access$200(RandomizedRunner.java:79)
[junit4:junit4]   2> 	at com.carrotsearch.randomizedtesting.RandomizedRunner$1.run(RandomizedRunner.java:492)
[junit4:junit4]   2> 
[junit4:junit4]   2> "Signal Dispatcher" ID=4 RUNNABLE
[junit4:junit4]   2> 
[junit4:junit4]   2> "Finalizer" ID=3 WAITING on java.lang.ref.ReferenceQueue$Lock@1052a2e3
[junit4:junit4]   2> 	at java.lang.Object.wait(Native Method)
[junit4:junit4]   2> 	- waiting on java.lang.ref.ReferenceQueue$Lock@1052a2e3
[junit4:junit4]   2> 	at java.lang.ref.ReferenceQueue.remove(ReferenceQueue.java:133)
[junit4:junit4]   2> 	at java.lang.ref.ReferenceQueue.remove(ReferenceQueue.java:149)
[junit4:junit4]   2> 	at java.lang.ref.Finalizer$FinalizerThread.run(Finalizer.java:177)
[junit4:junit4]   2> 
[junit4:junit4]   2> "Reference Handler" ID=2 WAITING on java.lang.ref.Reference$Lock@2143ed74
[junit4:junit4]   2> 	at java.lang.Object.wait(Native Method)
[junit4:junit4]   2> 	- waiting on java.lang.ref.Reference$Lock@2143ed74
[junit4:junit4]   2> 	at java.lang.Object.wait(Object.java:502)
[junit4:junit4]   2> 	at java.lang.ref.Reference$ReferenceHandler.run(Reference.java:133)
[junit4:junit4]   2> 
[junit4:junit4]   2> "main" ID=1 WAITING on com.carrotsearch.randomizedtesting.RandomizedRunner$1@3295cfbe
[junit4:junit4]   2> 	at java.lang.Object.wait(Native Method)
[junit4:junit4]   2> 	- waiting on com.carrotsearch.randomizedtesting.RandomizedRunner$1@3295cfbe
[junit4:junit4]   2> 	at java.lang.Thread.join(Thread.java:1203)
[junit4:junit4]   2> 	at java.lang.Thread.join(Thread.java:1256)
[junit4:junit4]   2> 	at com.carrotsearch.randomizedtesting.RandomizedRunner.runSuite(RandomizedRunner.java:502)
[junit4:junit4]   2> 	at com.carrotsearch.randomizedtesting.RandomizedRunner.run(RandomizedRunner.java:399)
[junit4:junit4]   2> 	at com.carrotsearch.ant.tasks.junit4.slave.SlaveMain.execute(SlaveMain.java:180)
[junit4:junit4]   2> 	at com.carrotsearch.ant.tasks.junit4.slave.SlaveMain.main(SlaveMain.java:275)
[junit4:junit4]   2> 	at com.carrotsearch.ant.tasks.junit4.slave.SlaveMainSafe.main(SlaveMainSafe.java:12)
[junit4:junit4]   2> 
[junit4:junit4]   2> ^^==============================================
[junit4:junit4]   2> 
[junit4:junit4]   2> NOTE: download the large Jenkins line-docs file by running 'ant get-jenkins-line-docs' in the lucene directory.
[junit4:junit4]   2> NOTE: reproduce with: ant test  -Dtestcase=TestSortingMergePolicy -Dtests.method=testSortingMP -Dtests.seed=43888FACCAEA6BE9 -Dtests.multiplier=2 -Dtests.nightly=true -Dtests.slow=true -Dtests.linedocsfile=/home/hudson/lucene-data/enwiki.random.lines.txt -Dtests.locale=mk_MK -Dtests.timezone=Africa/Luanda -Dtests.file.encoding=ISO-8859-1
[junit4:junit4] ERROR   7199s J0 | TestSortingMergePolicy.testSortingMP <<<
[junit4:junit4]    > Throwable #1: java.lang.Exception: Test abandoned because suite timeout was reached.
[junit4:junit4]    > 	at __randomizedtesting.SeedInfo.seed([43888FACCAEA6BE9]:0)
[junit4:junit4]   2> 23.3.2013 03:52: com.carrotsearch.randomizedtesting.ThreadLeakControl checkThreadLeaks
[junit4:junit4]   2> WARNING: Will linger awaiting termination of 1 leaked thread(s).
[junit4:junit4]   2> 23.3.2013 03:52: com.carrotsearch.randomizedtesting.ThreadLeakControl checkThreadLeaks
[junit4:junit4]   2> SEVERE: 1 thread leaked from SUITE scope at org.apache.lucene.index.sorter.TestSortingMergePolicy: 
[junit4:junit4]   2>    1) Thread[id=10, name=TEST-TestSortingMergePolicy.testSortingMP-seed#[43888FACCAEA6BE9], state=TIMED_WAITING, group=TGRP-TestSortingMergePolicy]
[junit4:junit4]   2>         at java.lang.Object.wait(Native Method)
[junit4:junit4]   2>         at org.apache.lucene.index.IndexWriter.doWait(IndexWriter.java:3907)
[junit4:junit4]   2>         at org.apache.lucene.index.IndexWriter.forceMerge(IndexWriter.java:1684)
[junit4:junit4]   2>         at org.apache.lucene.index.IndexWriter.forceMerge(IndexWriter.java:1610)
[junit4:junit4]   2>         at org.apache.lucene.index.sorter.TestSortingMergePolicy.createRandomIndexes(TestSortingMergePolicy.java:81)
[junit4:junit4]   2>         at org.apache.lucene.index.sorter.TestSortingMergePolicy.setUp(TestSortingMergePolicy.java:51)
[junit4:junit4]   2>         at sun.reflect.NativeMethodAccessorImpl.invoke0(Native Method)
[junit4:junit4]   2>         at sun.reflect.NativeMethodAccessorImpl.invoke(NativeMethodAccessorImpl.java:57)
[junit4:junit4]   2>         at sun.reflect.DelegatingMethodAccessorImpl.invoke(DelegatingMethodAccessorImpl.java:43)
[junit4:junit4]   2>         at java.lang.reflect.Method.invoke(Method.java:616)
[junit4:junit4]   2>         at com.carrotsearch.randomizedtesting.RandomizedRunner.invoke(RandomizedRunner.java:1559)
[junit4:junit4]   2>         at com.carrotsearch.randomizedtesting.RandomizedRunner.access$600(RandomizedRunner.java:79)
[junit4:junit4]   2>         at com.carrotsearch.randomizedtesting.RandomizedRunner$7.evaluate(RandomizedRunner.java:771)
[junit4:junit4]   2>         at com.carrotsearch.randomizedtesting.RandomizedRunner$8.evaluate(RandomizedRunner.java:787)
[junit4:junit4]   2>         at org.apache.lucene.util.TestRuleSetupTeardownChained$1.evaluate(TestRuleSetupTeardownChained.java:50)
[junit4:junit4]   2>         at org.apache.lucene.util.TestRuleFieldCacheSanity$1.evaluate(TestRuleFieldCacheSanity.java:51)
[junit4:junit4]   2>         at org.apache.lucene.util.AbstractBeforeAfterRule$1.evaluate(AbstractBeforeAfterRule.java:46)
[junit4:junit4]   2>         at com.carrotsearch.randomizedtesting.rules.SystemPropertiesInvariantRule$1.evaluate(SystemPropertiesInvariantRule.java:55)
[junit4:junit4]   2>         at org.apache.lucene.util.TestRuleThreadAndTestName$1.evaluate(TestRuleThreadAndTestName.java:49)
[junit4:junit4]   2>         at org.apache.lucene.util.TestRuleIgnoreAfterMaxFailures$1.evaluate(TestRuleIgnoreAfterMaxFailures.java:70)
[junit4:junit4]   2>         at org.apache.lucene.util.TestRuleMarkFailure$1.evaluate(TestRuleMarkFailure.java:48)
[junit4:junit4]   2>         at com.carrotsearch.randomizedtesting.rules.StatementAdapter.evaluate(StatementAdapter.java:36)
[junit4:junit4]   2>         at com.carrotsearch.randomizedtesting.ThreadLeakControl$StatementRunner.run(ThreadLeakControl.java:358)
[junit4:junit4]   2>         at com.carrotsearch.randomizedtesting.ThreadLeakControl.forkTimeoutingTask(ThreadLeakControl.java:782)
[junit4:junit4]   2>         at com.carrotsearch.randomizedtesting.ThreadLeakControl$3.evaluate(ThreadLeakControl.java:442)
[junit4:junit4]   2>         at com.carrotsearch.randomizedtesting.RandomizedRunner.runSingleTest(RandomizedRunner.java:746)
[junit4:junit4]   2>         at com.carrotsearch.randomizedtesting.RandomizedRunner$3.evaluate(RandomizedRunner.java:648)
[junit4:junit4]   2>         at com.carrotsearch.randomizedtesting.RandomizedRunner$4.evaluate(RandomizedRunner.java:682)
[junit4:junit4]   2>         at com.carrotsearch.randomizedtesting.RandomizedRunner$5.evaluate(RandomizedRunner.java:693)
[junit4:junit4]   2>         at org.apache.lucene.util.AbstractBeforeAfterRule$1.evaluate(AbstractBeforeAfterRule.java:46)
[junit4:junit4]   2>         at org.apache.lucene.util.TestRuleStoreClassName$1.evaluate(TestRuleStoreClassName.java:42)
[junit4:junit4]   2>         at com.carrotsearch.randomizedtesting.rules.SystemPropertiesInvariantRule$1.evaluate(SystemPropertiesInvariantRule.java:55)
[junit4:junit4]   2>         at com.carrotsearch.randomizedtesting.rules.NoShadowingOrOverridesOnMethodsRule$1.evaluate(NoShadowingOrOverridesOnMethodsRule.java:39)
[junit4:junit4]   2>         at com.carrotsearch.randomizedtesting.rules.NoShadowingOrOverridesOnMethodsRule$1.evaluate(NoShadowingOrOverridesOnMethodsRule.java:39)
[junit4:junit4]   2>         at com.carrotsearch.randomizedtesting.rules.StatementAdapter.evaluate(StatementAdapter.java:36)
[junit4:junit4]   2>         at org.apache.lucene.util.TestRuleAssertionsRequired$1.evaluate(TestRuleAssertionsRequired.java:43)
[junit4:junit4]   2>         at org.apache.lucene.util.TestRuleMarkFailure$1.evaluate(TestRuleMarkFailure.java:48)
[junit4:junit4]   2>         at org.apache.lucene.util.TestRuleIgnoreAfterMaxFailures$1.evaluate(TestRuleIgnoreAfterMaxFailures.java:70)
[junit4:junit4]   2>         at org.apache.lucene.util.TestRuleIgnoreTestSuites$1.evaluate(TestRuleIgnoreTestSuites.java:55)
[junit4:junit4]   2>         at com.carrotsearch.randomizedtesting.rules.StatementAdapter.evaluate(StatementAdapter.java:36)
[junit4:junit4]   2>         at com.carrotsearch.randomizedtesting.ThreadLeakControl$StatementRunner.run(ThreadLeakControl.java:358)
[junit4:junit4]   2>         at java.lang.Thread.run(Thread.java:679)
[junit4:junit4]   2> 23.3.2013 03:52: com.carrotsearch.randomizedtesting.ThreadLeakControl tryToInterruptAll
[junit4:junit4]   2> INFO: Starting to interrupt leaked threads:
[junit4:junit4]   2>    1) Thread[id=10, name=TEST-TestSortingMergePolicy.testSortingMP-seed#[43888FACCAEA6BE9], state=TIMED_WAITING, group=TGRP-TestSortingMergePolicy]
[junit4:junit4]   2> 23.3.2013 03:52: com.carrotsearch.randomizedtesting.ThreadLeakControl tryToInterruptAll
[junit4:junit4]   2> INFO: All leaked threads terminated.
[junit4:junit4]   2> NOTE: test params are: codec=Lucene42: {s=PostingsFormat(name=Asserting)}, docValues:{ndv=DocValuesFormat(name=SimpleText)}, sim=RandomSimilarityProvider(queryNorm=false,coord=no): {}, locale=mk_MK, timezone=Africa/Luanda
[junit4:junit4]   2> NOTE: FreeBSD 9.0-RELEASE amd64/Sun Microsystems Inc. 1.6.0_32 (64-bit)/cpus=16,threads=1,free=438223208,total=514064384
[junit4:junit4]   2> NOTE: All tests run in this JVM: [TestSortingMergePolicy]
[junit4:junit4]   2> NOTE: download the large Jenkins line-docs file by running 'ant get-jenkins-line-docs' in the lucene directory.
[junit4:junit4]   2> NOTE: reproduce with: ant test  -Dtestcase=TestSortingMergePolicy -Dtests.seed=43888FACCAEA6BE9 -Dtests.multiplier=2 -Dtests.nightly=true -Dtests.slow=true -Dtests.linedocsfile=/home/hudson/lucene-data/enwiki.random.lines.txt -Dtests.locale=mk_MK -Dtests.timezone=Africa/Luanda -Dtests.file.encoding=ISO-8859-1
[junit4:junit4] ERROR   0.00s J0 | TestSortingMergePolicy (suite) <<<
[junit4:junit4]    > Throwable #1: java.lang.Exception: Suite timeout exceeded (>= 7200000 msec).
[junit4:junit4]    > 	at __randomizedtesting.SeedInfo.seed([43888FACCAEA6BE9]:0)
[junit4:junit4]    > Throwable #2: com.carrotsearch.randomizedtesting.UncaughtExceptionError: Captured an uncaught exception in thread: Thread[id=15, name=Lucene Merge Thread #4, state=RUNNABLE, group=TGRP-TestSortingMergePolicy]
[junit4:junit4]    > Caused by: org.apache.lucene.index.MergePolicy$MergeException: java.lang.AssertionError: info.dir=MockDirWrapper(org.apache.lucene.store.RAMDirectory@6ab30913 lockFactory=org.apache.lucene.store.SingleInstanceLockFactory@1018f51f) vs BaseDirectoryWrapper(org.apache.lucene.store.RAMDirectory@755c62bc lockFactory=org.apache.lucene.store.SingleInstanceLockFactory@45660d6)
[junit4:junit4]    > 	at __randomizedtesting.SeedInfo.seed([43888FACCAEA6BE9]:0)
[junit4:junit4]    > 	at org.apache.lucene.index.ConcurrentMergeScheduler.handleMergeException(ConcurrentMergeScheduler.java:541)
[junit4:junit4]    > 	at org.apache.lucene.index.ConcurrentMergeScheduler$MergeThread.run(ConcurrentMergeScheduler.java:514)
[junit4:junit4]    > Caused by: java.lang.AssertionError: info.dir=MockDirWrapper(org.apache.lucene.store.RAMDirectory@6ab30913 lockFactory=org.apache.lucene.store.SingleInstanceLockFactory@1018f51f) vs BaseDirectoryWrapper(org.apache.lucene.store.RAMDirectory@755c62bc lockFactory=org.apache.lucene.store.SingleInstanceLockFactory@45660d6)
[junit4:junit4]    > 	at org.apache.lucene.index.IndexWriter$ReaderPool.get(IndexWriter.java:531)
[junit4:junit4]    > 	at org.apache.lucene.index.IndexWriter.mergeMiddle(IndexWriter.java:3626)
[junit4:junit4]    > 	at org.apache.lucene.index.IndexWriter.merge(IndexWriter.java:3296)
[junit4:junit4]    > 	at org.apache.lucene.index.ConcurrentMergeScheduler.doMerge(ConcurrentMergeScheduler.java:401)
[junit4:junit4]    > 	at org.apache.lucene.index.ConcurrentMergeScheduler$MergeThread.run(ConcurrentMergeScheduler.java:478)
[junit4:junit4]    > Throwable #3: com.carrotsearch.randomizedtesting.UncaughtExceptionError: Captured an uncaught exception in thread: Thread[id=16, name=Lucene Merge Thread #5, state=RUNNABLE, group=TGRP-TestSortingMergePolicy]
[junit4:junit4]    > Caused by: org.apache.lucene.index.MergePolicy$MergeException: java.lang.AssertionError: info.dir=MockDirWrapper(org.apache.lucene.store.RAMDirectory@6ab30913 lockFactory=org.apache.lucene.store.SingleInstanceLockFactory@1018f51f) vs BaseDirectoryWrapper(org.apache.lucene.store.RAMDirectory@755c62bc lockFactory=org.apache.lucene.store.SingleInstanceLockFactory@45660d6)
[junit4:junit4]    > 	at __randomizedtesting.SeedInfo.seed([43888FACCAEA6BE9]:0)
[junit4:junit4]    > 	at org.apache.lucene.index.ConcurrentMergeScheduler.handleMergeException(ConcurrentMergeScheduler.java:541)
[junit4:junit4]    > 	at org.apache.lucene.index.ConcurrentMergeScheduler$MergeThread.run(ConcurrentMergeScheduler.java:514)
[junit4:junit4]    > Caused by: java.lang.AssertionError: info.dir=MockDirWrapper(org.apache.lucene.store.RAMDirectory@6ab30913 lockFactory=org.apache.lucene.store.SingleInstanceLockFactory@1018f51f) vs BaseDirectoryWrapper(org.apache.lucene.store.RAMDirectory@755c62bc lockFactory=org.apache.lucene.store.SingleInstanceLockFactory@45660d6)
[junit4:junit4]    > 	at org.apache.lucene.index.IndexWriter$ReaderPool.get(IndexWriter.java:531)
[junit4:junit4]    > 	at org.apache.lucene.index.IndexWriter.mergeMiddle(IndexWriter.java:3626)
[junit4:junit4]    > 	at org.apache.lucene.index.IndexWriter.merge(IndexWriter.java:3296)
[junit4:junit4]    > 	at org.apache.lucene.index.ConcurrentMergeScheduler.doMerge(ConcurrentMergeScheduler.java:401)
[junit4:junit4]    > 	at org.apache.lucene.index.ConcurrentMergeScheduler$MergeThread.run(ConcurrentMergeScheduler.java:478)
[junit4:junit4]    > Throwable #4: com.carrotsearch.randomizedtesting.UncaughtExceptionError: Captured an uncaught exception in thread: Thread[id=19, name=Lucene Merge Thread #8, state=RUNNABLE, group=TGRP-TestSortingMergePolicy]
[junit4:junit4]    > Caused by: org.apache.lucene.index.MergePolicy$MergeException: java.lang.AssertionError: info.dir=MockDirWrapper(org.apache.lucene.store.RAMDirectory@6ab30913 lockFactory=org.apache.lucene.store.SingleInstanceLockFactory@1018f51f) vs BaseDirectoryWrapper(org.apache.lucene.store.RAMDirectory@755c62bc lockFactory=org.apache.lucene.store.SingleInstanceLockFactory@45660d6)
[junit4:junit4]    > 	at __randomizedtesting.SeedInfo.seed([43888FACCAEA6BE9]:0)
[junit4:junit4]    > 	at org.apache.lucene.index.ConcurrentMergeScheduler.handleMergeException(ConcurrentMergeScheduler.java:541)
[junit4:junit4]    > 	at org.apache.lucene.index.ConcurrentMergeScheduler$MergeThread.run(ConcurrentMergeScheduler.java:514)
[junit4:junit4]    > Caused by: java.lang.AssertionError: info.dir=MockDirWrapper(org.apache.lucene.store.RAMDirectory@6ab30913 lockFactory=org.apache.lucene.store.SingleInstanceLockFactory@1018f51f) vs BaseDirectoryWrapper(org.apache.lucene.store.RAMDirectory@755c62bc lockFactory=org.apache.lucene.store.SingleInstanceLockFactory@45660d6)
[junit4:junit4]    > 	at org.apache.lucene.index.IndexWriter$ReaderPool.get(IndexWriter.java:531)
[junit4:junit4]    > 	at org.apache.lucene.index.IndexWriter.mergeMiddle(IndexWriter.java:3626)
[junit4:junit4]    > 	at org.apache.lucene.index.IndexWriter.merge(IndexWriter.java:3296)
[junit4:junit4]    > 	at org.apache.lucene.index.ConcurrentMergeScheduler.doMerge(ConcurrentMergeScheduler.java:401)
[junit4:junit4]    > 	at org.apache.lucene.index.ConcurrentMergeScheduler$MergeThread.run(ConcurrentMergeScheduler.java:478)
[junit4:junit4]    > Throwable #5: com.carrotsearch.randomizedtesting.UncaughtExceptionError: Captured an uncaught exception in thread: Thread[id=20, name=Lucene Merge Thread #9, state=RUNNABLE, group=TGRP-TestSortingMergePolicy]
[junit4:junit4]    > Caused by: org.apache.lucene.index.MergePolicy$MergeException: java.lang.AssertionError: info.dir=BaseDirectoryWrapper(org.apache.lucene.store.RAMDirectory@755c62bc lockFactory=org.apache.lucene.store.SingleInstanceLockFactory@45660d6) vs MockDirWrapper(org.apache.lucene.store.RAMDirectory@6ab30913 lockFactory=org.apache.lucene.store.SingleInstanceLockFactory@1018f51f)
[junit4:junit4]    > 	at __randomizedtesting.SeedInfo.seed([43888FACCAEA6BE9]:0)
[junit4:junit4]    > 	at org.apache.lucene.index.ConcurrentMergeScheduler.handleMergeException(ConcurrentMergeScheduler.java:541)
[junit4:junit4]    > 	at org.apache.lucene.index.ConcurrentMergeScheduler$MergeThread.run(ConcurrentMergeScheduler.java:514)
[junit4:junit4]    > Caused by: java.lang.AssertionError: info.dir=BaseDirectoryWrapper(org.apache.lucene.store.RAMDirectory@755c62bc lockFactory=org.apache.lucene.store.SingleInstanceLockFactory@45660d6) vs MockDirWrapper(org.apache.lucene.store.RAMDirectory@6ab30913 lockFactory=org.apache.lucene.store.SingleInstanceLockFactory@1018f51f)
[junit4:junit4]    > 	at org.apache.lucene.index.IndexWriter$ReaderPool.get(IndexWriter.java:531)
[junit4:junit4]    > 	at org.apache.lucene.index.IndexWriter.mergeMiddle(IndexWriter.java:3626)
[junit4:junit4]    > 	at org.apache.lucene.index.IndexWriter.merge(IndexWriter.java:3296)
[junit4:junit4]    > 	at org.apache.lucene.index.ConcurrentMergeScheduler.doMerge(ConcurrentMergeScheduler.java:401)
[junit4:junit4]    > 	at org.apache.lucene.index.ConcurrentMergeScheduler$MergeThread.run(ConcurrentMergeScheduler.java:478)
[junit4:junit4]    > Throwable #6: com.carrotsearch.randomizedtesting.UncaughtExceptionError: Captured an uncaught exception in thread: Thread[id=21, name=Lucene Merge Thread #10, state=RUNNABLE, group=TGRP-TestSortingMergePolicy]
[junit4:junit4]    > Caused by: org.apache.lucene.index.MergePolicy$MergeException: java.lang.AssertionError: info.dir=BaseDirectoryWrapper(org.apache.lucene.store.RAMDirectory@755c62bc lockFactory=org.apache.lucene.store.SingleInstanceLockFactory@45660d6) vs MockDirWrapper(org.apache.lucene.store.RAMDirectory@6ab30913 lockFactory=org.apache.lucene.store.SingleInstanceLockFactory@1018f51f)
[junit4:junit4]    > 	at __randomizedtesting.SeedInfo.seed([43888FACCAEA6BE9]:0)
[junit4:junit4]    > 	at org.apache.lucene.index.ConcurrentMergeScheduler.handleMergeException(ConcurrentMergeScheduler.java:541)
[junit4:junit4]    > 	at org.apache.lucene.index.ConcurrentMergeScheduler$MergeThread.run(ConcurrentMergeScheduler.java:514)
[junit4:junit4]    > Caused by: java.lang.AssertionError: info.dir=BaseDirectoryWrapper(org.apache.lucene.store.RAMDirectory@755c62bc lockFactory=org.apache.lucene.store.SingleInstanceLockFactory@45660d6) vs MockDirWrapper(org.apache.lucene.store.RAMDirectory@6ab30913 lockFactory=org.apache.lucene.store.SingleInstanceLockFactory@1018f51f)
[junit4:junit4]    > 	at org.apache.lucene.index.IndexWriter$ReaderPool.get(IndexWriter.java:531)
[junit4:junit4]    > 	at org.apache.lucene.index.IndexWriter.mergeMiddle(IndexWriter.java:3626)
[junit4:junit4]    > 	at org.apache.lucene.index.IndexWriter.merge(IndexWriter.java:3296)
[junit4:junit4]    > 	at org.apache.lucene.index.ConcurrentMergeScheduler.doMerge(ConcurrentMergeScheduler.java:401)
[junit4:junit4]    > 	at org.apache.lucene.index.ConcurrentMergeScheduler$MergeThread.run(ConcurrentMergeScheduler.java:478)
[junit4:junit4]    > Throwable #7: com.carrotsearch.randomizedtesting.UncaughtExceptionError: Captured an uncaught exception in thread: Thread[id=27, name=Lucene Merge Thread #16, state=RUNNABLE, group=TGRP-TestSortingMergePolicy]
[junit4:junit4]    > Caused by: org.apache.lucene.index.MergePolicy$MergeException: java.lang.AssertionError: info.dir=MockDirWrapper(org.apache.lucene.store.RAMDirectory@6ab30913 lockFactory=org.apache.lucene.store.SingleInstanceLockFactory@1018f51f) vs BaseDirectoryWrapper(org.apache.lucene.store.RAMDirectory@755c62bc lockFactory=org.apache.lucene.store.SingleInstanceLockFactory@45660d6)
[junit4:junit4]    > 	at __randomizedtesting.SeedInfo.seed([43888FACCAEA6BE9]:0)
[junit4:junit4]    > 	at org.apache.lucene.index.ConcurrentMergeScheduler.handleMergeException(ConcurrentMergeScheduler.java:541)
[junit4:junit4]    > 	at org.apache.lucene.index.ConcurrentMergeScheduler$MergeThread.run(ConcurrentMergeScheduler.java:514)
[junit4:junit4]    > Caused by: java.lang.AssertionError: info.dir=MockDirWrapper(org.apache.lucene.store.RAMDirectory@6ab30913 lockFactory=org.apache.lucene.store.SingleInstanceLockFactory@1018f51f) vs BaseDirectoryWrapper(org.apache.lucene.store.RAMDirectory@755c62bc lockFactory=org.apache.lucene.store.SingleInstanceLockFactory@45660d6)
[junit4:junit4]    > 	at org.apache.lucene.index.IndexWriter$ReaderPool.get(IndexWriter.java:531)
[junit4:junit4]    > 	at org.apache.lucene.index.IndexWriter.mergeMiddle(IndexWriter.java:3626)
[junit4:junit4]    > 	at org.apache.lucene.index.IndexWriter.merge(IndexWriter.java:3296)
[junit4:junit4]    > 	at org.apache.lucene.index.ConcurrentMergeScheduler.doMerge(ConcurrentMergeScheduler.java:401)
[junit4:junit4]    > 	at org.apache.lucene.index.ConcurrentMergeScheduler$MergeThread.run(ConcurrentMergeScheduler.java:478)
[junit4:junit4] Completed on J0 in 7220.70s, 1 test, 8 errors <<< FAILURES!

[...truncated 17 lines...]
BUILD FAILED
/usr/home/hudson/hudson-slave/workspace/Lucene-Solr-NightlyTests-4.x/build.xml:388: The following error occurred while executing this line:
/usr/home/hudson/hudson-slave/workspace/Lucene-Solr-NightlyTests-4.x/build.xml:361: The following error occurred while executing this line:
/usr/home/hudson/hudson-slave/workspace/Lucene-Solr-NightlyTests-4.x/build.xml:39: The following error occurred while executing this line:
/usr/home/hudson/hudson-slave/workspace/Lucene-Solr-NightlyTests-4.x/lucene/build.xml:548: The following error occurred while executing this line:
/usr/home/hudson/hudson-slave/workspace/Lucene-Solr-NightlyTests-4.x/lucene/common-build.xml:1756: The following error occurred while executing this line:
/usr/home/hudson/hudson-slave/workspace/Lucene-Solr-NightlyTests-4.x/lucene/module-build.xml:61: The following error occurred while executing this line:
/usr/home/hudson/hudson-slave/workspace/Lucene-Solr-NightlyTests-4.x/lucene/common-build.xml:1212: The following error occurred while executing this line:
/usr/home/hudson/hudson-slave/workspace/Lucene-Solr-NightlyTests-4.x/lucene/common-build.xml:876: There were test failures: 10 suites, 39 tests, 7 suite-level errors, 1 error, 1 ignored (1 assumption)

Total time: 182 minutes 27 seconds
Build step 'Invoke Ant' marked build as failure
Archiving artifacts
Recording test results
Email was triggered for: Failure
Sending email for trigger: Failure



Mime
View raw message