lucene-dev mailing list archives

Site index · List index
Message view « Date » · « Thread »
Top « Date » · « Thread »
From Policeman Jenkins Server <jenk...@thetaphi.de>
Subject [JENKINS] Lucene-Solr-trunk-Linux (32bit/jdk1.8.0-ea-b79) - Build # 4814 - Still Failing!
Date Thu, 21 Mar 2013 22:07:27 GMT
Build: http://jenkins.thetaphi.de/job/Lucene-Solr-trunk-Linux/4814/
Java: 32bit/jdk1.8.0-ea-b79 -server -XX:+UseParallelGC

2 tests failed.
FAILED:  org.apache.solr.cloud.BasicDistributedZk2Test.testDistribSearch

Error Message:
Server at http://127.0.0.1:52889/onenodecollectioncore returned non ok status:404, message:Can not find: /onenodecollectioncore/update

Stack Trace:
org.apache.solr.common.SolrException: Server at http://127.0.0.1:52889/onenodecollectioncore returned non ok status:404, message:Can not find: /onenodecollectioncore/update
	at __randomizedtesting.SeedInfo.seed([919584EE21170C51:10730AF656486C6D]:0)
	at org.apache.solr.client.solrj.impl.HttpSolrServer.request(HttpSolrServer.java:375)
	at org.apache.solr.client.solrj.impl.HttpSolrServer.request(HttpSolrServer.java:181)
	at org.apache.solr.client.solrj.request.AbstractUpdateRequest.process(AbstractUpdateRequest.java:117)
	at org.apache.solr.client.solrj.SolrServer.add(SolrServer.java:116)
	at org.apache.solr.client.solrj.SolrServer.add(SolrServer.java:102)
	at org.apache.solr.cloud.BasicDistributedZk2Test.testNodeWithoutCollectionForwarding(BasicDistributedZk2Test.java:196)
	at org.apache.solr.cloud.BasicDistributedZk2Test.doTest(BasicDistributedZk2Test.java:89)
	at org.apache.solr.BaseDistributedSearchTestCase.testDistribSearch(BaseDistributedSearchTestCase.java:806)
	at sun.reflect.NativeMethodAccessorImpl.invoke0(Native Method)
	at sun.reflect.NativeMethodAccessorImpl.invoke(NativeMethodAccessorImpl.java:57)
	at sun.reflect.DelegatingMethodAccessorImpl.invoke(DelegatingMethodAccessorImpl.java:43)
	at java.lang.reflect.Method.invoke(Method.java:487)
	at com.carrotsearch.randomizedtesting.RandomizedRunner.invoke(RandomizedRunner.java:1559)
	at com.carrotsearch.randomizedtesting.RandomizedRunner.access$600(RandomizedRunner.java:79)
	at com.carrotsearch.randomizedtesting.RandomizedRunner$6.evaluate(RandomizedRunner.java:737)
	at com.carrotsearch.randomizedtesting.RandomizedRunner$7.evaluate(RandomizedRunner.java:773)
	at com.carrotsearch.randomizedtesting.RandomizedRunner$8.evaluate(RandomizedRunner.java:787)
	at com.carrotsearch.randomizedtesting.rules.SystemPropertiesRestoreRule$1.evaluate(SystemPropertiesRestoreRule.java:53)
	at org.apache.lucene.util.TestRuleSetupTeardownChained$1.evaluate(TestRuleSetupTeardownChained.java:50)
	at org.apache.lucene.util.TestRuleFieldCacheSanity$1.evaluate(TestRuleFieldCacheSanity.java:51)
	at org.apache.lucene.util.AbstractBeforeAfterRule$1.evaluate(AbstractBeforeAfterRule.java:46)
	at com.carrotsearch.randomizedtesting.rules.SystemPropertiesInvariantRule$1.evaluate(SystemPropertiesInvariantRule.java:55)
	at org.apache.lucene.util.TestRuleThreadAndTestName$1.evaluate(TestRuleThreadAndTestName.java:49)
	at org.apache.lucene.util.TestRuleIgnoreAfterMaxFailures$1.evaluate(TestRuleIgnoreAfterMaxFailures.java:70)
	at org.apache.lucene.util.TestRuleMarkFailure$1.evaluate(TestRuleMarkFailure.java:48)
	at com.carrotsearch.randomizedtesting.rules.StatementAdapter.evaluate(StatementAdapter.java:36)
	at com.carrotsearch.randomizedtesting.ThreadLeakControl$StatementRunner.run(ThreadLeakControl.java:358)
	at com.carrotsearch.randomizedtesting.ThreadLeakControl.forkTimeoutingTask(ThreadLeakControl.java:782)
	at com.carrotsearch.randomizedtesting.ThreadLeakControl$3.evaluate(ThreadLeakControl.java:442)
	at com.carrotsearch.randomizedtesting.RandomizedRunner.runSingleTest(RandomizedRunner.java:746)
	at com.carrotsearch.randomizedtesting.RandomizedRunner$3.evaluate(RandomizedRunner.java:648)
	at com.carrotsearch.randomizedtesting.RandomizedRunner$4.evaluate(RandomizedRunner.java:682)
	at com.carrotsearch.randomizedtesting.RandomizedRunner$5.evaluate(RandomizedRunner.java:693)
	at com.carrotsearch.randomizedtesting.rules.StatementAdapter.evaluate(StatementAdapter.java:36)
	at com.carrotsearch.randomizedtesting.rules.SystemPropertiesRestoreRule$1.evaluate(SystemPropertiesRestoreRule.java:53)
	at org.apache.lucene.util.AbstractBeforeAfterRule$1.evaluate(AbstractBeforeAfterRule.java:46)
	at org.apache.lucene.util.TestRuleStoreClassName$1.evaluate(TestRuleStoreClassName.java:42)
	at com.carrotsearch.randomizedtesting.rules.SystemPropertiesInvariantRule$1.evaluate(SystemPropertiesInvariantRule.java:55)
	at com.carrotsearch.randomizedtesting.rules.NoShadowingOrOverridesOnMethodsRule$1.evaluate(NoShadowingOrOverridesOnMethodsRule.java:39)
	at com.carrotsearch.randomizedtesting.rules.NoShadowingOrOverridesOnMethodsRule$1.evaluate(NoShadowingOrOverridesOnMethodsRule.java:39)
	at com.carrotsearch.randomizedtesting.rules.StatementAdapter.evaluate(StatementAdapter.java:36)
	at org.apache.lucene.util.TestRuleAssertionsRequired$1.evaluate(TestRuleAssertionsRequired.java:43)
	at org.apache.lucene.util.TestRuleMarkFailure$1.evaluate(TestRuleMarkFailure.java:48)
	at org.apache.lucene.util.TestRuleIgnoreAfterMaxFailures$1.evaluate(TestRuleIgnoreAfterMaxFailures.java:70)
	at org.apache.lucene.util.TestRuleIgnoreTestSuites$1.evaluate(TestRuleIgnoreTestSuites.java:55)
	at com.carrotsearch.randomizedtesting.rules.StatementAdapter.evaluate(StatementAdapter.java:36)
	at com.carrotsearch.randomizedtesting.ThreadLeakControl$StatementRunner.run(ThreadLeakControl.java:358)
	at java.lang.Thread.run(Thread.java:722)


FAILED:  org.apache.solr.cloud.UnloadDistributedZkTest.testDistribSearch

Error Message:
Still found shard2 in collection test_unload_shard_and_collection

Stack Trace:
java.lang.AssertionError: Still found shard2 in collection test_unload_shard_and_collection
	at __randomizedtesting.SeedInfo.seed([919584EE21170C51:10730AF656486C6D]:0)
	at org.junit.Assert.fail(Assert.java:93)
	at org.apache.solr.cloud.UnloadDistributedZkTest.testUnloadShardAndCollection(UnloadDistributedZkTest.java:124)
	at org.apache.solr.cloud.UnloadDistributedZkTest.doTest(UnloadDistributedZkTest.java:77)
	at org.apache.solr.BaseDistributedSearchTestCase.testDistribSearch(BaseDistributedSearchTestCase.java:806)
	at sun.reflect.NativeMethodAccessorImpl.invoke0(Native Method)
	at sun.reflect.NativeMethodAccessorImpl.invoke(NativeMethodAccessorImpl.java:57)
	at sun.reflect.DelegatingMethodAccessorImpl.invoke(DelegatingMethodAccessorImpl.java:43)
	at java.lang.reflect.Method.invoke(Method.java:487)
	at com.carrotsearch.randomizedtesting.RandomizedRunner.invoke(RandomizedRunner.java:1559)
	at com.carrotsearch.randomizedtesting.RandomizedRunner.access$600(RandomizedRunner.java:79)
	at com.carrotsearch.randomizedtesting.RandomizedRunner$6.evaluate(RandomizedRunner.java:737)
	at com.carrotsearch.randomizedtesting.RandomizedRunner$7.evaluate(RandomizedRunner.java:773)
	at com.carrotsearch.randomizedtesting.RandomizedRunner$8.evaluate(RandomizedRunner.java:787)
	at com.carrotsearch.randomizedtesting.rules.SystemPropertiesRestoreRule$1.evaluate(SystemPropertiesRestoreRule.java:53)
	at org.apache.lucene.util.TestRuleSetupTeardownChained$1.evaluate(TestRuleSetupTeardownChained.java:50)
	at org.apache.lucene.util.TestRuleFieldCacheSanity$1.evaluate(TestRuleFieldCacheSanity.java:51)
	at org.apache.lucene.util.AbstractBeforeAfterRule$1.evaluate(AbstractBeforeAfterRule.java:46)
	at com.carrotsearch.randomizedtesting.rules.SystemPropertiesInvariantRule$1.evaluate(SystemPropertiesInvariantRule.java:55)
	at org.apache.lucene.util.TestRuleThreadAndTestName$1.evaluate(TestRuleThreadAndTestName.java:49)
	at org.apache.lucene.util.TestRuleIgnoreAfterMaxFailures$1.evaluate(TestRuleIgnoreAfterMaxFailures.java:70)
	at org.apache.lucene.util.TestRuleMarkFailure$1.evaluate(TestRuleMarkFailure.java:48)
	at com.carrotsearch.randomizedtesting.rules.StatementAdapter.evaluate(StatementAdapter.java:36)
	at com.carrotsearch.randomizedtesting.ThreadLeakControl$StatementRunner.run(ThreadLeakControl.java:358)
	at com.carrotsearch.randomizedtesting.ThreadLeakControl.forkTimeoutingTask(ThreadLeakControl.java:782)
	at com.carrotsearch.randomizedtesting.ThreadLeakControl$3.evaluate(ThreadLeakControl.java:442)
	at com.carrotsearch.randomizedtesting.RandomizedRunner.runSingleTest(RandomizedRunner.java:746)
	at com.carrotsearch.randomizedtesting.RandomizedRunner$3.evaluate(RandomizedRunner.java:648)
	at com.carrotsearch.randomizedtesting.RandomizedRunner$4.evaluate(RandomizedRunner.java:682)
	at com.carrotsearch.randomizedtesting.RandomizedRunner$5.evaluate(RandomizedRunner.java:693)
	at com.carrotsearch.randomizedtesting.rules.StatementAdapter.evaluate(StatementAdapter.java:36)
	at com.carrotsearch.randomizedtesting.rules.SystemPropertiesRestoreRule$1.evaluate(SystemPropertiesRestoreRule.java:53)
	at org.apache.lucene.util.AbstractBeforeAfterRule$1.evaluate(AbstractBeforeAfterRule.java:46)
	at org.apache.lucene.util.TestRuleStoreClassName$1.evaluate(TestRuleStoreClassName.java:42)
	at com.carrotsearch.randomizedtesting.rules.SystemPropertiesInvariantRule$1.evaluate(SystemPropertiesInvariantRule.java:55)
	at com.carrotsearch.randomizedtesting.rules.NoShadowingOrOverridesOnMethodsRule$1.evaluate(NoShadowingOrOverridesOnMethodsRule.java:39)
	at com.carrotsearch.randomizedtesting.rules.NoShadowingOrOverridesOnMethodsRule$1.evaluate(NoShadowingOrOverridesOnMethodsRule.java:39)
	at com.carrotsearch.randomizedtesting.rules.StatementAdapter.evaluate(StatementAdapter.java:36)
	at org.apache.lucene.util.TestRuleAssertionsRequired$1.evaluate(TestRuleAssertionsRequired.java:43)
	at org.apache.lucene.util.TestRuleMarkFailure$1.evaluate(TestRuleMarkFailure.java:48)
	at org.apache.lucene.util.TestRuleIgnoreAfterMaxFailures$1.evaluate(TestRuleIgnoreAfterMaxFailures.java:70)
	at org.apache.lucene.util.TestRuleIgnoreTestSuites$1.evaluate(TestRuleIgnoreTestSuites.java:55)
	at com.carrotsearch.randomizedtesting.rules.StatementAdapter.evaluate(StatementAdapter.java:36)
	at com.carrotsearch.randomizedtesting.ThreadLeakControl$StatementRunner.run(ThreadLeakControl.java:358)
	at java.lang.Thread.run(Thread.java:722)




Build Log:
[...truncated 8917 lines...]
[junit4:junit4] Suite: org.apache.solr.cloud.UnloadDistributedZkTest
[junit4:junit4]   2> 12 T13 oas.BaseDistributedSearchTestCase.initHostContext Setting hostContext system property: /rll/t
[junit4:junit4]   2> 21 T13 oas.SolrTestCaseJ4.setUp ###Starting testDistribSearch
[junit4:junit4]   2> Creating dataDir: /mnt/ssd/jenkins/workspace/Lucene-Solr-trunk-Linux/solr/build/solr-core/test/J0/./solrtest-UnloadDistributedZkTest-1363902752720
[junit4:junit4]   2> 24 T13 oasc.ZkTestServer.run STARTING ZK TEST SERVER
[junit4:junit4]   2> 27 T14 oasc.ZkTestServer$ZKServerMain.runFromConfig Starting server
[junit4:junit4]   2> 53 T14 oaz.Environment.logEnv Server environment:zookeeper.version=3.4.5-1392090, built on 09/30/2012 17:52 GMT
[junit4:junit4]   2> 53 T14 oaz.Environment.logEnv Server environment:host.name=serv1
[junit4:junit4]   2> 53 T14 oaz.Environment.logEnv Server environment:java.version=1.8.0-ea
[junit4:junit4]   2> 54 T14 oaz.Environment.logEnv Server environment:java.vendor=Oracle Corporation
[junit4:junit4]   2> 54 T14 oaz.Environment.logEnv Server environment:java.home=/var/lib/jenkins/tools/java/32bit/jdk1.8.0-ea-b79/jre
[junit4:junit4]   2> 54 T14 oaz.Environment.logEnv Server environment:java.class.path=/mnt/ssd/jenkins/workspace/Lucene-Solr-trunk-Linux/solr/build/solr-core/classes/test:/mnt/ssd/jenkins/workspace/Lucene-Solr-trunk-Linux/solr/build/solr-test-framework/classes/java:/mnt/ssd/jenkins/workspace/Lucene-Solr-trunk-Linux/solr/build/solr-core/test-files:/mnt/ssd/jenkins/workspace/Lucene-Solr-trunk-Linux/lucene/build/test-framework/classes/java:/mnt/ssd/jenkins/workspace/Lucene-Solr-trunk-Linux/lucene/build/codecs/classes/java:/mnt/ssd/jenkins/workspace/Lucene-Solr-trunk-Linux/solr/build/solr-solrj/classes/java:/mnt/ssd/jenkins/workspace/Lucene-Solr-trunk-Linux/solr/build/solr-core/classes/java:/mnt/ssd/jenkins/workspace/Lucene-Solr-trunk-Linux/lucene/build/analysis/common/lucene-analyzers-common-5.0-SNAPSHOT.jar:/mnt/ssd/jenkins/workspace/Lucene-Solr-trunk-Linux/lucene/build/analysis/kuromoji/lucene-analyzers-kuromoji-5.0-SNAPSHOT.jar:/mnt/ssd/jenkins/workspace/Lucene-Solr-trunk-Linux/lucene/build/analysis/phonetic/lucene-analyzers-phonetic-5.0-SNAPSHOT.jar:/mnt/ssd/jenkins/workspace/Lucene-Solr-trunk-Linux/lucene/build/codecs/lucene-codecs-5.0-SNAPSHOT.jar:/mnt/ssd/jenkins/workspace/Lucene-Solr-trunk-Linux/lucene/build/highlighter/lucene-highlighter-5.0-SNAPSHOT.jar:/mnt/ssd/jenkins/workspace/Lucene-Solr-trunk-Linux/lucene/build/memory/lucene-memory-5.0-SNAPSHOT.jar:/mnt/ssd/jenkins/workspace/Lucene-Solr-trunk-Linux/lucene/build/misc/lucene-misc-5.0-SNAPSHOT.jar:/mnt/ssd/jenkins/workspace/Lucene-Solr-trunk-Linux/lucene/build/spatial/lucene-spatial-5.0-SNAPSHOT.jar:/mnt/ssd/jenkins/workspace/Lucene-Solr-trunk-Linux/lucene/build/suggest/lucene-suggest-5.0-SNAPSHOT.jar:/mnt/ssd/jenkins/workspace/Lucene-Solr-trunk-Linux/lucene/build/grouping/lucene-grouping-5.0-SNAPSHOT.jar:/mnt/ssd/jenkins/workspace/Lucene-Solr-trunk-Linux/lucene/build/queries/lucene-queries-5.0-SNAPSHOT.jar:/mnt/ssd/jenkins/workspace/Lucene-Solr-trunk-Linux/lucene/build/queryparser/lucene-queryparser-5.0-SNAPSHOT.jar:/mnt/ssd/jenkins/workspace/Lucene-Solr-trunk-Linux/solr/core/lib/cglib-nodep-2.2.jar:/mnt/ssd/jenkins/workspace/Lucene-Solr-trunk-Linux/solr/core/lib/commons-cli-1.2.jar:/mnt/ssd/jenkins/workspace/Lucene-Solr-trunk-Linux/solr/core/lib/commons-codec-1.7.jar:/mnt/ssd/jenkins/workspace/Lucene-Solr-trunk-Linux/solr/core/lib/commons-fileupload-1.2.1.jar:/mnt/ssd/jenkins/workspace/Lucene-Solr-trunk-Linux/solr/core/lib/commons-lang-2.6.jar:/mnt/ssd/jenkins/workspace/Lucene-Solr-trunk-Linux/solr/core/lib/easymock-3.0.jar:/mnt/ssd/jenkins/workspace/Lucene-Solr-trunk-Linux/solr/core/lib/guava-13.0.1.jar:/mnt/ssd/jenkins/workspace/Lucene-Solr-trunk-Linux/solr/core/lib/javax.servlet-api-3.0.1.jar:/mnt/ssd/jenkins/workspace/Lucene-Solr-trunk-Linux/solr/core/lib/objenesis-1.2.jar:/mnt/ssd/jenkins/workspace/Lucene-Solr-trunk-Linux/solr/core/lib/org.restlet-2.1.1.jar:/mnt/ssd/jenkins/workspace/Lucene-Solr-trunk-Linux/solr/core/lib/org.restlet.ext.servlet-2.1.1.jar:/mnt/ssd/jenkins/workspace/Lucene-Solr-trunk-Linux/solr/core/lib/spatial4j-0.3.jar:/mnt/ssd/jenkins/workspace/Lucene-Solr-trunk-Linux/solr/solrj/lib/commons-io-2.1.jar:/mnt/ssd/jenkins/workspace/Lucene-Solr-trunk-Linux/solr/solrj/lib/httpclient-4.2.3.jar:/mnt/ssd/jenkins/workspace/Lucene-Solr-trunk-Linux/solr/solrj/lib/httpcore-4.2.2.jar:/mnt/ssd/jenkins/workspace/Lucene-Solr-trunk-Linux/solr/solrj/lib/httpmime-4.2.3.jar:/mnt/ssd/jenkins/workspace/Lucene-Solr-trunk-Linux/solr/solrj/lib/jcl-over-slf4j-1.6.4.jar:/mnt/ssd/jenkins/workspace/Lucene-Solr-trunk-Linux/solr/solrj/lib/noggit-0.5.jar:/mnt/ssd/jenkins/workspace/Lucene-Solr-trunk-Linux/solr/solrj/lib/slf4j-api-1.6.4.jar:/mnt/ssd/jenkins/workspace/Lucene-Solr-trunk-Linux/solr/solrj/lib/slf4j-jdk14-1.6.4.jar:/mnt/ssd/jenkins/workspace/Lucene-Solr-trunk-Linux/solr/solrj/lib/wstx-asl-3.2.7.jar:/mnt/ssd/jenkins/workspace/Lucene-Solr-trunk-Linux/solr/solrj/lib/zookeeper-3.4.5.jar:/mnt/ssd/jenkins/workspace/Lucene-Solr-trunk-Linux/solr/example/lib/jetty-continuation-8.1.8.v20121106.jar:/mnt/ssd/jenkins/workspace/Lucene-Solr-trunk-Linux/solr/example/lib/jetty-deploy-8.1.8.v20121106.jar:/mnt/ssd/jenkins/workspace/Lucene-Solr-trunk-Linux/solr/example/lib/jetty-http-8.1.8.v20121106.jar:/mnt/ssd/jenkins/workspace/Lucene-Solr-trunk-Linux/solr/example/lib/jetty-io-8.1.8.v20121106.jar:/mnt/ssd/jenkins/workspace/Lucene-Solr-trunk-Linux/solr/example/lib/jetty-jmx-8.1.8.v20121106.jar:/mnt/ssd/jenkins/workspace/Lucene-Solr-trunk-Linux/solr/example/lib/jetty-security-8.1.8.v20121106.jar:/mnt/ssd/jenkins/workspace/Lucene-Solr-trunk-Linux/solr/example/lib/jetty-server-8.1.8.v20121106.jar:/mnt/ssd/jenkins/workspace/Lucene-Solr-trunk-Linux/solr/example/lib/jetty-servlet-8.1.8.v20121106.jar:/mnt/ssd/jenkins/workspace/Lucene-Solr-trunk-Linux/solr/example/lib/jetty-util-8.1.8.v20121106.jar:/mnt/ssd/jenkins/workspace/Lucene-Solr-trunk-Linux/solr/example/lib/jetty-webapp-8.1.8.v20121106.jar:/mnt/ssd/jenkins/workspace/Lucene-Solr-trunk-Linux/solr/example/lib/jetty-xml-8.1.8.v20121106.jar:/mnt/ssd/jenkins/workspace/Lucene-Solr-trunk-Linux/solr/example/lib/servlet-api-3.0.jar:/mnt/ssd/jenkins/workspace/Lucene-Solr-trunk-Linux/solr/example/example-DIH/solr/db/lib/derby-10.9.1.0.jar:/mnt/ssd/jenkins/workspace/Lucene-Solr-trunk-Linux/solr/example/example-DIH/solr/db/lib/hsqldb-1.8.0.10.jar:/mnt/ssd/jenkins/workspace/Lucene-Solr-trunk-Linux/lucene/build/core/classes/java:/mnt/ssd/jenkins/workspace/Lucene-Solr-trunk-Linux/lucene/test-framework/lib/junit-4.10.jar:/mnt/ssd/jenkins/workspace/Lucene-Solr-trunk-Linux/lucene/test-framework/lib/randomizedtesting-runner-2.0.8.jar:/var/lib/jenkins/tools/hudson.tasks.Ant_AntInstallation/ANT_1.8.2/lib/ant-launcher.jar:/var/lib/jenkins/.ant/lib/ivy-2.3.0.jar:/var/lib/jenkins/tools/hudson.tasks.Ant_AntInstallation/ANT_1.8.2/lib/ant-jai.jar:/var/lib/jenkins/tools/hudson.tasks.Ant_AntInstallation/ANT_1.8.2/lib/ant-swing.jar:/var/lib/jenkins/tools/hudson.tasks.Ant_AntInstallation/ANT_1.8.2/lib/ant-apache-oro.jar:/var/lib/jenkins/tools/hudson.tasks.Ant_AntInstallation/ANT_1.8.2/lib/ant-jmf.jar:/var/lib/jenkins/tools/hudson.tasks.Ant_AntInstallation/ANT_1.8.2/lib/ant-apache-xalan2.jar:/var/lib/jenkins/tools/hudson.tasks.Ant_AntInstallation/ANT_1.8.2/lib/ant-javamail.jar:/var/lib/jenkins/tools/hudson.tasks.Ant_AntInstallation/ANT_1.8.2/lib/ant-apache-resolver.jar:/var/lib/jenkins/tools/hudson.tasks.Ant_AntInstallation/ANT_1.8.2/lib/ant-testutil.jar:/var/lib/jenkins/tools/hudson.tasks.Ant_AntInstallation/ANT_1.8.2/lib/ant-commons-logging.jar:/var/lib/jenkins/tools/hudson.tasks.Ant_AntInstallation/ANT_1.8.2/lib/ant-apache-log4j.jar:/var/lib/jenkins/tools/hudson.tasks.Ant_AntInstallation/ANT_1.8.2/lib/ant-junit.jar:/var/lib/jenkins/tools/hudson.tasks.Ant_AntInstallation/ANT_1.8.2/lib/ant-jsch.jar:/var/lib/jenkins/tools/hudson.tasks.Ant_AntInstallation/ANT_1.8.2/lib/ant-commons-net.jar:/var/lib/jenkins/tools/hudson.tasks.Ant_AntInstallation/ANT_1.8.2/lib/ant-apache-bsf.jar:/var/lib/jenkins/tools/hudson.tasks.Ant_AntInstallation/ANT_1.8.2/lib/ant-jdepend.jar:/var/lib/jenkins/tools/hudson.tasks.Ant_AntInstallation/ANT_1.8.2/lib/ant-netrexx.jar:/var/lib/jenkins/tools/hudson.tasks.Ant_AntInstallation/ANT_1.8.2/lib/ant-apache-regexp.jar:/var/lib/jenkins/tools/hudson.tasks.Ant_AntInstallation/ANT_1.8.2/lib/ant-junit4.jar:/var/lib/jenkins/tools/hudson.tasks.Ant_AntInstallation/ANT_1.8.2/lib/ant.jar:/var/lib/jenkins/tools/hudson.tasks.Ant_AntInstallation/ANT_1.8.2/lib/ant-apache-bcel.jar:/var/lib/jenkins/tools/hudson.tasks.Ant_AntInstallation/ANT_1.8.2/lib/ant-antlr.jar:/var/lib/jenkins/tools/java/32bit/jdk1.8.0-ea-b79/lib/tools.jar:/var/lib/jenkins/.ivy2/cache/com.carrotsearch.randomizedtesting/junit4-ant/jars/junit4-ant-2.0.8.jar
[junit4:junit4]   2> 55 T14 oaz.Environment.logEnv Server environment:java.library.path=/usr/java/packages/lib/i386:/lib:/usr/lib
[junit4:junit4]   2> 56 T14 oaz.Environment.logEnv Server environment:java.io.tmpdir=.
[junit4:junit4]   2> 56 T14 oaz.Environment.logEnv Server environment:java.compiler=<NA>
[junit4:junit4]   2> 56 T14 oaz.Environment.logEnv Server environment:os.name=Linux
[junit4:junit4]   2> 56 T14 oaz.Environment.logEnv Server environment:os.arch=i386
[junit4:junit4]   2> 57 T14 oaz.Environment.logEnv Server environment:os.version=3.2.0-39-generic
[junit4:junit4]   2> 57 T14 oaz.Environment.logEnv Server environment:user.name=jenkins
[junit4:junit4]   2> 57 T14 oaz.Environment.logEnv Server environment:user.home=/var/lib/jenkins
[junit4:junit4]   2> 57 T14 oaz.Environment.logEnv Server environment:user.dir=/mnt/ssd/jenkins/workspace/Lucene-Solr-trunk-Linux/solr/build/solr-core/test/J0
[junit4:junit4]   2> 70 T14 oazs.ZooKeeperServer.setTickTime tickTime set to 1000
[junit4:junit4]   2> 70 T14 oazs.ZooKeeperServer.setMinSessionTimeout minSessionTimeout set to -1
[junit4:junit4]   2> 71 T14 oazs.ZooKeeperServer.setMaxSessionTimeout maxSessionTimeout set to -1
[junit4:junit4]   2> 191 T14 oazs.NIOServerCnxnFactory.configure binding to port 0.0.0.0/0.0.0.0:0
[junit4:junit4]   2> 214 T14 oazsp.FileTxnSnapLog.save Snapshotting: 0x0 to /mnt/ssd/jenkins/workspace/Lucene-Solr-trunk-Linux/solr/build/solr-core/test/J0/./org.apache.solr.cloud.UnloadDistributedZkTest-1363902752719/zookeeper/server1/data/version-2/snapshot.0
[junit4:junit4]   2> 287 T13 oasc.ZkTestServer.run start zk server on port:49982
[junit4:junit4]   2> 308 T13 oaz.Environment.logEnv Client environment:zookeeper.version=3.4.5-1392090, built on 09/30/2012 17:52 GMT
[junit4:junit4]   2> 308 T13 oaz.Environment.logEnv Client environment:host.name=serv1
[junit4:junit4]   2> 309 T13 oaz.Environment.logEnv Client environment:java.version=1.8.0-ea
[junit4:junit4]   2> 309 T13 oaz.Environment.logEnv Client environment:java.vendor=Oracle Corporation
[junit4:junit4]   2> 310 T13 oaz.Environment.logEnv Client environment:java.home=/var/lib/jenkins/tools/java/32bit/jdk1.8.0-ea-b79/jre
[junit4:junit4]   2> 311 T13 oaz.Environment.logEnv Client environment:java.class.path=/mnt/ssd/jenkins/workspace/Lucene-Solr-trunk-Linux/solr/build/solr-core/classes/test:/mnt/ssd/jenkins/workspace/Lucene-Solr-trunk-Linux/solr/build/solr-test-framework/classes/java:/mnt/ssd/jenkins/workspace/Lucene-Solr-trunk-Linux/solr/build/solr-core/test-files:/mnt/ssd/jenkins/workspace/Lucene-Solr-trunk-Linux/lucene/build/test-framework/classes/java:/mnt/ssd/jenkins/workspace/Lucene-Solr-trunk-Linux/lucene/build/codecs/classes/java:/mnt/ssd/jenkins/workspace/Lucene-Solr-trunk-Linux/solr/build/solr-solrj/classes/java:/mnt/ssd/jenkins/workspace/Lucene-Solr-trunk-Linux/solr/build/solr-core/classes/java:/mnt/ssd/jenkins/workspace/Lucene-Solr-trunk-Linux/lucene/build/analysis/common/lucene-analyzers-common-5.0-SNAPSHOT.jar:/mnt/ssd/jenkins/workspace/Lucene-Solr-trunk-Linux/lucene/build/analysis/kuromoji/lucene-analyzers-kuromoji-5.0-SNAPSHOT.jar:/mnt/ssd/jenkins/workspace/Lucene-Solr-trunk-Linux/lucene/build/analysis/phonetic/lucene-analyzers-phonetic-5.0-SNAPSHOT.jar:/mnt/ssd/jenkins/workspace/Lucene-Solr-trunk-Linux/lucene/build/codecs/lucene-codecs-5.0-SNAPSHOT.jar:/mnt/ssd/jenkins/workspace/Lucene-Solr-trunk-Linux/lucene/build/highlighter/lucene-highlighter-5.0-SNAPSHOT.jar:/mnt/ssd/jenkins/workspace/Lucene-Solr-trunk-Linux/lucene/build/memory/lucene-memory-5.0-SNAPSHOT.jar:/mnt/ssd/jenkins/workspace/Lucene-Solr-trunk-Linux/lucene/build/misc/lucene-misc-5.0-SNAPSHOT.jar:/mnt/ssd/jenkins/workspace/Lucene-Solr-trunk-Linux/lucene/build/spatial/lucene-spatial-5.0-SNAPSHOT.jar:/mnt/ssd/jenkins/workspace/Lucene-Solr-trunk-Linux/lucene/build/suggest/lucene-suggest-5.0-SNAPSHOT.jar:/mnt/ssd/jenkins/workspace/Lucene-Solr-trunk-Linux/lucene/build/grouping/lucene-grouping-5.0-SNAPSHOT.jar:/mnt/ssd/jenkins/workspace/Lucene-Solr-trunk-Linux/lucene/build/queries/lucene-queries-5.0-SNAPSHOT.jar:/mnt/ssd/jenkins/workspace/Lucene-Solr-trunk-Linux/lucene/build/queryparser/lucene-queryparser-5.0-SNAPSHOT.jar:/mnt/ssd/jenkins/workspace/Lucene-Solr-trunk-Linux/solr/core/lib/cglib-nodep-2.2.jar:/mnt/ssd/jenkins/workspace/Lucene-Solr-trunk-Linux/solr/core/lib/commons-cli-1.2.jar:/mnt/ssd/jenkins/workspace/Lucene-Solr-trunk-Linux/solr/core/lib/commons-codec-1.7.jar:/mnt/ssd/jenkins/workspace/Lucene-Solr-trunk-Linux/solr/core/lib/commons-fileupload-1.2.1.jar:/mnt/ssd/jenkins/workspace/Lucene-Solr-trunk-Linux/solr/core/lib/commons-lang-2.6.jar:/mnt/ssd/jenkins/workspace/Lucene-Solr-trunk-Linux/solr/core/lib/easymock-3.0.jar:/mnt/ssd/jenkins/workspace/Lucene-Solr-trunk-Linux/solr/core/lib/guava-13.0.1.jar:/mnt/ssd/jenkins/workspace/Lucene-Solr-trunk-Linux/solr/core/lib/javax.servlet-api-3.0.1.jar:/mnt/ssd/jenkins/workspace/Lucene-Solr-trunk-Linux/solr/core/lib/objenesis-1.2.jar:/mnt/ssd/jenkins/workspace/Lucene-Solr-trunk-Linux/solr/core/lib/org.restlet-2.1.1.jar:/mnt/ssd/jenkins/workspace/Lucene-Solr-trunk-Linux/solr/core/lib/org.restlet.ext.servlet-2.1.1.jar:/mnt/ssd/jenkins/workspace/Lucene-Solr-trunk-Linux/solr/core/lib/spatial4j-0.3.jar:/mnt/ssd/jenkins/workspace/Lucene-Solr-trunk-Linux/solr/solrj/lib/commons-io-2.1.jar:/mnt/ssd/jenkins/workspace/Lucene-Solr-trunk-Linux/solr/solrj/lib/httpclient-4.2.3.jar:/mnt/ssd/jenkins/workspace/Lucene-Solr-trunk-Linux/solr/solrj/lib/httpcore-4.2.2.jar:/mnt/ssd/jenkins/workspace/Lucene-Solr-trunk-Linux/solr/solrj/lib/httpmime-4.2.3.jar:/mnt/ssd/jenkins/workspace/Lucene-Solr-trunk-Linux/solr/solrj/lib/jcl-over-slf4j-1.6.4.jar:/mnt/ssd/jenkins/workspace/Lucene-Solr-trunk-Linux/solr/solrj/lib/noggit-0.5.jar:/mnt/ssd/jenkins/workspace/Lucene-Solr-trunk-Linux/solr/solrj/lib/slf4j-api-1.6.4.jar:/mnt/ssd/jenkins/workspace/Lucene-Solr-trunk-Linux/solr/solrj/lib/slf4j-jdk14-1.6.4.jar:/mnt/ssd/jenkins/workspace/Lucene-Solr-trunk-Linux/solr/solrj/lib/wstx-asl-3.2.7.jar:/mnt/ssd/jenkins/workspace/Lucene-Solr-trunk-Linux/solr/solrj/lib/zookeeper-3.4.5.jar:/mnt/ssd/jenkins/workspace/Lucene-Solr-trunk-Linux/solr/example/lib/jetty-continuation-8.1.8.v20121106.jar:/mnt/ssd/jenkins/workspace/Lucene-Solr-trunk-Linux/solr/example/lib/jetty-deploy-8.1.8.v20121106.jar:/mnt/ssd/jenkins/workspace/Lucene-Solr-trunk-Linux/solr/example/lib/jetty-http-8.1.8.v20121106.jar:/mnt/ssd/jenkins/workspace/Lucene-Solr-trunk-Linux/solr/example/lib/jetty-io-8.1.8.v20121106.jar:/mnt/ssd/jenkins/workspace/Lucene-Solr-trunk-Linux/solr/example/lib/jetty-jmx-8.1.8.v20121106.jar:/mnt/ssd/jenkins/workspace/Lucene-Solr-trunk-Linux/solr/example/lib/jetty-security-8.1.8.v20121106.jar:/mnt/ssd/jenkins/workspace/Lucene-Solr-trunk-Linux/solr/example/lib/jetty-server-8.1.8.v20121106.jar:/mnt/ssd/jenkins/workspace/Lucene-Solr-trunk-Linux/solr/example/lib/jetty-servlet-8.1.8.v20121106.jar:/mnt/ssd/jenkins/workspace/Lucene-Solr-trunk-Linux/solr/example/lib/jetty-util-8.1.8.v20121106.jar:/mnt/ssd/jenkins/workspace/Lucene-Solr-trunk-Linux/solr/example/lib/jetty-webapp-8.1.8.v20121106.jar:/mnt/ssd/jenkins/workspace/Lucene-Solr-trunk-Linux/solr/example/lib/jetty-xml-8.1.8.v20121106.jar:/mnt/ssd/jenkins/workspace/Lucene-Solr-trunk-Linux/solr/example/lib/servlet-api-3.0.jar:/mnt/ssd/jenkins/workspace/Lucene-Solr-trunk-Linux/solr/example/example-DIH/solr/db/lib/derby-10.9.1.0.jar:/mnt/ssd/jenkins/workspace/Lucene-Solr-trunk-Linux/solr/example/example-DIH/solr/db/lib/hsqldb-1.8.0.10.jar:/mnt/ssd/jenkins/workspace/Lucene-Solr-trunk-Linux/lucene/build/core/classes/java:/mnt/ssd/jenkins/workspace/Lucene-Solr-trunk-Linux/lucene/test-framework/lib/junit-4.10.jar:/mnt/ssd/jenkins/workspace/Lucene-Solr-trunk-Linux/lucene/test-framework/lib/randomizedtesting-runner-2.0.8.jar:/var/lib/jenkins/tools/hudson.tasks.Ant_AntInstallation/ANT_1.8.2/lib/ant-launcher.jar:/var/lib/jenkins/.ant/lib/ivy-2.3.0.jar:/var/lib/jenkins/tools/hudson.tasks.Ant_AntInstallation/ANT_1.8.2/lib/ant-jai.jar:/var/lib/jenkins/tools/hudson.tasks.Ant_AntInstallation/ANT_1.8.2/lib/ant-swing.jar:/var/lib/jenkins/tools/hudson.tasks.Ant_AntInstallation/ANT_1.8.2/lib/ant-apache-oro.jar:/var/lib/jenkins/tools/hudson.tasks.Ant_AntInstallation/ANT_1.8.2/lib/ant-jmf.jar:/var/lib/jenkins/tools/hudson.tasks.Ant_AntInstallation/ANT_1.8.2/lib/ant-apache-xalan2.jar:/var/lib/jenkins/tools/hudson.tasks.Ant_AntInstallation/ANT_1.8.2/lib/ant-javamail.jar:/var/lib/jenkins/tools/hudson.tasks.Ant_AntInstallation/ANT_1.8.2/lib/ant-apache-resolver.jar:/var/lib/jenkins/tools/hudson.tasks.Ant_AntInstallation/ANT_1.8.2/lib/ant-testutil.jar:/var/lib/jenkins/tools/hudson.tasks.Ant_AntInstallation/ANT_1.8.2/lib/ant-commons-logging.jar:/var/lib/jenkins/tools/hudson.tasks.Ant_AntInstallation/ANT_1.8.2/lib/ant-apache-log4j.jar:/var/lib/jenkins/tools/hudson.tasks.Ant_AntInstallation/ANT_1.8.2/lib/ant-junit.jar:/var/lib/jenkins/tools/hudson.tasks.Ant_AntInstallation/ANT_1.8.2/lib/ant-jsch.jar:/var/lib/jenkins/tools/hudson.tasks.Ant_AntInstallation/ANT_1.8.2/lib/ant-commons-net.jar:/var/lib/jenkins/tools/hudson.tasks.Ant_AntInstallation/ANT_1.8.2/lib/ant-apache-bsf.jar:/var/lib/jenkins/tools/hudson.tasks.Ant_AntInstallation/ANT_1.8.2/lib/ant-jdepend.jar:/var/lib/jenkins/tools/hudson.tasks.Ant_AntInstallation/ANT_1.8.2/lib/ant-netrexx.jar:/var/lib/jenkins/tools/hudson.tasks.Ant_AntInstallation/ANT_1.8.2/lib/ant-apache-regexp.jar:/var/lib/jenkins/tools/hudson.tasks.Ant_AntInstallation/ANT_1.8.2/lib/ant-junit4.jar:/var/lib/jenkins/tools/hudson.tasks.Ant_AntInstallation/ANT_1.8.2/lib/ant.jar:/var/lib/jenkins/tools/hudson.tasks.Ant_AntInstallation/ANT_1.8.2/lib/ant-apache-bcel.jar:/var/lib/jenkins/tools/hudson.tasks.Ant_AntInstallation/ANT_1.8.2/lib/ant-antlr.jar:/var/lib/jenkins/tools/java/32bit/jdk1.8.0-ea-b79/lib/tools.jar:/var/lib/jenkins/.ivy2/cache/com.carrotsearch.randomizedtesting/junit4-ant/jars/junit4-ant-2.0.8.jar
[junit4:junit4]   2> 312 T13 oaz.Environment.logEnv Client environment:java.library.path=/usr/java/packages/lib/i386:/lib:/usr/lib
[junit4:junit4]   2> 313 T13 oaz.Environment.logEnv Client environment:java.io.tmpdir=.
[junit4:junit4]   2> 314 T13 oaz.Environment.logEnv Client environment:java.compiler=<NA>
[junit4:junit4]   2> 314 T13 oaz.Environment.logEnv Client environment:os.name=Linux
[junit4:junit4]   2> 315 T13 oaz.Environment.logEnv Client environment:os.arch=i386
[junit4:junit4]   2> 316 T13 oaz.Environment.logEnv Client environment:os.version=3.2.0-39-generic
[junit4:junit4]   2> 316 T13 oaz.Environment.logEnv Client environment:user.name=jenkins
[junit4:junit4]   2> 317 T13 oaz.Environment.logEnv Client environment:user.home=/var/lib/jenkins
[junit4:junit4]   2> 317 T13 oaz.Environment.logEnv Client environment:user.dir=/mnt/ssd/jenkins/workspace/Lucene-Solr-trunk-Linux/solr/build/solr-core/test/J0
[junit4:junit4]   2> 320 T13 oaz.ZooKeeper.<init> Initiating client connection, connectString=127.0.0.1:49982 sessionTimeout=10000 watcher=org.apache.solr.common.cloud.ConnectionManager@18fedab
[junit4:junit4]   2> 344 T13 oascc.ConnectionManager.waitForConnected Waiting for client to connect to ZooKeeper
[junit4:junit4]   2> 348 T19 oaz.ClientCnxn$SendThread.logStartConnect Opening socket connection to server localhost.localdomain/127.0.0.1:49982. Will not attempt to authenticate using SASL (access denied ("javax.security.auth.AuthPermission" "getLoginConfiguration"))
[junit4:junit4]   2> 350 T19 oaz.ClientCnxn$SendThread.primeConnection Socket connection established to localhost.localdomain/127.0.0.1:49982, initiating session
[junit4:junit4]   2> 972 T15 oazs.NIOServerCnxnFactory.run Accepted socket connection from /127.0.0.1:50263
[junit4:junit4]   2> 987 T15 oazs.ZooKeeperServer.processConnectRequest Client attempting to establish new session at /127.0.0.1:50263
[junit4:junit4]   2> 991 T17 oazsp.FileTxnLog.append Creating new log file: log.1
[junit4:junit4]   2> 1028 T17 oazs.ZooKeeperServer.finishSessionInit Established session 0x13d8ef0689b0000 with negotiated timeout 10000 for client /127.0.0.1:50263
[junit4:junit4]   2> 1029 T19 oaz.ClientCnxn$SendThread.onConnected Session establishment complete on server localhost.localdomain/127.0.0.1:49982, sessionid = 0x13d8ef0689b0000, negotiated timeout = 10000
[junit4:junit4]   2> 1031 T20 oascc.ConnectionManager.process Watcher org.apache.solr.common.cloud.ConnectionManager@18fedab name:ZooKeeperConnection Watcher:127.0.0.1:49982 got event WatchedEvent state:SyncConnected type:None path:null path:null type:None
[junit4:junit4]   2> 1032 T13 oascc.ConnectionManager.waitForConnected Client is connected to ZooKeeper
[junit4:junit4]   2> 1033 T13 oascc.SolrZkClient.makePath makePath: /solr
[junit4:junit4]   2> 1056 T18 oazs.PrepRequestProcessor.pRequest2Txn Processed session termination for sessionid: 0x13d8ef0689b0000
[junit4:junit4]   2> 1057 T20 oaz.ClientCnxn$EventThread.run EventThread shut down
[junit4:junit4]   2> 1057 T13 oaz.ZooKeeper.close Session: 0x13d8ef0689b0000 closed
[junit4:junit4]   2> 1059 T15 oazs.NIOServerCnxn.closeSock Closed socket connection for client /127.0.0.1:50263 which had sessionid 0x13d8ef0689b0000
[junit4:junit4]   2> 1059 T13 oaz.ZooKeeper.<init> Initiating client connection, connectString=127.0.0.1:49982/solr sessionTimeout=10000 watcher=org.apache.solr.common.cloud.ConnectionManager@1b9a5d5
[junit4:junit4]   2> 1060 T13 oascc.ConnectionManager.waitForConnected Waiting for client to connect to ZooKeeper
[junit4:junit4]   2> 1060 T21 oaz.ClientCnxn$SendThread.logStartConnect Opening socket connection to server localhost.localdomain/127.0.0.1:49982. Will not attempt to authenticate using SASL (access denied ("javax.security.auth.AuthPermission" "getLoginConfiguration"))
[junit4:junit4]   2> 1061 T21 oaz.ClientCnxn$SendThread.primeConnection Socket connection established to localhost.localdomain/127.0.0.1:49982, initiating session
[junit4:junit4]   2> 1061 T15 oazs.NIOServerCnxnFactory.run Accepted socket connection from /127.0.0.1:50264
[junit4:junit4]   2> 1062 T15 oazs.ZooKeeperServer.processConnectRequest Client attempting to establish new session at /127.0.0.1:50264
[junit4:junit4]   2> 1063 T17 oazs.ZooKeeperServer.finishSessionInit Established session 0x13d8ef0689b0001 with negotiated timeout 10000 for client /127.0.0.1:50264
[junit4:junit4]   2> 1063 T21 oaz.ClientCnxn$SendThread.onConnected Session establishment complete on server localhost.localdomain/127.0.0.1:49982, sessionid = 0x13d8ef0689b0001, negotiated timeout = 10000
[junit4:junit4]   2> 1063 T22 oascc.ConnectionManager.process Watcher org.apache.solr.common.cloud.ConnectionManager@1b9a5d5 name:ZooKeeperConnection Watcher:127.0.0.1:49982/solr got event WatchedEvent state:SyncConnected type:None path:null path:null type:None
[junit4:junit4]   2> 1064 T13 oascc.ConnectionManager.waitForConnected Client is connected to ZooKeeper
[junit4:junit4]   2> 1071 T13 oascc.SolrZkClient.makePath makePath: /collections/collection1
[junit4:junit4]   2> 1076 T13 oascc.SolrZkClient.makePath makePath: /collections/collection1/shards
[junit4:junit4]   2> 1079 T13 oascc.SolrZkClient.makePath makePath: /collections/control_collection
[junit4:junit4]   2> 1084 T13 oascc.SolrZkClient.makePath makePath: /collections/control_collection/shards
[junit4:junit4]   2> 1088 T13 oasc.AbstractZkTestCase.putConfig put /mnt/ssd/jenkins/workspace/Lucene-Solr-trunk-Linux/solr/build/solr-core/test-files/solr/collection1/conf/solrconfig-tlog.xml to /configs/conf1/solrconfig.xml
[junit4:junit4]   2> 1096 T13 oascc.SolrZkClient.makePath makePath: /configs/conf1/solrconfig.xml
[junit4:junit4]   2> 1103 T13 oasc.AbstractZkTestCase.putConfig put /mnt/ssd/jenkins/workspace/Lucene-Solr-trunk-Linux/solr/build/solr-core/test-files/solr/collection1/conf/schema.xml to /configs/conf1/schema.xml
[junit4:junit4]   2> 1106 T13 oascc.SolrZkClient.makePath makePath: /configs/conf1/schema.xml
[junit4:junit4]   2> 1112 T13 oasc.AbstractZkTestCase.putConfig put /mnt/ssd/jenkins/workspace/Lucene-Solr-trunk-Linux/solr/build/solr-core/test-files/solr/collection1/conf/stopwords.txt to /configs/conf1/stopwords.txt
[junit4:junit4]   2> 1113 T13 oascc.SolrZkClient.makePath makePath: /configs/conf1/stopwords.txt
[junit4:junit4]   2> 1118 T13 oasc.AbstractZkTestCase.putConfig put /mnt/ssd/jenkins/workspace/Lucene-Solr-trunk-Linux/solr/build/solr-core/test-files/solr/collection1/conf/protwords.txt to /configs/conf1/protwords.txt
[junit4:junit4]   2> 1118 T13 oascc.SolrZkClient.makePath makePath: /configs/conf1/protwords.txt
[junit4:junit4]   2> 1122 T13 oasc.AbstractZkTestCase.putConfig put /mnt/ssd/jenkins/workspace/Lucene-Solr-trunk-Linux/solr/build/solr-core/test-files/solr/collection1/conf/currency.xml to /configs/conf1/currency.xml
[junit4:junit4]   2> 1123 T13 oascc.SolrZkClient.makePath makePath: /configs/conf1/currency.xml
[junit4:junit4]   2> 1128 T13 oasc.AbstractZkTestCase.putConfig put /mnt/ssd/jenkins/workspace/Lucene-Solr-trunk-Linux/solr/build/solr-core/test-files/solr/collection1/conf/open-exchange-rates.json to /configs/conf1/open-exchange-rates.json
[junit4:junit4]   2> 1128 T13 oascc.SolrZkClient.makePath makePath: /configs/conf1/open-exchange-rates.json
[junit4:junit4]   2> 1133 T13 oasc.AbstractZkTestCase.putConfig put /mnt/ssd/jenkins/workspace/Lucene-Solr-trunk-Linux/solr/build/solr-core/test-files/solr/collection1/conf/mapping-ISOLatin1Accent.txt to /configs/conf1/mapping-ISOLatin1Accent.txt
[junit4:junit4]   2> 1135 T13 oascc.SolrZkClient.makePath makePath: /configs/conf1/mapping-ISOLatin1Accent.txt
[junit4:junit4]   2> 1140 T13 oasc.AbstractZkTestCase.putConfig put /mnt/ssd/jenkins/workspace/Lucene-Solr-trunk-Linux/solr/build/solr-core/test-files/solr/collection1/conf/old_synonyms.txt to /configs/conf1/old_synonyms.txt
[junit4:junit4]   2> 1141 T13 oascc.SolrZkClient.makePath makePath: /configs/conf1/old_synonyms.txt
[junit4:junit4]   2> 1145 T13 oasc.AbstractZkTestCase.putConfig put /mnt/ssd/jenkins/workspace/Lucene-Solr-trunk-Linux/solr/build/solr-core/test-files/solr/collection1/conf/synonyms.txt to /configs/conf1/synonyms.txt
[junit4:junit4]   2> 1146 T13 oascc.SolrZkClient.makePath makePath: /configs/conf1/synonyms.txt
[junit4:junit4]   2> 1150 T18 oazs.PrepRequestProcessor.pRequest2Txn Processed session termination for sessionid: 0x13d8ef0689b0001
[junit4:junit4]   2> 1150 T22 oaz.ClientCnxn$EventThread.run EventThread shut down
[junit4:junit4]   2> 1150 T13 oaz.ZooKeeper.close Session: 0x13d8ef0689b0001 closed
[junit4:junit4]   2> 1150 T15 oazs.NIOServerCnxn.closeSock Closed socket connection for client /127.0.0.1:50264 which had sessionid 0x13d8ef0689b0001
[junit4:junit4]   2> 1353 T13 oejs.Server.doStart jetty-8.1.8.v20121106
[junit4:junit4]   2> 1445 T13 oejs.AbstractConnector.doStart Started SelectChannelConnector@127.0.0.1:37854
[junit4:junit4]   2> 1459 T13 oass.SolrDispatchFilter.init SolrDispatchFilter.init()
[junit4:junit4]   2> 1460 T13 oasc.SolrResourceLoader.locateSolrHome JNDI not configured for solr (NoInitialContextEx)
[junit4:junit4]   2> 1460 T13 oasc.SolrResourceLoader.locateSolrHome using system property solr.solr.home: /mnt/ssd/jenkins/workspace/Lucene-Solr-trunk-Linux/solr/build/solr-core/test/J0/./org.apache.solr.cloud.UnloadDistributedZkTest-controljetty-1363902753849
[junit4:junit4]   2> 1461 T13 oasc.CoreContainer$Initializer.initialize looking for solr config file: /mnt/ssd/jenkins/workspace/Lucene-Solr-trunk-Linux/solr/build/solr-core/test/J0/./org.apache.solr.cloud.UnloadDistributedZkTest-controljetty-1363902753849/solr.xml
[junit4:junit4]   2> 1461 T13 oasc.CoreContainer.<init> New CoreContainer 13152660
[junit4:junit4]   2> 1462 T13 oasc.CoreContainer.load Loading CoreContainer using Solr Home: '/mnt/ssd/jenkins/workspace/Lucene-Solr-trunk-Linux/solr/build/solr-core/test/J0/./org.apache.solr.cloud.UnloadDistributedZkTest-controljetty-1363902753849/'
[junit4:junit4]   2> 1462 T13 oasc.SolrResourceLoader.<init> new SolrResourceLoader for directory: '/mnt/ssd/jenkins/workspace/Lucene-Solr-trunk-Linux/solr/build/solr-core/test/J0/./org.apache.solr.cloud.UnloadDistributedZkTest-controljetty-1363902753849/'
[junit4:junit4]   2> 1508 T13 oashc.HttpShardHandlerFactory.getParameter Setting socketTimeout to: 120000
[junit4:junit4]   2> 1509 T13 oashc.HttpShardHandlerFactory.getParameter Setting urlScheme to: http://
[junit4:junit4]   2> 1510 T13 oashc.HttpShardHandlerFactory.getParameter Setting connTimeout to: 15000
[junit4:junit4]   2> 1510 T13 oashc.HttpShardHandlerFactory.getParameter Setting maxConnectionsPerHost to: 20
[junit4:junit4]   2> 1511 T13 oashc.HttpShardHandlerFactory.getParameter Setting corePoolSize to: 0
[junit4:junit4]   2> 1511 T13 oashc.HttpShardHandlerFactory.getParameter Setting maximumPoolSize to: 2147483647
[junit4:junit4]   2> 1512 T13 oashc.HttpShardHandlerFactory.getParameter Setting maxThreadIdleTime to: 5
[junit4:junit4]   2> 1512 T13 oashc.HttpShardHandlerFactory.getParameter Setting sizeOfQueue to: -1
[junit4:junit4]   2> 1513 T13 oashc.HttpShardHandlerFactory.getParameter Setting fairnessPolicy to: false
[junit4:junit4]   2> 1527 T13 oascsi.HttpClientUtil.createClient Creating new http client, config:maxConnectionsPerHost=20&maxConnections=10000&socketTimeout=120000&connTimeout=15000&retry=false
[junit4:junit4]   2> 1765 T13 oasc.CoreContainer.load Registering Log Listener
[junit4:junit4]   2> 1780 T13 oasc.CoreContainer.initZooKeeper Zookeeper client=127.0.0.1:49982/solr
[junit4:junit4]   2> 1788 T13 oasc.ZkController.checkChrootPath zkHost includes chroot
[junit4:junit4]   2> 1789 T13 oaz.ZooKeeper.<init> Initiating client connection, connectString=127.0.0.1:49982 sessionTimeout=60000 watcher=org.apache.solr.common.cloud.ConnectionManager@13650e4
[junit4:junit4]   2> 1790 T13 oascc.ConnectionManager.waitForConnected Waiting for client to connect to ZooKeeper
[junit4:junit4]   2> 1791 T33 oaz.ClientCnxn$SendThread.logStartConnect Opening socket connection to server localhost.localdomain/127.0.0.1:49982. Will not attempt to authenticate using SASL (access denied ("javax.security.auth.AuthPermission" "getLoginConfiguration"))
[junit4:junit4]   2> 1792 T33 oaz.ClientCnxn$SendThread.primeConnection Socket connection established to localhost.localdomain/127.0.0.1:49982, initiating session
[junit4:junit4]   2> 1792 T15 oazs.NIOServerCnxnFactory.run Accepted socket connection from /127.0.0.1:50265
[junit4:junit4]   2> 1793 T15 oazs.ZooKeeperServer.processConnectRequest Client attempting to establish new session at /127.0.0.1:50265
[junit4:junit4]   2> 1794 T17 oazs.ZooKeeperServer.finishSessionInit Established session 0x13d8ef0689b0002 with negotiated timeout 20000 for client /127.0.0.1:50265
[junit4:junit4]   2> 1794 T33 oaz.ClientCnxn$SendThread.onConnected Session establishment complete on server localhost.localdomain/127.0.0.1:49982, sessionid = 0x13d8ef0689b0002, negotiated timeout = 20000
[junit4:junit4]   2> 1795 T34 oascc.ConnectionManager.process Watcher org.apache.solr.common.cloud.ConnectionManager@13650e4 name:ZooKeeperConnection Watcher:127.0.0.1:49982 got event WatchedEvent state:SyncConnected type:None path:null path:null type:None
[junit4:junit4]   2> 1795 T13 oascc.ConnectionManager.waitForConnected Client is connected to ZooKeeper
[junit4:junit4]   2> 1797 T18 oazs.PrepRequestProcessor.pRequest2Txn Processed session termination for sessionid: 0x13d8ef0689b0002
[junit4:junit4]   2> 1798 T34 oaz.ClientCnxn$EventThread.run EventThread shut down
[junit4:junit4]   2> 1798 T13 oaz.ZooKeeper.close Session: 0x13d8ef0689b0002 closed
[junit4:junit4]   2> 1798 T15 oazs.NIOServerCnxn.closeSock Closed socket connection for client /127.0.0.1:50265 which had sessionid 0x13d8ef0689b0002
[junit4:junit4]   2> 1800 T13 oascsi.HttpClientUtil.createClient Creating new http client, config:maxConnections=500&maxConnectionsPerHost=16&socketTimeout=120000&connTimeout=15000
[junit4:junit4]   2> 1810 T13 oaz.ZooKeeper.<init> Initiating client connection, connectString=127.0.0.1:49982/solr sessionTimeout=30000 watcher=org.apache.solr.common.cloud.ConnectionManager@151dcad
[junit4:junit4]   2> 1812 T13 oascc.ConnectionManager.waitForConnected Waiting for client to connect to ZooKeeper
[junit4:junit4]   2> 1812 T35 oaz.ClientCnxn$SendThread.logStartConnect Opening socket connection to server localhost.localdomain/127.0.0.1:49982. Will not attempt to authenticate using SASL (access denied ("javax.security.auth.AuthPermission" "getLoginConfiguration"))
[junit4:junit4]   2> 1813 T35 oaz.ClientCnxn$SendThread.primeConnection Socket connection established to localhost.localdomain/127.0.0.1:49982, initiating session
[junit4:junit4]   2> 1813 T15 oazs.NIOServerCnxnFactory.run Accepted socket connection from /127.0.0.1:50266
[junit4:junit4]   2> 1814 T15 oazs.ZooKeeperServer.processConnectRequest Client attempting to establish new session at /127.0.0.1:50266
[junit4:junit4]   2> 1815 T17 oazs.ZooKeeperServer.finishSessionInit Established session 0x13d8ef0689b0003 with negotiated timeout 20000 for client /127.0.0.1:50266
[junit4:junit4]   2> 1815 T35 oaz.ClientCnxn$SendThread.onConnected Session establishment complete on server localhost.localdomain/127.0.0.1:49982, sessionid = 0x13d8ef0689b0003, negotiated timeout = 20000
[junit4:junit4]   2> 1816 T36 oascc.ConnectionManager.process Watcher org.apache.solr.common.cloud.ConnectionManager@151dcad name:ZooKeeperConnection Watcher:127.0.0.1:49982/solr got event WatchedEvent state:SyncConnected type:None path:null path:null type:None
[junit4:junit4]   2> 1816 T13 oascc.ConnectionManager.waitForConnected Client is connected to ZooKeeper
[junit4:junit4]   2> 1822 T13 oascc.SolrZkClient.makePath makePath: /overseer/queue
[junit4:junit4]   2> 1830 T18 oazs.PrepRequestProcessor.pRequest Got user-level KeeperException when processing sessionid:0x13d8ef0689b0003 type:create cxid:0x7 zxid:0x1b txntype:-1 reqpath:n/a Error Path:/solr/overseer Error:KeeperErrorCode = NodeExists for /solr/overseer
[junit4:junit4]   2> 1832 T13 oascc.SolrZkClient.makePath makePath: /overseer/collection-queue-work
[junit4:junit4]   2> 1840 T13 oascc.SolrZkClient.makePath makePath: /live_nodes
[junit4:junit4]   2> 1843 T13 oasc.ZkController.createEphemeralLiveNode Register node as live in ZooKeeper:/live_nodes/127.0.0.1:37854_rll%2Ft
[junit4:junit4]   2> 1847 T18 oazs.PrepRequestProcessor.pRequest Got user-level KeeperException when processing sessionid:0x13d8ef0689b0003 type:delete cxid:0x12 zxid:0x1e txntype:-1 reqpath:n/a Error Path:/solr/live_nodes/127.0.0.1:37854_rll%2Ft Error:KeeperErrorCode = NoNode for /solr/live_nodes/127.0.0.1:37854_rll%2Ft
[junit4:junit4]   2> 1848 T13 oascc.SolrZkClient.makePath makePath: /live_nodes/127.0.0.1:37854_rll%2Ft
[junit4:junit4]   2> 1857 T13 oascc.SolrZkClient.makePath makePath: /overseer_elect/election
[junit4:junit4]   2> 1873 T18 oazs.PrepRequestProcessor.pRequest Got user-level KeeperException when processing sessionid:0x13d8ef0689b0003 type:delete cxid:0x20 zxid:0x23 txntype:-1 reqpath:n/a Error Path:/solr/overseer_elect/leader Error:KeeperErrorCode = NoNode for /solr/overseer_elect/leader
[junit4:junit4]   2> 1874 T13 oascc.SolrZkClient.makePath makePath: /overseer_elect/leader
[junit4:junit4]   2> 1879 T13 oasc.Overseer.start Overseer (id=89384730815561731-127.0.0.1:37854_rll%2Ft-n_0000000000) starting
[junit4:junit4]   2> 1880 T18 oazs.PrepRequestProcessor.pRequest Got user-level KeeperException when processing sessionid:0x13d8ef0689b0003 type:create cxid:0x25 zxid:0x25 txntype:-1 reqpath:n/a Error Path:/solr/overseer Error:KeeperErrorCode = NodeExists for /solr/overseer
[junit4:junit4]   2> 1890 T18 oazs.PrepRequestProcessor.pRequest Got user-level KeeperException when processing sessionid:0x13d8ef0689b0003 type:create cxid:0x26 zxid:0x26 txntype:-1 reqpath:n/a Error Path:/solr/overseer Error:KeeperErrorCode = NodeExists for /solr/overseer
[junit4:junit4]   2> 1893 T18 oazs.PrepRequestProcessor.pRequest Got user-level KeeperException when processing sessionid:0x13d8ef0689b0003 type:create cxid:0x28 zxid:0x27 txntype:-1 reqpath:n/a Error Path:/solr/overseer Error:KeeperErrorCode = NodeExists for /solr/overseer
[junit4:junit4]   2> 1894 T13 oascc.SolrZkClient.makePath makePath: /overseer/queue-work
[junit4:junit4]   2> 1905 T18 oazs.PrepRequestProcessor.pRequest Got user-level KeeperException when processing sessionid:0x13d8ef0689b0003 type:create cxid:0x2e zxid:0x29 txntype:-1 reqpath:n/a Error Path:/solr/overseer Error:KeeperErrorCode = NodeExists for /solr/overseer
[junit4:junit4]   2> 1907 T38 oasc.OverseerCollectionProcessor.run Process current queue of collection creations
[junit4:junit4]   2> 1908 T13 oascc.SolrZkClient.makePath makePath: /clusterstate.json
[junit4:junit4]   2> 1915 T13 oascc.SolrZkClient.makePath makePath: /aliases.json
[junit4:junit4]   2> 1919 T13 oascc.ZkStateReader.createClusterStateWatchersAndUpdate Updating cluster state from ZooKeeper... 
[junit4:junit4]   2> 1934 T37 oasc.Overseer$ClusterStateUpdater.run Starting to work on the main queue
[junit4:junit4]   2> 1952 T13 oass.SolrDispatchFilter.init user.dir=/mnt/ssd/jenkins/workspace/Lucene-Solr-trunk-Linux/solr/build/solr-core/test/J0
[junit4:junit4]   2> 1953 T13 oass.SolrDispatchFilter.init SolrDispatchFilter.init() done
[junit4:junit4]   2> 1979 T13 oascsi.HttpClientUtil.createClient Creating new http client, config:maxConnections=128&maxConnectionsPerHost=32&followRedirects=false
[junit4:junit4]   2> 1991 T13 oascsi.HttpClientUtil.createClient Creating new http client, config:
[junit4:junit4]   2> 1994 T13 oaz.ZooKeeper.<init> Initiating client connection, connectString=127.0.0.1:49982/solr sessionTimeout=10000 watcher=org.apache.solr.common.cloud.ConnectionManager@105638a
[junit4:junit4]   2> 1995 T13 oascc.ConnectionManager.waitForConnected Waiting for client to connect to ZooKeeper
[junit4:junit4]   2> 1995 T40 oaz.ClientCnxn$SendThread.logStartConnect Opening socket connection to server localhost.localdomain/127.0.0.1:49982. Will not attempt to authenticate using SASL (access denied ("javax.security.auth.AuthPermission" "getLoginConfiguration"))
[junit4:junit4]   2> 1996 T40 oaz.ClientCnxn$SendThread.primeConnection Socket connection established to localhost.localdomain/127.0.0.1:49982, initiating session
[junit4:junit4]   2> 1996 T15 oazs.NIOServerCnxnFactory.run Accepted socket connection from /127.0.0.1:50267
[junit4:junit4]   2> 1997 T15 oazs.ZooKeeperServer.processConnectRequest Client attempting to establish new session at /127.0.0.1:50267
[junit4:junit4]   2> 1998 T17 oazs.ZooKeeperServer.finishSessionInit Established session 0x13d8ef0689b0004 with negotiated timeout 10000 for client /127.0.0.1:50267
[junit4:junit4]   2> 1998 T40 oaz.ClientCnxn$SendThread.onConnected Session establishment complete on server localhost.localdomain/127.0.0.1:49982, sessionid = 0x13d8ef0689b0004, negotiated timeout = 10000
[junit4:junit4]   2> 1999 T41 oascc.ConnectionManager.process Watcher org.apache.solr.common.cloud.ConnectionManager@105638a name:ZooKeeperConnection Watcher:127.0.0.1:49982/solr got event WatchedEvent state:SyncConnected type:None path:null path:null type:None
[junit4:junit4]   2> 1999 T13 oascc.ConnectionManager.waitForConnected Client is connected to ZooKeeper
[junit4:junit4]   2> 2001 T13 oascc.ZkStateReader.createClusterStateWatchersAndUpdate Updating cluster state from ZooKeeper... 
[junit4:junit4]   2> 2006 T13 oasc.ChaosMonkey.monkeyLog monkey: init - expire sessions:true cause connection loss:true
[junit4:junit4]   2> 2088 T13 oejs.Server.doStart jetty-8.1.8.v20121106
[junit4:junit4]   2> 2090 T13 oejs.AbstractConnector.doStart Started SelectChannelConnector@127.0.0.1:44577
[junit4:junit4]   2> 2091 T13 oass.SolrDispatchFilter.init SolrDispatchFilter.init()
[junit4:junit4]   2> 2092 T13 oasc.SolrResourceLoader.locateSolrHome JNDI not configured for solr (NoInitialContextEx)
[junit4:junit4]   2> 2092 T13 oasc.SolrResourceLoader.locateSolrHome using system property solr.solr.home: /mnt/ssd/jenkins/workspace/Lucene-Solr-trunk-Linux/solr/build/solr-core/test/J0/./org.apache.solr.cloud.UnloadDistributedZkTest-jetty1-1363902754704
[junit4:junit4]   2> 2092 T13 oasc.CoreContainer$Initializer.initialize looking for solr config file: /mnt/ssd/jenkins/workspace/Lucene-Solr-trunk-Linux/solr/build/solr-core/test/J0/./org.apache.solr.cloud.UnloadDistributedZkTest-jetty1-1363902754704/solr.xml
[junit4:junit4]   2> 2093 T13 oasc.CoreContainer.<init> New CoreContainer 10066568
[junit4:junit4]   2> 2094 T13 oasc.CoreContainer.load Loading CoreContainer using Solr Home: '/mnt/ssd/jenkins/workspace/Lucene-Solr-trunk-Linux/solr/build/solr-core/test/J0/./org.apache.solr.cloud.UnloadDistributedZkTest-jetty1-1363902754704/'
[junit4:junit4]   2> 2094 T13 oasc.SolrResourceLoader.<init> new SolrResourceLoader for directory: '/mnt/ssd/jenkins/workspace/Lucene-Solr-trunk-Linux/solr/build/solr-core/test/J0/./org.apache.solr.cloud.UnloadDistributedZkTest-jetty1-1363902754704/'
[junit4:junit4]   2> 2118 T13 oashc.HttpShardHandlerFactory.getParameter Setting socketTimeout to: 120000
[junit4:junit4]   2> 2119 T13 oashc.HttpShardHandlerFactory.getParameter Setting urlScheme to: http://
[junit4:junit4]   2> 2119 T13 oashc.HttpShardHandlerFactory.getParameter Setting connTimeout to: 15000
[junit4:junit4]   2> 2119 T13 oashc.HttpShardHandlerFactory.getParameter Setting maxConnectionsPerHost to: 20
[junit4:junit4]   2> 2120 T13 oashc.HttpShardHandlerFactory.getParameter Setting corePoolSize to: 0
[junit4:junit4]   2> 2120 T13 oashc.HttpShardHandlerFactory.getParameter Setting maximumPoolSize to: 2147483647
[junit4:junit4]   2> 2121 T13 oashc.HttpShardHandlerFactory.getParameter Setting maxThreadIdleTime to: 5
[junit4:junit4]   2> 2121 T13 oashc.HttpShardHandlerFactory.getParameter Setting sizeOfQueue to: -1
[junit4:junit4]   2> 2122 T13 oashc.HttpShardHandlerFactory.getParameter Setting fairnessPolicy to: false
[junit4:junit4]   2> 2122 T13 oascsi.HttpClientUtil.createClient Creating new http client, config:maxConnectionsPerHost=20&maxConnections=10000&socketTimeout=120000&connTimeout=15000&retry=false
[junit4:junit4]   2> 2131 T13 oasc.CoreContainer.load Registering Log Listener
[junit4:junit4]   2> 2150 T13 oasc.CoreContainer.initZooKeeper Zookeeper client=127.0.0.1:49982/solr
[junit4:junit4]   2> 2150 T13 oasc.ZkController.checkChrootPath zkHost includes chroot
[junit4:junit4]   2> 2151 T13 oaz.ZooKeeper.<init> Initiating client connection, connectString=127.0.0.1:49982 sessionTimeout=60000 watcher=org.apache.solr.common.cloud.ConnectionManager@919888
[junit4:junit4]   2> 2152 T13 oascc.ConnectionManager.waitForConnected Waiting for client to connect to ZooKeeper
[junit4:junit4]   2> 2153 T51 oaz.ClientCnxn$SendThread.logStartConnect Opening socket connection to server localhost.localdomain/127.0.0.1:49982. Will not attempt to authenticate using SASL (access denied ("javax.security.auth.AuthPermission" "getLoginConfiguration"))
[junit4:junit4]   2> 2154 T51 oaz.ClientCnxn$SendThread.primeConnection Socket connection established to localhost.localdomain/127.0.0.1:49982, initiating session
[junit4:junit4]   2> 2154 T15 oazs.NIOServerCnxnFactory.run Accepted socket connection from /127.0.0.1:50268
[junit4:junit4]   2> 2155 T15 oazs.ZooKeeperServer.processConnectRequest Client attempting to establish new session at /127.0.0.1:50268
[junit4:junit4]   2> 2156 T17 oazs.ZooKeeperServer.finishSessionInit Established session 0x13d8ef0689b0005 with negotiated timeout 20000 for client /127.0.0.1:50268
[junit4:junit4]   2> 2156 T51 oaz.ClientCnxn$SendThread.onConnected Session establishment complete on server localhost.localdomain/127.0.0.1:49982, sessionid = 0x13d8ef0689b0005, negotiated timeout = 20000
[junit4:junit4]   2> 2157 T52 oascc.ConnectionManager.process Watcher org.apache.solr.common.cloud.ConnectionManager@919888 name:ZooKeeperConnection Watcher:127.0.0.1:49982 got event WatchedEvent state:SyncConnected type:None path:null path:null type:None
[junit4:junit4]   2> 2157 T13 oascc.ConnectionManager.waitForConnected Client is connected to ZooKeeper
[junit4:junit4]   2> 2159 T18 oazs.PrepRequestProcessor.pRequest2Txn Processed session termination for sessionid: 0x13d8ef0689b0005
[junit4:junit4]   2> 2160 T52 oaz.ClientCnxn$EventThread.run EventThread shut down
[junit4:junit4]   2> 2160 T15 oazs.NIOServerCnxn.closeSock Closed socket connection for client /127.0.0.1:50268 which had sessionid 0x13d8ef0689b0005
[junit4:junit4]   2> 2160 T13 oaz.ZooKeeper.close Session: 0x13d8ef0689b0005 closed
[junit4:junit4]   2> 2161 T13 oascsi.HttpClientUtil.createClient Creating new http client, config:maxConnections=500&maxConnectionsPerHost=16&socketTimeout=120000&connTimeout=15000
[junit4:junit4]   2> 2165 T13 oaz.ZooKeeper.<init> Initiating client connection, connectString=127.0.0.1:49982/solr sessionTimeout=30000 watcher=org.apache.solr.common.cloud.ConnectionManager@1dfd2c1
[junit4:junit4]   2> 2166 T13 oascc.ConnectionManager.waitForConnected Waiting for client to connect to ZooKeeper
[junit4:junit4]   2> 2166 T53 oaz.ClientCnxn$SendThread.logStartConnect Opening socket connection to server localhost.localdomain/127.0.0.1:49982. Will not attempt to authenticate using SASL (access denied ("javax.security.auth.AuthPermission" "getLoginConfiguration"))
[junit4:junit4]   2> 2167 T53 oaz.ClientCnxn$SendThread.primeConnection Socket connection established to localhost.localdomain/127.0.0.1:49982, initiating session
[junit4:junit4]   2> 2167 T15 oazs.NIOServerCnxnFactory.run Accepted socket connection from /127.0.0.1:50269
[junit4:junit4]   2> 2168 T15 oazs.ZooKeeperServer.processConnectRequest Client attempting to establish new session at /127.0.0.1:50269
[junit4:junit4]   2> 2170 T17 oazs.ZooKeeperServer.finishSessionInit Established session 0x13d8ef0689b0006 with negotiated timeout 20000 for client /127.0.0.1:50269
[junit4:junit4]   2> 2170 T53 oaz.ClientCnxn$SendThread.onConnected Session establishment complete on server localhost.localdomain/127.0.0.1:49982, sessionid = 0x13d8ef0689b0006, negotiated timeout = 20000
[junit4:junit4]   2> 2171 T54 oascc.ConnectionManager.process Watcher org.apache.solr.common.cloud.ConnectionManager@1dfd2c1 name:ZooKeeperConnection Watcher:127.0.0.1:49982/solr got event WatchedEvent state:SyncConnected type:None path:null path:null type:None
[junit4:junit4]   2> 2171 T13 oascc.ConnectionManager.waitForConnected Client is connected to ZooKeeper
[junit4:junit4]   2> 2172 T18 oazs.PrepRequestProcessor.pRequest Got user-level KeeperException when processing sessionid:0x13d8ef0689b0006 type:create cxid:0x1 zxid:0x30 txntype:-1 reqpath:n/a Error Path:/solr/overseer Error:KeeperErrorCode = NodeExists for /solr/overseer
[junit4:junit4]   2> 2174 T18 oazs.PrepRequestProcessor.pRequest Got user-level KeeperException when processing sessionid:0x13d8ef0689b0006 type:create cxid:0x3 zxid:0x31 txntype:-1 reqpath:n/a Error Path:/solr/overseer Error:KeeperErrorCode = NodeExists for /solr/overseer
[junit4:junit4]   2> 2177 T13 oascc.ZkStateReader.createClusterStateWatchersAndUpdate Updating cluster state from ZooKeeper... 
[junit4:junit4]   2> 3181 T13 oasc.ZkController.createEphemeralLiveNode Register node as live in ZooKeeper:/live_nodes/127.0.0.1:44577_rll%2Ft
[junit4:junit4]   2> 3182 T18 oazs.PrepRequestProcessor.pRequest Got user-level KeeperException when processing sessionid:0x13d8ef0689b0006 type:delete cxid:0xd zxid:0x32 txntype:-1 reqpath:n/a Error Path:/solr/live_nodes/127.0.0.1:44577_rll%2Ft Error:KeeperErrorCode = NoNode for /solr/live_nodes/127.0.0.1:44577_rll%2Ft
[junit4:junit4]   2> 3183 T13 oascc.SolrZkClient.makePath makePath: /live_nodes/127.0.0.1:44577_rll%2Ft
[junit4:junit4]   2> 3189 T54 oascc.ZkStateReader$3.process Updating live nodes... (2)
[junit4:junit4]   2> 3189 T41 oascc.ZkStateReader$3.process Updating live nodes... (2)
[junit4:junit4]   2> 3189 T36 oascc.ZkStateReader$3.process Updating live nodes... (2)
[junit4:junit4]   2> 3199 T13 oass.SolrDispatchFilter.init user.dir=/mnt/ssd/jenkins/workspace/Lucene-Solr-trunk-Linux/solr/build/solr-core/test/J0
[junit4:junit4]   2> 3199 T13 oass.SolrDispatchFilter.init SolrDispatchFilter.init() done
[junit4:junit4]   2> 3200 T13 oascsi.HttpClientUtil.createClient Creating new http client, config:maxConnections=128&maxConnectionsPerHost=32&followRedirects=false
[junit4:junit4]   2> 3272 T13 oejs.Server.doStart jetty-8.1.8.v20121106
[junit4:junit4]   2> 3274 T13 oejs.AbstractConnector.doStart Started SelectChannelConnector@127.0.0.1:43071
[junit4:junit4]   2> 3275 T13 oass.SolrDispatchFilter.init SolrDispatchFilter.init()
[junit4:junit4]   2> 3275 T13 oasc.SolrResourceLoader.locateSolrHome JNDI not configured for solr (NoInitialContextEx)
[junit4:junit4]   2> 3276 T13 oasc.SolrResourceLoader.locateSolrHome using system property solr.solr.home: /mnt/ssd/jenkins/workspace/Lucene-Solr-trunk-Linux/solr/build/solr-core/test/J0/./org.apache.solr.cloud.UnloadDistributedZkTest-jetty2-1363902755904
[junit4:junit4]   2> 3276 T13 oasc.CoreContainer$Initializer.initialize looking for solr config file: /mnt/ssd/jenkins/workspace/Lucene-Solr-trunk-Linux/solr/build/solr-core/test/J0/./org.apache.solr.cloud.UnloadDistributedZkTest-jetty2-1363902755904/solr.xml
[junit4:junit4]   2> 3277 T13 oasc.CoreContainer.<init> New CoreContainer 29436849
[junit4:junit4]   2> 3277 T13 oasc.CoreContainer.load Loading CoreContainer using Solr Home: '/mnt/ssd/jenkins/workspace/Lucene-Solr-trunk-Linux/solr/build/solr-core/test/J0/./org.apache.solr.cloud.UnloadDistributedZkTest-jetty2-1363902755904/'
[junit4:junit4]   2> 3278 T13 oasc.SolrResourceLoader.<init> new SolrResourceLoader for directory: '/mnt/ssd/jenkins/workspace/Lucene-Solr-trunk-Linux/solr/build/solr-core/test/J0/./org.apache.solr.cloud.UnloadDistributedZkTest-jetty2-1363902755904/'
[junit4:junit4]   2> 3300 T13 oashc.HttpShardHandlerFactory.getParameter Setting socketTimeout to: 120000
[junit4:junit4]   2> 3300 T13 oashc.HttpShardHandlerFactory.getParameter Setting urlScheme to: http://
[junit4:junit4]   2> 3301 T13 oashc.HttpShardHandlerFactory.getParameter Setting connTimeout to: 15000
[junit4:junit4]   2> 3301 T13 oashc.HttpShardHandlerFactory.getParameter Setting maxConnectionsPerHost to: 20
[junit4:junit4]   2> 3302 T13 oashc.HttpShardHandlerFactory.getParameter Setting corePoolSize to: 0
[junit4:junit4]   2> 3302 T13 oashc.HttpShardHandlerFactory.getParameter Setting maximumPoolSize to: 2147483647
[junit4:junit4]   2> 3302 T13 oashc.HttpShardHandlerFactory.getParameter Setting maxThreadIdleTime to: 5
[junit4:junit4]   2> 3303 T13 oashc.HttpShardHandlerFactory.getParameter Setting sizeOfQueue to: -1
[junit4:junit4]   2> 3303 T13 oashc.HttpShardHandlerFactory.getParameter Setting fairnessPolicy to: false
[junit4:junit4]   2> 3304 T13 oascsi.HttpClientUtil.createClient Creating new http client, config:maxConnectionsPerHost=20&maxConnections=10000&socketTimeout=120000&connTimeout=15000&retry=false
[junit4:junit4]   2> 3312 T13 oasc.CoreContainer.load Registering Log Listener
[junit4:junit4]   2> 3326 T13 oasc.CoreContainer.initZooKeeper Zookeeper client=127.0.0.1:49982/solr
[junit4:junit4]   2> 3326 T13 oasc.ZkController.checkChrootPath zkHost includes chroot
[junit4:junit4]   2> 3327 T13 oaz.ZooKeeper.<init> Initiating client connection, connectString=127.0.0.1:49982 sessionTimeout=60000 watcher=org.apache.solr.common.cloud.ConnectionManager@1a8305f
[junit4:junit4]   2> 3328 T13 oascc.ConnectionManager.waitForConnected Waiting for client to connect to ZooKeeper
[junit4:junit4]   2> 3328 T65 oaz.ClientCnxn$SendThread.logStartConnect Opening socket connection to server localhost.localdomain/127.0.0.1:49982. Will not attempt to authenticate using SASL (access denied ("javax.security.auth.AuthPermission" "getLoginConfiguration"))
[junit4:junit4]   2> 3329 T65 oaz.ClientCnxn$SendThread.primeConnection Socket connection established to localhost.localdomain/127.0.0.1:49982, initiating session
[junit4:junit4]   2> 3329 T15 oazs.NIOServerCnxnFactory.run Accepted socket connection from /127.0.0.1:50271
[junit4:junit4]   2> 3329 T15 oazs.ZooKeeperServer.processConnectRequest Client attempting to establish new session at /127.0.0.1:50271
[junit4:junit4]   2> 3330 T17 oazs.ZooKeeperServer.finishSessionInit Established session 0x13d8ef0689b0007 with negotiated timeout 20000 for client /127.0.0.1:50271
[junit4:junit4]   2> 3330 T65 oaz.ClientCnxn$SendThread.onConnected Session establishment complete on server localhost.localdomain/127.0.0.1:49982, sessionid = 0x13d8ef0689b0007, negotiated timeout = 20000
[junit4:junit4]   2> 3331 T66 oascc.ConnectionManager.process Watcher org.apache.solr.common.cloud.ConnectionManager@1a8305f name:ZooKeeperConnection Watcher:127.0.0.1:49982 got event WatchedEvent state:SyncConnected type:None path:null path:null type:None
[junit4:junit4]   2> 3331 T13 oascc.ConnectionManager.waitForConnected Client is connected to ZooKeeper
[junit4:junit4]   2> 3333 T18 oazs.PrepRequestProcessor.pRequest2Txn Processed session termination for sessionid: 0x13d8ef0689b0007
[junit4:junit4]   2> 3333 T66 oaz.ClientCnxn$EventThread.run EventThread shut down
[junit4:junit4]   2> 3333 T13 oaz.ZooKeeper.close Session: 0x13d8ef0689b0007 closed
[junit4:junit4]   2> 3334 T15 oazs.NIOServerCnxn.closeSock Closed socket connection for client /127.0.0.1:50271 which had sessionid 0x13d8ef0689b0007
[junit4:junit4]   2> 3334 T13 oascsi.HttpClientUtil.createClient Creating new http client, config:maxConnections=500&maxConnectionsPerHost=16&socketTimeout=120000&connTimeout=15000
[junit4:junit4]   2> 3338 T13 oaz.ZooKeeper.<init> Initiating client connection, connectString=127.0.0.1:49982/solr sessionTimeout=30000 watcher=org.apache.solr.common.cloud.ConnectionManager@c59915
[junit4:junit4]   2> 3339 T67 oaz.ClientCnxn$SendThread.logStartConnect Opening socket connection to server localhost.localdomain/127.0.0.1:49982. Will not attempt to authenticate using SASL (access denied ("javax.security.auth.AuthPermission" "getLoginConfiguration"))
[junit4:junit4]   2> 3339 T13 oascc.ConnectionManager.waitForConnected Waiting for client to connect to ZooKeeper
[junit4:junit4]   2> 3339 T67 oaz.ClientCnxn$SendThread.primeConnection Socket connection established to localhost.localdomain/127.0.0.1:49982, initiating session
[junit4:junit4]   2> 3340 T15 oazs.NIOServerCnxnFactory.run Accepted socket connection from /127.0.0.1:50272
[junit4:junit4]   2> 3340 T15 oazs.ZooKeeperServer.processConnectRequest Client attempting to establish new session at /127.0.0.1:50272
[junit4:junit4]   2> 3341 T17 oazs.ZooKeeperServer.finishSessionInit Established session 0x13d8ef0689b0008 with negotiated timeout 20000 for client /127.0.0.1:50272
[junit4:junit4]   2> 3341 T67 oaz.ClientCnxn$SendThread.onConnected Session establishment complete on server localhost.localdomain/127.0.0.1:49982, sessionid = 0x13d8ef0689b0008, negotiated timeout = 20000
[junit4:junit4]   2> 3342 T68 oascc.ConnectionManager.process Watcher org.apache.solr.common.cloud.ConnectionManager@c59915 name:ZooKeeperConnection Watcher:127.0.0.1:49982/solr got event WatchedEvent state:SyncConnected type:None path:null path:null type:None
[junit4:junit4]   2> 3342 T13 oascc.ConnectionManager.waitForConnected Client is connected to ZooKeeper
[junit4:junit4]   2> 3343 T18 oazs.PrepRequestProcessor.pRequest Got user-level KeeperException when processing sessionid:0x13d8ef0689b0008 type:create cxid:0x1 zxid:0x38 txntype:-1 reqpath:n/a Error Path:/solr/overseer Error:KeeperErrorCode = NodeExists for /solr/overseer
[junit4:junit4]   2> 3345 T18 oazs.PrepRequestProcessor.pRequest Got user-level KeeperException when processing sessionid:0x13d8ef0689b0008 type:create cxid:0x3 zxid:0x39 txntype:-1 reqpath:n/a Error Path:/solr/overseer Error:KeeperErrorCode = NodeExists for /solr/overseer
[junit4:junit4]   2> 3347 T13 oascc.ZkStateReader.createClusterStateWatchersAndUpdate Updating cluster state from ZooKeeper... 
[junit4:junit4]   2> 4351 T13 oasc.ZkController.createEphemeralLiveNode Register node as live in ZooKeeper:/live_nodes/127.0.0.1:43071_rll%2Ft
[junit4:junit4]   2> 4352 T18 oazs.PrepRequestProcessor.pRequest Got user-level KeeperException when processing sessionid:0x13d8ef0689b0008 type:delete cxid:0xd zxid:0x3a txntype:-1 reqpath:n/a Error Path:/solr/live_nodes/127.0.0.1:43071_rll%2Ft Error:KeeperErrorCode = NoNode for /solr/live_nodes/127.0.0.1:43071_rll%2Ft
[junit4:junit4]   2> 4352 T13 oascc.SolrZkClient.makePath makePath: /live_nodes/127.0.0.1:43071_rll%2Ft
[junit4:junit4]   2> 4356 T41 oascc.ZkStateReader$3.process Updating live nodes... (3)
[junit4:junit4]   2> 4356 T36 oascc.ZkStateReader$3.process Updating live nodes... (3)
[junit4:junit4]   2> 4356 T54 oascc.ZkStateReader$3.process Updating live nodes... (3)
[junit4:junit4]   2> 4358 T68 oascc.ZkStateReader$3.process Updating live nodes... (3)
[junit4:junit4]   2> 4368 T13 oass.SolrDispatchFilter.init user.dir=/mnt/ssd/jenkins/workspace/Lucene-Solr-trunk-Linux/solr/build/solr-core/test/J0
[junit4:junit4]   2> 4368 T13 oass.SolrDispatchFilter.init SolrDispatchFilter.init() done
[junit4:junit4]   2> 4369 T13 oascsi.HttpClientUtil.createClient Creating new http client, config:maxConnections=128&maxConnectionsPerHost=32&followRedirects=false
[junit4:junit4]   2> 4443 T13 oejs.Server.doStart jetty-8.1.8.v20121106
[junit4:junit4]   2> 4445 T13 oejs.AbstractConnector.doStart Started SelectChannelConnector@127.0.0.1:45600
[junit4:junit4]   2> 4446 T13 oass.SolrDispatchFilter.init SolrDispatchFilter.init()
[junit4:junit4]   2> 4447 T13 oasc.SolrResourceLoader.locateSolrHome JNDI not configured for solr (NoInitialContextEx)
[junit4:junit4]   2> 4447 T13 oasc.SolrResourceLoader.locateSolrHome using system property solr.solr.home: /mnt/ssd/jenkins/workspace/Lucene-Solr-trunk-Linux/solr/build/solr-core/test/J0/./org.apache.solr.cloud.UnloadDistributedZkTest-jetty3-1363902757070
[junit4:junit4]   2> 4448 T13 oasc.CoreContainer$Initializer.initialize looking for solr config file: /mnt/ssd/jenkins/workspace/Lucene-Solr-trunk-Linux/solr/build/solr-core/test/J0/./org.apache.solr.cloud.UnloadDistributedZkTest-jetty3-1363902757070/solr.xml
[junit4:junit4]   2> 4448 T13 oasc.CoreContainer.<init> New CoreContainer 11061845
[junit4:junit4]   2> 4449 T13 oasc.CoreContainer.load Loading CoreContainer using Solr Home: '/mnt/ssd/jenkins/workspace/Lucene-Solr-trunk-Linux/solr/build/solr-core/test/J0/./org.apache.solr.cloud.UnloadDistributedZkTest-jetty3-1363902757070/'
[junit4:junit4]   2> 4449 T13 oasc.SolrResourceLoader.<init> new SolrResourceLoader for directory: '/mnt/ssd/jenkins/workspace/Lucene-Solr-trunk-Linux/solr/build/solr-core/test/J0/./org.apache.solr.cloud.UnloadDistributedZkTest-jetty3-1363902757070/'
[junit4:junit4]   2> 4472 T13 oashc.HttpShardHandlerFactory.getParameter Setting socketTimeout to: 120000
[junit4:junit4]   2> 4472 T13 oashc.HttpShardHandlerFactory.getParameter Setting urlScheme to: http://
[junit4:junit4]   2> 4473 T13 oashc.HttpShardHandlerFactory.getParameter Setting connTimeout to: 15000
[junit4:junit4]   2> 4473 T13 oashc.HttpShardHandlerFactory.getParameter Setting maxConnectionsPerHost to: 20
[junit4:junit4]   2> 4473 T13 oashc.HttpShardHandlerFactory.getParameter Setting corePoolSize to: 0
[junit4:junit4]   2> 4474 T13 oashc.HttpShardHandlerFactory.getParameter Setting maximumPoolSize to: 2147483647
[junit4:junit4]   2> 4474 T13 oashc.HttpShardHandlerFactory.getParameter Setting maxThreadIdleTime to: 5
[junit4:junit4]   2> 4475 T13 oashc.HttpShardHandlerFactory.getParameter Setting sizeOfQueue to: -1
[junit4:junit4]   2> 4475 T13 oashc.HttpShardHandlerFactory.getParameter Setting fairnessPolicy to: false
[junit4:junit4]   2> 4476 T13 oascsi.HttpClientUtil.createClient Creating new http client, config:maxConnectionsPerHost=20&maxConnections=10000&socketTimeout=120000&connTimeout=15000&retry=false
[junit4:junit4]   2> 4487 T13 oasc.CoreContainer.load Registering Log Listener
[junit4:junit4]   2> 4501 T13 oasc.CoreContainer.initZooKeeper Zookeeper client=127.0.0.1:49982/solr
[junit4:junit4]   2> 4501 T13 oasc.ZkController.checkChrootPath zkHost includes chroot
[junit4:junit4]   2> 4502 T13 oaz.ZooKeeper.<init> Initiating client connection, connectString=127.0.0.1:49982 sessionTimeout=60000 watcher=org.apache.solr.common.cloud.ConnectionManager@13cca0c
[junit4:junit4]   2> 4503 T13 oascc.ConnectionManager.waitForConnected Waiting for client to connect to ZooKeeper
[junit4:junit4]   2> 4503 T79 oaz.ClientCnxn$SendThread.logStartConnect Opening socket connection to server localhost.localdomain/127.0.0.1:49982. Will not attempt to authenticate using SASL (access denied ("javax.security.auth.AuthPermission" "getLoginConfiguration"))
[junit4:junit4]   2> 4504 T79 oaz.ClientCnxn$SendThread.primeConnection Socket connection established to localhost.localdomain/127.0.0.1:49982, initiating session
[junit4:junit4]   2> 4504 T15 oazs.NIOServerCnxnFactory.run Accepted socket connection from /127.0.0.1:50273
[junit4:junit4]   2> 4505 T15 oazs.ZooKeeperServer.processConnectRequest Client attempting to establish new session at /127.0.0.1:50273
[junit4:junit4]   2> 4506 T17 oazs.ZooKeeperServer.finishSessionInit Established session 0x13d8ef0689b0009 with negotiated timeout 20000 for client /127.0.0.1:50273
[junit4:junit4]   2> 4506 T79 oaz.ClientCnxn$SendThread.onConnected Session establishment complete on server localhost.localdomain/127.0.0.1:49982, sessionid = 0x13d8ef0689b0009, negotiated timeout = 20000
[junit4:junit4]   2> 4506 T80 oascc.ConnectionManager.process Watcher org.apache.solr.common.cloud.ConnectionManager@13cca0c name:ZooKeeperConnection Watcher:127.0.0.1:49982 got event WatchedEvent state:SyncConnected type:None path:null path:null type:None
[junit4:junit4]   2> 4507 T13 oascc.ConnectionManager.waitForConnected Client is connected to ZooKeeper
[junit4:junit4]   2> 4508 T18 oazs.PrepRequestProcessor.pRequest2Txn Processed session termination for sessionid: 0x13d8ef0689b0009
[junit4:junit4]   2> 4509 T80 oaz.ClientCnxn$EventThread.run EventThread shut down
[junit4:junit4]   2> 4509 T15 oazs.NIOServerCnxn.closeSock Closed socket connection for client /127.0.0.1:50273 which had sessionid 0x13d8ef0689b0009
[junit4:junit4]   2> 4509 T13 oaz.ZooKeeper.close Session: 0x13d8ef0689b0009 closed
[junit4:junit4]   2> 4510 T13 oascsi.HttpClientUtil.createClient Creating new http client, config:maxConnections=500&maxConnectionsPerHost=16&socketTimeout=120000&connTimeout=15000
[junit4:junit4]   2> 4514 T13 oaz.ZooKeeper.<init> Initiating client connection, connectString=127.0.0.1:49982/solr sessionTimeout=30000 watcher=org.apache.solr.common.cloud.ConnectionManager@46e9e0
[junit4:junit4]   2> 4515 T13 oascc.ConnectionManager.waitForConnected Waiting for client to connect to ZooKeeper
[junit4:junit4]   2> 4515 T81 oaz.ClientCnxn$SendThread.logStartConnect Opening socket connection to server localhost.localdomain/127.0.0.1:49982. Will not attempt to authenticate using SASL (access denied ("javax.security.auth.AuthPermission" "getLoginConfiguration"))
[junit4:junit4]   2> 4516 T81 oaz.ClientCnxn$SendThread.primeConnection Socket connection established to localhost.localdomain/127.0.0.1:49982, initiating session
[junit4:junit4]   2> 4516 T15 oazs.NIOServerCnxnFactory.run Accepted socket connection from /127.0.0.1:50274
[junit4:junit4]   2> 4517 T15 oazs.ZooKeeperServer.processConnectRequest Client attempting to establish new session at /127.0.0.1:50274
[junit4:junit4]   2> 4518 T17 oazs.ZooKeeperServer.finishSessionInit Established session 0x13d8ef0689b000a with negotiated timeout 20000 for client /127.0.0.1:50274
[junit4:junit4]   2> 4518 T81 oaz.ClientCnxn$SendThread.onConnected Session establishment complete on server localhost.localdomain/127.0.0.1:49982, sessionid = 0x13d8ef0689b000a, negotiated timeout = 20000
[junit4:junit4]   2> 4519 T82 oascc.ConnectionManager.process Watcher org.apache.solr.common.cloud.ConnectionManager@46e9e0 name:ZooKeeperConnection Watcher:127.0.0.1:49982/solr got event WatchedEvent state:SyncConnected type:None path:null path:null type:None
[junit4:junit4]   2> 4519 T13 oascc.ConnectionManager.waitForConnected Client is connected to ZooKeeper
[junit4:junit4]   2> 4521 T18 oazs.PrepRequestProcessor.pRequest Got user-level KeeperException when processing sessionid:0x13d8ef0689b000a type:create cxid:0x1 zxid:0x40 txntype:-1 reqpath:n/a Error Path:/solr/overseer Error:KeeperErrorCode = NodeExists for /solr/overseer
[junit4:junit4]   2> 4523 T18 oazs.PrepRequestProcessor.pRequest Got user-level KeeperException when processing sessionid:0x13d8ef0689b000a type:create cxid:0x3 zxid:0x41 txntype:-1 reqpath:n/a Error Path:/solr/overseer Error:KeeperErrorCode = NodeExists for /solr/overseer
[junit4:junit4]   2> 4526 T13 oascc.ZkStateReader.createClusterStateWatchersAndUpdate Updating cluster state from ZooKeeper... 
[junit4:junit4]   2> 5529 T13 oasc.ZkController.createEphemeralLiveNode Register node as live in ZooKeeper:/live_nodes/127.0.0.1:45600_rll%2Ft
[junit4:junit4]   2> 5530 T18 oazs.PrepRequestProcessor.pRequest Got user-level KeeperException when processing sessionid:0x13d8ef0689b000a type:delete cxid:0xd zxid:0x42 txntype:-1 reqpath:n/a Error Path:/solr/live_nodes/127.0.0.1:45600_rll%2Ft Error:KeeperErrorCode = NoNode for /solr/live_nodes/127.0.0.1:45600_rll%2Ft
[junit4:junit4]   2> 5531 T13 oascc.SolrZkClient.makePath makePath: /live_nodes/127.0.0.1:45600_rll%2Ft
[junit4:junit4]   2> 5535 T54 oascc.ZkStateReader$3.process Updating live nodes... (4)
[junit4:junit4]   2> 5535 T68 oascc.ZkStateReader$3.process Updating live nodes... (4)
[junit4:junit4]   2> 5535 T36 oascc.ZkStateReader$3.process Updating live nodes... (4)
[junit4:junit4]   2> 5535 T41 oascc.ZkStateReader$3.process Updating live nodes... (4)
[junit4:junit4]   2> 5535 T82 oascc.ZkStateReader$3.process Updating live nodes... (4)
[junit4:junit4]   2> 5541 T13 oass.SolrDispatchFilter.init user.dir=/mnt/ssd/jenkins/workspace/Lucene-Solr-trunk-Linux/solr/build/solr-core/test/J0
[junit4:junit4]   2> 5541 T13 oass.SolrDispatchFilter.init SolrDispatchFilter.init() done
[junit4:junit4]   2> 5542 T13 oascsi.HttpClientUtil.createClient Creating new http client, config:maxConnections=128&maxConnectionsPerHost=32&followRedirects=false
[junit4:junit4]   2> 5606 T13 oejs.Server.doStart jetty-8.1.8.v20121106
[junit4:junit4]   2> 5609 T13 oejs.AbstractConnector.doStart Started SelectChannelConnector@127.0.0.1:50161
[junit4:junit4]   2> 5610 T13 oass.SolrDispatchFilter.init SolrDispatchFilter.init()
[junit4:junit4]   2> 5611 T13 oasc.SolrResourceLoader.locateSolrHome JNDI not configured for solr (NoInitialContextEx)
[junit4:junit4]   2> 5611 T13 oasc.SolrResourceLoader.locateSolrHome using system property solr.solr.home: /mnt/ssd/jenkins/workspace/Lucene-Solr-trunk-Linux/solr/build/solr-core/test/J0/./org.apache.solr.cloud.UnloadDistributedZkTest-jetty4-1363902758243
[junit4:junit4]   2> 5612 T13 oasc.CoreContainer$Initializer.initialize looking for solr config file: /mnt/ssd/jenkins/workspace/Lucene-Solr-trunk-Linux/solr/build/solr-core/test/J0/./org.apache.solr.cloud.UnloadDistributedZkTest-jetty4-1363902758243/solr.xml
[junit4:junit4]   2> 5613 T13 oasc.CoreContainer.<init> New CoreContainer 19968131
[junit4:junit4]   2> 5613 T13 oasc.CoreContainer.load Loading CoreContainer using Solr Home: '/mnt/ssd/jenkins/workspace/Lucene-Solr-trunk-Linux/solr/build/solr-core/test/J0/./org.apache.solr.cloud.UnloadDistributedZkTest-jetty4-1363902758243/'
[junit4:junit4]   2> 5614 T13 oasc.SolrResourceLoader.<init> new SolrResourceLoader for directory: '/mnt/ssd/jenkins/workspace/Lucene-Solr-trunk-Linux/solr/build/solr-core/test/J0/./org.apache.solr.cloud.UnloadDistributedZkTest-jetty4-1363902758243/'
[junit4:junit4]   2> 5641 T13 oashc.HttpShardHandlerFactory.getParameter Setting socketTimeout to: 120000
[junit4:junit4]   2> 5641 T13 oashc.HttpShardHandlerFactory.getParameter Setting urlScheme to: http://
[junit4:junit4]   2> 5642 T13 oashc.HttpShardHandlerFactory.getParameter Setting connTimeout to: 15000
[junit4:junit4]   2> 5642 T13 oashc.HttpShardHandlerFactory.getParameter Setting maxConnectionsPerHost to: 20
[junit4:junit4]   2> 5643 T13 oashc.HttpShardHandlerFactory.getParameter Setting corePoolSize to: 0
[junit4:junit4]   2> 5643 T13 oashc.HttpShardHandlerFactory.getParameter Setting maximumPoolSize to: 2147483647
[junit4:junit4]   2> 5644 T13 oashc.HttpShardHandlerFactory.getParameter Setting maxThreadIdleTime to: 5
[junit4:junit4]   2> 5644 T13 oashc.HttpShardHandlerFactory.getParameter Setting sizeOfQueue to: -1
[junit4:junit4]   2> 5645 T13 oashc.HttpShardHandlerFactory.getParameter Setting fairnessPolicy to: false
[junit4:junit4]   2> 5645 T13 oascsi.HttpClientUtil.createClient Creating new http client, config:maxConnectionsPerHost=20&maxConnections=10000&socketTimeout=120000&connTimeout=15000&retry=false
[junit4:junit4]   2> 5653 T13 oasc.CoreContainer.load Registering Log Listener
[junit4:junit4]   2> 5666 T13 oasc.CoreContainer.initZooKeeper Zookeeper client=127.0.0.1:49982/solr
[junit4:junit4]   2> 5666 T13 oasc.ZkController.checkChrootPath zkHost includes chroot
[junit4:junit4]   2> 5667 T13 oaz.ZooKeeper.<init> Initiating client connection, connectString=127.0.0.1:49982 sessionTimeout=60000 watcher=org.apache.solr.common.cloud.ConnectionManager@17c8684
[junit4:junit4]   2> 5668 T13 oascc.ConnectionManager.waitForConnected Waiting for client to connect to ZooKeeper
[junit4:junit4]   2> 5668 T93 oaz.ClientCnxn$SendThread.logStartConnect Opening socket connection to server localhost.localdomain/127.0.0.1:49982. Will not attempt to authenticate using SASL (access denied ("javax.security.auth.AuthPermission" "getLoginConfiguration"))
[junit4:junit4]   2> 5669 T93 oaz.ClientCnxn$SendThread.primeConnection Socket connection established to localhost.localdomain/127.0.0.1:49982, initiating session
[junit4:junit4]   2> 5669 T15 oazs.NIOServerCnxnFactory.run Accepted socket connection from /127.0.0.1:50275
[junit4:junit4]   2> 5670 T15 oazs.ZooKeeperServer.processConnectRequest Client attempting to establish new session at /127.0.0.1:50275
[junit4:junit4]   2> 5671 T17 oazs.ZooKeeperServer.finishSessionInit Established session 0x13d8ef0689b000b with negotiated timeout 20000 for client /127.0.0.1:50275
[junit4:junit4]   2> 5671 T93 oaz.ClientCnxn$SendThread.onConnected Session establishment complete on server localhost.localdomain/127.0.0.1:49982, sessionid = 0x13d8ef0689b000b, negotiated timeout = 20000
[junit4:junit4]   2> 5672 T94 oascc.ConnectionManager.process Watcher org.apache.solr.common.cloud.ConnectionManager@17c8684 name:ZooKeeperConnection Watcher:127.0.0.1:49982 got event WatchedEvent state:SyncConnected type:None path:null path:null type:None
[junit4:junit4]   2> 5672 T13 oascc.ConnectionManager.waitForConnected Client is connected to ZooKeeper
[junit4:junit4]   2> 5674 T18 oazs.PrepRequestProcessor.pRequest2Txn Processed session termination for sessionid: 0x13d8ef0689b000b
[junit4:junit4]   2> 5675 T94 oaz.ClientCnxn$EventThread.run EventThread shut down
[junit4:junit4]   2> 5675 T13 oaz.ZooKeeper.close Session: 0x13d8ef0689b000b closed
[junit4:junit4]   2> 5675 T15 oazs.NIOServerCnxn.closeSock Closed socket connection for client /127.0.0.1:50275 which had sessionid 0x13d8ef0689b000b
[junit4:junit4]   2> 5676 T13 oascsi.HttpClientUtil.createClient Creating new http client, config:maxConnections=500&maxConnectionsPerHost=16&socketTimeout=120000&connTimeout=15000
[junit4:junit4]   2> 5680 T13 oaz.ZooKeeper.<init> Initiating client connection, connectString=127.0.0.1:49982/solr sessionTimeout=30000 watcher=org.apache.solr.common.cloud.ConnectionManager@d92f8
[junit4:junit4]   2> 5681 T13 oascc.ConnectionManager.waitForConnected Waiting for client to connect to ZooKeeper
[junit4:junit4]   2> 5682 T95 oaz.ClientCnxn$SendThread.logStartConnect Opening socket connection to server localhost.localdomain/127.0.0.1:49982. Will not attempt to authenticate using SASL (access denied ("javax.security.auth.AuthPermission" "getLoginConfiguration"))
[junit4:junit4]   2> 5682 T95 oaz.ClientCnxn$SendThread.primeConnection Socket connection established to localhost.localdomain/127.0.0.1:49982, initiating session
[junit4:junit4]   2> 5682 T15 oazs.NIOServerCnxnFactory.run Accepted socket connection from /127.0.0.1:50276
[junit4:junit4]   2> 5683 T15 oazs.ZooKeeperServer.processConnectRequest Client attempting to establish new session at /127.0.0.1:50276
[junit4:junit4]   2> 5684 T17 oazs.ZooKeeperServer.finishSessionInit Established session 0x13d8ef0689b000c with negotiated timeout 20000 for client /127.0.0.1:50276
[junit4:junit4]   2> 5684 T95 oaz.ClientCnxn$SendThread.onConnected Session establishment complete on server localhost.localdomain/127.0.0.1:49982, sessionid = 0x13d8ef0689b000c, negotiated timeout = 20000
[junit4:junit4]   2> 5685 T96 oascc.ConnectionManager.process Watcher org.apache.solr.common.cloud.ConnectionManager@d92f8 name:ZooKeeperConnection Watcher:127.0.0.1:49982/solr got event WatchedEvent state:SyncConnected type:None path:null path:null type:None
[junit4:junit4]   2> 5685 T13 oascc.ConnectionManager.waitForConnected Client is connected to ZooKeeper
[junit4:junit4]   2> 5686 T18 oazs.PrepRequestProcessor.pRequest Got user-level KeeperException when processing sessionid:0x13d8ef0689b000c type:create cxid:0x1 zxid:0x48 txntype:-1 reqpath:n/a Error Path:/solr/overseer Error:KeeperErrorCode = NodeExists for /solr/overseer
[junit4:junit4]   2> 5687 T18 oazs.PrepRequestProcessor.pRequest Got user-level KeeperException when processing sessionid:0x13d8ef0689b000c type:create cxid:0x3 zxid:0x49 txntype:-1 reqpath:n/a Error Path:/solr/overseer Error:KeeperErrorCode = NodeExists for /solr/overseer
[junit4:junit4]   2> 5690 T13 oascc.ZkStateReader.createClusterStateWatchersAndUpdate Updating cluster state from ZooKeeper... 
[junit4:junit4]   2> 6693 T13 oasc.ZkController.createEphemeralLiveNode Register node as live in ZooKeeper:/live_nodes/127.0.0.1:50161_rll%2Ft
[junit4:junit4]   2> 6695 T18 oazs.PrepRequestProcessor.pRequest Got user-level KeeperException when processing sessionid:0x13d8ef0689b000c type:delete cxid:0xd zxid:0x4a txntype:-1 reqpath:n/a Error Path:/solr/live_nodes/127.0.0.1:50161_rll%2Ft Error:KeeperErrorCode = NoNode for /solr/live_nodes/127.0.0.1:50161_rll%2Ft
[junit4:junit4]   2> 6695 T13 oascc.SolrZkClient.makePath makePath: /live_nodes/127.0.0.1:50161_rll%2Ft
[junit4:junit4]   2> 6700 T68 oascc.ZkStateReader$3.process Updating live nodes... (5)
[junit4:junit4]   2> 6700 T41 oascc.ZkStateReader$3.process Updating live nodes... (5)
[junit4:junit4]   2> 6700 T36 oascc.ZkStateReader$3.process Updating live nodes... (5)
[junit4:junit4]   2> 6700 T54 oascc.ZkStateReader$3.process Updating live nodes... (5)
[junit4:junit4]   2> 6700 T96 oascc.ZkStateReader$3.process Updating live nodes... (5)
[junit4:junit4]   2> 6700 T82 oascc.ZkStateReader$3.process Updating live nodes... (5)
[junit4:junit4]   2> 6708 T13 oass.SolrDispatchFilter.init user.dir=/mnt/ssd/jenkins/workspace/Lucene-Solr-trunk-Linux/solr/build/solr-core/test/J0
[junit4:junit4]   2> 6708 T13 oass.SolrDispatchFilter.init SolrDispatchFilter.init() done
[junit4:junit4]   2> 6709 T13 oascsi.HttpClientUtil.createClient Creating new http client, config:maxConnections=128&maxConnectionsPerHost=32&followRedirects=false
[junit4:junit4]   2> 6712 T13 oascsi.HttpClientUtil.createClient Creating new http client, config:maxConnections=128&maxConnectionsPerHost=32&followRedirects=false
[junit4:junit4]   2> 6977 T48 oasc.CoreContainer.create Creating SolrCore 'unloadcollection1' using instanceDir: /mnt/ssd/jenkins/workspace/Lucene-Solr-trunk-Linux/solr/build/solr-core/test/J0/./org.apache.solr.cloud.UnloadDistributedZkTest-jetty1-1363902754704/unloadcollection1
[junit4:junit4]   2> 6979 T48 oasc.ZkController.createCollectionZkNode Check for collection zkNode:unloadcollection
[junit4:junit4]   2> 6981 T48 oasc.ZkController.createCollectionZkNode Creating collection in ZooKeeper:unloadcollection
[junit4:junit4]   2> 6982 T48 oasc.ZkController.getConfName Looking for collection configName
[junit4:junit4]   2> 6984 T48 oasc.ZkController.getConfName Only one config set found in zk - using it:conf1
[junit4:junit4]   2> 6985 T48 oascc.SolrZkClient.makePath makePath: /collections/unloadcollection
[junit4:junit4]   2> 6989 T48 oasc.ZkController.readConfigName Load collection config from:/collections/unloadcollection
[junit4:junit4]   2> 6996 T48 oasc.SolrResourceLoader.<init> new SolrResourceLoader for directory: '/mnt/ssd/jenkins/workspace/Lucene-Solr-trunk-Linux/solr/build/solr-core/test/J0/./org.apache.solr.cloud.UnloadDistributedZkTest-jetty1-1363902754704/unloadcollection1/'
[junit4:junit4]   2> 7069 T48 oasc.SolrConfig.<init> Using Lucene MatchVersion: LUCENE_50
[junit4:junit4]   2> 7125 T48 oasc.SolrConfig.<init> Loaded SolrConfig: solrconfig.xml
[junit4:junit4]   2> 7127 T48 oass.IndexSchema.readSchema Reading Solr Schema
[junit4:junit4]   2> 7198 T48 oass.IndexSchema.readSchema Schema name=test
[junit4:junit4]   2> 7868 T48 oass.OpenExchangeRatesOrgProvider.init Initialized with rates=open-exchange-rates.json, refreshInterval=1440.
[junit4:junit4]   2> 7884 T48 oass.IndexSchema.readSchema default search field in schema is text
[junit4:junit4]   2> 7887 T48 oass.IndexSchema.readSchema unique key field: id
[junit4:junit4]   2> 7956 T48 oass.FileExchangeRateProvider.reload Reloading exchange rates from file currency.xml
[junit4:junit4]   2> 7965 T48 oass.FileExchangeRateProvider.reload Reloading exchange rates from file currency.xml
[junit4:junit4]   2> 7971 T48 oass.OpenExchangeRatesOrgProvider.reload Reloading exchange rates from open-exchange-rates.json
[junit4:junit4]   2> 7975 T48 oass.OpenExchangeRatesOrgProvider$OpenExchangeRates.<init> WARNING Unknown key IMPORTANT NOTE
[junit4:junit4]   2> 7975 T48 oass.OpenExchangeRatesOrgProvider$OpenExchangeRates.<init> WARNING Expected key, got STRING
[junit4:junit4]   2> 7976 T48 oass.OpenExchangeRatesOrgProvider.reload Reloading exchange rates from open-exchange-rates.json
[junit4:junit4]   2> 7978 T48 oass.OpenExchangeRatesOrgProvider$OpenExchangeRates.<init> WARNING Unknown key IMPORTANT NOTE
[junit4:junit4]   2> 7978 T48 oass.OpenExchangeRatesOrgProvider$OpenExchangeRates.<init> WARNING Expected key, got STRING
[junit4:junit4]   2> 7979 T48 oasc.SolrCore.initDirectoryFactory org.apache.solr.core.MockDirectoryFactory
[junit4:junit4]   2> 7979 T48 oasc.SolrCore.<init> [unloadcollection1] Opening new SolrCore at /mnt/ssd/jenkins/workspace/Lucene-Solr-trunk-Linux/solr/build/solr-core/test/J0/./org.apache.solr.cloud.UnloadDistributedZkTest-jetty1-1363902754704/unloadcollection1/, dataDir=/mnt/ssd/jenkins/workspace/Lucene-Solr-trunk-Linux/solr/build/solr-core/test/J0/./solrtest-UnloadDistributedZkTest-1363902752720/1363902759418unloadcollection1_1n/
[junit4:junit4]   2> 7983 T48 oasc.JmxMonitoredMap.<init> JMX monitoring is enabled. Adding Solr mbeans to JMX Server: com.sun.jmx.mbeanserver.JmxMBeanServer@f89aab
[junit4:junit4]   2> 7986 T48 oasc.SolrCore.initDirectoryFactory org.apache.solr.core.MockDirectoryFactory
[junit4:junit4]   2> 7987 T48 oasc.CachingDirectoryFactory.get return new directory for /mnt/ssd/jenkins/workspace/Lucene-Solr-trunk-Linux/solr/build/solr-core/test/J0/./solrtest-UnloadDistributedZkTest-1363902752720/1363902759418unloadcollection1_1n forceNew: false
[junit4:junit4]   2> 7987 T48 oasc.SolrCore.getNewIndexDir New index directory detected: old=null new=/mnt/ssd/jenkins/workspace/Lucene-Solr-trunk-Linux/solr/build/solr-core/test/J0/./solrtest-UnloadDistributedZkTest-1363902752720/1363902759418unloadcollection1_1n/index/
[junit4:junit4]   2> 7988 T48 oasc.SolrCore.initIndex WARNING [unloadcollection1] Solr index directory '/mnt/ssd/jenkins/workspace/Lucene-Solr-trunk-Linux/solr/build/solr-core/test/J0/./solrtest-UnloadDistributedZkTest-1363902752720/1363902759418unloadcollection1_1n/index' doesn't exist. Creating new index...
[junit4:junit4]   2> 7992 T48 oasc.CachingDirectoryFactory.get return new directory for /mnt/ssd/jenkins/workspace/Lucene-Solr-trunk-Linux/solr/build/solr-core/test/J0/./solrtest-UnloadDistributedZkTest-1363902752720/1363902759418unloadcollection1_1n/index forceNew: false
[junit4:junit4]   2> 7995 T48 oasc.SolrDeletionPolicy.onCommit SolrDeletionPolicy.onCommit: commits:num=1
[junit4:junit4]   2> 		commit{dir=MockDirWrapper(RateLimitedDirectoryWrapper(org.apache.lucene.store.RAMDirectory@12d8d20 lockFactory=org.apache.lucene.store.NativeFSLockFactory@1a7c0ba)),segFN=segments_1,generation=1,filenames=[segments_1]
[junit4:junit4]   2> 7995 T48 oasc.SolrDeletionPolicy.updateCommits newest commit = 1[segments_1]
[junit4:junit4]   2> 8025 T48 oasup.UpdateRequestProcessorChain.init inserting DistributedUpdateProcessorFactory into updateRequestProcessorChain "dedupe"
[junit4:junit4]   2> 8026 T48 oasup.UpdateRequestProcessorChain.init inserting DistributedUpdateProcessorFactory into updateRequestProcessorChain "stored_sig"
[junit4:junit4]   2> 8048 T48 oasup.UpdateRequestProcessorChain.init inserting DistributedUpdateProcessorFactory into updateRequestProcessorChain "distrib-dup-test-chain-implicit"
[junit4:junit4]   2> 8051 T48 oasc.RequestHandlers.initHandlersFromConfig created standard: solr.StandardRequestHandler
[junit4:junit4]   2> 8056 T48 oasc.RequestHandlers.initHandlersFromConfig created /get: solr.RealTimeGetHandler
[junit4:junit4]   2> 8057 T48 oasc.RequestHandlers.initHandlersFromConfig adding lazy requestHandler: solr.ReplicationHandler
[junit4:junit4]   2> 8058 T48 oasc.RequestHandlers.initHandlersFromConfig created /replication: solr.ReplicationHandler
[junit4:junit4]   2> 8063 T48 oasc.RequestHandlers.initHandlersFromConfig created /update: solr.UpdateRequestHandler
[junit4:junit4]   2> 8065 T48 oasc.RequestHandlers.initHandlersFromConfig created /admin/: org.apache.solr.handler.admin.AdminHandlers
[junit4:junit4]   2> 8068 T48 oashl.XMLLoader.init xsltCacheLifetimeSeconds=60
[junit4:junit4]   2> 8071 T48 oass.SolrIndexSearcher.<init> Opening Searcher@b387e2 main
[junit4:junit4]   2> 8079 T48 oasu.UpdateHandler.clearLog Clearing tlog files, tlogDir=/mnt/ssd/jenkins/workspace/Lucene-Solr-trunk-Linux/solr/build/solr-core/test/J0/./solrtest-UnloadDistributedZkTest-1363902752720/1363902759418unloadcollection1_1n/tlog
[junit4:junit4]   2> 8084 T48 oasu.CommitTracker.<init> Hard AutoCommit: disabled
[junit4:junit4]   2> 8085 T48 oasu.CommitTracker.<init> Soft AutoCommit: disabled
[junit4:junit4]   2> 8157 T98 oasc.SolrCore.registerSearcher [unloadcollection1] Registered new searcher Searcher@b387e2 main{StandardDirectoryReader(segments_1:1)}
[junit4:junit4]   2> 8162 T48 oasc.ZkController.publish publishing core=unloadcollection1 state=down
[junit4:junit4]   2> 9450 T37 oascc.ZkStateReader.updateClusterState Updating cloud state from ZooKeeper... 
[junit4:junit4]   2> 9451 T37 oasc.Overseer$ClusterStateUpdater.updateState Update state numShards=1 message={
[junit4:junit4]   2> 	  "core":"unloadcollection1",
[junit4:junit4]   2> 	  "node_name":"127.0.0.1:44577_rll%2Ft",
[junit4:junit4]   2> 	  "roles":null,
[junit4:junit4]   2> 	  "numShards":"1",
[junit4:junit4]   2> 	  "core_node_name":null,
[junit4:junit4]   2> 	  "shard":null,
[junit4:junit4]   2> 	  "state":"down",
[junit4:junit4]   2> 	  "operation":"state",
[junit4:junit4]   2> 	  "collection":"unloadcollection",
[junit4:junit4]   2> 	  "base_url":"http://127.0.0.1:44577/rll/t"}
[junit4:junit4]   2> 9451 T37 oasc.Overseer$ClusterStateUpdater.createCollection Create collection unloadcollection with numShards 1
[junit4:junit4]   2> 9461 T37 oasc.Overseer$ClusterStateUpdater.updateState Assigning new node to shard shard=shard1
[junit4:junit4]   2> 9470 T54 oascc.ZkStateReader$2.process A cluster state change: WatchedEvent state:SyncConnected type:NodeDataChanged path:/clusterstate.json, has occurred - updating... (live nodes size: 5)
[junit4:junit4]   2> 9470 T82 oascc.ZkStateReader$2.process A cluster state change: WatchedEvent state:SyncConnected type:NodeDataChanged path:/clusterstate.json, has occurred - updating... (live nodes size: 5)
[junit4:junit4]   2> 9470 T41 oascc.ZkStateReader$2.process A cluster state change: WatchedEvent state:SyncConnected type:NodeDataChanged path:/clusterstate.json, has occurred - updating... (live nodes size: 5)
[junit4:junit4]   2> 9470 T96 oascc.ZkStateReader$2.process A cluster state change: WatchedEvent state:SyncConnected type:NodeDataChanged path:/clusterstate.json, has occurred - updating... (live nodes size: 5)
[junit4:junit4]   2> 9470 T68 oascc.ZkStateReader$2.process A cluster state change: WatchedEvent state:SyncConnected type:NodeDataChanged path:/clusterstate.json, has occurred - updating... (live nodes size: 5)
[junit4:junit4]   2> 9471 T36 oascc.ZkStateReader$2.process A cluster state change: WatchedEvent state:SyncConnected type:NodeDataChanged path:/clusterstate.json, has occurred - updating... (live nodes size: 5)
[junit4:junit4]   2> 10165 T48 oasc.CoreContainer.registerCore registering core: unloadcollection1
[junit4:junit4]   2> 10166 T48 oasc.ZkController.register Register replica - core:unloadcollection1 address:http://127.0.0.1:44577/rll/t collection:unloadcollection shard:shard1
[junit4:junit4]   2> 10171 T48 oascsi.HttpClientUtil.createClient Creating new http client, config:maxConnections=10000&maxConnectionsPerHost=20&connTimeout=30000&socketTimeout=30000&retry=false
[junit4:junit4]   2> 10181 T48 oascc.SolrZkClient.makePath makePath: /collections/unloadcollection/leader_elect/shard1/election
[junit4:junit4]   2> 10191 T18 oazs.PrepRequestProcessor.pRequest Got user-level KeeperException when processing sessionid:0x13d8ef0689b0006 type:delete cxid:0x51 zxid:0x57 txntype:-1 reqpath:n/a Error Path:/solr/collections/unloadcollection/leaders Error:KeeperErrorCode = NoNode for /solr/collections/unloadcollection/leaders
[junit4:junit4]   2> 10191 T48 oasc.ShardLeaderElectionContext.runLeaderProcess Running the leader process.
[junit4:junit4]   2> 10192 T18 oazs.PrepRequestProcessor.pRequest Got user-level KeeperException when processing sessionid:0x13d8ef0689b0006 type:create cxid:0x52 zxid:0x58 txntype:-1 reqpath:n/a Error Path:/solr/overseer Error:KeeperErrorCode = NodeExists for /solr/overseer
[junit4:junit4]   2> 10196 T48 oasc.ShardLeaderElectionContext.waitForReplicasToComeUp Enough replicas found to continue.
[junit4:junit4]   2> 10196 T48 oasc.ShardLeaderElectionContext.runLeaderProcess I may be the new leader - try and sync
[junit4:junit4]   2> 10197 T48 oasc.SyncStrategy.sync Sync replicas to http://127.0.0.1:44577/rll/t/unloadcollection1/
[junit4:junit4]   2> 10198 T48 oasc.SyncStrategy.syncReplicas Sync Success - now sync replicas to me
[junit4:junit4]   2> 10198 T48 oasc.SyncStrategy.syncToMe http://127.0.0.1:44577/rll/t/unloadcollection1/ has no replicas
[junit4:junit4]   2> 10199 T48 oasc.ShardLeaderElectionContext.runLeaderProcess I am the new leader: http://127.0.0.1:44577/rll/t/unloadcollection1/
[junit4:junit4]   2> 10200 T48 oascc.SolrZkClient.makePath makePath: /collections/unloadcollection/leaders/shard1
[junit4:junit4]   2> 10207 T18 oazs.PrepRequestProcessor.pRequest Got user-level KeeperException when processing sessionid:0x13d8ef0689b0006 type:create cxid:0x5d zxid:0x5c txntype:-1 reqpath:n/a Error Path:/solr/overseer Error:KeeperErrorCode = NodeExists for /solr/overseer
[junit4:junit4]   2> 10980 T37 oascc.ZkStateReader.updateClusterState Updating cloud state from ZooKeeper... 
[junit4:junit4]   2> 10992 T96 oascc.ZkStateReader$2.process A cluster state change: WatchedEvent state:SyncConnected type:NodeDataChanged path:/clusterstate.json, has occurred - updating... (live nodes size: 5)
[junit4:junit4]   2> 10992 T68 oascc.ZkStateReader$2.process A cluster state change: WatchedEvent state:SyncConnected type:NodeDataChanged path:/clusterstate.json, has occurred - updating... (live nodes size: 5)
[junit4:junit4]   2> 10992 T36 oascc.ZkStateReader$2.process A cluster state change: WatchedEvent state:SyncConnected type:NodeDataChanged path:/clusterstate.json, has occurred - updating... (live nodes size: 5)
[junit4:junit4]   2> 10992 T41 oascc.ZkStateReader$2.process A cluster state change: WatchedEvent state:SyncConnected type:NodeDataChanged path:/clusterstate.json, has occurred - updating... (live nodes size: 5)
[junit4:junit4]   2> 10992 T82 oascc.ZkStateReader$2.process A cluster state change: WatchedEvent state:SyncConnected type:NodeDataChanged path:/clusterstate.json, has occurred - updating... (live nodes size: 5)
[junit4:junit4]   2> 10992 T54 oascc.ZkStateReader$2.process A cluster state change: WatchedEvent state:SyncConnected type:NodeDataChanged path:/clusterstate.json, has occurred - updating... (live nodes size: 5)
[junit4:junit4]   2> 11013 T48 oasc.ZkController.register We are http://127.0.0.1:44577/rll/t/unloadcollection1/ and leader is http://127.0.0.1:44577/rll/t/unloadcollection1/
[junit4:junit4]   2> 11015 T48 oasc.ZkController.register No LogReplay needed for core=unloadcollection1 baseURL=http://127.0.0.1:44577/rll/t
[junit4:junit4]   2> 11016 T48 oasc.ZkController.checkRecovery I am the leader, no recovery necessary
[junit4:junit4]   2> 11016 T48 oasc.ZkController.publish publishing core=unloadcollection1 state=active
[junit4:junit4]   2> 11086 T48 oascc.ZkStateReader.updateClusterState Updating cloud state from ZooKeeper... 
[junit4:junit4]   2> 11087 T48 oasc.CoreContainer.persistFile Persisting cores config to /mnt/ssd/jenkins/workspace/Lucene-Solr-trunk-Linux/solr/build/solr-core/test/J0/./org.apache.solr.cloud.UnloadDistributedZkTest-jetty1-1363902754704/solr.xml
[junit4:junit4]   2> 11096 T48 oasc.SolrXMLSerializer.persistFile Persisting cores config to /mnt/ssd/jenkins/workspace/Lucene-Solr-trunk-Linux/solr/build/solr-core/test/J0/./org.apache.solr.cloud.UnloadDistributedZkTest-jetty1-1363902754704/solr.xml
[junit4:junit4]   2> 11098 T48 oass.SolrDispatchFilter.handleAdminRequest /admin/cores {numShards=1&dataDir=/mnt/ssd/jenkins/workspace/Lucene-Solr-trunk-Linux/solr/build/solr-core/test/J0/./solrtest-UnloadDistributedZkTest-1363902752720/1363902759418unloadcollection1_1n&wt=javabin&version=2&name=unloadcollection1&collection=unloadcollection&action=CREATE} status=0 QTime=4125 
[junit4:junit4]   2> 11134 T13 oascsi.HttpClientUtil.createClient Creating new http client, config:
[junit4:junit4]   2> 11136 T13 oaz.ZooKeeper.<init> Initiating client connection, connectString=127.0.0.1:49982/solr sessionTimeout=10000 watcher=org.apache.solr.common.cloud.ConnectionManager@1dc0a71
[junit4:junit4]   2> 11137 T13 oascc.ConnectionManager.waitForConnected Waiting for client to connect to ZooKeeper
[junit4:junit4]   2> 11142 T99 oaz.ClientCnxn$SendThread.logStartConnect Opening socket connection to server localhost.localdomain/127.0.0.1:49982. Will not attempt to authenticate using SASL (access denied ("javax.security.auth.AuthPermission" "getLoginConfiguration"))
[junit4:junit4]   2> 11142 T99 oaz.ClientCnxn$SendThread.primeConnection Socket connection established to localhost.localdomain/127.0.0.1:49982, initiating session
[junit4:junit4]   2> 11142 T15 oazs.NIOServerCnxnFactory.run Accepted socket connection from /127.0.0.1:50279
[junit4:junit4]   2> 11143 T15 oazs.ZooKeeperServer.processConnectRequest Client attempting to establish new session at /127.0.0.1:50279
[junit4:junit4]   2> 11145 T17 oazs.ZooKeeperServer.finishSessionInit Established session 0x13d8ef0689b000d with negotiated timeout 10000 for client /127.0.0.1:50279
[junit4:junit4]   2> 11145 T99 oaz.ClientCnxn$SendThread.onConnected Session establishment complete on server localhost.localdomain/127.0.0.1:49982, sessionid = 0x13d8ef0689b000d, negotiated timeout = 10000
[junit4:junit4]   2> 11146 T100 oascc.ConnectionManager.process Watcher org.apache.solr.common.cloud.ConnectionManager@1dc0a71 name:ZooKeeperConnection Watcher:127.0.0.1:49982/solr got event WatchedEvent state:SyncConnected type:None path:null path:null type:None
[junit4:junit4]   2> 11146 T13 oascc.ConnectionManager.waitForConnected Client is connected to ZooKeeper
[junit4:junit4]   2> 11148 T13 oascc.ZkStateReader.createClusterStateWatchersAndUpdate Updating cluster state from ZooKeeper... 
[junit4:junit4]   2> 11152 T13 oascc.ZkStateReader.updateClusterState Updating cloud state from ZooKeeper... 
[junit4:junit4]   2> 11153 T13 oascsi.HttpClientUtil.createClient Creating new http client, config:maxConnections=128&maxConnectionsPerHost=32&followRedirects=false
[junit4:junit4]   2> 11159 T64 oasc.CoreContainer.create Creating SolrCore 'unloadcollection2' using instanceDir: /mnt/ssd/jenkins/workspace/Lucene-Solr-trunk-Linux/solr/build/solr-core/test/J0/./org.apache.solr.cloud.UnloadDistributedZkTest-jetty2-1363902755904/unloadcollection2
[junit4:junit4]   2> 11160 T64 oasc.ZkController.createCollectionZkNode Check for collection zkNode:unloadcollection
[junit4:junit4]   2> 11162 T64 oasc.ZkController.createCollectionZkNode Collection zkNode exists
[junit4:junit4]   2> 11162 T64 oasc.ZkController.readConfigName Load collection config from:/collections/unloadcollection
[junit4:junit4]   2> 11166 T64 oasc.SolrResourceLoader.<init> new SolrResourceLoader for directory: '/mnt/ssd/jenkins/workspace/Lucene-Solr-trunk-Linux/solr/build/solr-core/test/J0/./org.apache.solr.cloud.UnloadDistributedZkTest-jetty2-1363902755904/unloadcollection2/'
[junit4:junit4]   2> 11204 T64 oasc.SolrConfig.<init> Using Lucene MatchVersion: LUCENE_50
[junit4:junit4]   2> 11243 T64 oasc.SolrConfig.<init> Loaded SolrConfig: solrconfig.xml
[junit4:junit4]   2> 11245 T64 oass.IndexSchema.readSchema Reading Solr Schema
[junit4:junit4]   2> 11294 T64 oass.IndexSchema.readSchema Schema name=test
[junit4:junit4]   2> 11694 T64 oass.OpenExchangeRatesOrgProvider.init Initialized with rates=open-exchange-rates.json, refreshInterval=1440.
[junit4:junit4]   2> 11708 T64 oass.IndexSchema.readSchema default search field in schema is text
[junit4:junit4]   2> 11712 T64 oass.IndexSchema.readSchema unique key field: id
[junit4:junit4]   2> 11745 T64 oass.FileExchangeRateProvider.reload Reloading exchange rates from file currency.xml
[junit4:junit4]   2> 11750 T64 oass.FileExchangeRateProvider.reload Reloading exchange rates from file currency.xml
[junit4:junit4]   2> 11755 T64 oass.OpenExchangeRatesOrgProvider.reload Reloading exchange rates from open-exchange-rates.json
[junit4:junit4]   2> 11756 T64 oass.OpenExchangeRatesOrgProvider$OpenExchangeRates.<init> WARNING Unknown key IMPORTANT NOTE
[junit4:junit4]   2> 11757 T64 oass.OpenExchangeRatesOrgProvider$OpenExchangeRates.<init> WARNING Expected key, got STRING
[junit4:junit4]   2> 11757 T64 oass.OpenExchangeRatesOrgProvider.reload Reloading exchange rates from open-exchange-rates.json
[junit4:junit4]   2> 11759 T64 oass.OpenExchangeRatesOrgProvider$OpenExchangeRates.<init> WARNING Unknown key IMPORTANT NOTE
[junit4:junit4]   2> 11759 T64 oass.OpenExchangeRatesOrgProvider$OpenExchangeRates.<init> WARNING Expected key, got STRING
[junit4:junit4]   2> 11760 T64 oasc.SolrCore.initDirectoryFactory org.apache.solr.core.MockDirectoryFactory
[junit4:junit4]   2> 11760 T64 oasc.SolrCore.<init> [unloadcollection2] Opening new SolrCore at /mnt/ssd/jenkins/workspace/Lucene-Solr-trunk-Linux/solr/build/solr-core/test/J0/./org.apache.solr.cloud.UnloadDistributedZkTest-jetty2-1363902755904/unloadcollection2/, dataDir=/mnt/ssd/jenkins/workspace/Lucene-Solr-trunk-Linux/solr/build/solr-core/test/J0/./solrtest-UnloadDistributedZkTest-1363902752720/1363902763855unloadcollection1_2n/
[junit4:junit4]   2> 11760 T64 oasc.JmxMonitoredMap.<init> JMX monitoring is enabled. Adding Solr mbeans to JMX Server: com.sun.jmx.mbeanserver.JmxMBeanServer@f89aab
[junit4:junit4]   2> 11762 T64 oasc.SolrCore.initDirectoryFactory org.apache.solr.core.MockDirectoryFactory
[junit4:junit4]   2> 11763 T64 oasc.CachingDirectoryFactory.get return new directory for /mnt/ssd/jenkins/workspace/Lucene-Solr-trunk-Linux/solr/build/solr-core/test/J0/./solrtest-UnloadDistributedZkTest-1363902752720/1363902763855unloadcollection1_2n forceNew: false
[junit4:junit4]   2> 11763 T64 oasc.SolrCore.getNewIndexDir New index directory detected: old=null new=/mnt/ssd/jenkins/workspace/Lucene-Solr-trunk-Linux/solr/build/solr-core/test/J0/./solrtest-UnloadDistributedZkTest-1363902752720/1363902763855unloadcollection1_2n/index/
[junit4:junit4]   2> 11763 T64 oasc.SolrCore.initIndex WARNING [unloadcollection2] Solr index directory '/mnt/ssd/jenkins/workspace/Lucene-Solr-trunk-Linux/solr/build/solr-core/test/J0/./solrtest-UnloadDistributedZkTest-1363902752720/1363902763855unloadcollection1_2n/index' doesn't exist. Creating new index...
[junit4:junit4]   2> 11764 T64 oasc.CachingDirectoryFactory.get return new directory for /mnt/ssd/jenkins/workspace/Lucene-Solr-trunk-Linux/solr/build/solr-core/test/J0/./solrtest-UnloadDistributedZkTest-1363902752720/1363902763855unloadcollection1_2n/index forceNew: false
[junit4:junit4]   2> 11766 T64 oasc.SolrDeletionPolicy.onCommit SolrDeletionPolicy.onCommit: commits:num=1
[junit4:junit4]   2> 		commit{dir=MockDirWrapper(RateLimitedDirectoryWrapper(org.apache.lucene.store.RAMDirectory@132a36d lockFactory=org.apache.lucene.store.NativeFSLockFactory@176c5b5)),segFN=segments_1,generation=1,filenames=[segments_1]
[junit4:junit4]   2> 11766 T64 oasc.SolrDeletionPolicy.updateCommits newest commit = 1[segments_1]
[junit4:junit4]   2> 11769 T64 oasup.UpdateRequestProcessorChain.init inserting DistributedUpdateProcessorFactory into updateRequestProcessorChain "dedupe"
[junit4:junit4]   2> 11769 T64 oasup.UpdateRequestProcessorChain.init inserting DistributedUpdateProcessorFactory into updateRequestProcessorChain "stored_sig"
[junit4:junit4]   2> 11770 T64 oasup.UpdateRequestProcessorChain.init inserting DistributedUpdateProcessorFactory into updateRequestProcessorChain "distrib-dup-test-chain-implicit"
[junit4:junit4]   2> 11772 T64 oasc.RequestHandlers.initHandlersFromConfig created standard: solr.StandardRequestHandler
[junit4:junit4]   2> 11773 T64 oasc.RequestHandlers.initHandlersFromConfig created /get: solr.RealTimeGetHandler
[junit4:junit4]   2> 11774 T64 oasc.RequestHandlers.initHandlersFromConfig adding lazy requestHandler: solr.ReplicationHandler
[junit4:junit4]   2> 11775 T64 oasc.RequestHandlers.initHandlersFromConfig created /replication: solr.ReplicationHandler
[junit4:junit4]   2> 11776 T64 oasc.RequestHandlers.initHandlersFromConfig created /update: solr.UpdateRequestHandler
[junit4:junit4]   2> 11777 T64 oasc.RequestHandlers.initHandlersFromConfig created /admin/: org.apache.solr.handler.admin.AdminHandlers
[junit4:junit4]   2> 11781 T64 oashl.XMLLoader.init xsltCacheLifetimeSeconds=60
[junit4:junit4]   2> 11784 T64 oass.SolrIndexSearcher.<init> Opening Searcher@1675eac main
[junit4:junit4]   2> 11785 T64 oasu.UpdateHandler.clearLog Clearing tlog files, tlogDir=/mnt/ssd/jenkins/workspace/Lucene-Solr-trunk-Linux/solr/build/solr-core/test/J0/./solrtest-UnloadDistributedZkTest-1363902752720/1363902763855unloadcollection1_2n/tlog
[junit4:junit4]   2> 11786 T64 oasu.CommitTracker.<init> Hard AutoCommit: disabled
[junit4:junit4]   2> 11786 T64 oasu.CommitTracker.<init> Soft AutoCommit: disabled
[junit4:junit4]   2> 11794 T101 oasc.SolrCore.registerSearcher [unloadcollection2] Registered new searcher Searcher@1675eac main{StandardDirectoryReader(segments_1:1)}
[junit4:junit4]   2> 11798 T64 oasc.ZkController.publish publishing core=unloadcollection2 state=down
[junit4:junit4]   2> 11799 T64 oasc.ZkController.publish numShards not found on descriptor - reading it from system property
[junit4:junit4]   2> 12588 T37 oascc.ZkStateReader.updateClusterState Updating cloud state from ZooKeeper... 
[junit4:junit4]   2> 12590 T37 oasc.Overseer$ClusterStateUpdater.updateState Update state numShards=1 message={
[junit4:junit4]   2> 	  "core":"unloadcollection1",
[junit4:junit4]   2> 	  "node_name":"127.0.0.1:44577_rll%2Ft",
[junit4:junit4]   2> 	  "roles":null,
[junit4:junit4]   2> 	  "numShards":"1",
[junit4:junit4]   2> 	  "core_node_name":"127.0.0.1:44577_rll%2Ft_unloadcollection1",
[junit4:junit4]   2> 	  "shard":"shard1",
[junit4:junit4]   2> 	  "state":"active",
[junit4:junit4]   2> 	  "operation":"state",
[junit4:junit4]   2> 	  "collection":"unloadcollection",
[junit4:junit4]   2> 	  "base_url":"http://127.0.0.1:44577/rll/t"}
[junit4:junit4]   2> 12594 T37 oasc.Overseer$ClusterStateUpdater.updateState Update state numShards=2 message={
[junit4:junit4]   2> 	  "core":"unloadcollection2",
[junit4:junit4]   2> 	  "node_name":"127.0.0.1:43071_rll%2Ft",
[junit4:junit4]   2> 	  "roles":null,
[junit4:junit4]   2> 	  "numShards":"2",
[junit4:junit4]   2> 	  "core_node_name":null,
[junit4:junit4]   2> 	  "shard":null,
[junit4:junit4]   2> 	  "state":"down",
[junit4:junit4]   2> 	  "operation":"state",
[junit4:junit4]   2> 	  "collection":"unloadcollection",
[junit4:junit4]   2> 	  "base_url":"http://127.0.0.1:43071/rll/t"}
[junit4:junit4]   2> 12594 T37 oasc.Overseer$ClusterStateUpdater.updateState Collection already exists with numShards=1
[junit4:junit4]   2> 12594 T37 oasc.Overseer$ClusterStateUpdater.updateState Assigning new node to shard shard=shard1
[junit4:junit4]   2> 12598 T68 oascc.ZkStateReader$2.process A cluster state change: WatchedEvent state:SyncConnected type:NodeDataChanged path:/clusterstate.json, has occurred - updating... (live nodes size: 5)
[junit4:junit4]   2> 12599 T54 oascc.ZkStateReader$2.process A cluster state change: WatchedEvent state:SyncConnected type:NodeDataChanged path:/clusterstate.json, has occurred - updating... (live nodes size: 5)
[junit4:junit4]   2> 12598 T41 oascc.ZkStateReader$2.process A cluster state change: WatchedEvent state:SyncConnected type:NodeDataChanged path:/clusterstate.json, has occurred - updating... (live nodes size: 5)
[junit4:junit4]   2> 12599 T82 oascc.ZkStateReader$2.process A cluster state change: WatchedEvent state:SyncConnected type:NodeDataChanged path:/clusterstate.json, has occurred - updating... (live nodes size: 5)
[junit4:junit4]   2> 12599 T96 oascc.ZkStateReader$2.process A cluster state change: WatchedEvent state:SyncConnected type:NodeDataChanged path:/clusterstate.json, has occurred - updating... (live nodes size: 5)
[junit4:junit4]   2> 12599 T100 oascc.ZkStateReader$2.process A cluster state change: WatchedEvent state:SyncConnected type:NodeDataChanged path:/clusterstate.json, has occurred - updating... (live nodes size: 5)
[junit4:junit4]   2> 12599 T36 oascc.ZkStateReader$2.process A cluster state change: WatchedEvent state:SyncConnected type:NodeDataChanged path:/clusterstate.json, has occurred - updating... (live nodes size: 5)
[junit4:junit4]   2> 12801 T64 oasc.CoreContainer.registerCore registering core: unloadcollection2
[junit4:junit4]   2> 12801 T64 oasc.ZkController.register Register replica - core:unloadcollection2 address:http://127.0.0.1:43071/rll/t collection:unloadcollection shard:shard1
[junit4:junit4]   2> 12806 T64 oasc.ZkController.register We are http://127.0.0.1:43071/rll/t/unloadcollection2/ and leader is http://127.0.0.1:44577/rll/t/unloadcollection1/
[junit4:junit4]   2> 12806 T64 oasc.ZkController.register No LogReplay needed for core=unloadcollection2 baseURL=http://127.0.0.1:43071/rll/t
[junit4:junit4]   2> 12807 T64 oasc.ZkController.checkRecovery Core needs to recover:unloadcollection2
[junit4:junit4]   2> 12807 T64 oasu.DefaultSolrCoreState.doRecovery Running recovery - first canceling any ongoing recovery
[junit4:junit4]   2> ASYNC  NEW_CORE C1 name=unloadcollection2 org.apache.solr.core.SolrCore@bd0667 url=http://127.0.0.1:43071/rll/t/unloadcollection2 node=127.0.0.1:43071_rll%2Ft C1_STATE=coll:unloadcollection core:unloadcollection2 props:{core=unloadcollection2, node_name=127.0.0.1:43071_rll%2Ft, state=down, collection=unloadcollection, base_url=http://127.0.0.1:43071/rll/t}
[junit4:junit4]   2> 12812 T102 C1 P43071 oasc.RecoveryStrategy.run Starting recovery process.  core=unloadcollection2 recoveringAfterStartup=true
[junit4:junit4]   2> 12813 T102 C1 P43071 oasc.RecoveryStrategy.doRecovery ###### startupVersions=[]
[junit4:junit4]   2> 12813 T64 oascc.ZkStateReader.updateClusterState Updating cloud state from ZooKeeper... 
[junit4:junit4]   2> 12813 T102 C1 P43071 oasc.ZkController.publish publishing core=unloadcollection2 state=recovering
[junit4:junit4]   2> 12814 T102 C1 P43071 oasc.ZkController.publish numShards not found on descriptor - reading it from system property
[junit4:junit4]   2> 12815 T64 oasc.CoreContainer.persistFile Persisting cores config to /mnt/ssd/jenkins/workspace/Lucene-Solr-trunk-Linux/solr/build/solr-core/test/J0/./org.apache.solr.cloud.UnloadDistributedZkTest-jetty2-1363902755904/solr.xml
[junit4:junit4]   2> 12816 T102 C1 P43071 oascsi.HttpClientUtil.createClient Creating new http client, config:maxConnections=128&maxConnectionsPerHost=32&followRedirects=false
[junit4:junit4]   2> 12834 T64 oasc.SolrXMLSerializer.persistFile Persisting cores config to /mnt/ssd/jenkins/workspace/Lucene-Solr-trunk-Linux/solr/build/solr-core/test/J0/./org.apache.solr.cloud.UnloadDistributedZkTest-jetty2-1363902755904/solr.xml
[junit4:junit4]   2> 12836 T64 oass.SolrDispatchFilter.handleAdminRequest /admin/cores {dataDir=/mnt/ssd/jenkins/workspace/Lucene-Solr-trunk-Linux/solr/build/solr-core/test/J0/./solrtest-UnloadDistributedZkTest-1363902752720/1363902763855unloadcollection1_2n&wt=javabin&version=2&name=unloadcollection2&collection=unloadcollection&action=CREATE} status=0 QTime=1677 
[junit4:junit4]   2> 12838 T13 oascc.ZkStateReader.updateClusterState Updating cloud state from ZooKeeper... 
[junit4:junit4]   2> 12840 T13 oasc.AbstractDistribZkTestBase.waitForRecoveriesToFinish Wait for recoveries to finish - collection: unloadcollection failOnTimeout:true timeout (sec):230
[junit4:junit4]   2> 12841 T13 oascc.ZkStateReader.updateClusterState Updating cloud state from ZooKeeper... 
[junit4:junit4]   2> 13844 T13 oascc.ZkStateReader.updateClusterState Updating cloud state from ZooKeeper... 
[junit4:junit4]   2> 14108 T37 oascc.ZkStateReader.updateClusterState Updating cloud state from ZooKeeper... 
[junit4:junit4]   2> 14110 T37 oasc.Overseer$ClusterStateUpdater.updateState Update state numShards=2 message={
[junit4:junit4]   2> 	  "core":"unloadcollection2",
[junit4:junit4]   2> 	  "node_name":"127.0.0.1:43071_rll%2Ft",
[junit4:junit4]   2> 	  "roles":null,
[junit4:junit4]   2> 	  "numShards":"2",
[junit4:junit4]   2> 	  "core_node_name":"127.0.0.1:43071_rll%2Ft_unloadcollection2",
[junit4:junit4]   2> 	  "shard":"shard1",
[junit4:junit4]   2> 	  "state":"recovering",
[junit4:junit4]   2> 	  "operation":"state",
[junit4:junit4]   2> 	  "collection":"unloadcollection",
[junit4:junit4]   2> 	  "base_url":"http://127.0.0.1:43071/rll/t"}
[junit4:junit4]   2> 14117 T54 oascc.ZkStateReader$2.process A cluster state change: WatchedEvent state:SyncConnected type:NodeDataChanged path:/clusterstate.json, has occurred - updating... (live nodes size: 5)
[junit4:junit4]   2> 14117 T96 oascc.ZkStateReader$2.process A cluster state change: WatchedEvent state:SyncConnected type:NodeDataChanged path:/clusterstate.json, has occurred - updating... (live nodes size: 5)
[junit4:junit4]   2> 14117 T82 oascc.ZkStateReader$2.process A cluster state change: WatchedEvent state:SyncConnected type:NodeDataChanged path:/clusterstate.json, has occurred - updating... (live nodes size: 5)
[junit4:junit4]   2> 14117 T100 oascc.ZkStateReader$2.process A cluster state change: WatchedEvent state:SyncConnected type:NodeDataChanged path:/clusterstate.json, has occurred - updating... (live nodes size: 5)
[junit4:junit4]   2> 14117 T68 oascc.ZkStateReader$2.process A cluster state change: WatchedEvent state:SyncConnected type:NodeDataChanged path:/clusterstate.json, has occurred - updating... (live nodes size: 5)
[junit4:junit4]   2> 14117 T41 oascc.ZkStateReader$2.process A cluster state change: WatchedEvent state:SyncConnected type:NodeDataChanged path:/clusterstate.json, has occurred - updating... (live nodes size: 5)
[junit4:junit4]   2> 14118 T36 oascc.ZkStateReader$2.process A cluster state change: WatchedEvent state:SyncConnected type:NodeDataChanged path:/clusterstate.json, has occurred - updating... (live nodes size: 5)
[junit4:junit4]   2> 14833 T48 oass.SolrDispatchFilter.handleAdminRequest /admin/cores {core=unloadcollection1&wt=javabin&coreNodeName=127.0.0.1:43071_rll%252Ft_unloadcollection2&checkLive=true&version=2&onlyIfLeader=true&state=recovering&nodeName=127.0.0.1:43071_rll%252Ft&action=PREPRECOVERY} status=0 QTime=2001 
[junit4:junit4]   2> 14846 T13 oascc.ZkStateReader.updateClusterState Updating cloud state from ZooKeeper... 
[junit4:junit4]   2> 15849 T13 oascc.ZkStateReader.updateClusterState Updating cloud state from ZooKeeper... 
[junit4:junit4]   2>  C1_STATE=coll:unloadcollection core:unloadcollection2 props:{core=unloadcollection2, node_name=127.0.0.1:43071_rll%2Ft, shard=shard1, state=recovering, collection=unloadcollection, base_url=http://127.0.0.1:43071/rll/t}
[junit4:junit4]   2> 16834 T102 C1 P43071 oasc.RecoveryStrategy.doRecovery Attempting to PeerSync from http://127.0.0.1:44577/rll/t/unloadcollection1/ core=unloadcollection2 - recoveringAfterStartup=true
[junit4:junit4]   2> 16840 T102 C1 P43071 oascsi.HttpClientUtil.createClient Creating new http client, config:maxConnectionsPerHost=20&maxConnections=10000&connTimeout=30000&socketTimeout=30000&retry=false
[junit4:junit4]   2> 16849 T102 C1 P43071 oasu.PeerSync.sync PeerSync: core=unloadcollection2 url=http://127.0.0.1:43071/rll/t START replicas=[http://127.0.0.1:44577/rll/t/unloadcollection1/] nUpdates=100
[junit4:junit4]   2> 16851 T13 oascc.ZkStateReader.updateClusterState Updating cloud state from ZooKeeper... 
[junit4:junit4]   2> 16852 T102 C1 P43071 oasu.PeerSync.sync WARNING no frame of reference to tell of we've missed updates
[junit4:junit4]   2> 16852 T102 C1 P43071 oasc.RecoveryStrategy.doRecovery PeerSync Recovery was not successful - trying replication. core=unloadcollection2
[junit4:junit4]   2> 16853 T102 C1 P43071 oasc.RecoveryStrategy.doRecovery Starting Replication Recovery. core=unloadcollection2
[junit4:junit4]   2> 16853 T102 C1 P43071 oasc.RecoveryStrategy.doRecovery Begin buffering updates. core=unloadcollection2
[junit4:junit4]   2> 16853 T102 C1 P43071 oasu.UpdateLog.bufferUpdates Starting to buffer updates. FSUpdateLog{state=ACTIVE, tlog=null}
[junit4:junit4]   2> 16853 T102 C1 P43071 oasc.RecoveryStrategy.replicate Attempting to replicate from http://127.0.0.1:44577/rll/t/unloadcollection1/. core=unloadcollection2
[junit4:junit4]   2> 16854 T102 C1 P43071 oascsi.HttpClientUtil.createClient Creating new http client, config:maxConnections=128&maxConnectionsPerHost=32&followRedirects=false
[junit4:junit4]   2> ASYNC  NEW_CORE C2 name=unloadcollection1 org.apache.solr.core.SolrCore@1f590a url=http://127.0.0.1:44577/rll/t/unloadcollection1 node=127.0.0.1:44577_rll%2Ft C2_STATE=coll:unloadcollection core:unloadcollection1 props:{core=unloadcollection1, node_name=127.0.0.1:44577_rll%2Ft, shard=shard1, state=active, collection=unloadcollection, base_url=http://127.0.0.1:44577/rll/t, leader=true}
[junit4:junit4]   2> 16868 T47 C2 P44577 REQ /get {getVersions=100&wt=javabin&version=2&distrib=false&qt=/get} status=0 QTime=2 
[junit4:junit4]   2> 16874 T50 C2 P44577 oasu.DirectUpdateHandler2.commit start commit{,optimize=false,openSearcher=false,waitSearcher=true,expungeDeletes=false,softCommit=false,prepareCommit=false}
[junit4:junit4]   2> 16877 T50 C2 P44577 oasc.SolrDeletionPolicy.onInit SolrDeletionPolicy.onInit: commits:num=1
[junit4:junit4]   2> 		commit{dir=MockDirWrapper(RateLimitedDirectoryWrapper(org.apache.lucene.store.RAMDirectory@12d8d20 lockFactory=org.apache.lucene.store.NativeFSLockFactory@1a7c0ba)),segFN=segments_1,generation=1,filenames=[segments_1]
[junit4:junit4]   2> 16878 T50 C2 P44577 oasc.SolrDeletionPolicy.updateCommits newest commit = 1[segments_1]
[junit4:junit4]   2> 16879 T50 C2 P44577 oasc.SolrDeletionPolicy.onCommit SolrDeletionPolicy.onCommit: commits:num=2
[junit4:junit4]   2> 		commit{dir=MockDirWrapper(RateLimitedDirectoryWrapper(org.apache.lucene.store.RAMDirectory@12d8d20 lockFactory=org.apache.lucene.store.NativeFSLockFactory@1a7c0ba)),segFN=segments_1,generation=1,filenames=[segments_1]
[junit4:junit4]   2> 		commit{dir=MockDirWrapper(RateLimitedDirectoryWrapper(org.apache.lucene.store.RAMDirectory@12d8d20 lockFactory=org.apache.lucene.store.NativeFSLockFactory@1a7c0ba)),segFN=segments_2,generation=2,filenames=[segments_2]
[junit4:junit4]   2> 16880 T50 C2 P44577 oasc.SolrDeletionPolicy.updateCommits newest commit = 2[segments_2]
[junit4:junit4]   2> 16881 T50 C2 P44577 oass.SolrIndexSearcher.<init> Opening Searcher@1f5b316 realtime
[junit4:junit4]   2> 16882 T50 C2 P44577 oasu.DirectUpdateHandler2.commit end_commit_flush
[junit4:junit4]   2> 16882 T50 C2 P44577 /update {waitSearcher=true&wt=javabin&commit=true&version=2&commit_end_point=true&softCommit=false&openSearcher=false} {commit=} 0 16
[junit4:junit4]   2> 16907 T102 C1 P43071 oash.ReplicationHandler.inform Commits will be reserved for  10000
[junit4:junit4]   2> 16907 T102 C1 P43071 oascsi.HttpClientUtil.createClient Creating new http client, config:connTimeout=5000&socketTimeout=20000&allowCompression=false&maxConnections=10000&maxConnectionsPerHost=10000
[junit4:junit4]   2> 16913 T102 C1 P43071 oash.SnapPuller.<init>  No value set for 'pollInterval'. Timer Task not started.
[junit4:junit4]   2> 16927 T47 C2 P44577 oash.ReplicationHandler.inform Commits will be reserved for  10000
[junit4:junit4]   2> 16928 T47 C2 P44577 REQ /replication {wt=javabin&version=2&command=indexversion&qt=/replication} status=0 QTime=13 
[junit4:junit4]   2> 16929 T102 C1 P43071 oash.SnapPuller.fetchLatestIndex Master's generation: 2
[junit4:junit4]   2> 16930 T102 C1 P43071 oash.SnapPuller.fetchLatestIndex Slave's generation: 1
[junit4:junit4]   2> 16930 T102 C1 P43071 oash.SnapPuller.fetchLatestIndex Starting replication process
[junit4:junit4]   2> 16934 T50 C2 P44577 REQ /replication {wt=javabin&version=2&generation=2&command=filelist&qt=/replication} status=0 QTime=1 
[junit4:junit4]   2> 16935 T102 C1 P43071 oash.SnapPuller.fetchLatestIndex Number of files in latest index in master: 1
[junit4:junit4]   2> 16937 T102 C1 P43071 oasc.CachingDirectoryFactory.get return new directory for /mnt/ssd/jenkins/workspace/Lucene-Solr-trunk-Linux/solr/build/solr-core/test/J0/./solrtest-UnloadDistributedZkTest-1363902752720/1363902763855unloadcollection1_2n/index.20130321175249634 forceNew: false
[junit4:junit4]   2> 16937 T102 C1 P43071 oash.SnapPuller.fetchLatestIndex Starting download to MockDirWrapper(org.apache.lucene.store.RAMDirectory@1bf8c47 lockFactory=org.apache.lucene.store.NativeFSLockFactory@1b5a85) fullCopy=false
[junit4:junit4]   2> 16945 T48 C2 P44577 REQ /replication {file=segments_2&wt=filestream&checksum=true&generation=2&command=filecontent&qt=/replication} status=0 QTime=2 
[junit4:junit4]   2> 16952 T102 C1 P43071 oash.SnapPuller.fetchLatestIndex Total time taken for download : 0 secs
[junit4:junit4]   2> 16963 T102 C1 P43071 oasu.DefaultSolrCoreState.newIndexWriter Creating new IndexWriter...
[junit4:junit4]   2> 16964 T102 C1 P43071 oasu.DefaultSolrCoreState.newIndexWriter Waiting until IndexWriter is unused... core=unloadcollection2
[junit4:junit4]   2> 16966 T102 C1 P43071 oasc.SolrDeletionPolicy.onInit SolrDeletionPolicy.onInit: commits:num=2
[junit4:junit4]   2> 		commit{dir=MockDirWrapper(RateLimitedDirectoryWrapper(org.apache.lucene.store.RAMDirectory@132a36d lockFactory=org.apache.lucene.store.NativeFSLockFactory@176c5b5)),segFN=segments_1,generation=1,filenames=[segments_1]
[junit4:junit4]   2> 		commit{dir=MockDirWrapper(RateLimitedDirectoryWrapper(org.apache.lucene.store.RAMDirectory@132a36d lockFactory=org.apache.lucene.store.NativeFSLockFactory@176c5b5)),segFN=segments_2,generation=2,filenames=[segments_2]
[junit4:junit4]   2> 16966 T102 C1 P43071 oasc.SolrDeletionPolicy.updateCommits newest commit = 2[segments_2]
[junit4:junit4]   2> 16966 T102 C1 P43071 oasu.DefaultSolrCoreState.newIndexWriter New IndexWriter is ready to be used.
[junit4:junit4]   2> 16967 T102 C1 P43071 oass.SolrIndexSearcher.<init> Opening Searcher@16dbfa6 main
[junit4:junit4]   2> 16969 T101 oasc.SolrCore.registerSearcher [unloadcollection2] Registered new searcher Searcher@16dbfa6 main{StandardDirectoryReader(segments_2:1:nrt)}
[junit4:junit4]   2> 16971 T102 C1 P43071 oasc.RecoveryStrategy.replay No replay needed. core=unloadcollection2
[junit4:junit4]   2> 16971 T102 C1 P43071 oasc.RecoveryStrategy.doRecovery Replication Recovery was successful - registering as Active. core=unloadcollection2
[junit4:junit4]   2> 16971 T102 C1 P43071 oasc.ZkController.publish publishing core=unloadcollection2 state=active
[junit4:junit4]   2> 16971 T102 C1 P43071 oasc.ZkController.publish numShards not found on descriptor - reading it from system property
[junit4:junit4]   2> 16973 T102 C1 P43071 oasc.RecoveryStrategy.doRecovery Finished recovery process. core=unloadcollection2
[junit4:junit4]   2> 17128 T37 oascc.ZkStateReader.updateClusterState Updating cloud state from ZooKeeper... 
[junit4:junit4]   2> 17130 T37 oasc.Overseer$ClusterStateUpdater.updateState Update state numShards=2 message={
[junit4:junit4]   2> 	  "core":"unloadcollection2",
[junit4:junit4]   2> 	  "node_name":"127.0.0.1:43071_rll%2Ft",
[junit4:junit4]   2> 	  "roles":null,
[junit4:junit4]   2> 	  "numShards":"2",
[junit4:junit4]   2> 	  "core_node_name":"127.0.0.1:43071_rll%2Ft_unloadcollection2",
[junit4:junit4]   2> 	  "shard":"shard1",
[junit4:junit4]   2> 	  "state":"active",
[junit4:junit4]   2> 	  "operation":"state",
[junit4:junit4]   2> 	  "collection":"unloadcollection",
[junit4:junit4]   2> 	  "base_url":"http://127.0.0.1:43071/rll/t"}
[junit4:junit4]   2> 17136 T82 oascc.ZkStateReader$2.process A cluster state change: WatchedEvent state:SyncConnected type:NodeDataChanged path:/clusterstate.json, has occurred - updating... (live nodes size: 5)
[junit4:junit4]   2> 17136 T54 oascc.ZkStateReader$2.process A cluster state change: WatchedEvent state:SyncConnected type:NodeDataChanged path:/clusterstate.json, has occurred - updating... (live nodes size: 5)
[junit4:junit4]   2> 17136 T96 oascc.ZkStateReader$2.process A cluster state change: WatchedEvent state:SyncConnected type:NodeDataChanged path:/clusterstate.json, has occurred - updating... (live nodes size: 5)
[junit4:junit4]   2> 17136 T100 oascc.ZkStateReader$2.process A cluster state change: WatchedEvent state:SyncConnected type:NodeDataChanged path:/clusterstate.json, has occurred - updating... (live nodes size: 5)
[junit4:junit4]   2> 17136 T36 oascc.ZkStateReader$2.process A cluster state change: WatchedEvent state:SyncConnected type:NodeDataChanged path:/clusterstate.json, has occurred - updating... (live nodes size: 5)
[junit4:junit4]   2> 17136 T68 oascc.ZkStateReader$2.process A cluster state change: WatchedEvent state:SyncConnected type:NodeDataChanged path:/clusterstate.json, has occurred - updating... (live nodes size: 5)
[junit4:junit4]   2> 17136 T41 oascc.ZkStateReader$2.process A cluster state change: WatchedEvent state:SyncConnected type:NodeDataChanged path:/clusterstate.json, has occurred - updating... (live nodes size: 5)
[junit4:junit4]   2> 17854 T13 oascc.ZkStateReader.updateClusterState Updating cloud state from ZooKeeper... 
[junit4:junit4]   2> 17855 T13 oasc.AbstractDistribZkTestBase.waitForRecoveriesToFinish Recoveries finished - collection: unloadcollection
[junit4:junit4]   2> 17856 T13 oascsi.HttpClientUtil.createClient Creating new http client, config:maxConnections=128&maxConnectionsPerHost=32&followRedirects=false
[junit4:junit4]   2> 17863 T76 oasc.CoreContainer.create Creating SolrCore 'unloadcollection3' using instanceDir: /mnt/ssd/jenkins/workspace/Lucene-Solr-trunk-Linux/solr/build/solr-core/test/J0/./org.apache.solr.cloud.UnloadDistributedZkTest-jetty3-1363902757070/unloadcollection3
[junit4:junit4]   2> 17864 T76 oasc.ZkController.createCollectionZkNode Check for collection zkNode:unloadcollection
[junit4:junit4]   2> 17865 T76 oasc.ZkController.createCollectionZkNode Collection zkNode exists
[junit4:junit4]   2> 17865 T76 oasc.ZkController.readConfigName Load collection config from:/collections/unloadcollection
[junit4:junit4]   2> 17867 T76 oasc.SolrResourceLoader.<init> new SolrResourceLoader for directory: '/mnt/ssd/jenkins/workspace/Lucene-Solr-trunk-Linux/solr/build/solr-core/test/J0/./org.apache.solr.cloud.UnloadDistributedZkTest-jetty3-1363902757070/unloadcollection3/'
[junit4:junit4]   2> 17900 T76 oasc.SolrConfig.<init> Using Lucene MatchVersion: LUCENE_50
[junit4:junit4]   2> 17935 T76 oasc.SolrConfig.<init> Loaded SolrConfig: solrconfig.xml
[junit4:junit4]   2> 17936 T76 oass.IndexSchema.readSchema Reading Solr Schema
[junit4:junit4]   2> 17974 T76 oass.IndexSchema.readSchema Schema name=test
[junit4:junit4]   2> 18399 T76 oass.OpenExchangeRatesOrgProvider.init Initialized with rates=open-exchange-rates.json, refreshInterval=1440.
[junit4:junit4]   2> 18410 T76 oass.IndexSchema.readSchema default search field in schema is text
[junit4:junit4]   2> 18413 T76 oass.IndexSchema.readSchema unique key field: id
[junit4:junit4]   2> 18440 T76 oass.FileExchangeRateProvider.reload Reloading exchange rates from file currency.xml
[junit4:junit4]   2> 18444 T76 oass.FileExchangeRateProvider.reload Reloading exchange rates from file currency.xml
[junit4:junit4]   2> 18449 T76 oass.OpenExchangeRatesOrgProvider.reload Reloading exchange rates from open-exchange-rates.json
[junit4:junit4]   2> 18450 T76 oass.OpenExchangeRatesOrgProvider$OpenExchangeRates.<init> WARNING Unknown key IMPORTANT NOTE
[junit4:junit4]   2> 18451 T76 oass.OpenExchangeRatesOrgProvider$OpenExchangeRates.<init> WARNING Expected key, got STRING
[junit4:junit4]   2> 18451 T76 oass.OpenExchangeRatesOrgProvider.reload Reloading exchange rates from open-exchange-rates.json
[junit4:junit4]   2> 18453 T76 oass.OpenExchangeRatesOrgProvider$OpenExchangeRates.<init> WARNING Unknown key IMPORTANT NOTE
[junit4:junit4]   2> 18453 T76 oass.OpenExchangeRatesOrgProvider$OpenExchangeRates.<init> WARNING Expected key, got STRING
[junit4:junit4]   2> 18454 T76 oasc.SolrCore.initDirectoryFactory org.apache.solr.core.MockDirectoryFactory
[junit4:junit4]   2> 18454 T76 oasc.SolrCore.<init> [unloadcollection3] Opening new SolrCore at /mnt/ssd/jenkins/workspace/Lucene-Solr-trunk-Linux/solr/build/solr-core/test/J0/./org.apache.solr.cloud.UnloadDistributedZkTest-jetty3-1363902757070/unloadcollection3/, dataDir=/mnt/ssd/jenkins/workspace/Lucene-Solr-trunk-Linux/solr/build/solr-core/test/J0/./solrtest-UnloadDistributedZkTest-1363902752720/1363902770559unloadcollection_3n/
[junit4:junit4]   2> 18454 T76 oasc.JmxMonitoredMap.<init> JMX monitoring is enabled. Adding Solr mbeans to JMX Server: com.sun.jmx.mbeanserver.JmxMBeanServer@f89aab
[junit4:junit4]   2> 18455 T76 oasc.SolrCore.initDirectoryFactory org.apache.solr.core.MockDirectoryFactory
[junit4:junit4]   2> 18456 T76 oasc.CachingDirectoryFactory.get return new directory for /mnt/ssd/jenkins/workspace/Lucene-Solr-trunk-Linux/solr/build/solr-core/test/J0/./solrtest-UnloadDistributedZkTest-1363902752720/1363902770559unloadcollection_3n forceNew: false
[junit4:junit4]   2> 18456 T76 oasc.SolrCore.getNewIndexDir New index directory detected: old=null new=/mnt/ssd/jenkins/workspace/Lucene-Solr-trunk-Linux/solr/build/solr-core/test/J0/./solrtest-UnloadDistributedZkTest-1363902752720/1363902770559unloadcollection_3n/index/
[junit4:junit4]   2> 18456 T76 oasc.SolrCore.initIndex WARNING [unloadcollection3] Solr index directory '/mnt/ssd/jenkins/workspace/Lucene-Solr-trunk-Linux/solr/build/solr-core/test/J0/./solrtest-UnloadDistributedZkTest-1363902752720/1363902770559unloadcollection_3n/index' doesn't exist. Creating new index...
[junit4:junit4]   2> 18457 T76 oasc.CachingDirectoryFactory.get return new directory for /mnt/ssd/jenkins/workspace/Lucene-Solr-trunk-Linux/solr/build/solr-core/test/J0/./solrtest-UnloadDistributedZkTest-1363902752720/1363902770559unloadcollection_3n/index forceNew: false
[junit4:junit4]   2> 18459 T76 oasc.SolrDeletionPolicy.onCommit SolrDeletionPolicy.onCommit: commits:num=1
[junit4:junit4]   2> 		commit{dir=MockDirWrapper(RateLimitedDirectoryWrapper(org.apache.lucene.store.RAMDirectory@19133bd lockFactory=org.apache.lucene.store.NativeFSLockFactory@16f2e27)),segFN=segments_1,generation=1,filenames=[segments_1]
[junit4:junit4]   2> 18459 T76 oasc.SolrDeletionPolicy.updateCommits newest commit = 1[segments_1]
[junit4:junit4]   2> 18462 T76 oasup.UpdateRequestProcessorChain.init inserting DistributedUpdateProcessorFactory into updateRequestProcessorChain "dedupe"
[junit4:junit4]   2> 18462 T76 oasup.UpdateRequestProcessorChain.init inserting DistributedUpdateProcessorFactory into updateRequestProcessorChain "stored_sig"
[junit4:junit4]   2> 18463 T76 oasup.UpdateRequestProcessorChain.init inserting DistributedUpdateProcessorFactory into updateRequestProcessorChain "distrib-dup-test-chain-implicit"
[junit4:junit4]   2> 18464 T76 oasc.RequestHandlers.initHandlersFromConfig created standard: solr.StandardRequestHandler
[junit4:junit4]   2> 18465 T76 oasc.RequestHandlers.initHandlersFromConfig created /get: solr.RealTimeGetHandler
[junit4:junit4]   2> 18465 T76 oasc.RequestHandlers.initHandlersFromConfig adding lazy requestHandler: solr.ReplicationHandler
[junit4:junit4]   2> 18465 T76 oasc.RequestHandlers.initHandlersFromConfig created /replication: solr.ReplicationHandler
[junit4:junit4]   2> 18466 T76 oasc.RequestHandlers.initHandlersFromConfig created /update: solr.UpdateRequestHandler
[junit4:junit4]   2> 18467 T76 oasc.RequestHandlers.initHandlersFromConfig created /admin/: org.apache.solr.handler.admin.AdminHandlers
[junit4:junit4]   2> 18469 T76 oashl.XMLLoader.init xsltCacheLifetimeSeconds=60
[junit4:junit4]   2> 18472 T76 oass.SolrIndexSearcher.<init> Opening Searcher@7ef28c main
[junit4:junit4]   2> 18473 T76 oasu.UpdateHandler.clearLog Clearing tlog files, tlogDir=/mnt/ssd/jenkins/workspace/Lucene-Solr-trunk-Linux/solr/build/solr-core/test/J0/./solrtest-UnloadDistributedZkTest-1363902752720/1363902770559unloadcollection_3n/tlog
[junit4:junit4]   2> 18474 T76 oasu.CommitTracker.<init> Hard AutoCommit: disabled
[junit4:junit4]   2> 18474 T76 oasu.CommitTracker.<init> Soft AutoCommit: disabled
[junit4:junit4]   2> 18482 T105 oasc.SolrCore.registerSearcher [unloadcollection3] Registered new searcher Searcher@7ef28c main{StandardDirectoryReader(segments_1:1)}
[junit4:junit4]   2> 18485 T76 oasc.ZkController.publish publishing core=unloadcollection3 state=down
[junit4:junit4]   2> 18486 T76 oasc.ZkController.publish numShards not found on descriptor - reading it from system property
[junit4:junit4]   2> 18643 T37 oascc.ZkStateReader.updateClusterState Updating cloud state from ZooKeeper... 
[junit4:junit4]   2> 18644 T37 oasc.Overseer$ClusterStateUpdater.updateState Update state numShards=2 message={
[junit4:junit4]   2> 	  "core":"unloadcollection3",
[junit4:junit4]   2> 	  "node_name":"127.0.0.1:45600_rll%2Ft",
[junit4:junit4]   2> 	  "roles":null,
[junit4:junit4]   2> 	  "numShards":"2",
[junit4:junit4]   2> 	  "core_node_name":null,
[junit4:junit4]   2> 	  "shard":null,
[junit4:junit4]   2> 	  "state":"down",
[junit4:junit4]   2> 	  "operation":"state",
[junit4:junit4]   2> 	  "collection":"unloadcollection",
[junit4:junit4]   2> 	  "base_url":"http://127.0.0.1:45600/rll/t"}
[junit4:junit4]   2> 18645 T37 oasc.Overseer$ClusterStateUpdater.updateState Collection already exists with numShards=1
[junit4:junit4]   2> 18645 T37 oasc.Overseer$ClusterStateUpdater.updateState Assigning new node to shard shard=shard1
[junit4:junit4]   2> 18734 T54 oascc.ZkStateReader$2.process A cluster state change: WatchedEvent state:SyncConnected type:NodeDataChanged path:/clusterstate.json, has occurred - updating... (live nodes size: 5)
[junit4:junit4]   2> 18734 T36 oascc.ZkStateReader$2.process A cluster state change: WatchedEvent state:SyncConnected type:NodeDataChanged path:/clusterstate.json, has occurred - updating... (live nodes size: 5)
[junit4:junit4]   2> 18735 T41 oascc.ZkStateReader$2.process A cluster state change: WatchedEvent state:SyncConnected type:NodeDataChanged path:/clusterstate.json, has occurred - updating... (live nodes size: 5)
[junit4:junit4]   2> 18735 T82 oascc.ZkStateReader$2.process A cluster state change: WatchedEvent state:SyncConnected type:NodeDataChanged path:/clusterstate.json, has occurred - updating... (live nodes size: 5)
[junit4:junit4]   2> 18735 T96 oascc.ZkStateReader$2.process A cluster state change: WatchedEvent state:SyncConnected type:NodeDataChanged path:/clusterstate.json, has occurred - updating... (live nodes size: 5)
[junit4:junit4]   2> 18734 T68 oascc.ZkStateReader$2.process A cluster state change: WatchedEvent state:SyncConnected type:NodeDataChanged path:/clusterstate.json, has occurred - updating... (live nodes size: 5)
[junit4:junit4]   2> 18735 T100 oascc.ZkStateReader$2.process A cluster state change: WatchedEvent state:SyncConnected type:NodeDataChanged path:/clusterstate.json, has occurred - updating... (live nodes size: 5)
[junit4:junit4]   2> 19488 T76 oasc.CoreContainer.registerCore registering core: unloadcollection3
[junit4:junit4]   2> 19488 T76 oasc.ZkController.register Register replica - core:unloadcollection3 address:http://127.0.0.1:45600/rll/t collection:unloadcollection shard:shard1
[junit4:junit4]   2> 19493 T76 oasc.ZkController.register We are http://127.0.0.1:45600/rll/t/unloadcollection3/ and leader is http://127.0.0.1:44577/rll/t/unloadcollection1/
[junit4:junit4]   2> 19494 T76 oasc.ZkController.register No LogReplay needed for core=unloadcollection3 baseURL=http://127.0.0.1:45600/rll/t
[junit4:junit4]   2> 19494 T76 oasc.ZkController.checkRecovery Core needs to recover:unloadcollection3
[junit4:junit4]   2> 19494 T76 oasu.DefaultSolrCoreState.doRecovery Running recovery - first canceling any ongoing recovery
[junit4:junit4]   2> ASYNC  NEW_CORE C3 name=unloadcollection3 org.apache.solr.core.SolrCore@1e6974f url=http://127.0.0.1:45600/rll/t/unloadcollection3 node=127.0.0.1:45600_rll%2Ft C3_STATE=coll:unloadcollection core:unloadcollection3 props:{core=unloadcollection3, node_name=127.0.0.1:45600_rll%2Ft, state=down, collection=unloadcollection, base_url=http://127.0.0.1:45600/rll/t}
[junit4:junit4]   2> 19495 T106 C3 P45600 oasc.RecoveryStrategy.run Starting recovery process.  core=unloadcollection3 recoveringAfterStartup=true
[junit4:junit4]   2> 19496 T106 C3 P45600 oasc.RecoveryStrategy.doRecovery ###### startupVersions=[]
[junit4:junit4]   2> 19497 T106 C3 P45600 oasc.ZkController.publish publishing core=unloadcollection3 state=recovering
[junit4:junit4]   2> 19498 T106 C3 P45600 oasc.ZkController.publish numShards not found on descriptor - reading it from system property
[junit4:junit4]   2> 19499 T106 C3 P45600 oascsi.HttpClientUtil.createClient Creating new http client, config:maxConnections=128&maxConnectionsPerHost=32&followRedirects=false
[junit4:junit4]   2> 19503 T76 oascc.ZkStateReader.updateClusterState Updating cloud state from ZooKeeper... 
[junit4:junit4]   2> 19504 T76 oasc.CoreContainer.persistFile Persisting cores config to /mnt/ssd/jenkins/workspace/Lucene-Solr-trunk-Linux/solr/build/solr-core/test/J0/./org.apache.solr.cloud.UnloadDistributedZkTest-jetty3-1363902757070/solr.xml
[junit4:junit4]   2> 19515 T76 oasc.SolrXMLSerializer.persistFile Persisting cores config to /mnt/ssd/jenkins/workspace/Lucene-Solr-trunk-Linux/solr/build/solr-core/test/J0/./org.apache.solr.cloud.UnloadDistributedZkTest-jetty3-1363902757070/solr.xml
[junit4:junit4]   2> 19516 T76 oass.SolrDispatchFilter.handleAdminRequest /admin/cores {dataDir=/mnt/ssd/jenkins/workspace/Lucene-Solr-trunk-Linux/solr/build/solr-core/test/J0/./solrtest-UnloadDistributedZkTest-1363902752720/1363902770559unloadcollection_3n&wt=javabin&version=2&name=unloadcollection3&collection=unloadcollection&action=CREATE} status=0 QTime=1653 
[junit4:junit4]   2> 19517 T13 oasc.AbstractDistribZkTestBase.waitForRecoveriesToFinish Wait for recoveries to finish - collection: unloadcollection failOnTimeout:true timeout (sec):230
[junit4:junit4]   2> 19518 T13 oascc.ZkStateReader.updateClusterState Updating cloud state from ZooKeeper... 
[junit4:junit4]   2> 20243 T37 oascc.ZkStateReader.updateClusterState Updating cloud state from ZooKeeper... 
[junit4:junit4]   2> 20244 T37 oasc.Overseer$ClusterStateUpdater.updateState Update state numShards=2 message={
[junit4:junit4]   2> 	  "core":"unloadcollection3",
[junit4:junit4]   2> 	  "node_name":"127.0.0.1:45600_rll%2Ft",
[junit4:junit4]   2> 	  "roles":null,
[junit4:junit4]   2> 	  "numShards":"2",
[junit4:junit4]   2> 	  "core_node_name":"127.0.0.1:45600_rll%2Ft_unloadcollection3",
[junit4:junit4]   2> 	  "shard":"shard1",
[junit4:junit4]   2> 	  "state":"recovering",
[junit4:junit4]   2> 	  "operation":"state",
[junit4:junit4]   2> 	  "collection":"unloadcollection",
[junit4:junit4]   2> 	  "base_url":"http://127.0.0.1:45600/rll/t"}
[junit4:junit4]   2> 20249 T68 oascc.ZkStateReader$2.process A cluster state change: WatchedEvent state:SyncConnected type:NodeDataChanged path:/clusterstate.json, has occurred - updating... (live nodes size: 5)
[junit4:junit4]   2> 20249 T36 oascc.ZkStateReader$2.process A cluster state change: WatchedEvent state:SyncConnected type:NodeDataChanged path:/clusterstate.json, has occurred - updating... (live nodes size: 5)
[junit4:junit4]   2> 20249 T100 oascc.ZkStateReader$2.process A cluster state change: WatchedEvent state:SyncConnected type:NodeDataChanged path:/clusterstate.json, has occurred - updating... (live nodes size: 5)
[junit4:junit4]   2> 20249 T96 oascc.ZkStateReader$2.process A cluster state change: WatchedEvent state:SyncConnected type:NodeDataChanged path:/clusterstate.json, has occurred - updating... (live nodes size: 5)
[junit4:junit4]   2> 20249 T54 oascc.ZkStateReader$2.process A cluster state change: WatchedEvent state:SyncConnected type:NodeDataChanged path:/clusterstate.json, has occurred - updating... (live nodes size: 5)
[junit4:junit4]   2> 20249 T82 oascc.ZkStateReader$2.process A cluster state change: WatchedEvent state:SyncConnected type:NodeDataChanged path:/clusterstate.json, has occurred - updating... (live nodes size: 5)
[junit4:junit4]   2> 20249 T41 oascc.ZkStateReader$2.process A cluster state change: WatchedEvent state:SyncConnected type:NodeDataChanged path:/clusterstate.json, has occurred - updating... (live nodes size: 5)
[junit4:junit4]   2> 20511 T49 oass.SolrDispatchFilter.handleAdminRequest /admin/cores {core=unloadcollection1&wt=javabin&coreNodeName=127.0.0.1:45600_rll%252Ft_unloadcollection3&checkLive=true&version=2&onlyIfLeader=true&state=recovering&nodeName=127.0.0.1:45600_rll%252Ft&action=PREPRECOVERY} status=0 QTime=1001 
[junit4:junit4]   2> 20520 T13 oascc.ZkStateReader.updateClusterState Updating cloud state from ZooKeeper... 
[junit4:junit4]   2> 21522 T13 oascc.ZkStateReader.updateClusterState Updating cloud state from ZooKeeper... 
[junit4:junit4]   2>  C3_STATE=coll:unloadcollection core:unloadcollection3 props:{core=unloadcollection3, node_name=127.0.0.1:45600_rll%2Ft, shard=shard1, state=recovering, collection=unloadcollection, base_url=http://127.0.0.1:45600/rll/t}
[junit4:junit4]   2> 22512 T106 C3 P45600 oasc.RecoveryStrategy.doRecovery Attempting to PeerSync from http://127.0.0.1:44577/rll/t/unloadcollection1/ core=unloadcollection3 - recoveringAfterStartup=true
[junit4:junit4]   2> 22512 T106 C3 P45600 oasu.PeerSync.sync PeerSync: core=unloadcollection3 url=http://127.0.0.1:45600/rll/t START replicas=[http://127.0.0.1:44577/rll/t/unloadcollection1/] nUpdates=100
[junit4:junit4]   2> 22513 T106 C3 P45600 oasu.PeerSync.sync WARNING no frame of reference to tell of we've missed updates
[junit4:junit4]   2> 22513 T106 C3 P45600 oasc.RecoveryStrategy.doRecovery PeerSync Recovery was not successful - trying replication. core=unloadcollection3
[junit4:junit4]   2> 22514 T106 C3 P45600 oasc.RecoveryStrategy.doRecovery Starting Replication Recovery. core=unloadcollection3
[junit4:junit4]   2> 22514 T106 C3 P45600 oasc.RecoveryStrategy.doRecovery Begin buffering updates. core=unloadcollection3
[junit4:junit4]   2> 22514 T106 C3 P45600 oasu.UpdateLog.bufferUpdates Starting to buffer updates. FSUpdateLog{state=ACTIVE, tlog=null}
[junit4:junit4]   2> 22514 T106 C3 P45600 oasc.RecoveryStrategy.replicate Attempting to replicate from http://127.0.0.1:44577/rll/t/unloadcollection1/. core=unloadcollection3
[junit4:junit4]   2> 22514 T106 C3 P45600 oascsi.HttpClientUtil.createClient Creating new http client, config:maxConnections=128&maxConnectionsPerHost=32&followRedirects=false
[junit4:junit4]   2> 22516 T49 C2 P44577 REQ /get {getVersions=100&wt=javabin&version=2&distrib=false&qt=/get} status=0 QTime=0 
[junit4:junit4]   2> 22521 T50 C2 P44577 oasu.DirectUpdateHandler2.commit start commit{,optimize=false,openSearcher=false,waitSearcher=true,expungeDeletes=false,softCommit=false,prepareCommit=false}
[junit4:junit4]   2> 22521 T50 C2 P44577 oasc.SolrDeletionPolicy.onCommit SolrDeletionPolicy.onCommit: commits:num=2
[junit4:junit4]   2> 		commit{dir=MockDirWrapper(RateLimitedDirectoryWrapper(org.apache.lucene.store.RAMDirectory@12d8d20 lockFactory=org.apache.lucene.store.NativeFSLockFactory@1a7c0ba)),segFN=segments_2,generation=2,filenames=[segments_2]
[junit4:junit4]   2> 		commit{dir=MockDirWrapper(RateLimitedDirectoryWrapper(org.apache.lucene.store.RAMDirectory@12d8d20 lockFactory=org.apache.lucene.store.NativeFSLockFactory@1a7c0ba)),segFN=segments_3,generation=3,filenames=[segments_3]
[junit4:junit4]   2> 22522 T50 C2 P44577 oasc.SolrDeletionPolicy.updateCommits newest commit = 3[segments_3]
[junit4:junit4]   2> 22522 T50 C2 P44577 oasu.DirectUpdateHandler2.commit end_commit_flush
[junit4:junit4]   2> 22523 T50 C2 P44577 /update {waitSearcher=true&wt=javabin&commit=true&version=2&commit_end_point=true&softCommit=false&openSearcher=false} {commit=} 0 2
[junit4:junit4]   2> 22524 T106 C3 P45600 oash.ReplicationHandler.inform Commits will be reserved for  10000
[junit4:junit4]   2> 22524 T106 C3 P45600 oash.SnapPuller.<init>  No value set for 'pollInterval'. Timer Task not started.
[junit4:junit4]   2> 22524 T13 oascc.ZkStateReader.updateClusterState Updating cloud state from ZooKeeper... 
[junit4:junit4]   2> 22527 T49 C2 P44577 REQ /replication {wt=javabin&version=2&command=indexversion&qt=/replication} status=0 QTime=0 
[junit4:junit4]   2> 22528 T106 C3 P45600 oash.SnapPuller.fetchLatestIndex Master's generation: 3
[junit4:junit4]   2> 22528 T106 C3 P45600 oash.SnapPuller.fetchLatestIndex Slave's generation: 1
[junit4:junit4]   2> 22529 T106 C3 P45600 oash.SnapPuller.fetchLatestIndex Starting replication process
[junit4:junit4]   2> 22531 T47 C2 P44577 REQ /replication {wt=javabin&version=2&generation=3&command=filelist&qt=/replication} status=0 QTime=0 
[junit4:junit4]   2> 22532 T106 C3 P45600 oash.SnapPuller.fetchLatestIndex Number of files in latest index in master: 1
[junit4:junit4]   2> 22533 T106 C3 P45600 oasc.CachingDirectoryFactory.get return new directory for /mnt/ssd/jenkins/workspace/Lucene-Solr-trunk-Linux/solr/build/solr-core/test/J0/./solrtest-UnloadDistributedZkTest-1363902752720/1363902770559unloadcollection_3n/index.20130321175255230 forceNew: false
[junit4:junit4]   2> 22533 T106 C3 P45600 oash.SnapPuller.fetchLatestIndex Starting download to MockDirWrapper(org.apache.lucene.store.RAMDirectory@f28195 lockFactory=org.apache.lucene.store.NativeFSLockFactory@11a0202) fullCopy=false
[junit4:junit4]   2> 22536 T50 C2 P44577 REQ /replication {file=segments_3&wt=filestream&checksum=true&generation=3&command=filecontent&qt=/replication} status=0 QTime=0 
[junit4:junit4]   2> 22537 T106 C3 P45600 oash.SnapPuller.fetchLatestIndex Total time taken for download : 0 secs
[junit4:junit4]   2> 22539 T106 C3 P45600 oasu.DefaultSolrCoreState.newIndexWriter Creating new IndexWriter...
[junit4:junit4]   2> 22539 T106 C3 P45600 oasu.DefaultSolrCoreState.newIndexWriter Waiting until IndexWriter is unused... core=unloadcollection3
[junit4:junit4]   2> 22541 T106 C3 P45600 oasc.SolrDeletionPolicy.onInit SolrDeletionPolicy.onInit: commits:num=2
[junit4:junit4]   2> 		commit{dir=MockDirWrapper(RateLimitedDirectoryWrapper(org.apache.lucene.store.RAMDirectory@19133bd lockFactory=org.apache.lucene.store.NativeFSLockFactory@16f2e27)),segFN=segments_1,generation=1,filenames=[segments_1]
[junit4:junit4]   2> 		commit{dir=MockDirWrapper(RateLimitedDirectoryWrapper(org.apache.lucene.store.RAMDirectory@19133bd lockFactory=org.apache.lucene.store.NativeFSLockFactory@16f2e27)),segFN=segments_3,generation=3,filenames=[segments_3]
[junit4:junit4]   2> 22541 T106 C3 P45600 oasc.SolrDeletionPolicy.updateCommits newest commit = 3[segments_3]
[junit4:junit4]   2> 22541 T106 C3 P45600 oasu.DefaultSolrCoreState.newIndexWriter New IndexWriter is ready to be used.
[junit4:junit4]   2> 22542 T106 C3 P45600 oass.SolrIndexSearcher.<init> Opening Searcher@c45608 main
[junit4:junit4]   2> 22544 T105 oasc.SolrCore.registerSearcher [unloadcollection3] Registered new searcher Searcher@c45608 main{StandardDirectoryReader(segments_3:1:nrt)}
[junit4:junit4]   2> 22546 T106 C3 P45600 oasc.RecoveryStrategy.replay No replay needed. core=unloadcollection3
[junit4:junit4]   2> 22546 T106 C3 P45600 oasc.RecoveryStrategy.doRecovery Replication Recovery was successful - registering as Active. core=unloadcollection3
[junit4:junit4]   2> 22546 T106 C3 P45600 oasc.ZkController.publish publishing core=unloadcollection3 state=active
[junit4:junit4]   2> 22546 T106 C3 P45600 oasc.ZkController.publish numShards not found on descriptor - reading it from system property
[junit4:junit4]   2> 22548 T106 C3 P45600 oasc.RecoveryStrategy.doRecovery Finished recovery process. core=unloadcollection3
[junit4:junit4]   2> 23260 T37 oascc.ZkStateReader.updateClusterState Updating cloud state from ZooKeeper... 
[junit4:junit4]   2> 23261 T37 oasc.Overseer$ClusterStateUpdater.updateState Update state numShards=2 message={
[junit4:junit4]   2> 	  "core":"unloadcollection3",
[junit4:junit4]   2> 	  "node_name":"127.0.0.1:45600_rll%2Ft",
[junit4:junit4]   2> 	  "roles":null,
[junit4:junit4]   2> 	  "numShards":"2",
[junit4:junit4]   2> 	  "core_node_name":"127.0.0.1:45600_rll%2Ft_unloadcollection3",
[junit4:junit4]   2> 	  "shard":"shard1",
[junit4:junit4]   2> 	  "state":"active",
[junit4:junit4]   2> 	  "operation":"state",
[junit4:junit4]   2> 	  "collection":"unloadcollection",
[junit4:junit4]   2> 	  "base_url":"http://127.0.0.1:45600/rll/t"}
[junit4:junit4]   2> 23281 T68 oascc.ZkStateReader$2.process A cluster state change: WatchedEvent state:SyncConnected type:NodeDataChanged path:/clusterstate.json, has occurred - updating... (live nodes size: 5)
[junit4:junit4]   2> 23281 T36 oascc.ZkStateReader$2.process A cluster state change: WatchedEvent state:SyncConnected type:NodeDataChanged path:/clusterstate.json, has occurred - updating... (live nodes size: 5)
[junit4:junit4]   2> 23282 T100 oascc.ZkStateReader$2.process A cluster state change: WatchedEvent state:SyncConnected type:NodeDataChanged path:/clusterstate.json, has occurred - updating... (live nodes size: 5)
[junit4:junit4]   2> 23282 T82 oascc.ZkStateReader$2.process A cluster state change: WatchedEvent state:SyncConnected type:NodeDataChanged path:/clusterstate.json, has occurred - updating... (live nodes size: 5)
[junit4:junit4]   2> 23282 T96 oascc.ZkStateReader$2.process A cluster state change: WatchedEvent state:SyncConnected type:NodeDataChanged path:/clusterstate.json, has occurred - updating... (live nodes size: 5)
[junit4:junit4]   2> 23282 T54 oascc.ZkStateReader$2.process A cluster state change: WatchedEvent state:SyncConnected type:NodeDataChanged path:/clusterstate.json, has occurred - updating... (live nodes size: 5)
[junit4:junit4]   2> 23282 T41 oascc.ZkStateReader$2.process A cluster state change: WatchedEvent state:SyncConnected type:NodeDataChanged path:/clusterstate.json, has occurred - updating... (live nodes size: 5)
[junit4:junit4]   2> 23527 T13 oascc.ZkStateReader.updateClusterState Updating cloud state from ZooKeeper... 
[junit4:junit4]   2> 23528 T13 oasc.AbstractDistribZkTestBase.waitForRecoveriesToFinish Recoveries finished - collection: unloadcollection
[junit4:junit4]   2> 23529 T13 oascsi.HttpClientUtil.createClient Creating new http client, config:maxConnections=128&maxConnectionsPerHost=32&followRedirects=false
[junit4:junit4]   2>  C3_STATE=coll:unloadcollection core:unloadcollection3 props:{core=unloadcollection3, node_name=127.0.0.1:45600_rll%2Ft, shard=shard1, state=active, collection=unloadcollection, base_url=http://127.0.0.1:45600/rll/t}
[junit4:junit4]   2> 23611 T77 C3 P45600 /update {distrib.from=http://127.0.0.1:44577/rll/t/unloadcollection1/&wt=javabin&version=2&update.distrib=FROMLEADER} {add=[20 (1430155717532188672)]} 0 5
[junit4:junit4]   2>  C1_STATE=coll:unloadcollection core:unloadcollection2 props:{core=unloadcollection2, node_name=127.0.0.1:43071_rll%2Ft, shard=shard1, state=active, collection=unloadcollection, base_url=http://127.0.0.1:43071/rll/t}
[junit4:junit4]   2> 23615 T61 C1 P43071 /update {distrib.from=http://127.0.0.1:44577/rll/t/unloadcollection1/&wt=javabin&version=2&update.distrib=FROMLEADER} {add=[20 (1430155717532188672)]} 0 4
[junit4:junit4]   2> 23616 T49 C2 P44577 /update {distrib.from=http://127.0.0.1:45600/rll/t/unloadcollection3/&wt=javabin&version=2&update.distrib=TOLEADER} {add=[20 (1430155717532188672)]} 0 42
[junit4:junit4]   2> 23616 T75 C3 P45600 /update {wt=javabin&version=2} {add=[20]} 0 60
[junit4:junit4]   2> 23630 T62 C1 P43071 /update {distrib.from=http://127.0.0.1:44577/rll/t/unloadcollection1/&wt=javabin&version=2&update.distrib=FROMLEADER} {add=[21 (1430155717582520320)]} 0 3
[junit4:junit4]   2> 23630 T76 C3 P45600 /update {distrib.from=http://127.0.0.1:44577/rll/t/unloadcollection1/&wt=javabin&version=2&update.distrib=FROMLEADER} {add=[21 (1430155717582520320)]} 0 3
[junit4:junit4]   2> 23631 T47 C2 P44577 /update {distrib.from=http://127.0.0.1:45600/rll/t/unloadcollection3/&wt=javabin&version=2&update.distrib=TOLEADER} {add=[21 (1430155717582520320)]} 0 9
[junit4:junit4]   2> 23632 T78 C3 P45600 /update {wt=javabin&version=2} {add=[21]} 0 13
[junit4:junit4]   2> 23645 T64 C1 P43071 /update {distrib.from=http://127.0.0.1:44577/rll/t/unloadcollection1/&wt=javabin&version=2&update.distrib=FROMLEADER} {add=[22 (1430155717599297536)]} 0 3
[junit4:junit4]   2> 23645 T75 C3 P45600 /update {distrib.from=http://127.0.0.1:44577/rll/t/unloadcollection1/&wt=javabin&version=2&update.distrib=FROMLEADER} {add=[22 (1430155717599297536)]} 0 3
[junit4:junit4]   2> 23646 T50 C2 P44577 /update {distrib.from=http://127.0.0.1:45600/rll/t/unloadcollection3/&wt=javabin&version=2&update.distrib=TOLEADER} {add=[22 (1430155717599297536)]} 0 9
[junit4:junit4]   2> 23647 T77 C3 P45600 /update {wt=javabin&version=2} {add=[22]} 0 12
[junit4:junit4]   2> 23660 T61 C1 P43071 /update {distrib.from=http://127.0.0.1:44577/rll/t/unloadcollection1/&wt=javabin&version=2&update.distrib=FROMLEADER} {add=[23 (1430155717613977600)]} 0 3
[junit4:junit4]   2> 23660 T78 C3 P45600 /update {distrib.from=http://127.0.0.1:44577/rll/t/unloadcollection1/&wt=javabin&version=2&update.distrib=FROMLEADER} {add=[23 (1430155717613977600)]} 0 3
[junit4:junit4]   2> 23662 T48 C2 P44577 /update {distrib.from=http://127.0.0.1:45600/rll/t/unloadcollection3/&wt=javabin&version=2&update.distrib=TOLEADER} {add=[23 (1430155717613977600)]} 0 10
[junit4:junit4]   2> 23662 T76 C3 P45600 /update {wt=javabin&version=2} {add=[23]} 0 13
[junit4:junit4]   2> 23678 T62 C1 P43071 /update {distrib.from=http://127.0.0.1:44577/rll/t/unloadcollection1/&wt=javabin&version=2&update.distrib=FROMLEADER} {add=[24 (1430155717632851968)]} 0 3
[junit4:junit4]   2> 23678 T77 C3 P45600 /update {distrib.from=http://127.0.0.1:44577/rll/t/unloadcollection1/&wt=javabin&version=2&update.distrib=FROMLEADER} {add=[24 (1430155717632851968)]} 0 3
[junit4:junit4]   2> 23679 T49 C2 P44577 /update {distrib.from=http://127.0.0.1:45600/rll/t/unloadcollection3/&wt=javabin&version=2&update.distrib=TOLEADER} {add=[24 (1430155717632851968)]} 0 9
[junit4:junit4]   2> 23680 T75 C3 P45600 /update {wt=javabin&version=2} {add=[24]} 0 15
[junit4:junit4]   2> 23693 T76 C3 P45600 /update {distrib.from=http://127.0.0.1:44577/rll/t/unloadcollection1/&wt=javabin&version=2&update.distrib=FROMLEADER} {add=[25 (1430155717649629184)]} 0 2
[junit4:junit4]   2> 23693 T64 C1 P43071 /update {distrib.from=http://127.0.0.1:44577/rll/t/unloadcollection1/&wt=javabin&version=2&update.distrib=FROMLEADER} {add=[25 (1430155717649629184)]} 0 2
[junit4:junit4]   2> 23694 T47 C2 P44577 /update {distrib.from=http://127.0.0.1:45600/rll/t/unloadcollection3/&wt=javabin&version=2&update.distrib=TOLEADER} {add=[25 (1430155717649629184)]} 0 8
[junit4:junit4]   2> 23695 T78 C3 P45600 /update {wt=javabin&version=2} {add=[25]} 0 12
[junit4:junit4]   2> 23710 T75 C3 P45600 /update {distrib.from=http://127.0.0.1:44577/rll/t/unloadcollection1/&wt=javabin&version=2&update.distrib=FROMLEADER} {add=[26 (1430155717666406400)]} 0 3
[junit4:junit4]   2> 23711 T63 C1 P43071 /update {distrib.from=http://127.0.0.1:44577/rll/t/unloadcollection1/&wt=javabin&version=2&update.distrib=FROMLEADER} {add=[26 (1430155717666406400)]} 0 4
[junit4:junit4]   2> 23712 T50 C2 P44577 /update {distrib.from=http://127.0.0.1:45600/rll/t/unloadcollection3/&wt=javabin&version=2&update.distrib=TOLEADER} {add=[26 (1430155717666406400)]} 0 10
[junit4:junit4]   2> 23714 T77 C3 P45600 /update {wt=javabin&version=2} {add=[26]} 0 16
[junit4:junit4]   2> 23729 T61 C1 P43071 /update {distrib.from=http://127.0.0.1:44577/rll/t/unloadcollection1/&wt=javabin&version=2&update.distrib=FROMLEADER} {add=[27 (1430155717686329344)]} 0 2
[junit4:junit4]   2> 23730 T78 C3 P45600 /update {distrib.from=http://127.0.0.1:44577/rll/t/unloadcollection1/&wt=javabin&version=2&update.distrib=FROMLEADER} {add=[27 (1430155717686329344)]} 0 3
[junit4:junit4]   2> 23731 T48 C2 P44577 /update {distrib.from=http://127.0.0.1:45600/rll/t/unloadcollection3/&wt=javabin&version=2&update.distrib=TOLEADER} {add=[27 (1430155717686329344)]} 0 10
[junit4:junit4]   2> 23732 T76 C3 P45600 /update {wt=javabin&version=2} {add=[27]} 0 15
[junit4:junit4]   2> 23748 T77 C3 P45600 /update {distrib.from=http://127.0.0.1:44577/rll/t/unloadcollection1/&wt=javabin&version=2&update.distrib=FROMLEADER} {add=[28 (1430155717705203712)]} 0 3
[junit4:junit4]   2> 23748 T62 C1 P43071 /update {distrib.from=http://127.0.0.1:44577/rll/t/unloadcollection1/&wt=javabin&version=2&update.distrib=FROMLEADER} {add=[28 (1430155717705203712)]} 0 3
[junit4:junit4]   2> 23750 T47 C2 P44577 /update {distrib.from=http://127.0.0.1:45600/rll/t/unloadcollection3/&wt=javabin&version=2&update.distrib=TOLEADER} {add=[28 (1430155717705203712)]} 0 11
[junit4:junit4]   2> 23751 T75 C3 P45600 /update {wt=javabin&version=2} {add=[28]} 0 15
[junit4:junit4]   2> 23768 T76 C3 P45600 /update {distrib.from=http://127.0.0.1:44577/rll/t/unloadcollection1/&wt=javabin&version=2&update.distrib=FROMLEADER} {add=[29 (1430155717726175232)]} 0 4
[junit4:junit4]   2> 23768 T64 C1 P43071 /update {distrib.from=http://127.0.0.1:44577/rll/t/unloadcollection1/&wt=javabin&version=2&update.distrib=FROMLEADER} {add=[29 (1430155717726175232)]} 0 4
[junit4:junit4]   2> 23769 T50 C2 P44577 /update {distrib.from=http://127.0.0.1:45600/rll/t/unloadcollection3/&wt=javabin&version=2&update.distrib=TOLEADER} {add=[29 (1430155717726175232)]} 0 11
[junit4:junit4]   2> 23771 T78 C3 P45600 /update {wt=javabin&version=2} {add=[29]} 0 17
[junit4:junit4]   2> 23787 T75 C3 P45600 /update {distrib.from=http://127.0.0.1:44577/rll/t/unloadcollection1/&wt=javabin&version=2&update.distrib=FROMLEADER} {add=[30 (1430155717746098176)]} 0 3
[junit4:junit4]   2> 23787 T63 C1 P43071 /update {distrib.from=http://127.0.0.1:44577/rll/t/unloadcollection1/&wt=javabin&version=2&update.distrib=FROMLEADER} {add=[30 (1430155717746098176)]} 0 3
[junit4:junit4]   2> 23788 T49 C2 P44577 /update {distrib.from=http://127.0.0.1:45600/rll/t/unloadcollection3/&wt=javabin&version=2&update.distrib=TOLEADER} {add=[30 (1430155717746098176)]} 0 10
[junit4:junit4]   2> 23789 T77 C3 P45600 /update {wt=javabin&version=2} {add=[30]} 0 15
[junit4:junit4]   2> 23803 T78 C3 P45600 /update {distrib.from=http://127.0.0.1:44577/rll/t/unloadcollection1/&wt=javabin&version=2&update.distrib=FROMLEADER} {add=[31 (1430155717763923968)]} 0 3
[junit4:junit4]   2> 23803 T61 C1 P43071 /update {distrib.from=http://127.0.0.1:44577/rll/t/unloadcollection1/&wt=javabin&version=2&update.distrib=FROMLEADER} {add=[31 (1430155717763923968)]} 0 3
[junit4:junit4]   2> 23804 T48 C2 P44577 /update {distrib.from=http://127.0.0.1:45600/rll/t/unloadcollection3/&wt=javabin&version=2&update.distrib=TOLEADER} {add=[31 (1430155717763923968)]} 0 9
[junit4:junit4]   2> 23805 T76 C3 P45600 /update {wt=javabin&version=2} {add=[31]} 0 13
[junit4:junit4]   2> 23817 T77 C3 P45600 /update {distrib.from=http://127.0.0.1:44577/rll/t/unloadcollection1/&wt=javabin&version=2&update.distrib=FROMLEADER} {add=[32 (1430155717780701184)]} 0 2
[junit4:junit4]   2> 23818 T62 C1 P43071 /update {distrib.from=http://127.0.0.1:44577/rll/t/unloadcollection1/&wt=javabin&version=2&update.distrib=FROMLEADER} {add=[32 (1430155717780701184)]} 0 3
[junit4:junit4]   2> 23819 T47 C2 P44577 /update {distrib.from=http://127.0.0.1:45600/rll/t/unloadcollection3/&wt=javabin&version=2&update.distrib=TOLEADER} {add=[32 (1430155717780701184)]} 0 8
[junit4:junit4]   2> 23820 T75 C3 P45600 /update {wt=javabin&version=2} {add=[32]} 0 12
[junit4:junit4]   2> 23833 T76 C3 P45600 /update {distrib.from=http://127.0.0.1:44577/rll/t/unloadcollection1/&wt=javabin&version=2&update.distrib=FROMLEADER} {add=[33 (1430155717796429824)]} 0 2
[junit4:junit4]   2> 23833 T64 C1 P43071 /update {distrib.from=http://127.0.0.1:44577/rll/t/unloadcollection1/&wt=javabin&version=2&update.distrib=FROMLEADER} {add=[33 (1430155717796429824)]} 0 2
[junit4:junit4]   2> 23834 T50 C2 P44577 /update {distrib.from=http://127.0.0.1:45600/rll/t/unloadcollection3/&wt=javabin&version=2&update.distrib=TOLEADER} {add=[33 (1430155717796429824)]} 0 9
[junit4:junit4]   2> 23835 T78 C3 P45600 /update {wt=javabin&version=2} {add=[33]} 0 12
[junit4:junit4]   2> 23847 T63 C1 P43071 /update {distrib.from=http://127.0.0.1:44577/rll/t/unloadcollection1/&wt=javabin&version=2&update.distrib=FROMLEADER} {add=[34 (1430155717812158464)]} 0 2
[junit4:junit4]   2> 23848 T75 C3 P45600 /update {distrib.from=http://127.0.0.1:44577/rll/t/unloadcollection1/&wt=javabin&version=2&update.distrib=FROMLEADER} {add=[34 (1430155717812158464)]} 0 3
[junit4:junit4]   2> 23849 T49 C2 P44577 /update {distrib.from=http://127.0.0.1:45600/rll/t/unloadcollection3/&wt=javabin&version=2&update.distrib=TOLEADER} {add=[34 (1430155717812158464)]} 0 9
[junit4:junit4]   2> 23850 T77 C3 P45600 /update {wt=javabin&version=2} {add=[34]} 0 12
[junit4:junit4]   2> 23867 T78 C3 P45600 /update {distrib.from=http://127.0.0.1:44577/rll/t/unloadcollection1/&wt=javabin&version=2&update.distrib=FROMLEADER} {add=[35 (1430155717826838528)]} 0 3
[junit4:junit4]   2> 23872 T61 C1 P43071 /update {distrib.from=http://127.0.0.1:44577/rll/t/unloadcollection1/&wt=javabin&version=2&update.distrib=FROMLEADER} {add=[35 (1430155717826838528)]} 0 2
[junit4:junit4]   2> 23873 T48 C2 P44577 /update {distrib.from=http://127.0.0.1:45600/rll/t/unloadcollection3/&wt=javabin&version=2&update.distrib=TOLEADER} {add=[35 (1430155717826838528)]} 0 18
[junit4:junit4]   2> 23874 T76 C3 P45600 /update {wt=javabin&version=2} {add=[35]} 0 22
[junit4:junit4]   2> 23887 T77 C3 P45600 /update {distrib.from=http://127.0.0.1:44577/rll/t/unloadcollection1/&wt=javabin&version=2&update.distrib=FROMLEADER} {add=[36 (1430155717853052928)]} 0 2
[junit4:junit4]   2> 23888 T62 C1 P43071 /update {distrib.from=http://127.0.0.1:44577/rll/t/unloadcollection1/&wt=javabin&version=2&update.distrib=FROMLEADER} {add=[36 (1430155717853052928)]} 0 3
[junit4:junit4]   2> 23889 T47 C2 P44577 /update {distrib.from=http://127.0.0.1:45600/rll/t/unloadcollection3/&wt=javabin&version=2&update.distrib=TOLEADER} {add=[36 (1430155717853052928)]} 0 9
[junit4:junit4]   2> 23890 T75 C3 P45600 /update {wt=javabin&version=2} {add=[36]} 0 13
[junit4:junit4]   2> 23902 T76 C3 P45600 /update {distrib.from=http://127.0.0.1:44577/rll/t/unloadcollection1/&wt=javabin&version=2&update.distrib=FROMLEADER} {add=[37 (1430155717868781568)]} 0 2
[junit4:junit4]   2> 23902 T64 C1 P43071 /update {distrib.from=http://127.0.0.1:44577/rll/t/unloadcollection1/&wt=javabin&version=2&update.distrib=FROMLEADER} {add=[37 (1430155717868781568)]} 0 2
[junit4:junit4]   2> 23903 T50 C2 P44577 /update {distrib.from=http://127.0.0.1:45600/rll/t/unloadcollection3/&wt=javabin&version=2&update.distrib=TOLEADER} {add=[37 (1430155717868781568)]} 0 8
[junit4:junit4]   2> 23904 T78 C3 P45600 /update {wt=javabin&version=2} {add=[37]} 0 11
[junit4:junit4]   2> 23916 T63 C1 P43071 /update {distrib.from=http://127.0.0.1:44577/rll/t/unloadcollection1/&wt=javabin&version=2&update.distrib=FROMLEADER} {add=[38 (1430155717884510208)]} 0 2
[junit4:junit4]   2> 23916 T75 C3 P45600 /update {distrib.from=http://127.0.0.1:44577/rll/t/unloadcollection1/&wt=javabin&version=2&update.distrib=FROMLEADER} {add=[38 (1430155717884510208)]} 0 2
[junit4:junit4]   2> 23917 T49 C2 P44577 /update {distrib.from=http://127.0.0.1:45600/rll/t/unloadcollection3/&wt=javabin&version=2&update.distrib=TOLEADER} {add=[38 (1430155717884510208)]} 0 8
[junit4:junit4]   2> 23918 T77 C3 P45600 /update {wt=javabin&version=2} {add=[38]} 0 11
[junit4:junit4]   2> 23932 T61 C1 P43071 /update {distrib.from=http://127.0.0.1:44577/rll/t/unloadcollection1/&wt=javabin&version=2&update.distrib=FROMLEADER} {add=[39 (1430155717899190272)]} 0 2
[junit4:junit4]   2> 23932 T78 C3 P45600 /update {distrib.from=http://127.0.0.1:44577/rll/t/unloadcollection1/&wt=javabin&version=2&update.distrib=FROMLEADER} {add=[39 (1430155717899190272)]} 0 2
[junit4:junit4]   2> 23933 T48 C2 P44577 /update {distrib.from=http://127.0.0.1:45600/rll/t/unloadcollection3/&wt=javabin&version=2&update.distrib=TOLEADER} {add=[39 (1430155717899190272)]} 0 9
[junit4:junit4]   2> 23934 T76 C3 P45600 /update {wt=javabin&version=2} {add=[39]} 0 13
[junit4:junit4]   2> 23947 T77 C3 P45600 /update {distrib.from=http://127.0.0.1:44577/rll/t/unloadcollection1/&wt=javabin&version=2&update.distrib=FROMLEADER} {add=[40 (1430155717915967488)]} 0 2
[junit4:junit4]   2> 23947 T62 C1 P43071 /update {distrib.from=http://127.0.0.1:44577/rll/t/unloadcollection1/&wt=javabin&version=2&update.distrib=FROMLEADER} {add=[40 (1430155717915967488)]} 0 2
[junit4:junit4]   2> 23948 T47 C2 P44577 /update {distrib.from=http://127.0.0.1:45600/rll/t/unloadcollection3/&wt=javabin&version=2&update.distrib=TOLEADER} {add=[40 (1430155717915967488)]} 0 8
[junit4:junit4]   2> 23949 T75 C3 P45600 /update {wt=javabin&version=2} {add=[40]} 0 12
[junit4:junit4]   2> 23963 T77 C3 P45600 /update {distrib.from=http://127.0.0.1:44577/rll/t/unloadcollection1/&wt=javabin&version=2&update.distrib=FROMLEADER} {add=[41 (1430155717931696128)]} 0 3
[junit4:junit4]   2> 23963 T64 C1 P43071 /update {distrib.from=http://127.0.0.1:44577/rll/t/unloadcollection1/&wt=javabin&version=2&update.distrib=FROMLEADER} {add=[41 (1430155717931696128)]} 0 3
[junit4:junit4]   2> 23965 T50 C2 P44577 /update {distrib.from=http://127.0.0.1:45600/rll/t/unloadcollection3/&wt=javabin&version=2&update.distrib=TOLEADER} {add=[41 (1430155717931696128)]} 0 10
[junit4:junit4]   2> 23966 T76 C3 P45600 /update {wt=javabin&version=2} {add=[41]} 0 14
[junit4:junit4]   2> 23979 T63 C1 P43071 /update {distrib.from=http://127.0.0.1:44577/rll/t/unloadcollection1/&wt=javabin&version=2&update.distrib=FROMLEADER} {add=[42 (1430155717949521920)]} 0 2
[junit4:junit4]   2> 23979 T78 C3 P45600 /update {distrib.from=http://127.0.0.1:44577/rll/t/unloadcollection1/&wt=javabin&version=2&update.distrib=FROMLEADER} {add=[42 (1430155717949521920)]} 0 2
[junit4:junit4]   2> 23980 T49 C2 P44577 /update {distrib.from=http://127.0.0.1:45600/rll/t/unloadcollection3/&wt=javabin&version=2&update.distrib=TOLEADER} {add=[42 (1430155717949521920)]} 0 9
[junit4:junit4]   2> 23981 T75 C3 P45600 /update {wt=javabin&version=2} {add=[42]} 0 13
[junit4:junit4]   2> 23992 T61 C1 P43071 /update {distrib.from=http://127.0.0.1:44577/rll/t/unloadcollection1/&wt=javabin&version=2&update.distrib=FROMLEADER} {add=[43 (1430155717964201984)]} 0 2
[junit4:junit4]   2> 23992 T76 C3 P45600 /update {distrib.from=http://127.0.0.1:44577/rll/t/unloadcollection1/&wt=javabin&version=2&update.distrib=FROMLEADER} {add=[43 (1430155717964201984)]} 0 1
[junit4:junit4]   2> 23994 T48 C2 P44577 /update {distrib.from=http://127.0.0.1:45600/rll/t/unloadcollection3/&wt=javabin&version=2&update.distrib=TOLEADER} {add=[43 (1430155717964201984)]} 0 8
[junit4:junit4]   2> 23994 T77 C3 P45600 /update {wt=javabin&version=2} {add=[43]} 0 10
[junit4:junit4]   2> 24010 T62 C1 P43071 /update {distrib.from=http://127.0.0.1:44577/rll/t/unloadcollection1/&wt=javabin&version=2&update.distrib=FROMLEADER} {add=[44 (1430155717979930624)]} 0 5
[junit4:junit4]   2> 24010 T75 C3 P45600 /update {distrib.from=http://127.0.0.1:44577/rll/t/unloadcollection1/&wt=javabin&version=2&update.distrib=FROMLEADER} {add=[44 (1430155717979930624)]} 0 5
[junit4:junit4]   2> 24011 T47 C2 P44577 /update {distrib.from=http://127.0.0.1:45600/rll/t/unloadcollection3/&wt=javabin&version=2&update.distrib=TOLEADER} {add=[44 (1430155717979930624)]} 0 11
[junit4:junit4]   2> 24012 T78 C3 P45600 /update {wt=javabin&version=2} {add=[44]} 0 15
[junit4:junit4]   2> 24026 T63 C1 P43071 /update {distrib.from=http://127.0.0.1:44577/rll/t/unloadcollection1/&wt=javabin&version=2&update.distrib=FROMLEADER} {add=[45 (1430155717998804992)]} 0 3
[junit4:junit4]   2> 24028 T76 C3 P45600 /update {distrib.from=http://127.0.0.1:44577/rll/t/unloadcollection1/&wt=javabin&version=2&update.distrib=FROMLEADER} {add=[45 (1430155717998804992)]} 0 2
[junit4:junit4]   2> 24029 T50 C2 P44577 /update {distrib.from=http://127.0.0.1:45600/rll/t/unloadcollection3/&wt=javabin&version=2&update.distrib=TOLEADER} {add=[45 (1430155717998804992)]} 0 11
[junit4:junit4]   2> 24030 T77 C3 P45600 /update {wt=javabin&version=2} {add=[45]} 0 15
[junit4:junit4]   2> 24043 T78 C3 P45600 /update {distrib.from=http://127.0.0.1:44577/rll/t/unloadcollection1/&wt=javabin&version=2&update.distrib=FROMLEADER} {add=[46 (1430155718016630784)]} 0 2
[junit4:junit4]   2> 24043 T61 C1 P43071 /update {distrib.from=http://127.0.0.1:44577/rll/t/unloadcollection1/&wt=javabin&version=2&update.distrib=FROMLEADER} {add=[46 (1430155718016630784)]} 0 2
[junit4:junit4]   2> 24044 T49 C2 P44577 /update {distrib.from=http://127.0.0.1:45600/rll/t/unloadcollection3/&wt=javabin&version=2&update.distrib=TOLEADER} {add=[46 (1430155718016630784)]} 0 9
[junit4:junit4]   2> 24046 T75 C3 P45600 /update {wt=javabin&version=2} {add=[46]} 0 13
[junit4:junit4]   2> 24060 T64 C1 P43071 /update {distrib.from=http://127.0.0.1:44577/rll/t/unloadcollection1/&wt=javabin&version=2&update.distrib=FROMLEADER} {add=[47 (1430155718034456576)]} 0 3
[junit4:junit4]   2> 24060 T77 C3 P45600 /update {distrib.from=http://127.0.0.1:44577/rll/t/unloadcollection1/&wt=javabin&version=2&update.distrib=FROMLEADER} {add=[47 (1430155718034456576)]} 0 2
[junit4:junit4]   2> 24067 T48 C2 P44577 /update {distrib.from=http://127.0.0.1:45600/rll/t/unloadcollection3/&wt=javabin&version=2&update.distrib=TOLEADER} {add=[47 (1430155718034456576)]} 0 15
[junit4:junit4]   2> 24068 T76 C3 P45600 /update {wt=javabin&version=2} {add=[47]} 0 19
[junit4:junit4]   2> 24080 T75 C3 P45600 /update {distrib.from=http://127.0.0.1:44577/rll/t/unloadcollection1/&wt=javabin&version=2&update.distrib=FROMLEADER} {add=[48 (1430155718056476672)]} 0 2
[junit4:junit4]   2> 24081 T62 C1 P43071 /update {distrib.from=http://127.0.0.1:44577/rll/t/unloadcollection1/&wt=javabin&version=2&update.distrib=FROMLEADER} {add=[48 (1430155718056476672)]} 0 3
[junit4:junit4]   2> 24082 T47 C2 P44577 /update {distrib.from=http://127.0.0.1:45600/rll/t/unloadcollection3/&wt=javabin&version=2&update.distrib=TOLEADER} {add=[48 (1430155718056476672)]} 0 8
[junit4:junit4]   2> 24083 T78 C3 P45600 /update {wt=javabin&version=2} {add=[48]} 0 12
[junit4:junit4]   2> 24094 T63 C1 P43071 /update {distrib.from=http://127.0.0.1:44577/rll/t/unloadcollection1/&wt=javabin&version=2&update.distrib=FROMLEADER} {add=[49 (1430155718071156736)]} 0 2
[junit4:junit4]   2> 24094 T76 C3 P45600 /update {distrib.from=http://127.0.0.1:44577/rll/t/unloadcollection1/&wt=javabin&version=2&update.distrib=FROMLEADER} {add=[49 (1430155718071156736)]} 0 2
[junit4:junit4]   2> 24095 T50 C2 P44577 /update {distrib.from=http://127.0.0.1:45600/rll/t/unloadcollection3/&wt=javabin&version=2&update.distrib=TOLEADER} {add=[49 (1430155718071156736)]} 0 7
[junit4:junit4]   2> 24095 T77 C3 P45600 /update {wt=javabin&version=2} {add=[49]} 0 10
[junit4:junit4]   2> 24106 T78 C3 P45600 /update {distrib.from=http://127.0.0.1:44577/rll/t/unloadcollection1/&wt=javabin&version=2&update.distrib=FROMLEADER} {add=[50 (1430155718084788224)]} 0 2
[junit4:junit4]   2> 24106 T61 C1 P43071 /update {distrib.from=http://127.0.0.1:44577/rll/t/unloadcollection1/&wt=javabin&version=2&update.distrib=FROMLEADER} {add=[50 (1430155718084788224)]} 0 2
[junit4:junit4]   2> 24107 T49 C2 P44577 /update {distrib.from=http://127.0.0.1:45600/rll/t/unloadcollection3/&wt=javabin&version=2&update.distrib=TOLEADER} {add=[50 (1430155718084788224)]} 0 7
[junit4:junit4]   2> 24108 T75 C3 P45600 /update {wt=javabin&version=2} {add=[50]} 0 10
[junit4:junit4]   2> 24119 T64 C1 P43071 /update {distrib.from=http://127.0.0.1:44577/rll/t/unloadcollection1/&wt=javabin&version=2&update.distrib=FROMLEADER} {add=[51 (1430155718097371136)]} 0 2
[junit4:junit4]   2> 24119 T77 C3 P45600 /update {distrib.from=http://127.0.0.1:44577/rll/t/unloadcollection1/&wt=javabin&version=2&update.distrib=FROMLEADER} {add=[51 (1430155718097371136)]} 0 2
[junit4:junit4]   2> 24120 T48 C2 P44577 /update {distrib.from=http://127.0.0.1:45600/rll/t/unloadcollection3/&wt=javabin&version=2&update.distrib=TOLEADER} {add=[51 (1430155718097371136)]} 0 7
[junit4:junit4]   2> 24121 T76 C3 P45600 /update {wt=javabin&version=2} {add=[51]} 0 11
[junit4:junit4]   2> 24132 T62 C1 P43071 /update {distrib.from=http://127.0.0.1:44577/rll/t/unloadcollection1/&wt=javabin&version=2&update.distrib=FROMLEADER} {add=[52 (1430155718111002624)]} 0 2
[junit4:junit4]   2> 24132 T75 C3 P45600 /update {distrib.from=http://127.0.0.1:44577/rll/t/unloadcollection1/&wt=javabin&version=2&update.distrib=FROMLEADER} {add=[52 (1430155718111002624)]} 0 2
[junit4:junit4]   2> 24133 T47 C2 P44577 /update {distrib.from=http://127.0.0.1:45600/rll/t/unloadcollection3/&wt=javabin&version=2&update.distrib=TOLEADER} {add=[52 (1430155718111002624)]} 0 7
[junit4:junit4]   2> 24134 T78 C3 P45600 /update {wt=javabin&version=2} {add=[52]} 0 11
[junit4:junit4]   2> 24144 T76 C3 P45600 /update {distrib.from=http://127.0.0.1:44577/rll/t/unloadcollection1/&wt=javabin&version=2&update.distrib=FROMLEADER} {add=[53 (1430155718124634112)]} 0 1
[junit4:junit4]   2> 24145 T63 C1 P43071 /update {distrib.from=http://127.0.0.1:44577/rll/t/unloadcollection1/&wt=javabin&version=2&update.distrib=FROMLEADER} {add=[53 (1430155718124634112)]} 0 2
[junit4:junit4]   2> 24146 T49 C2 P44577 /update {distrib.from=http://127.0.0.1:45600/rll/t/unloadcollection3/&wt=javabin&version=2&update.distrib=TOLEADER} {add=[53 (1430155718124634112)]} 0 7
[junit4:junit4]   2> 24146 T77 C3 P45600 /update {wt=javabin&version=2} {add=[53]} 0 10
[junit4:junit4]   2> 24157 T61 C1 P43071 /update {distrib.from=http://127.0.0.1:44577/rll/t/unloadcollection1/&wt=javabin&version=2&update.distrib=FROMLEADER} {add=[54 (1430155718138265600)]} 0 2
[junit4:junit4]   2> 24157 T78 C3 P45600 /update {distrib.from=http://127.0.0.1:44577/rll/t/unloadcollection1/&wt=javabin&version=2&update.distrib=FROMLEADER} {add=[54 (1430155718138265600)]} 0 2
[junit4:junit4]   2> 24158 T50 C2 P44577 /update {distrib.from=http://127.0.0.1:45600/rll/t/unloadcollection3/&wt=javabin&version=2&update.distrib=TOLEADER} {add=[54 (1430155718138265600)]} 0 7
[junit4:junit4]   2> 24158 T75 C3 P45600 /update {wt=javabin&version=2} {add=[54]} 0 9
[junit4:junit4]   2> 24169 T77 C3 P45600 /update {distrib.from=http://127.0.0.1:44577/rll/t/unloadcollection1/&wt=javabin&version=2&update.distrib=FROMLEADER} {add=[55 (1430155718150848512)]} 0 2
[junit4:junit4]   2> 24169 T64 C1 P43071 /update {distrib.from=http://127.0.0.1:44577/rll/t/unloadcollection1/&wt=javabin&version=2&update.distrib=FROMLEADER} {add=[55 (1430155718150848512)]} 0 2
[junit4:junit4]   2> 24170 T47 C2 P44577 /update {distrib.from=http://127.0.0.1:45600/rll/t/unloadcollection3/&wt=javabin&version=2&update.distrib=TOLEADER} {add=[55 (1430155718150848512)]} 0 7
[junit4:junit4]   2> 24171 T76 C3 P45600 /update {wt=javabin&version=2} {add=[55]} 0 10
[junit4:junit4]   2> 24182 T75 C3 P45600 /update {distrib.from=http://127.0.0.1:44577/rll/t/unloadcollection1/&wt=javabin&version=2&update.distrib=FROMLEADER} {add=[56 (1430155718163431424)]} 0 2
[junit4:junit4]   2> 24182 T62 C1 P43071 /update {distrib.from=http://127.0.0.1:44577/rll/t/unloadcollection1/&wt=javabin&version=2&update.distrib=FROMLEADER} {add=[56 (1430155718163431424)]} 0 2
[junit4:junit4]   2> 24183 T48 C2 P44577 /update {distrib.from=http://127.0.0.1:45600/rll/t/unloadcollection3/&wt=javabin&version=2&update.distrib=TOLEADER} {add=[56 (1430155718163431424)]} 0 7
[junit4:junit4]   2> 24184 T78 C3 P45600 /update {wt=javabin&version=2} {add=[56]} 0 11
[junit4:junit4]   2> 24195 T76 C3 P45600 /update {distrib.from=http://127.0.0.1:44577/rll/t/unloadcollection1/&wt=javabin&version=2&update.distrib=FROMLEADER} {add=[57 (1430155718177062912)]} 0 2
[junit4:junit4]   2> 24195 T63 C1 P43071 /update {distrib.from=http://127.0.0.1:44577/rll/t/unloadcollection1/&wt=javabin&version=2&update.distrib=FROMLEADER} {add=[57 (1430155718177062912)]} 0 2
[junit4:junit4]   2> 24196 T49 C2 P44577 /update {distrib.from=http://127.0.0.1:45600/rll/t/unloadcollection3/&wt=javabin&version=2&update.distrib=TOLEADER} {add=[57 (1430155718177062912)]} 0 7
[junit4:junit4]   2> 24196 T77 C3 P45600 /update {wt=javabin&version=2} {add=[57]} 0 10
[junit4:junit4]   2> 24207 T61 C1 P43071 /update {distrib.from=http://127.0.0.1:44577/rll/t/unloadcollection1/&wt=javabin&version=2&update.distrib=FROMLEADER} {add=[58 (1430155718190694400)]} 0 2
[junit4:junit4]   2> 24207 T78 C3 P45600 /update {distrib.from=http://127.0.0.1:44577/rll/t/unloadcollection1/&wt=javabin&version=2&update.distrib=FROMLEADER} {add=[58 (1430155718190694400)]} 0 2
[junit4:junit4]   2> 24208 T50 C2 P44577 /update {distrib.from=http://127.0.0.1:45600/rll/t/unloadcollection3/&wt=javabin&version=2&update.distrib=TOLEADER} {add=[58 (1430155718190694400)]} 0 7
[junit4:junit4]   2> 24209 T75 C3 P45600 /update {wt=javabin&version=2} {add=[58]} 0 10
[junit4:junit4]   2> 24220 T77 C3 P45600 /update {distrib.from=http://127.0.0.1:44577/rll/t/unloadcollection1/&wt=javabin&version=2&update.distrib=FROMLEADER} {add=[59 (1430155718204325888)]} 0 2
[junit4:junit4]   2> 24220 T64 C1 P43071 /update {distrib.from=http://127.0.0.1:44577/rll/t/unloadcollection1/&wt=javabin&version=2&update.distrib=FROMLEADER} {add=[59 (1430155718204325888)]} 0 2
[junit4:junit4]   2> 24221 T47 C2 P44577 /update {distrib.from=http://127.0.0.1:45600/rll/t/unloadcollection3/&wt=javabin&version=2&update.distrib=TOLEADER} {add=[59 (1430155718204325888)]} 0 7
[junit4:junit4]   2> 24222 T76 C3 P45600 /update {wt=javabin&version=2} {add=[59]} 0 9
[junit4:junit4]   2> 24233 T75 C3 P45600 /update {distrib.from=http://127.0.0.1:44577/rll/t/unloadcollection1/&wt=javabin&version=2&update.distrib=FROMLEADER} {add=[60 (1430155718216908800)]} 0 3
[junit4:junit4]   2> 24233 T62 C1 P43071 /update {distrib.from=http://127.0.0.1:44577/rll/t/unloadcollection1/&wt=javabin&version=2&update.distrib=FROMLEADER} {add=[60 (1430155718216908800)]} 0 2
[junit4:junit4]   2> 24234 T48 C2 P44577 /update {distrib.from=http://127.0.0.1:45600/rll/t/unloadcollection3/&wt=javabin&version=2&update.distrib=TOLEADER} {add=[60 (1430155718216908800)]} 0 7
[junit4:junit4]   2> 24234 T78 C3 P45600 /update {wt=javabin&version=2} {add=[60]} 0 10
[junit4:junit4]   2> 24247 T63 C1 P43071 /update {distrib.from=http://127.0.0.1:44577/rll/t/unloadcollection1/&wt=javabin&version=2&update.distrib=FROMLEADER} {add=[61 (1430155718232637440)]} 0 2
[junit4:junit4]   2> 24247 T76 C3 P45600 /update {distrib.from=http://127.0.0.1:44577/rll/t/unloadcollection1/&wt=javabin&version=2&update.distrib=FROMLEADER} {add=[61 (1430155718232637440)]} 0 2
[junit4:junit4]   2> 24248 T49 C2 P44577 /update {distrib.from=http://127.0.0.1:45600/rll/t/unloadcollection3/&wt=javabin&version=2&update.distrib=TOLEADER} {add=[61 (1430155718232637440)]} 0 7
[junit4:junit4]   2> 24249 T77 C3 P45600 /update {wt=javabin&version=2} {add=[61]} 0 12
[junit4:junit4]   2> 24260 T78 C3 P45600 /update {distrib.from=http://127.0.0.1:44577/rll/t/unloadcollection1/&wt=javabin&version=2&update.distrib=FROMLEADER} {add=[62 (1430155718245220352)]} 0 2
[junit4:junit4]   2> 24260 T61 C1 P43071 /update {distrib.from=http://127.0.0.1:44577/rll/t/unloadcollection1/&wt=javabin&version=2&update.distrib=FROMLEADER} {add=[62 (1430155718245220352)]} 0 2
[junit4:junit4]   2> 24261 T50 C2 P44577 /update {distrib.from=http://127.0.0.1:45600/rll/t/unloadcollection3/&wt=javabin&version=2&update.distrib=TOLEADER} {add=[62 (1430155718245220352)]} 0 7
[junit4:junit4]   2> 24261 T75 C3 P45600 /update {wt=javabin&version=2} {add=[62]} 0 10
[junit4:junit4]   2> 24272 T77 C3 P45600 /update {distrib.from=http://127.0.0.1:44577/rll/t/unloadcollection1/&wt=javabin&version=2&update.distrib=FROMLEADER} {add=[63 (1430155718258851840)]} 0 1
[junit4:junit4]   2> 24272 T64 C1 P43071 /update {distrib.from=http://127.0.0.1:44577/rll/t/unloadcollection1/&wt=javabin&version=2&update.distrib=FROMLEADER} {add=[63 (1430155718258851840)]} 0 2
[junit4:junit4]   2> 24273 T47 C2 P44577 /update {distrib.from=http://127.0.0.1:45600/rll/t/unloadcollection3/&wt=javabin&version=2&update.distrib=TOLEADER} {add=[63 (1430155718258851840)]} 0 7
[junit4:junit4]   2> 24274 T76 C3 P45600 /update {wt=javabin&version=2} {add=[63]} 0 10
[junit4:junit4]   2> 24284 T75 C3 P45600 /update {distrib.from=http://127.0.0.1:44577/rll/t/unloadcollection1/&wt=javabin&version=2&update.distrib=FROMLEADER} {add=[64 (1430155718271434752)]} 0 1
[junit4:junit4]   2> 24284 T62 C1 P43071 /update {distrib.from=http://127.0.0.1:44577/rll/t/unloadcollection1/&wt=javabin&version=2&update.distrib=FROMLEADER} {add=[64 (1430155718271434752)]} 0 1
[junit4:junit4]   2> 24285 T48 C2 P44577 /update {distrib.from=http://127.0.0.1:45600/rll/t/unloadcollection3/&wt=javabin&version=2&update.distrib=TOLEADER} {add=[64 (1430155718271434752)]} 0 6
[junit4:junit4]   2> 24286 T78 C3 P45600 /update {wt=javabin&version=2} {add=[64]} 0 9
[junit4:junit4]   2> 24297 T63 C1 P43071 /update {distrib.from=http://127.0.0.1:44577/rll/t/unloadcollection1/&wt=javabin&version=2&update.distrib=FROMLEADER} {add=[65 (1430155718284017664)]} 0 2
[junit4:junit4]   2> 24297 T76 C3 P45600 /update {distrib.from=http://127.0.0.1:44577/rll/t/unloadcollection1/&wt=javabin&version=2&update.distrib=FROMLEADER} {add=[65 (1430155718284017664)]} 0 2
[junit4:junit4]   2> 24298 T49 C2 P44577 /update {distrib.from=http://127.0.0.1:45600/rll/t/unloadcollection3/&wt=javabin&version=2&update.distrib=TOLEADER} {add=[65 (1430155718284017664)]} 0 7
[junit4:junit4]   2> 24298 T77 C3 P45600 /update {wt=javabin&version=2} {add=[65]} 0 10
[junit4:junit4]   2> 24309 T78 C3 P45600 /update {distrib.from=http://127.0.0.1:44577/rll/t/unloadcollection1/&wt=javabin&version=2&update.distrib=FROMLEADER} {add=[66 (1430155718297649152)]} 0 2
[junit4:junit4]   2> 24309 T61 C1 P43071 /update {distrib.from=http://127.0.0.1:44577/rll/t/unloadcollection1/&wt=javabin&version=2&update.distrib=FROMLEADER} {add=[66 (1430155718297649152)]} 0 2
[junit4:junit4]   2> 24310 T50 C2 P44577 /update {distrib.from=http://127.0.0.1:45600/rll/t/unloadcollection3/&wt=javabin&version=2&update.distrib=TOLEADER} {add=[66 (1430155718297649152)]} 0 7
[junit4:junit4]   2> 24311 T75 C3 P45600 /update {wt=javabin&version=2} {add=[66]} 0 10
[junit4:junit4]   2> 24321 T77 C3 P45600 /update {distrib.from=http://127.0.0.1:44577/rll/t/unloadcollection1/&wt=javabin&version=2&update.distrib=FROMLEADER} {add=[67 (1430155718310232064)]} 0 2
[junit4:junit4]   2> 24321 T64 C1 P43071 /update {distrib.from=http://127.0.0.1:44577/rll/t/unloadcollection1/&wt=javabin&version=2&update.distrib=FROMLEADER} {add=[67 (1430155718310232064)]} 0 2
[junit4:junit4]   2> 24322 T47 C2 P44577 /update {distrib.from=http://127.0.0.1:45600/rll/t/unloadcollection3/&wt=javabin&version=2&update.distrib=TOLEADER} {add=[67 (1430155718310232064)]} 0 7
[junit4:junit4]   2> 24323 T76 C3 P45600 /update {wt=javabin&version=2} {add=[67]} 0 10
[junit4:junit4]   2> 24333 T75 C3 P45600 /update {distrib.from=http://127.0.0.1:44577/rll/t/unloadcollection1/&wt=javabin&version=2&update.distrib=FROMLEADER} {add=[68 (1430155718322814976)]} 0 2
[junit4:junit4]   2> 24333 T62 C1 P43071 /update {distrib.from=http://127.0.0.1:44577/rll/t/unloadcollection1/&wt=javabin&version=2&update.distrib=FROMLEADER} {add=[68 (1430155718322814976)]} 0 2
[junit4:junit4]   2> 24334 T48 C2 P44577 /update {distrib.from=http://127.0.0.1:45600/rll/t/unloadcollection3/&wt=javabin&version=2&update.distrib=TOLEADER} {add=[68 (1430155718322814976)]} 0 7
[junit4:junit4]   2> 24335 T78 C3 P45600 /update {wt=javabin&version=2} {add=[68]} 0 10
[junit4:junit4]   2> 24345 T76 C3 P45600 /update {distrib.from=http://127.0.0.1:44577/rll/t/unloadcollection1/&wt=javabin&version=2&update.distrib=FROMLEADER} {add=[69 (1430155718335397888)]} 0 2
[junit4:junit4]   2> 24345 T63 C1 P43071 /update {distrib.from=http://127.0.0.1:44577/rll/t/unloadcollection1/&wt=javabin&version=2&update.distrib=FROMLEADER} {add=[69 (1430155718335397888)]} 0 2
[junit4:junit4]   2> 24346 T49 C2 P44577 /update {distrib.from=http://127.0.0.1:45600/rll/t/unloadcollection3/&wt=javabin&version=2&update.di

[...truncated too long message...]

e.solr.common.SolrException: Server at http://127.0.0.1:52889/onenodecollectioncore returned non ok status:404, message:Can not find: /onenodecollectioncore/update
[junit4:junit4]    > 	at __randomizedtesting.SeedInfo.seed([919584EE21170C51:10730AF656486C6D]:0)
[junit4:junit4]    > 	at org.apache.solr.client.solrj.impl.HttpSolrServer.request(HttpSolrServer.java:375)
[junit4:junit4]    > 	at org.apache.solr.client.solrj.impl.HttpSolrServer.request(HttpSolrServer.java:181)
[junit4:junit4]    > 	at org.apache.solr.client.solrj.request.AbstractUpdateRequest.process(AbstractUpdateRequest.java:117)
[junit4:junit4]    > 	at org.apache.solr.client.solrj.SolrServer.add(SolrServer.java:116)
[junit4:junit4]    > 	at org.apache.solr.client.solrj.SolrServer.add(SolrServer.java:102)
[junit4:junit4]    > 	at org.apache.solr.cloud.BasicDistributedZk2Test.testNodeWithoutCollectionForwarding(BasicDistributedZk2Test.java:196)
[junit4:junit4]    > 	at org.apache.solr.cloud.BasicDistributedZk2Test.doTest(BasicDistributedZk2Test.java:89)
[junit4:junit4]    > 	at org.apache.solr.BaseDistributedSearchTestCase.testDistribSearch(BaseDistributedSearchTestCase.java:806)
[junit4:junit4]    > 	at sun.reflect.NativeMethodAccessorImpl.invoke0(Native Method)
[junit4:junit4]    > 	at sun.reflect.NativeMethodAccessorImpl.invoke(NativeMethodAccessorImpl.java:57)
[junit4:junit4]    > 	at sun.reflect.DelegatingMethodAccessorImpl.invoke(DelegatingMethodAccessorImpl.java:43)
[junit4:junit4]    > 	at java.lang.reflect.Method.invoke(Method.java:487)
[junit4:junit4]    > 	at com.carrotsearch.randomizedtesting.RandomizedRunner.invoke(RandomizedRunner.java:1559)
[junit4:junit4]    > 	at com.carrotsearch.randomizedtesting.RandomizedRunner.access$600(RandomizedRunner.java:79)
[junit4:junit4]    > 	at com.carrotsearch.randomizedtesting.RandomizedRunner$6.evaluate(RandomizedRunner.java:737)
[junit4:junit4]    > 	at com.carrotsearch.randomizedtesting.RandomizedRunner$7.evaluate(RandomizedRunner.java:773)
[junit4:junit4]    > 	at com.carrotsearch.randomizedtesting.RandomizedRunner$8.evaluate(RandomizedRunner.java:787)
[junit4:junit4]    > 	at com.carrotsearch.randomizedtesting.rules.SystemPropertiesRestoreRule$1.evaluate(SystemPropertiesRestoreRule.java:53)
[junit4:junit4]    > 	at org.apache.lucene.util.TestRuleSetupTeardownChained$1.evaluate(TestRuleSetupTeardownChained.java:50)
[junit4:junit4]    > 	at org.apache.lucene.util.TestRuleFieldCacheSanity$1.evaluate(TestRuleFieldCacheSanity.java:51)
[junit4:junit4]    > 	at org.apache.lucene.util.AbstractBeforeAfterRule$1.evaluate(AbstractBeforeAfterRule.java:46)
[junit4:junit4]    > 	at com.carrotsearch.randomizedtesting.rules.SystemPropertiesInvariantRule$1.evaluate(SystemPropertiesInvariantRule.java:55)
[junit4:junit4]    > 	at org.apache.lucene.util.TestRuleThreadAndTestName$1.evaluate(TestRuleThreadAndTestName.java:49)
[junit4:junit4]    > 	at org.apache.lucene.util.TestRuleIgnoreAfterMaxFailures$1.evaluate(TestRuleIgnoreAfterMaxFailures.java:70)
[junit4:junit4]    > 	at org.apache.lucene.util.TestRuleMarkFailure$1.evaluate(TestRuleMarkFailure.java:48)
[junit4:junit4]    > 	at com.carrotsearch.randomizedtesting.rules.StatementAdapter.evaluate(StatementAdapter.java:36)
[junit4:junit4]    > 	at com.carrotsearch.randomizedtesting.ThreadLeakControl$StatementRunner.run(ThreadLeakControl.java:358)
[junit4:junit4]    > 	at com.carrotsearch.randomizedtesting.ThreadLeakControl.forkTimeoutingTask(ThreadLeakControl.java:782)
[junit4:junit4]    > 	at com.carrotsearch.randomizedtesting.ThreadLeakControl$3.evaluate(ThreadLeakControl.java:442)
[junit4:junit4]    > 	at com.carrotsearch.randomizedtesting.RandomizedRunner.runSingleTest(RandomizedRunner.java:746)
[junit4:junit4]    > 	at com.carrotsearch.randomizedtesting.RandomizedRunner$3.evaluate(RandomizedRunner.java:648)
[junit4:junit4]    > 	at com.carrotsearch.randomizedtesting.RandomizedRunner$4.evaluate(RandomizedRunner.java:682)
[junit4:junit4]    > 	at com.carrotsearch.randomizedtesting.RandomizedRunner$5.evaluate(RandomizedRunner.java:693)
[junit4:junit4]    > 	at com.carrotsearch.randomizedtesting.rules.StatementAdapter.evaluate(StatementAdapter.java:36)
[junit4:junit4]    > 	at com.carrotsearch.randomizedtesting.rules.SystemPropertiesRestoreRule$1.evaluate(SystemPropertiesRestoreRule.java:53)
[junit4:junit4]    > 	at org.apache.lucene.util.AbstractBeforeAfterRule$1.evaluate(AbstractBeforeAfterRule.java:46)
[junit4:junit4]    > 	at org.apache.lucene.util.TestRuleStoreClassName$1.evaluate(TestRuleStoreClassName.java:42)
[junit4:junit4]    > 	at com.carrotsearch.randomizedtesting.rules.SystemPropertiesInvariantRule$1.evaluate(SystemPropertiesInvariantRule.java:55)
[junit4:junit4]    > 	at com.carrotsearch.randomizedtesting.rules.NoShadowingOrOverridesOnMethodsRule$1.evaluate(NoShadowingOrOverridesOnMethodsRule.java:39)
[junit4:junit4]    > 	at com.carrotsearch.randomizedtesting.rules.NoShadowingOrOverridesOnMethodsRule$1.evaluate(NoShadowingOrOverridesOnMethodsRule.java:39)
[junit4:junit4]    > 	at com.carrotsearch.randomizedtesting.rules.StatementAdapter.evaluate(StatementAdapter.java:36)
[junit4:junit4]    > 	at org.apache.lucene.util.TestRuleAssertionsRequired$1.evaluate(TestRuleAssertionsRequired.java:43)
[junit4:junit4]    > 	at org.apache.lucene.util.TestRuleMarkFailure$1.evaluate(TestRuleMarkFailure.java:48)
[junit4:junit4]    > 	at org.apache.lucene.util.TestRuleIgnoreAfterMaxFailures$1.evaluate(TestRuleIgnoreAfterMaxFailures.java:70)
[junit4:junit4]    > 	at org.apache.lucene.util.TestRuleIgnoreTestSuites$1.evaluate(TestRuleIgnoreTestSuites.java:55)
[junit4:junit4]    > 	at com.carrotsearch.randomizedtesting.rules.StatementAdapter.evaluate(StatementAdapter.java:36)
[junit4:junit4]    > 	at com.carrotsearch.randomizedtesting.ThreadLeakControl$StatementRunner.run(ThreadLeakControl.java:358)
[junit4:junit4]    > 	at java.lang.Thread.run(Thread.java:722)
[junit4:junit4]   2> 31965 T1857 oas.SolrTestCaseJ4.deleteCore ###deleteCore
[junit4:junit4]   2> 31969 T1856 ccr.ThreadLeakControl.checkThreadLeaks WARNING Will linger awaiting termination of 3 leaked thread(s).
[junit4:junit4]   2> 32202 T1860 oazs.SessionTrackerImpl.run SessionTrackerImpl exited loop!
[junit4:junit4]   2> 32805 T780 oasc.OverseerCollectionProcessor.run WARNING Overseer cannot talk to ZK
[junit4:junit4]   2> 33172 T1948 oascc.ZkStateReader$3.process WARNING ZooKeeper watch triggered, but Solr cannot talk to ZK
[junit4:junit4]   2> 33172 T1948 oascc.ZkStateReader$2.process A cluster state change: WatchedEvent state:SyncConnected type:NodeChildrenChanged path:/live_nodes, has occurred - updating... (live nodes size: 1)
[junit4:junit4]   2> 33173 T1948 oascc.ZkStateReader$2.process WARNING ZooKeeper watch triggered, but Solr cannot talk to ZK
[junit4:junit4]   2> 33173 T1948 oaz.ClientCnxn$EventThread.run EventThread shut down
[junit4:junit4]   2> NOTE: test params are: codec=Lucene42: {}, docValues:{}, sim=DefaultSimilarity, locale=th, timezone=Antarctica/Rothera
[junit4:junit4]   2> NOTE: Linux 3.2.0-39-generic i386/Oracle Corporation 1.8.0-ea (32-bit)/cpus=8,threads=2,free=156073200,total=257949696
[junit4:junit4]   2> NOTE: All tests run in this JVM: [DocValuesTest, UnloadDistributedZkTest, TestFieldTypeResource, TestSolrDeletionPolicy2, LukeRequestHandlerTest, TestQuerySenderListener, DistributedTermsComponentTest, RAMDirectoryFactoryTest, CSVRequestHandlerTest, UpdateRequestProcessorFactoryTest, DistributedSpellCheckComponentTest, UUIDFieldTest, ExternalFileFieldSortTest, TestWriterPerf, TestCoreContainer, TestSolrIndexConfig, OverseerTest, SliceStateTest, RecoveryZkTest, TestQueryUtils, ResourceLoaderTest, TestValueSourceCache, TestTrie, TestPseudoReturnFields, TestRemoteStreaming, TestRandomDVFaceting, TestSolrCoreProperties, ShowFileRequestHandlerTest, IndexSchemaTest, SpatialFilterTest, SchemaVersionSpecificBehaviorTest, TestIBSimilarityFactory, TestFastLRUCache, SliceStateUpdateTest, LoggingHandlerTest, SystemInfoHandlerTest, QueryEqualityTest, TestStressVersions, TestJoin, TestReversedWildcardFilterFactory, TestLFUCache, OverseerCollectionProcessorTest, TermsComponentTest, SynonymTokenizerTest, StatelessScriptUpdateProcessorFactoryTest, TestPluginEnable, TestRealTimeGet, DirectSolrConnectionTest, TestFunctionQuery, BadComponentTest, TestFastWriter, PrimUtilsTest, TestDocSet, SolrInfoMBeanTest, MBeansHandlerTest, SuggesterTest, TestSweetSpotSimilarityFactory, BasicFunctionalityTest, JsonLoaderTest, TestSearchPerf, SpellingQueryConverterTest, TestPerFieldSimilarity, DirectUpdateHandlerOptimizeTest, DocumentBuilderTest, TestFaceting, LegacyHTMLStripCharFilterTest, BasicDistributedZk2Test]
[junit4:junit4] Completed on J0 in 33.24s, 1 test, 1 error <<< FAILURES!

[...truncated 426 lines...]
BUILD FAILED
/mnt/ssd/jenkins/workspace/Lucene-Solr-trunk-Linux/build.xml:375: The following error occurred while executing this line:
/mnt/ssd/jenkins/workspace/Lucene-Solr-trunk-Linux/build.xml:355: The following error occurred while executing this line:
/mnt/ssd/jenkins/workspace/Lucene-Solr-trunk-Linux/build.xml:39: The following error occurred while executing this line:
/mnt/ssd/jenkins/workspace/Lucene-Solr-trunk-Linux/solr/build.xml:183: The following error occurred while executing this line:
/mnt/ssd/jenkins/workspace/Lucene-Solr-trunk-Linux/solr/common-build.xml:449: The following error occurred while executing this line:
/mnt/ssd/jenkins/workspace/Lucene-Solr-trunk-Linux/lucene/common-build.xml:1210: The following error occurred while executing this line:
/mnt/ssd/jenkins/workspace/Lucene-Solr-trunk-Linux/lucene/common-build.xml:874: There were test failures: 272 suites, 1144 tests, 1 error, 1 failure, 13 ignored (7 assumptions)

Total time: 37 minutes 35 seconds
Build step 'Invoke Ant' marked build as failure
Archiving artifacts
Recording test results
Description set: Java: 32bit/jdk1.8.0-ea-b79 -server -XX:+UseParallelGC
Email was triggered for: Failure
Sending email for trigger: Failure



Mime
View raw message