lucene-dev mailing list archives

Site index · List index
Message view « Date » · « Thread »
Top « Date » · « Thread »
From Policeman Jenkins Server <jenk...@thetaphi.de>
Subject [JENKINS] Lucene-Solr-4.x-Linux (64bit/ibm-j9-jdk7) - Build # 4573 - Failure!
Date Thu, 07 Mar 2013 05:39:18 GMT
Build: http://jenkins.thetaphi.de/job/Lucene-Solr-4.x-Linux/4573/
Java: 64bit/ibm-j9-jdk7 

2 tests failed.
REGRESSION:  org.apache.solr.rest.TestFieldCollectionResource.testGetAllFields

Error Message:
Exception during query

Stack Trace:
java.lang.RuntimeException: Exception during query
	at __randomizedtesting.SeedInfo.seed([118807F236C56EBF:FD264D36CC369727]:0)
	at org.apache.solr.util.RestTestBase.assertQ(RestTestBase.java:143)
	at org.apache.solr.rest.TestFieldCollectionResource.testGetAllFields(TestFieldCollectionResource.java:26)
	at sun.reflect.NativeMethodAccessorImpl.invoke0(Native Method)
	at sun.reflect.NativeMethodAccessorImpl.invoke(NativeMethodAccessorImpl.java:88)
	at sun.reflect.DelegatingMethodAccessorImpl.invoke(DelegatingMethodAccessorImpl.java:55)
	at java.lang.reflect.Method.invoke(Method.java:613)
	at com.carrotsearch.randomizedtesting.RandomizedRunner.invoke(RandomizedRunner.java:1559)
	at com.carrotsearch.randomizedtesting.RandomizedRunner.access$600(RandomizedRunner.java:79)
	at com.carrotsearch.randomizedtesting.RandomizedRunner$6.evaluate(RandomizedRunner.java:737)
	at com.carrotsearch.randomizedtesting.RandomizedRunner$7.evaluate(RandomizedRunner.java:773)
	at com.carrotsearch.randomizedtesting.RandomizedRunner$8.evaluate(RandomizedRunner.java:787)
	at com.carrotsearch.randomizedtesting.rules.SystemPropertiesRestoreRule$1.evaluate(SystemPropertiesRestoreRule.java:53)
	at org.apache.lucene.util.TestRuleSetupTeardownChained$1.evaluate(TestRuleSetupTeardownChained.java:50)
	at org.apache.lucene.util.TestRuleFieldCacheSanity$1.evaluate(TestRuleFieldCacheSanity.java:51)
	at org.apache.lucene.util.AbstractBeforeAfterRule$1.evaluate(AbstractBeforeAfterRule.java:46)
	at com.carrotsearch.randomizedtesting.rules.SystemPropertiesInvariantRule$1.evaluate(SystemPropertiesInvariantRule.java:55)
	at org.apache.lucene.util.TestRuleThreadAndTestName$1.evaluate(TestRuleThreadAndTestName.java:49)
	at org.apache.lucene.util.TestRuleIgnoreAfterMaxFailures$1.evaluate(TestRuleIgnoreAfterMaxFailures.java:70)
	at org.apache.lucene.util.TestRuleMarkFailure$1.evaluate(TestRuleMarkFailure.java:48)
	at com.carrotsearch.randomizedtesting.rules.StatementAdapter.evaluate(StatementAdapter.java:36)
	at com.carrotsearch.randomizedtesting.ThreadLeakControl$StatementRunner.run(ThreadLeakControl.java:358)
	at com.carrotsearch.randomizedtesting.ThreadLeakControl.forkTimeoutingTask(ThreadLeakControl.java:782)
	at com.carrotsearch.randomizedtesting.ThreadLeakControl$3.evaluate(ThreadLeakControl.java:442)
	at com.carrotsearch.randomizedtesting.RandomizedRunner.runSingleTest(RandomizedRunner.java:746)
	at com.carrotsearch.randomizedtesting.RandomizedRunner$3.evaluate(RandomizedRunner.java:648)
	at com.carrotsearch.randomizedtesting.RandomizedRunner$4.evaluate(RandomizedRunner.java:682)
	at com.carrotsearch.randomizedtesting.RandomizedRunner$5.evaluate(RandomizedRunner.java:693)
	at com.carrotsearch.randomizedtesting.rules.StatementAdapter.evaluate(StatementAdapter.java:36)
	at com.carrotsearch.randomizedtesting.rules.SystemPropertiesRestoreRule$1.evaluate(SystemPropertiesRestoreRule.java:53)
	at org.apache.lucene.util.AbstractBeforeAfterRule$1.evaluate(AbstractBeforeAfterRule.java:46)
	at org.apache.lucene.util.TestRuleStoreClassName$1.evaluate(TestRuleStoreClassName.java:42)
	at com.carrotsearch.randomizedtesting.rules.SystemPropertiesInvariantRule$1.evaluate(SystemPropertiesInvariantRule.java:55)
	at com.carrotsearch.randomizedtesting.rules.NoShadowingOrOverridesOnMethodsRule$1.evaluate(NoShadowingOrOverridesOnMethodsRule.java:39)
	at com.carrotsearch.randomizedtesting.rules.NoShadowingOrOverridesOnMethodsRule$1.evaluate(NoShadowingOrOverridesOnMethodsRule.java:39)
	at com.carrotsearch.randomizedtesting.rules.StatementAdapter.evaluate(StatementAdapter.java:36)
	at org.apache.lucene.util.TestRuleAssertionsRequired$1.evaluate(TestRuleAssertionsRequired.java:43)
	at org.apache.lucene.util.TestRuleMarkFailure$1.evaluate(TestRuleMarkFailure.java:48)
	at org.apache.lucene.util.TestRuleIgnoreAfterMaxFailures$1.evaluate(TestRuleIgnoreAfterMaxFailures.java:70)
	at org.apache.lucene.util.TestRuleIgnoreTestSuites$1.evaluate(TestRuleIgnoreTestSuites.java:55)
	at com.carrotsearch.randomizedtesting.rules.StatementAdapter.evaluate(StatementAdapter.java:36)
	at com.carrotsearch.randomizedtesting.ThreadLeakControl$StatementRunner.run(ThreadLeakControl.java:358)
	at java.lang.Thread.run(Thread.java:780)
Caused by: java.lang.RuntimeException: REQUEST FAILED: xpath=(/response/arr[@name='fields']/lst/str[@name='name'])[1]
= 'custstopfilt'
	xml response was: <?xml version="1.0" encoding="UTF-8"?>
<response>

<lst name="responseHeader">
  <int name="status">0</int>
  <int name="QTime">2</int>
</lst>
<arr name="fields">
  <lst>
    <str name="name">lowerfilt</str>
    <str name="type">lowerfilt</str>
    <bool name="indexed">true</bool>
    <bool name="stored">true</bool>
  </lst>
  <lst>
    <str name="name">text_np</str>
    <str name="type">text_np</str>
    <bool name="indexed">true</bool>
    <bool name="stored">false</bool>
  </lst>
  <lst>
    <str name="name">timestamp</str>
    <str name="type">date</str>
    <bool name="indexed">true</bool>
    <bool name="stored">true</bool>
  </lst>
  <lst>
    <str name="name">id</str>
    <str name="type">string</str>
    <bool name="indexed">true</bool>
    <bool name="stored">true</bool>
    <bool name="multiValued">false</bool>
    <bool name="required">true</bool>
    <bool name="uniqueKey">true</bool>
  </lst>
  <lst>
    <str name="name">signatureField</str>
    <str name="type">string</str>
    <bool name="indexed">true</bool>
    <bool name="stored">false</bool>
  </lst>
  <lst>
    <str name="name">sindsto</str>
    <str name="type">string</str>
    <bool name="indexed">true</bool>
    <bool name="stored">true</bool>
  </lst>
  <lst>
    <str name="name">isto</str>
    <str name="type">int</str>
    <bool name="indexed">false</bool>
    <bool name="stored">true</bool>
  </lst>
  <lst>
    <str name="name">subject</str>
    <str name="type">text</str>
    <bool name="indexed">true</bool>
    <bool name="stored">true</bool>
  </lst>
  <lst>
    <str name="name">text</str>
    <str name="type">text</str>
    <bool name="indexed">true</bool>
    <bool name="stored">false</bool>
    <bool name="multiValued">true</bool>
  </lst>
  <lst>
    <str name="name">HTMLwhitetok</str>
    <str name="type">HTMLwhitetok</str>
    <bool name="indexed">true</bool>
    <bool name="stored">true</bool>
  </lst>
  <lst>
    <str name="name">wdf_nocase</str>
    <str name="type">wdf_nocase</str>
    <bool name="indexed">true</bool>
    <bool name="stored">true</bool>
  </lst>
  <lst>
    <str name="name">bind</str>
    <str name="type">boolean</str>
    <bool name="indexed">true</bool>
    <bool name="stored">false</bool>
  </lst>
  <lst>
    <str name="name">title_lettertok</str>
    <str name="type">lettertok</str>
    <bool name="indexed">true</bool>
    <bool name="stored">false</bool>
  </lst>
  <lst>
    <str name="name">test_offtv</str>
    <str name="type">text</str>
    <bool name="termOffsets">true</bool>
    <bool name="termVectors">true</bool>
  </lst>
  <lst>
    <str name="name">subword</str>
    <str name="type">subword</str>
    <bool name="indexed">true</bool>
    <bool name="stored">true</bool>
  </lst>
  <lst>
    <str name="name">title</str>
    <str name="type">nametext</str>
    <bool name="indexed">true</bool>
    <bool name="stored">true</bool>
  </lst>
  <lst>
    <str name="name">shouldbestored</str>
    <str name="type">unstored</str>
    <bool name="stored">true</bool>
  </lst>
  <lst>
    <str name="name">point_hash</str>
    <str name="type">geohash</str>
    <bool name="indexed">true</bool>
    <bool name="stored">true</bool>
    <bool name="multiValued">false</bool>
  </lst>
  <lst>
    <str name="name">custengporterfilt</str>
    <str name="type">custengporterfilt</str>
    <bool name="indexed">true</bool>
    <bool name="stored">true</bool>
  </lst>
  <lst>
    <str name="name">lettertok</str>
    <str name="type">lettertok</str>
    <bool name="indexed">true</bool>
    <bool name="stored">true</bool>
  </lst>
  <lst>
    <str name="name">test_posofftv</str>
    <str name="type">text</str>
    <bool name="termOffsets">true</bool>
    <bool name="termVectors">true</bool>
    <bool name="termPositions">true</bool>
  </lst>
  <lst>
    <str name="name">lengthfilt</str>
    <str name="type">lengthfilt</str>
    <bool name="indexed">true</bool>
    <bool name="stored">true</bool>
  </lst>
  <lst>
    <str name="name">standardtok</str>
    <str name="type">standardtok</str>
    <bool name="indexed">true</bool>
    <bool name="stored">true</bool>
  </lst>
  <lst>
    <str name="name">weight</str>
    <str name="type">float</str>
    <bool name="indexed">true</bool>
    <bool name="stored">true</bool>
  </lst>
  <lst>
    <str name="name">porterfilt</str>
    <str name="type">porterfilt</str>
    <bool name="indexed">true</bool>
    <bool name="stored">true</bool>
  </lst>
  <lst>
    <str name="name">title_stemmed</str>
    <str name="type">text</str>
    <bool name="indexed">true</bool>
    <bool name="stored">false</bool>
  </lst>
  <lst>
    <str name="name">standardtokfilt</str>
    <str name="type">standardtokfilt</str>
    <bool name="indexed">true</bool>
    <bool name="stored">true</bool>
  </lst>
  <lst>
    <str name="name">uniq</str>
    <str name="type">string</str>
    <bool name="indexed">true</bool>
    <bool name="stored">true</bool>
    <bool name="multiValued">true</bool>
  </lst>
  <lst>
    <str name="name">test_basictv</str>
    <str name="type">text</str>
    <bool name="termVectors">true</bool>
  </lst>
  <lst>
    <str name="name">whitetok</str>
    <str name="type">whitetok</str>
    <bool name="indexed">true</bool>
    <bool name="stored">true</bool>
  </lst>
  <lst>
    <str name="name">nullfirst</str>
    <str name="type">string</str>
    <bool name="indexed">true</bool>
    <bool name="stored">true</bool>
    <bool name="sortMissingFirst">true</bool>
  </lst>
  <lst>
    <str name="name">textgap</str>
    <str name="type">textgap</str>
    <bool name="indexed">true</bool>
    <bool name="stored">true</bool>
  </lst>
  <lst>
    <str name="name">name</str>
    <str name="type">nametext</str>
    <bool name="indexed">true</bool>
    <bool name="stored">true</bool>
  </lst>
  <lst>
    <str name="name">bsto</str>
    <str name="type">boolean</str>
    <bool name="indexed">false</bool>
    <bool name="stored">true</bool>
  </lst>
  <lst>
    <str name="name">sind</str>
    <str name="type">string</str>
    <bool name="indexed">true</bool>
    <bool name="stored">false</bool>
  </lst>
  <lst>
    <str name="name">stopfilt</str>
    <str name="type">stopfilt</str>
    <bool name="indexed">true</bool>
    <bool name="stored">true</bool>
  </lst>
  <lst>
    <str name="name">test_notv</str>
    <str name="type">text</str>
    <bool name="termVectors">false</bool>
  </lst>
  <lst>
    <str name="name">point</str>
    <str name="type">xy</str>
    <bool name="indexed">true</bool>
    <bool name="stored">true</bool>
    <bool name="multiValued">false</bool>
  </lst>
  <lst>
    <str name="name">wdf_preserve</str>
    <str name="type">wdf_preserve</str>
    <bool name="indexed">true</bool>
    <bool name="stored">true</bool>
  </lst>
  <lst>
    <str name="name">teststop</str>
    <str name="type">teststop</str>
    <bool name="indexed">true</bool>
    <bool name="stored">true</bool>
  </lst>
  <lst>
    <str name="name">numericsubword</str>
    <str name="type">numericsubword</str>
    <bool name="indexed">true</bool>
    <bool name="stored">true</bool>
  </lst>
  <lst>
    <str name="name">patternreplacefilt</str>
    <str name="type">patternreplacefilt</str>
    <bool name="indexed">true</bool>
    <bool name="stored">true</bool>
  </lst>
  <lst>
    <str name="name">lowertok</str>
    <str name="type">lowertok</str>
    <bool name="indexed">true</bool>
    <bool name="stored">true</bool>
  </lst>
  <lst>
    <str name="name">shouldbeunstored</str>
    <str name="type">unstored</str>
  </lst>
  <lst>
    <str name="name">sku1</str>
    <str name="type">skutype1</str>
    <bool name="indexed">true</bool>
    <bool name="stored">true</bool>
  </lst>
  <lst>
    <str name="name">pointD</str>
    <str name="type">xyd</str>
    <bool name="indexed">true</bool>
    <bool name="stored">true</bool>
    <bool name="multiValued">false</bool>
  </lst>
  <lst>
    <str name="name">sku2</str>
    <str name="type">skutype2</str>
    <bool name="indexed">true</bool>
    <bool name="stored">true</bool>
  </lst>
  <lst>
    <str name="name">uuid</str>
    <str name="type">uuid</str>
    <bool name="stored">true</bool>
  </lst>
  <lst>
    <str name="name">shouldbeunindexed</str>
    <str name="type">unstored</str>
    <bool name="indexed">false</bool>
    <bool name="stored">true</bool>
  </lst>
  <lst>
    <str name="name">nouniq</str>
    <str name="type">string</str>
    <bool name="indexed">true</bool>
    <bool name="stored">true</bool>
    <bool name="multiValued">true</bool>
  </lst>
  <lst>
    <str name="name">test_hlt</str>
    <str name="type">highlittext</str>
    <bool name="compressed">true</bool>
    <bool name="indexed">true</bool>
  </lst>
  <lst>
    <str name="name">keywordtok</str>
    <str name="type">keywordtok</str>
    <bool name="indexed">true</bool>
    <bool name="stored">true</bool>
  </lst>
  <lst>
    <str name="name">standardfilt</str>
    <str name="type">standardfilt</str>
    <bool name="indexed">true</bool>
    <bool name="stored">true</bool>
  </lst>
  <lst>
    <str name="name">syn</str>
    <str name="type">syn</str>
    <bool name="indexed">true</bool>
    <bool name="stored">true</bool>
  </lst>
  <lst>
    <str name="name">bindsto</str>
    <str name="type">boolean</str>
    <bool name="indexed">true</bool>
    <bool name="stored">true</bool>
  </lst>
  <lst>
    <str name="name">uniq2</str>
    <str name="type">string</str>
    <bool name="indexed">true</bool>
    <bool name="stored">true</bool>
    <bool name="multiValued">true</bool>
  </lst>
  <lst>
    <str name="name">uniq3</str>
    <str name="type">string</str>
    <bool name="indexed">true</bool>
    <bool name="stored">true</bool>
  </lst>
  <lst>
    <str name="name">iind</str>
    <str name="type">int</str>
    <bool name="indexed">true</bool>
    <bool name="stored">false</bool>
  </lst>
  <lst>
    <str name="name">engporterfilt</str>
    <str name="type">engporterfilt</str>
    <bool name="indexed">true</bool>
    <bool name="stored">true</bool>
  </lst>
  <lst>
    <str name="name">numberpartfail</str>
    <str name="type">failtype1</str>
    <bool name="indexed">true</bool>
    <bool name="stored">true</bool>
  </lst>
  <lst>
    <str name="name">ssto</str>
    <str name="type">string</str>
    <bool name="indexed">false</bool>
    <bool name="stored">true</bool>
  </lst>
  <lst>
    <str name="name">protectedsubword</str>
    <str name="type">protectedsubword</str>
    <bool name="indexed">true</bool>
    <bool name="stored">true</bool>
  </lst>
  <lst>
    <str name="name">dedup</str>
    <str name="type">dedup</str>
    <bool name="indexed">true</bool>
    <bool name="stored">true</bool>
  </lst>
  <lst>
    <str name="name">custstopfilt</str>
    <str name="type">custstopfilt</str>
    <bool name="indexed">true</bool>
    <bool name="stored">true</bool>
  </lst>
  <lst>
    <str name="name">store</str>
    <str name="type">location</str>
    <bool name="indexed">true</bool>
    <bool name="stored">true</bool>
  </lst>
  <lst>
    <str name="name">_version_</str>
    <str name="type">long</str>
    <bool name="indexed">true</bool>
    <bool name="stored">true</bool>
  </lst>
  <lst>
    <str name="name">HTMLstandardtok</str>
    <str name="type">HTMLstandardtok</str>
    <bool name="indexed">true</bool>
    <bool name="stored">true</bool>
  </lst>
  <lst>
    <str name="name">test_postv</str>
    <str name="type">text</str>
    <bool name="termVectors">true</bool>
    <bool name="termPositions">true</bool>
  </lst>
  <lst>
    <str name="name">test_hlt_off</str>
    <str name="type">highlittext</str>
    <bool name="compressed">false</bool>
    <bool name="indexed">true</bool>
  </lst>
  <lst>
    <str name="name">copyfield_source</str>
    <str name="type">string</str>
    <bool name="indexed">true</bool>
    <bool name="stored">true</bool>
    <bool name="multiValued">true</bool>
  </lst>
  <lst>
    <str name="name">bday</str>
    <str name="type">date</str>
    <bool name="indexed">true</bool>
    <bool name="stored">true</bool>
  </lst>
</arr>
</response>

	request was:/schema/fields?indent=on&wt=xml
	at org.apache.solr.util.RestTestBase.assertQ(RestTestBase.java:136)
	... 41 more


REGRESSION:  org.apache.solr.rest.TestFieldCollectionResource.testJsonGetAllFields

Error Message:
mismatch: 'custstopfilt'!='lowerfilt' @ fields/[0]/name

Stack Trace:
java.lang.RuntimeException: mismatch: 'custstopfilt'!='lowerfilt' @ fields/[0]/name
	at __randomizedtesting.SeedInfo.seed([118807F236C56EBF:9888757E96762299]:0)
	at org.apache.solr.util.RestTestBase.assertJQ(RestTestBase.java:242)
	at org.apache.solr.util.RestTestBase.assertJQ(RestTestBase.java:186)
	at org.apache.solr.rest.TestFieldCollectionResource.testJsonGetAllFields(TestFieldCollectionResource.java:50)
	at sun.reflect.NativeMethodAccessorImpl.invoke0(Native Method)
	at sun.reflect.NativeMethodAccessorImpl.invoke(NativeMethodAccessorImpl.java:88)
	at sun.reflect.DelegatingMethodAccessorImpl.invoke(DelegatingMethodAccessorImpl.java:55)
	at java.lang.reflect.Method.invoke(Method.java:613)
	at com.carrotsearch.randomizedtesting.RandomizedRunner.invoke(RandomizedRunner.java:1559)
	at com.carrotsearch.randomizedtesting.RandomizedRunner.access$600(RandomizedRunner.java:79)
	at com.carrotsearch.randomizedtesting.RandomizedRunner$6.evaluate(RandomizedRunner.java:737)
	at com.carrotsearch.randomizedtesting.RandomizedRunner$7.evaluate(RandomizedRunner.java:773)
	at com.carrotsearch.randomizedtesting.RandomizedRunner$8.evaluate(RandomizedRunner.java:787)
	at com.carrotsearch.randomizedtesting.rules.SystemPropertiesRestoreRule$1.evaluate(SystemPropertiesRestoreRule.java:53)
	at org.apache.lucene.util.TestRuleSetupTeardownChained$1.evaluate(TestRuleSetupTeardownChained.java:50)
	at org.apache.lucene.util.TestRuleFieldCacheSanity$1.evaluate(TestRuleFieldCacheSanity.java:51)
	at org.apache.lucene.util.AbstractBeforeAfterRule$1.evaluate(AbstractBeforeAfterRule.java:46)
	at com.carrotsearch.randomizedtesting.rules.SystemPropertiesInvariantRule$1.evaluate(SystemPropertiesInvariantRule.java:55)
	at org.apache.lucene.util.TestRuleThreadAndTestName$1.evaluate(TestRuleThreadAndTestName.java:49)
	at org.apache.lucene.util.TestRuleIgnoreAfterMaxFailures$1.evaluate(TestRuleIgnoreAfterMaxFailures.java:70)
	at org.apache.lucene.util.TestRuleMarkFailure$1.evaluate(TestRuleMarkFailure.java:48)
	at com.carrotsearch.randomizedtesting.rules.StatementAdapter.evaluate(StatementAdapter.java:36)
	at com.carrotsearch.randomizedtesting.ThreadLeakControl$StatementRunner.run(ThreadLeakControl.java:358)
	at com.carrotsearch.randomizedtesting.ThreadLeakControl.forkTimeoutingTask(ThreadLeakControl.java:782)
	at com.carrotsearch.randomizedtesting.ThreadLeakControl$3.evaluate(ThreadLeakControl.java:442)
	at com.carrotsearch.randomizedtesting.RandomizedRunner.runSingleTest(RandomizedRunner.java:746)
	at com.carrotsearch.randomizedtesting.RandomizedRunner$3.evaluate(RandomizedRunner.java:648)
	at com.carrotsearch.randomizedtesting.RandomizedRunner$4.evaluate(RandomizedRunner.java:682)
	at com.carrotsearch.randomizedtesting.RandomizedRunner$5.evaluate(RandomizedRunner.java:693)
	at com.carrotsearch.randomizedtesting.rules.StatementAdapter.evaluate(StatementAdapter.java:36)
	at com.carrotsearch.randomizedtesting.rules.SystemPropertiesRestoreRule$1.evaluate(SystemPropertiesRestoreRule.java:53)
	at org.apache.lucene.util.AbstractBeforeAfterRule$1.evaluate(AbstractBeforeAfterRule.java:46)
	at org.apache.lucene.util.TestRuleStoreClassName$1.evaluate(TestRuleStoreClassName.java:42)
	at com.carrotsearch.randomizedtesting.rules.SystemPropertiesInvariantRule$1.evaluate(SystemPropertiesInvariantRule.java:55)
	at com.carrotsearch.randomizedtesting.rules.NoShadowingOrOverridesOnMethodsRule$1.evaluate(NoShadowingOrOverridesOnMethodsRule.java:39)
	at com.carrotsearch.randomizedtesting.rules.NoShadowingOrOverridesOnMethodsRule$1.evaluate(NoShadowingOrOverridesOnMethodsRule.java:39)
	at com.carrotsearch.randomizedtesting.rules.StatementAdapter.evaluate(StatementAdapter.java:36)
	at org.apache.lucene.util.TestRuleAssertionsRequired$1.evaluate(TestRuleAssertionsRequired.java:43)
	at org.apache.lucene.util.TestRuleMarkFailure$1.evaluate(TestRuleMarkFailure.java:48)
	at org.apache.lucene.util.TestRuleIgnoreAfterMaxFailures$1.evaluate(TestRuleIgnoreAfterMaxFailures.java:70)
	at org.apache.lucene.util.TestRuleIgnoreTestSuites$1.evaluate(TestRuleIgnoreTestSuites.java:55)
	at com.carrotsearch.randomizedtesting.rules.StatementAdapter.evaluate(StatementAdapter.java:36)
	at com.carrotsearch.randomizedtesting.ThreadLeakControl$StatementRunner.run(ThreadLeakControl.java:358)
	at java.lang.Thread.run(Thread.java:780)




Build Log:
[...truncated 11711 lines...]
BUILD FAILED
/mnt/ssd/jenkins/workspace/Lucene-Solr-4.x-Linux/build.xml:381: The following error occurred
while executing this line:
/mnt/ssd/jenkins/workspace/Lucene-Solr-4.x-Linux/build.xml:374: The following error occurred
while executing this line:
/mnt/ssd/jenkins/workspace/Lucene-Solr-4.x-Linux/build.xml:39: The following error occurred
while executing this line:
/mnt/ssd/jenkins/workspace/Lucene-Solr-4.x-Linux/solr/build.xml:183: The following error occurred
while executing this line:
/mnt/ssd/jenkins/workspace/Lucene-Solr-4.x-Linux/solr/common-build.xml:449: The following
error occurred while executing this line:
/mnt/ssd/jenkins/workspace/Lucene-Solr-4.x-Linux/lucene/common-build.xml:1213: The following
error occurred while executing this line:
/mnt/ssd/jenkins/workspace/Lucene-Solr-4.x-Linux/lucene/common-build.xml:877: There were test
failures: 267 suites, 1127 tests, 2 errors, 28 ignored (3 assumptions)

Total time: 34 minutes 49 seconds
Build step 'Invoke Ant' marked build as failure
Archiving artifacts
Recording test results
Description set: Java: 64bit/ibm-j9-jdk7 
Email was triggered for: Failure
Sending email for trigger: Failure



Mime
View raw message