lucene-dev mailing list archives

Site index · List index
Message view « Date » · « Thread »
Top « Date » · « Thread »
From Apache Jenkins Server <jenk...@builds.apache.org>
Subject [JENKINS] Lucene-Solr-Tests-trunk-java7 - Build # 3821 - Failure
Date Mon, 18 Mar 2013 00:25:48 GMT
Build: https://builds.apache.org/job/Lucene-Solr-Tests-trunk-java7/3821/

1 tests failed.
REGRESSION:  org.apache.solr.cloud.SyncSliceTest.testDistribSearch

Error Message:
shard1 is not consistent.  Got 305 from http://127.0.0.1:24982/_zz/lm/collection1lastClient and got 5 from http://127.0.0.1:31439/_zz/lm/collection1

Stack Trace:
java.lang.AssertionError: shard1 is not consistent.  Got 305 from http://127.0.0.1:24982/_zz/lm/collection1lastClient and got 5 from http://127.0.0.1:31439/_zz/lm/collection1
	at __randomizedtesting.SeedInfo.seed([4EDCC76005B1F466:CF3A497872EE945A]:0)
	at org.junit.Assert.fail(Assert.java:93)
	at org.apache.solr.cloud.AbstractFullDistribZkTestBase.checkShardConsistency(AbstractFullDistribZkTestBase.java:963)
	at org.apache.solr.cloud.SyncSliceTest.doTest(SyncSliceTest.java:233)
	at org.apache.solr.BaseDistributedSearchTestCase.testDistribSearch(BaseDistributedSearchTestCase.java:806)
	at sun.reflect.NativeMethodAccessorImpl.invoke0(Native Method)
	at sun.reflect.NativeMethodAccessorImpl.invoke(NativeMethodAccessorImpl.java:57)
	at sun.reflect.DelegatingMethodAccessorImpl.invoke(DelegatingMethodAccessorImpl.java:43)
	at java.lang.reflect.Method.invoke(Method.java:601)
	at com.carrotsearch.randomizedtesting.RandomizedRunner.invoke(RandomizedRunner.java:1559)
	at com.carrotsearch.randomizedtesting.RandomizedRunner.access$600(RandomizedRunner.java:79)
	at com.carrotsearch.randomizedtesting.RandomizedRunner$6.evaluate(RandomizedRunner.java:737)
	at com.carrotsearch.randomizedtesting.RandomizedRunner$7.evaluate(RandomizedRunner.java:773)
	at com.carrotsearch.randomizedtesting.RandomizedRunner$8.evaluate(RandomizedRunner.java:787)
	at com.carrotsearch.randomizedtesting.rules.SystemPropertiesRestoreRule$1.evaluate(SystemPropertiesRestoreRule.java:53)
	at org.apache.lucene.util.TestRuleSetupTeardownChained$1.evaluate(TestRuleSetupTeardownChained.java:50)
	at org.apache.lucene.util.TestRuleFieldCacheSanity$1.evaluate(TestRuleFieldCacheSanity.java:51)
	at org.apache.lucene.util.AbstractBeforeAfterRule$1.evaluate(AbstractBeforeAfterRule.java:46)
	at com.carrotsearch.randomizedtesting.rules.SystemPropertiesInvariantRule$1.evaluate(SystemPropertiesInvariantRule.java:55)
	at org.apache.lucene.util.TestRuleThreadAndTestName$1.evaluate(TestRuleThreadAndTestName.java:49)
	at org.apache.lucene.util.TestRuleIgnoreAfterMaxFailures$1.evaluate(TestRuleIgnoreAfterMaxFailures.java:70)
	at org.apache.lucene.util.TestRuleMarkFailure$1.evaluate(TestRuleMarkFailure.java:48)
	at com.carrotsearch.randomizedtesting.rules.StatementAdapter.evaluate(StatementAdapter.java:36)
	at com.carrotsearch.randomizedtesting.ThreadLeakControl$StatementRunner.run(ThreadLeakControl.java:358)
	at com.carrotsearch.randomizedtesting.ThreadLeakControl.forkTimeoutingTask(ThreadLeakControl.java:782)
	at com.carrotsearch.randomizedtesting.ThreadLeakControl$3.evaluate(ThreadLeakControl.java:442)
	at com.carrotsearch.randomizedtesting.RandomizedRunner.runSingleTest(RandomizedRunner.java:746)
	at com.carrotsearch.randomizedtesting.RandomizedRunner$3.evaluate(RandomizedRunner.java:648)
	at com.carrotsearch.randomizedtesting.RandomizedRunner$4.evaluate(RandomizedRunner.java:682)
	at com.carrotsearch.randomizedtesting.RandomizedRunner$5.evaluate(RandomizedRunner.java:693)
	at com.carrotsearch.randomizedtesting.rules.StatementAdapter.evaluate(StatementAdapter.java:36)
	at com.carrotsearch.randomizedtesting.rules.SystemPropertiesRestoreRule$1.evaluate(SystemPropertiesRestoreRule.java:53)
	at org.apache.lucene.util.AbstractBeforeAfterRule$1.evaluate(AbstractBeforeAfterRule.java:46)
	at org.apache.lucene.util.TestRuleStoreClassName$1.evaluate(TestRuleStoreClassName.java:42)
	at com.carrotsearch.randomizedtesting.rules.SystemPropertiesInvariantRule$1.evaluate(SystemPropertiesInvariantRule.java:55)
	at com.carrotsearch.randomizedtesting.rules.NoShadowingOrOverridesOnMethodsRule$1.evaluate(NoShadowingOrOverridesOnMethodsRule.java:39)
	at com.carrotsearch.randomizedtesting.rules.NoShadowingOrOverridesOnMethodsRule$1.evaluate(NoShadowingOrOverridesOnMethodsRule.java:39)
	at com.carrotsearch.randomizedtesting.rules.StatementAdapter.evaluate(StatementAdapter.java:36)
	at org.apache.lucene.util.TestRuleAssertionsRequired$1.evaluate(TestRuleAssertionsRequired.java:43)
	at org.apache.lucene.util.TestRuleMarkFailure$1.evaluate(TestRuleMarkFailure.java:48)
	at org.apache.lucene.util.TestRuleIgnoreAfterMaxFailures$1.evaluate(TestRuleIgnoreAfterMaxFailures.java:70)
	at org.apache.lucene.util.TestRuleIgnoreTestSuites$1.evaluate(TestRuleIgnoreTestSuites.java:55)
	at com.carrotsearch.randomizedtesting.rules.StatementAdapter.evaluate(StatementAdapter.java:36)
	at com.carrotsearch.randomizedtesting.ThreadLeakControl$StatementRunner.run(ThreadLeakControl.java:358)
	at java.lang.Thread.run(Thread.java:722)




Build Log:
[...truncated 9756 lines...]
[junit4:junit4] Suite: org.apache.solr.cloud.SyncSliceTest
[junit4:junit4]   2> 1 T3212 oas.BaseDistributedSearchTestCase.initHostContext Setting hostContext system property: /_zz/lm
[junit4:junit4]   2> 6 T3212 oas.SolrTestCaseJ4.setUp ###Starting testDistribSearch
[junit4:junit4]   2> Creating dataDir: /usr/home/hudson/hudson-slave/workspace/Lucene-Solr-Tests-trunk-java7/solr/build/solr-core/test/J1/./solrtest-SyncSliceTest-1363565499284
[junit4:junit4]   2> 7 T3212 oasc.ZkTestServer.run STARTING ZK TEST SERVER
[junit4:junit4]   2> 7 T3213 oasc.ZkTestServer$ZKServerMain.runFromConfig Starting server
[junit4:junit4]   2> 10 T3213 oazs.ZooKeeperServer.setTickTime tickTime set to 1000
[junit4:junit4]   2> 10 T3213 oazs.ZooKeeperServer.setMinSessionTimeout minSessionTimeout set to -1
[junit4:junit4]   2> 10 T3213 oazs.ZooKeeperServer.setMaxSessionTimeout maxSessionTimeout set to -1
[junit4:junit4]   2> 10 T3213 oazs.NIOServerCnxnFactory.configure binding to port 0.0.0.0/0.0.0.0:0
[junit4:junit4]   2> 11 T3213 oazsp.FileTxnSnapLog.save Snapshotting: 0x0 to /usr/home/hudson/hudson-slave/workspace/Lucene-Solr-Tests-trunk-java7/solr/build/solr-core/test/J1/./org.apache.solr.cloud.SyncSliceTest-1363565499283/zookeeper/server1/data/version-2/snapshot.0
[junit4:junit4]   2> 108 T3212 oasc.ZkTestServer.run start zk server on port:20361
[junit4:junit4]   2> 108 T3212 oaz.ZooKeeper.<init> Initiating client connection, connectString=127.0.0.1:20361 sessionTimeout=10000 watcher=org.apache.solr.common.cloud.ConnectionManager@4a606ae3
[junit4:junit4]   2> 109 T3212 oascc.ConnectionManager.waitForConnected Waiting for client to connect to ZooKeeper
[junit4:junit4]   2> 109 T3218 oaz.ClientCnxn$SendThread.logStartConnect Opening socket connection to server localhost/127.0.0.1:20361. Will not attempt to authenticate using SASL (access denied ("javax.security.auth.AuthPermission" "getLoginConfiguration"))
[junit4:junit4]   2> 110 T3218 oaz.ClientCnxn$SendThread.primeConnection Socket connection established to localhost/127.0.0.1:20361, initiating session
[junit4:junit4]   2> 110 T3214 oazs.NIOServerCnxnFactory.run Accepted socket connection from /140.211.11.196:20362
[junit4:junit4]   2> 111 T3214 oazs.ZooKeeperServer.processConnectRequest Client attempting to establish new session at /140.211.11.196:20362
[junit4:junit4]   2> 111 T3216 oazsp.FileTxnLog.append Creating new log file: log.1
[junit4:junit4]   2> 114 T3216 oazs.ZooKeeperServer.finishSessionInit Established session 0x13d7ad653990000 with negotiated timeout 10000 for client /140.211.11.196:20362
[junit4:junit4]   2> 114 T3218 oaz.ClientCnxn$SendThread.onConnected Session establishment complete on server localhost/127.0.0.1:20361, sessionid = 0x13d7ad653990000, negotiated timeout = 10000
[junit4:junit4]   2> 115 T3219 oascc.ConnectionManager.process Watcher org.apache.solr.common.cloud.ConnectionManager@4a606ae3 name:ZooKeeperConnection Watcher:127.0.0.1:20361 got event WatchedEvent state:SyncConnected type:None path:null path:null type:None
[junit4:junit4]   2> 115 T3212 oascc.ConnectionManager.waitForConnected Client is connected to ZooKeeper
[junit4:junit4]   2> 115 T3212 oascc.SolrZkClient.makePath makePath: /solr
[junit4:junit4]   2> 118 T3217 oazs.PrepRequestProcessor.pRequest2Txn Processed session termination for sessionid: 0x13d7ad653990000
[junit4:junit4]   2> 126 T3219 oaz.ClientCnxn$EventThread.run EventThread shut down
[junit4:junit4]   2> 126 T3212 oaz.ZooKeeper.close Session: 0x13d7ad653990000 closed
[junit4:junit4]   2> 126 T3214 oazs.NIOServerCnxn.closeSock Closed socket connection for client /140.211.11.196:20362 which had sessionid 0x13d7ad653990000
[junit4:junit4]   2> 127 T3212 oaz.ZooKeeper.<init> Initiating client connection, connectString=127.0.0.1:20361/solr sessionTimeout=10000 watcher=org.apache.solr.common.cloud.ConnectionManager@1907c4aa
[junit4:junit4]   2> 127 T3212 oascc.ConnectionManager.waitForConnected Waiting for client to connect to ZooKeeper
[junit4:junit4]   2> 127 T3220 oaz.ClientCnxn$SendThread.logStartConnect Opening socket connection to server localhost/127.0.0.1:20361. Will not attempt to authenticate using SASL (access denied ("javax.security.auth.AuthPermission" "getLoginConfiguration"))
[junit4:junit4]   2> 128 T3220 oaz.ClientCnxn$SendThread.primeConnection Socket connection established to localhost/127.0.0.1:20361, initiating session
[junit4:junit4]   2> 128 T3214 oazs.NIOServerCnxnFactory.run Accepted socket connection from /140.211.11.196:20363
[junit4:junit4]   2> 128 T3214 oazs.ZooKeeperServer.processConnectRequest Client attempting to establish new session at /140.211.11.196:20363
[junit4:junit4]   2> 130 T3216 oazs.ZooKeeperServer.finishSessionInit Established session 0x13d7ad653990001 with negotiated timeout 10000 for client /140.211.11.196:20363
[junit4:junit4]   2> 130 T3220 oaz.ClientCnxn$SendThread.onConnected Session establishment complete on server localhost/127.0.0.1:20361, sessionid = 0x13d7ad653990001, negotiated timeout = 10000
[junit4:junit4]   2> 130 T3221 oascc.ConnectionManager.process Watcher org.apache.solr.common.cloud.ConnectionManager@1907c4aa name:ZooKeeperConnection Watcher:127.0.0.1:20361/solr got event WatchedEvent state:SyncConnected type:None path:null path:null type:None
[junit4:junit4]   2> 131 T3212 oascc.ConnectionManager.waitForConnected Client is connected to ZooKeeper
[junit4:junit4]   2> 131 T3212 oascc.SolrZkClient.makePath makePath: /collections/collection1
[junit4:junit4]   2> 141 T3212 oascc.SolrZkClient.makePath makePath: /collections/collection1/shards
[junit4:junit4]   2> 143 T3212 oascc.SolrZkClient.makePath makePath: /collections/control_collection
[junit4:junit4]   2> 145 T3212 oascc.SolrZkClient.makePath makePath: /collections/control_collection/shards
[junit4:junit4]   2> 154 T3212 oasc.AbstractZkTestCase.putConfig put /usr/home/hudson/hudson-slave/workspace/Lucene-Solr-Tests-trunk-java7/solr/build/solr-core/test-files/solr/collection1/conf/solrconfig-tlog.xml to /configs/conf1/solrconfig.xml
[junit4:junit4]   2> 155 T3212 oascc.SolrZkClient.makePath makePath: /configs/conf1/solrconfig.xml
[junit4:junit4]   2> 170 T3212 oasc.AbstractZkTestCase.putConfig put /usr/home/hudson/hudson-slave/workspace/Lucene-Solr-Tests-trunk-java7/solr/build/solr-core/test-files/solr/collection1/conf/schema.xml to /configs/conf1/schema.xml
[junit4:junit4]   2> 171 T3212 oascc.SolrZkClient.makePath makePath: /configs/conf1/schema.xml
[junit4:junit4]   2> 274 T3212 oasc.AbstractZkTestCase.putConfig put /usr/home/hudson/hudson-slave/workspace/Lucene-Solr-Tests-trunk-java7/solr/build/solr-core/test-files/solr/collection1/conf/stopwords.txt to /configs/conf1/stopwords.txt
[junit4:junit4]   2> 275 T3212 oascc.SolrZkClient.makePath makePath: /configs/conf1/stopwords.txt
[junit4:junit4]   2> 278 T3212 oasc.AbstractZkTestCase.putConfig put /usr/home/hudson/hudson-slave/workspace/Lucene-Solr-Tests-trunk-java7/solr/build/solr-core/test-files/solr/collection1/conf/protwords.txt to /configs/conf1/protwords.txt
[junit4:junit4]   2> 278 T3212 oascc.SolrZkClient.makePath makePath: /configs/conf1/protwords.txt
[junit4:junit4]   2> 288 T3212 oasc.AbstractZkTestCase.putConfig put /usr/home/hudson/hudson-slave/workspace/Lucene-Solr-Tests-trunk-java7/solr/build/solr-core/test-files/solr/collection1/conf/currency.xml to /configs/conf1/currency.xml
[junit4:junit4]   2> 289 T3212 oascc.SolrZkClient.makePath makePath: /configs/conf1/currency.xml
[junit4:junit4]   2> 291 T3212 oasc.AbstractZkTestCase.putConfig put /usr/home/hudson/hudson-slave/workspace/Lucene-Solr-Tests-trunk-java7/solr/build/solr-core/test-files/solr/collection1/conf/open-exchange-rates.json to /configs/conf1/open-exchange-rates.json
[junit4:junit4]   2> 291 T3212 oascc.SolrZkClient.makePath makePath: /configs/conf1/open-exchange-rates.json
[junit4:junit4]   2> 294 T3212 oasc.AbstractZkTestCase.putConfig put /usr/home/hudson/hudson-slave/workspace/Lucene-Solr-Tests-trunk-java7/solr/build/solr-core/test-files/solr/collection1/conf/mapping-ISOLatin1Accent.txt to /configs/conf1/mapping-ISOLatin1Accent.txt
[junit4:junit4]   2> 294 T3212 oascc.SolrZkClient.makePath makePath: /configs/conf1/mapping-ISOLatin1Accent.txt
[junit4:junit4]   2> 302 T3212 oasc.AbstractZkTestCase.putConfig put /usr/home/hudson/hudson-slave/workspace/Lucene-Solr-Tests-trunk-java7/solr/build/solr-core/test-files/solr/collection1/conf/old_synonyms.txt to /configs/conf1/old_synonyms.txt
[junit4:junit4]   2> 302 T3212 oascc.SolrZkClient.makePath makePath: /configs/conf1/old_synonyms.txt
[junit4:junit4]   2> 305 T3212 oasc.AbstractZkTestCase.putConfig put /usr/home/hudson/hudson-slave/workspace/Lucene-Solr-Tests-trunk-java7/solr/build/solr-core/test-files/solr/collection1/conf/synonyms.txt to /configs/conf1/synonyms.txt
[junit4:junit4]   2> 305 T3212 oascc.SolrZkClient.makePath makePath: /configs/conf1/synonyms.txt
[junit4:junit4]   2> 307 T3217 oazs.PrepRequestProcessor.pRequest2Txn Processed session termination for sessionid: 0x13d7ad653990001
[junit4:junit4]   2> 315 T3221 oaz.ClientCnxn$EventThread.run EventThread shut down
[junit4:junit4]   2> 315 T3212 oaz.ZooKeeper.close Session: 0x13d7ad653990001 closed
[junit4:junit4]   2> 315 T3214 oazs.NIOServerCnxn.closeSock Closed socket connection for client /140.211.11.196:20363 which had sessionid 0x13d7ad653990001
[junit4:junit4]   2> 448 T3212 oejs.Server.doStart jetty-8.1.8.v20121106
[junit4:junit4]   2> 453 T3212 oejs.AbstractConnector.doStart Started SocketConnector@127.0.0.1:20364
[junit4:junit4]   2> 453 T3212 oass.SolrDispatchFilter.init SolrDispatchFilter.init()
[junit4:junit4]   2> 454 T3212 oasc.SolrResourceLoader.locateSolrHome JNDI not configured for solr (NoInitialContextEx)
[junit4:junit4]   2> 454 T3212 oasc.SolrResourceLoader.locateSolrHome using system property solr.solr.home: /usr/home/hudson/hudson-slave/workspace/Lucene-Solr-Tests-trunk-java7/solr/build/solr-core/test/J1/./org.apache.solr.cloud.SyncSliceTest-controljetty-1363565499592
[junit4:junit4]   2> 454 T3212 oasc.CoreContainer$Initializer.initialize looking for solr config file: /usr/home/hudson/hudson-slave/workspace/Lucene-Solr-Tests-trunk-java7/solr/build/solr-core/test/J1/./org.apache.solr.cloud.SyncSliceTest-controljetty-1363565499592/solr.xml
[junit4:junit4]   2> 455 T3212 oasc.CoreContainer.<init> New CoreContainer 1250908191
[junit4:junit4]   2> 455 T3212 oasc.CoreContainer.load Loading CoreContainer using Solr Home: '/usr/home/hudson/hudson-slave/workspace/Lucene-Solr-Tests-trunk-java7/solr/build/solr-core/test/J1/./org.apache.solr.cloud.SyncSliceTest-controljetty-1363565499592/'
[junit4:junit4]   2> 456 T3212 oasc.SolrResourceLoader.<init> new SolrResourceLoader for directory: '/usr/home/hudson/hudson-slave/workspace/Lucene-Solr-Tests-trunk-java7/solr/build/solr-core/test/J1/./org.apache.solr.cloud.SyncSliceTest-controljetty-1363565499592/'
[junit4:junit4]   2> 500 T3212 oashc.HttpShardHandlerFactory.getParameter Setting socketTimeout to: 120000
[junit4:junit4]   2> 501 T3212 oashc.HttpShardHandlerFactory.getParameter Setting urlScheme to: http://
[junit4:junit4]   2> 501 T3212 oashc.HttpShardHandlerFactory.getParameter Setting connTimeout to: 15000
[junit4:junit4]   2> 501 T3212 oashc.HttpShardHandlerFactory.getParameter Setting maxConnectionsPerHost to: 20
[junit4:junit4]   2> 502 T3212 oashc.HttpShardHandlerFactory.getParameter Setting corePoolSize to: 0
[junit4:junit4]   2> 502 T3212 oashc.HttpShardHandlerFactory.getParameter Setting maximumPoolSize to: 2147483647
[junit4:junit4]   2> 502 T3212 oashc.HttpShardHandlerFactory.getParameter Setting maxThreadIdleTime to: 5
[junit4:junit4]   2> 503 T3212 oashc.HttpShardHandlerFactory.getParameter Setting sizeOfQueue to: -1
[junit4:junit4]   2> 503 T3212 oashc.HttpShardHandlerFactory.getParameter Setting fairnessPolicy to: false
[junit4:junit4]   2> 503 T3212 oascsi.HttpClientUtil.createClient Creating new http client, config:maxConnectionsPerHost=20&maxConnections=10000&socketTimeout=120000&connTimeout=15000&retry=false
[junit4:junit4]   2> 517 T3212 oasc.CoreContainer.load Registering Log Listener
[junit4:junit4]   2> 531 T3212 oasc.CoreContainer.initZooKeeper Zookeeper client=127.0.0.1:20361/solr
[junit4:junit4]   2> 532 T3212 oasc.ZkController.checkChrootPath zkHost includes chroot
[junit4:junit4]   2> 532 T3212 oaz.ZooKeeper.<init> Initiating client connection, connectString=127.0.0.1:20361 sessionTimeout=60000 watcher=org.apache.solr.common.cloud.ConnectionManager@3aed1d63
[junit4:junit4]   2> 541 T3231 oaz.ClientCnxn$SendThread.logStartConnect Opening socket connection to server localhost/127.0.0.1:20361. Will not attempt to authenticate using SASL (access denied ("javax.security.auth.AuthPermission" "getLoginConfiguration"))
[junit4:junit4]   2> 540 T3212 oascc.ConnectionManager.waitForConnected Waiting for client to connect to ZooKeeper
[junit4:junit4]   2> 542 T3231 oaz.ClientCnxn$SendThread.primeConnection Socket connection established to localhost/127.0.0.1:20361, initiating session
[junit4:junit4]   2> 542 T3214 oazs.NIOServerCnxnFactory.run Accepted socket connection from /140.211.11.196:20365
[junit4:junit4]   2> 543 T3214 oazs.ZooKeeperServer.processConnectRequest Client attempting to establish new session at /140.211.11.196:20365
[junit4:junit4]   2> 548 T3231 oaz.ClientCnxn$SendThread.onConnected Session establishment complete on server localhost/127.0.0.1:20361, sessionid = 0x13d7ad653990002, negotiated timeout = 20000
[junit4:junit4]   2> 548 T3216 oazs.ZooKeeperServer.finishSessionInit Established session 0x13d7ad653990002 with negotiated timeout 20000 for client /140.211.11.196:20365
[junit4:junit4]   2> 549 T3232 oascc.ConnectionManager.process Watcher org.apache.solr.common.cloud.ConnectionManager@3aed1d63 name:ZooKeeperConnection Watcher:127.0.0.1:20361 got event WatchedEvent state:SyncConnected type:None path:null path:null type:None
[junit4:junit4]   2> 549 T3212 oascc.ConnectionManager.waitForConnected Client is connected to ZooKeeper
[junit4:junit4]   2> 553 T3217 oazs.PrepRequestProcessor.pRequest2Txn Processed session termination for sessionid: 0x13d7ad653990002
[junit4:junit4]   2> 637 T3232 oaz.ClientCnxn$EventThread.run EventThread shut down
[junit4:junit4]   2> 637 T3214 oazs.NIOServerCnxn.closeSock Closed socket connection for client /140.211.11.196:20365 which had sessionid 0x13d7ad653990002
[junit4:junit4]   2> 637 T3212 oaz.ZooKeeper.close Session: 0x13d7ad653990002 closed
[junit4:junit4]   2> 638 T3212 oascsi.HttpClientUtil.createClient Creating new http client, config:maxConnections=500&maxConnectionsPerHost=16&socketTimeout=120000&connTimeout=15000
[junit4:junit4]   2> 645 T3212 oaz.ZooKeeper.<init> Initiating client connection, connectString=127.0.0.1:20361/solr sessionTimeout=30000 watcher=org.apache.solr.common.cloud.ConnectionManager@5991020a
[junit4:junit4]   2> 646 T3212 oascc.ConnectionManager.waitForConnected Waiting for client to connect to ZooKeeper
[junit4:junit4]   2> 646 T3233 oaz.ClientCnxn$SendThread.logStartConnect Opening socket connection to server localhost/127.0.0.1:20361. Will not attempt to authenticate using SASL (access denied ("javax.security.auth.AuthPermission" "getLoginConfiguration"))
[junit4:junit4]   2> 647 T3233 oaz.ClientCnxn$SendThread.primeConnection Socket connection established to localhost/127.0.0.1:20361, initiating session
[junit4:junit4]   2> 647 T3214 oazs.NIOServerCnxnFactory.run Accepted socket connection from /140.211.11.196:20366
[junit4:junit4]   2> 647 T3214 oazs.ZooKeeperServer.processConnectRequest Client attempting to establish new session at /140.211.11.196:20366
[junit4:junit4]   2> 650 T3216 oazs.ZooKeeperServer.finishSessionInit Established session 0x13d7ad653990003 with negotiated timeout 20000 for client /140.211.11.196:20366
[junit4:junit4]   2> 650 T3233 oaz.ClientCnxn$SendThread.onConnected Session establishment complete on server localhost/127.0.0.1:20361, sessionid = 0x13d7ad653990003, negotiated timeout = 20000
[junit4:junit4]   2> 651 T3234 oascc.ConnectionManager.process Watcher org.apache.solr.common.cloud.ConnectionManager@5991020a name:ZooKeeperConnection Watcher:127.0.0.1:20361/solr got event WatchedEvent state:SyncConnected type:None path:null path:null type:None
[junit4:junit4]   2> 651 T3212 oascc.ConnectionManager.waitForConnected Client is connected to ZooKeeper
[junit4:junit4]   2> 684 T3212 oascc.SolrZkClient.makePath makePath: /overseer/queue
[junit4:junit4]   2> 686 T3217 oazs.PrepRequestProcessor.pRequest Got user-level KeeperException when processing sessionid:0x13d7ad653990003 type:create cxid:0x7 zxid:0x1b txntype:-1 reqpath:n/a Error Path:/solr/overseer Error:KeeperErrorCode = NodeExists for /solr/overseer
[junit4:junit4]   2> 716 T3212 oascc.SolrZkClient.makePath makePath: /overseer/collection-queue-work
[junit4:junit4]   2> 754 T3212 oascc.SolrZkClient.makePath makePath: /live_nodes
[junit4:junit4]   2> 756 T3212 oasc.ZkController.createEphemeralLiveNode Register node as live in ZooKeeper:/live_nodes/127.0.0.1:20364__zz%2Flm
[junit4:junit4]   2> 757 T3217 oazs.PrepRequestProcessor.pRequest Got user-level KeeperException when processing sessionid:0x13d7ad653990003 type:delete cxid:0x12 zxid:0x1e txntype:-1 reqpath:n/a Error Path:/solr/live_nodes/127.0.0.1:20364__zz%2Flm Error:KeeperErrorCode = NoNode for /solr/live_nodes/127.0.0.1:20364__zz%2Flm
[junit4:junit4]   2> 770 T3212 oascc.SolrZkClient.makePath makePath: /live_nodes/127.0.0.1:20364__zz%2Flm
[junit4:junit4]   2> 774 T3212 oascc.SolrZkClient.makePath makePath: /overseer_elect/election
[junit4:junit4]   2> 828 T3217 oazs.PrepRequestProcessor.pRequest Got user-level KeeperException when processing sessionid:0x13d7ad653990003 type:delete cxid:0x20 zxid:0x23 txntype:-1 reqpath:n/a Error Path:/solr/overseer_elect/leader Error:KeeperErrorCode = NoNode for /solr/overseer_elect/leader
[junit4:junit4]   2> 830 T3212 oascc.SolrZkClient.makePath makePath: /overseer_elect/leader
[junit4:junit4]   2> 862 T3212 oasc.Overseer.start Overseer (id=89362628561403907-127.0.0.1:20364__zz%2Flm-n_0000000000) starting
[junit4:junit4]   2> 863 T3217 oazs.PrepRequestProcessor.pRequest Got user-level KeeperException when processing sessionid:0x13d7ad653990003 type:create cxid:0x25 zxid:0x25 txntype:-1 reqpath:n/a Error Path:/solr/overseer Error:KeeperErrorCode = NodeExists for /solr/overseer
[junit4:junit4]   2> 864 T3217 oazs.PrepRequestProcessor.pRequest Got user-level KeeperException when processing sessionid:0x13d7ad653990003 type:create cxid:0x26 zxid:0x26 txntype:-1 reqpath:n/a Error Path:/solr/overseer Error:KeeperErrorCode = NodeExists for /solr/overseer
[junit4:junit4]   2> 870 T3217 oazs.PrepRequestProcessor.pRequest Got user-level KeeperException when processing sessionid:0x13d7ad653990003 type:create cxid:0x28 zxid:0x27 txntype:-1 reqpath:n/a Error Path:/solr/overseer Error:KeeperErrorCode = NodeExists for /solr/overseer
[junit4:junit4]   2> 871 T3212 oascc.SolrZkClient.makePath makePath: /overseer/queue-work
[junit4:junit4]   2> 878 T3217 oazs.PrepRequestProcessor.pRequest Got user-level KeeperException when processing sessionid:0x13d7ad653990003 type:create cxid:0x2e zxid:0x29 txntype:-1 reqpath:n/a Error Path:/solr/overseer Error:KeeperErrorCode = NodeExists for /solr/overseer
[junit4:junit4]   2> 880 T3236 oasc.OverseerCollectionProcessor.run Process current queue of collection creations
[junit4:junit4]   2> 880 T3212 oascc.SolrZkClient.makePath makePath: /clusterstate.json
[junit4:junit4]   2> 887 T3212 oascc.SolrZkClient.makePath makePath: /aliases.json
[junit4:junit4]   2> 888 T3212 oascc.ZkStateReader.createClusterStateWatchersAndUpdate Updating cluster state from ZooKeeper... 
[junit4:junit4]   2> 890 T3235 oasc.Overseer$ClusterStateUpdater.run Starting to work on the main queue
[junit4:junit4]   2> 893 T3237 oasc.CoreContainer.create Creating SolrCore 'collection1' using instanceDir: /usr/home/hudson/hudson-slave/workspace/Lucene-Solr-Tests-trunk-java7/solr/build/solr-core/test/J1/./org.apache.solr.cloud.SyncSliceTest-controljetty-1363565499592/collection1
[junit4:junit4]   2> 893 T3237 oasc.ZkController.createCollectionZkNode Check for collection zkNode:control_collection
[junit4:junit4]   2> 894 T3237 oasc.ZkController.createCollectionZkNode Collection zkNode exists
[junit4:junit4]   2> 894 T3237 oasc.ZkController.readConfigName Load collection config from:/collections/control_collection
[junit4:junit4]   2> 895 T3237 oasc.SolrResourceLoader.<init> new SolrResourceLoader for directory: '/usr/home/hudson/hudson-slave/workspace/Lucene-Solr-Tests-trunk-java7/solr/build/solr-core/test/J1/./org.apache.solr.cloud.SyncSliceTest-controljetty-1363565499592/collection1/'
[junit4:junit4]   2> 896 T3237 oasc.SolrResourceLoader.replaceClassLoader Adding 'file:/usr/home/hudson/hudson-slave/workspace/Lucene-Solr-Tests-trunk-java7/solr/build/solr-core/test/J1/org.apache.solr.cloud.SyncSliceTest-controljetty-1363565499592/collection1/lib/classes/' to classloader
[junit4:junit4]   2> 896 T3237 oasc.SolrResourceLoader.replaceClassLoader Adding 'file:/usr/home/hudson/hudson-slave/workspace/Lucene-Solr-Tests-trunk-java7/solr/build/solr-core/test/J1/org.apache.solr.cloud.SyncSliceTest-controljetty-1363565499592/collection1/lib/README' to classloader
[junit4:junit4]   2> 939 T3237 oasc.SolrConfig.<init> Using Lucene MatchVersion: LUCENE_50
[junit4:junit4]   2> 979 T3237 oasc.SolrConfig.<init> Loaded SolrConfig: solrconfig.xml
[junit4:junit4]   2> 1080 T3237 oass.IndexSchema.readSchema Reading Solr Schema
[junit4:junit4]   2> 1085 T3237 oass.IndexSchema.readSchema Schema name=test
[junit4:junit4]   2> 1502 T3237 oass.OpenExchangeRatesOrgProvider.init Initialized with rates=open-exchange-rates.json, refreshInterval=1440.
[junit4:junit4]   2> 1510 T3237 oass.IndexSchema.readSchema default search field in schema is text
[junit4:junit4]   2> 1513 T3237 oass.IndexSchema.readSchema unique key field: id
[junit4:junit4]   2> 1523 T3237 oass.FileExchangeRateProvider.reload Reloading exchange rates from file currency.xml
[junit4:junit4]   2> 1527 T3237 oass.FileExchangeRateProvider.reload Reloading exchange rates from file currency.xml
[junit4:junit4]   2> 1530 T3237 oass.OpenExchangeRatesOrgProvider.reload Reloading exchange rates from open-exchange-rates.json
[junit4:junit4]   2> 1531 T3237 oass.OpenExchangeRatesOrgProvider$OpenExchangeRates.<init> WARNING Unknown key IMPORTANT NOTE
[junit4:junit4]   2> 1531 T3237 oass.OpenExchangeRatesOrgProvider$OpenExchangeRates.<init> WARNING Expected key, got STRING
[junit4:junit4]   2> 1531 T3237 oass.OpenExchangeRatesOrgProvider.reload Reloading exchange rates from open-exchange-rates.json
[junit4:junit4]   2> 1532 T3237 oass.OpenExchangeRatesOrgProvider$OpenExchangeRates.<init> WARNING Unknown key IMPORTANT NOTE
[junit4:junit4]   2> 1532 T3237 oass.OpenExchangeRatesOrgProvider$OpenExchangeRates.<init> WARNING Expected key, got STRING
[junit4:junit4]   2> 1532 T3237 oasc.SolrCore.initDirectoryFactory solr.NRTCachingDirectoryFactory
[junit4:junit4]   2> 1562 T3237 oasc.SolrCore.<init> [collection1] Opening new SolrCore at /usr/home/hudson/hudson-slave/workspace/Lucene-Solr-Tests-trunk-java7/solr/build/solr-core/test/J1/./org.apache.solr.cloud.SyncSliceTest-controljetty-1363565499592/collection1/, dataDir=./org.apache.solr.cloud.SyncSliceTest-1363565499283/control/data/
[junit4:junit4]   2> 1562 T3237 oasc.JmxMonitoredMap.<init> JMX monitoring is enabled. Adding Solr mbeans to JMX Server: com.sun.jmx.mbeanserver.JmxMBeanServer@5b5bae99
[junit4:junit4]   2> 1562 T3237 oasc.SolrCore.initDirectoryFactory solr.NRTCachingDirectoryFactory
[junit4:junit4]   2> 1563 T3237 oasc.CachingDirectoryFactory.get return new directory for /usr/home/hudson/hudson-slave/workspace/Lucene-Solr-Tests-trunk-java7/solr/build/solr-core/test/J1/org.apache.solr.cloud.SyncSliceTest-1363565499283/control/data forceNew: false
[junit4:junit4]   2> 1564 T3237 oasc.SolrCore.getNewIndexDir New index directory detected: old=null new=./org.apache.solr.cloud.SyncSliceTest-1363565499283/control/data/index/
[junit4:junit4]   2> 1564 T3237 oasc.SolrCore.initIndex WARNING [collection1] Solr index directory './org.apache.solr.cloud.SyncSliceTest-1363565499283/control/data/index' doesn't exist. Creating new index...
[junit4:junit4]   2> 1565 T3237 oasc.CachingDirectoryFactory.get return new directory for /usr/home/hudson/hudson-slave/workspace/Lucene-Solr-Tests-trunk-java7/solr/build/solr-core/test/J1/org.apache.solr.cloud.SyncSliceTest-1363565499283/control/data/index forceNew: false
[junit4:junit4]   2> 1569 T3237 oasc.SolrDeletionPolicy.onCommit SolrDeletionPolicy.onCommit: commits:num=1
[junit4:junit4]   2> 		commit{dir=NRTCachingDirectory(org.apache.lucene.store.NIOFSDirectory@/usr/home/hudson/hudson-slave/workspace/Lucene-Solr-Tests-trunk-java7/solr/build/solr-core/test/J1/org.apache.solr.cloud.SyncSliceTest-1363565499283/control/data/index lockFactory=org.apache.lucene.store.NativeFSLockFactory@7bcdd983; maxCacheMB=48.0 maxMergeSizeMB=4.0),segFN=segments_1,generation=1,filenames=[segments_1]
[junit4:junit4]   2> 1570 T3237 oasc.SolrDeletionPolicy.updateCommits newest commit = 1[segments_1]
[junit4:junit4]   2> 1572 T3237 oasup.UpdateRequestProcessorChain.init inserting DistributedUpdateProcessorFactory into updateRequestProcessorChain "dedupe"
[junit4:junit4]   2> 1572 T3237 oasup.UpdateRequestProcessorChain.init inserting DistributedUpdateProcessorFactory into updateRequestProcessorChain "stored_sig"
[junit4:junit4]   2> 1572 T3237 oasup.UpdateRequestProcessorChain.init inserting DistributedUpdateProcessorFactory into updateRequestProcessorChain "distrib-dup-test-chain-implicit"
[junit4:junit4]   2> 1573 T3237 oasc.RequestHandlers.initHandlersFromConfig created standard: solr.StandardRequestHandler
[junit4:junit4]   2> 1573 T3237 oasc.RequestHandlers.initHandlersFromConfig created /get: solr.RealTimeGetHandler
[junit4:junit4]   2> 1573 T3237 oasc.RequestHandlers.initHandlersFromConfig adding lazy requestHandler: solr.ReplicationHandler
[junit4:junit4]   2> 1574 T3237 oasc.RequestHandlers.initHandlersFromConfig created /replication: solr.ReplicationHandler
[junit4:junit4]   2> 1574 T3237 oasc.RequestHandlers.initHandlersFromConfig created /update: solr.UpdateRequestHandler
[junit4:junit4]   2> 1574 T3237 oasc.RequestHandlers.initHandlersFromConfig created /admin/: org.apache.solr.handler.admin.AdminHandlers
[junit4:junit4]   2> 1583 T3237 oashl.XMLLoader.init xsltCacheLifetimeSeconds=60
[junit4:junit4]   2> 1588 T3237 oass.SolrIndexSearcher.<init> Opening Searcher@3c163a6c main
[junit4:junit4]   2> 1589 T3237 oasu.CommitTracker.<init> Hard AutoCommit: disabled
[junit4:junit4]   2> 1589 T3237 oasu.CommitTracker.<init> Soft AutoCommit: disabled
[junit4:junit4]   2> 1592 T3238 oasc.SolrCore.registerSearcher [collection1] Registered new searcher Searcher@3c163a6c main{StandardDirectoryReader(segments_1:1)}
[junit4:junit4]   2> 1592 T3237 oasc.ZkController.publish publishing core=collection1 state=down
[junit4:junit4]   2> 1592 T3237 oasc.ZkController.publish numShards not found on descriptor - reading it from system property
[junit4:junit4]   2> 2393 T3235 oascc.ZkStateReader.updateClusterState Updating cloud state from ZooKeeper... 
[junit4:junit4]   2> 2394 T3235 oasc.Overseer$ClusterStateUpdater.updateState Update state numShards=1 message={
[junit4:junit4]   2> 	  "operation":"state",
[junit4:junit4]   2> 	  "core_node_name":null,
[junit4:junit4]   2> 	  "numShards":"1",
[junit4:junit4]   2> 	  "shard":null,
[junit4:junit4]   2> 	  "roles":null,
[junit4:junit4]   2> 	  "state":"down",
[junit4:junit4]   2> 	  "core":"collection1",
[junit4:junit4]   2> 	  "collection":"control_collection",
[junit4:junit4]   2> 	  "node_name":"127.0.0.1:20364__zz%2Flm",
[junit4:junit4]   2> 	  "base_url":"http://127.0.0.1:20364/_zz/lm"}
[junit4:junit4]   2> 2394 T3235 oasc.Overseer$ClusterStateUpdater.createCollection Create collection control_collection with numShards 1
[junit4:junit4]   2> 2394 T3235 oasc.Overseer$ClusterStateUpdater.updateState Assigning new node to shard shard=shard1
[junit4:junit4]   2> 2411 T3234 oascc.ZkStateReader$2.process A cluster state change: WatchedEvent state:SyncConnected type:NodeDataChanged path:/clusterstate.json, has occurred - updating... (live nodes size: 1)
[junit4:junit4]   2> 2595 T3237 oasc.CoreContainer.registerCore registering core: collection1
[junit4:junit4]   2> 2595 T3237 oasc.ZkController.register Register replica - core:collection1 address:http://127.0.0.1:20364/_zz/lm collection:control_collection shard:shard1
[junit4:junit4]   2> 2596 T3237 oascc.SolrZkClient.makePath makePath: /collections/control_collection/leader_elect/shard1/election
[junit4:junit4]   2> 2611 T3217 oazs.PrepRequestProcessor.pRequest Got user-level KeeperException when processing sessionid:0x13d7ad653990003 type:delete cxid:0x82 zxid:0x35 txntype:-1 reqpath:n/a Error Path:/solr/collections/control_collection/leaders Error:KeeperErrorCode = NoNode for /solr/collections/control_collection/leaders
[junit4:junit4]   2> 2611 T3237 oasc.ShardLeaderElectionContext.runLeaderProcess Running the leader process.
[junit4:junit4]   2> 2612 T3217 oazs.PrepRequestProcessor.pRequest Got user-level KeeperException when processing sessionid:0x13d7ad653990003 type:create cxid:0x83 zxid:0x36 txntype:-1 reqpath:n/a Error Path:/solr/overseer Error:KeeperErrorCode = NodeExists for /solr/overseer
[junit4:junit4]   2> 2614 T3237 oasc.ShardLeaderElectionContext.waitForReplicasToComeUp Enough replicas found to continue.
[junit4:junit4]   2> 2614 T3237 oasc.ShardLeaderElectionContext.runLeaderProcess I may be the new leader - try and sync
[junit4:junit4]   2> 2615 T3237 oasc.SyncStrategy.sync Sync replicas to http://127.0.0.1:20364/_zz/lm/collection1/
[junit4:junit4]   2> 2615 T3237 oasc.SyncStrategy.syncReplicas Sync Success - now sync replicas to me
[junit4:junit4]   2> 2615 T3237 oasc.SyncStrategy.syncToMe http://127.0.0.1:20364/_zz/lm/collection1/ has no replicas
[junit4:junit4]   2> 2615 T3237 oasc.ShardLeaderElectionContext.runLeaderProcess I am the new leader: http://127.0.0.1:20364/_zz/lm/collection1/
[junit4:junit4]   2> 2616 T3237 oascc.SolrZkClient.makePath makePath: /collections/control_collection/leaders/shard1
[junit4:junit4]   2> 2619 T3217 oazs.PrepRequestProcessor.pRequest Got user-level KeeperException when processing sessionid:0x13d7ad653990003 type:create cxid:0x8e zxid:0x3a txntype:-1 reqpath:n/a Error Path:/solr/overseer Error:KeeperErrorCode = NodeExists for /solr/overseer
[junit4:junit4]   2> 3914 T3235 oascc.ZkStateReader.updateClusterState Updating cloud state from ZooKeeper... 
[junit4:junit4]   2> 3955 T3234 oascc.ZkStateReader$2.process A cluster state change: WatchedEvent state:SyncConnected type:NodeDataChanged path:/clusterstate.json, has occurred - updating... (live nodes size: 1)
[junit4:junit4]   2> 3998 T3237 oasc.ZkController.register We are http://127.0.0.1:20364/_zz/lm/collection1/ and leader is http://127.0.0.1:20364/_zz/lm/collection1/
[junit4:junit4]   2> 3998 T3237 oasc.ZkController.register No LogReplay needed for core=collection1 baseURL=http://127.0.0.1:20364/_zz/lm
[junit4:junit4]   2> 3998 T3237 oasc.ZkController.checkRecovery I am the leader, no recovery necessary
[junit4:junit4]   2> 3998 T3237 oasc.ZkController.publish publishing core=collection1 state=active
[junit4:junit4]   2> 3998 T3237 oasc.ZkController.publish numShards not found on descriptor - reading it from system property
[junit4:junit4]   2> 4000 T3237 oascc.ZkStateReader.updateClusterState Updating cloud state from ZooKeeper... 
[junit4:junit4]   2> 4001 T3212 oass.SolrDispatchFilter.init user.dir=/usr/home/hudson/hudson-slave/workspace/Lucene-Solr-Tests-trunk-java7/solr/build/solr-core/test/J1
[junit4:junit4]   2> 4002 T3212 oass.SolrDispatchFilter.init SolrDispatchFilter.init() done
[junit4:junit4]   2> 4003 T3212 oascsi.HttpClientUtil.createClient Creating new http client, config:maxConnections=128&maxConnectionsPerHost=32&followRedirects=false
[junit4:junit4]   2> 4017 T3212 oascsi.HttpClientUtil.createClient Creating new http client, config:
[junit4:junit4]   2> 4019 T3212 oaz.ZooKeeper.<init> Initiating client connection, connectString=127.0.0.1:20361/solr sessionTimeout=10000 watcher=org.apache.solr.common.cloud.ConnectionManager@673dc324
[junit4:junit4]   2> 4020 T3212 oascc.ConnectionManager.waitForConnected Waiting for client to connect to ZooKeeper
[junit4:junit4]   2> 4020 T3240 oaz.ClientCnxn$SendThread.logStartConnect Opening socket connection to server localhost/127.0.0.1:20361. Will not attempt to authenticate using SASL (access denied ("javax.security.auth.AuthPermission" "getLoginConfiguration"))
[junit4:junit4]   2> 4020 T3240 oaz.ClientCnxn$SendThread.primeConnection Socket connection established to localhost/127.0.0.1:20361, initiating session
[junit4:junit4]   2> 4021 T3214 oazs.NIOServerCnxnFactory.run Accepted socket connection from /140.211.11.196:20367
[junit4:junit4]   2> 4021 T3214 oazs.ZooKeeperServer.processConnectRequest Client attempting to establish new session at /140.211.11.196:20367
[junit4:junit4]   2> 4022 T3216 oazs.ZooKeeperServer.finishSessionInit Established session 0x13d7ad653990004 with negotiated timeout 10000 for client /140.211.11.196:20367
[junit4:junit4]   2> 4022 T3240 oaz.ClientCnxn$SendThread.onConnected Session establishment complete on server localhost/127.0.0.1:20361, sessionid = 0x13d7ad653990004, negotiated timeout = 10000
[junit4:junit4]   2> 4022 T3241 oascc.ConnectionManager.process Watcher org.apache.solr.common.cloud.ConnectionManager@673dc324 name:ZooKeeperConnection Watcher:127.0.0.1:20361/solr got event WatchedEvent state:SyncConnected type:None path:null path:null type:None
[junit4:junit4]   2> 4022 T3212 oascc.ConnectionManager.waitForConnected Client is connected to ZooKeeper
[junit4:junit4]   2> 4024 T3212 oascc.ZkStateReader.createClusterStateWatchersAndUpdate Updating cluster state from ZooKeeper... 
[junit4:junit4]   2> 4026 T3212 oasc.ChaosMonkey.monkeyLog monkey: init - expire sessions:true cause connection loss:true
[junit4:junit4]   2> 4224 T3212 oejs.Server.doStart jetty-8.1.8.v20121106
[junit4:junit4]   2> 4227 T3212 oejs.AbstractConnector.doStart Started SocketConnector@127.0.0.1:20368
[junit4:junit4]   2> 4228 T3212 oass.SolrDispatchFilter.init SolrDispatchFilter.init()
[junit4:junit4]   2> 4229 T3212 oasc.SolrResourceLoader.locateSolrHome JNDI not configured for solr (NoInitialContextEx)
[junit4:junit4]   2> 4229 T3212 oasc.SolrResourceLoader.locateSolrHome using system property solr.solr.home: /usr/home/hudson/hudson-slave/workspace/Lucene-Solr-Tests-trunk-java7/solr/build/solr-core/test/J1/./org.apache.solr.cloud.SyncSliceTest-jetty1-1363565503303
[junit4:junit4]   2> 4230 T3212 oasc.CoreContainer$Initializer.initialize looking for solr config file: /usr/home/hudson/hudson-slave/workspace/Lucene-Solr-Tests-trunk-java7/solr/build/solr-core/test/J1/./org.apache.solr.cloud.SyncSliceTest-jetty1-1363565503303/solr.xml
[junit4:junit4]   2> 4231 T3212 oasc.CoreContainer.<init> New CoreContainer 106451010
[junit4:junit4]   2> 4231 T3212 oasc.CoreContainer.load Loading CoreContainer using Solr Home: '/usr/home/hudson/hudson-slave/workspace/Lucene-Solr-Tests-trunk-java7/solr/build/solr-core/test/J1/./org.apache.solr.cloud.SyncSliceTest-jetty1-1363565503303/'
[junit4:junit4]   2> 4232 T3212 oasc.SolrResourceLoader.<init> new SolrResourceLoader for directory: '/usr/home/hudson/hudson-slave/workspace/Lucene-Solr-Tests-trunk-java7/solr/build/solr-core/test/J1/./org.apache.solr.cloud.SyncSliceTest-jetty1-1363565503303/'
[junit4:junit4]   2> 4302 T3212 oashc.HttpShardHandlerFactory.getParameter Setting socketTimeout to: 120000
[junit4:junit4]   2> 4303 T3212 oashc.HttpShardHandlerFactory.getParameter Setting urlScheme to: http://
[junit4:junit4]   2> 4304 T3212 oashc.HttpShardHandlerFactory.getParameter Setting connTimeout to: 15000
[junit4:junit4]   2> 4304 T3212 oashc.HttpShardHandlerFactory.getParameter Setting maxConnectionsPerHost to: 20
[junit4:junit4]   2> 4305 T3212 oashc.HttpShardHandlerFactory.getParameter Setting corePoolSize to: 0
[junit4:junit4]   2> 4305 T3212 oashc.HttpShardHandlerFactory.getParameter Setting maximumPoolSize to: 2147483647
[junit4:junit4]   2> 4306 T3212 oashc.HttpShardHandlerFactory.getParameter Setting maxThreadIdleTime to: 5
[junit4:junit4]   2> 4306 T3212 oashc.HttpShardHandlerFactory.getParameter Setting sizeOfQueue to: -1
[junit4:junit4]   2> 4307 T3212 oashc.HttpShardHandlerFactory.getParameter Setting fairnessPolicy to: false
[junit4:junit4]   2> 4307 T3212 oascsi.HttpClientUtil.createClient Creating new http client, config:maxConnectionsPerHost=20&maxConnections=10000&socketTimeout=120000&connTimeout=15000&retry=false
[junit4:junit4]   2> 4331 T3212 oasc.CoreContainer.load Registering Log Listener
[junit4:junit4]   2> 4353 T3212 oasc.CoreContainer.initZooKeeper Zookeeper client=127.0.0.1:20361/solr
[junit4:junit4]   2> 4354 T3212 oasc.ZkController.checkChrootPath zkHost includes chroot
[junit4:junit4]   2> 4354 T3212 oaz.ZooKeeper.<init> Initiating client connection, connectString=127.0.0.1:20361 sessionTimeout=60000 watcher=org.apache.solr.common.cloud.ConnectionManager@4d64b95a
[junit4:junit4]   2> 4355 T3212 oascc.ConnectionManager.waitForConnected Waiting for client to connect to ZooKeeper
[junit4:junit4]   2> 4356 T3251 oaz.ClientCnxn$SendThread.logStartConnect Opening socket connection to server localhost/127.0.0.1:20361. Will not attempt to authenticate using SASL (access denied ("javax.security.auth.AuthPermission" "getLoginConfiguration"))
[junit4:junit4]   2> 4357 T3251 oaz.ClientCnxn$SendThread.primeConnection Socket connection established to localhost/127.0.0.1:20361, initiating session
[junit4:junit4]   2> 4357 T3214 oazs.NIOServerCnxnFactory.run Accepted socket connection from /140.211.11.196:20369
[junit4:junit4]   2> 4357 T3214 oazs.ZooKeeperServer.processConnectRequest Client attempting to establish new session at /140.211.11.196:20369
[junit4:junit4]   2> 4359 T3216 oazs.ZooKeeperServer.finishSessionInit Established session 0x13d7ad653990005 with negotiated timeout 20000 for client /140.211.11.196:20369
[junit4:junit4]   2> 4359 T3251 oaz.ClientCnxn$SendThread.onConnected Session establishment complete on server localhost/127.0.0.1:20361, sessionid = 0x13d7ad653990005, negotiated timeout = 20000
[junit4:junit4]   2> 4359 T3252 oascc.ConnectionManager.process Watcher org.apache.solr.common.cloud.ConnectionManager@4d64b95a name:ZooKeeperConnection Watcher:127.0.0.1:20361 got event WatchedEvent state:SyncConnected type:None path:null path:null type:None
[junit4:junit4]   2> 4360 T3212 oascc.ConnectionManager.waitForConnected Client is connected to ZooKeeper
[junit4:junit4]   2> 4361 T3217 oazs.PrepRequestProcessor.pRequest2Txn Processed session termination for sessionid: 0x13d7ad653990005
[junit4:junit4]   2> 4375 T3252 oaz.ClientCnxn$EventThread.run EventThread shut down
[junit4:junit4]   2> 4375 T3214 oazs.NIOServerCnxn.closeSock Closed socket connection for client /140.211.11.196:20369 which had sessionid 0x13d7ad653990005
[junit4:junit4]   2> 4375 T3212 oaz.ZooKeeper.close Session: 0x13d7ad653990005 closed
[junit4:junit4]   2> 4376 T3212 oascsi.HttpClientUtil.createClient Creating new http client, config:maxConnections=500&maxConnectionsPerHost=16&socketTimeout=120000&connTimeout=15000
[junit4:junit4]   2> 4388 T3212 oaz.ZooKeeper.<init> Initiating client connection, connectString=127.0.0.1:20361/solr sessionTimeout=30000 watcher=org.apache.solr.common.cloud.ConnectionManager@51a55a68
[junit4:junit4]   2> 4390 T3212 oascc.ConnectionManager.waitForConnected Waiting for client to connect to ZooKeeper
[junit4:junit4]   2> 4390 T3253 oaz.ClientCnxn$SendThread.logStartConnect Opening socket connection to server localhost/127.0.0.1:20361. Will not attempt to authenticate using SASL (access denied ("javax.security.auth.AuthPermission" "getLoginConfiguration"))
[junit4:junit4]   2> 4391 T3253 oaz.ClientCnxn$SendThread.primeConnection Socket connection established to localhost/127.0.0.1:20361, initiating session
[junit4:junit4]   2> 4391 T3214 oazs.NIOServerCnxnFactory.run Accepted socket connection from /140.211.11.196:20370
[junit4:junit4]   2> 4391 T3214 oazs.ZooKeeperServer.processConnectRequest Client attempting to establish new session at /140.211.11.196:20370
[junit4:junit4]   2> 4392 T3216 oazs.ZooKeeperServer.finishSessionInit Established session 0x13d7ad653990006 with negotiated timeout 20000 for client /140.211.11.196:20370
[junit4:junit4]   2> 4392 T3253 oaz.ClientCnxn$SendThread.onConnected Session establishment complete on server localhost/127.0.0.1:20361, sessionid = 0x13d7ad653990006, negotiated timeout = 20000
[junit4:junit4]   2> 4392 T3254 oascc.ConnectionManager.process Watcher org.apache.solr.common.cloud.ConnectionManager@51a55a68 name:ZooKeeperConnection Watcher:127.0.0.1:20361/solr got event WatchedEvent state:SyncConnected type:None path:null path:null type:None
[junit4:junit4]   2> 4393 T3212 oascc.ConnectionManager.waitForConnected Client is connected to ZooKeeper
[junit4:junit4]   2> 4394 T3217 oazs.PrepRequestProcessor.pRequest Got user-level KeeperException when processing sessionid:0x13d7ad653990006 type:create cxid:0x1 zxid:0x48 txntype:-1 reqpath:n/a Error Path:/solr/overseer Error:KeeperErrorCode = NodeExists for /solr/overseer
[junit4:junit4]   2> 4395 T3217 oazs.PrepRequestProcessor.pRequest Got user-level KeeperException when processing sessionid:0x13d7ad653990006 type:create cxid:0x3 zxid:0x49 txntype:-1 reqpath:n/a Error Path:/solr/overseer Error:KeeperErrorCode = NodeExists for /solr/overseer
[junit4:junit4]   2> 4404 T3212 oascc.ZkStateReader.createClusterStateWatchersAndUpdate Updating cluster state from ZooKeeper... 
[junit4:junit4]   2> 5407 T3212 oasc.ZkController.createEphemeralLiveNode Register node as live in ZooKeeper:/live_nodes/127.0.0.1:20368__zz%2Flm
[junit4:junit4]   2> 5408 T3217 oazs.PrepRequestProcessor.pRequest Got user-level KeeperException when processing sessionid:0x13d7ad653990006 type:delete cxid:0xd zxid:0x4a txntype:-1 reqpath:n/a Error Path:/solr/live_nodes/127.0.0.1:20368__zz%2Flm Error:KeeperErrorCode = NoNode for /solr/live_nodes/127.0.0.1:20368__zz%2Flm
[junit4:junit4]   2> 5435 T3212 oascc.SolrZkClient.makePath makePath: /live_nodes/127.0.0.1:20368__zz%2Flm
[junit4:junit4]   2> 5439 T3254 oascc.ZkStateReader$3.process Updating live nodes... (2)
[junit4:junit4]   2> 5439 T3241 oascc.ZkStateReader$3.process Updating live nodes... (2)
[junit4:junit4]   2> 5439 T3234 oascc.ZkStateReader$3.process Updating live nodes... (2)
[junit4:junit4]   2> 5439 T3234 oascc.ZkStateReader$2.process A cluster state change: WatchedEvent state:SyncConnected type:NodeChildrenChanged path:/live_nodes, has occurred - updating... (live nodes size: 2)
[junit4:junit4]   2> 5445 T3255 oasc.CoreContainer.create Creating SolrCore 'collection1' using instanceDir: /usr/home/hudson/hudson-slave/workspace/Lucene-Solr-Tests-trunk-java7/solr/build/solr-core/test/J1/./org.apache.solr.cloud.SyncSliceTest-jetty1-1363565503303/collection1
[junit4:junit4]   2> 5445 T3255 oasc.ZkController.createCollectionZkNode Check for collection zkNode:collection1
[junit4:junit4]   2> 5445 T3255 oasc.ZkController.createCollectionZkNode Collection zkNode exists
[junit4:junit4]   2> 5445 T3255 oasc.ZkController.readConfigName Load collection config from:/collections/collection1
[junit4:junit4]   2> 5446 T3255 oasc.SolrResourceLoader.<init> new SolrResourceLoader for directory: '/usr/home/hudson/hudson-slave/workspace/Lucene-Solr-Tests-trunk-java7/solr/build/solr-core/test/J1/./org.apache.solr.cloud.SyncSliceTest-jetty1-1363565503303/collection1/'
[junit4:junit4]   2> 5447 T3255 oasc.SolrResourceLoader.replaceClassLoader Adding 'file:/usr/home/hudson/hudson-slave/workspace/Lucene-Solr-Tests-trunk-java7/solr/build/solr-core/test/J1/org.apache.solr.cloud.SyncSliceTest-jetty1-1363565503303/collection1/lib/README' to classloader
[junit4:junit4]   2> 5448 T3255 oasc.SolrResourceLoader.replaceClassLoader Adding 'file:/usr/home/hudson/hudson-slave/workspace/Lucene-Solr-Tests-trunk-java7/solr/build/solr-core/test/J1/org.apache.solr.cloud.SyncSliceTest-jetty1-1363565503303/collection1/lib/classes/' to classloader
[junit4:junit4]   2> 5467 T3235 oascc.ZkStateReader.updateClusterState Updating cloud state from ZooKeeper... 
[junit4:junit4]   2> 5467 T3235 oasc.Overseer$ClusterStateUpdater.updateState Update state numShards=1 message={
[junit4:junit4]   2> 	  "operation":"state",
[junit4:junit4]   2> 	  "core_node_name":"127.0.0.1:20364__zz%2Flm_collection1",
[junit4:junit4]   2> 	  "numShards":"1",
[junit4:junit4]   2> 	  "shard":"shard1",
[junit4:junit4]   2> 	  "roles":null,
[junit4:junit4]   2> 	  "state":"active",
[junit4:junit4]   2> 	  "core":"collection1",
[junit4:junit4]   2> 	  "collection":"control_collection",
[junit4:junit4]   2> 	  "node_name":"127.0.0.1:20364__zz%2Flm",
[junit4:junit4]   2> 	  "base_url":"http://127.0.0.1:20364/_zz/lm"}
[junit4:junit4]   2> 5481 T3254 oascc.ZkStateReader$2.process A cluster state change: WatchedEvent state:SyncConnected type:NodeDataChanged path:/clusterstate.json, has occurred - updating... (live nodes size: 2)
[junit4:junit4]   2> 5481 T3241 oascc.ZkStateReader$2.process A cluster state change: WatchedEvent state:SyncConnected type:NodeDataChanged path:/clusterstate.json, has occurred - updating... (live nodes size: 2)
[junit4:junit4]   2> 5481 T3234 oascc.ZkStateReader$2.process A cluster state change: WatchedEvent state:SyncConnected type:NodeDataChanged path:/clusterstate.json, has occurred - updating... (live nodes size: 2)
[junit4:junit4]   2> 5486 T3255 oasc.SolrConfig.<init> Using Lucene MatchVersion: LUCENE_50
[junit4:junit4]   2> 5528 T3255 oasc.SolrConfig.<init> Loaded SolrConfig: solrconfig.xml
[junit4:junit4]   2> 5629 T3255 oass.IndexSchema.readSchema Reading Solr Schema
[junit4:junit4]   2> 5635 T3255 oass.IndexSchema.readSchema Schema name=test
[junit4:junit4]   2> 6105 T3255 oass.OpenExchangeRatesOrgProvider.init Initialized with rates=open-exchange-rates.json, refreshInterval=1440.
[junit4:junit4]   2> 6113 T3255 oass.IndexSchema.readSchema default search field in schema is text
[junit4:junit4]   2> 6116 T3255 oass.IndexSchema.readSchema unique key field: id
[junit4:junit4]   2> 6125 T3255 oass.FileExchangeRateProvider.reload Reloading exchange rates from file currency.xml
[junit4:junit4]   2> 6129 T3255 oass.FileExchangeRateProvider.reload Reloading exchange rates from file currency.xml
[junit4:junit4]   2> 6132 T3255 oass.OpenExchangeRatesOrgProvider.reload Reloading exchange rates from open-exchange-rates.json
[junit4:junit4]   2> 6133 T3255 oass.OpenExchangeRatesOrgProvider$OpenExchangeRates.<init> WARNING Unknown key IMPORTANT NOTE
[junit4:junit4]   2> 6134 T3255 oass.OpenExchangeRatesOrgProvider$OpenExchangeRates.<init> WARNING Expected key, got STRING
[junit4:junit4]   2> 6135 T3255 oass.OpenExchangeRatesOrgProvider.reload Reloading exchange rates from open-exchange-rates.json
[junit4:junit4]   2> 6135 T3255 oass.OpenExchangeRatesOrgProvider$OpenExchangeRates.<init> WARNING Unknown key IMPORTANT NOTE
[junit4:junit4]   2> 6136 T3255 oass.OpenExchangeRatesOrgProvider$OpenExchangeRates.<init> WARNING Expected key, got STRING
[junit4:junit4]   2> 6136 T3255 oasc.SolrCore.initDirectoryFactory solr.NRTCachingDirectoryFactory
[junit4:junit4]   2> 6136 T3255 oasc.SolrCore.<init> [collection1] Opening new SolrCore at /usr/home/hudson/hudson-slave/workspace/Lucene-Solr-Tests-trunk-java7/solr/build/solr-core/test/J1/./org.apache.solr.cloud.SyncSliceTest-jetty1-1363565503303/collection1/, dataDir=./org.apache.solr.cloud.SyncSliceTest-1363565499283/jetty1/
[junit4:junit4]   2> 6136 T3255 oasc.JmxMonitoredMap.<init> JMX monitoring is enabled. Adding Solr mbeans to JMX Server: com.sun.jmx.mbeanserver.JmxMBeanServer@5b5bae99
[junit4:junit4]   2> 6137 T3255 oasc.SolrCore.initDirectoryFactory solr.NRTCachingDirectoryFactory
[junit4:junit4]   2> 6137 T3255 oasc.CachingDirectoryFactory.get return new directory for /usr/home/hudson/hudson-slave/workspace/Lucene-Solr-Tests-trunk-java7/solr/build/solr-core/test/J1/org.apache.solr.cloud.SyncSliceTest-1363565499283/jetty1 forceNew: false
[junit4:junit4]   2> 6138 T3255 oasc.SolrCore.getNewIndexDir New index directory detected: old=null new=./org.apache.solr.cloud.SyncSliceTest-1363565499283/jetty1/index/
[junit4:junit4]   2> 6138 T3255 oasc.SolrCore.initIndex WARNING [collection1] Solr index directory './org.apache.solr.cloud.SyncSliceTest-1363565499283/jetty1/index' doesn't exist. Creating new index...
[junit4:junit4]   2> 6139 T3255 oasc.CachingDirectoryFactory.get return new directory for /usr/home/hudson/hudson-slave/workspace/Lucene-Solr-Tests-trunk-java7/solr/build/solr-core/test/J1/org.apache.solr.cloud.SyncSliceTest-1363565499283/jetty1/index forceNew: false
[junit4:junit4]   2> 6147 T3255 oasc.SolrDeletionPolicy.onCommit SolrDeletionPolicy.onCommit: commits:num=1
[junit4:junit4]   2> 		commit{dir=NRTCachingDirectory(org.apache.lucene.store.NIOFSDirectory@/usr/home/hudson/hudson-slave/workspace/Lucene-Solr-Tests-trunk-java7/solr/build/solr-core/test/J1/org.apache.solr.cloud.SyncSliceTest-1363565499283/jetty1/index lockFactory=org.apache.lucene.store.NativeFSLockFactory@461bb495; maxCacheMB=48.0 maxMergeSizeMB=4.0),segFN=segments_1,generation=1,filenames=[segments_1]
[junit4:junit4]   2> 6147 T3255 oasc.SolrDeletionPolicy.updateCommits newest commit = 1[segments_1]
[junit4:junit4]   2> 6150 T3255 oasup.UpdateRequestProcessorChain.init inserting DistributedUpdateProcessorFactory into updateRequestProcessorChain "dedupe"
[junit4:junit4]   2> 6150 T3255 oasup.UpdateRequestProcessorChain.init inserting DistributedUpdateProcessorFactory into updateRequestProcessorChain "stored_sig"
[junit4:junit4]   2> 6151 T3255 oasup.UpdateRequestProcessorChain.init inserting DistributedUpdateProcessorFactory into updateRequestProcessorChain "distrib-dup-test-chain-implicit"
[junit4:junit4]   2> 6151 T3255 oasc.RequestHandlers.initHandlersFromConfig created standard: solr.StandardRequestHandler
[junit4:junit4]   2> 6152 T3255 oasc.RequestHandlers.initHandlersFromConfig created /get: solr.RealTimeGetHandler
[junit4:junit4]   2> 6152 T3255 oasc.RequestHandlers.initHandlersFromConfig adding lazy requestHandler: solr.ReplicationHandler
[junit4:junit4]   2> 6152 T3255 oasc.RequestHandlers.initHandlersFromConfig created /replication: solr.ReplicationHandler
[junit4:junit4]   2> 6152 T3255 oasc.RequestHandlers.initHandlersFromConfig created /update: solr.UpdateRequestHandler
[junit4:junit4]   2> 6153 T3255 oasc.RequestHandlers.initHandlersFromConfig created /admin/: org.apache.solr.handler.admin.AdminHandlers
[junit4:junit4]   2> 6161 T3255 oashl.XMLLoader.init xsltCacheLifetimeSeconds=60
[junit4:junit4]   2> 6167 T3255 oass.SolrIndexSearcher.<init> Opening Searcher@4c1c3678 main
[junit4:junit4]   2> 6168 T3255 oasu.CommitTracker.<init> Hard AutoCommit: disabled
[junit4:junit4]   2> 6168 T3255 oasu.CommitTracker.<init> Soft AutoCommit: disabled
[junit4:junit4]   2> 6171 T3256 oasc.SolrCore.registerSearcher [collection1] Registered new searcher Searcher@4c1c3678 main{StandardDirectoryReader(segments_1:1)}
[junit4:junit4]   2> 6172 T3255 oasc.ZkController.publish publishing core=collection1 state=down
[junit4:junit4]   2> 6173 T3255 oasc.ZkController.publish numShards not found on descriptor - reading it from system property
[junit4:junit4]   2> 6985 T3235 oascc.ZkStateReader.updateClusterState Updating cloud state from ZooKeeper... 
[junit4:junit4]   2> 6986 T3235 oasc.Overseer$ClusterStateUpdater.updateState Update state numShards=1 message={
[junit4:junit4]   2> 	  "operation":"state",
[junit4:junit4]   2> 	  "core_node_name":null,
[junit4:junit4]   2> 	  "numShards":"1",
[junit4:junit4]   2> 	  "shard":null,
[junit4:junit4]   2> 	  "roles":null,
[junit4:junit4]   2> 	  "state":"down",
[junit4:junit4]   2> 	  "core":"collection1",
[junit4:junit4]   2> 	  "collection":"collection1",
[junit4:junit4]   2> 	  "node_name":"127.0.0.1:20368__zz%2Flm",
[junit4:junit4]   2> 	  "base_url":"http://127.0.0.1:20368/_zz/lm"}
[junit4:junit4]   2> 6986 T3235 oasc.Overseer$ClusterStateUpdater.createCollection Create collection collection1 with numShards 1
[junit4:junit4]   2> 6986 T3235 oasc.Overseer$ClusterStateUpdater.updateState Assigning new node to shard shard=shard1
[junit4:junit4]   2> 6991 T3234 oascc.ZkStateReader$2.process A cluster state change: WatchedEvent state:SyncConnected type:NodeDataChanged path:/clusterstate.json, has occurred - updating... (live nodes size: 2)
[junit4:junit4]   2> 6991 T3254 oascc.ZkStateReader$2.process A cluster state change: WatchedEvent state:SyncConnected type:NodeDataChanged path:/clusterstate.json, has occurred - updating... (live nodes size: 2)
[junit4:junit4]   2> 6991 T3241 oascc.ZkStateReader$2.process A cluster state change: WatchedEvent state:SyncConnected type:NodeDataChanged path:/clusterstate.json, has occurred - updating... (live nodes size: 2)
[junit4:junit4]   2> 7175 T3255 oasc.CoreContainer.registerCore registering core: collection1
[junit4:junit4]   2> 7175 T3255 oasc.ZkController.register Register replica - core:collection1 address:http://127.0.0.1:20368/_zz/lm collection:collection1 shard:shard1
[junit4:junit4]   2> 7176 T3255 oascc.SolrZkClient.makePath makePath: /collections/collection1/leader_elect/shard1/election
[junit4:junit4]   2> 7190 T3217 oazs.PrepRequestProcessor.pRequest Got user-level KeeperException when processing sessionid:0x13d7ad653990006 type:delete cxid:0x4a zxid:0x5a txntype:-1 reqpath:n/a Error Path:/solr/collections/collection1/leaders Error:KeeperErrorCode = NoNode for /solr/collections/collection1/leaders
[junit4:junit4]   2> 7191 T3255 oasc.ShardLeaderElectionContext.runLeaderProcess Running the leader process.
[junit4:junit4]   2> 7191 T3217 oazs.PrepRequestProcessor.pRequest Got user-level KeeperException when processing sessionid:0x13d7ad653990006 type:create cxid:0x4b zxid:0x5b txntype:-1 reqpath:n/a Error Path:/solr/overseer Error:KeeperErrorCode = NodeExists for /solr/overseer
[junit4:junit4]   2> 7194 T3255 oasc.ShardLeaderElectionContext.waitForReplicasToComeUp Enough replicas found to continue.
[junit4:junit4]   2> 7194 T3255 oasc.ShardLeaderElectionContext.runLeaderProcess I may be the new leader - try and sync
[junit4:junit4]   2> 7194 T3255 oasc.SyncStrategy.sync Sync replicas to http://127.0.0.1:20368/_zz/lm/collection1/
[junit4:junit4]   2> 7194 T3255 oasc.SyncStrategy.syncReplicas Sync Success - now sync replicas to me
[junit4:junit4]   2> 7194 T3255 oasc.SyncStrategy.syncToMe http://127.0.0.1:20368/_zz/lm/collection1/ has no replicas
[junit4:junit4]   2> 7194 T3255 oasc.ShardLeaderElectionContext.runLeaderProcess I am the new leader: http://127.0.0.1:20368/_zz/lm/collection1/
[junit4:junit4]   2> 7195 T3255 oascc.SolrZkClient.makePath makePath: /collections/collection1/leaders/shard1
[junit4:junit4]   2> 7198 T3217 oazs.PrepRequestProcessor.pRequest Got user-level KeeperException when processing sessionid:0x13d7ad653990006 type:create cxid:0x56 zxid:0x5f txntype:-1 reqpath:n/a Error Path:/solr/overseer Error:KeeperErrorCode = NodeExists for /solr/overseer
[junit4:junit4]   2> 8511 T3235 oascc.ZkStateReader.updateClusterState Updating cloud state from ZooKeeper... 
[junit4:junit4]   2> 8554 T3241 oascc.ZkStateReader$2.process A cluster state change: WatchedEvent state:SyncConnected type:NodeDataChanged path:/clusterstate.json, has occurred - updating... (live nodes size: 2)
[junit4:junit4]   2> 8554 T3254 oascc.ZkStateReader$2.process A cluster state change: WatchedEvent state:SyncConnected type:NodeDataChanged path:/clusterstate.json, has occurred - updating... (live nodes size: 2)
[junit4:junit4]   2> 8554 T3234 oascc.ZkStateReader$2.process A cluster state change: WatchedEvent state:SyncConnected type:NodeDataChanged path:/clusterstate.json, has occurred - updating... (live nodes size: 2)
[junit4:junit4]   2> 8577 T3255 oasc.ZkController.register We are http://127.0.0.1:20368/_zz/lm/collection1/ and leader is http://127.0.0.1:20368/_zz/lm/collection1/
[junit4:junit4]   2> 8577 T3255 oasc.ZkController.register No LogReplay needed for core=collection1 baseURL=http://127.0.0.1:20368/_zz/lm
[junit4:junit4]   2> 8577 T3255 oasc.ZkController.checkRecovery I am the leader, no recovery necessary
[junit4:junit4]   2> 8577 T3255 oasc.ZkController.publish publishing core=collection1 state=active
[junit4:junit4]   2> 8578 T3255 oasc.ZkController.publish numShards not found on descriptor - reading it from system property
[junit4:junit4]   2> 8579 T3255 oascc.ZkStateReader.updateClusterState Updating cloud state from ZooKeeper... 
[junit4:junit4]   2> 8580 T3212 oass.SolrDispatchFilter.init user.dir=/usr/home/hudson/hudson-slave/workspace/Lucene-Solr-Tests-trunk-java7/solr/build/solr-core/test/J1
[junit4:junit4]   2> 8581 T3212 oass.SolrDispatchFilter.init SolrDispatchFilter.init() done
[junit4:junit4]   2> 8581 T3212 oascsi.HttpClientUtil.createClient Creating new http client, config:maxConnections=128&maxConnectionsPerHost=32&followRedirects=false
[junit4:junit4]   2> 8773 T3212 oejs.Server.doStart jetty-8.1.8.v20121106
[junit4:junit4]   2> 8777 T3212 oejs.AbstractConnector.doStart Started SocketConnector@127.0.0.1:20371
[junit4:junit4]   2> 8778 T3212 oass.SolrDispatchFilter.init SolrDispatchFilter.init()
[junit4:junit4]   2> 8778 T3212 oasc.SolrResourceLoader.locateSolrHome JNDI not configured for solr (NoInitialContextEx)
[junit4:junit4]   2> 8779 T3212 oasc.SolrResourceLoader.locateSolrHome using system property solr.solr.home: /usr/home/hudson/hudson-slave/workspace/Lucene-Solr-Tests-trunk-java7/solr/build/solr-core/test/J1/./org.apache.solr.cloud.SyncSliceTest-jetty2-1363565507868
[junit4:junit4]   2> 8779 T3212 oasc.CoreContainer$Initializer.initialize looking for solr config file: /usr/home/hudson/hudson-slave/workspace/Lucene-Solr-Tests-trunk-java7/solr/build/solr-core/test/J1/./org.apache.solr.cloud.SyncSliceTest-jetty2-1363565507868/solr.xml
[junit4:junit4]   2> 8780 T3212 oasc.CoreContainer.<init> New CoreContainer 1715387315
[junit4:junit4]   2> 8781 T3212 oasc.CoreContainer.load Loading CoreContainer using Solr Home: '/usr/home/hudson/hudson-slave/workspace/Lucene-Solr-Tests-trunk-java7/solr/build/solr-core/test/J1/./org.apache.solr.cloud.SyncSliceTest-jetty2-1363565507868/'
[junit4:junit4]   2> 8781 T3212 oasc.SolrResourceLoader.<init> new SolrResourceLoader for directory: '/usr/home/hudson/hudson-slave/workspace/Lucene-Solr-Tests-trunk-java7/solr/build/solr-core/test/J1/./org.apache.solr.cloud.SyncSliceTest-jetty2-1363565507868/'
[junit4:junit4]   2> 8845 T3212 oashc.HttpShardHandlerFactory.getParameter Setting socketTimeout to: 120000
[junit4:junit4]   2> 8845 T3212 oashc.HttpShardHandlerFactory.getParameter Setting urlScheme to: http://
[junit4:junit4]   2> 8846 T3212 oashc.HttpShardHandlerFactory.getParameter Setting connTimeout to: 15000
[junit4:junit4]   2> 8846 T3212 oashc.HttpShardHandlerFactory.getParameter Setting maxConnectionsPerHost to: 20
[junit4:junit4]   2> 8847 T3212 oashc.HttpShardHandlerFactory.getParameter Setting corePoolSize to: 0
[junit4:junit4]   2> 8847 T3212 oashc.HttpShardHandlerFactory.getParameter Setting maximumPoolSize to: 2147483647
[junit4:junit4]   2> 8848 T3212 oashc.HttpShardHandlerFactory.getParameter Setting maxThreadIdleTime to: 5
[junit4:junit4]   2> 8848 T3212 oashc.HttpShardHandlerFactory.getParameter Setting sizeOfQueue to: -1
[junit4:junit4]   2> 8849 T3212 oashc.HttpShardHandlerFactory.getParameter Setting fairnessPolicy to: false
[junit4:junit4]   2> 8849 T3212 oascsi.HttpClientUtil.createClient Creating new http client, config:maxConnectionsPerHost=20&maxConnections=10000&socketTimeout=120000&connTimeout=15000&retry=false
[junit4:junit4]   2> 8868 T3212 oasc.CoreContainer.load Registering Log Listener
[junit4:junit4]   2> 8887 T3212 oasc.CoreContainer.initZooKeeper Zookeeper client=127.0.0.1:20361/solr
[junit4:junit4]   2> 8888 T3212 oasc.ZkController.checkChrootPath zkHost includes chroot
[junit4:junit4]   2> 8888 T3212 oaz.ZooKeeper.<init> Initiating client connection, connectString=127.0.0.1:20361 sessionTimeout=60000 watcher=org.apache.solr.common.cloud.ConnectionManager@3c0dc8cf
[junit4:junit4]   2> 8890 T3212 oascc.ConnectionManager.waitForConnected Waiting for client to connect to ZooKeeper
[junit4:junit4]   2> 8890 T3267 oaz.ClientCnxn$SendThread.logStartConnect Opening socket connection to server localhost/127.0.0.1:20361. Will not attempt to authenticate using SASL (access denied ("javax.security.auth.AuthPermission" "getLoginConfiguration"))
[junit4:junit4]   2> 8891 T3267 oaz.ClientCnxn$SendThread.primeConnection Socket connection established to localhost/127.0.0.1:20361, initiating session
[junit4:junit4]   2> 8891 T3214 oazs.NIOServerCnxnFactory.run Accepted socket connection from /140.211.11.196:20372
[junit4:junit4]   2> 8891 T3214 oazs.ZooKeeperServer.processConnectRequest Client attempting to establish new session at /140.211.11.196:20372
[junit4:junit4]   2> 8893 T3216 oazs.ZooKeeperServer.finishSessionInit Established session 0x13d7ad653990007 with negotiated timeout 20000 for client /140.211.11.196:20372
[junit4:junit4]   2> 8893 T3267 oaz.ClientCnxn$SendThread.onConnected Session establishment complete on server localhost/127.0.0.1:20361, sessionid = 0x13d7ad653990007, negotiated timeout = 20000
[junit4:junit4]   2> 8894 T3268 oascc.ConnectionManager.process Watcher org.apache.solr.common.cloud.ConnectionManager@3c0dc8cf name:ZooKeeperConnection Watcher:127.0.0.1:20361 got event WatchedEvent state:SyncConnected type:None path:null path:null type:None
[junit4:junit4]   2> 8894 T3212 oascc.ConnectionManager.waitForConnected Client is connected to ZooKeeper
[junit4:junit4]   2> 8895 T3217 oazs.PrepRequestProcessor.pRequest2Txn Processed session termination for sessionid: 0x13d7ad653990007
[junit4:junit4]   2> 8909 T3268 oaz.ClientCnxn$EventThread.run EventThread shut down
[junit4:junit4]   2> 8909 T3214 oazs.NIOServerCnxn.closeSock Closed socket connection for client /140.211.11.196:20372 which had sessionid 0x13d7ad653990007
[junit4:junit4]   2> 8909 T3212 oaz.ZooKeeper.close Session: 0x13d7ad653990007 closed
[junit4:junit4]   2> 8910 T3212 oascsi.HttpClientUtil.createClient Creating new http client, config:maxConnections=500&maxConnectionsPerHost=16&socketTimeout=120000&connTimeout=15000
[junit4:junit4]   2> 8917 T3212 oaz.ZooKeeper.<init> Initiating client connection, connectString=127.0.0.1:20361/solr sessionTimeout=30000 watcher=org.apache.solr.common.cloud.ConnectionManager@3889a988
[junit4:junit4]   2> 8918 T3212 oascc.ConnectionManager.waitForConnected Waiting for client to connect to ZooKeeper
[junit4:junit4]   2> 8918 T3269 oaz.ClientCnxn$SendThread.logStartConnect Opening socket connection to server localhost/127.0.0.1:20361. Will not attempt to authenticate using SASL (access denied ("javax.security.auth.AuthPermission" "getLoginConfiguration"))
[junit4:junit4]   2> 8919 T3269 oaz.ClientCnxn$SendThread.primeConnection Socket connection established to localhost/127.0.0.1:20361, initiating session
[junit4:junit4]   2> 8919 T3214 oazs.NIOServerCnxnFactory.run Accepted socket connection from /140.211.11.196:20373
[junit4:junit4]   2> 8919 T3214 oazs.ZooKeeperServer.processConnectRequest Client attempting to establish new session at /140.211.11.196:20373
[junit4:junit4]   2> 8921 T3216 oazs.ZooKeeperServer.finishSessionInit Established session 0x13d7ad653990008 with negotiated timeout 20000 for client /140.211.11.196:20373
[junit4:junit4]   2> 8921 T3269 oaz.ClientCnxn$SendThread.onConnected Session establishment complete on server localhost/127.0.0.1:20361, sessionid = 0x13d7ad653990008, negotiated timeout = 20000
[junit4:junit4]   2> 8921 T3270 oascc.ConnectionManager.process Watcher org.apache.solr.common.cloud.ConnectionManager@3889a988 name:ZooKeeperConnection Watcher:127.0.0.1:20361/solr got event WatchedEvent state:SyncConnected type:None path:null path:null type:None
[junit4:junit4]   2> 8921 T3212 oascc.ConnectionManager.waitForConnected Client is connected to ZooKeeper
[junit4:junit4]   2> 8922 T3217 oazs.PrepRequestProcessor.pRequest Got user-level KeeperException when processing sessionid:0x13d7ad653990008 type:create cxid:0x1 zxid:0x6c txntype:-1 reqpath:n/a Error Path:/solr/overseer Error:KeeperErrorCode = NodeExists for /solr/overseer
[junit4:junit4]   2> 8924 T3217 oazs.PrepRequestProcessor.pRequest Got user-level KeeperException when processing sessionid:0x13d7ad653990008 type:create cxid:0x3 zxid:0x6d txntype:-1 reqpath:n/a Error Path:/solr/overseer Error:KeeperErrorCode = NodeExists for /solr/overseer
[junit4:junit4]   2> 8927 T3212 oascc.ZkStateReader.createClusterStateWatchersAndUpdate Updating cluster state from ZooKeeper... 
[junit4:junit4]   2> 9930 T3212 oasc.ZkController.createEphemeralLiveNode Register node as live in ZooKeeper:/live_nodes/127.0.0.1:20371__zz%2Flm
[junit4:junit4]   2> 9931 T3217 oazs.PrepRequestProcessor.pRequest Got user-level KeeperException when processing sessionid:0x13d7ad653990008 type:delete cxid:0xd zxid:0x6e txntype:-1 reqpath:n/a Error Path:/solr/live_nodes/127.0.0.1:20371__zz%2Flm Error:KeeperErrorCode = NoNode for /solr/live_nodes/127.0.0.1:20371__zz%2Flm
[junit4:junit4]   2> 9957 T3212 oascc.SolrZkClient.makePath makePath: /live_nodes/127.0.0.1:20371__zz%2Flm
[junit4:junit4]   2> 9960 T3254 oascc.ZkStateReader$2.process A cluster state change: WatchedEvent state:SyncConnected type:NodeChildrenChanged path:/live_nodes, has occurred - updating... (live nodes size: 2)
[junit4:junit4]   2> 9961 T3270 oascc.ZkStateReader$3.process Updating live nodes... (3)
[junit4:junit4]   2> 9961 T3234 oascc.ZkStateReader$3.process Updating live nodes... (3)
[junit4:junit4]   2> 9961 T3241 oascc.ZkStateReader$3.process Updating live nodes... (3)
[junit4:junit4]   2> 9961 T3234 oascc.ZkStateReader$2.process A cluster state change: WatchedEvent state:SyncConnected type:NodeChildrenChanged path:/live_nodes, has occurred - updating... (live nodes size: 3)
[junit4:junit4]   2> 9961 T3241 oascc.ZkStateReader$2.process A cluster state change: WatchedEvent state:SyncConnected type:NodeChildrenChanged path:/live_nodes, has occurred - updating... (live nodes size: 3)
[junit4:junit4]   2> 9962 T3254 oascc.ZkStateReader$3.process Updating live nodes... (3)
[junit4:junit4]   2> 9973 T3271 oasc.CoreContainer.create Creating SolrCore 'collection1' using instanceDir: /usr/home/hudson/hudson-slave/workspace/Lucene-Solr-Tests-trunk-java7/solr/build/solr-core/test/J1/./org.apache.solr.cloud.SyncSliceTest-jetty2-1363565507868/collection1
[junit4:junit4]   2> 9973 T3271 oasc.ZkController.createCollectionZkNode Check for collection zkNode:collection1
[junit4:junit4]   2> 9974 T3271 oasc.ZkController.createCollectionZkNode Collection zkNode exists
[junit4:junit4]   2> 9974 T3271 oasc.ZkController.readConfigName Load collection config from:/collections/collection1
[junit4:junit4]   2> 9975 T3271 oasc.SolrResourceLoader.<init> new SolrResourceLoader for directory: '/usr/home/hudson/hudson-slave/workspace/Lucene-Solr-Tests-trunk-java7/solr/build/solr-core/test/J1/./org.apache.solr.cloud.SyncSliceTest-jetty2-1363565507868/collection1/'
[junit4:junit4]   2> 9976 T3271 oasc.SolrResourceLoader.replaceClassLoader Adding 'file:/usr/home/hudson/hudson-slave/workspace/Lucene-Solr-Tests-trunk-java7/solr/build/solr-core/test/J1/org.apache.solr.cloud.SyncSliceTest-jetty2-1363565507868/collection1/lib/README' to classloader
[junit4:junit4]   2> 9976 T3271 oasc.SolrResourceLoader.replaceClassLoader Adding 'file:/usr/home/hudson/hudson-slave/workspace/Lucene-Solr-Tests-trunk-java7/solr/build/solr-core/test/J1/org.apache.solr.cloud.SyncSliceTest-jetty2-1363565507868/collection1/lib/classes/' to classloader
[junit4:junit4]   2> 10012 T3271 oasc.SolrConfig.<init> Using Lucene MatchVersion: LUCENE_50
[junit4:junit4]   2> 10052 T3271 oasc.SolrConfig.<init> Loaded SolrConfig: solrconfig.xml
[junit4:junit4]   2> 10067 T3235 oascc.ZkStateReader.updateClusterState Updating cloud state from ZooKeeper... 
[junit4:junit4]   2> 10067 T3235 oasc.Overseer$ClusterStateUpdater.updateState Update state numShards=1 message={
[junit4:junit4]   2> 	  "operation":"state",
[junit4:junit4]   2> 	  "core_node_name":"127.0.0.1:20368__zz%2Flm_collection1",
[junit4:junit4]   2> 	  "numShards":"1",
[junit4:junit4]   2> 	  "shard":"shard1",
[junit4:junit4]   2> 	  "roles":null,
[junit4:junit4]   2> 	  "state":"active",
[junit4:junit4]   2> 	  "core":"collection1",
[junit4:junit4]   2> 	  "collection":"collection1",
[junit4:junit4]   2> 	  "node_name":"127.0.0.1:20368__zz%2Flm",
[junit4:junit4]   2> 	  "base_url":"http://127.0.0.1:20368/_zz/lm"}
[junit4:junit4]   2> 10080 T3241 oascc.ZkStateReader$2.process A cluster state change: WatchedEvent state:SyncConnected type:NodeDataChanged path:/clusterstate.json, has occurred - updating... (live nodes size: 3)
[junit4:junit4]   2> 10080 T3254 oascc.ZkStateReader$2.process A cluster state change: WatchedEvent state:SyncConnected type:NodeDataChanged path:/clusterstate.json, has occurred - updating... (live nodes size: 3)
[junit4:junit4]   2> 10080 T3234 oascc.ZkStateReader$2.process A cluster state change: WatchedEvent state:SyncConnected type:NodeDataChanged path:/clusterstate.json, has occurred - updating... (live nodes size: 3)
[junit4:junit4]   2> 10153 T3271 oass.IndexSchema.readSchema Reading Solr Schema
[junit4:junit4]   2> 10153 T3270 oascc.ZkStateReader$2.process A cluster state change: WatchedEvent state:SyncConnected type:NodeDataChanged path:/clusterstate.json, has occurred - updating... (live nodes size: 3)
[junit4:junit4]   2> 10158 T3271 oass.IndexSchema.readSchema Schema name=test
[junit4:junit4]   2> 10607 T3271 oass.OpenExchangeRatesOrgProvider.init Initialized with rates=open-exchange-rates.json, refreshInterval=1440.
[junit4:junit4]   2> 10614 T3271 oass.IndexSchema.readSchema default search field in schema is text
[junit4:junit4]   2> 10617 T3271 oass.IndexSchema.readSchema unique key field: id
[junit4:junit4]   2> 10628 T3271 oass.FileExchangeRateProvider.reload Reloading exchange rates from file currency.xml
[junit4:junit4]   2> 10631 T3271 oass.FileExchangeRateProvider.reload Reloading exchange rates from file currency.xml
[junit4:junit4]   2> 10634 T3271 oass.OpenExchangeRatesOrgProvider.reload Reloading exchange rates from open-exchange-rates.json
[junit4:junit4]   2> 10635 T3271 oass.OpenExchangeRatesOrgProvider$OpenExchangeRates.<init> WARNING Unknown key IMPORTANT NOTE
[junit4:junit4]   2> 10636 T3271 oass.OpenExchangeRatesOrgProvider$OpenExchangeRates.<init> WARNING Expected key, got STRING
[junit4:junit4]   2> 10636 T3271 oass.OpenExchangeRatesOrgProvider.reload Reloading exchange rates from open-exchange-rates.json
[junit4:junit4]   2> 10637 T3271 oass.OpenExchangeRatesOrgProvider$OpenExchangeRates.<init> WARNING Unknown key IMPORTANT NOTE
[junit4:junit4]   2> 10637 T3271 oass.OpenExchangeRatesOrgProvider$OpenExchangeRates.<init> WARNING Expected key, got STRING
[junit4:junit4]   2> 10638 T3271 oasc.SolrCore.initDirectoryFactory solr.NRTCachingDirectoryFactory
[junit4:junit4]   2> 10638 T3271 oasc.SolrCore.<init> [collection1] Opening new SolrCore at /usr/home/hudson/hudson-slave/workspace/Lucene-Solr-Tests-trunk-java7/solr/build/solr-core/test/J1/./org.apache.solr.cloud.SyncSliceTest-jetty2-1363565507868/collection1/, dataDir=./org.apache.solr.cloud.SyncSliceTest-1363565499283/jetty2/
[junit4:junit4]   2> 10638 T3271 oasc.JmxMonitoredMap.<init> JMX monitoring is enabled. Adding Solr mbeans to JMX Server: com.sun.jmx.mbeanserver.JmxMBeanServer@5b5bae99
[junit4:junit4]   2> 10639 T3271 oasc.SolrCore.initDirectoryFactory solr.NRTCachingDirectoryFactory
[junit4:junit4]   2> 10640 T3271 oasc.CachingDirectoryFactory.get return new directory for /usr/home/hudson/hudson-slave/workspace/Lucene-Solr-Tests-trunk-java7/solr/build/solr-core/test/J1/org.apache.solr.cloud.SyncSliceTest-1363565499283/jetty2 forceNew: false
[junit4:junit4]   2> 10640 T3271 oasc.SolrCore.getNewIndexDir New index directory detected: old=null new=./org.apache.solr.cloud.SyncSliceTest-1363565499283/jetty2/index/
[junit4:junit4]   2> 10641 T3271 oasc.SolrCore.initIndex WARNING [collection1] Solr index directory './org.apache.solr.cloud.SyncSliceTest-1363565499283/jetty2/index' doesn't exist. Creating new index...
[junit4:junit4]   2> 10641 T3271 oasc.CachingDirectoryFactory.get return new directory for /usr/home/hudson/hudson-slave/workspace/Lucene-Solr-Tests-trunk-java7/solr/build/solr-core/test/J1/org.apache.solr.cloud.SyncSliceTest-1363565499283/jetty2/index forceNew: false
[junit4:junit4]   2> 10657 T3271 oasc.SolrDeletionPolicy.onCommit SolrDeletionPolicy.onCommit: commits:num=1
[junit4:junit4]   2> 		commit{dir=NRTCachingDirectory(org.apache.lucene.store.NIOFSDirectory@/usr/home/hudson/hudson-slave/workspace/Lucene-Solr-Tests-trunk-java7/solr/build/solr-core/test/J1/org.apache.solr.cloud.SyncSliceTest-1363565499283/jetty2/index lockFactory=org.apache.lucene.store.NativeFSLockFactory@34f885b1; maxCacheMB=48.0 maxMergeSizeMB=4.0),segFN=segments_1,generation=1,filenames=[segments_1]
[junit4:junit4]   2> 10657 T3271 oasc.SolrDeletionPolicy.updateCommits newest commit = 1[segments_1]
[junit4:junit4]   2> 10659 T3271 oasup.UpdateRequestProcessorChain.init inserting DistributedUpdateProcessorFactory into updateRequestProcessorChain "dedupe"
[junit4:junit4]   2> 10660 T3271 oasup.UpdateRequestProcessorChain.init inserting DistributedUpdateProcessorFactory into updateRequestProcessorChain "stored_sig"
[junit4:junit4]   2> 10660 T3271 oasup.UpdateRequestProcessorChain.init inserting DistributedUpdateProcessorFactory into updateRequestProcessorChain "distrib-dup-test-chain-implicit"
[junit4:junit4]   2> 10661 T3271 oasc.RequestHandlers.initHandlersFromConfig created standard: solr.StandardRequestHandler
[junit4:junit4]   2> 10661 T3271 oasc.RequestHandlers.initHandlersFromConfig created /get: solr.RealTimeGetHandler
[junit4:junit4]   2> 10661 T3271 oasc.RequestHandlers.initHandlersFromConfig adding lazy requestHandler: solr.ReplicationHandler
[junit4:junit4]   2> 10662 T3271 oasc.RequestHandlers.initHandlersFromConfig created /replication: solr.ReplicationHandler
[junit4:junit4]   2> 10662 T3271 oasc.RequestHandlers.initHandlersFromConfig created /update: solr.UpdateRequestHandler
[junit4:junit4]   2> 10662 T3271 oasc.RequestHandlers.initHandlersFromConfig created /admin/: org.apache.solr.handler.admin.AdminHandlers
[junit4:junit4]   2> 10671 T3271 oashl.XMLLoader.init xsltCacheLifetimeSeconds=60
[junit4:junit4]   2> 10676 T3271 oass.SolrIndexSearcher.<init> Opening Searcher@55196e6d main
[junit4:junit4]   2> 10677 T3271 oasu.CommitTracker.<init> Hard AutoCommit: disabled
[junit4:junit4]   2> 10677 T3271 oasu.CommitTracker.<init> Soft AutoCommit: disabled
[junit4:junit4]   2> 10680 T3272 oasc.SolrCore.registerSearcher [collection1] Registered new searcher Searcher@55196e6d main{StandardDirectoryReader(segments_1:1)}
[junit4:junit4]   2> 10682 T3271 oasc.ZkController.publish publishing core=collection1 state=down
[junit4:junit4]   2> 10682 T3271 oasc.ZkController.publish numShards not found on descriptor - reading it from system property
[junit4:junit4]   2> 11583 T3235 oascc.ZkStateReader.updateClusterState Updating cloud state from ZooKeeper... 
[junit4:junit4]   2> 11584 T3235 oasc.Overseer$ClusterStateUpdater.updateState Update state numShards=1 message={
[junit4:junit4]   2> 	  "operation":"state",
[junit4:junit4]   2> 	  "core_node_name":null,
[junit4:junit4]   2> 	  "numShards":"1",
[junit4:junit4]   2> 	  "shard":null,
[junit4:junit4]   2> 	  "roles":null,
[junit4:junit4]   2> 	  "state":"down",
[junit4:junit4]   2> 	  "core":"collection1",
[junit4:junit4]   2> 	  "collection":"collection1",
[junit4:junit4]   2> 	  "node_name":"127.0.0.1:20371__zz%2Flm",
[junit4:junit4]   2> 	  "base_url":"http://127.0.0.1:20371/_zz/lm"}
[junit4:junit4]   2> 11585 T3235 oasc.Overseer$ClusterStateUpdater.updateState Collection already exists with numShards=1
[junit4:junit4]   2> 11585 T3235 oasc.Overseer$ClusterStateUpdater.updateState Assigning new node to shard shard=shard1
[junit4:junit4]   2> 11589 T3270 oascc.ZkStateReader$2.process A cluster state change: WatchedEvent state:SyncConnected type:NodeDataChanged path:/clusterstate.json, has occurred - updating... (live nodes size: 3)
[junit4:junit4]   2> 11589 T3234 oascc.ZkStateReader$2.process A cluster state change: WatchedEvent state:SyncConnected type:NodeDataChanged path:/clusterstate.json, has occurred - updating... (live nodes size: 3)
[junit4:junit4]   2> 11589 T3241 oascc.ZkStateReader$2.process A cluster state change: WatchedEvent state:SyncConnected type:NodeDataChanged path:/clusterstate.json, has occurred - updating... (live nodes size: 3)
[junit4:junit4]   2> 11589 T3254 oascc.ZkStateReader$2.process A cluster state change: WatchedEvent state:SyncConnected type:NodeDataChanged path:/clusterstate.json, has occurred - updating... (live nodes size: 3)
[junit4:junit4]   2> 11684 T3271 oasc.CoreContainer.registerCore registering core: collection1
[junit4:junit4]   2> 11684 T3271 oasc.ZkController.register Register replica - core:collection1 address:http://127.0.0.1:20371/_zz/lm collection:collection1 shard:shard1
[junit4:junit4]   2> 11689 T3271 oasc.ZkController.register We are http://127.0.0.1:20371/_zz/lm/collection1/ and leader is http://127.0.0.1:20368/_zz/lm/collection1/
[junit4:junit4]   2> 11689 T3271 oasc.ZkController.register No LogReplay needed for core=collection1 baseURL=http://127.0.0.1:20371/_zz/lm
[junit4:junit4]   2> 11690 T3271 oasc.ZkController.checkRecovery Core needs to recover:collection1
[junit4:junit4]   2> 11690 T3271 oasu.DefaultSolrCoreState.doRecovery Running recovery - first canceling any ongoing recovery
[junit4:junit4]   2> ASYNC  NEW_CORE C419 name=collection1 org.apache.solr.core.SolrCore@58b7a50d url=http://127.0.0.1:20371/_zz/lm/collection1 node=127.0.0.1:20371__zz%2Flm C419_STATE=coll:collection1 core:collection1 props:{state=down, core=collection1, collection=collection1, node_name=127.0.0.1:20371__zz%2Flm, base_url=http://127.0.0.1:20371/_zz/lm}
[junit4:junit4]   2> 11690 T3273 C419 P20371 oasc.RecoveryStrategy.run Starting recovery process.  core=collection1 recoveringAfterStartup=true
[junit4:junit4]   2> 11691 T3271 oascc.ZkStateReader.updateClusterState Updating cloud state from ZooKeeper... 
[junit4:junit4]   2> 11692 T3273 C419 P20371 oasc.RecoveryStrategy.doRecovery ###### startupVersions=[]
[junit4:junit4]   2> 11692 T3273 C419 P20371 oasc.ZkController.publish publishing core=collection1 state=recovering
[junit4:junit4]   2> 11692 T3273 C419 P20371 oasc.ZkController.publish numShards not found on descriptor - reading it from system property
[junit4:junit4]   2> 11693 T3212 oass.SolrDispatchFilter.init user.dir=/usr/home/hudson/hudson-slave/workspace/Lucene-Solr-Tests-trunk-java7/solr/build/solr-core/test/J1
[junit4:junit4]   2> 11694 T3212 oass.SolrDispatchFilter.init SolrDispatchFilter.init() done
[junit4:junit4]   2> 11694 T3273 C419 P20371 oascsi.HttpClientUtil.createClient Creating new http client, config:maxConnections=128&maxConnectionsPerHost=32&followRedirects=false
[junit4:junit4]   2> 11694 T3212 oascsi.HttpClientUtil.createClient Creating new http client, config:maxConnections=128&maxConnectionsPerHost=32&followRedirects=false
[junit4:junit4]   2> 11930 T3212 oejs.Server.doStart jetty-8.1.8.v20121106
[junit4:junit4]   2> 11934 T3212 oejs.AbstractConnector.doStart Started SocketConnector@127.0.0.1:24982
[junit4:junit4]   2> 11935 T3212 oass.SolrDispatchFilter.init SolrDispatchFilter.init()
[junit4:junit4]   2> 11935 T3212 oasc.SolrResourceLoader.locateSolrHome JNDI not configured for solr (NoInitialContextEx)
[junit4:junit4]   2> 11936 T3212 oasc.SolrResourceLoader.locateSolrHome using system property solr.solr.home: /usr/home/hudson/hudson-slave/workspace/Lucene-Solr-Tests-trunk-java7/solr/build/solr-core/test/J1/./org.apache.solr.cloud.SyncSliceTest-jetty3-1363565510992
[junit4:junit4]   2> 11936 T3212 oasc.CoreContainer$Initializer.initialize looking for solr config file: /usr/home/hudson/hudson-slave/workspace/Lucene-Solr-Tests-trunk-java7/solr/build/solr-core/test/J1/./org.apache.solr.cloud.SyncSliceTest-jetty3-1363565510992/solr.xml
[junit4:junit4]   2> 11937 T3212 oasc.CoreContainer.<init> New CoreContainer 411158290
[junit4:junit4]   2> 11938 T3212 oasc.CoreContainer.load Loading CoreContainer using Solr Home: '/usr/home/hudson/hudson-slave/workspace/Lucene-Solr-Tests-trunk-java7/solr/build/solr-core/test/J1/./org.apache.solr.cloud.SyncSliceTest-jetty3-1363565510992/'
[junit4:junit4]   2> 11938 T3212 oasc.SolrResourceLoader.<init> new SolrResourceLoader for directory: '/usr/home/hudson/hudson-slave/workspace/Lucene-Solr-Tests-trunk-java7/solr/build/solr-core/test/J1/./org.apache.solr.cloud.SyncSliceTest-jetty3-1363565510992/'
[junit4:junit4]   2> 12004 T3212 oashc.HttpShardHandlerFactory.getParameter Setting socketTimeout to: 120000
[junit4:junit4]   2> 12005 T3212 oashc.HttpShardHandlerFactory.getParameter Setting urlScheme to: http://
[junit4:junit4]   2> 12005 T3212 oashc.HttpShardHandlerFactory.getParameter Setting connTimeout to: 15000
[junit4:junit4]   2> 12006 T3212 oashc.HttpShardHandlerFactory.getParameter Setting maxConnectionsPerHost to: 20
[junit4:junit4]   2> 12006 T3212 oashc.HttpShardHandlerFactory.getParameter Setting corePoolSize to: 0
[junit4:junit4]   2> 12007 T3212 oashc.HttpShardHandlerFactory.getParameter Setting maximumPoolSize to: 2147483647
[junit4:junit4]   2> 12007 T3212 oashc.HttpShardHandlerFactory.getParameter Setting maxThreadIdleTime to: 5
[junit4:junit4]   2> 12008 T3212 oashc.HttpShardHandlerFactory.getParameter Setting sizeOfQueue to: -1
[junit4:junit4]   2> 12009 T3212 oashc.HttpShardHandlerFactory.getParameter Setting fairnessPolicy to: false
[junit4:junit4]   2> 12009 T3212 oascsi.HttpClientUtil.createClient Creating new http client, config:maxConnectionsPerHost=20&maxConnections=10000&socketTimeout=120000&connTimeout=15000&retry=false
[junit4:junit4]   2> 12031 T3212 oasc.CoreContainer.load Registering Log Listener
[junit4:junit4]   2> 12051 T3212 oasc.CoreContainer.initZooKeeper Zookeeper client=127.0.0.1:20361/solr
[junit4:junit4]   2> 12052 T3212 oasc.ZkController.checkChrootPath zkHost includes chroot
[junit4:junit4]   2> 12052 T3212 oaz.ZooKeeper.<init> Initiating client connection, connectString=127.0.0.1:20361 sessionTimeout=60000 watcher=org.apache.solr.common.cloud.ConnectionManager@101d0360
[junit4:junit4]   2> 12053 T3212 oascc.ConnectionManager.waitForConnected Waiting for client to connect to ZooKeeper
[junit4:junit4]   2> 12054 T3284 oaz.ClientCnxn$SendThread.logStartConnect Opening socket connection to server localhost/127.0.0.1:20361. Will not attempt to authenticate using SASL (access denied ("javax.security.auth.AuthPermission" "getLoginConfiguration"))
[junit4:junit4]   2> 12055 T3284 oaz.ClientCnxn$SendThread.primeConnection Socket connection established to localhost/127.0.0.1:20361, initiating session
[junit4:junit4]   2> 12055 T3214 oazs.NIOServerCnxnFactory.run Accepted socket connection from /140.211.11.196:51232
[junit4:junit4]   2> 12055 T3214 oazs.ZooKeeperServer.processConnectRequest Client attempting to establish new session at /140.211.11.196:51232
[junit4:junit4]   2> 12057 T3216 oazs.ZooKeeperServer.finishSessionInit Established session 0x13d7ad653990009 with negotiated timeout 20000 for client /140.211.11.196:51232
[junit4:junit4]   2> 12058 T3284 oaz.ClientCnxn$SendThread.onConnected Session establishment complete on server localhost/127.0.0.1:20361, sessionid = 0x13d7ad653990009, negotiated timeout = 20000
[junit4:junit4]   2> 12058 T3285 oascc.ConnectionManager.process Watcher org.apache.solr.common.cloud.ConnectionManager@101d0360 name:ZooKeeperConnection Watcher:127.0.0.1:20361 got event WatchedEvent state:SyncConnected type:None path:null path:null type:None
[junit4:junit4]   2> 12058 T3212 oascc.ConnectionManager.waitForConnected Client is connected to ZooKeeper
[junit4:junit4]   2> 12060 T3217 oazs.PrepRequestProcessor.pRequest2Txn Processed session termination for sessionid: 0x13d7ad653990009
[junit4:junit4]   2> 12061 T3285 oaz.ClientCnxn$EventThread.run EventThread shut down
[junit4:junit4]   2> 12061 T3214 oazs.NIOServerCnxn.closeSock Closed socket connection for client /140.211.11.196:51232 which had sessionid 0x13d7ad653990009
[junit4:junit4]   2> 12061 T3212 oaz.ZooKeeper.close Session: 0x13d7ad653990009 closed
[junit4:junit4]   2> 12062 T3212 oascsi.HttpClientUtil.createClient Creating new http client, config:maxConnections=500&maxConnectionsPerHost=16&socketTimeout=120000&connTimeout=15000
[junit4:junit4]   2> 12075 T3212 oaz.ZooKeeper.<init> Initiating client connection, connectString=127.0.0.1:20361/solr sessionTimeout=30000 watcher=org.apache.solr.common.cloud.ConnectionManager@619163ca
[junit4:junit4]   2> 12077 T3212 oascc.ConnectionManager.waitForConnected Waiting for client to connect to ZooKeeper
[junit4:junit4]   2> 12077 T3286 oaz.ClientCnxn$SendThread.logStartConnect Opening socket connection to server localhost/127.0.0.1:20361. Will not attempt to authenticate using SASL (access denied ("javax.security.auth.AuthPermission" "getLoginConfiguration"))
[junit4:junit4]   2> 12078 T3286 oaz.ClientCnxn$SendThread.primeConnection Socket connection established to localhost/127.0.0.1:20361, initiating session
[junit4:junit4]   2> 12078 T3214 oazs.NIOServerCnxnFactory.run Accepted socket connection from /140.211.11.196:12750
[junit4:junit4]   2> 12078 T3214 oazs.ZooKeeperServer.processConnectRequest Client attempting to establish new session at /140.211.11.196:12750
[junit4:junit4]   2> 12080 T3216 oazs.ZooKeeperServer.finishSessionInit Established session 0x13d7ad65399000a with negotiated timeout 20000 for client /140.211.11.196:12750
[junit4:junit4]   2> 12080 T3286 oaz.ClientCnxn$SendThread.onConnected Session establishment complete on server localhost/127.0.0.1:20361, sessionid = 0x13d7ad65399000a, negotiated timeout = 20000
[junit4:junit4]   2> 12080 T3287 oascc.ConnectionManager.process Watcher org.apache.solr.common.cloud.ConnectionManager@619163ca name:ZooKeeperConnection Watcher:127.0.0.1:20361/solr got event WatchedEvent state:SyncConnected type:None path:null path:null type:None
[junit4:junit4]   2> 12081 T3212 oascc.ConnectionManager.waitForConnected Client is connected to ZooKeeper
[junit4:junit4]   2> 12082 T3217 oazs.PrepRequestProcessor.pRequest Got user-level KeeperException when processing sessionid:0x13d7ad65399000a type:create cxid:0x1 zxid:0x7f txntype:-1 reqpath:n/a Error Path:/solr/overseer Error:KeeperErrorCode = NodeExists for /solr/overseer
[junit4:junit4]   2> 12084 T3217 oazs.PrepRequestProcessor.pRequest Got user-level KeeperException when processing sessionid:0x13d7ad65399000a type:create cxid:0x3 zxid:0x80 txntype:-1 reqpath:n/a Error Path:/solr/overseer Error:KeeperErrorCode = NodeExists for /solr/overseer
[junit4:junit4]   2> 12086 T3212 oascc.ZkStateReader.createClusterStateWatchersAndUpdate Updating cluster state from ZooKeeper... 
[junit4:junit4]   2> 13089 T3212 oasc.ZkController.createEphemeralLiveNode Register node as live in ZooKeeper:/live_nodes/127.0.0.1:24982__zz%2Flm
[junit4:junit4]   2> 13091 T3217 oazs.PrepRequestProcessor.pRequest Got user-level KeeperException when processing sessionid:0x13d7ad65399000a type:delete cxid:0xd zxid:0x81 txntype:-1 reqpath:n/a Error Path:/solr/live_nodes/127.0.0.1:24982__zz%2Flm Error:KeeperErrorCode = NoNode for /solr/live_nodes/127.0.0.1:24982__zz%2Flm
[junit4:junit4]   2> 13117 T3212 oascc.SolrZkClient.makePath makePath: /live_nodes/127.0.0.1:24982__zz%2Flm
[junit4:junit4]   2> 13118 T3235 oascc.ZkStateReader.updateClusterState Updating cloud state from ZooKeeper... 
[junit4:junit4]   2> 13121 T3254 oascc.ZkStateReader$2.process A cluster state change: WatchedEvent state:SyncConnected type:NodeChildrenChanged path:/live_nodes, has occurred - updating... (live nodes size: 3)
[junit4:junit4]   2> 13121 T3235 oasc.Overseer$ClusterStateUpdater.updateState Update state numShards=1 message={
[junit4:junit4]   2> 	  "operation":"state",
[junit4:junit4]   2> 	  "core_node_name":"127.0.0.1:20371__zz%2Flm_collection1",
[junit4:junit4]   2> 	  "numShards":"1",
[junit4:junit4]   2> 	  "shard":"shard1",
[junit4:junit4]   2> 	  "roles":null,
[junit4:junit4]   2> 	  "state":"recovering",
[junit4:junit4]   2> 	  "core":"collection1",
[junit4:junit4]   2> 	  "collection":"collection1",
[junit4:junit4]   2> 	  "node_name":"127.0.0.1:20371__zz%2Flm",
[junit4:junit4]   2> 	  "base_url":"http://127.0.0.1:20371/_zz/lm"}
[junit4:junit4]   2> 13121 T3287 oascc.ZkStateReader$3.process Updating live nodes... (4)
[junit4:junit4]   2> 13122 T3241 oascc.ZkStateReader$3.process Updating live nodes... (4)
[junit4:junit4]   2> 13122 T3270 oascc.ZkStateReader$3.process Updating live nodes... (4)
[junit4:junit4]   2> 13122 T3241 oascc.ZkStateReader$2.process A cluster state change: WatchedEvent state:SyncConnected type:NodeChildrenChanged path:/live_nodes, has occurred - updating... (live nodes size: 4)
[junit4:junit4]   2> 13122 T3270 oascc.ZkStateReader$2.process A cluster state change: WatchedEvent state:SyncConnected type:NodeChildrenChanged path:/live_nodes, has occurred - updating... (live nodes size: 4)
[junit4:junit4]   2> 13125 T3254 oascc.ZkStateReader$3.process Updating live nodes... (4)
[junit4:junit4]   2> 13128 T3270 oascc.ZkStateReader$2.process A cluster state change: WatchedEvent state:SyncConnected type:NodeDataChanged path:/clusterstate.json, has occurred - updating... (live nodes size: 4)
[junit4:junit4]   2> 13128 T3254 oascc.ZkStateReader$2.process A cluster state change: WatchedEvent state:SyncConnected type:NodeDataChanged path:/clusterstate.json, has occurred - updating... (live nodes size: 4)
[junit4:junit4]   2> 13128 T3241 oascc.ZkStateReader$2.process A cluster state change: WatchedEvent state:SyncConnected type:NodeDataChanged path:/clusterstate.json, has occurred - updating... (live nodes size: 4)
[junit4:junit4]   2> 13128 T3287 oascc.ZkStateReader$2.process A cluster state change: WatchedEvent state:SyncConnected type:NodeDataChanged path:/clusterstate.json, has occurred - updating... (live nodes size: 4)
[junit4:junit4]   2> 13131 T3288 oasc.CoreContainer.create Creating SolrCore 'collection1' using instanceDir: /usr/home/hudson/hudson-slave/workspace/Lucene-Solr-Tests-trunk-java7/solr/build/solr-core/test/J1/./org.apache.solr.cloud.SyncSliceTest-jetty3-1363565510992/collection1
[junit4:junit4]   2> 13131 T3288 oasc.ZkController.createCollectionZkNode Check for collection zkNode:collection1
[junit4:junit4]   2> 13137 T3288 oasc.ZkController.createCollectionZkNode Collection zkNode exists
[junit4:junit4]   2> 13137 T3288 oasc.ZkController.readConfigName Load collection config from:/collections/collection1
[junit4:junit4]   2> 13137 T3234 oascc.ZkStateReader$3.process Updating live nodes... (4)
[junit4:junit4]   2> 13137 T3234 oascc.ZkStateReader$2.process A cluster state change: WatchedEvent state:SyncConnected type:NodeChildrenChanged path:/live_nodes, has occurred - updating... (live nodes size: 4)
[junit4:junit4]   2> 13139 T3234 oascc.ZkStateReader$2.process A cluster state change: WatchedEvent state:SyncConnected type:NodeDataChanged path:/clusterstate.json, has occurred - updating... (live nodes size: 4)
[junit4:junit4]   2> 13139 T3288 oasc.SolrResourceLoader.<init> new SolrResourceLoader for directory: '/usr/home/hudson/hudson-slave/workspace/Lucene-Solr-Tests-trunk-java7/solr/build/solr-core/test/J1/./org.apache.solr.cloud.SyncSliceTest-jetty3-1363565510992/collection1/'
[junit4:junit4]   2> 13140 T3288 oasc.SolrResourceLoader.replaceClassLoader Adding 'file:/usr/home/hudson/hudson-slave/workspace/Lucene-Solr-Tests-trunk-java7/solr/build/solr-core/test/J1/org.apache.solr.cloud.SyncSliceTest-jetty3-1363565510992/collection1/lib/README' to classloader
[junit4:junit4]   2> 13141 T3288 oasc.SolrResourceLoader.replaceClassLoader Adding 'file:/usr/home/hudson/hudson-slave/workspace/Lucene-Solr-Tests-trunk-java7/solr/build/solr-core/test/J1/org.apache.solr.cloud.SyncSliceTest-jetty3-1363565510992/collection1/lib/classes/' to classloader
[junit4:junit4]   2> 13193 T3288 oasc.SolrConfig.<init> Using Lucene MatchVersion: LUCENE_50
[junit4:junit4]   2> 13252 T3288 oasc.SolrConfig.<init> Loaded SolrConfig: solrconfig.xml
[junit4:junit4]   2> 13353 T3288 oass.IndexSchema.readSchema Reading Solr Schema
[junit4:junit4]   2> 13360 T3288 oass.IndexSchema.readSchema Schema name=test
[junit4:junit4]   2> 13718 T3244 oass.SolrDispatchFilter.handleAdminRequest /admin/cores {coreNodeName=127.0.0.1:20371__zz%252Flm_collection1&state=recovering&nodeName=127.0.0.1:20371__zz%252Flm&action=PREPRECOVERY&checkLive=true&core=collection1&wt=javabin&onlyIfLeader=true&version=2} status=0 QTime=2002 
[junit4:junit4]   2> 14001 T3288 oass.OpenExchangeRatesOrgProvider.init Initialized with rates=open-exchange-rates.json, refreshInterval=1440.
[junit4:junit4]   2> 14013 T3288 oass.IndexSchema.readSchema default search field in schema is text
[junit4:junit4]   2> 14017 T3288 oass.IndexSchema.readSchema unique key field: id
[junit4:junit4]   2> 14030 T3288 oass.FileExchangeRateProvider.reload Reloading exchange rates from file currency.xml
[junit4:junit4]   2> 14035 T3288 oass.FileExchangeRateProvider.reload Reloading exchange rates from file currency.xml
[junit4:junit4]   2> 14040 T3288 oass.OpenExchangeRatesOrgProvider.reload Reloading exchange rates from open-exchange-rates.json
[junit4:junit4]   2> 14041 T3288 oass.OpenExchangeRatesOrgProvider$OpenExchangeRates.<init> WARNING Unknown key IMPORTANT NOTE
[junit4:junit4]   2> 14041 T3288 oass.OpenExchangeRatesOrgProvider$OpenExchangeRates.<init> WARNING Expected key, got STRING
[junit4:junit4]   2> 14041 T3288 oass.OpenExchangeRatesOrgProvider.reload Reloading exchange rates from open-exchange-rates.json
[junit4:junit4]   2> 14042 T3288 oass.OpenExchangeRatesOrgProvider$OpenExchangeRates.<init> WARNING Unknown key IMPORTANT NOTE
[junit4:junit4]   2> 14043 T3288 oass.OpenExchangeRatesOrgProvider$OpenExchangeRates.<init> WARNING Expected key, got STRING
[junit4:junit4]   2> 14043 T3288 oasc.SolrCore.initDirectoryFactory solr.NRTCachingDirectoryFactory
[junit4:junit4]   2> 14043 T3288 oasc.SolrCore.<init> [collection1] Opening new SolrCore at /usr/home/hudson/hudson-slave/workspace/Lucene-Solr-Tests-trunk-java7/solr/build/solr-core/test/J1/./org.apache.solr.cloud.SyncSliceTest-jetty3-1363565510992/collection1/, dataDir=./org.apache.solr.cloud.SyncSliceTest-1363565499283/jetty3/
[junit4:junit4]   2> 14044 T3288 oasc.JmxMonitoredMap.<init> JMX monitoring is enabled. Adding Solr mbeans to JMX Server: com.sun.jmx.mbeanserver.JmxMBeanServer@5b5bae99
[junit4:junit4]   2> 14044 T3288 oasc.SolrCore.initDirectoryFactory solr.NRTCachingDirectoryFactory
[junit4:junit4]   2> 14045 T3288 oasc.CachingDirectoryFactory.get return new directory for /usr/home/hudson/hudson-slave/workspace/Lucene-Solr-Tests-trunk-java7/solr/build/solr-core/test/J1/org.apache.solr.cloud.SyncSliceTest-1363565499283/jetty3 forceNew: false
[junit4:junit4]   2> 14046 T3288 oasc.SolrCore.getNewIndexDir New index directory detected: old=null new=./org.apache.solr.cloud.SyncSliceTest-1363565499283/jetty3/index/
[junit4:junit4]   2> 14046 T3288 oasc.SolrCore.initIndex WARNING [collection1] Solr index directory './org.apache.solr.cloud.SyncSliceTest-1363565499283/jetty3/index' doesn't exist. Creating new index...
[junit4:junit4]   2> 14047 T3288 oasc.CachingDirectoryFactory.get return new directory for /usr/home/hudson/hudson-slave/workspace/Lucene-Solr-Tests-trunk-java7/solr/build/solr-core/test/J1/org.apache.solr.cloud.SyncSliceTest-1363565499283/jetty3/index forceNew: false
[junit4:junit4]   2> 14054 T3288 oasc.SolrDeletionPolicy.onCommit SolrDeletionPolicy.onCommit: commits:num=1
[junit4:junit4]   2> 		commit{dir=NRTCachingDirectory(org.apache.lucene.store.NIOFSDirectory@/usr/home/hudson/hudson-slave/workspace/Lucene-Solr-Tests-trunk-java7/solr/build/solr-core/test/J1/org.apache.solr.cloud.SyncSliceTest-1363565499283/jetty3/index lockFactory=org.apache.lucene.store.NativeFSLockFactory@6d0efaa8; maxCacheMB=48.0 maxMergeSizeMB=4.0),segFN=segments_1,generation=1,filenames=[segments_1]
[junit4:junit4]   2> 14055 T3288 oasc.SolrDeletionPolicy.updateCommits newest commit = 1[segments_1]
[junit4:junit4]   2> 14058 T3288 oasup.UpdateRequestProcessorChain.init inserting DistributedUpdateProcessorFactory into updateRequestProcessorChain "dedupe"
[junit4:junit4]   2> 14058 T3288 oasup.UpdateRequestProcessorChain.init inserting DistributedUpdateProcessorFactory into updateRequestProcessorChain "stored_sig"
[junit4:junit4]   2> 14059 T3288 oasup.UpdateRequestProcessorChain.init inserting DistributedUpdateProcessorFactory into updateRequestProcessorChain "distrib-dup-test-chain-implicit"
[junit4:junit4]   2> 14060 T3288 oasc.RequestHandlers.initHandlersFromConfig created standard: solr.StandardRequestHandler
[junit4:junit4]   2> 14060 T3288 oasc.RequestHandlers.initHandlersFromConfig created /get: solr.RealTimeGetHandler
[junit4:junit4]   2> 14061 T3288 oasc.RequestHandlers.initHandlersFromConfig adding lazy requestHandler: solr.ReplicationHandler
[junit4:junit4]   2> 14061 T3288 oasc.RequestHandlers.initHandlersFromConfig created /replication: solr.ReplicationHandler
[junit4:junit4]   2> 14062 T3288 oasc.RequestHandlers.initHandlersFromConfig created /update: solr.UpdateRequestHandler
[junit4:junit4]   2> 14062 T3288 oasc.RequestHandlers.initHandlersFromConfig created /admin/: org.apache.solr.handler.admin.AdminHandlers
[junit4:junit4]   2> 14075 T3288 oashl.XMLLoader.init xsltCacheLifetimeSeconds=60
[junit4:junit4]   2> 14083 T3288 oass.SolrIndexSearcher.<init> Opening Searcher@2abe2cf1 main
[junit4:junit4]   2> 14084 T3288 oasu.CommitTracker.<init> Hard AutoCommit: disabled
[junit4:junit4]   2> 14085 T3288 oasu.CommitTracker.<init> Soft AutoCommit: disabled
[junit4:junit4]   2> 14089 T3289 oasc.SolrCore.registerSearcher [collection1] Registered new searcher Searcher@2abe2cf1 main{StandardDirectoryReader(segments_1:1)}
[junit4:junit4]   2> 14091 T3288 oasc.ZkController.publish publishing core=collection1 state=down
[junit4:junit4]   2> 14091 T3288 oasc.ZkController.publish numShards not found on descriptor - reading it from system property
[junit4:junit4]   2> 14639 T3235 oascc.ZkStateReader.updateClusterState Updating cloud state from ZooKeeper... 
[junit4:junit4]   2> 14640 T3235 oasc.Overseer$ClusterStateUpdater.updateState Update state numShards=1 message={
[junit4:junit4]   2> 	  "operation":"state",
[junit4:junit4]   2> 	  "core_node_name":null,
[junit4:junit4]   2> 	  "numShards":"1",
[junit4:junit4]   2> 	  "shard":null,
[junit4:junit4]   2> 	  "roles":null,
[junit4:junit4]   2> 	  "state":"down",
[junit4:junit4]   2> 	  "core":"collection1",
[junit4:junit4]   2> 	  "collection":"collection1",
[junit4:junit4]   2> 	  "node_name":"127.0.0.1:24982__zz%2Flm",
[junit4:junit4]   2> 	  "base_url":"http://127.0.0.1:24982/_zz/lm"}
[junit4:junit4]   2> 14641 T3235 oasc.Overseer$ClusterStateUpdater.updateState Collection already exists with numShards=1
[junit4:junit4]   2> 14641 T3235 oasc.Overseer$ClusterStateUpdater.updateState Assigning new node to shard shard=shard1
[junit4:junit4]   2> 14646 T3234 oascc.ZkStateReader$2.process A cluster state change: WatchedEvent state:SyncConnected type:NodeDataChanged path:/clusterstate.json, has occurred - updating... (live nodes size: 4)
[junit4:junit4]   2> 14646 T3270 oascc.ZkStateReader$2.process A cluster state change: WatchedEvent state:SyncConnected type:NodeDataChanged path:/clusterstate.json, has occurred - updating... (live nodes size: 4)
[junit4:junit4]   2> 14646 T3287 oascc.ZkStateReader$2.process A cluster state change: WatchedEvent state:SyncConnected type:NodeDataChanged path:/clusterstate.json, has occurred - updating... (live nodes size: 4)
[junit4:junit4]   2> 14646 T3241 oascc.ZkStateReader$2.process A cluster state change: WatchedEvent state:SyncConnected type:NodeDataChanged path:/clusterstate.json, has occurred - updating... (live nodes size: 4)
[junit4:junit4]   2> 14646 T3254 oascc.ZkStateReader$2.process A cluster state change: WatchedEvent state:SyncConnected type:NodeDataChanged path:/clusterstate.json, has occurred - updating... (live nodes size: 4)
[junit4:junit4]   2> 15094 T3288 oasc.CoreContainer.registerCore registering core: collection1
[junit4:junit4]   2> 15094 T3288 oasc.ZkController.register Register replica - core:collection1 address:http://127.0.0.1:24982/_zz/lm collection:collection1 shard:shard1
[junit4:junit4]   2> 15098 T3288 oasc.ZkController.register We are http://127.0.0.1:24982/_zz/lm/collection1/ and leader is http://127.0.0.1:20368/_zz/lm/collection1/
[junit4:junit4]   2> 15098 T3288 oasc.ZkController.register No LogReplay needed for core=collection1 baseURL=http://127.0.0.1:24982/_zz/lm
[junit4:junit4]   2> 15098 T3288 oasc.ZkController.checkRecovery Core needs to recover:collection1
[junit4:junit4]   2> 15098 T3288 oasu.DefaultSolrCoreState.doRecovery Running recovery - first canceling any ongoing recovery
[junit4:junit4]   2> ASYNC  NEW_CORE C420 name=collection1 org.apache.solr.core.SolrCore@1cd5ff2f url=http://127.0.0.1:24982/_zz/lm/collection1 node=127.0.0.1:24982__zz%2Flm C420_STATE=coll:collection1 core:collection1 props:{state=down, core=collection1, collection=collection1, node_name=127.0.0.1:24982__zz%2Flm, base_url=http://127.0.0.1:24982/_zz/lm}
[junit4:junit4]   2> 15099 T3290 C420 P24982 oasc.RecoveryStrategy.run Starting recovery process.  core=collection1 recoveringAfterStartup=true
[junit4:junit4]   2> 15100 T3290 C420 P24982 oasc.RecoveryStrategy.doRecovery ###### startupVersions=[]
[junit4:junit4]   2> 15100 T3288 oascc.ZkStateReader.updateClusterState Updating cloud state from ZooKeeper... 
[junit4:junit4]   2> 15101 T3290 C420 P24982 oasc.ZkController.publish publishing core=collection1 state=recovering
[junit4:junit4]   2> 15101 T3290 C420 P24982 oasc.ZkController.publish numShards not found on descriptor - reading it from system property
[junit4:junit4]   2> 15102 T3212 oass.SolrDispatchFilter.init user.dir=/usr/home/hudson/hudson-slave/workspace/Lucene-Solr-Tests-trunk-java7/solr/build/solr-core/test/J1
[junit4:junit4]   2> 15102 T3290 C420 P24982 oascsi.HttpClientUtil.createClient Creating new http client, config:maxConnections=128&maxConnectionsPerHost=32&followRedirects=false
[junit4:junit4]   2> 15102 T3212 oass.SolrDispatchFilter.init SolrDispatchFilter.init() done
[junit4:junit4]   2> 15103 T3212 oascsi.HttpClientUtil.createClient Creating new http client, config:maxConnections=128&maxConnectionsPerHost=32&followRedirects=false
[junit4:junit4]   2> 15313 T3212 oejs.Server.doStart jetty-8.1.8.v20121106
[junit4:junit4]   2> 15316 T3212 oejs.AbstractConnector.doStart Started SocketConnector@127.0.0.1:31439
[junit4:junit4]   2> 15317 T3212 oass.SolrDispatchFilter.init SolrDispatchFilter.init()
[junit4:junit4]   2> 15318 T3212 oasc.SolrResourceLoader.locateSolrHome JNDI not configured for solr (NoInitialContextEx)
[junit4:junit4]   2> 15318 T3212 oasc.SolrResourceLoader.locateSolrHome using system property solr.solr.home: /usr/home/hudson/hudson-slave/workspace/Lucene-Solr-Tests-trunk-java7/solr/build/solr-core/test/J1/./org.apache.solr.cloud.SyncSliceTest-jetty4-1363565514395
[junit4:junit4]   2> 15319 T3212 oasc.CoreContainer$Initializer.initialize looking for solr config file: /usr/home/hudson/hudson-slave/workspace/Lucene-Solr-Tests-trunk-java7/solr/build/solr-core/test/J1/./org.apache.solr.cloud.SyncSliceTest-jetty4-1363565514395/solr.xml
[junit4:junit4]   2> 15320 T3212 oasc.CoreContainer.<init> New CoreContainer 1797215718
[junit4:junit4]   2> 15321 T3212 oasc.CoreContainer.load Loading CoreContainer using Solr Home: '/usr/home/hudson/hudson-slave/workspace/Lucene-Solr-Tests-trunk-java7/solr/build/solr-core/test/J1/./org.apache.solr.cloud.SyncSliceTest-jetty4-1363565514395/'
[junit4:junit4]   2> 15321 T3212 oasc.SolrResourceLoader.<init> new SolrResourceLoader for directory: '/usr/home/hudson/hudson-slave/workspace/Lucene-Solr-Tests-trunk-java7/solr/build/solr-core/test/J1/./org.apache.solr.cloud.SyncSliceTest-jetty4-1363565514395/'
[junit4:junit4]   2> 15389 T3212 oashc.HttpShardHandlerFactory.getParameter Setting socketTimeout to: 120000
[junit4:junit4]   2> 15390 T3212 oashc.HttpShardHandlerFactory.getParameter Setting urlScheme to: http://
[junit4:junit4]   2> 15391 T3212 oashc.HttpShardHandlerFactory.getParameter Setting connTimeout to: 15000
[junit4:junit4]   2> 15391 T3212 oashc.HttpShardHandlerFactory.getParameter Setting maxConnectionsPerHost to: 20
[junit4:junit4]   2> 15392 T3212 oashc.HttpShardHandlerFactory.getParameter Setting corePoolSize to: 0
[junit4:junit4]   2> 15393 T3212 oashc.HttpShardHandlerFactory.getParameter Setting maximumPoolSize to: 2147483647
[junit4:junit4]   2> 15393 T3212 oashc.HttpShardHandlerFactory.getParameter Setting maxThreadIdleTime to: 5
[junit4:junit4]   2> 15394 T3212 oashc.HttpShardHandlerFactory.getParameter Setting sizeOfQueue to: -1
[junit4:junit4]   2> 15394 T3212 oashc.HttpShardHandlerFactory.getParameter Setting fairnessPolicy to: false
[junit4:junit4]   2> 15395 T3212 oascsi.HttpClientUtil.createClient Creating new http client, config:maxConnectionsPerHost=20&maxConnections=10000&socketTimeout=120000&connTimeout=15000&retry=false
[junit4:junit4]   2> 15415 T3212 oasc.CoreContainer.load Registering Log Listener
[junit4:junit4]   2> 15435 T3212 oasc.CoreContainer.initZooKeeper Zookeeper client=127.0.0.1:20361/solr
[junit4:junit4]   2> 15436 T3212 oasc.ZkController.checkChrootPath zkHost includes chroot
[junit4:junit4]   2> 15436 T3212 oaz.ZooKeeper.<init> Initiating client connection, connectString=127.0.0.1:20361 sessionTimeout=60000 watcher=org.apache.solr.common.cloud.ConnectionManager@767c3b92
[junit4:junit4]   2> 15438 T3212 oascc.ConnectionManager.waitForConnected Waiting for client to connect to ZooKeeper
[junit4:junit4]   2> 15438 T3301 oaz.ClientCnxn$SendThread.logStartConnect Opening socket connection to server localhost/127.0.0.1:20361. Will not attempt to authenticate using SASL (access denied ("javax.security.auth.AuthPermission" "getLoginConfiguration"))
[junit4:junit4]   2> 15439 T3301 oaz.ClientCnxn$SendThread.primeConnection Socket connection established to localhost/127.0.0.1:20361, initiating session
[junit4:junit4]   2> 15439 T3214 oazs.NIOServerCnxnFactory.run Accepted socket connection from /140.211.11.196:34399
[junit4:junit4]   2> 15440 T3214 oazs.ZooKeeperServer.processConnectRequest Client attempting to establish new session at /140.211.11.196:34399
[junit4:junit4]   2> 15442 T3216 oazs.ZooKeeperServer.finishSessionInit Established session 0x13d7ad65399000b with negotiated timeout 20000 for client /140.211.11.196:34399
[junit4:junit4]   2> 15442 T3301 oaz.ClientCnxn$SendThread.onConnected Session establishment complete on server localhost/127.0.0.1:20361, sessionid = 0x13d7ad65399000b, negotiated timeout = 20000
[junit4:junit4]   2> 15442 T3302 oascc.ConnectionManager.process Watcher org.apache.solr.common.cloud.ConnectionManager@767c3b92 name:ZooKeeperConnection Watcher:127.0.0.1:20361 got event WatchedEvent state:SyncConnected type:None path:null path:null type:None
[junit4:junit4]   2> 15442 T3212 oascc.ConnectionManager.waitForConnected Client is connected to ZooKeeper
[junit4:junit4]   2> 15444 T3217 oazs.PrepRequestProcessor.pRequest2Txn Processed session termination for sessionid: 0x13d7ad65399000b
[junit4:junit4]   2> 15445 T3302 oaz.ClientCnxn$EventThread.run EventThread shut down
[junit4:junit4]   2> 15445 T3214 oazs.NIOServerCnxn.closeSock Closed socket connection for client /140.211.11.196:34399 which had sessionid 0x13d7ad65399000b
[junit4:junit4]   2> 15445 T3212 oaz.ZooKeeper.close Session: 0x13d7ad65399000b closed
[junit4:junit4]   2> 15446 T3212 oascsi.HttpClientUtil.createClient Creating new http client, config:maxConnections=500&maxConnectionsPerHost=16&socketTimeout=120000&connTimeout=15000
[junit4:junit4]   2> 15456 T3212 oaz.ZooKeeper.<init> Initiating client connection, connectString=127.0.0.1:20361/solr sessionTimeout=30000 watcher=org.apache.solr.common.cloud.ConnectionManager@34262b70
[junit4:junit4]   2> 15458 T3212 oascc.ConnectionManager.waitForConnected Waiting for client to connect to ZooKeeper
[junit4:junit4]   2> 15458 T3303 oaz.ClientCnxn$SendThread.logStartConnect Opening socket connection to server localhost/127.0.0.1:20361. Will not attempt to authenticate using SASL (access denied ("javax.security.auth.AuthPermission" "getLoginConfiguration"))
[junit4:junit4]   2> 15459 T3303 oaz.ClientCnxn$SendThread.primeConnection Socket connection established to localhost/127.0.0.1:20361, initiating session
[junit4:junit4]   2> 15459 T3214 oazs.NIOServerCnxnFactory.run Accepted socket connection from /140.211.11.196:18666
[junit4:junit4]   2> 15459 T3214 oazs.ZooKeeperServer.processConnectRequest Client attempting to establish new session at /140.211.11.196:18666
[junit4:junit4]   2> 15460 T3216 oazs.ZooKeeperServer.finishSessionInit Established session 0x13d7ad65399000c with negotiated timeout 20000 for client /140.211.11.196:18666
[junit4:junit4]   2> 15461 T3303 oaz.ClientCnxn$SendThread.onConnected Session establishment complete on server localhost/127.0.0.1:20361, sessionid = 0x13d7ad65399000c, negotiated timeout = 20000
[junit4:junit4]   2> 15461 T3304 oascc.ConnectionManager.process Watcher org.apache.solr.common.cloud.ConnectionManager@34262b70 name:ZooKeeperConnection Watcher:127.0.0.1:20361/solr got event WatchedEvent state:SyncConnected type:None path:null path:null type:None
[junit4:junit4]   2> 15461 T3212 oascc.ConnectionManager.waitForConnected Client is connected to ZooKeeper
[junit4:junit4]   2> 15462 T3217 oazs.PrepRequestProcessor.pRequest Got user-level KeeperException when processing sessionid:0x13d7ad65399000c type:create cxid:0x1 zxid:0x92 txntype:-1 reqpath:n/a Error Path:/solr/overseer Error:KeeperErrorCode = NodeExists for /solr/overseer
[junit4:junit4]   2> 15464 T3217 oazs.PrepRequestProcessor.pRequest Got user-level KeeperException when processing sessionid:0x13d7ad65399000c type:create cxid:0x3 zxid:0x93 txntype:-1 reqpath:n/a Error Path:/solr/overseer Error:KeeperErrorCode = NodeExists for /solr/overseer
[junit4:junit4]   2> 15467 T3212 oascc.ZkStateReader.createClusterStateWatchersAndUpdate Updating cluster state from ZooKeeper... 
[junit4:junit4]   2>  C419_STATE=coll:collection1 core:collection1 props:{shard=shard1, state=recovering, core=collection1, collection=collection1, node_name=127.0.0.1:20371__zz%2Flm, base_url=http://127.0.0.1:20371/_zz/lm}
[junit4:junit4]   2> 15720 T3273 C419 P20371 oasc.RecoveryStrategy.doRecovery Attempting to PeerSync from http://127.0.0.1:20368/_zz/lm/collection1/ core=collection1 - recoveringAfterStartup=true
[junit4:junit4]   2> 15720 T3273 C419 P20371 oasu.PeerSync.sync PeerSync: core=collection1 url=http://127.0.0.1:20371/_zz/lm START replicas=[http://127.0.0.1:20368/_zz/lm/collection1/] nUpdates=100
[junit4:junit4]   2> 15721 T3273 C419 P20371 oasu.PeerSync.sync WARNING no frame of reference to tell of we've missed updates
[junit4:junit4]   2> 15722 T3273 C419 P20371 oasc.RecoveryStrategy.doRecovery PeerSync Recovery was not successful - trying replication. core=collection1
[junit4:junit4]   2> 15722 T3273 C419 P20371 oasc.RecoveryStrategy.doRecovery Starting Replication Recovery. core=collection1
[junit4:junit4]   2> 15722 T3273 C419 P20371 oasc.RecoveryStrategy.doRecovery Begin buffering updates. core=collection1
[junit4:junit4]   2> 15723 T3273 C419 P20371 oasu.UpdateLog.bufferUpdates Starting to buffer updates. FSUpdateLog{state=ACTIVE, tlog=null}
[junit4:junit4]   2> 15723 T3273 C419 P20371 oasc.RecoveryStrategy.replicate Attempting to replicate from http://127.0.0.1:20368/_zz/lm/collection1/. core=collection1
[junit4:junit4]   2> 15723 T3273 C419 P20371 oascsi.HttpClientUtil.createClient Creating new http client, config:maxConnections=128&maxConnectionsPerHost=32&followRedirects=false
[junit4:junit4]   2> ASYNC  NEW_CORE C421 name=collection1 org.apache.solr.core.SolrCore@59ab347b url=http://127.0.0.1:20368/_zz/lm/collection1 node=127.0.0.1:20368__zz%2Flm C421_STATE=coll:collection1 core:collection1 props:{shard=shard1, state=active, core=collection1, collection=collection1, node_name=127.0.0.1:20368__zz%2Flm, base_url=http://127.0.0.1:20368/_zz/lm, leader=true}
[junit4:junit4]   2> 15729 T3246 C421 P20368 REQ /get {getVersions=100&distrib=false&wt=javabin&qt=/get&version=2} status=0 QTime=0 
[junit4:junit4]   2> 15735 T3247 C421 P20368 oasu.DirectUpdateHandler2.commit start commit{,optimize=false,openSearcher=false,waitSearcher=true,expungeDeletes=false,softCommit=false,prepareCommit=false}
[junit4:junit4]   2> 15740 T3247 C421 P20368 oasc.SolrDeletionPolicy.onInit SolrDeletionPolicy.onInit: commits:num=1
[junit4:junit4]   2> 		commit{dir=NRTCachingDirectory(org.apache.lucene.store.NIOFSDirectory@/usr/home/hudson/hudson-slave/workspace/Lucene-Solr-Tests-trunk-java7/solr/build/solr-core/test/J1/org.apache.solr.cloud.SyncSliceTest-1363565499283/jetty1/index lockFactory=org.apache.lucene.store.NativeFSLockFactory@461bb495; maxCacheMB=48.0 maxMergeSizeMB=4.0),segFN=segments_1,generation=1,filenames=[segments_1]
[junit4:junit4]   2> 15740 T3247 C421 P20368 oasc.SolrDeletionPolicy.updateCommits newest commit = 1[segments_1]
[junit4:junit4]   2> 15745 T3247 C421 P20368 oasc.SolrDeletionPolicy.onCommit SolrDeletionPolicy.onCommit: commits:num=2
[junit4:junit4]   2> 		commit{dir=NRTCachingDirectory(org.apache.lucene.store.NIOFSDirectory@/usr/home/hudson/hudson-slave/workspace/Lucene-Solr-Tests-trunk-java7/solr/build/solr-core/test/J1/org.apache.solr.cloud.SyncSliceTest-1363565499283/jetty1/index lockFactory=org.apache.lucene.store.NativeFSLockFactory@461bb495; maxCacheMB=48.0 maxMergeSizeMB=4.0),segFN=segments_1,generation=1,filenames=[segments_1]
[junit4:junit4]   2> 		commit{dir=NRTCachingDirectory(org.apache.lucene.store.NIOFSDirectory@/usr/home/hudson/hudson-slave/workspace/Lucene-Solr-Tests-trunk-java7/solr/build/solr-core/test/J1/org.apache.solr.cloud.SyncSliceTest-1363565499283/jetty1/index lockFactory=org.apache.lucene.store.NativeFSLockFactory@461bb495; maxCacheMB=48.0 maxMergeSizeMB=4.0),segFN=segments_2,generation=2,filenames=[segments_2]
[junit4:junit4]   2> 15745 T3247 C421 P20368 oasc.SolrDeletionPolicy.updateCommits newest commit = 2[segments_2]
[junit4:junit4]   2> 15747 T3247 C421 P20368 oass.SolrIndexSearcher.<init> Opening Searcher@51f5ed79 realtime
[junit4:junit4]   2> 15747 T3247 C421 P20368 oasu.DirectUpdateHandler2.commit end_commit_flush
[junit4:junit4]   2> 15748 T3247 C421 P20368 /update {waitSearcher=true&openSearcher=false&commit=true&wt=javabin&commit_end_point=true&version=2&softCommit=false} {commit=} 0 14
[junit4:junit4]   2> 15749 T3273 C419 P20371 oash.ReplicationHandler.inform Commits will be reserved for  10000
[junit4:junit4]   2> 15749 T3273 C419 P20371 oash.SnapPuller.<init>  No value set for 'pollInterval'. Timer Task not started.
[junit4:junit4]   2> 15752 T3248 C421 P20368 oash.ReplicationHandler.inform Commits will be reserved for  10000
[junit4:junit4]   2> 15752 T3248 C421 P20368 REQ /replication {command=indexversion&qt=/replication&wt=javabin&version=2} status=0 QTime=2 
[junit4:junit4]   2> 15753 T3273 C419 P20371 oash.SnapPuller.fetchLatestIndex Master's generation: 2
[junit4:junit4]   2> 15753 T3273 C419 P20371 oash.SnapPuller.fetchLatestIndex Slave's generation: 1
[junit4:junit4]   2> 15753 T3273 C419 P20371 oash.SnapPuller.fetchLatestIndex Starting replication process
[junit4:junit4]   2> 15756 T3248 C421 P20368 REQ /replication {command=filelist&qt=/replication&wt=javabin&generation=2&version=2} status=0 QTime=1 
[junit4:junit4]   2> 15756 T3273 C419 P20371 oash.SnapPuller.fetchLatestIndex Number of files in latest index in master: 1
[junit4:junit4]   2> 15757 T3273 C419 P20371 oasc.CachingDirectoryFactory.get return new directory for /usr/home/hudson/hudson-slave/workspace/Lucene-Solr-Tests-trunk-java7/solr/build/solr-core/test/J1/org.apache.solr.cloud.SyncSliceTest-1363565499283/jetty2/index.20130317201155034 forceNew: false
[junit4:junit4]   2> 15759 T3273 C419 P20371 oash.SnapPuller.fetchLatestIndex Starting download to NRTCachingDirectory(org.apache.lucene.store.NIOFSDirectory@/usr/home/hudson/hudson-slave/workspace/Lucene-Solr-Tests-trunk-java7/solr/build/solr-core/test/J1/org.apache.solr.cloud.SyncSliceTest-1363565499283/jetty2/index.20130317201155034 lockFactory=org.apache.lucene.store.NativeFSLockFactory@5fd974ba; maxCacheMB=48.0 maxMergeSizeMB=4.0) fullCopy=false
[junit4:junit4]   2> 15762 T3248 C421 P20368 REQ /replication {file=segments_2&command=filecontent&checksum=true&wt=filestream&qt=/replication&generation=2} status=0 QTime=0 
[junit4:junit4]   2> 15763 T3273 C419 P20371 oash.SnapPuller.fetchLatestIndex Total time taken for download : 0 secs
[junit4:junit4]   2> 15780 T3273 C419 P20371 oasu.DefaultSolrCoreState.newIndexWriter Creating new IndexWriter...
[junit4:junit4]   2> 15780 T3273 C419 P20371 oasu.DefaultSolrCoreState.newIndexWriter Waiting until IndexWriter is unused... core=collection1
[junit4:junit4]   2> 15784 T3273 C419 P20371 oasc.SolrDeletionPolicy.onInit SolrDeletionPolicy.onInit: commits:num=2
[junit4:junit4]   2> 		commit{dir=NRTCachingDirectory(org.apache.lucene.store.NIOFSDirectory@/usr/home/hudson/hudson-slave/workspace/Lucene-Solr-Tests-trunk-java7/solr/build/solr-core/test/J1/org.apache.solr.cloud.SyncSliceTest-1363565499283/jetty2/index lockFactory=org.apache.lucene.store.NativeFSLockFactory@34f885b1; maxCacheMB=48.0 maxMergeSizeMB=4.0),segFN=segments_1,generation=1,filenames=[segments_1]
[junit4:junit4]   2> 		commit{dir=NRTCachingDirectory(org.apache.lucene.store.NIOFSDirectory@/usr/home/hudson/hudson-slave/workspace/Lucene-Solr-Tests-trunk-java7/solr/build/solr-core/test/J1/org.apache.solr.cloud.SyncSliceTest-1363565499283/jetty2/index lockFactory=org.apache.lucene.store.NativeFSLockFactory@34f885b1; maxCacheMB=48.0 maxMergeSizeMB=4.0),segFN=segments_2,generation=2,filenames=[segments_2]
[junit4:junit4]   2> 15785 T3273 C419 P20371 oasc.SolrDeletionPolicy.updateCommits newest commit = 2[segments_2]
[junit4:junit4]   2> 15785 T3273 C419 P20371 oasu.DefaultSolrCoreState.newIndexWriter New IndexWriter is ready to be used.
[junit4:junit4]   2> 15786 T3273 C419 P20371 oass.SolrIndexSearcher.<init> Opening Searcher@429dfa03 main
[junit4:junit4]   2> 15787 T3272 oasc.SolrCore.registerSearcher [collection1] Registered new searcher Searcher@429dfa03 main{StandardDirectoryReader(segments_2:1:nrt)}
[junit4:junit4]   2> 15788 T3273 C419 P20371 oasc.RecoveryStrategy.replay No replay needed. core=collection1
[junit4:junit4]   2> 15788 T3273 C419 P20371 oasc.RecoveryStrategy.doRecovery Replication Recovery was successful - registering as Active. core=collection1
[junit4:junit4]   2> 15788 T3273 C419 P20371 oasc.ZkController.publish publishing core=collection1 state=active
[junit4:junit4]   2> 15788 T3273 C419 P20371 oasc.ZkController.publish numShards not found on descriptor - reading it from system property
[junit4:junit4]   2> 15790 T3273 C419 P20371 oasc.RecoveryStrategy.doRecovery Finished recovery process. core=collection1
[junit4:junit4]   2> 16161 T3235 oascc.ZkStateReader.updateClusterState Updating cloud state from ZooKeeper... 
[junit4:junit4]   2> 16161 T3235 oasc.Overseer$ClusterStateUpdater.updateState Update state numShards=1 message={
[junit4:junit4]   2> 	  "operation":"state",
[junit4:junit4]   2> 	  "core_node_name":"127.0.0.1:24982__zz%2Flm_collection1",
[junit4:junit4]   2> 	  "numShards":"1",
[junit4:junit4]   2> 	  "shard":"shard1",
[junit4:junit4]   2> 	  "roles":null,
[junit4:junit4]   2> 	  "state":"recovering",
[junit4:junit4]   2> 	  "core":"collection1",
[junit4:junit4]   2> 	  "collection":"collection1",
[junit4:junit4]   2> 	  "node_name":"127.0.0.1:24982__zz%2Flm",
[junit4:junit4]   2> 	  "base_url":"http://127.0.0.1:24982/_zz/lm"}
[junit4:junit4]   2> 16172 T3235 oasc.Overseer$ClusterStateUpdater.updateState Update state numShards=1 message={
[junit4:junit4]   2> 	  "operation":"state",
[junit4:junit4]   2> 	  "core_node_name":"127.0.0.1:20371__zz%2Flm_collection1",
[junit4:junit4]   2> 	  "numShards":"1",
[junit4:junit4]   2> 	  "shard":"shard1",
[junit4:junit4]   2> 	  "roles":null,
[junit4:junit4]   2> 	  "state":"active",
[junit4:junit4]   2> 	  "core":"collection1",
[junit4:junit4]   2> 	  "collection":"collection1",
[junit4:junit4]   2> 	  "node_name":"127.0.0.1:20371__zz%2Flm",
[junit4:junit4]   2> 	  "base_url":"http://127.0.0.1:20371/_zz/lm"}
[junit4:junit4]   2> 16186 T3287 oascc.ZkStateReader$2.process A cluster state change: WatchedEvent state:SyncConnected type:NodeDataChanged path:/clusterstate.json, has occurred - updating... (live nodes size: 4)
[junit4:junit4]   2> 16186 T3270 oascc.ZkStateReader$2.process A cluster state change: WatchedEvent state:SyncConnected type:NodeDataChanged path:/clusterstate.json, has occurred - updating... (live nodes size: 4)
[junit4:junit4]   2> 16186 T3304 oascc.ZkStateReader$2.process A cluster state change: WatchedEvent state:SyncConnected type:NodeDataChanged path:/clusterstate.json, has occurred - updating... (live nodes size: 4)
[junit4:junit4]   2> 16186 T3254 oascc.ZkStateReader$2.process A cluster state change: WatchedEvent state:SyncConnected type:NodeDataChanged path:/clusterstate.json, has occurred - updating... (live nodes size: 4)
[junit4:junit4]   2> 16186 T3241 oascc.ZkStateReader$2.process A cluster state change: WatchedEvent state:SyncConnected type:NodeDataChanged path:/clusterstate.json, has occurred - updating... (live nodes size: 4)
[junit4:junit4]   2> 16186 T3234 oascc.ZkStateReader$2.process A cluster state change: WatchedEvent state:SyncConnected type:NodeDataChanged path:/clusterstate.json, has occurred - updating... (live nodes size: 4)
[junit4:junit4]   2> 16470 T3212 oasc.ZkController.createEphemeralLiveNode Register node as live in ZooKeeper:/live_nodes/127.0.0.1:31439__zz%2Flm
[junit4:junit4]   2> 16472 T3217 oazs.PrepRequestProcessor.pRequest Got user-level KeeperException when processing sessionid:0x13d7ad65399000c type:delete cxid:0xf zxid:0x9c txntype:-1 reqpath:n/a Error Path:/solr/live_nodes/127.0.0.1:31439__zz%2Flm Error:KeeperErrorCode = NoNode for /solr/live_nodes/127.0.0.1:31439__zz%2Flm
[junit4:junit4]   2> 16473 T3212 oascc.SolrZkClient.makePath makePath: /live_nodes/127.0.0.1:31439__zz%2Flm
[junit4:junit4]   2> 16475 T3304 oascc.ZkStateReader$2.process A cluster state change: WatchedEvent state:SyncConnected type:NodeChildrenChanged path:/live_nodes, has occurred - updating... (live nodes size: 4)
[junit4:junit4]   2> 16475 T3254 oascc.ZkStateReader$2.process A cluster state change: WatchedEvent state:SyncConnected type:NodeChildrenChanged path:/live_nodes, has occurred - updating... (live nodes size: 4)
[junit4:junit4]   2> 16476 T3287 oascc.ZkStateReader$3.process Updating live nodes... (5)
[junit4:junit4]   2> 16476 T3241 oascc.ZkStateReader$3.process Updating live nodes... (5)
[junit4:junit4]   2> 16476 T3234 oascc.ZkStateReader$3.process Updating live nodes... (5)
[junit4:junit4]   2> 16476 T3270 oascc.ZkStateReader$3.process Updating live nodes... (5)
[junit4:junit4]   2> 16476 T3287 oascc.ZkStateReader$2.process A cluster state change: WatchedEvent state:SyncConnected type:NodeChildrenChanged path:/live_nodes, has occurred - updating... (live nodes size: 5)
[junit4:junit4]   2> 16476 T3234 oascc.ZkStateReader$2.process A cluster state change: WatchedEvent state:SyncConnected type:NodeChildrenChanged path:/live_nodes, has occurred - updating... (live nodes size: 5)
[junit4:junit4]   2> 16476 T3270 oascc.ZkStateReader$2.process A cluster state change: WatchedEvent state:SyncConnected type:NodeChildrenChanged path:/live_nodes, has occurred - updating... (live nodes size: 5)
[junit4:junit4]   2> 16476 T3241 oascc.ZkStateReader$2.process A cluster state change: WatchedEvent state:SyncConnected type:NodeChildrenChanged path:/live_nodes, has occurred - updating... (live nodes size: 5)
[junit4:junit4]   2> 16477 T3254 oascc.ZkStateReader$3.process Updating live nodes... (5)
[junit4:junit4]   2> 16477 T3304 oascc.ZkStateReader$3.process Updating live nodes... (5)
[junit4:junit4]   2> 16494 T3307 oasc.CoreContainer.create Creating SolrCore 'collection1' using instanceDir: /usr/home/hudson/hudson-slave/workspace/Lucene-Solr-Tests-trunk-java7/solr/build/solr-core/test/J1/./org.apache.solr.cloud.SyncSliceTest-jetty4-1363565514395/collection1
[junit4:junit4]   2> 16495 T3307 oasc.ZkController.createCollectionZkNode Check for collection zkNode:collection1
[junit4:junit4]   2> 16495 T3307 oasc.ZkController.createCollectionZkNode Collection zkNode exists
[junit4:junit4]   2> 16496 T3307 oasc.ZkController.readConfigName Load collection config from:/collections/collection1
[junit4:junit4]   2> 16497 T3307 oasc.SolrResourceLoader.<init> new SolrResourceLoader for directory: '/usr/home/hudson/hudson-slave/workspace/Lucene-Solr-Tests-trunk-java7/solr/build/solr-core/test/J1/./org.apache.solr.cloud.SyncSliceTest-jetty4-1363565514395/collection1/'
[junit4:junit4]   2> 16498 T3307 oasc.SolrResourceLoader.replaceClassLoader Adding 'file:/usr/home/hudson/hudson-slave/workspace/Lucene-Solr-Tests-trunk-java7/solr/build/solr-core/test/J1/org.apache.solr.cloud.SyncSliceTest-jetty4-1363565514395/collection1/lib/README' to classloader
[junit4:junit4]   2> 16499 T3307 oasc.SolrResourceLoader.replaceClassLoader Adding 'file:/usr/home/hudson/hudson-slave/workspace/Lucene-Solr-Tests-trunk-java7/solr/build/solr-core/test/J1/org.apache.solr.cloud.SyncSliceTest-jetty4-1363565514395/collection1/lib/classes/' to classloader
[junit4:junit4]   2> 16577 T3307 oasc.SolrConfig.<init> Using Lucene MatchVersion: LUCENE_50
[junit4:junit4]   2> 16636 T3307 oasc.SolrConfig.<init> Loaded SolrConfig: solrconfig.xml
[junit4:junit4]   2> 16737 T3307 oass.IndexSchema.readSchema Reading Solr Schema
[junit4:junit4]   2> 16744 T3307 oass.IndexSchema.readSchema Schema name=test
[junit4:junit4]   2> 17121 T3245 oass.SolrDispatchFilter.handleAdminRequest /admin/cores {coreNodeName=127.0.0.1:24982__zz%252Flm_collection1&state=recovering&nodeName=127.0.0.1:24982__zz%252Flm&action=PREPRECOVERY&checkLive=true&core=collection1&wt=javabin&onlyIfLeader=true&version=2} status=0 QTime=2002 
[junit4:junit4]   2> 17361 T3307 oass.OpenExchangeRatesOrgProvider.init Initialized with rates=open-exchange-rates.json, refreshInterval=1440.
[junit4:junit4]   2> 17373 T3307 oass.IndexSchema.readSchema default search field in schema is text
[junit4:junit4]   2> 17377 T3307 oass.IndexSchema.readSchema unique key field: id
[junit4:junit4]   2> 17391 T3307 oass.FileExchangeRateProvider.reload Reloading exchange rates from file currency.xml
[junit4:junit4]   2> 17397 T3307 oass.FileExchangeRateProvider.reload Reloading exchange rates from file currency.xml
[junit4:junit4]   2> 17402 T3307 oass.OpenExchangeRatesOrgProvider.reload Reloading exchange rates from open-exchange-rates.json
[junit4:junit4]   2> 17403 T3307 oass.OpenExchangeRatesOrgProvider$OpenExchangeRates.<init> WARNING Unknown key IMPORTANT NOTE
[junit4:junit4]   2> 17404 T3307 oass.OpenExchangeRatesOrgProvider$OpenExchangeRates.<init> WARNING Expected key, got STRING
[junit4:junit4]   2> 17404 T3307 oass.OpenExchangeRatesOrgProvider.reload Reloading exchange rates from open-exchange-rates.json
[junit4:junit4]   2> 17405 T3307 oass.OpenExchangeRatesOrgProvider$OpenExchangeRates.<init> WARNING Unknown key IMPORTANT NOTE
[junit4:junit4]   2> 17406 T3307 oass.OpenExchangeRatesOrgProvider$OpenExchangeRates.<init> WARNING Expected key, got STRING
[junit4:junit4]   2> 17406 T3307 oasc.SolrCore.initDirectoryFactory solr.NRTCachingDirectoryFactory
[junit4:junit4]   2> 17406 T3307 oasc.SolrCore.<init> [collection1] Opening new SolrCore at /usr/home/hudson/hudson-slave/workspace/Lucene-Solr-Tests-trunk-java7/solr/build/solr-core/test/J1/./org.apache.solr.cloud.SyncSliceTest-jetty4-1363565514395/collection1/, dataDir=./org.apache.solr.cloud.SyncSliceTest-1363565499283/jetty4/
[junit4:junit4]   2> 17407 T3307 oasc.JmxMonitoredMap.<init> JMX monitoring is enabled. Adding Solr mbeans to JMX Server: com.sun.jmx.mbeanserver.JmxMBeanServer@5b5bae99
[junit4:junit4]   2> 17407 T3307 oasc.SolrCore.initDirectoryFactory solr.NRTCachingDirectoryFactory
[junit4:junit4]   2> 17408 T3307 oasc.CachingDirectoryFactory.get return new directory for /usr/home/hudson/hudson-slave/workspace/Lucene-Solr-Tests-trunk-java7/solr/build/solr-core/test/J1/org.apache.solr.cloud.SyncSliceTest-1363565499283/jetty4 forceNew: false
[junit4:junit4]   2> 17409 T3307 oasc.SolrCore.getNewIndexDir New index directory detected: old=null new=./org.apache.solr.cloud.SyncSliceTest-1363565499283/jetty4/index/
[junit4:junit4]   2> 17410 T3307 oasc.SolrCore.initIndex WARNING [collection1] Solr index directory './org.apache.solr.cloud.SyncSliceTest-1363565499283/jetty4/index' doesn't exist. Creating new index...
[junit4:junit4]   2> 17410 T3307 oasc.CachingDirectoryFactory.get return new directory for /usr/home/hudson/hudson-slave/workspace/Lucene-Solr-Tests-trunk-java7/solr/build/solr-core/test/J1/org.apache.solr.cloud.SyncSliceTest-1363565499283/jetty4/index forceNew: false
[junit4:junit4]   2> 17416 T3307 oasc.SolrDeletionPolicy.onCommit SolrDeletionPolicy.onCommit: commits:num=1
[junit4:junit4]   2> 		commit{dir=NRTCachingDirectory(org.apache.lucene.store.NIOFSDirectory@/usr/home/hudson/hudson-slave/workspace/Lucene-Solr-Tests-trunk-java7/solr/build/solr-core/test/J1/org.apache.solr.cloud.SyncSliceTest-1363565499283/jetty4/index lockFactory=org.apache.lucene.store.NativeFSLockFactory@13755cd5; maxCacheMB=48.0 maxMergeSizeMB=4.0),segFN=segments_1,generation=1,filenames=[segments_1]
[junit4:junit4]   2> 17417 T3307 oasc.SolrDeletionPolicy.updateCommits newest commit = 1[segments_1]
[junit4:junit4]   2> 17420 T3307 oasup.UpdateRequestProcessorChain.init inserting DistributedUpdateProcessorFactory into updateRequestProcessorChain "dedupe"
[junit4:junit4]   2> 17420 T3307 oasup.UpdateRequestProcessorChain.init inserting DistributedUpdateProcessorFactory into updateRequestProcessorChain "stored_sig"
[junit4:junit4]   2> 17421 T3307 oasup.UpdateRequestProcessorChain.init inserting DistributedUpdateProcessorFactory into updateRequestProcessorChain "distrib-dup-test-chain-implicit"
[junit4:junit4]   2> 17422 T3307 oasc.RequestHandlers.initHandlersFromConfig created standard: solr.StandardRequestHandler
[junit4:junit4]   2> 17422 T3307 oasc.RequestHandlers.initHandlersFromConfig created /get: solr.RealTimeGetHandler
[junit4:junit4]   2> 17423 T3307 oasc.RequestHandlers.initHandlersFromConfig adding lazy requestHandler: solr.ReplicationHandler
[junit4:junit4]   2> 17423 T3307 oasc.RequestHandlers.initHandlersFromConfig created /replication: solr.ReplicationHandler
[junit4:junit4]   2> 17424 T3307 oasc.RequestHandlers.initHandlersFromConfig created /update: solr.UpdateRequestHandler
[junit4:junit4]   2> 17424 T3307 oasc.RequestHandlers.initHandlersFromConfig created /admin/: org.apache.solr.handler.admin.AdminHandlers
[junit4:junit4]   2> 17437 T3307 oashl.XMLLoader.init xsltCacheLifetimeSeconds=60
[junit4:junit4]   2> 17446 T3307 oass.SolrIndexSearcher.<init> Opening Searcher@63012574 main
[junit4:junit4]   2> 17447 T3307 oasu.CommitTracker.<init> Hard AutoCommit: disabled
[junit4:junit4]   2> 17447 T3307 oasu.CommitTracker.<init> Soft AutoCommit: disabled
[junit4:junit4]   2> 17452 T3308 oasc.SolrCore.registerSearcher [collection1] Registered new searcher Searcher@63012574 main{StandardDirectoryReader(segments_1:1)}
[junit4:junit4]   2> 17454 T3307 oasc.ZkController.publish publishing core=collection1 state=down
[junit4:junit4]   2> 17454 T3307 oasc.ZkController.publish numShards not found on descriptor - reading it from system property
[junit4:junit4]   2> 17700 T3235 oascc.ZkStateReader.updateClusterState Updating cloud state from ZooKeeper... 
[junit4:junit4]   2> 17701 T3235 oasc.Overseer$ClusterStateUpdater.updateState Update state numShards=1 message={
[junit4:junit4]   2> 	  "operation":"state",
[junit4:junit4]   2> 	  "core_node_name":null,
[junit4:junit4]   2> 	  "numShards":"1",
[junit4:junit4]   2> 	  "shard":null,
[junit4:junit4]   2> 	  "roles":null,
[junit4:junit4]   2> 	  "state":"down",
[junit4:junit4]   2> 	  "core":"collection1",
[junit4:junit4]   2> 	  "collection":"collection1",
[junit4:junit4]   2> 	  "node_name":"127.0.0.1:31439__zz%2Flm",
[junit4:junit4]   2> 	  "base_url":"http://127.0.0.1:31439/_zz/lm"}
[junit4:junit4]   2> 17701 T3235 oasc.Overseer$ClusterStateUpdater.updateState Collection already exists with numShards=1
[junit4:junit4]   2> 17701 T3235 oasc.Overseer$ClusterStateUpdater.updateState Assigning new node to shard shard=shard1
[junit4:junit4]   2> 17714 T3234 oascc.ZkStateReader$2.process A cluster state change: WatchedEvent state:SyncConnected type:NodeDataChanged path:/clusterstate.json, has occurred - updating... (live nodes size: 5)
[junit4:junit4]   2> 17714 T3254 oascc.ZkStateReader$2.process A cluster state change: WatchedEvent state:SyncConnected type:NodeDataChanged path:/clusterstate.json, has occurred - updating... (live nodes size: 5)
[junit4:junit4]   2> 17714 T3241 oascc.ZkStateReader$2.process A cluster state change: WatchedEvent state:SyncConnected type:NodeDataChanged path:/clusterstate.json, has occurred - updating... (live nodes size: 5)
[junit4:junit4]   2> 17714 T3287 oascc.ZkStateReader$2.process A cluster state change: WatchedEvent state:SyncConnected type:NodeDataChanged path:/clusterstate.json, has occurred - updating... (live nodes size: 5)
[junit4:junit4]   2> 17714 T3304 oascc.ZkStateReader$2.process A cluster state change: WatchedEvent state:SyncConnected type:NodeDataChanged path:/clusterstate.json, has occurred - updating... (live nodes size: 5)
[junit4:junit4]   2> 17714 T3270 oascc.ZkStateReader$2.process A cluster state change: WatchedEvent state:SyncConnected type:NodeDataChanged path:/clusterstate.json, has occurred - updating... (live nodes size: 5)
[junit4:junit4]   2> 18457 T3307 oasc.CoreContainer.registerCore registering core: collection1
[junit4:junit4]   2> 18457 T3307 oasc.ZkController.register Register replica - core:collection1 address:http://127.0.0.1:31439/_zz/lm collection:collection1 shard:shard1
[junit4:junit4]   2> 18461 T3307 oasc.ZkController.register We are http://127.0.0.1:31439/_zz/lm/collection1/ and leader is http://127.0.0.1:20368/_zz/lm/collection1/
[junit4:junit4]   2> 18461 T3307 oasc.ZkController.register No LogReplay needed for core=collection1 baseURL=http://127.0.0.1:31439/_zz/lm
[junit4:junit4]   2> 18461 T3307 oasc.ZkController.checkRecovery Core needs to recover:collection1
[junit4:junit4]   2> 18461 T3307 oasu.DefaultSolrCoreState.doRecovery Running recovery - first canceling any ongoing recovery
[junit4:junit4]   2> ASYNC  NEW_CORE C422 name=collection1 org.apache.solr.core.SolrCore@2472edf url=http://127.0.0.1:31439/_zz/lm/collection1 node=127.0.0.1:31439__zz%2Flm C422_STATE=coll:collection1 core:collection1 props:{state=down, core=collection1, collection=collection1, node_name=127.0.0.1:31439__zz%2Flm, base_url=http://127.0.0.1:31439/_zz/lm}
[junit4:junit4]   2> 18462 T3309 C422 P31439 oasc.RecoveryStrategy.run Starting recovery process.  core=collection1 recoveringAfterStartup=true
[junit4:junit4]   2> 18462 T3307 oascc.ZkStateReader.updateClusterState Updating cloud state from ZooKeeper... 
[junit4:junit4]   2> 18463 T3309 C422 P31439 oasc.RecoveryStrategy.doRecovery ###### startupVersions=[]
[junit4:junit4]   2> 18464 T3309 C422 P31439 oasc.ZkController.publish publishing core=collection1 state=recovering
[junit4:junit4]   2> 18464 T3309 C422 P31439 oasc.ZkController.publish numShards not found on descriptor - reading it from system property
[junit4:junit4]   2> 18464 T3212 oass.SolrDispatchFilter.init user.dir=/usr/home/hudson/hudson-slave/workspace/Lucene-Solr-Tests-trunk-java7/solr/build/solr-core/test/J1
[junit4:junit4]   2> 18465 T3309 C422 P31439 oascsi.HttpClientUtil.createClient Creating new http client, config:maxConnections=128&maxConnectionsPerHost=32&followRedirects=false
[junit4:junit4]   2> 18465 T3212 oass.SolrDispatchFilter.init SolrDispatchFilter.init() done
[junit4:junit4]   2> 18466 T3212 oascsi.HttpClientUtil.createClient Creating new http client, config:maxConnections=128&maxConnectionsPerHost=32&followRedirects=false
[junit4:junit4]   2> 18488 T3212 oascc.ZkStateReader.updateClusterState Updating cloud state from ZooKeeper... 
[junit4:junit4]   2> 18490 T3212 oasc.AbstractFullDistribZkTestBase.waitForThingsToLevelOut Wait for recoveries to finish - wait 15 for each attempt
[junit4:junit4]   2> 18490 T3212 oasc.AbstractDistribZkTestBase.waitForRecoveriesToFinish Wait for recoveries to finish - collection: collection1 failOnTimeout:true timeout (sec):15
[junit4:junit4]   2> 18491 T3212 oascc.ZkStateReader.updateClusterState Updating cloud state from ZooKeeper... 
[junit4:junit4]   2>  C420_STATE=coll:collection1 core:collection1 props:{shard=shard1, state=recovering, core=collection1, collection=collection1, node_name=127.0.0.1:24982__zz%2Flm, base_url=http://127.0.0.1:24982/_zz/lm}
[junit4:junit4]   2> 19123 T3290 C420 P24982 oasc.RecoveryStrategy.doRecovery Attempting to PeerSync from http://127.0.0.1:20368/_zz/lm/collection1/ core=collection1 - recoveringAfterStartup=true
[junit4:junit4]   2> 19123 T3290 C420 P24982 oasu.PeerSync.sync PeerSync: core=collection1 url=http://127.0.0.1:24982/_zz/lm START replicas=[http://127.0.0.1:20368/_zz/lm/collection1/] nUpdates=100
[junit4:junit4]   2> 19124 T3290 C420 P24982 oasu.PeerSync.sync WARNING no frame of reference to tell of we've missed updates
[junit4:junit4]   2> 19124 T3290 C420 P24982 oasc.RecoveryStrategy.doRecovery PeerSync Recovery was not successful - trying replication. core=collection1
[junit4:junit4]   2> 19124 T3290 C420 P24982 oasc.RecoveryStrategy.doRecovery Starting Replication Recovery. core=collection1
[junit4:junit4]   2> 19124 T3290 C420 P24982 oasc.RecoveryStrategy.doRecovery Begin buffering updates. core=collection1
[junit4:junit4]   2> 19124 T3290 C420 P24982 oasu.UpdateLog.bufferUpdates Starting to buffer updates. FSUpdateLog{state=ACTIVE, tlog=null}
[junit4:junit4]   2> 19125 T3290 C420 P24982 oasc.RecoveryStrategy.replicate Attempting to replicate from http://127.0.0.1:20368/_zz/lm/collection1/. core=collection1
[junit4:junit4]   2> 19125 T3290 C420 P24982 oascsi.HttpClientUtil.createClient Creating new http client, config:maxConnections=128&maxConnectionsPerHost=32&followRedirects=false
[junit4:junit4]   2> 19126 T3246 C421 P20368 REQ /get {getVersions=100&distrib=false&wt=javabin&qt=/get&version=2} status=0 QTime=0 
[junit4:junit4]   2> 19136 T3250 C421 P20368 oasu.DirectUpdateHandler2.commit start commit{,optimize=false,openSearcher=false,waitSearcher=true,expungeDeletes=false,softCommit=false,prepareCommit=false}
[junit4:junit4]   2> 19142 T3250 C421 P20368 oasc.SolrDeletionPolicy.onCommit SolrDeletionPolicy.onCommit: commits:num=2
[junit4:junit4]   2> 		commit{dir=NRTCachingDirectory(org.apache.lucene.store.NIOFSDirectory@/usr/home/hudson/hudson-slave/workspace/Lucene-Solr-Tests-trunk-java7/solr/build/solr-core/test/J1/org.apache.solr.cloud.SyncSliceTest-1363565499283/jetty1/index lockFactory=org.apache.lucene.store.NativeFSLockFactory@461bb495; maxCacheMB=48.0 maxMergeSizeMB=4.0),segFN=segments_2,generation=2,filenames=[segments_2]
[junit4:junit4]   2> 		commit{dir=NRTCachingDirectory(org.apache.lucene.store.NIOFSDirectory@/usr/home/hudson/hudson-slave/workspace/Lucene-Solr-Tests-trunk-java7/solr/build/solr-core/test/J1/org.apache.solr.cloud.SyncSliceTest-1363565499283/jetty1/index lockFactory=org.apache.lucene.store.NativeFSLockFactory@461bb495; maxCacheMB=48.0 maxMergeSizeMB=4.0),segFN=segments_3,generation=3,filenames=[segments_3]
[junit4:junit4]   2> 19143 T3250 C421 P20368 oasc.SolrDeletionPolicy.updateCommits newest commit = 3[segments_3]
[junit4:junit4]   2> 19144 T3250 C421 P20368 oasu.DirectUpdateHandler2.commit end_commit_flush
[junit4:junit4]   2> 19144 T3250 C421 P20368 /update {waitSearcher=true&openSearcher=false&commit=true&wt=javabin&commit_end_point=true&version=2&softCommit=false} {commit=} 0 8
[junit4:junit4]   2> 19145 T3290 C420 P24982 oash.ReplicationHandler.inform Commits will be reserved for  10000
[junit4:junit4]   2> 19145 T3290 C420 P24982 oash.SnapPuller.<init>  No value set for 'pollInterval'. Timer Task not started.
[junit4:junit4]   2> 19148 T3248 C421 P20368 REQ /replication {command=indexversion&qt=/replication&wt=javabin&version=2} status=0 QTime=0 
[junit4:junit4]   2> 19149 T3290 C420 P24982 oash.SnapPuller.fetchLatestIndex Master's generation: 3
[junit4:junit4]   2> 19149 T3290 C420 P24982 oash.SnapPuller.fetchLatestIndex Slave's generation: 1
[junit4:junit4]   2> 19149 T3290 C420 P24982 oash.SnapPuller.fetchLatestIndex Starting replication process
[junit4:junit4]   2> 19152 T3248 C421 P20368 REQ /replication {command=filelist&qt=/replication&wt=javabin&generation=3&version=2} status=0 QTime=1 
[junit4:junit4]   2> 19153 T3290 C420 P24982 oash.SnapPuller.fetchLatestIndex Number of files in latest index in master: 1
[junit4:junit4]   2> 19154 T3290 C420 P24982 oasc.CachingDirectoryFactory.get return new directory for /usr/home/hudson/hudson-slave/workspace/Lucene-Solr-Tests-trunk-java7/solr/build/solr-core/test/J1/org.apache.solr.cloud.SyncSliceTest-1363565499283/jetty3/index.20130317201158430 forceNew: false
[junit4:junit4]   2> 19155 T3290 C420 P24982 oash.SnapPuller.fetchLatestIndex Starting download to NRTCachingDirectory(org.apache.lucene.store.NIOFSDirectory@/usr/home/hudson/hudson-slave/workspace/Lucene-Solr-Tests-trunk-java7/solr/build/solr-core/test/J1/org.apache.solr.cloud.SyncSliceTest-1363565499283/jetty3/index.20130317201158430 lockFactory=org.apache.lucene.store.NativeFSLockFactory@34603d76; maxCacheMB=48.0 maxMergeSizeMB=4.0) fullCopy=false
[junit4:junit4]   2> 19159 T3248 C421 P20368 REQ /replication {file=segments_3&command=filecontent&checksum=true&wt=filestream&qt=/replication&generation=3} status=0 QTime=0 
[junit4:junit4]   2> 19160 T3290 C420 P24982 oash.SnapPuller.fetchLatestIndex Total time taken for download : 0 secs
[junit4:junit4]   2> 19163 T3290 C420 P24982 oasu.DefaultSolrCoreState.newIndexWriter Creating new IndexWriter...
[junit4:junit4]   2> 19163 T3290 C420 P24982 oasu.DefaultSolrCoreState.newIndexWriter Waiting until IndexWriter is unused... core=collection1
[junit4:junit4]   2> 19167 T3290 C420 P24982 oasc.SolrDeletionPolicy.onInit SolrDeletionPolicy.onInit: commits:num=2
[junit4:junit4]   2> 		commit{dir=NRTCachingDirectory(org.apache.lucene.store.NIOFSDirectory@/usr/home/hudson/hudson-slave/workspace/Lucene-Solr-Tests-trunk-java7/solr/build/solr-core/test/J1/org.apache.solr.cloud.SyncSliceTest-1363565499283/jetty3/index lockFactory=org.apache.lucene.store.NativeFSLockFactory@6d0efaa8; maxCacheMB=48.0 maxMergeSizeMB=4.0),segFN=segments_1,generation=1,filenames=[segments_1]
[junit4:junit4]   2> 		commit{dir=NRTCachingDirectory(org.apache.lucene.store.NIOFSDirectory@/usr/home/hudson/hudson-slave/workspace/Lucene-Solr-Tests-trunk-java7/solr/build/solr-core/test/J1/org.apache.solr.cloud.SyncSliceTest-1363565499283/jetty3/index lockFactory=org.apache.lucene.store.NativeFSLockFactory@6d0efaa8; maxCacheMB=48.0 maxMergeSizeMB=4.0),segFN=segments_3,generation=3,filenames=[segments_3]
[junit4:junit4]   2> 19168 T3290 C420 P24982 oasc.SolrDeletionPolicy.updateCommits newest commit = 3[segments_3]
[junit4:junit4]   2> 19168 T3290 C420 P24982 oasu.DefaultSolrCoreState.newIndexWriter New IndexWriter is ready to be used.
[junit4:junit4]   2> 19169 T3290 C420 P24982 oass.SolrIndexSearcher.<init> Opening Searcher@631f4e46 main
[junit4:junit4]   2> 19170 T3289 oasc.SolrCore.registerSearcher [collection1] Registered new searcher Searcher@631f4e46 main{StandardDirectoryReader(segments_3:1:nrt)}
[junit4:junit4]   2> 19171 T3290 C420 P24982 oasc.RecoveryStrategy.replay No replay needed. core=collection1
[junit4:junit4]   2> 19171 T3290 C420 P24982 oasc.RecoveryStrategy.doRecovery Replication Recovery was successful - registering as Active. core=collection1
[junit4:junit4]   2> 19171 T3290 C420 P24982 oasc.ZkController.publish publishing core=collection1 state=active
[junit4:junit4]   2> 19171 T3290 C420 P24982 oasc.ZkController.publish numShards not found on descriptor - reading it from system property
[junit4:junit4]   2> 19173 T3290 C420 P24982 oasc.RecoveryStrategy.doRecovery Finished recovery process. core=collection1
[junit4:junit4]   2> 19220 T3235 oascc.ZkStateReader.updateClusterState Updating cloud state from ZooKeeper... 
[junit4:junit4]   2> 19221 T3235 oasc.Overseer$ClusterStateUpdater.updateState Update state numShards=1 message={
[junit4:junit4]   2> 	  "operation":"state",
[junit4:junit4]   2> 	  "core_node_name":"127.0.0.1:31439__zz%2Flm_collection1",
[junit4:junit4]   2> 	  "numShards":"1",
[junit4:junit4]   2> 	  "shard":"shard1",
[junit4:junit4]   2> 	  "roles":null,
[junit4:junit4]   2> 	  "state":"recovering",
[junit4:junit4]   2> 	  "core":"collection1",
[junit4:junit4]   2> 	  "collection":"collection1",
[junit4:junit4]   2> 	  "node_name":"127.0.0.1:31439__zz%2Flm",
[junit4:junit4]   2> 	  "base_url":"http://127.0.0.1:31439/_zz/lm"}
[junit4:junit4]   2> 19225 T3235 oasc.Overseer$ClusterStateUpdater.updateState Update state numShards=1 message={
[junit4:junit4]   2> 	  "operation":"state",
[junit4:junit4]   2> 	  "core_node_name":"127.0.0.1:24982__zz%2Flm_collection1",
[junit4:junit4]   2> 	  "numShards":"1",
[junit4:junit4]   2> 	  "shard":"shard1",
[junit4:junit4]   2> 	  "roles":null,
[junit4:junit4]   2> 	  "state":"active",
[junit4:junit4]   2> 	  "core":"collection1",
[junit4:junit4]   2> 	  "collection":"collection1",
[junit4:junit4]   2> 	  "node_name":"127.0.0.1:24982__zz%2Flm",
[junit4:junit4]   2> 	  "base_url":"http://127.0.0.1:24982/_zz/lm"}
[junit4:junit4]   2> 19236 T3234 oascc.ZkStateReader$2.process A cluster state change: WatchedEvent state:SyncConnected type:NodeDataChanged path:/clusterstate.json, has occurred - updating... (live nodes size: 5)
[junit4:junit4]   2> 19236 T3270 oascc.ZkStateReader$2.process A cluster state change: WatchedEvent state:SyncConnected type:NodeDataChanged path:/clusterstate.json, has occurred - updating... (live nodes size: 5)
[junit4:junit4]   2> 19237 T3304 oascc.ZkStateReader$2.process A cluster state change: WatchedEvent state:SyncConnected type:NodeDataChanged path:/clusterstate.json, has occurred - updating... (live nodes size: 5)
[junit4:junit4]   2> 19237 T3287 oascc.ZkStateReader$2.process A cluster state change: WatchedEvent state:SyncConnected type:NodeDataChanged path:/clusterstate.json, has occurred - updating... (live nodes size: 5)
[junit4:junit4]   2> 19237 T3254 oascc.ZkStateReader$2.process A cluster state change: WatchedEvent state:SyncConnected type:NodeDataChanged path:/clusterstate.json, has occurred - updating... (live nodes size: 5)
[junit4:junit4]   2> 19237 T3241 oascc.ZkStateReader$2.process A cluster state change: WatchedEvent state:SyncConnected type:NodeDataChanged path:/clusterstate.json, has occurred - updating... (live nodes size: 5)
[junit4:junit4]   2> 19490 T3249 oass.SolrDispatchFilter.handleAdminRequest /admin/cores {coreNodeName=127.0.0.1:31439__zz%252Flm_collection1&state=recovering&nodeName=127.0.0.1:31439__zz%252Flm&action=PREPRECOVERY&checkLive=true&core=collection1&wt=javabin&onlyIfLeader=true&version=2} status=0 QTime=1001 
[junit4:junit4]   2> 19493 T3212 oascc.ZkStateReader.updateClusterState Updating cloud state from ZooKeeper... 
[junit4:junit4]   2> 20495 T3212 oascc.ZkStateReader.updateClusterState Updating cloud state from ZooKeeper... 
[junit4:junit4]   2>  C422_STATE=coll:collection1 core:collection1 props:{shard=shard1, state=recovering, core=collection1, collection=collection1, node_name=127.0.0.1:31439__zz%2Flm, base_url=http://127.0.0.1:31439/_zz/lm}
[junit4:junit4]   2> 21492 T3309 C422 P31439 oasc.RecoveryStrategy.doRecovery Attempting to PeerSync from http://127.0.0.1:20368/_zz/lm/collection1/ core=collection1 - recoveringAfterStartup=true
[junit4:junit4]   2> 21492 T3309 C422 P31439 oasu.PeerSync.sync PeerSync: core=collection1 url=http://127.0.0.1:31439/_zz/lm START replicas=[http://127.0.0.1:20368/_zz/lm/collection1/] nUpdates=100
[junit4:junit4]   2> 21493 T3309 C422 P31439 oasu.PeerSync.sync WARNING no frame of reference to tell of we've missed updates
[junit4:junit4]   2> 21493 T3309 C422 P31439 oasc.RecoveryStrategy.doRecovery PeerSync Recovery was not successful - trying replication. core=collection1
[junit4:junit4]   2> 21493 T3309 C422 P31439 oasc.RecoveryStrategy.doRecovery Starting Replication Recovery. core=collection1
[junit4:junit4]   2> 21493 T3309 C422 P31439 oasc.RecoveryStrategy.doRecovery Begin buffering updates. core=collection1
[junit4:junit4]   2> 21493 T3309 C422 P31439 oasu.UpdateLog.bufferUpdates Starting to buffer updates. FSUpdateLog{state=ACTIVE, tlog=null}
[junit4:junit4]   2> 21494 T3309 C422 P31439 oasc.RecoveryStrategy.replicate Attempting to replicate from http://127.0.0.1:20368/_zz/lm/collection1/. core=collection1
[junit4:junit4]   2> 21494 T3309 C422 P31439 oascsi.HttpClientUtil.createClient Creating new http client, config:maxConnections=128&maxConnectionsPerHost=32&followRedirects=false
[junit4:junit4]   2> 21495 T3246 C421 P20368 REQ /get {getVersions=100&distrib=false&wt=javabin&qt=/get&version=2} status=0 QTime=0 
[junit4:junit4]   2> 21497 T3212 oascc.ZkStateReader.updateClusterState Updating cloud state from ZooKeeper... 
[junit4:junit4]   2> 21512 T3244 C421 P20368 oasu.DirectUpdateHandler2.commit start commit{,optimize=false,openSearcher=false,waitSearcher=true,expungeDeletes=false,softCommit=false,prepareCommit=false}
[junit4:junit4]   2> 21516 T3244 C421 P20368 oasc.SolrDeletionPolicy.onCommit SolrDeletionPolicy.onCommit: commits:num=3
[junit4:junit4]   2> 		commit{dir=NRTCachingDirectory(org.apache.lucene.store.NIOFSDirectory@/usr/home/hudson/hudson-slave/workspace/Lucene-Solr-Tests-trunk-java7/solr/build/solr-core/test/J1/org.apache.solr.cloud.SyncSliceTest-1363565499283/jetty1/index lockFactory=org.apache.lucene.store.NativeFSLockFactory@461bb495; maxCacheMB=48.0 maxMergeSizeMB=4.0),segFN=segments_2,generation=2,filenames=[segments_2]
[junit4:junit4]   2> 		commit{dir=NRTCachingDirectory(org.apache.lucene.store.NIOFSDirectory@/usr/home/hudson/hudson-slave/workspace/Lucene-Solr-Tests-trunk-java7/solr/build/solr-core/test/J1/org.apache.solr.cloud.SyncSliceTest-1363565499283/jetty1/index lockFactory=org.apache.lucene.store.NativeFSLockFactory@461bb495; maxCacheMB=48.0 maxMergeSizeMB=4.0),segFN=segments_3,generation=3,filenames=[segments_3]
[junit4:junit4]   2> 		commit{dir=NRTCachingDirectory(org.apache.lucene.store.NIOFSDirectory@/usr/home/hudson/hudson-slave/workspace/Lucene-Solr-Tests-trunk-java7/solr/build/solr-core/test/J1/org.apache.solr.cloud.SyncSliceTest-1363565499283/jetty1/index lockFactory=org.apache.lucene.store.NativeFSLockFactory@461bb495; maxCacheMB=48.0 maxMergeSizeMB=4.0),segFN=segments_4,generation=4,filenames=[segments_4]
[junit4:junit4]   2> 21516 T3244 C421 P20368 oasc.SolrDeletionPolicy.updateCommits newest commit = 4[segments_4]
[junit4:junit4]   2> 21518 T3244 C421 P20368 oasu.DirectUpdateHandler2.commit end_commit_flush
[junit4:junit4]   2> 21518 T3244 C421 P20368 /update {waitSearcher=true&openSearcher=false&commit=true&wt=javabin&commit_end_point=true&version=2&softCommit=false} {commit=} 0 6
[junit4:junit4]   2> 21519 T3309 C422 P31439 oash.ReplicationHandler.inform Commits will be reserved for  10000
[junit4:junit4]   2> 21519 T3309 C422 P31439 oash.SnapPuller.<init>  No value set for 'pollInterval'. Timer Task not started.
[junit4:junit4]   2> 21521 T3248 C421 P20368 REQ /replication {command=indexversion&qt=/replication&wt=javabin&version=2} status=0 QTime=0 
[junit4:junit4]   2> 21522 T3309 C422 P31439 oash.SnapPuller.fetchLatestIndex Master's generation: 4
[junit4:junit4]   2> 21522 T3309 C422 P31439 oash.SnapPuller.fetchLatestIndex Slave's generation: 1
[junit4:junit4]   2> 21522 T3309 C422 P31439 oash.SnapPuller.fetchLatestIndex Starting replication process
[junit4:junit4]   2> 21525 T3248 C421 P20368 REQ /replication {command=filelist&qt=/replication&wt=javabin&generation=4&version=2} status=0 QTime=1 
[junit4:junit4]   2> 21525 T3309 C422 P31439 oash.SnapPuller.fetchLatestIndex Number of files in latest index in master: 1
[junit4:junit4]   2> 21527 T3309 C422 P31439 oasc.CachingDirectoryFactory.get return new directory for /usr/home/hudson/hudson-slave/workspace/Lucene-Solr-Tests-trunk-java7/solr/build/solr-core/test/J1/org.apache.solr.cloud.SyncSliceTest-1363565499283/jetty4/index.20130317201200803 forceNew: false
[junit4:junit4]   2> 21529 T3309 C422 P31439 oash.SnapPuller.fetchLatestIndex Starting download to NRTCachingDirectory(org.apache.lucene.store.NIOFSDirectory@/usr/home/hudson/hudson-slave/workspace/Lucene-Solr-Tests-trunk-java7/solr/build/solr-core/test/J1/org.apache.solr.cloud.SyncSliceTest-1363565499283/jetty4/index.20130317201200803 lockFactory=org.apache.lucene.store.NativeFSLockFactory@6a8e42ee; maxCacheMB=48.0 maxMergeSizeMB=4.0) fullCopy=false
[junit4:junit4]   2> 21532 T3248 C421 P20368 REQ /replication {file=segments_4&command=filecontent&checksum=true&wt=filestream&qt=/replication&generation=4} status=0 QTime=0 
[junit4:junit4]   2> 21533 T3309 C422 P31439 oash.SnapPuller.fetchLatestIndex Total time taken for download : 0 secs
[junit4:junit4]   2> 21536 T3309 C422 P31439 oasu.DefaultSolrCoreState.newIndexWriter Creating new IndexWriter...
[junit4:junit4]   2> 21536 T3309 C422 P31439 oasu.DefaultSolrCoreState.newIndexWriter Waiting until IndexWriter is unused... core=collection1
[junit4:junit4]   2> 21542 T3309 C422 P31439 oasc.SolrDeletionPolicy.onInit SolrDeletionPolicy.onInit: commits:num=2
[junit4:junit4]   2> 		commit{dir=NRTCachingDirectory(org.apache.lucene.store.NIOFSDirectory@/usr/home/hudson/hudson-slave/workspace/Lucene-Solr-Tests-trunk-java7/solr/build/solr-core/test/J1/org.apache.solr.cloud.SyncSliceTest-1363565499283/jetty4/index lockFactory=org.apache.lucene.store.NativeFSLockFactory@13755cd5; maxCacheMB=48.0 maxMergeSizeMB=4.0),segFN=segments_1,generation=1,filenames=[segments_1]
[junit4:junit4]   2> 		commit{dir=NRTCachingDirectory(org.apache.lucene.store.NIOFSDirectory@/usr/home/hudson/hudson-slave/workspace/Lucene-Solr-Tests-trunk-java7/solr/build/solr-core/test/J1/org.apache.solr.cloud.SyncSliceTest-1363565499283/jetty4/index lockFactory=org.apache.lucene.store.NativeFSLockFactory@13755cd5; maxCacheMB=48.0 maxMergeSizeMB=4.0),segFN=segments_4,generation=4,filenames=[segments_4]
[junit4:junit4]   2> 21542 T3309 C422 P31439 oasc.SolrDeletionPolicy.updateCommits newest commit = 4[segments_4]
[junit4:junit4]   2> 21543 T3309 C422 P31439 oasu.DefaultSolrCoreState.newIndexWriter New IndexWriter is ready to be used.
[junit4:junit4]   2> 21544 T3309 C422 P31439 oass.SolrIndexSearcher.<init> Opening Searcher@159f50ab main
[junit4:junit4]   2> 21545 T3308 oasc.SolrCore.registerSearcher [collection1] Registered new searcher Searcher@159f50ab main{StandardDirectoryReader(segments_4:1:nrt)}
[junit4:junit4]   2> 21546 T3309 C422 P31439 oasc.RecoveryStrategy.replay No replay needed. core=collection1
[junit4:junit4]   2> 21546 T3309 C422 P31439 oasc.RecoveryStrategy.doRecovery Replication Recovery was successful - registering as Active. core=collection1
[junit4:junit4]   2> 21546 T3309 C422 P31439 oasc.ZkController.publish publishing core=collection1 state=active
[junit4:junit4]   2> 21546 T3309 C422 P31439 oasc.ZkController.publish numShards not found on descriptor - reading it from system property
[junit4:junit4]   2> 21548 T3309 C422 P31439 oasc.RecoveryStrategy.doRecovery Finished recovery process. core=collection1
[junit4:junit4]   2> 22253 T3235 oascc.ZkStateReader.updateClusterState Updating cloud state from ZooKeeper... 
[junit4:junit4]   2> 22253 T3235 oasc.Overseer$ClusterStateUpdater.updateState Update state numShards=1 message={
[junit4:junit4]   2> 	  "operation":"state",
[junit4:junit4]   2> 	  "core_node_name":"127.0.0.1:31439__zz%2Flm_collection1",
[junit4:junit4]   2> 	  "numShards":"1",
[junit4:junit4]   2> 	  "shard":"shard1",
[junit4:junit4]   2> 	  "roles":null,
[junit4:junit4]   2> 	  "state":"active",
[junit4:junit4]   2> 	  "core":"collection1",
[junit4:junit4]   2> 	  "collection":"collection1",
[junit4:junit4]   2> 	  "node_name":"127.0.0.1:31439__zz%2Flm",
[junit4:junit4]   2> 	  "base_url":"http://127.0.0.1:31439/_zz/lm"}
[junit4:junit4]   2> 22268 T3241 oascc.ZkStateReader$2.process A cluster state change: WatchedEvent state:SyncConnected type:NodeDataChanged path:/clusterstate.json, has occurred - updating... (live nodes size: 5)
[junit4:junit4]   2> 22268 T3234 oascc.ZkStateReader$2.process A cluster state change: WatchedEvent state:SyncConnected type:NodeDataChanged path:/clusterstate.json, has occurred - updating... (live nodes size: 5)
[junit4:junit4]   2> 22268 T3270 oascc.ZkStateReader$2.process A cluster state change: WatchedEvent state:SyncConnected type:NodeDataChanged path:/clusterstate.json, has occurred - updating... (live nodes size: 5)
[junit4:junit4]   2> 22268 T3304 oascc.ZkStateReader$2.process A cluster state change: WatchedEvent state:SyncConnected type:NodeDataChanged path:/clusterstate.json, has occurred - updating... (live nodes size: 5)
[junit4:junit4]   2> 22268 T3287 oascc.ZkStateReader$2.process A cluster state change: WatchedEvent state:SyncConnected type:NodeDataChanged path:/clusterstate.json, has occurred - updating... (live nodes size: 5)
[junit4:junit4]   2> 22268 T3254 oascc.ZkStateReader$2.process A cluster state change: WatchedEvent state:SyncConnected type:NodeDataChanged path:/clusterstate.json, has occurred - updating... (live nodes size: 5)
[junit4:junit4]   2> 22499 T3212 oascc.ZkStateReader.updateClusterState Updating cloud state from ZooKeeper... 
[junit4:junit4]   2> 22501 T3212 oasc.AbstractDistribZkTestBase.waitForRecoveriesToFinish Recoveries finished - collection: collection1
[junit4:junit4]   2> ASYNC  NEW_CORE C423 name=collection1 org.apache.solr.core.SolrCore@7732e3b7 url=http://127.0.0.1:20364/_zz/lm/collection1 node=127.0.0.1:20364__zz%2Flm C423_STATE=coll:control_collection core:collection1 props:{shard=shard1, state=active, core=collection1, collection=control_collection, node_name=127.0.0.1:20364__zz%2Flm, base_url=http://127.0.0.1:20364/_zz/lm, leader=true}
[junit4:junit4]   2> 22511 T3224 C423 P20364 oasu.DirectUpdateHandler2.commit start commit{,optimize=false,openSearcher=true,waitSearcher=true,expungeDeletes=false,softCommit=false,prepareCommit=false}
[junit4:junit4]   2> 22517 T3224 C423 P20364 oasc.SolrDeletionPolicy.onInit SolrDeletionPolicy.onInit: commits:num=1
[junit4:junit4]   2> 		commit{dir=NRTCachingDirectory(org.apache.lucene.store.NIOFSDirectory@/usr/home/hudson/hudson-slave/workspace/Lucene-Solr-Tests-trunk-java7/solr/build/solr-core/test/J1/org.apache.solr.cloud.SyncSliceTest-1363565499283/control/data/index lockFactory=org.apache.lucene.store.NativeFSLockFactory@7bcdd983; maxCacheMB=48.0 maxMergeSizeMB=4.0),segFN=segments_1,generation=1,filenames=[segments_1]
[junit4:junit4]   2> 22517 T3224 C423 P20364 oasc.SolrDeletionPolicy.updateCommits newest commit = 1[segments_1]
[junit4:junit4]   2> 22522 T3224 C423 P20364 oasc.SolrDeletionPolicy.onCommit SolrDeletionPolicy.onCommit: commits:num=2
[junit4:junit4]   2> 		commit{dir=NRTCachingDirectory(org.apache.lucene.store.NIOFSDirectory@/usr/home/hudson/hudson-slave/workspace/Lucene-Solr-Tests-trunk-java7/solr/build/solr-core/test/J1/org.apache.solr.cloud.SyncSliceTest-1363565499283/control/data/index lockFactory=org.apache.lucene.store.NativeFSLockFactory@7bcdd983; maxCacheMB=48.0 maxMergeSizeMB=4.0),segFN=segments_1,generation=1,filenames=[segments_1]
[junit4:junit4]   2> 		commit{dir=NRTCachingDirectory(org.apache.lucene.store.NIOFSDirectory@/usr/home/hudson/hudson-slave/workspace/Lucene-Solr-Tests-trunk-java7/solr/build/solr-core/test/J1/org.apache.solr.cloud.SyncSliceTest-1363565499283/control/data/index lockFactory=org.apache.lucene.store.NativeFSLockFactory@7bcdd983; maxCacheMB=48.0 maxMergeSizeMB=4.0),segFN=segments_2,generation=2,filenames=[segments_2]
[junit4:junit4]   2> 22522 T3224 C423 P20364 oasc.SolrDeletionPolicy.updateCommits newest commit = 2[segments_2]
[junit4:junit4]   2> 22526 T3224 C423 P20364 oass.SolrIndexSearcher.<init> Opening Searcher@378cc793 main
[junit4:junit4]   2> 22526 T3224 C423 P20364 oasu.DirectUpdateHandler2.commit end_commit_flush
[junit4:junit4]   2> 22527 T3238 oasc.SolrCore.registerSearcher [collection1] Registered new searcher Searcher@378cc793 main{StandardDirectoryReader(segments_1:1)}
[junit4:junit4]   2> 22528 T3224 C423 P20364 /update {waitSearcher=true&commit=true&wt=javabin&version=2&softCommit=false} {commit=} 0 17
[junit4:junit4]   2> 22538 T3247 C421 P20368 oasu.DirectUpdateHandler2.commit start commit{,optimize=false,openSearcher=true,waitSearcher=true,expungeDeletes=false,softCommit=false,prepareCommit=false}
[junit4:junit4]   2> 22542 T3247 C421 P20368 oasc.SolrDeletionPolicy.onCommit SolrDeletionPolicy.onCommit: commits:num=4
[junit4:junit4]   2> 		commit{dir=NRTCachingDirectory(org.apache.lucene.store.NIOFSDirectory@/usr/home/hudson/hudson-slave/workspace/Lucene-Solr-Tests-trunk-java7/solr/build/solr-core/test/J1/org.apache.solr.cloud.SyncSliceTest-1363565499283/jetty1/index lockFactory=org.apache.lucene.store.NativeFSLockFactory@461bb495; maxCacheMB=48.0 maxMergeSizeMB=4.0),segFN=segments_2,generation=2,filenames=[segments_2]
[junit4:junit4]   2> 		commit{dir=NRTCachingDirectory(org.apache.lucene.store.NIOFSDirectory@/usr/home/hudson/hudson-slave/workspace/Lucene-Solr-Tests-trunk-java7/solr/build/solr-core/test/J1/org.apache.solr.cloud.SyncSliceTest-1363565499283/jetty1/index lockFactory=org.apache.lucene.store.NativeFSLockFactory@461bb495; maxCacheMB=48.0 maxMergeSizeMB=4.0),segFN=segments_3,generation=3,filenames=[segments_3]
[junit4:junit4]   2> 		commit{dir=NRTCachingDirectory(org.apache.lucene.store.NIOFSDirectory@/usr/home/hudson/hudson-slave/workspace/Lucene-Solr-Tests-trunk-java7/solr/build/solr-core/test/J1/org.apache.solr.cloud.SyncSliceTest-1363565499283/jetty1/index lockFactory=org.apache.lucene.store.NativeFSLockFactory@461bb495; maxCacheMB=48.0 maxMergeSizeMB=4.0),segFN=segments_4,generation=4,filenames=[segments_4]
[junit4:junit4]   2> 		commit{dir=NRTCachingDirectory(org.apache.lucene.store.NIOFSDirectory@/usr/home/hudson/hudson-slave/workspace/Lucene-Solr-Tests-trunk-java7/solr/build/solr-core/test/J1/org.apache.solr.cloud.SyncSliceTest-1363565499283/jetty1/index lockFactory=org.apache.lucene.store.NativeFSLockFactory@461bb495; maxCacheMB=48.0 maxMergeSizeMB=4.0),segFN=segments_5,generation=5,filenames=[segments_5]
[junit4:junit4]   2> 22543 T3247 C421 P20368 oasc.SolrDeletionPolicy.updateCommits newest commit = 5[segments_5]
[junit4:junit4]   2> 22544 T3247 C421 P20368 oass.SolrIndexSearcher.<init> Opening Searcher@38dcfee6 main
[junit4:junit4]   2> 22545 T3247 C421 P20368 oasu.DirectUpdateHandler2.commit end_commit_flush
[junit4:junit4]   2> 22546 T3256 oasc.SolrCore.registerSearcher [collection1] Registered new searcher Searcher@38dcfee6 main{StandardDirectoryReader(segments_2:1:nrt)}
[junit4:junit4]   2> 22547 T3247 C421 P20368 oasu.SolrCmdDistributor.distribCommit Distrib commit to:[StdNode: http://127.0.0.1:20371/_zz/lm/collection1/, StdNode: http://127.0.0.1:24982/_zz/lm/collection1/, StdNode: http://127.0.0.1:31439/_zz/lm/collection1/] params:commit_end_point=true&commit=true&softCommit=false&waitSearcher=true&expungeDeletes=false
[junit4:junit4]   2>  C420_STATE=coll:collection1 core:collection1 props:{shard=shard1, state=active, core=collection1, collection=collection1, node_name=127.0.0.1:24982__zz%2Flm, base_url=http://127.0.0.1:24982/_zz/lm}
[junit4:junit4]   2> 22559 T3277 C420 P24982 oasu.DirectUpdateHandler2.commit start commit{,optimize=false,openSearcher=true,waitSearcher=true,expungeDeletes=false,softCommit=false,prepareCommit=false}
[junit4:junit4]   2>  C419_STATE=coll:collection1 core:collection1 props:{shard=shard1, state=active, core=collection1, collection=collection1, node_name=127.0.0.1:20371__zz%2Flm, base_url=http://127.0.0.1:20371/_zz/lm}
[junit4:junit4]   2> 22568 T3260 C419 P20371 oasu.DirectUpdateHandler2.commit start commit{,optimize=false,openSearcher=true,waitSearcher=true,expungeDeletes=false,softCommit=false,prepareCommit=false}
[junit4:junit4]   2>  C422_STATE=coll:collection1 core:collection1 props:{shard=shard1, state=active, core=collection1, collection=collection1, node_name=127.0.0.1:31439__zz%2Flm, base_url=http://127.0.0.1:31439/_zz/lm}
[junit4:junit4]   2> 22568 T3294 C422 P31439 oasu.DirectUpdateHandler2.commit start commit{,optimize=false,openSearcher=true,waitSearcher=true,expungeDeletes=false,softCommit=false,prepareCommit=false}
[junit4:junit4]   2> 22573 T3277 C420 P24982 oasc.SolrDeletionPolicy.onCommit SolrDeletionPolicy.onCommit: commits:num=2
[junit4:junit4]   2> 		commit{dir=NRTCachingDirectory(org.apache.lucene.store.NIOFSDirectory@/usr/home/hudson/hudson-slave/workspace/Lucene-Solr-Tests-trunk-java7/solr/build/solr-core/test/J1/org.apache.solr.cloud.SyncSliceTest-1363565499283/jetty3/index lockFactory=org.apache.lucene.store.NativeFSLockFactory@6d0efaa8; maxCacheMB=48.0 maxMergeSizeMB=4.0),segFN=segments_3,generation=3,filenames=[segments_3]
[junit4:junit4]   2> 		commit{dir=NRTCachingDirectory(org.apache.lucene.store.NIOFSDirectory@/usr/home/hudson/hudson-slave/workspace/Lucene-Solr-Tests-trunk-java7/solr/build/solr-core/test/J1/org.apache.solr.cloud.SyncSliceTest-1363565499283/jetty3/index lockFactory=org.apache.lucene.store.NativeFSLockFactory@6d0efaa8; maxCacheMB=48.0 maxMergeSizeMB=4.0),segFN=segments_4,generation=4,filenames=[segments_4]
[junit4:junit4]   2> 22573 T3277 C420 P24982 oasc.SolrDeletionPolicy.updateCommits newest commit = 4[segments_4]
[junit4:junit4]   2> 22575 T3277 C420 P24982 oass.SolrIndexSearcher.<init> Opening Searcher@7ed5cb13 main
[junit4:junit4]   2> 22576 T3277 C420 P24982 oasu.DirectUpdateHandler2.commit end_commit_flush
[junit4:junit4]   2> 22576 T3260 C419 P20371 oasc.SolrDeletionPolicy.onCommit SolrDeletionPolicy.onCommit: commits:num=2
[junit4:junit4]   2> 		commit{dir=NRTCachingDirectory(org.apache.lucene.store.NIOFSDirectory@/usr/home/hudson/hudson-slave/workspace/Lucene-Solr-Tests-trunk-java7/solr/build/solr-core/test/J1/org.apache.solr.cloud.SyncSliceTest-1363565499283/jetty2/index lockFactory=org.apache.lucene.store.NativeFSLockFactory@34f885b1; maxCacheMB=48.0 maxMergeSizeMB=4.0),segFN=segments_2,generation=2,filenames=[segments_2]
[junit4:junit4]   2> 		commit{dir=NRTCachingDirectory(org.apache.lucene.store.NIOFSDirectory@/usr/home/hudson/hudson-slave/workspace/Lucene-Solr-Tests-trunk-java7/solr/build/solr-core/test/J1/org.apache.solr.cloud.SyncSliceTest-1363565499283/jetty2/index lockFactory=org.apache.lucene.store.NativeFSLockFactory@34f885b1; maxCacheMB=48.0 maxMergeSizeMB=4.0),segFN=segments_3,generation=3,filenames=[segments_3]
[junit4:junit4]   2> 22577 T3289 oasc.SolrCore.registerSearcher [collection1] Registered new searcher Searcher@7ed5cb13 main{StandardDirectoryReader(segments_3:1:nrt)}
[junit4:junit4]   2> 22577 T3260 C419 P20371 oasc.SolrDeletionPolicy.updateCommits newest commit = 3[segments_3]
[junit4:junit4]   2> 22578 T3277 C420 P24982 /update {waitSearcher=true&commit=true&wt=javabin&expungeDeletes=false&commit_end_point=true&version=2&softCommit=false} {commit=} 0 19
[junit4:junit4]   2> 22578 T3294 C422 P31439 oasc.SolrDeletionPolicy.onCommit SolrDeletionPolicy.onCommit: commits:num=2
[junit4:junit4]   2> 		commit{dir=NRTCachingDirectory(org.apache.lucene.store.NIOFSDirectory@/usr/home/hudson/hudson-slave/workspace/Lucene-Solr-Tests-trunk-java7/solr/build/solr-core/test/J1/org.apache.solr.cloud.SyncSliceTest-1363565499283/jetty4/index lockFactory=org.apache.lucene.store.NativeFSLockFactory@13755cd5; maxCacheMB=48.0 maxMergeSizeMB=4.0),segFN=segments_4,generation=4,filenames=[segments_4]
[junit4:junit4]   2> 		commit{dir=NRTCachingDirectory(org.apache.lucene.store.NIOFSDirectory@/usr/home/hudson/hudson-slave/workspace/Lucene-Solr-Tests-trunk-java7/solr/build/solr-core/test/J1/org.apache.solr.cloud.SyncSliceTest-1363565499283/jetty4/index lockFactory=org.apache.lucene.store.NativeFSLockFactory@13755cd5; maxCacheMB=48.0 maxMergeSizeMB=4.0),segFN=segments_5,generation=5,filenames=[segments_5]
[junit4:junit4]   2> 22579 T3294 C422 P31439 oasc.SolrDeletionPolicy.updateCommits newest commit = 5[segments_5]
[junit4:junit4]   2> 22580 T3260 C419 P20371 oass.SolrIndexSearcher.<init> Opening Searcher@6af18c36 main
[junit4:junit4]   2> 22580 T3260 C419 P20371 oasu.DirectUpdateHandler2.commit end_commit_flush
[junit4:junit4]   2> 22581 T3272 oasc.SolrCore.registerSearcher [collection1] Registered new searcher Searcher@6af18c36 main{StandardDirectoryReader(segments_2:1:nrt)}
[junit4:junit4]   2> 22581 T3294 C422 P31439 oass.SolrIndexSearcher.<init> Opening Searcher@3c5cc0af main
[junit4:junit4]   2> 22582 T3260 C419 P20371 /update {waitSearcher=true&commit=true&wt=javabin&expungeDeletes=false&commit_end_point=true&version=2&softCommit=false} {commit=} 0 14
[junit4:junit4]   2> 22582 T3294 C422 P31439 oasu.DirectUpdateHandler2.commit end_commit_flush
[junit4:junit4]   2> 22582 T3308 oasc.SolrCore.registerSearcher [collection1] Registered new searcher Searcher@3c5cc0af main{StandardDirectoryReader(segments_4:1:nrt)}
[junit4:junit4]   2> 22583 T3294 C422 P31439 /update {waitSearcher=true&commit=true&wt=javabin&expungeDeletes=false&commit_end_point=true&version=2&softCommit=false} {commit=} 0 15
[junit4:junit4]   2> 22584 T3247 C421 P20368 /update {waitSearcher=true&commit=true&wt=javabin&version=2&softCommit=false} {commit=} 0 46
[junit4:junit4]   2> 22585 T3212 oascc.ZkStateReader.updateClusterState Updating cloud state from ZooKeeper... 
[junit4:junit4]   2> 22588 T3245 C421 P20368 REQ /select {tests=checkShardConsistency&q=*:*&distrib=false&wt=javabin&version=2&rows=0} hits=0 status=0 QTime=1 
[junit4:junit4]   2> 22590 T3261 C419 P20371 REQ /select {tests=checkShardConsistency&q=*:*&distrib=false&wt=javabin&version=2&rows=0} hits=0 status=0 QTime=1 
[junit4:junit4]   2> 22592 T3278 C420 P24982 REQ /select {tests=checkShardConsistency&q=*:*&distrib=false&wt=javabin&version=2&rows=0} hits=0 status=0 QTime=1 
[junit4:junit4]   2> 22594 T3295 C422 P31439 REQ /select {tests=checkShardConsistency&q=*:*&distrib=false&wt=javabin&version=2&rows=0} hits=0 status=0 QTime=1 
[junit4:junit4]   2> 24599 T3224 C423 P20364 oass.SolrIndexSearcher.<init> Opening Searcher@30016168 realtime
[junit4:junit4]   2> 24600 T3224 C423 P20364 /update {wt=javabin&version=2} {deleteByQuery=*:* (-1429802082761703424)} 0 3
[junit4:junit4]   2> 24608 T3294 C422 P31439 /update {update.distrib=FROMLEADER&_version_=-1429802082767994880&update.from=http://127.0.0.1:20368/_zz/lm/collection1/&wt=javabin&version=2} {deleteByQuery=*:* (-1429802082767994880)} 0 2
[junit4:junit4]   2> 24608 T3277 C420 P24982 /update {update.distrib=FROMLEADER&_version_=-1429802082767994880&update.from=http://127.0.0.1:20368/_zz/lm/collection1/&wt=javabin&version=2} {deleteByQuery=*:* (-1429802082767994880)} 0 2
[junit4:junit4]   2> 24609 T3260 C419 P20371 /update {update.distrib=FROMLEADER&_version_=-1429802082767994880&update.from=http://127.0.0.1:20368/_zz/lm/collection1/&wt=javabin&version=2} {deleteByQuery=*:* (-1429802082767994880)} 0 2
[junit4:junit4]   2> 24609 T3247 C421 P20368 /update {wt=javabin&version=2} {deleteByQuery=*:* (-1429802082767994880)} 0 6
[junit4:junit4]   2> 24614 T3224 C423 P20364 /update {wt=javabin&version=2} {add=[0 (1429802082777432064)]} 0 2
[junit4:junit4]   2> 24623 T3277 C420 P24982 /update {distrib.from=http://127.0.0.1:20368/_zz/lm/collection1/&update.distrib=FROMLEADER&wt=javabin&version=2} {add=[0 (1429802082782674944)]} 0 2
[junit4:junit4]   2> 24623 T3294 C422 P31439 /update {distrib.from=http://127.0.0.1:20368/_zz/lm/collection1/&update.distrib=FROMLEADER&wt=javabin&version=2} {add=[0 (1429802082782674944)]} 0 2
[junit4:junit4]   2> 24623 T3260 C419 P20371 /update {distrib.from=http://127.0.0.1:20368/_zz/lm/collection1/&update.distrib=FROMLEADER&wt=javabin&version=2} {add=[0 (1429802082782674944)]} 0 2
[junit4:junit4]   2> 24624 T3247 C421 P20368 /update {wt=javabin&version=2} {add=[0 (1429802082782674944)]} 0 7
[junit4:junit4]   2> 24628 T3224 C423 P20364 /update {wt=javabin&version=2} {add=[1 (1429802082793160704)]} 0 1
[junit4:junit4]   2> 24634 T3277 C420 P24982 /update {distrib.from=http://127.0.0.1:20368/_zz/lm/collection1/&update.distrib=FROMLEADER&wt=javabin&version=2} {add=[1 (1429802082796306432)]} 0 1
[junit4:junit4]   2> 24634 T3260 C419 P20371 /update {distrib.from=http://127.0.0.1:20368/_zz/lm/collection1/&update.distrib=FROMLEADER&wt=javabin&version=2} {add=[1 (1429802082796306432)]} 0 1
[junit4:junit4]   2> 24634 T3294 C422 P31439 /update {distrib.from=http://127.0.0.1:20368/_zz/lm/collection1/&update.distrib=FROMLEADER&wt=javabin&version=2} {add=[1 (1429802082796306432)]} 0 1
[junit4:junit4]   2> 24635 T3247 C421 P20368 /update {wt=javabin&version=2} {add=[1 (1429802082796306432)]} 0 5
[junit4:junit4]   2> 24637 T3224 C423 P20364 /update {wt=javabin&version=2} {add=[2 (1429802082803646464)]} 0 0
[junit4:junit4]   2> 24643 T3277 C420 P24982 /update {distrib.from=http://127.0.0.1:20368/_zz/lm/collection1/&update.distrib=FROMLEADER&wt=javabin&version=2} {add=[2 (1429802082806792192)]} 0 0
[junit4:junit4]   2> 24644 T3294 C422 P31439 /update {distrib.from=http://127.0.0.1:20368/_zz/lm/collection1/&update.distrib=FROMLEADER&wt=javabin&version=2} {add=[2 (1429802082806792192)]} 0 0
[junit4:junit4]   2> 24644 T3247 C421 P20368 /update {test.distrib.skip.servers=http://127.0.0.1:20371/_zz/lm/collection1/&wt=javabin&version=2} {add=[2 (1429802082806792192)]} 0 4
[junit4:junit4]   2> 24647 T3224 C423 P20364 /update {wt=javabin&version=2} {add=[3 (1429802082814132224)]} 0 0
[junit4:junit4]   2> 24654 T3294 C422 P31439 /update {distrib.from=http://127.0.0.1:20368/_zz/lm/collection1/&update.distrib=FROMLEADER&wt=javabin&version=2} {add=[3 (1429802082817277952)]} 0 1
[junit4:junit4]   2> 24654 T3247 C421 P20368 /update {test.distrib.skip.servers=http://127.0.0.1:20371/_zz/lm/collection1/&test.distrib.skip.servers=http://127.0.0.1:24982/_zz/lm/collection1/&wt=javabin&version=2} {add=[3 (1429802082817277952)]} 0 4
[junit4:junit4]   2> 24657 T3224 C423 P20364 oasu.DirectUpdateHandler2.commit start commit{,optimize=false,openSearcher=true,waitSearcher=true,expungeDeletes=false,softCommit=false,prepareCommit=false}
[junit4:junit4]   2> 24734 T3224 C423 P20364 oasc.SolrDeletionPolicy.onCommit SolrDeletionPolicy.onCommit: commits:num=2
[junit4:junit4]   2> 		commit{dir=NRTCachingDirectory(org.apache.lucene.store.NIOFSDirectory@/usr/home/hudson/hudson-slave/workspace/Lucene-Solr-Tests-trunk-java7/solr/build/solr-core/test/J1/org.apache.solr.cloud.SyncSliceTest-1363565499283/control/data/index lockFactory=org.apache.lucene.store.NativeFSLockFactory@7bcdd983; maxCacheMB=48.0 maxMergeSizeMB=4.0),segFN=segments_2,generation=2,filenames=[segments_2]
[junit4:junit4]   2> 		commit{dir=NRTCachingDirectory(org.apache.lucene.store.NIOFSDirectory@/usr/home/hudson/hudson-slave/workspace/Lucene-Solr-Tests-trunk-java7/solr/build/solr-core/test/J1/org.apache.solr.cloud.SyncSliceTest-1363565499283/control/data/index lockFactory=org.apache.lucene.store.NativeFSLockFactory@7bcdd983; maxCacheMB=48.0 maxMergeSizeMB=4.0),segFN=segments_3,generation=3,filenames=[_0.cbnd, _0.fnm, _0.dvdm, _0.cbnm, _0.pos, _0.tim, _0.fdx, _0.si, _0.tip, _0.doc, _0.fdt, segments_3, _0.dvdd]
[junit4:junit4]   2> 24735 T3224 C423 P20364 oasc.SolrDeletionPolicy.updateCommits newest commit = 3[_0.cbnd, _0.fnm, _0.dvdm, _0.cbnm, _0.pos, _0.tim, _0.fdx, _0.si, _0.tip, _0.doc, _0.fdt, segments_3, _0.dvdd]
[junit4:junit4]   2> 24743 T3224 C423 P20364 oass.SolrIndexSearcher.<init> Opening Searcher@40a3a700 main
[junit4:junit4]   2> 24744 T3224 C423 P20364 oasu.DirectUpdateHandler2.commit end_commit_flush
[junit4:junit4]   2> 24745 T3238 oasc.SolrCore.registerSearcher [collection1] Registered new searcher Searcher@40a3a700 main{StandardDirectoryReader(segments_3:3:nrt _0(5.0):C4)}
[junit4:junit4]   2> 24745 T3224 C423 P20364 /update {waitSearcher=true&commit=true&wt=javabin&version=2&softCommit=false} {commit=} 0 88
[junit4:junit4]   2> 24748 T3247 C421 P20368 oasu.DirectUpdateHandler2.commit start commit{,optimize=false,openSearcher=true,waitSearcher=true,expungeDeletes=false,softCommit=false,prepareCommit=false}
[junit4:junit4]   2> 24808 T3247 C421 P20368 oasc.SolrDeletionPolicy.onCommit SolrDeletionPolicy.onCommit: commits:num=5
[junit4:junit4]   2> 		commit{dir=NRTCachingDirectory(org.apache.lucene.store.NIOFSDirectory@/usr/home/hudson/hudson-slave/workspace/Lucene-Solr-Tests-trunk-java7/solr/build/solr-core/test/J1/org.apache.solr.cloud.SyncSliceTest-1363565499283/jetty1/index lockFactory=org.apache.lucene.store.NativeFSLockFactory@461bb495; maxCacheMB=48.0 maxMergeSizeMB=4.0),segFN=segments_2,generation=2,filenames=[segments_2]
[junit4:junit4]   2> 		commit{dir=NRTCachingDirectory(org.apache.lucene.store.NIOFSDirectory@/usr/home/hudson/hudson-slave/workspace/Lucene-Solr-Tests-trunk-java7/solr/build/solr-core/test/J1/org.apache.solr.cloud.SyncSliceTest-1363565499283/jetty1/index lockFactory=org.apache.lucene.store.NativeFSLockFactory@461bb495; maxCacheMB=48.0 maxMergeSizeMB=4.0),segFN=segments_3,generation=3,filenames=[segments_3]
[junit4:junit4]   2> 		commit{dir=NRTCachingDirectory(org.apache.lucene.store.NIOFSDirectory@/usr/home/hudson/hudson-slave/workspace/Lucene-Solr-Tests-trunk-java7/solr/build/solr-core/test/J1/org.apache.solr.cloud.SyncSliceTest-1363565499283/jetty1/index lockFactory=org.apache.lucene.store.NativeFSLockFactory@461bb495; maxCacheMB=48.0 maxMergeSizeMB=4.0),segFN=segments_4,generation=4,filenames=[segments_4]
[junit4:junit4]   2> 		commit{dir=NRTCachingDirectory(org.apache.lucene.store.NIOFSDirectory@/usr/home/hudson/hudson-slave/workspace/Lucene-Solr-Tests-trunk-java7/solr/build/solr-core/test/J1/org.apache.solr.cloud.SyncSliceTest-1363565499283/jetty1/index lockFactory=org.apache.lucene.store.NativeFSLockFactory@461bb495; maxCacheMB=48.0 maxMergeSizeMB=4.0),segFN=segments_5,generation=5,filenames=[segments_5]
[junit4:junit4]   2> 		commit{dir=NRTCachingDirectory(org.apache.lucene.store.NIOFSDirectory@/usr/home/hudson/hudson-slave/workspace/Lucene-Solr-Tests-trunk-java7/solr/build/solr-core/test/J1/org.apache.solr.cloud.SyncSliceTest-1363565499283/jetty1/index lockFactory=org.apache.lucene.store.NativeFSLockFactory@461bb495; maxCacheMB=48.0 maxMergeSizeMB=4.0),segFN=segments_6,generation=6,filenames=[_0.cbnd, _0.fnm, _0.dvdm, _0.cbnm, _0.pos, _0.tim, _0.fdx, _0.si, segments_6, _0.tip, _0.doc, _0.fdt, _0.dvdd]
[junit4:junit4]   2> 24809 T3247 C421 P20368 oasc.SolrDeletionPolicy.updateCommits newest commit = 6[_0.cbnd, _0.fnm, _0.dvdm, _0.cbnm, _0.pos, _0.tim, _0.fdx, _0.si, segments_6, _0.tip, _0.doc, _0.fdt, _0.dvdd]
[junit4:junit4]   2> 24816 T3247 C421 P20368 oass.SolrIndexSearcher.<init> Opening Searcher@3cc47a0c main
[junit4:junit4]   2> 24816 T3247 C421 P20368 oasu.DirectUpdateHandler2.commit end_commit_flush
[junit4:junit4]   2> 24817 T3256 oasc.SolrCore.registerSearcher [collection1] Registered new searcher Searcher@3cc47a0c main{StandardDirectoryReader(segments_6:3:nrt _0(5.0):C4)}
[junit4:junit4]   2> 24818 T3247 C421 P20368 oasu.SolrCmdDistributor.distribCommit Distrib commit to:[StdNode: http://127.0.0.1:20371/_zz/lm/collection1/, StdNode: http://127.0.0.1:24982/_zz/lm/collection1/, StdNode: http://127.0.0.1:31439/_zz/lm/collection1/] params:commit_end_point=true&commit=true&softCommit=false&waitSearcher=true&expungeDeletes=false
[junit4:junit4]   2> 24821 T3277 C420 P24982 oasu.DirectUpdateHandler2.commit start commit{,optimize=false,openSearcher=true,waitSearcher=true,expungeDeletes=false,softCommit=false,prepareCommit=false}
[junit4:junit4]   2> 24821 T3294 C422 P31439 oasu.DirectUpdateHandler2.commit start commit{,optimize=false,openSearcher=true,waitSearcher=true,expungeDeletes=false,softCommit=false,prepareCommit=false}
[junit4:junit4]   2> 24821 T3260 C419 P20371 oasu.DirectUpdateHandler2.commit start commit{,optimize=false,openSearcher=true,waitSearcher=true,expungeDeletes=false,softCommit=false,prepareCommit=false}
[junit4:junit4]   2> 24941 T3294 C422 P31439 oasc.SolrDeletionPolicy.onCommit SolrDeletionPolicy.onCommit: commits:num=2
[junit4:junit4]   2> 		commit{dir=NRTCachingDirectory(org.apache.lucene.store.NIOFSDirectory@/usr/home/hudson/hudson-slave/workspace/Lucene-Solr-Tests-trunk-java7/solr/build/solr-core/test/J1/org.apache.solr.cloud.SyncSliceTest-1363565499283/jetty4/index lockFactory=org.apache.lucene.store.NativeFSLockFactory@13755cd5; maxCacheMB=48.0 maxMergeSizeMB=4.0),segFN=segments_5,generation=5,filenames=[segments_5]
[junit4:junit4]   2> 		commit{dir=NRTCachingDirectory(org.apache.lucene.store.NIOFSDirectory@/usr/home/hudson/hudson-slave/workspace/Lucene-Solr-Tests-trunk-java7/solr/build/solr-core/test/J1/org.apache.solr.cloud.SyncSliceTest-1363565499283/jetty4/index lockFactory=org.apache.lucene.store.NativeFSLockFactory@13755cd5; maxCacheMB=48.0 maxMergeSizeMB=4.0),segFN=segments_6,generation=6,filenames=[_0.cbnd, _0.fnm, _0.dvdm, _0.cbnm, _0.pos, _0.tim, _0.fdx, _0.si, segments_6, _0.tip, _0.doc, _0.fdt, _0.dvdd]
[junit4:junit4]   2> 24942 T3260 C419 P20371 oasc.SolrDeletionPolicy.onCommit SolrDeletionPolicy.onCommit: commits:num=2
[junit4:junit4]   2> 		commit{dir=NRTCachingDirectory(org.apache.lucene.store.NIOFSDirectory@/usr/home/hudson/hudson-slave/workspace/Lucene-Solr-Tests-trunk-java7/solr/build/solr-core/test/J1/org.apache.solr.cloud.SyncSliceTest-1363565499283/jetty2/index lockFactory=org.apache.lucene.store.NativeFSLockFactory@34f885b1; maxCacheMB=48.0 maxMergeSizeMB=4.0),segFN=segments_3,generation=3,filenames=[segments_3]
[junit4:junit4]   2> 		commit{dir=NRTCachingDirectory(org.apache.lucene.store.NIOFSDirectory@/usr/home/hudson/hudson-slave/workspace/Lucene-Solr-Tests-trunk-java7/solr/build/solr-core/test/J1/org.apache.solr.cloud.SyncSliceTest-1363565499283/jetty2/index lockFactory=org.apache.lucene.store.NativeFSLockFactory@34f885b1; maxCacheMB=48.0 maxMergeSizeMB=4.0),segFN=segments_4,generation=4,filenames=[_0.cbnd, _0.fnm, _0.dvdm, _0.cbnm, _0.pos, _0.tim, _0.fdx, _0.si, _0.tip, _0.doc, _0.fdt, _0.dvdd, segments_4]
[junit4:junit4]   2> 24942 T3277 C420 P24982 oasc.SolrDeletionPolicy.onCommit SolrDeletionPolicy.onCommit: commits:num=2
[junit4:junit4]   2> 		commit{dir=NRTCachingDirectory(org.apache.lucene.store.NIOFSDirectory@/usr/home/hudson/hudson-slave/workspace/Lucene-Solr-Tests-trunk-java7/solr/build/solr-core/test/J1/org.apache.solr.cloud.SyncSliceTest-1363565499283/jetty3/index lockFactory=org.apache.lucene.store.NativeFSLockFactory@6d0efaa8; maxCacheMB=48.0 maxMergeSizeMB=4.0),segFN=segments_4,generation=4,filenames=[segments_4]
[junit4:junit4]   2> 		commit{dir=NRTCachingDirectory(org.apache.lucene.store.NIOFSDirectory@/usr/home/hudson/hudson-slave/workspace/Lucene-Solr-Tests-trunk-java7/solr/build/solr-core/test/J1/org.apache.solr.cloud.SyncSliceTest-1363565499283/jetty3/index lockFactory=org.apache.lucene.store.NativeFSLockFactory@6d0efaa8; maxCacheMB=48.0 maxMergeSizeMB=4.0),segFN=segments_5,generation=5,filenames=[_0.cbnd, _0.fnm, _0.dvdm, _0.cbnm, _0.pos, _0.tim, _0.fdx, segments_5, _0.si, _0.tip, _0.doc, _0.fdt, _0.dvdd]
[junit4:junit4]   2> 24942 T3294 C422 P31439 oasc.SolrDeletionPolicy.updateCommits newest commit = 6[_0.cbnd, _0.fnm, _0.dvdm, _0.cbnm, _0.pos, _0.tim, _0.fdx, _0.si, segments_6, _0.tip, _0.doc, _0.fdt, _0.dvdd]
[junit4:junit4]   2> 24943 T3260 C419 P20371 oasc.SolrDeletionPolicy.updateCommits newest commit = 4[_0.cbnd, _0.fnm, _0.dvdm, _0.cbnm, _0.pos, _0.tim, _0.

[...truncated too long message...]

e.java:46)
[junit4:junit4]    > 	at org.apache.lucene.util.TestRuleStoreClassName$1.evaluate(TestRuleStoreClassName.java:42)
[junit4:junit4]    > 	at com.carrotsearch.randomizedtesting.rules.SystemPropertiesInvariantRule$1.evaluate(SystemPropertiesInvariantRule.java:55)
[junit4:junit4]    > 	at com.carrotsearch.randomizedtesting.rules.NoShadowingOrOverridesOnMethodsRule$1.evaluate(NoShadowingOrOverridesOnMethodsRule.java:39)
[junit4:junit4]    > 	at com.carrotsearch.randomizedtesting.rules.NoShadowingOrOverridesOnMethodsRule$1.evaluate(NoShadowingOrOverridesOnMethodsRule.java:39)
[junit4:junit4]    > 	at com.carrotsearch.randomizedtesting.rules.StatementAdapter.evaluate(StatementAdapter.java:36)
[junit4:junit4]    > 	at org.apache.lucene.util.TestRuleAssertionsRequired$1.evaluate(TestRuleAssertionsRequired.java:43)
[junit4:junit4]    > 	at org.apache.lucene.util.TestRuleMarkFailure$1.evaluate(TestRuleMarkFailure.java:48)
[junit4:junit4]    > 	at org.apache.lucene.util.TestRuleIgnoreAfterMaxFailures$1.evaluate(TestRuleIgnoreAfterMaxFailures.java:70)
[junit4:junit4]    > 	at org.apache.lucene.util.TestRuleIgnoreTestSuites$1.evaluate(TestRuleIgnoreTestSuites.java:55)
[junit4:junit4]    > 	at com.carrotsearch.randomizedtesting.rules.StatementAdapter.evaluate(StatementAdapter.java:36)
[junit4:junit4]    > 	at com.carrotsearch.randomizedtesting.ThreadLeakControl$StatementRunner.run(ThreadLeakControl.java:358)
[junit4:junit4]    > 	at java.lang.Thread.run(Thread.java:722)
[junit4:junit4]   2> 805678 T3212 oas.SolrTestCaseJ4.deleteCore ###deleteCore
[junit4:junit4]   2> 805724 T3215 oazs.SessionTrackerImpl.run SessionTrackerImpl exited loop!
[junit4:junit4]   2> 833108 T3287 oasu.PeerSync.handleResponse WARNING PeerSync: core=collection1 url=http://127.0.0.1:24982/_zz/lm  couldn't connect to http://127.0.0.1:20368/_zz/lm/collection1/, counting as success
[junit4:junit4]   2> 833109 T3287 oasu.PeerSync.sync PeerSync: core=collection1 url=http://127.0.0.1:24982/_zz/lm DONE. sync succeeded
[junit4:junit4]   2> 833109 T3287 oasc.SyncStrategy.syncReplicas We have been closed, won't attempt to sync replicas back to leader
[junit4:junit4]   2> 833109 T3287 oasc.ShardLeaderElectionContext.rejoinLeaderElection Not rejoining election because CoreContainer is shutdown
[junit4:junit4]   2> 833109 T3287 oasc.SolrCore.close [collection1]  CLOSING SolrCore org.apache.solr.core.SolrCore@1cd5ff2f
[junit4:junit4]   2> 833111 T3287 oasu.DirectUpdateHandler2.close closing DirectUpdateHandler2{commits=50,autocommits=0,soft autocommits=0,optimizes=0,rollbacks=0,expungeDeletes=0,docsPending=0,adds=0,deletesById=0,deletesByQuery=0,errors=0,cumulative_adds=5,cumulative_deletesById=0,cumulative_deletesByQuery=1,cumulative_errors=0}
[junit4:junit4]   2> 833111 T3287 oasu.SolrCoreState.decrefSolrCoreState Closing SolrCoreState
[junit4:junit4]   2> 833111 T3287 oasu.DefaultSolrCoreState.closeIndexWriter SolrCoreState ref count has reached 0 - closing IndexWriter
[junit4:junit4]   2> 833111 T3287 oasu.DefaultSolrCoreState.closeIndexWriter closing IndexWriter with IndexWriterCloser
[junit4:junit4]   2> 833112 T3287 C420 P24982 oasu.TransactionLog.forceClose SEVERE Error: Forcing close of tlog{file=./org.apache.solr.cloud.SyncSliceTest-1363565499283/jetty3/tlog/tlog.0000000000000000003 refcount=2}
[junit4:junit4]   2> 833112 T3287 C420 P24982 oasu.TransactionLog.forceClose SEVERE Error: Forcing close of tlog{file=./org.apache.solr.cloud.SyncSliceTest-1363565499283/jetty3/tlog/tlog.0000000000000000002 refcount=2}
[junit4:junit4]   2> 833113 T3287 C420 P24982 oasu.TransactionLog.forceClose SEVERE Error: Forcing close of tlog{file=./org.apache.solr.cloud.SyncSliceTest-1363565499283/jetty3/tlog/tlog.0000000000000000001 refcount=2}
[junit4:junit4]   2> 833115 T3287 oasc.SolrCore.closeSearcher [collection1] Closing main searcher on request.
[junit4:junit4]   2> 833116 T3287 oasc.CachingDirectoryFactory.close Closing directory when closing factory: /usr/home/hudson/hudson-slave/workspace/Lucene-Solr-Tests-trunk-java7/solr/build/solr-core/test/J1/org.apache.solr.cloud.SyncSliceTest-1363565499283/jetty3/index.20130317201845433
[junit4:junit4]   2> 833116 T3287 oasc.CachingDirectoryFactory.closeDirectory Closing directory: /usr/home/hudson/hudson-slave/workspace/Lucene-Solr-Tests-trunk-java7/solr/build/solr-core/test/J1/org.apache.solr.cloud.SyncSliceTest-1363565499283/jetty3/index.20130317201845433
[junit4:junit4]   2> 833117 T3287 oasc.CachingDirectoryFactory.close Closing directory when closing factory: /usr/home/hudson/hudson-slave/workspace/Lucene-Solr-Tests-trunk-java7/solr/build/solr-core/test/J1/org.apache.solr.cloud.SyncSliceTest-1363565499283/jetty3/index.20130317201158430
[junit4:junit4]   2> 833117 T3287 oasc.CachingDirectoryFactory.closeDirectory Removing directory: /usr/home/hudson/hudson-slave/workspace/Lucene-Solr-Tests-trunk-java7/solr/build/solr-core/test/J1/org.apache.solr.cloud.SyncSliceTest-1363565499283/jetty3/index.20130317201158430
[junit4:junit4]   2> 833118 T3287 oasc.CachingDirectoryFactory.closeDirectory Closing directory: /usr/home/hudson/hudson-slave/workspace/Lucene-Solr-Tests-trunk-java7/solr/build/solr-core/test/J1/org.apache.solr.cloud.SyncSliceTest-1363565499283/jetty3/index.20130317201158430
[junit4:junit4]   2> 833118 T3287 oasc.CachingDirectoryFactory.close Closing directory when closing factory: /usr/home/hudson/hudson-slave/workspace/Lucene-Solr-Tests-trunk-java7/solr/build/solr-core/test/J1/org.apache.solr.cloud.SyncSliceTest-1363565499283/jetty3
[junit4:junit4]   2> 833118 T3287 oasc.CachingDirectoryFactory.closeDirectory Closing directory: /usr/home/hudson/hudson-slave/workspace/Lucene-Solr-Tests-trunk-java7/solr/build/solr-core/test/J1/org.apache.solr.cloud.SyncSliceTest-1363565499283/jetty3
[junit4:junit4]   2> 833118 T3287 oascc.ZkStateReader$3.process WARNING ZooKeeper watch triggered, but Solr cannot talk to ZK
[junit4:junit4]   2> 833119 T3287 oascc.ZkStateReader$2.process A cluster state change: WatchedEvent state:SyncConnected type:NodeChildrenChanged path:/live_nodes, has occurred - updating... (live nodes size: 2)
[junit4:junit4]   2> 833119 T3287 oascc.ZkStateReader$2.process WARNING ZooKeeper watch triggered, but Solr cannot talk to ZK
[junit4:junit4]   2> 833119 T3287 oascc.ZkStateReader$2.process A cluster state change: WatchedEvent state:SyncConnected type:NodeDataChanged path:/clusterstate.json, has occurred - updating... (live nodes size: 2)
[junit4:junit4]   2> 833119 T3287 oascc.ZkStateReader$2.process WARNING ZooKeeper watch triggered, but Solr cannot talk to ZK
[junit4:junit4]   2> 833119 T3287 oaz.ClientCnxn$EventThread.run EventThread shut down
[junit4:junit4]   2> NOTE: test params are: codec=CheapBastard, sim=RandomSimilarityProvider(queryNorm=true,coord=yes): {}, locale=it_CH, timezone=America/St_Vincent
[junit4:junit4]   2> NOTE: FreeBSD 9.0-RELEASE amd64/Oracle Corporation 1.7.0_17 (64-bit)/cpus=16,threads=2,free=273261056,total=536870912
[junit4:junit4]   2> NOTE: All tests run in this JVM: [TimeZoneUtilsTest, TestCollationField, TestIndexingPerformance, SolrTestCaseJ4Test, XsltUpdateRequestHandlerTest, TestFiltering, TestLazyCores, TestRTGBase, TestPartialUpdateDeduplication, TestComponentsName, FullSolrCloudDistribCmdsTest, DistanceFunctionTest, SampleTest, TestDistributedSearch, DateMathParserTest, HighlighterConfigTest, TestIndexSearcher, TestNumberUtils, TestPropInject, TestCSVResponseWriter, DOMUtilTest, SpellPossibilityIteratorTest, TestRangeQuery, TestQueryTypes, SuggesterWFSTTest, TestDefaultSimilarityFactory, TestUpdate, TestSuggestSpellingConverter, TestZkChroot, TestStressReorder, TestSystemIdResolver, EchoParamsTest, SolrCoreCheckLockOnStartupTest, TestDynamicFieldCollectionResource, SpellCheckCollatorTest, TestPostingsSolrHighlighter, TestBinaryResponseWriter, TestUtils, URLClassifyProcessorTest, TestQuerySenderNoQuery, SignatureUpdateProcessorFactoryTest, TestHashPartitioner, SolrCmdDistributorTest, TestMergePolicyConfig, SolrRequestParserTest, TestOmitPositions, IndexBasedSpellCheckerTest, TestMultiCoreConfBootstrap, TestSolrJ, TestRandomFaceting, NotRequiredUniqueKeyTest, DefaultValueUpdateProcessorTest, CurrencyFieldXmlFileTest, XmlUpdateRequestHandlerTest, OpenCloseCoreStressTest, TestSolrXMLSerializer, TestArbitraryIndexDir, TestCSVLoader, TestFieldResource, OpenExchangeRatesOrgProviderTest, TestBM25SimilarityFactory, TermVectorComponentDistributedTest, UpdateParamsTest, TestElisionMultitermQuery, BasicDistributedZkTest, ChaosMonkeySafeLeaderTest, UnloadDistributedZkTest, CollectionsAPIDistributedZkTest, SyncSliceTest]
[junit4:junit4] Completed on J1 in 833.74s, 1 test, 1 failure <<< FAILURES!

[...truncated 10 lines...]
BUILD FAILED
/usr/home/hudson/hudson-slave/workspace/Lucene-Solr-Tests-trunk-java7/build.xml:381: The following error occurred while executing this line:
/usr/home/hudson/hudson-slave/workspace/Lucene-Solr-Tests-trunk-java7/build.xml:361: The following error occurred while executing this line:
/usr/home/hudson/hudson-slave/workspace/Lucene-Solr-Tests-trunk-java7/build.xml:39: The following error occurred while executing this line:
/usr/home/hudson/hudson-slave/workspace/Lucene-Solr-Tests-trunk-java7/solr/build.xml:183: The following error occurred while executing this line:
/usr/home/hudson/hudson-slave/workspace/Lucene-Solr-Tests-trunk-java7/solr/common-build.xml:449: The following error occurred while executing this line:
/usr/home/hudson/hudson-slave/workspace/Lucene-Solr-Tests-trunk-java7/lucene/common-build.xml:1213: The following error occurred while executing this line:
/usr/home/hudson/hudson-slave/workspace/Lucene-Solr-Tests-trunk-java7/lucene/common-build.xml:877: There were test failures: 272 suites, 1144 tests, 1 failure, 27 ignored (8 assumptions)

Total time: 68 minutes 2 seconds
Build step 'Invoke Ant' marked build as failure
Archiving artifacts
Recording test results
Email was triggered for: Failure
Sending email for trigger: Failure



Mime
View raw message