lucene-dev mailing list archives

Site index · List index
Message view « Date » · « Thread »
Top « Date » · « Thread »
From Apache Jenkins Server <jenk...@builds.apache.org>
Subject [JENKINS] Lucene-Solr-NightlyTests-trunk - Build # 214 - Still Failing
Date Fri, 22 Mar 2013 15:53:10 GMT
Build: https://builds.apache.org/job/Lucene-Solr-NightlyTests-trunk/214/

1 tests failed.
FAILED:  org.apache.solr.core.OpenCloseCoreStressTest.test10MinutesNew

Error Message:
Core 00012_core bad! expected:<262> but was:<261>

Stack Trace:
java.lang.AssertionError: Core 00012_core bad! expected:<262> but was:<261>
	at __randomizedtesting.SeedInfo.seed([59F7143B2A5369F:3FBAC962C06BDC2B]:0)
	at org.junit.Assert.fail(Assert.java:93)
	at org.junit.Assert.failNotEquals(Assert.java:647)
	at org.junit.Assert.assertEquals(Assert.java:128)
	at org.junit.Assert.assertEquals(Assert.java:472)
	at org.apache.solr.core.OpenCloseCoreStressTest.checkResults(OpenCloseCoreStressTest.java:303)
	at org.apache.solr.core.OpenCloseCoreStressTest.doStress(OpenCloseCoreStressTest.java:201)
	at org.apache.solr.core.OpenCloseCoreStressTest.test10MinutesNew(OpenCloseCoreStressTest.java:133)
	at sun.reflect.NativeMethodAccessorImpl.invoke0(Native Method)
	at sun.reflect.NativeMethodAccessorImpl.invoke(NativeMethodAccessorImpl.java:57)
	at sun.reflect.DelegatingMethodAccessorImpl.invoke(DelegatingMethodAccessorImpl.java:43)
	at java.lang.reflect.Method.invoke(Method.java:601)
	at com.carrotsearch.randomizedtesting.RandomizedRunner.invoke(RandomizedRunner.java:1559)
	at com.carrotsearch.randomizedtesting.RandomizedRunner.access$600(RandomizedRunner.java:79)
	at com.carrotsearch.randomizedtesting.RandomizedRunner$6.evaluate(RandomizedRunner.java:737)
	at com.carrotsearch.randomizedtesting.RandomizedRunner$7.evaluate(RandomizedRunner.java:773)
	at com.carrotsearch.randomizedtesting.RandomizedRunner$8.evaluate(RandomizedRunner.java:787)
	at com.carrotsearch.randomizedtesting.rules.SystemPropertiesRestoreRule$1.evaluate(SystemPropertiesRestoreRule.java:53)
	at org.apache.lucene.util.TestRuleSetupTeardownChained$1.evaluate(TestRuleSetupTeardownChained.java:50)
	at org.apache.lucene.util.TestRuleFieldCacheSanity$1.evaluate(TestRuleFieldCacheSanity.java:51)
	at org.apache.lucene.util.AbstractBeforeAfterRule$1.evaluate(AbstractBeforeAfterRule.java:46)
	at com.carrotsearch.randomizedtesting.rules.SystemPropertiesInvariantRule$1.evaluate(SystemPropertiesInvariantRule.java:55)
	at org.apache.lucene.util.TestRuleThreadAndTestName$1.evaluate(TestRuleThreadAndTestName.java:49)
	at org.apache.lucene.util.TestRuleIgnoreAfterMaxFailures$1.evaluate(TestRuleIgnoreAfterMaxFailures.java:70)
	at org.apache.lucene.util.TestRuleMarkFailure$1.evaluate(TestRuleMarkFailure.java:48)
	at com.carrotsearch.randomizedtesting.rules.StatementAdapter.evaluate(StatementAdapter.java:36)
	at com.carrotsearch.randomizedtesting.ThreadLeakControl$StatementRunner.run(ThreadLeakControl.java:358)
	at com.carrotsearch.randomizedtesting.ThreadLeakControl.forkTimeoutingTask(ThreadLeakControl.java:782)
	at com.carrotsearch.randomizedtesting.ThreadLeakControl$3.evaluate(ThreadLeakControl.java:442)
	at com.carrotsearch.randomizedtesting.RandomizedRunner.runSingleTest(RandomizedRunner.java:746)
	at com.carrotsearch.randomizedtesting.RandomizedRunner$3.evaluate(RandomizedRunner.java:648)
	at com.carrotsearch.randomizedtesting.RandomizedRunner$4.evaluate(RandomizedRunner.java:682)
	at com.carrotsearch.randomizedtesting.RandomizedRunner$5.evaluate(RandomizedRunner.java:693)
	at com.carrotsearch.randomizedtesting.rules.StatementAdapter.evaluate(StatementAdapter.java:36)
	at com.carrotsearch.randomizedtesting.rules.SystemPropertiesRestoreRule$1.evaluate(SystemPropertiesRestoreRule.java:53)
	at org.apache.lucene.util.AbstractBeforeAfterRule$1.evaluate(AbstractBeforeAfterRule.java:46)
	at org.apache.lucene.util.TestRuleStoreClassName$1.evaluate(TestRuleStoreClassName.java:42)
	at com.carrotsearch.randomizedtesting.rules.SystemPropertiesInvariantRule$1.evaluate(SystemPropertiesInvariantRule.java:55)
	at com.carrotsearch.randomizedtesting.rules.NoShadowingOrOverridesOnMethodsRule$1.evaluate(NoShadowingOrOverridesOnMethodsRule.java:39)
	at com.carrotsearch.randomizedtesting.rules.NoShadowingOrOverridesOnMethodsRule$1.evaluate(NoShadowingOrOverridesOnMethodsRule.java:39)
	at com.carrotsearch.randomizedtesting.rules.StatementAdapter.evaluate(StatementAdapter.java:36)
	at org.apache.lucene.util.TestRuleAssertionsRequired$1.evaluate(TestRuleAssertionsRequired.java:43)
	at org.apache.lucene.util.TestRuleMarkFailure$1.evaluate(TestRuleMarkFailure.java:48)
	at org.apache.lucene.util.TestRuleIgnoreAfterMaxFailures$1.evaluate(TestRuleIgnoreAfterMaxFailures.java:70)
	at org.apache.lucene.util.TestRuleIgnoreTestSuites$1.evaluate(TestRuleIgnoreTestSuites.java:55)
	at com.carrotsearch.randomizedtesting.rules.StatementAdapter.evaluate(StatementAdapter.java:36)
	at com.carrotsearch.randomizedtesting.ThreadLeakControl$StatementRunner.run(ThreadLeakControl.java:358)
	at java.lang.Thread.run(Thread.java:722)




Build Log:
[...truncated 9317 lines...]
[junit4:junit4] Suite: org.apache.solr.core.OpenCloseCoreStressTest
[junit4:junit4]   2> 6 T2951 oas.SolrTestCaseJ4.setUp ###Starting test30SecondsNew
[junit4:junit4]   2> 98 T2951 oejs.Server.doStart jetty-8.1.8.v20121106
[junit4:junit4]   2> 102 T2951 oejs.AbstractConnector.doStart Started SocketConnector@127.0.0.1:27795
[junit4:junit4]   2> 103 T2951 oass.SolrDispatchFilter.init SolrDispatchFilter.init()
[junit4:junit4]   2> 103 T2951 oasc.SolrResourceLoader.locateSolrHome JNDI not configured for solr (NoInitialContextEx)
[junit4:junit4]   2> 104 T2951 oasc.SolrResourceLoader.locateSolrHome using system property solr.solr.home: /usr/home/hudson/hudson-slave/workspace/Lucene-Solr-NightlyTests-trunk/solr/build/solr-core/test/J1/./OpenCloseCoreStressTest_
[junit4:junit4]   2> 104 T2951 oasc.CoreContainer$Initializer.initialize looking for solr config file: /usr/home/hudson/hudson-slave/workspace/Lucene-Solr-NightlyTests-trunk/solr/build/solr-core/test/J1/./OpenCloseCoreStressTest_/solr.xml
[junit4:junit4]   2> 104 T2951 oasc.CoreContainer.<init> New CoreContainer 175104781
[junit4:junit4]   2> 105 T2951 oasc.CoreContainer.load Loading CoreContainer using Solr Home: '/usr/home/hudson/hudson-slave/workspace/Lucene-Solr-NightlyTests-trunk/solr/build/solr-core/test/J1/./OpenCloseCoreStressTest_/'
[junit4:junit4]   2> 106 T2951 oasc.SolrResourceLoader.<init> new SolrResourceLoader for directory: '/usr/home/hudson/hudson-slave/workspace/Lucene-Solr-NightlyTests-trunk/solr/build/solr-core/test/J1/./OpenCloseCoreStressTest_/'
[junit4:junit4]   2> 135 T2951 oasc.SolrProperties.walkFromHere Looking for cores in /usr/home/hudson/hudson-slave/workspace/Lucene-Solr-NightlyTests-trunk/solr/build/solr-core/test/J1/./OpenCloseCoreStressTest_
[junit4:junit4]   2> 136 T2951 oasc.SolrProperties.walkFromHere Discovered properties file /usr/home/hudson/hudson-slave/workspace/Lucene-Solr-NightlyTests-trunk/solr/build/solr-core/test/J1/./OpenCloseCoreStressTest_/00013_core/core.properties, adding to cores
[junit4:junit4]   2> 136 T2951 oasc.SolrProperties.walkFromHere Discovered properties file /usr/home/hudson/hudson-slave/workspace/Lucene-Solr-NightlyTests-trunk/solr/build/solr-core/test/J1/./OpenCloseCoreStressTest_/00017_core/core.properties, adding to cores
[junit4:junit4]   2> 137 T2951 oasc.SolrProperties.walkFromHere Discovered properties file /usr/home/hudson/hudson-slave/workspace/Lucene-Solr-NightlyTests-trunk/solr/build/solr-core/test/J1/./OpenCloseCoreStressTest_/00003_core/core.properties, adding to cores
[junit4:junit4]   2> 138 T2951 oasc.SolrProperties.walkFromHere Discovered properties file /usr/home/hudson/hudson-slave/workspace/Lucene-Solr-NightlyTests-trunk/solr/build/solr-core/test/J1/./OpenCloseCoreStressTest_/00007_core/core.properties, adding to cores
[junit4:junit4]   2> 138 T2951 oasc.SolrProperties.walkFromHere Discovered properties file /usr/home/hudson/hudson-slave/workspace/Lucene-Solr-NightlyTests-trunk/solr/build/solr-core/test/J1/./OpenCloseCoreStressTest_/00002_core/core.properties, adding to cores
[junit4:junit4]   2> 139 T2951 oasc.SolrProperties.walkFromHere Discovered properties file /usr/home/hudson/hudson-slave/workspace/Lucene-Solr-NightlyTests-trunk/solr/build/solr-core/test/J1/./OpenCloseCoreStressTest_/00006_core/core.properties, adding to cores
[junit4:junit4]   2> 140 T2951 oasc.SolrProperties.walkFromHere Discovered properties file /usr/home/hudson/hudson-slave/workspace/Lucene-Solr-NightlyTests-trunk/solr/build/solr-core/test/J1/./OpenCloseCoreStressTest_/00012_core/core.properties, adding to cores
[junit4:junit4]   2> 140 T2951 oasc.SolrProperties.walkFromHere Discovered properties file /usr/home/hudson/hudson-slave/workspace/Lucene-Solr-NightlyTests-trunk/solr/build/solr-core/test/J1/./OpenCloseCoreStressTest_/00016_core/core.properties, adding to cores
[junit4:junit4]   2> 141 T2951 oasc.SolrProperties.walkFromHere Discovered properties file /usr/home/hudson/hudson-slave/workspace/Lucene-Solr-NightlyTests-trunk/solr/build/solr-core/test/J1/./OpenCloseCoreStressTest_/00018_core/core.properties, adding to cores
[junit4:junit4]   2> 142 T2951 oasc.SolrProperties.walkFromHere Discovered properties file /usr/home/hudson/hudson-slave/workspace/Lucene-Solr-NightlyTests-trunk/solr/build/solr-core/test/J1/./OpenCloseCoreStressTest_/00000_core/core.properties, adding to cores
[junit4:junit4]   2> 142 T2951 oasc.SolrProperties.walkFromHere Discovered properties file /usr/home/hudson/hudson-slave/workspace/Lucene-Solr-NightlyTests-trunk/solr/build/solr-core/test/J1/./OpenCloseCoreStressTest_/00004_core/core.properties, adding to cores
[junit4:junit4]   2> 143 T2951 oasc.SolrProperties.walkFromHere Discovered properties file /usr/home/hudson/hudson-slave/workspace/Lucene-Solr-NightlyTests-trunk/solr/build/solr-core/test/J1/./OpenCloseCoreStressTest_/00008_core/core.properties, adding to cores
[junit4:junit4]   2> 144 T2951 oasc.SolrProperties.walkFromHere Discovered properties file /usr/home/hudson/hudson-slave/workspace/Lucene-Solr-NightlyTests-trunk/solr/build/solr-core/test/J1/./OpenCloseCoreStressTest_/00010_core/core.properties, adding to cores
[junit4:junit4]   2> 145 T2951 oasc.SolrProperties.walkFromHere Discovered properties file /usr/home/hudson/hudson-slave/workspace/Lucene-Solr-NightlyTests-trunk/solr/build/solr-core/test/J1/./OpenCloseCoreStressTest_/00014_core/core.properties, adding to cores
[junit4:junit4]   2> 146 T2951 oasc.SolrProperties.walkFromHere Discovered properties file /usr/home/hudson/hudson-slave/workspace/Lucene-Solr-NightlyTests-trunk/solr/build/solr-core/test/J1/./OpenCloseCoreStressTest_/00009_core/core.properties, adding to cores
[junit4:junit4]   2> 146 T2951 oasc.SolrProperties.walkFromHere Discovered properties file /usr/home/hudson/hudson-slave/workspace/Lucene-Solr-NightlyTests-trunk/solr/build/solr-core/test/J1/./OpenCloseCoreStressTest_/00011_core/core.properties, adding to cores
[junit4:junit4]   2> 147 T2951 oasc.SolrProperties.walkFromHere Discovered properties file /usr/home/hudson/hudson-slave/workspace/Lucene-Solr-NightlyTests-trunk/solr/build/solr-core/test/J1/./OpenCloseCoreStressTest_/00015_core/core.properties, adding to cores
[junit4:junit4]   2> 148 T2951 oasc.SolrProperties.walkFromHere Discovered properties file /usr/home/hudson/hudson-slave/workspace/Lucene-Solr-NightlyTests-trunk/solr/build/solr-core/test/J1/./OpenCloseCoreStressTest_/00019_core/core.properties, adding to cores
[junit4:junit4]   2> 148 T2951 oasc.SolrProperties.walkFromHere Discovered properties file /usr/home/hudson/hudson-slave/workspace/Lucene-Solr-NightlyTests-trunk/solr/build/solr-core/test/J1/./OpenCloseCoreStressTest_/00001_core/core.properties, adding to cores
[junit4:junit4]   2> 149 T2951 oasc.SolrProperties.walkFromHere Discovered properties file /usr/home/hudson/hudson-slave/workspace/Lucene-Solr-NightlyTests-trunk/solr/build/solr-core/test/J1/./OpenCloseCoreStressTest_/00005_core/core.properties, adding to cores
[junit4:junit4]   2> 150 T2951 oasc.SolrProperties.walkFromHere Looking for cores in /usr/home/hudson/hudson-slave/workspace/Lucene-Solr-NightlyTests-trunk/solr/build/solr-core/test/J1/./OpenCloseCoreStressTest_
[junit4:junit4]   2> 150 T2951 oasc.SolrProperties.walkFromHere Discovered properties file /usr/home/hudson/hudson-slave/workspace/Lucene-Solr-NightlyTests-trunk/solr/build/solr-core/test/J1/./OpenCloseCoreStressTest_/00013_core/core.properties, adding to cores
[junit4:junit4]   2> 151 T2951 oasc.SolrProperties.walkFromHere Discovered properties file /usr/home/hudson/hudson-slave/workspace/Lucene-Solr-NightlyTests-trunk/solr/build/solr-core/test/J1/./OpenCloseCoreStressTest_/00017_core/core.properties, adding to cores
[junit4:junit4]   2> 152 T2951 oasc.SolrProperties.walkFromHere Discovered properties file /usr/home/hudson/hudson-slave/workspace/Lucene-Solr-NightlyTests-trunk/solr/build/solr-core/test/J1/./OpenCloseCoreStressTest_/00003_core/core.properties, adding to cores
[junit4:junit4]   2> 152 T2951 oasc.SolrProperties.walkFromHere Discovered properties file /usr/home/hudson/hudson-slave/workspace/Lucene-Solr-NightlyTests-trunk/solr/build/solr-core/test/J1/./OpenCloseCoreStressTest_/00007_core/core.properties, adding to cores
[junit4:junit4]   2> 153 T2951 oasc.SolrProperties.walkFromHere Discovered properties file /usr/home/hudson/hudson-slave/workspace/Lucene-Solr-NightlyTests-trunk/solr/build/solr-core/test/J1/./OpenCloseCoreStressTest_/00002_core/core.properties, adding to cores
[junit4:junit4]   2> 154 T2951 oasc.SolrProperties.walkFromHere Discovered properties file /usr/home/hudson/hudson-slave/workspace/Lucene-Solr-NightlyTests-trunk/solr/build/solr-core/test/J1/./OpenCloseCoreStressTest_/00006_core/core.properties, adding to cores
[junit4:junit4]   2> 154 T2951 oasc.SolrProperties.walkFromHere Discovered properties file /usr/home/hudson/hudson-slave/workspace/Lucene-Solr-NightlyTests-trunk/solr/build/solr-core/test/J1/./OpenCloseCoreStressTest_/00012_core/core.properties, adding to cores
[junit4:junit4]   2> 155 T2951 oasc.SolrProperties.walkFromHere Discovered properties file /usr/home/hudson/hudson-slave/workspace/Lucene-Solr-NightlyTests-trunk/solr/build/solr-core/test/J1/./OpenCloseCoreStressTest_/00016_core/core.properties, adding to cores
[junit4:junit4]   2> 156 T2951 oasc.SolrProperties.walkFromHere Discovered properties file /usr/home/hudson/hudson-slave/workspace/Lucene-Solr-NightlyTests-trunk/solr/build/solr-core/test/J1/./OpenCloseCoreStressTest_/00018_core/core.properties, adding to cores
[junit4:junit4]   2> 156 T2951 oasc.SolrProperties.walkFromHere Discovered properties file /usr/home/hudson/hudson-slave/workspace/Lucene-Solr-NightlyTests-trunk/solr/build/solr-core/test/J1/./OpenCloseCoreStressTest_/00000_core/core.properties, adding to cores
[junit4:junit4]   2> 157 T2951 oasc.SolrProperties.walkFromHere Discovered properties file /usr/home/hudson/hudson-slave/workspace/Lucene-Solr-NightlyTests-trunk/solr/build/solr-core/test/J1/./OpenCloseCoreStressTest_/00004_core/core.properties, adding to cores
[junit4:junit4]   2> 158 T2951 oasc.SolrProperties.walkFromHere Discovered properties file /usr/home/hudson/hudson-slave/workspace/Lucene-Solr-NightlyTests-trunk/solr/build/solr-core/test/J1/./OpenCloseCoreStressTest_/00008_core/core.properties, adding to cores
[junit4:junit4]   2> 158 T2951 oasc.SolrProperties.walkFromHere Discovered properties file /usr/home/hudson/hudson-slave/workspace/Lucene-Solr-NightlyTests-trunk/solr/build/solr-core/test/J1/./OpenCloseCoreStressTest_/00010_core/core.properties, adding to cores
[junit4:junit4]   2> 159 T2951 oasc.SolrProperties.walkFromHere Discovered properties file /usr/home/hudson/hudson-slave/workspace/Lucene-Solr-NightlyTests-trunk/solr/build/solr-core/test/J1/./OpenCloseCoreStressTest_/00014_core/core.properties, adding to cores
[junit4:junit4]   2> 160 T2951 oasc.SolrProperties.walkFromHere Discovered properties file /usr/home/hudson/hudson-slave/workspace/Lucene-Solr-NightlyTests-trunk/solr/build/solr-core/test/J1/./OpenCloseCoreStressTest_/00009_core/core.properties, adding to cores
[junit4:junit4]   2> 161 T2951 oasc.SolrProperties.walkFromHere Discovered properties file /usr/home/hudson/hudson-slave/workspace/Lucene-Solr-NightlyTests-trunk/solr/build/solr-core/test/J1/./OpenCloseCoreStressTest_/00011_core/core.properties, adding to cores
[junit4:junit4]   2> 161 T2951 oasc.SolrProperties.walkFromHere Discovered properties file /usr/home/hudson/hudson-slave/workspace/Lucene-Solr-NightlyTests-trunk/solr/build/solr-core/test/J1/./OpenCloseCoreStressTest_/00015_core/core.properties, adding to cores
[junit4:junit4]   2> 162 T2951 oasc.SolrProperties.walkFromHere Discovered properties file /usr/home/hudson/hudson-slave/workspace/Lucene-Solr-NightlyTests-trunk/solr/build/solr-core/test/J1/./OpenCloseCoreStressTest_/00019_core/core.properties, adding to cores
[junit4:junit4]   2> 163 T2951 oasc.SolrProperties.walkFromHere Discovered properties file /usr/home/hudson/hudson-slave/workspace/Lucene-Solr-NightlyTests-trunk/solr/build/solr-core/test/J1/./OpenCloseCoreStressTest_/00001_core/core.properties, adding to cores
[junit4:junit4]   2> 163 T2951 oasc.SolrProperties.walkFromHere Discovered properties file /usr/home/hudson/hudson-slave/workspace/Lucene-Solr-NightlyTests-trunk/solr/build/solr-core/test/J1/./OpenCloseCoreStressTest_/00005_core/core.properties, adding to cores
[junit4:junit4]   2> 164 T2951 oashc.HttpShardHandlerFactory.getParameter Setting socketTimeout to: 0
[junit4:junit4]   2> 164 T2951 oashc.HttpShardHandlerFactory.getParameter Setting urlScheme to: http://
[junit4:junit4]   2> 165 T2951 oashc.HttpShardHandlerFactory.getParameter Setting connTimeout to: 0
[junit4:junit4]   2> 165 T2951 oashc.HttpShardHandlerFactory.getParameter Setting maxConnectionsPerHost to: 20
[junit4:junit4]   2> 166 T2951 oashc.HttpShardHandlerFactory.getParameter Setting corePoolSize to: 0
[junit4:junit4]   2> 166 T2951 oashc.HttpShardHandlerFactory.getParameter Setting maximumPoolSize to: 2147483647
[junit4:junit4]   2> 166 T2951 oashc.HttpShardHandlerFactory.getParameter Setting maxThreadIdleTime to: 5
[junit4:junit4]   2> 167 T2951 oashc.HttpShardHandlerFactory.getParameter Setting sizeOfQueue to: -1
[junit4:junit4]   2> 167 T2951 oashc.HttpShardHandlerFactory.getParameter Setting fairnessPolicy to: false
[junit4:junit4]   2> 168 T2951 oascsi.HttpClientUtil.createClient Creating new http client, config:maxConnectionsPerHost=20&maxConnections=10000&socketTimeout=0&connTimeout=0&retry=false
[junit4:junit4]   2> 184 T2951 oasc.CoreMaps.allocateLazyCores Allocating transient cache for 10 transient cores
[junit4:junit4]   2> 185 T2951 oasc.CoreContainer.load Registering Log Listener
[junit4:junit4]   2> 186 T2951 oass.SolrDispatchFilter.init user.dir=/usr/home/hudson/hudson-slave/workspace/Lucene-Solr-NightlyTests-trunk/solr/build/solr-core/test/J1
[junit4:junit4]   2> 187 T2951 oass.SolrDispatchFilter.init SolrDispatchFilter.init() done
[junit4:junit4]   2> 187 T2951 oascsi.HttpClientUtil.createClient Creating new http client, config:maxConnections=128&maxConnectionsPerHost=32&followRedirects=false
[junit4:junit4]   2> 199 T2951 oascsi.HttpClientUtil.createClient Creating new http client, config:maxConnections=128&maxConnectionsPerHost=32&followRedirects=false
[junit4:junit4]   2> 211 T2951 oascsi.HttpClientUtil.createClient Creating new http client, config:maxConnections=128&maxConnectionsPerHost=32&followRedirects=false
[junit4:junit4]   2> 223 T2951 oascsi.HttpClientUtil.createClient Creating new http client, config:maxConnections=128&maxConnectionsPerHost=32&followRedirects=false
[junit4:junit4]   2> 235 T2951 oascsi.HttpClientUtil.createClient Creating new http client, config:maxConnections=128&maxConnectionsPerHost=32&followRedirects=false
[junit4:junit4]   2> 247 T2951 oascsi.HttpClientUtil.createClient Creating new http client, config:maxConnections=128&maxConnectionsPerHost=32&followRedirects=false
[junit4:junit4]   2> 259 T2951 oascsi.HttpClientUtil.createClient Creating new http client, config:maxConnections=128&maxConnectionsPerHost=32&followRedirects=false
[junit4:junit4]   2> 271 T2951 oascsi.HttpClientUtil.createClient Creating new http client, config:maxConnections=128&maxConnectionsPerHost=32&followRedirects=false
[junit4:junit4]   2> 284 T2951 oascsi.HttpClientUtil.createClient Creating new http client, config:maxConnections=128&maxConnectionsPerHost=32&followRedirects=false
[junit4:junit4]   2> 296 T2951 oascsi.HttpClientUtil.createClient Creating new http client, config:maxConnections=128&maxConnectionsPerHost=32&followRedirects=false
[junit4:junit4]   2> 308 T2951 oascsi.HttpClientUtil.createClient Creating new http client, config:maxConnections=128&maxConnectionsPerHost=32&followRedirects=false
[junit4:junit4]   2> 320 T2951 oascsi.HttpClientUtil.createClient Creating new http client, config:maxConnections=128&maxConnectionsPerHost=32&followRedirects=false
[junit4:junit4]   2> 332 T2951 oascsi.HttpClientUtil.createClient Creating new http client, config:maxConnections=128&maxConnectionsPerHost=32&followRedirects=false
[junit4:junit4]   2> 344 T2951 oascsi.HttpClientUtil.createClient Creating new http client, config:maxConnections=128&maxConnectionsPerHost=32&followRedirects=false
[junit4:junit4]   2> 356 T2951 oascsi.HttpClientUtil.createClient Creating new http client, config:maxConnections=128&maxConnectionsPerHost=32&followRedirects=false
[junit4:junit4]   2> 369 T2951 oascsi.HttpClientUtil.createClient Creating new http client, config:maxConnections=128&maxConnectionsPerHost=32&followRedirects=false
[junit4:junit4]   2> 381 T2951 oascsi.HttpClientUtil.createClient Creating new http client, config:maxConnections=128&maxConnectionsPerHost=32&followRedirects=false
[junit4:junit4]   2> 393 T2951 oascsi.HttpClientUtil.createClient Creating new http client, config:maxConnections=128&maxConnectionsPerHost=32&followRedirects=false
[junit4:junit4]   2> 404 T2951 oascsi.HttpClientUtil.createClient Creating new http client, config:maxConnections=128&maxConnectionsPerHost=32&followRedirects=false
[junit4:junit4]   2> 414 T2951 oascsi.HttpClientUtil.createClient Creating new http client, config:maxConnections=128&maxConnectionsPerHost=32&followRedirects=false
[junit4:junit4]   2> 424 T2951 oascsi.HttpClientUtil.createClient Creating new http client, config:maxConnections=128&maxConnectionsPerHost=32&followRedirects=false
[junit4:junit4]   2> 433 T2951 oascsi.HttpClientUtil.createClient Creating new http client, config:maxConnections=128&maxConnectionsPerHost=32&followRedirects=false
[junit4:junit4]   2> 443 T2951 oascsi.HttpClientUtil.createClient Creating new http client, config:maxConnections=128&maxConnectionsPerHost=32&followRedirects=false
[junit4:junit4]   2> 454 T2951 oascsi.HttpClientUtil.createClient Creating new http client, config:maxConnections=128&maxConnectionsPerHost=32&followRedirects=false
[junit4:junit4]   2> 463 T2951 oascsi.HttpClientUtil.createClient Creating new http client, config:maxConnections=128&maxConnectionsPerHost=32&followRedirects=false
[junit4:junit4]   2> 473 T2951 oascsi.HttpClientUtil.createClient Creating new http client, config:maxConnections=128&maxConnectionsPerHost=32&followRedirects=false
[junit4:junit4]   2> 484 T2951 oascsi.HttpClientUtil.createClient Creating new http client, config:maxConnections=128&maxConnectionsPerHost=32&followRedirects=false
[junit4:junit4]   2> 494 T2951 oascsi.HttpClientUtil.createClient Creating new http client, config:maxConnections=128&maxConnectionsPerHost=32&followRedirects=false
[junit4:junit4]   2> 503 T2951 oascsi.HttpClientUtil.createClient Creating new http client, config:maxConnections=128&maxConnectionsPerHost=32&followRedirects=false
[junit4:junit4]   2> 513 T2951 oascsi.HttpClientUtil.createClient Creating new http client, config:maxConnections=128&maxConnectionsPerHost=32&followRedirects=false
[junit4:junit4]   2> 523 T2951 oasc.OpenCloseCoreStressTest.doStress Starting indexing and querying
[junit4:junit4]   2> 523 T2951 oasc.OpenCloseCoreStressTest.doStress 
[junit4:junit4]   2> 	
[junit4:junit4]   2> 	
[junit4:junit4]   2> 	
[junit4:junit4]   2> 	
[junit4:junit4]   2> 	Starting a 30 second cycle, seconds left: 30. Seconds run so far: 0.
[junit4:junit4]   2> 526 T2962 oasc.OneIndexer.run Starting indexing thread: 2962
[junit4:junit4]   2> 526 T2963 oasc.OneIndexer.run Starting indexing thread: 2963
[junit4:junit4]   2> 526 T2964 oasc.OneIndexer.run Starting indexing thread: 2964
[junit4:junit4]   2> 527 T2965 oasc.OneIndexer.run Starting indexing thread: 2965
[junit4:junit4]   2> 527 T2966 oasc.OneIndexer.run Starting indexing thread: 2966
[junit4:junit4]   2> 527 T2967 oasc.OneIndexer.run Starting indexing thread: 2967
[junit4:junit4]   2> 527 T2968 oasc.OneIndexer.run Starting indexing thread: 2968
[junit4:junit4]   2> 527 T2969 oasc.OneIndexer.run Starting indexing thread: 2969
[junit4:junit4]   2> 527 T2970 oasc.OneIndexer.run Starting indexing thread: 2970
[junit4:junit4]   2> 528 T2971 oasc.OneIndexer.run Starting indexing thread: 2971
[junit4:junit4]   2> 528 T2972 oasc.OneIndexer.run Starting indexing thread: 2972
[junit4:junit4]   2> 529 T2973 oasc.OneIndexer.run Starting indexing thread: 2973
[junit4:junit4]   2> 530 T2976 oasc.OneIndexer.run Starting indexing thread: 2976
[junit4:junit4]   2> 529 T2975 oasc.OneIndexer.run Starting indexing thread: 2975
[junit4:junit4]   2> 529 T2974 oasc.OneIndexer.run Starting indexing thread: 2974
[junit4:junit4]   2> 532 T2955 oasc.CoreContainer.create Creating SolrCore '00008_core' using instanceDir: /usr/home/hudson/hudson-slave/workspace/Lucene-Solr-NightlyTests-trunk/solr/build/solr-core/test/J1/./OpenCloseCoreStressTest_/00008_core
[junit4:junit4]   2> 531 T2954 oasc.CoreContainer.create Creating SolrCore '00019_core' using instanceDir: /usr/home/hudson/hudson-slave/workspace/Lucene-Solr-NightlyTests-trunk/solr/build/solr-core/test/J1/./OpenCloseCoreStressTest_/00019_core
[junit4:junit4]   2> 533 T2957 oasc.CoreContainer.create Creating SolrCore '00000_core' using instanceDir: /usr/home/hudson/hudson-slave/workspace/Lucene-Solr-NightlyTests-trunk/solr/build/solr-core/test/J1/./OpenCloseCoreStressTest_/00000_core
[junit4:junit4]   2> 534 T2982 oasc.OneQuery.run Starting query thread: 2982
[junit4:junit4]   2> 534 T2984 oasc.OneQuery.run Starting query thread: 2984
[junit4:junit4]   2> 534 T2985 oasc.OneQuery.run Starting query thread: 2985
[junit4:junit4]   2> 534 T2987 oasc.OneQuery.run Starting query thread: 2987
[junit4:junit4]   2> 534 T2954 oasc.SolrResourceLoader.<init> new SolrResourceLoader for directory: '/usr/home/hudson/hudson-slave/workspace/Lucene-Solr-NightlyTests-trunk/solr/build/solr-core/test/J1/./OpenCloseCoreStressTest_/00019_core/'
[junit4:junit4]   2> 541 T2992 oasc.OneQuery.run Starting query thread: 2992
[junit4:junit4]   2> 534 T2960 oasc.CoreContainer.create Creating SolrCore '00017_core' using instanceDir: /usr/home/hudson/hudson-slave/workspace/Lucene-Solr-NightlyTests-trunk/solr/build/solr-core/test/J1/./OpenCloseCoreStressTest_/00017_core
[junit4:junit4]   2> 534 T2955 oasc.SolrResourceLoader.<init> new SolrResourceLoader for directory: '/usr/home/hudson/hudson-slave/workspace/Lucene-Solr-NightlyTests-trunk/solr/build/solr-core/test/J1/./OpenCloseCoreStressTest_/00008_core/'
[junit4:junit4]   2> 534 T2983 oasc.OneQuery.run Starting query thread: 2983
[junit4:junit4]   2> 533 T2981 oasc.OneQuery.run Starting query thread: 2981
[junit4:junit4]   2> 544 T2996 oasc.CoreContainer.create Creating SolrCore '00013_core' using instanceDir: /usr/home/hudson/hudson-slave/workspace/Lucene-Solr-NightlyTests-trunk/solr/build/solr-core/test/J1/./OpenCloseCoreStressTest_/00013_core
[junit4:junit4]   2> 533 T2978 oasc.OneQuery.run Starting query thread: 2978
[junit4:junit4]   2> 533 T2979 oasc.OneQuery.run Starting query thread: 2979
[junit4:junit4]   2> 533 T2980 oasc.OneQuery.run Starting query thread: 2980
[junit4:junit4]   2> 533 T2977 oasc.OneQuery.run Starting query thread: 2977
[junit4:junit4]   2> 533 T2958 oasc.CoreContainer.create Creating SolrCore '00005_core' using instanceDir: /usr/home/hudson/hudson-slave/workspace/Lucene-Solr-NightlyTests-trunk/solr/build/solr-core/test/J1/./OpenCloseCoreStressTest_/00005_core
[junit4:junit4]   2> 532 T2956 oasc.CoreContainer.create Creating SolrCore '00014_core' using instanceDir: /usr/home/hudson/hudson-slave/workspace/Lucene-Solr-NightlyTests-trunk/solr/build/solr-core/test/J1/./OpenCloseCoreStressTest_/00014_core
[junit4:junit4]   2> 544 T2997 oasc.CoreContainer.create Creating SolrCore '00015_core' using instanceDir: /usr/home/hudson/hudson-slave/workspace/Lucene-Solr-NightlyTests-trunk/solr/build/solr-core/test/J1/./OpenCloseCoreStressTest_/00015_core
[junit4:junit4]   2> 544 T2960 oasc.SolrResourceLoader.<init> new SolrResourceLoader for directory: '/usr/home/hudson/hudson-slave/workspace/Lucene-Solr-NightlyTests-trunk/solr/build/solr-core/test/J1/./OpenCloseCoreStressTest_/00017_core/'
[junit4:junit4]   2> 545 T2958 oasc.SolrResourceLoader.<init> new SolrResourceLoader for directory: '/usr/home/hudson/hudson-slave/workspace/Lucene-Solr-NightlyTests-trunk/solr/build/solr-core/test/J1/./OpenCloseCoreStressTest_/00005_core/'
[junit4:junit4]   2> 546 T2956 oasc.SolrResourceLoader.<init> new SolrResourceLoader for directory: '/usr/home/hudson/hudson-slave/workspace/Lucene-Solr-NightlyTests-trunk/solr/build/solr-core/test/J1/./OpenCloseCoreStressTest_/00014_core/'
[junit4:junit4]   2> 546 T2997 oasc.SolrResourceLoader.<init> new SolrResourceLoader for directory: '/usr/home/hudson/hudson-slave/workspace/Lucene-Solr-NightlyTests-trunk/solr/build/solr-core/test/J1/./OpenCloseCoreStressTest_/00015_core/'
[junit4:junit4]   2> 543 T2995 oasc.CoreContainer.create Creating SolrCore '00012_core' using instanceDir: /usr/home/hudson/hudson-slave/workspace/Lucene-Solr-NightlyTests-trunk/solr/build/solr-core/test/J1/./OpenCloseCoreStressTest_/00012_core
[junit4:junit4]   2> 542 T2994 oasc.CoreContainer.create Creating SolrCore '00016_core' using instanceDir: /usr/home/hudson/hudson-slave/workspace/Lucene-Solr-NightlyTests-trunk/solr/build/solr-core/test/J1/./OpenCloseCoreStressTest_/00016_core
[junit4:junit4]   2> 542 T2993 oasc.OneQuery.run Starting query thread: 2993
[junit4:junit4]   2> 541 T2991 oasc.OneQuery.run Starting query thread: 2991
[junit4:junit4]   2> 535 T2989 oasc.OneQuery.run Starting query thread: 2989
[junit4:junit4]   2> 535 T2986 oasc.CoreContainer.create Creating SolrCore '00002_core' using instanceDir: /usr/home/hudson/hudson-slave/workspace/Lucene-Solr-NightlyTests-trunk/solr/build/solr-core/test/J1/./OpenCloseCoreStressTest_/00002_core
[junit4:junit4]   2> 547 T2995 oasc.SolrResourceLoader.<init> new SolrResourceLoader for directory: '/usr/home/hudson/hudson-slave/workspace/Lucene-Solr-NightlyTests-trunk/solr/build/solr-core/test/J1/./OpenCloseCoreStressTest_/00012_core/'
[junit4:junit4]   2> 535 T2988 oasc.OneQuery.run Starting query thread: 2988
[junit4:junit4]   2> 547 T2996 oasc.SolrResourceLoader.<init> new SolrResourceLoader for directory: '/usr/home/hudson/hudson-slave/workspace/Lucene-Solr-NightlyTests-trunk/solr/build/solr-core/test/J1/./OpenCloseCoreStressTest_/00013_core/'
[junit4:junit4]   2> 548 T2986 oasc.SolrResourceLoader.<init> new SolrResourceLoader for directory: '/usr/home/hudson/hudson-slave/workspace/Lucene-Solr-NightlyTests-trunk/solr/build/solr-core/test/J1/./OpenCloseCoreStressTest_/00002_core/'
[junit4:junit4]   2> 547 T2994 oasc.SolrResourceLoader.<init> new SolrResourceLoader for directory: '/usr/home/hudson/hudson-slave/workspace/Lucene-Solr-NightlyTests-trunk/solr/build/solr-core/test/J1/./OpenCloseCoreStressTest_/00016_core/'
[junit4:junit4]   2> 545 T2957 oasc.SolrResourceLoader.<init> new SolrResourceLoader for directory: '/usr/home/hudson/hudson-slave/workspace/Lucene-Solr-NightlyTests-trunk/solr/build/solr-core/test/J1/./OpenCloseCoreStressTest_/00000_core/'
[junit4:junit4]   2> 625 T2955 oasc.SolrConfig.<init> Using Lucene MatchVersion: LUCENE_41
[junit4:junit4]   2> 633 T2997 oasc.SolrConfig.<init> Using Lucene MatchVersion: LUCENE_41
[junit4:junit4]   2> 634 T2958 oasc.SolrConfig.<init> Using Lucene MatchVersion: LUCENE_41
[junit4:junit4]   2> 638 T3000 oasc.CoreContainer.create Creating SolrCore '00018_core' using instanceDir: /usr/home/hudson/hudson-slave/workspace/Lucene-Solr-NightlyTests-trunk/solr/build/solr-core/test/J1/./OpenCloseCoreStressTest_/00018_core
[junit4:junit4]   2> 641 T3003 oasc.CoreContainer.create Creating SolrCore '00006_core' using instanceDir: /usr/home/hudson/hudson-slave/workspace/Lucene-Solr-NightlyTests-trunk/solr/build/solr-core/test/J1/./OpenCloseCoreStressTest_/00006_core
[junit4:junit4]   2> 641 T3000 oasc.SolrResourceLoader.<init> new SolrResourceLoader for directory: '/usr/home/hudson/hudson-slave/workspace/Lucene-Solr-NightlyTests-trunk/solr/build/solr-core/test/J1/./OpenCloseCoreStressTest_/00018_core/'
[junit4:junit4]   2> 643 T3003 oasc.SolrResourceLoader.<init> new SolrResourceLoader for directory: '/usr/home/hudson/hudson-slave/workspace/Lucene-Solr-NightlyTests-trunk/solr/build/solr-core/test/J1/./OpenCloseCoreStressTest_/00006_core/'
[junit4:junit4]   2> 644 T2995 oasc.SolrConfig.<init> Using Lucene MatchVersion: LUCENE_41
[junit4:junit4]   2> 644 T3004 oasc.CoreContainer.create Creating SolrCore '00003_core' using instanceDir: /usr/home/hudson/hudson-slave/workspace/Lucene-Solr-NightlyTests-trunk/solr/build/solr-core/test/J1/./OpenCloseCoreStressTest_/00003_core
[junit4:junit4]   2> 645 T2954 oasc.SolrConfig.<init> Using Lucene MatchVersion: LUCENE_41
[junit4:junit4]   2> 646 T3004 oasc.SolrResourceLoader.<init> new SolrResourceLoader for directory: '/usr/home/hudson/hudson-slave/workspace/Lucene-Solr-NightlyTests-trunk/solr/build/solr-core/test/J1/./OpenCloseCoreStressTest_/00003_core/'
[junit4:junit4]   2> 646 T3005 oasc.CoreContainer.create Creating SolrCore '00004_core' using instanceDir: /usr/home/hudson/hudson-slave/workspace/Lucene-Solr-NightlyTests-trunk/solr/build/solr-core/test/J1/./OpenCloseCoreStressTest_/00004_core
[junit4:junit4]   2> 648 T3005 oasc.SolrResourceLoader.<init> new SolrResourceLoader for directory: '/usr/home/hudson/hudson-slave/workspace/Lucene-Solr-NightlyTests-trunk/solr/build/solr-core/test/J1/./OpenCloseCoreStressTest_/00004_core/'
[junit4:junit4]   2> 649 T3009 oasc.CoreContainer.create Creating SolrCore '00010_core' using instanceDir: /usr/home/hudson/hudson-slave/workspace/Lucene-Solr-NightlyTests-trunk/solr/build/solr-core/test/J1/./OpenCloseCoreStressTest_/00010_core
[junit4:junit4]   2> 651 T3013 oasc.CoreContainer.create Creating SolrCore '00007_core' using instanceDir: /usr/home/hudson/hudson-slave/workspace/Lucene-Solr-NightlyTests-trunk/solr/build/solr-core/test/J1/./OpenCloseCoreStressTest_/00007_core
[junit4:junit4]   2> 652 T3009 oasc.SolrResourceLoader.<init> new SolrResourceLoader for directory: '/usr/home/hudson/hudson-slave/workspace/Lucene-Solr-NightlyTests-trunk/solr/build/solr-core/test/J1/./OpenCloseCoreStressTest_/00010_core/'
[junit4:junit4]   2> 652 T2957 oasc.SolrConfig.<init> Using Lucene MatchVersion: LUCENE_41
[junit4:junit4]   2> 653 T3014 oasc.CoreContainer.create Creating SolrCore '00009_core' using instanceDir: /usr/home/hudson/hudson-slave/workspace/Lucene-Solr-NightlyTests-trunk/solr/build/solr-core/test/J1/./OpenCloseCoreStressTest_/00009_core
[junit4:junit4]   2> 654 T3013 oasc.SolrResourceLoader.<init> new SolrResourceLoader for directory: '/usr/home/hudson/hudson-slave/workspace/Lucene-Solr-NightlyTests-trunk/solr/build/solr-core/test/J1/./OpenCloseCoreStressTest_/00007_core/'
[junit4:junit4]   2> 656 T2956 oasc.SolrConfig.<init> Using Lucene MatchVersion: LUCENE_41
[junit4:junit4]   2> 656 T3014 oasc.SolrResourceLoader.<init> new SolrResourceLoader for directory: '/usr/home/hudson/hudson-slave/workspace/Lucene-Solr-NightlyTests-trunk/solr/build/solr-core/test/J1/./OpenCloseCoreStressTest_/00009_core/'
[junit4:junit4]   2> 659 T2996 oasc.SolrConfig.<init> Using Lucene MatchVersion: LUCENE_41
[junit4:junit4]   2> 671 T2960 oasc.SolrConfig.<init> Using Lucene MatchVersion: LUCENE_41
[junit4:junit4]   2> 691 T2986 oasc.SolrConfig.<init> Using Lucene MatchVersion: LUCENE_41
[junit4:junit4]   2> 702 T2994 oasc.SolrConfig.<init> Using Lucene MatchVersion: LUCENE_41
[junit4:junit4]   2> 816 T3004 oasc.SolrConfig.<init> Using Lucene MatchVersion: LUCENE_41
[junit4:junit4]   2> 818 T3000 oasc.SolrConfig.<init> Using Lucene MatchVersion: LUCENE_41
[junit4:junit4]   2> 823 T3003 oasc.SolrConfig.<init> Using Lucene MatchVersion: LUCENE_41
[junit4:junit4]   2> 828 T3014 oasc.SolrConfig.<init> Using Lucene MatchVersion: LUCENE_41
[junit4:junit4]   2> 838 T2955 oasc.SolrConfig.<init> Loaded SolrConfig: solrconfig-minimal.xml
[junit4:junit4]   2> 841 T2955 oass.IndexSchema.readSchema Reading Solr Schema
[junit4:junit4]   2> 849 T3009 oasc.SolrConfig.<init> Using Lucene MatchVersion: LUCENE_41
[junit4:junit4]   2> 851 T3005 oasc.SolrConfig.<init> Using Lucene MatchVersion: LUCENE_41
[junit4:junit4]   2> 855 T2955 oass.IndexSchema.readSchema Schema name=tiny
[junit4:junit4]   2> 865 T2997 oasc.SolrConfig.<init> Loaded SolrConfig: solrconfig-minimal.xml
[junit4:junit4]   2> 866 T2995 oasc.SolrConfig.<init> Loaded SolrConfig: solrconfig-minimal.xml
[junit4:junit4]   2> 867 T2997 oass.IndexSchema.readSchema Reading Solr Schema
[junit4:junit4]   2> 867 T2995 oass.IndexSchema.readSchema Reading Solr Schema
[junit4:junit4]   2> 871 T3013 oasc.SolrConfig.<init> Using Lucene MatchVersion: LUCENE_41
[junit4:junit4]   2> 875 T2958 oasc.SolrConfig.<init> Loaded SolrConfig: solrconfig-minimal.xml
[junit4:junit4]   2> 880 T2958 oass.IndexSchema.readSchema Reading Solr Schema
[junit4:junit4]   2> 881 T2995 oass.IndexSchema.readSchema Schema name=tiny
[junit4:junit4]   2> 881 T2997 oass.IndexSchema.readSchema Schema name=tiny
[junit4:junit4]   2> 895 T2958 oass.IndexSchema.readSchema Schema name=tiny
[junit4:junit4]   2> 895 T2957 oasc.SolrConfig.<init> Loaded SolrConfig: solrconfig-minimal.xml
[junit4:junit4]   2> 897 T2957 oass.IndexSchema.readSchema Reading Solr Schema
[junit4:junit4]   2> 906 T2954 oasc.SolrConfig.<init> Loaded SolrConfig: solrconfig-minimal.xml
[junit4:junit4]   2> 909 T2954 oass.IndexSchema.readSchema Reading Solr Schema
[junit4:junit4]   2> 917 T2957 oass.IndexSchema.readSchema Schema name=tiny
[junit4:junit4]   2> 921 T2956 oasc.SolrConfig.<init> Loaded SolrConfig: solrconfig-minimal.xml
[junit4:junit4]   2> 922 T2954 oass.IndexSchema.readSchema Schema name=tiny
[junit4:junit4]   2> 922 T2956 oass.IndexSchema.readSchema Reading Solr Schema
[junit4:junit4]   2> 923 T2960 oasc.SolrConfig.<init> Loaded SolrConfig: solrconfig-minimal.xml
[junit4:junit4]   2> 924 T2960 oass.IndexSchema.readSchema Reading Solr Schema
[junit4:junit4]   2> 931 T2996 oasc.SolrConfig.<init> Loaded SolrConfig: solrconfig-minimal.xml
[junit4:junit4]   2> 932 T2996 oass.IndexSchema.readSchema Reading Solr Schema
[junit4:junit4]   2> 933 T2956 oass.IndexSchema.readSchema Schema name=tiny
[junit4:junit4]   2> 938 T2960 oass.IndexSchema.readSchema Schema name=tiny
[junit4:junit4]   2> 943 T2996 oass.IndexSchema.readSchema Schema name=tiny
[junit4:junit4]   2> 956 T2986 oasc.SolrConfig.<init> Loaded SolrConfig: solrconfig-minimal.xml
[junit4:junit4]   2> 958 T2994 oasc.SolrConfig.<init> Loaded SolrConfig: solrconfig-minimal.xml
[junit4:junit4]   2> 958 T2986 oass.IndexSchema.readSchema Reading Solr Schema
[junit4:junit4]   2> 961 T2994 oass.IndexSchema.readSchema Reading Solr Schema
[junit4:junit4]   2> 968 T2994 oass.IndexSchema.readSchema Schema name=tiny
[junit4:junit4]   2> 970 T2986 oass.IndexSchema.readSchema Schema name=tiny
[junit4:junit4]   2> 975 T2997 oass.IndexSchema.readSchema unique key field: id
[junit4:junit4]   2> 976 T2995 oass.IndexSchema.readSchema unique key field: id
[junit4:junit4]   2> 979 T2955 oass.IndexSchema.readSchema unique key field: id
[junit4:junit4]   2> 981 T2997 oasc.SolrCore.initDirectoryFactory org.apache.solr.core.MockFSDirectoryFactory
[junit4:junit4]   2> 982 T2995 oasc.SolrCore.initDirectoryFactory org.apache.solr.core.MockFSDirectoryFactory
[junit4:junit4]   2> 984 T2995 oasc.SolrCore.<init> [00012_core] Opening new SolrCore at /usr/home/hudson/hudson-slave/workspace/Lucene-Solr-NightlyTests-trunk/solr/build/solr-core/test/J1/./OpenCloseCoreStressTest_/00012_core/, dataDir=/usr/home/hudson/hudson-slave/workspace/Lucene-Solr-NightlyTests-trunk/solr/build/solr-core/test/J1/OpenCloseCoreStressTest_/00012_core/data/
[junit4:junit4]   2> 984 T2995 oasc.JmxMonitoredMap.<init> JMX monitoring is enabled. Adding Solr mbeans to JMX Server: com.sun.jmx.mbeanserver.JmxMBeanServer@33192410
[junit4:junit4]   2> 985 T2995 oasc.SolrCore.initDirectoryFactory org.apache.solr.core.MockFSDirectoryFactory
[junit4:junit4]   2> 985 T2955 oasc.SolrCore.initDirectoryFactory org.apache.solr.core.MockFSDirectoryFactory
[junit4:junit4]   2> 986 T2997 oasc.SolrCore.<init> [00015_core] Opening new SolrCore at /usr/home/hudson/hudson-slave/workspace/Lucene-Solr-NightlyTests-trunk/solr/build/solr-core/test/J1/./OpenCloseCoreStressTest_/00015_core/, dataDir=/usr/home/hudson/hudson-slave/workspace/Lucene-Solr-NightlyTests-trunk/solr/build/solr-core/test/J1/OpenCloseCoreStressTest_/00015_core/data/
[junit4:junit4]   2> 987 T2955 oasc.SolrCore.<init> [00008_core] Opening new SolrCore at /usr/home/hudson/hudson-slave/workspace/Lucene-Solr-NightlyTests-trunk/solr/build/solr-core/test/J1/./OpenCloseCoreStressTest_/00008_core/, dataDir=/usr/home/hudson/hudson-slave/workspace/Lucene-Solr-NightlyTests-trunk/solr/build/solr-core/test/J1/OpenCloseCoreStressTest_/00008_core/data/
[junit4:junit4]   2> 987 T2997 oasc.JmxMonitoredMap.<init> JMX monitoring is enabled. Adding Solr mbeans to JMX Server: com.sun.jmx.mbeanserver.JmxMBeanServer@33192410
[junit4:junit4]   2> 987 T2955 oasc.JmxMonitoredMap.<init> JMX monitoring is enabled. Adding Solr mbeans to JMX Server: com.sun.jmx.mbeanserver.JmxMBeanServer@33192410
[junit4:junit4]   2> 987 T2995 oasc.CachingDirectoryFactory.get return new directory for /usr/home/hudson/hudson-slave/workspace/Lucene-Solr-NightlyTests-trunk/solr/build/solr-core/test/J1/OpenCloseCoreStressTest_/00012_core/data
[junit4:junit4]   2> 988 T2997 oasc.SolrCore.initDirectoryFactory org.apache.solr.core.MockFSDirectoryFactory
[junit4:junit4]   2> 988 T2955 oasc.SolrCore.initDirectoryFactory org.apache.solr.core.MockFSDirectoryFactory
[junit4:junit4]   2> 990 T2995 oasc.SolrCore.getNewIndexDir New index directory detected: old=null new=/usr/home/hudson/hudson-slave/workspace/Lucene-Solr-NightlyTests-trunk/solr/build/solr-core/test/J1/OpenCloseCoreStressTest_/00012_core/data/index/
[junit4:junit4]   2> 990 T2955 oasc.CachingDirectoryFactory.get return new directory for /usr/home/hudson/hudson-slave/workspace/Lucene-Solr-NightlyTests-trunk/solr/build/solr-core/test/J1/OpenCloseCoreStressTest_/00008_core/data
[junit4:junit4]   2> 991 T2997 oasc.CachingDirectoryFactory.get return new directory for /usr/home/hudson/hudson-slave/workspace/Lucene-Solr-NightlyTests-trunk/solr/build/solr-core/test/J1/OpenCloseCoreStressTest_/00015_core/data
[junit4:junit4]   2> 992 T2995 oasc.SolrCore.initIndex WARNING [00012_core] Solr index directory '/usr/home/hudson/hudson-slave/workspace/Lucene-Solr-NightlyTests-trunk/solr/build/solr-core/test/J1/OpenCloseCoreStressTest_/00012_core/data/index' doesn't exist. Creating new index...
[junit4:junit4]   2> 993 T2955 oasc.SolrCore.getNewIndexDir New index directory detected: old=null new=/usr/home/hudson/hudson-slave/workspace/Lucene-Solr-NightlyTests-trunk/solr/build/solr-core/test/J1/OpenCloseCoreStressTest_/00008_core/data/index/
[junit4:junit4]   2> 995 T2995 oasc.CachingDirectoryFactory.get return new directory for /usr/home/hudson/hudson-slave/workspace/Lucene-Solr-NightlyTests-trunk/solr/build/solr-core/test/J1/OpenCloseCoreStressTest_/00012_core/data/index
[junit4:junit4]   2> 995 T2997 oasc.SolrCore.getNewIndexDir New index directory detected: old=null new=/usr/home/hudson/hudson-slave/workspace/Lucene-Solr-NightlyTests-trunk/solr/build/solr-core/test/J1/OpenCloseCoreStressTest_/00015_core/data/index/
[junit4:junit4]   2> 996 T2955 oasc.SolrCore.initIndex WARNING [00008_core] Solr index directory '/usr/home/hudson/hudson-slave/workspace/Lucene-Solr-NightlyTests-trunk/solr/build/solr-core/test/J1/OpenCloseCoreStressTest_/00008_core/data/index' doesn't exist. Creating new index...
[junit4:junit4]   2> 997 T2997 oasc.SolrCore.initIndex WARNING [00015_core] Solr index directory '/usr/home/hudson/hudson-slave/workspace/Lucene-Solr-NightlyTests-trunk/solr/build/solr-core/test/J1/OpenCloseCoreStressTest_/00015_core/data/index' doesn't exist. Creating new index...
[junit4:junit4]   2> 998 T2958 oass.IndexSchema.readSchema unique key field: id
[junit4:junit4]   2> 998 T2955 oasc.CachingDirectoryFactory.get return new directory for /usr/home/hudson/hudson-slave/workspace/Lucene-Solr-NightlyTests-trunk/solr/build/solr-core/test/J1/OpenCloseCoreStressTest_/00008_core/data/index
[junit4:junit4]   2> 998 T2997 oasc.CachingDirectoryFactory.get return new directory for /usr/home/hudson/hudson-slave/workspace/Lucene-Solr-NightlyTests-trunk/solr/build/solr-core/test/J1/OpenCloseCoreStressTest_/00015_core/data/index
[junit4:junit4]   2> 1003 T2958 oasc.SolrCore.initDirectoryFactory org.apache.solr.core.MockFSDirectoryFactory
[junit4:junit4]   2> 1006 T2958 oasc.SolrCore.<init> [00005_core] Opening new SolrCore at /usr/home/hudson/hudson-slave/workspace/Lucene-Solr-NightlyTests-trunk/solr/build/solr-core/test/J1/./OpenCloseCoreStressTest_/00005_core/, dataDir=/usr/home/hudson/hudson-slave/workspace/Lucene-Solr-NightlyTests-trunk/solr/build/solr-core/test/J1/OpenCloseCoreStressTest_/00005_core/data/
[junit4:junit4]   2> 1006 T2958 oasc.JmxMonitoredMap.<init> JMX monitoring is enabled. Adding Solr mbeans to JMX Server: com.sun.jmx.mbeanserver.JmxMBeanServer@33192410
[junit4:junit4]   2> 1007 T2958 oasc.SolrCore.initDirectoryFactory org.apache.solr.core.MockFSDirectoryFactory
[junit4:junit4]   2> 1009 T2957 oass.IndexSchema.readSchema unique key field: id
[junit4:junit4]   2> 1010 T2958 oasc.CachingDirectoryFactory.get return new directory for /usr/home/hudson/hudson-slave/workspace/Lucene-Solr-NightlyTests-trunk/solr/build/solr-core/test/J1/OpenCloseCoreStressTest_/00005_core/data
[junit4:junit4]   2> 1013 T2957 oasc.SolrCore.initDirectoryFactory org.apache.solr.core.MockFSDirectoryFactory
[junit4:junit4]   2> 1013 T2958 oasc.SolrCore.getNewIndexDir New index directory detected: old=null new=/usr/home/hudson/hudson-slave/workspace/Lucene-Solr-NightlyTests-trunk/solr/build/solr-core/test/J1/OpenCloseCoreStressTest_/00005_core/data/index/
[junit4:junit4]   2> 1015 T2954 oass.IndexSchema.readSchema unique key field: id
[junit4:junit4]   2> 1016 T2957 oasc.SolrCore.<init> [00000_core] Opening new SolrCore at /usr/home/hudson/hudson-slave/workspace/Lucene-Solr-NightlyTests-trunk/solr/build/solr-core/test/J1/./OpenCloseCoreStressTest_/00000_core/, dataDir=/usr/home/hudson/hudson-slave/workspace/Lucene-Solr-NightlyTests-trunk/solr/build/solr-core/test/J1/OpenCloseCoreStressTest_/00000_core/data/
[junit4:junit4]   2> 1017 T2957 oasc.JmxMonitoredMap.<init> JMX monitoring is enabled. Adding Solr mbeans to JMX Server: com.sun.jmx.mbeanserver.JmxMBeanServer@33192410
[junit4:junit4]   2> 1017 T2957 oasc.SolrCore.initDirectoryFactory org.apache.solr.core.MockFSDirectoryFactory
[junit4:junit4]   2> 1018 T2958 oasc.SolrCore.initIndex WARNING [00005_core] Solr index directory '/usr/home/hudson/hudson-slave/workspace/Lucene-Solr-NightlyTests-trunk/solr/build/solr-core/test/J1/OpenCloseCoreStressTest_/00005_core/data/index' doesn't exist. Creating new index...
[junit4:junit4]   2> 1019 T2958 oasc.CachingDirectoryFactory.get return new directory for /usr/home/hudson/hudson-slave/workspace/Lucene-Solr-NightlyTests-trunk/solr/build/solr-core/test/J1/OpenCloseCoreStressTest_/00005_core/data/index
[junit4:junit4]   2> 1020 T2957 oasc.CachingDirectoryFactory.get return new directory for /usr/home/hudson/hudson-slave/workspace/Lucene-Solr-NightlyTests-trunk/solr/build/solr-core/test/J1/OpenCloseCoreStressTest_/00000_core/data
[junit4:junit4]   2> 1020 T2954 oasc.SolrCore.initDirectoryFactory org.apache.solr.core.MockFSDirectoryFactory
[junit4:junit4]   2> 1022 T2957 oasc.SolrCore.getNewIndexDir New index directory detected: old=null new=/usr/home/hudson/hudson-slave/workspace/Lucene-Solr-NightlyTests-trunk/solr/build/solr-core/test/J1/OpenCloseCoreStressTest_/00000_core/data/index/
[junit4:junit4]   2> 1022 T2954 oasc.SolrCore.<init> [00019_core] Opening new SolrCore at /usr/home/hudson/hudson-slave/workspace/Lucene-Solr-NightlyTests-trunk/solr/build/solr-core/test/J1/./OpenCloseCoreStressTest_/00019_core/, dataDir=/usr/home/hudson/hudson-slave/workspace/Lucene-Solr-NightlyTests-trunk/solr/build/solr-core/test/J1/OpenCloseCoreStressTest_/00019_core/data/
[junit4:junit4]   2> 1029 T2957 oasc.SolrCore.initIndex WARNING [00000_core] Solr index directory '/usr/home/hudson/hudson-slave/workspace/Lucene-Solr-NightlyTests-trunk/solr/build/solr-core/test/J1/OpenCloseCoreStressTest_/00000_core/data/index' doesn't exist. Creating new index...
[junit4:junit4]   2> 1029 T2954 oasc.JmxMonitoredMap.<init> JMX monitoring is enabled. Adding Solr mbeans to JMX Server: com.sun.jmx.mbeanserver.JmxMBeanServer@33192410
[junit4:junit4]   2> 1029 T2956 oass.IndexSchema.readSchema unique key field: id
[junit4:junit4]   2> 1030 T2954 oasc.SolrCore.initDirectoryFactory org.apache.solr.core.MockFSDirectoryFactory
[junit4:junit4]   2> 1030 T2957 oasc.CachingDirectoryFactory.get return new directory for /usr/home/hudson/hudson-slave/workspace/Lucene-Solr-NightlyTests-trunk/solr/build/solr-core/test/J1/OpenCloseCoreStressTest_/00000_core/data/index
[junit4:junit4]   2> 1034 T2954 oasc.CachingDirectoryFactory.get return new directory for /usr/home/hudson/hudson-slave/workspace/Lucene-Solr-NightlyTests-trunk/solr/build/solr-core/test/J1/OpenCloseCoreStressTest_/00019_core/data
[junit4:junit4]   2> 1034 T2956 oasc.SolrCore.initDirectoryFactory org.apache.solr.core.MockFSDirectoryFactory
[junit4:junit4]   2> 1036 T2956 oasc.SolrCore.<init> [00014_core] Opening new SolrCore at /usr/home/hudson/hudson-slave/workspace/Lucene-Solr-NightlyTests-trunk/solr/build/solr-core/test/J1/./OpenCloseCoreStressTest_/00014_core/, dataDir=/usr/home/hudson/hudson-slave/workspace/Lucene-Solr-NightlyTests-trunk/solr/build/solr-core/test/J1/OpenCloseCoreStressTest_/00014_core/data/
[junit4:junit4]   2> 1037 T2956 oasc.JmxMonitoredMap.<init> JMX monitoring is enabled. Adding Solr mbeans to JMX Server: com.sun.jmx.mbeanserver.JmxMBeanServer@33192410
[junit4:junit4]   2> 1038 T2956 oasc.SolrCore.initDirectoryFactory org.apache.solr.core.MockFSDirectoryFactory
[junit4:junit4]   2> 1038 T2954 oasc.SolrCore.getNewIndexDir New index directory detected: old=null new=/usr/home/hudson/hudson-slave/workspace/Lucene-Solr-NightlyTests-trunk/solr/build/solr-core/test/J1/OpenCloseCoreStressTest_/00019_core/data/index/
[junit4:junit4]   2> 1040 T2954 oasc.SolrCore.initIndex WARNING [00019_core] Solr index directory '/usr/home/hudson/hudson-slave/workspace/Lucene-Solr-NightlyTests-trunk/solr/build/solr-core/test/J1/OpenCloseCoreStressTest_/00019_core/data/index' doesn't exist. Creating new index...
[junit4:junit4]   2> 1040 T2956 oasc.CachingDirectoryFactory.get return new directory for /usr/home/hudson/hudson-slave/workspace/Lucene-Solr-NightlyTests-trunk/solr/build/solr-core/test/J1/OpenCloseCoreStressTest_/00014_core/data
[junit4:junit4]   2> 1041 T2954 oasc.CachingDirectoryFactory.get return new directory for /usr/home/hudson/hudson-slave/workspace/Lucene-Solr-NightlyTests-trunk/solr/build/solr-core/test/J1/OpenCloseCoreStressTest_/00019_core/data/index
[junit4:junit4]   2> 1043 T2956 oasc.SolrCore.getNewIndexDir New index directory detected: old=null new=/usr/home/hudson/hudson-slave/workspace/Lucene-Solr-NightlyTests-trunk/solr/build/solr-core/test/J1/OpenCloseCoreStressTest_/00014_core/data/index/
[junit4:junit4]   2> 1043 T2996 oass.IndexSchema.readSchema unique key field: id
[junit4:junit4]   2> 1044 T2960 oass.IndexSchema.readSchema unique key field: id
[junit4:junit4]   2> 1045 T2956 oasc.SolrCore.initIndex WARNING [00014_core] Solr index directory '/usr/home/hudson/hudson-slave/workspace/Lucene-Solr-NightlyTests-trunk/solr/build/solr-core/test/J1/OpenCloseCoreStressTest_/00014_core/data/index' doesn't exist. Creating new index...
[junit4:junit4]   2> 1047 T2956 oasc.CachingDirectoryFactory.get return new directory for /usr/home/hudson/hudson-slave/workspace/Lucene-Solr-NightlyTests-trunk/solr/build/solr-core/test/J1/OpenCloseCoreStressTest_/00014_core/data/index
[junit4:junit4]   2> 1047 T2960 oasc.SolrCore.initDirectoryFactory org.apache.solr.core.MockFSDirectoryFactory
[junit4:junit4]   2> 1047 T2996 oasc.SolrCore.initDirectoryFactory org.apache.solr.core.MockFSDirectoryFactory
[junit4:junit4]   2> 1048 T2960 oasc.SolrCore.<init> [00017_core] Opening new SolrCore at /usr/home/hudson/hudson-slave/workspace/Lucene-Solr-NightlyTests-trunk/solr/build/solr-core/test/J1/./OpenCloseCoreStressTest_/00017_core/, dataDir=/usr/home/hudson/hudson-slave/workspace/Lucene-Solr-NightlyTests-trunk/solr/build/solr-core/test/J1/OpenCloseCoreStressTest_/00017_core/data/
[junit4:junit4]   2> 1048 T2960 oasc.JmxMonitoredMap.<init> JMX monitoring is enabled. Adding Solr mbeans to JMX Server: com.sun.jmx.mbeanserver.JmxMBeanServer@33192410
[junit4:junit4]   2> 1049 T2960 oasc.SolrCore.initDirectoryFactory org.apache.solr.core.MockFSDirectoryFactory
[junit4:junit4]   2> 1049 T2996 oasc.SolrCore.<init> [00013_core] Opening new SolrCore at /usr/home/hudson/hudson-slave/workspace/Lucene-Solr-NightlyTests-trunk/solr/build/solr-core/test/J1/./OpenCloseCoreStressTest_/00013_core/, dataDir=/usr/home/hudson/hudson-slave/workspace/Lucene-Solr-NightlyTests-trunk/solr/build/solr-core/test/J1/OpenCloseCoreStressTest_/00013_core/data/
[junit4:junit4]   2> 1049 T2996 oasc.JmxMonitoredMap.<init> JMX monitoring is enabled. Adding Solr mbeans to JMX Server: com.sun.jmx.mbeanserver.JmxMBeanServer@33192410
[junit4:junit4]   2> 1050 T2996 oasc.SolrCore.initDirectoryFactory org.apache.solr.core.MockFSDirectoryFactory
[junit4:junit4]   2> 1051 T2960 oasc.CachingDirectoryFactory.get return new directory for /usr/home/hudson/hudson-slave/workspace/Lucene-Solr-NightlyTests-trunk/solr/build/solr-core/test/J1/OpenCloseCoreStressTest_/00017_core/data
[junit4:junit4]   2> 1052 T2995 oasc.SolrDeletionPolicy.onCommit SolrDeletionPolicy.onCommit: commits:num=1
[junit4:junit4]   2> 		commit{dir=MockDirWrapper(org.apache.lucene.store.MMapDirectory@/usr/home/hudson/hudson-slave/workspace/Lucene-Solr-NightlyTests-trunk/solr/build/solr-core/test/J1/OpenCloseCoreStressTest_/00012_core/data/index lockFactory=org.apache.lucene.store.NativeFSLockFactory@6fb5bd0e),segFN=segments_1,generation=1,filenames=[segments_1]
[junit4:junit4]   2> 1052 T2995 oasc.SolrDeletionPolicy.updateCommits newest commit = 1[segments_1]
[junit4:junit4]   2> 1052 T2996 oasc.CachingDirectoryFactory.get return new directory for /usr/home/hudson/hudson-slave/workspace/Lucene-Solr-NightlyTests-trunk/solr/build/solr-core/test/J1/OpenCloseCoreStressTest_/00013_core/data
[junit4:junit4]   2> 1053 T2960 oasc.SolrCore.getNewIndexDir New index directory detected: old=null new=/usr/home/hudson/hudson-slave/workspace/Lucene-Solr-NightlyTests-trunk/solr/build/solr-core/test/J1/OpenCloseCoreStressTest_/00017_core/data/index/
[junit4:junit4]   2> 1053 T2958 oasc.SolrDeletionPolicy.onCommit SolrDeletionPolicy.onCommit: commits:num=1
[junit4:junit4]   2> 		commit{dir=MockDirWrapper(org.apache.lucene.store.MMapDirectory@/usr/home/hudson/hudson-slave/workspace/Lucene-Solr-NightlyTests-trunk/solr/build/solr-core/test/J1/OpenCloseCoreStressTest_/00005_core/data/index lockFactory=org.apache.lucene.store.NativeFSLockFactory@3a79526c),segFN=segments_1,generation=1,filenames=[segments_1]
[junit4:junit4]   2> 1053 T2997 oasc.SolrDeletionPolicy.onCommit SolrDeletionPolicy.onCommit: commits:num=1
[junit4:junit4]   2> 		commit{dir=MockDirWrapper(org.apache.lucene.store.MMapDirectory@/usr/home/hudson/hudson-slave/workspace/Lucene-Solr-NightlyTests-trunk/solr/build/solr-core/test/J1/OpenCloseCoreStressTest_/00015_core/data/index lockFactory=org.apache.lucene.store.NativeFSLockFactory@62d00791),segFN=segments_1,generation=1,filenames=[segments_1]
[junit4:junit4]   2> 1054 T2958 oasc.SolrDeletionPolicy.updateCommits newest commit = 1[segments_1]
[junit4:junit4]   2> 1054 T2997 oasc.SolrDeletionPolicy.updateCommits newest commit = 1[segments_1]
[junit4:junit4]   2> 1055 T2955 oasc.SolrDeletionPolicy.onCommit SolrDeletionPolicy.onCommit: commits:num=1
[junit4:junit4]   2> 		commit{dir=MockDirWrapper(org.apache.lucene.store.MMapDirectory@/usr/home/hudson/hudson-slave/workspace/Lucene-Solr-NightlyTests-trunk/solr/build/solr-core/test/J1/OpenCloseCoreStressTest_/00008_core/data/index lockFactory=org.apache.lucene.store.NativeFSLockFactory@57d4357),segFN=segments_1,generation=1,filenames=[segments_1]
[junit4:junit4]   2> 1055 T2955 oasc.SolrDeletionPolicy.updateCommits newest commit = 1[segments_1]
[junit4:junit4]   2> 1057 T2995 oasc.SolrCore.initWriters created json: solr.JSONResponseWriter
[junit4:junit4]   2> 1059 T2960 oasc.SolrCore.initIndex WARNING [00017_core] Solr index directory '/usr/home/hudson/hudson-slave/workspace/Lucene-Solr-NightlyTests-trunk/solr/build/solr-core/test/J1/OpenCloseCoreStressTest_/00017_core/data/index' doesn't exist. Creating new index...
[junit4:junit4]   2> 1060 T2995 oasc.RequestHandlers.initHandlersFromConfig created /admin/: solr.admin.AdminHandlers
[junit4:junit4]   2> 1060 T2960 oasc.CachingDirectoryFactory.get return new directory for /usr/home/hudson/hudson-slave/workspace/Lucene-Solr-NightlyTests-trunk/solr/build/solr-core/test/J1/OpenCloseCoreStressTest_/00017_core/data/index
[junit4:junit4]   2> 1061 T2995 oasc.RequestHandlers.initHandlersFromConfig created /select: solr.SearchHandler
[junit4:junit4]   2> 1061 T2995 oasc.RequestHandlers.initHandlersFromConfig created /update: solr.UpdateRequestHandler
[junit4:junit4]   2> 1062 T2958 oasc.SolrCore.initWriters created json: solr.JSONResponseWriter
[junit4:junit4]   2> 1062 T2996 oasc.SolrCore.getNewIndexDir New index directory detected: old=null new=/usr/home/hudson/hudson-slave/workspace/Lucene-Solr-NightlyTests-trunk/solr/build/solr-core/test/J1/OpenCloseCoreStressTest_/00013_core/data/index/
[junit4:junit4]   2> 1065 T2958 oasc.RequestHandlers.initHandlersFromConfig created /admin/: solr.admin.AdminHandlers
[junit4:junit4]   2> 1066 T2958 oasc.RequestHandlers.initHandlersFromConfig created /select: solr.SearchHandler
[junit4:junit4]   2> 1066 T2954 oasc.SolrDeletionPolicy.onCommit SolrDeletionPolicy.onCommit: commits:num=1
[junit4:junit4]   2> 		commit{dir=MockDirWrapper(org.apache.lucene.store.MMapDirectory@/usr/home/hudson/hudson-slave/workspace/Lucene-Solr-NightlyTests-trunk/solr/build/solr-core/test/J1/OpenCloseCoreStressTest_/00019_core/data/index lockFactory=org.apache.lucene.store.NativeFSLockFactory@240ad0a),segFN=segments_1,generation=1,filenames=[segments_1]
[junit4:junit4]   2> 1066 T2958 oasc.RequestHandlers.initHandlersFromConfig created /update: solr.UpdateRequestHandler
[junit4:junit4]   2> 1067 T2954 oasc.SolrDeletionPolicy.updateCommits newest commit = 1[segments_1]
[junit4:junit4]   2> 1068 T2955 oasc.SolrCore.initWriters created json: solr.JSONResponseWriter
[junit4:junit4]   2> 1071 T2955 oasc.RequestHandlers.initHandlersFromConfig created /admin/: solr.admin.AdminHandlers
[junit4:junit4]   2> 1071 T2955 oasc.RequestHandlers.initHandlersFromConfig created /select: solr.SearchHandler
[junit4:junit4]   2> 1072 T2955 oasc.RequestHandlers.initHandlersFromConfig created /update: solr.UpdateRequestHandler
[junit4:junit4]   2> 1072 T2997 oasc.SolrCore.initWriters created json: solr.JSONResponseWriter
[junit4:junit4]   2> 1075 T2997 oasc.RequestHandlers.initHandlersFromConfig created /admin/: solr.admin.AdminHandlers
[junit4:junit4]   2> 1075 T2996 oasc.SolrCore.initIndex WARNING [00013_core] Solr index directory '/usr/home/hudson/hudson-slave/workspace/Lucene-Solr-NightlyTests-trunk/solr/build/solr-core/test/J1/OpenCloseCoreStressTest_/00013_core/data/index' doesn't exist. Creating new index...
[junit4:junit4]   2> 1075 T2954 oasc.SolrCore.initWriters created json: solr.JSONResponseWriter
[junit4:junit4]   2> 1075 T2997 oasc.RequestHandlers.initHandlersFromConfig created /select: solr.SearchHandler
[junit4:junit4]   2> 1079 T2996 oasc.CachingDirectoryFactory.get return new directory for /usr/home/hudson/hudson-slave/workspace/Lucene-Solr-NightlyTests-trunk/solr/build/solr-core/test/J1/OpenCloseCoreStressTest_/00013_core/data/index
[junit4:junit4]   2> 1081 T2954 oasc.RequestHandlers.initHandlersFromConfig created /admin/: solr.admin.AdminHandlers
[junit4:junit4]   2> 1081 T2997 oasc.RequestHandlers.initHandlersFromConfig created /update: solr.UpdateRequestHandler
[junit4:junit4]   2> 1081 T2954 oasc.RequestHandlers.initHandlersFromConfig created /select: solr.SearchHandler
[junit4:junit4]   2> 1082 T2954 oasc.RequestHandlers.initHandlersFromConfig created /update: solr.UpdateRequestHandler
[junit4:junit4]   2> 1083 T2957 oasc.SolrDeletionPolicy.onCommit SolrDeletionPolicy.onCommit: commits:num=1
[junit4:junit4]   2> 		commit{dir=MockDirWrapper(org.apache.lucene.store.MMapDirectory@/usr/home/hudson/hudson-slave/workspace/Lucene-Solr-NightlyTests-trunk/solr/build/solr-core/test/J1/OpenCloseCoreStressTest_/00000_core/data/index lockFactory=org.apache.lucene.store.NativeFSLockFactory@4a4e0809),segFN=segments_1,generation=1,filenames=[segments_1]
[junit4:junit4]   2> 1083 T2957 oasc.SolrDeletionPolicy.updateCommits newest commit = 1[segments_1]
[junit4:junit4]   2> 1098 T2956 oasc.SolrDeletionPolicy.onCommit SolrDeletionPolicy.onCommit: commits:num=1
[junit4:junit4]   2> 		commit{dir=MockDirWrapper(org.apache.lucene.store.MMapDirectory@/usr/home/hudson/hudson-slave/workspace/Lucene-Solr-NightlyTests-trunk/solr/build/solr-core/test/J1/OpenCloseCoreStressTest_/00014_core/data/index lockFactory=org.apache.lucene.store.NativeFSLockFactory@14b7db7e),segFN=segments_1,generation=1,filenames=[segments_1]
[junit4:junit4]   2> 1098 T2956 oasc.SolrDeletionPolicy.updateCommits newest commit = 1[segments_1]
[junit4:junit4]   2> 1098 T2957 oasc.SolrCore.initWriters created json: solr.JSONResponseWriter
[junit4:junit4]   2> 1101 T2957 oasc.RequestHandlers.initHandlersFromConfig created /admin/: solr.admin.AdminHandlers
[junit4:junit4]   2> 1101 T2957 oasc.RequestHandlers.initHandlersFromConfig created /select: solr.SearchHandler
[junit4:junit4]   2> 1102 T2957 oasc.RequestHandlers.initHandlersFromConfig created /update: solr.UpdateRequestHandler
[junit4:junit4]   2> 1108 T2956 oasc.SolrCore.initWriters created json: solr.JSONResponseWriter
[junit4:junit4]   2> 1110 T2956 oasc.RequestHandlers.initHandlersFromConfig created /admin/: solr.admin.AdminHandlers
[junit4:junit4]   2> 1111 T2956 oasc.RequestHandlers.initHandlersFromConfig created /select: solr.SearchHandler
[junit4:junit4]   2> 1112 T2956 oasc.RequestHandlers.initHandlersFromConfig created /update: solr.UpdateRequestHandler
[junit4:junit4]   2> 1127 T2960 oasc.SolrDeletionPolicy.onCommit SolrDeletionPolicy.onCommit: commits:num=1
[junit4:junit4]   2> 		commit{dir=MockDirWrapper(org.apache.lucene.store.MMapDirectory@/usr/home/hudson/hudson-slave/workspace/Lucene-Solr-NightlyTests-trunk/solr/build/solr-core/test/J1/OpenCloseCoreStressTest_/00017_core/data/index lockFactory=org.apache.lucene.store.NativeFSLockFactory@5c5cd3),segFN=segments_1,generation=1,filenames=[segments_1]
[junit4:junit4]   2> 1127 T2960 oasc.SolrDeletionPolicy.updateCommits newest commit = 1[segments_1]
[junit4:junit4]   2> 1137 T2996 oasc.SolrDeletionPolicy.onCommit SolrDeletionPolicy.onCommit: commits:num=1
[junit4:junit4]   2> 		commit{dir=MockDirWrapper(org.apache.lucene.store.MMapDirectory@/usr/home/hudson/hudson-slave/workspace/Lucene-Solr-NightlyTests-trunk/solr/build/solr-core/test/J1/OpenCloseCoreStressTest_/00013_core/data/index lockFactory=org.apache.lucene.store.NativeFSLockFactory@24ad93a0),segFN=segments_1,generation=1,filenames=[segments_1]
[junit4:junit4]   2> 1137 T2960 oasc.SolrCore.initWriters created json: solr.JSONResponseWriter
[junit4:junit4]   2> 1140 T2996 oasc.SolrDeletionPolicy.updateCommits newest commit = 1[segments_1]
[junit4:junit4]   2> 1140 T2960 oasc.RequestHandlers.initHandlersFromConfig created /admin/: solr.admin.AdminHandlers
[junit4:junit4]   2> 1141 T2960 oasc.RequestHandlers.initHandlersFromConfig created /select: solr.SearchHandler
[junit4:junit4]   2> 1141 T2960 oasc.RequestHandlers.initHandlersFromConfig created /update: solr.UpdateRequestHandler
[junit4:junit4]   2> 1151 T2996 oasc.SolrCore.initWriters created json: solr.JSONResponseWriter
[junit4:junit4]   2> 1153 T2996 oasc.RequestHandlers.initHandlersFromConfig created /admin/: solr.admin.AdminHandlers
[junit4:junit4]   2> 1154 T2996 oasc.RequestHandlers.initHandlersFromConfig created /select: solr.SearchHandler
[junit4:junit4]   2> 1154 T2996 oasc.RequestHandlers.initHandlersFromConfig created /update: solr.UpdateRequestHandler
[junit4:junit4]   2> 1163 T2986 oass.IndexSchema.readSchema unique key field: id
[junit4:junit4]   2> 1169 T2994 oass.IndexSchema.readSchema unique key field: id
[junit4:junit4]   2> 1170 T2986 oasc.SolrCore.initDirectoryFactory org.apache.solr.core.MockFSDirectoryFactory
[junit4:junit4]   2> 1177 T2994 oasc.SolrCore.initDirectoryFactory org.apache.solr.core.MockFSDirectoryFactory
[junit4:junit4]   2> 1178 T2986 oasc.SolrCore.<init> [00002_core] Opening new SolrCore at /usr/home/hudson/hudson-slave/workspace/Lucene-Solr-NightlyTests-trunk/solr/build/solr-core/test/J1/./OpenCloseCoreStressTest_/00002_core/, dataDir=/usr/home/hudson/hudson-slave/workspace/Lucene-Solr-NightlyTests-trunk/solr/build/solr-core/test/J1/OpenCloseCoreStressTest_/00002_core/data/
[junit4:junit4]   2> 1178 T2986 oasc.JmxMonitoredMap.<init> JMX monitoring is enabled. Adding Solr mbeans to JMX Server: com.sun.jmx.mbeanserver.JmxMBeanServer@33192410
[junit4:junit4]   2> 1179 T2986 oasc.SolrCore.initDirectoryFactory org.apache.solr.core.MockFSDirectoryFactory
[junit4:junit4]   2> 1180 T2994 oasc.SolrCore.<init> [00016_core] Opening new SolrCore at /usr/home/hudson/hudson-slave/workspace/Lucene-Solr-NightlyTests-trunk/solr/build/solr-core/test/J1/./OpenCloseCoreStressTest_/00016_core/, dataDir=/usr/home/hudson/hudson-slave/workspace/Lucene-Solr-NightlyTests-trunk/solr/build/solr-core/test/J1/OpenCloseCoreStressTest_/00016_core/data/
[junit4:junit4]   2> 1181 T2994 oasc.JmxMonitoredMap.<init> JMX monitoring is enabled. Adding Solr mbeans to JMX Server: com.sun.jmx.mbeanserver.JmxMBeanServer@33192410
[junit4:junit4]   2> 1182 T2994 oasc.SolrCore.initDirectoryFactory org.apache.solr.core.MockFSDirectoryFactory
[junit4:junit4]   2> 1183 T3003 oasc.SolrConfig.<init> Loaded SolrConfig: solrconfig-minimal.xml
[junit4:junit4]   2> 1183 T3004 oasc.SolrConfig.<init> Loaded SolrConfig: solrconfig-minimal.xml
[junit4:junit4]   2> 1184 T2986 oasc.CachingDirectoryFactory.get return new directory for /usr/home/hudson/hudson-slave/workspace/Lucene-Solr-NightlyTests-trunk/solr/build/solr-core/test/J1/OpenCloseCoreStressTest_/00002_core/data
[junit4:junit4]   2> 1188 T3003 oass.IndexSchema.readSchema Reading Solr Schema
[junit4:junit4]   2> 1188 T3004 oass.IndexSchema.readSchema Reading Solr Schema
[junit4:junit4]   2> 1194 T3014 oasc.SolrConfig.<init> Loaded SolrConfig: solrconfig-minimal.xml
[junit4:junit4]   2> 1195 T2986 oasc.SolrCore.getNewIndexDir New index directory detected: old=null new=/usr/home/hudson/hudson-slave/workspace/Lucene-Solr-NightlyTests-trunk/solr/build/solr-core/test/J1/OpenCloseCoreStressTest_/00002_core/data/index/
[junit4:junit4]   2> 1195 T2994 oasc.CachingDirectoryFactory.get return new directory for /usr/home/hudson/hudson-slave/workspace/Lucene-Solr-NightlyTests-trunk/solr/build/solr-core/test/J1/OpenCloseCoreStressTest_/00016_core/data
[junit4:junit4]   2> 1200 T3014 oass.IndexSchema.readSchema Reading Solr Schema
[junit4:junit4]   2> 1202 T2994 oasc.SolrCore.getNewIndexDir New index directory detected: old=null new=/usr/home/hudson/hudson-slave/workspace/Lucene-Solr-NightlyTests-trunk/solr/build/solr-core/test/J1/OpenCloseCoreStressTest_/00016_core/data/index/
[junit4:junit4]   2> 1206 T2986 oasc.SolrCore.initIndex WARNING [00002_core] Solr index directory '/usr/home/hudson/hudson-slave/workspace/Lucene-Solr-NightlyTests-trunk/solr/build/solr-core/test/J1/OpenCloseCoreStressTest_/00002_core/data/index' doesn't exist. Creating new index...
[junit4:junit4]   2> 1208 T2986 oasc.CachingDirectoryFactory.get return new directory for /usr/home/hudson/hudson-slave/workspace/Lucene-Solr-NightlyTests-trunk/solr/build/solr-core/test/J1/OpenCloseCoreStressTest_/00002_core/data/index
[junit4:junit4]   2> 1208 T2994 oasc.SolrCore.initIndex WARNING [00016_core] Solr index directory '/usr/home/hudson/hudson-slave/workspace/Lucene-Solr-NightlyTests-trunk/solr/build/solr-core/test/J1/OpenCloseCoreStressTest_/00016_core/data/index' doesn't exist. Creating new index...
[junit4:junit4]   2> 1209 T3005 oasc.SolrConfig.<init> Loaded SolrConfig: solrconfig-minimal.xml
[junit4:junit4]   2> 1210 T2994 oasc.CachingDirectoryFactory.get return new directory for /usr/home/hudson/hudson-slave/workspace/Lucene-Solr-NightlyTests-trunk/solr/build/solr-core/test/J1/OpenCloseCoreStressTest_/00016_core/data/index
[junit4:junit4]   2> 1215 T3005 oass.IndexSchema.readSchema Reading Solr Schema
[junit4:junit4]   2> 1216 T3000 oasc.SolrConfig.<init> Loaded SolrConfig: solrconfig-minimal.xml
[junit4:junit4]   2> 1221 T3000 oass.IndexSchema.readSchema Reading Solr Schema
[junit4:junit4]   2> 1231 T3009 oasc.SolrConfig.<init> Loaded SolrConfig: solrconfig-minimal.xml
[junit4:junit4]   2> 1234 T3013 oasc.SolrConfig.<init> Loaded SolrConfig: solrconfig-minimal.xml
[junit4:junit4]   2> 1240 T3013 oass.IndexSchema.readSchema Reading Solr Schema
[junit4:junit4]   2> 1242 T3009 oass.IndexSchema.readSchema Reading Solr Schema
[junit4:junit4]   2> 1246 T2995 oashl.XMLLoader.init xsltCacheLifetimeSeconds=60
[junit4:junit4]   2> 1247 T2957 oashl.XMLLoader.init xsltCacheLifetimeSeconds=60
[junit4:junit4]   2> 1248 T2956 oashl.XMLLoader.init xsltCacheLifetimeSeconds=60
[junit4:junit4]   2> 1249 T2997 oashl.XMLLoader.init xsltCacheLifetimeSeconds=60
[junit4:junit4]   2> 1250 T2996 oashl.XMLLoader.init xsltCacheLifetimeSeconds=60
[junit4:junit4]   2> 1253 T2958 oashl.XMLLoader.init xsltCacheLifetimeSeconds=60
[junit4:junit4]   2> 1255 T2955 oashl.XMLLoader.init xsltCacheLifetimeSeconds=60
[junit4:junit4]   2> 1255 T2986 oasc.SolrDeletionPolicy.onCommit SolrDeletionPolicy.onCommit: commits:num=1
[junit4:junit4]   2> 		commit{dir=MockDirWrapper(org.apache.lucene.store.MMapDirectory@/usr/home/hudson/hudson-slave/workspace/Lucene-Solr-NightlyTests-trunk/solr/build/solr-core/test/J1/OpenCloseCoreStressTest_/00002_core/data/index lockFactory=org.apache.lucene.store.NativeFSLockFactory@75e6b3d8),segFN=segments_1,generation=1,filenames=[segments_1]
[junit4:junit4]   2> 1256 T2960 oashl.XMLLoader.init xsltCacheLifetimeSeconds=60
[junit4:junit4]   2> 1256 T2986 oasc.SolrDeletionPolicy.updateCommits newest commit = 1[segments_1]
[junit4:junit4]   2> 1259 T2994 oasc.SolrDeletionPolicy.onCommit SolrDeletionPolicy.onCommit: commits:num=1
[junit4:junit4]   2> 		commit{dir=MockDirWrapper(org.apache.lucene.store.MMapDirectory@/usr/home/hudson/hudson-slave/workspace/Lucene-Solr-NightlyTests-trunk/solr/build/solr-core/test/J1/OpenCloseCoreStressTest_/00016_core/data/index lockFactory=org.apache.lucene.store.NativeFSLockFactory@7d296660),segFN=segments_1,generation=1,filenames=[segments_1]
[junit4:junit4]   2> 1259 T2994 oasc.SolrDeletionPolicy.updateCommits newest commit = 1[segments_1]
[junit4:junit4]   2> 1263 T2986 oasc.SolrCore.initWriters created json: solr.JSONResponseWriter
[junit4:junit4]   2> 1264 T2954 oashl.XMLLoader.init xsltCacheLifetimeSeconds=60
[junit4:junit4]   2> 1265 T2986 oasc.RequestHandlers.initHandlersFromConfig created /admin/: solr.admin.AdminHandlers
[junit4:junit4]   2> 1266 T2986 oasc.RequestHandlers.initHandlersFromConfig created /select: solr.SearchHandler
[junit4:junit4]   2> 1267 T2986 oasc.RequestHandlers.initHandlersFromConfig created /update: solr.UpdateRequestHandler
[junit4:junit4]   2> 1270 T2994 oasc.SolrCore.initWriters created json: solr.JSONResponseWriter
[junit4:junit4]   2> 1272 T2994 oasc.RequestHandlers.initHandlersFromConfig created /admin/: solr.admin.AdminHandlers
[junit4:junit4]   2> 1273 T2994 oasc.RequestHandlers.initHandlersFromConfig created /select: solr.SearchHandler
[junit4:junit4]   2> 1274 T2994 oasc.RequestHandlers.initHandlersFromConfig created /update: solr.UpdateRequestHandler
[junit4:junit4]   2> 1307 T2996 oass.SolrIndexSearcher.<init> Opening Searcher@2186464c main
[junit4:junit4]   2> 1308 T2996 oasc.SolrCore.registerSearcher [00013_core] Registered new searcher Searcher@2186464c main{StandardDirectoryReader(segments_1:1)}
[junit4:junit4]   2> 1309 T2996 oasu.CommitTracker.<init> Hard AutoCommit: disabled
[junit4:junit4]   2> 1309 T2996 oasu.CommitTracker.<init> Soft AutoCommit: disabled
[junit4:junit4]   2> 1310 T2995 oass.SolrIndexSearcher.<init> Opening Searcher@7c709f7a main
[junit4:junit4]   2> 1310 T2957 oass.SolrIndexSearcher.<init> Opening Searcher@63d75c31 main
[junit4:junit4]   2> 1311 T2995 oasc.SolrCore.registerSearcher [00012_core] Registered new searcher Searcher@7c709f7a main{StandardDirectoryReader(segments_1:1)}
[junit4:junit4]   2> 1311 T2957 oasc.SolrCore.registerSearcher [00000_core] Registered new searcher Searcher@63d75c31 main{StandardDirectoryReader(segments_1:1)}
[junit4:junit4]   2> 1312 T2957 oasu.CommitTracker.<init> Hard AutoCommit: disabled
[junit4:junit4]   2> 1313 T2957 oasu.CommitTracker.<init> Soft AutoCommit: disabled
[junit4:junit4]   2> 1315 T2956 oass.SolrIndexSearcher.<init> Opening Searcher@3202ebeb main
[junit4:junit4]   2> 1316 T2956 oasc.SolrCore.registerSearcher [00014_core] Registered new searcher Searcher@3202ebeb main{StandardDirectoryReader(segments_1:1)}
[junit4:junit4]   2> 1316 T2960 oass.SolrIndexSearcher.<init> Opening Searcher@2ac0c47c main
[junit4:junit4]   2> 1317 T2956 oasu.CommitTracker.<init> Hard AutoCommit: disabled
[junit4:junit4]   2> 1317 T2956 oasu.CommitTracker.<init> Soft AutoCommit: disabled
[junit4:junit4]   2> 1317 T2996 oasc.CoreMaps.putTransientCore Opening transient core 00013_core
[junit4:junit4]   2> 1317 T2960 oasc.SolrCore.registerSearcher [00017_core] Registered new searcher Searcher@2ac0c47c main{StandardDirectoryReader(segments_1:1)}
[junit4:junit4]   2> 1318 T2995 oasu.CommitTracker.<init> Hard AutoCommit: disabled
[junit4:junit4]   2> 1317 T2997 oass.SolrIndexSearcher.<init> Opening Searcher@a730863 main
[junit4:junit4]   2> 1318 T2996 oasc.CoreContainer.registerCore registering core: 00013_core
[junit4:junit4]   2> 1319 T2954 oass.SolrIndexSearcher.<init> Opening Searcher@75ed32be main
[junit4:junit4]   2> 1318 T2995 oasu.CommitTracker.<init> Soft AutoCommit: disabled
[junit4:junit4]   2> 1318 T2960 oasu.CommitTracker.<init> Hard AutoCommit: disabled
[junit4:junit4]   2> 1320 T2960 oasu.CommitTracker.<init> Soft AutoCommit: disabled
[junit4:junit4]   2> 1322 T2954 oasc.SolrCore.registerSearcher [00019_core] Registered new searcher Searcher@75ed32be main{StandardDirectoryReader(segments_1:1)}
[junit4:junit4]   2> 1323 T2955 oass.SolrIndexSearcher.<init> Opening Searcher@37da93ab main
[junit4:junit4]   2> 1323 T2957 oasc.CoreMaps.putTransientCore Opening transient core 00000_core
[junit4:junit4]   2> 1323 T2954 oasu.CommitTracker.<init> Hard AutoCommit: disabled
[junit4:junit4]   2> 1324 T2957 oasc.CoreContainer.registerCore registering core: 00000_core
[junit4:junit4]   2> 1325 T2954 oasu.CommitTracker.<init> Soft AutoCommit: disabled
[junit4:junit4]   2> 1325 T2955 oasc.SolrCore.registerSearcher [00008_core] Registered new searcher Searcher@37da93ab main{StandardDirectoryReader(segments_1:1)}
[junit4:junit4]   2> 1324 T2958 oass.SolrIndexSearcher.<init> Opening Searcher@284d495b main
[junit4:junit4]   2> 1325 T2997 oasc.SolrCore.registerSearcher [00015_core] Registered new searcher Searcher@a730863 main{StandardDirectoryReader(segments_1:1)}
[junit4:junit4]   2> 1326 T2955 oasu.CommitTracker.<init> Hard AutoCommit: disabled
[junit4:junit4]   2> 1326 T2997 oasu.CommitTracker.<init> Hard AutoCommit: disabled
[junit4:junit4]   2> 1327 T2955 oasu.CommitTracker.<init> Soft AutoCommit: disabled
[junit4:junit4]   2> 1327 T2997 oasu.CommitTracker.<init> Soft AutoCommit: disabled
[junit4:junit4]   2> 1328 T3003 oass.IndexSchema.readSchema Schema name=tiny
[junit4:junit4]   2> 1327 T3005 oass.IndexSchema.readSchema Schema name=tiny
[junit4:junit4]   2> 1329 T3000 oass.IndexSchema.readSchema Schema name=tiny
[junit4:junit4]   2> 1328 T3013 oass.IndexSchema.readSchema Schema name=tiny
[junit4:junit4]   2> 1327 T2958 oasc.SolrCore.registerSearcher [00005_core] Registered new searcher Searcher@284d495b main{StandardDirectoryReader(segments_1:1)}
[junit4:junit4]   2> 1330 T3014 oass.IndexSchema.readSchema Schema name=tiny
[junit4:junit4]   2> 1329 T3004 oass.IndexSchema.readSchema Schema name=tiny
[junit4:junit4]   2> 1330 T2958 oasu.CommitTracker.<init> Hard AutoCommit: disabled
[junit4:junit4]   2> 1330 T3009 oass.IndexSchema.readSchema Schema name=tiny
[junit4:junit4]   2> 1331 T2958 oasu.CommitTracker.<init> Soft AutoCommit: disabled
[junit4:junit4]   2> 1331 T2995 oasc.CoreMaps.putTransientCore Opening transient core 00012_core
[junit4:junit4]   2> 1332 T2995 oasc.CoreContainer.registerCore registering core: 00012_core
[junit4:junit4]   2> 1332 T2956 oasc.CoreMaps.putTransientCore Opening transient core 00014_core
[junit4:junit4]   2> 1333 T2956 oasc.CoreContainer.registerCore registering core: 00014_core
[junit4:junit4]   2> ASYNC  NEW_CORE C141 name=00013_core org.apache.solr.core.SolrCore@cbf0536
[junit4:junit4]   2> 1347 T2996 C141 oasc.SolrDeletionPolicy.onInit SolrDeletionPolicy.onInit: commits:num=1
[junit4:junit4]   2> 		commit{dir=MockDirWrapper(org.apache.lucene.store.MMapDirectory@/usr/home/hudson/hudson-slave/workspace/Lucene-Solr-NightlyTests-trunk/solr/build/solr-core/test/J1/OpenCloseCoreStressTest_/00013_core/data/index lockFactory=org.apache.lucene.store.NativeFSLockFactory@24ad93a0),segFN=segments_1,generation=1,filenames=[segments_1]
[junit4:junit4]   2> 1348 T2996 C141 oasc.SolrDeletionPolicy.updateCommits newest commit = 1[segments_1]
[junit4:junit4]   2> 1349 T2960 oasc.CoreMaps.putTransientCore Opening transient core 00017_core
[junit4:junit4]   2> 1349 T2960 oasc.CoreContainer.registerCore registering core: 00017_core
[junit4:junit4]   2> ASYNC  NEW_CORE C142 name=00000_core org.apache.solr.core.SolrCore@e7263f4
[junit4:junit4]   2> 1359 T2957 C142 oasc.SolrDeletionPolicy.onInit SolrDeletionPolicy.onInit: commits:num=1
[junit4:junit4]   2> 		commit{dir=MockDirWrapper(org.apache.lucene.store.MMapDirectory@/usr/home/hudson/hudson-slave/workspace/Lucene-Solr-NightlyTests-trunk/solr/build/solr-core/test/J1/OpenCloseCoreStressTest_/00000_core/data/index lockFactory=org.apache.lucene.store.NativeFSLockFactory@4a4e0809),segFN=segments_1,generation=1,filenames=[segments_1]
[junit4:junit4]   2> 1359 T2954 oasc.CoreMaps.putTransientCore Opening transient core 00019_core
[junit4:junit4]   2> 1359 T2957 C142 oasc.SolrDeletionPolicy.updateCommits newest commit = 1[segments_1]
[junit4:junit4]   2> 1360 T2954 oasc.CoreContainer.registerCore registering core: 00019_core
[junit4:junit4]   2> 1361 T2996 C141 UPDATE [00013_core] webapp=/solr path=/update params={wt=javabin&version=2} {add=[id12]} 0 29
[junit4:junit4]   2> 1370 T2997 oasc.CoreMaps.putTransientCore Opening transient core 00015_core
[junit4:junit4]   2> 1371 T2997 oasc.CoreContainer.registerCore registering core: 00015_core
[junit4:junit4]   2> 1372 T2958 oasc.CoreMaps.putTransientCore Opening transient core 00005_core
[junit4:junit4]   2> 1372 T2958 oasc.CoreContainer.registerCore registering core: 00005_core
[junit4:junit4]   2> ASYNC  NEW_CORE C143 name=00014_core org.apache.solr.core.SolrCore@20f2442e
[junit4:junit4]   2> 1374 T2956 C143 oasc.SolrDeletionPolicy.onInit SolrDeletionPolicy.onInit: commits:num=1
[junit4:junit4]   2> 		commit{dir=MockDirWrapper(org.apache.lucene.store.MMapDirectory@/usr/home/hudson/hudson-slave/workspace/Lucene-Solr-NightlyTests-trunk/solr/build/solr-core/test/J1/OpenCloseCoreStressTest_/00014_core/data/index lockFactory=org.apache.lucene.store.NativeFSLockFactory@14b7db7e),segFN=segments_1,generation=1,filenames=[segments_1]
[junit4:junit4]   2> 1374 T2956 C143 oasc.SolrDeletionPolicy.updateCommits newest commit = 1[segments_1]
[junit4:junit4]   2> 1375 T2955 oasc.CoreMaps.putTransientCore Opening transient core 00008_core
[junit4:junit4]   2> 1375 T2955 oasc.CoreContainer.registerCore registering core: 00008_core
[junit4:junit4]   2> 1380 T2957 C142 UPDATE [00000_core] webapp=/solr path=/update params={wt=javabin&version=2} {add=[id5]} 0 40
[junit4:junit4]   2> ASYNC  NEW_CORE C144 name=00012_core org.apache.solr.core.SolrCore@11967031
[junit4:junit4]   2> 1385 T2995 C144 oasc.SolrDeletionPolicy.onInit SolrDeletionPolicy.onInit: commits:num=1
[junit4:junit4]   2> 		commit{dir=MockDirWrapper(org.apache.lucene.store.MMapDirectory@/usr/home/hudson/hudson-slave/workspace/Lucene-Solr-NightlyTests-trunk/solr/build/solr-core/test/J1/OpenCloseCoreStressTest_/00012_core/data/index lockFactory=org.apache.lucene.store.NativeFSLockFactory@6fb5bd0e),segFN=segments_1,generation=1,filenames=[segments_1]
[junit4:junit4]   2> 1386 T2995 C144 oasc.SolrDeletionPolicy.updateCommits newest commit = 1[segments_1]
[junit4:junit4]   2> 1393 T2998 C143 UPDATE [00014_core] webapp=/solr path=/update params={wt=javabin&version=2} {add=[id14]} 0 32
[junit4:junit4]   2> 1393 T2956 C143 UPDATE [00014_core] webapp=/solr path=/update params={wt=javabin&version=2} {add=[id4]} 0 35
[junit4:junit4]   2> 1394 T2994 oashl.XMLLoader.init xsltCacheLifetimeSeconds=60
[junit4:junit4]   2> 1394 T2986 oashl.XMLLoader.init xsltCacheLifetimeSeconds=60
[junit4:junit4]   2> ASYNC  NEW_CORE C145 name=00017_core org.apache.solr.core.SolrCore@64206cad
[junit4:junit4]   2> 1397 T2960 C145 oasc.SolrDeletionPolicy.onInit SolrDeletionPolicy.onInit: commits:num=1
[junit4:junit4]   2> 		commit{dir=MockDirWrapper(org.apache.lucene.store.MMapDirectory@/usr/home/hudson/hudson-slave/workspace/Lucene-Solr-NightlyTests-trunk/solr/build/solr-core/test/J1/OpenCloseCoreStressTest_/00017_core/data/index lockFactory=org.apache.lucene.store.NativeFSLockFactory@5c5cd3),segFN=segments_1,generation=1,filenames=[segments_1]
[junit4:junit4]   2> 1398 T2960 C145 oasc.SolrDeletionPolicy.updateCommits newest commit = 1[segments_1]
[junit4:junit4]   2> 1400 T2995 C144 UPDATE [00012_core] webapp=/solr path=/update params={wt=javabin&version=2} {add=[id9]} 0 36
[junit4:junit4]   2> ASYNC  NEW_CORE C146 name=00019_core org.apache.solr.core.SolrCore@64b02b1d
[junit4:junit4]   2> 1401 T2954 C146 oasc.SolrDeletionPolicy.onInit SolrDeletionPolicy.onInit: commits:num=1
[junit4:junit4]   2> 		commit{dir=MockDirWrapper(org.apache.lucene.store.MMapDirectory@/usr/home/hudson/hudson-slave/workspace/Lucene-Solr-NightlyTests-trunk/solr/build/solr-core/test/J1/OpenCloseCoreStressTest_/00019_core/data/index lockFactory=org.apache.lucene.store.NativeFSLockFactory@240ad0a),segFN=segments_1,generation=1,filenames=[segments_1]
[junit4:junit4]   2> 1402 T2954 C146 oasc.SolrDeletionPolicy.updateCommits newest commit = 1[segments_1]
[junit4:junit4]   2> 1402 T3010 C144 REQ [00012_core] webapp=/solr path=/select params={q=*:*&wt=javabin&qt=/select&version=2} hits=0 status=0 QTime=1 
[junit4:junit4]   2> 1403 T3001 C146 REQ [00019_core] webapp=/solr path=/select params={q=*:*&wt=javabin&qt=/select&version=2} hits=0 status=0 QTime=1 
[junit4:junit4]   2> 1403 T3006 C145 REQ [00017_core] webapp=/solr path=/select params={q=*:*&wt=javabin&qt=/select&version=2} hits=0 status=0 QTime=1 
[junit4:junit4]   2> 1404 T3002 C143 REQ [00014_core] webapp=/solr path=/select params={q=*:*&wt=javabin&qt=/select&version=2} hits=0 status=0 QTime=0 
[junit4:junit4]   2> ASYNC  NEW_CORE C147 name=00015_core org.apache.solr.core.SolrCore@7f50f5c3
[junit4:junit4]   2> 1405 T3012 C147 REQ [00015_core] webapp=/solr path=/select params={q=*:*&wt=javabin&qt=/select&version=2} hits=0 status=0 QTime=0 
[junit4:junit4]   2> 1405 T2960 C145 UPDATE [00017_core] webapp=/solr path=/update params={wt=javabin&version=2} {add=[id2]} 0 22
[junit4:junit4]   2> 1407 T2954 C146 UPDATE [00019_core] webapp=/solr path=/update params={wt=javabin&version=2} {add=[id1]} 0 20
[junit4:junit4]   2> 1411 T2954 C145 UPDATE [00017_core] webapp=/solr path=/update params={wt=javabin&version=2} {add=[id22]} 0 1
[junit4:junit4]   2> ASYNC  NEW_CORE C148 name=00008_core org.apache.solr.core.SolrCore@1c371682
[junit4:junit4]   2> 1411 T2999 C148 oasc.SolrDeletionPolicy.onInit SolrDeletionPolicy.onInit: commits:num=1
[junit4:junit4]   2> 		commit{dir=MockDirWrapper(org.apache.lucene.store.MMapDirectory@/usr/home/hudson/hudson-slave/workspace/Lucene-Solr-NightlyTests-trunk/solr/build/solr-core/test/J1/OpenCloseCoreStressTest_/00008_core/data/index lockFactory=org.apache.lucene.store.NativeFSLockFactory@57d4357),segFN=segments_1,generation=1,filenames=[segments_1]
[junit4:junit4]   2> 1412 T2999 C148 oasc.SolrDeletionPolicy.updateCommits newest commit = 1[segments_1]
[junit4:junit4]   2> 1413 T2994 oass.SolrIndexSearcher.<init> Opening Searcher@13c4f458 main
[junit4:junit4]   2> ASYNC  NEW_CORE C149 name=00005_core org.apache.solr.core.SolrCore@48f1b6e
[junit4:junit4]   2> 1416 T2990 C149 oasc.SolrDeletionPolicy.onInit SolrDeletionPolicy.onInit: commits:num=1
[junit4:junit4]   2> 		commit{dir=MockDirWrapper(org.apache.lucene.store.MMapDirectory@/usr/home/hudson/hudson-slave/workspace/Lucene-Solr-NightlyTests-trunk/solr/build/solr-core/test/J1/OpenCloseCoreStressTest_/00005_core/data/index lockFactory=org.apache.lucene.store.NativeFSLockFactory@3a79526c),segFN=segments_1,generation=1,filenames=[segments_1]
[junit4:junit4]   2> 1416 T2994 oasc.SolrCore.registerSearcher [00016_core] Registered new searcher Searcher@13c4f458 main{StandardDirectoryReader(segments_1:1)}
[junit4:junit4]   2> 1416 T2997 C147 oasc.SolrDeletionPolicy.onInit SolrDeletionPolicy.onInit: commits:num=1
[junit4:junit4]   2> 		commit{dir=MockDirWrapper(org.apache.lucene.store.MMapDirectory@/usr/home/hudson/hudson-slave/workspace/Lucene-Solr-NightlyTests-trunk/solr/build/solr-core/test/J1/OpenCloseCoreStressTest_/00015_core/data/index lockFactory=org.apache.lucene.store.NativeFSLockFactory@62d00791),segFN=segments_1,generation=1,filenames=[segments_1]
[junit4:junit4]   2> 1417 T2994 oasu.CommitTracker.<init> Hard AutoCommit: disabled
[junit4:junit4]   2> 1417 T2986 oass.SolrIndexSearcher.<init> Opening Searcher@36297348 main
[junit4:junit4]   2> 1417 T2990 C149 oasc.SolrDeletionPolicy.updateCommits newest commit = 1[segments_1]
[junit4:junit4]   2> 1417 T2994 oasu.CommitTracker.<init> Soft AutoCommit: disabled
[junit4:junit4]   2> 1417 T2997 C147 oasc.SolrDeletionPolicy.updateCommits newest commit = 1[segments_1]
[junit4:junit4]   2> 1419 T2986 oasc.SolrCore.registerSearcher [00002_core] Registered new searcher Searcher@36297348 main{StandardDirectoryReader(segments_1:1)}
[junit4:junit4]   2> 1420 T2986 oasu.CommitTracker.<init> Hard AutoCommit: disabled
[junit4:junit4]   2> 1430 T2986 oasu.CommitTracker.<init> Soft AutoCommit: disabled
[junit4:junit4]   2> 1432 T2997 C147 UPDATE [00015_core] webapp=/solr path=/update params={wt=javabin&version=2} {add=[id13]} 0 27
[junit4:junit4]   2> 1432 T2959 C148 UPDATE [00008_core] webapp=/solr path=/update params={wt=javabin&version=2} {add=[id10]} 0 29
[junit4:junit4]   2> 1432 T2999 C148 UPDATE [00008_core] webapp=/solr path=/update params={wt=javabin&version=2} {add=[id15]} 0 34
[junit4:junit4]   2> 1432 T2955 C148 UPDATE [00008_core] webapp=/solr path=/update params={wt=javabin&version=2} {add=[id6]} 0 27
[junit4:junit4]   2> 1434 T2994 oasc.CoreMaps.putTransientCore Opening transient core 00016_core
[junit4:junit4]   2> 1434 T2958 C149 UPDATE [00005_core] webapp=/solr path=/update params={wt=javabin&version=2} {add=[id3]} 0 29
[junit4:junit4]   2> 1435 T2994 oasc.CoreContainer.registerCore registering core: 00016_core
[junit4:junit4]   2> 1434 T2990 C149 UPDATE [00005_core] webapp=/solr path=/update params={wt=javabin&version=2} {add=[id7]} 0 30
[junit4:junit4]   2> 1435 T2955 oasc.CoreContainer.create Creating SolrCore '00011_core' using instanceDir: /usr/home/hudson/hudson-slave/workspace/Lucene-Solr-NightlyTests-trunk/solr/build/solr-core/test/J1/./OpenCloseCoreStressTest_/00011_core
[junit4:junit4]   2> 1436 T2997 C144 UPDATE [00012_core] webapp=/solr path=/update params={wt=javabin&version=2} {add=[id24]} 0 1
[junit4:junit4]   2> 1436 T2955 oasc.SolrResourceLoader.<init> new SolrResourceLoader for directory: '/usr/home/hudson/hudson-slave/workspace/Lucene-Solr-NightlyTests-trunk/solr/build/solr-core/test/J1/./OpenCloseCoreStressTest_/00011_core/'
[junit4:junit4]   2> 1436 T2959 oasc.CoreContainer.create Creating SolrCore '00001_core' using instanceDir: /usr/home/hudson/hudson-slave/workspace/Lucene-Solr-NightlyTests-trunk/solr/build/solr-core/test/J1/./OpenCloseCoreStressTest_/00001_core
[junit4:junit4]   2> 1437 T2999 C146 UPDATE [00019_core] webapp=/solr path=/update params={wt=javabin&version=2} {add=[id27]} 0 1
[junit4:junit4]   2> 1438 T2986 oasc.CoreMaps.putTransientCore Opening transient core 00002_core
[junit4:junit4]   2> 1439 T2959 oasc.SolrResourceLoader.<init> new SolrResourceLoader for directory: '/usr/home/hudson/hudson-slave/workspace/Lucene-Solr-NightlyTests-trunk/solr/build/solr-core/test/J1/./OpenCloseCoreStressTest_/00001_core/'
[junit4:junit4]   2> 1439 T2986 oasc.CoreContainer.registerCore registering core: 00002_core
[junit4:junit4]   2> 1439 T2961 oasc.SolrCore.close [00013_core]  CLOSING SolrCore org.apache.solr.core.SolrCore@cbf0536
[junit4:junit4]   2> 1440 T2997 C146 UPDATE [00019_core] webapp=/solr path=/update params={wt=javabin&version=2} {add=[id30]} 0 1
[junit4:junit4]   2> 1443 T2997 C144 UPDATE [00012_core] webapp=/solr path=/update params={wt=javabin&version=2} {add=[id32]} 0 0
[junit4:junit4]   2> 1446 T2961 oasu.DirectUpdateHandler2.close closing DirectUpdateHandler2{commits=0,autocommits=0,soft autocommits=0,optimizes=0,rollbacks=0,expungeDeletes=0,docsPending=1,adds=1,deletesById=0,deletesByQuery=0,errors=0,cumulative_adds=1,cumulative_deletesById=0,cumulative_deletesByQuery=0,cumulative_errors=0}
[junit4:junit4]   2> 1446 T2961 oasu.SolrCoreState.decrefSolrCoreState Closing SolrCoreState
[junit4:junit4]   2> 1447 T2961 oasu.DefaultSolrCoreState.closeIndexWriter SolrCoreState ref count has reached 0 - closing IndexWriter
[junit4:junit4]   2> 1447 T2961 oasu.DefaultSolrCoreState.closeIndexWriter closing IndexWriter with IndexWriterCloser
[junit4:junit4]   2> 1448 T2997 C143 UPDATE [00014_core] webapp=/solr path=/update params={wt=javabin&version=2} {add=[id33]} 0 1
[junit4:junit4]   2> 1457 T3013 oass.IndexSchema.readSchema unique key field: id
[junit4:junit4]   2> 1457 T3005 oass.IndexSchema.readSchema unique key field: id
[junit4:junit4]   2> 1458 T3003 oass.IndexSchema.readSchema unique key field: id
[junit4:junit4]   2> ASYNC  NEW_CORE C150 name=00002_core org.apache.solr.core.SolrCore@291f68c8
[junit4:junit4]   2> 1459 T3008 C150 REQ [00002_core] webapp=/solr path=/select params={q=*:*&wt=javabin&qt=/select&version=2} hits=0 status=0 QTime=0 
[junit4:junit4]   2> 1459 T3014 oass.IndexSchema.readSchema unique key field: id
[junit4:junit4]   2> ASYNC  NEW_CORE C151 name=00016_core org.apache.solr.core.SolrCore@3054f69d
[junit4:junit4]   2> 1459 T2994 C151 oasc.SolrDeletionPolicy.onInit SolrDeletionPolicy.onInit: commits:num=1
[junit4:junit4]   2> 		commit{dir=MockDirWrapper(org.apache.lucene.store.MMapDirectory@/usr/home/hudson/hudson-slave/workspace/Lucene-Solr-NightlyTests-trunk/solr/build/solr-core/test/J1/OpenCloseCoreStressTest_/00016_core/data/index lockFactory=org.apache.lucene.store.NativeFSLockFactory@7d296660),segFN=segments_1,generation=1,filenames=[segments_1]
[junit4:junit4]   2> 1460 T2994 C151 oasc.SolrDeletionPolicy.updateCommits newest commit = 1[segments_1]
[junit4:junit4]   2> 1461 T3013 oasc.SolrCore.initDirectoryFactory org.apache.solr.core.MockFSDirectoryFactory
[junit4:junit4]   2> 1461 T3003 oasc.SolrCore.initDirectoryFactory org.apache.solr.core.MockFSDirectoryFactory
[junit4:junit4]   2> 1460 T3009 oass.IndexSchema.readSchema unique key field: id
[junit4:junit4]   2> 1462 T2995 C150 oasc.SolrDeletionPolicy.onInit SolrDeletionPolicy.onInit: commits:num=1
[junit4:junit4]   2> 		commit{dir=MockDirWrapper(org.apache.lucene.store.MMapDirectory@/usr/home/hudson/hudson-slave/workspace/Lucene-Solr-NightlyTests-trunk/solr/build/solr-core/test/J1/OpenCloseCoreStressTest_/00002_core/data/index lockFactory=org.apache.lucene.store.NativeFSLockFactory@75e6b3d8),segFN=segments_1,generation=1,filenames=[segments_1]
[junit4:junit4]   2> 1462 T3014 oasc.SolrCore.initDirectoryFactory org.apache.solr.core.MockFSDirectoryFactory
[junit4:junit4]   2> 1463 T2995 C150 oasc.SolrDeletionPolicy.updateCommits newest commit = 1[segments_1]
[junit4:junit4]   2> 1462 T3004 oass.IndexSchema.readSchema unique key field: id
[junit4:junit4]   2> 1463 T3014 oasc.SolrCore.<init> [00009_core] Opening new SolrCore at /usr/home/hudson/hudson-slave/workspace/Lucene-Solr-NightlyTests-trunk/solr/build/solr-core/test/J1/./OpenCloseCoreStressTest_/00009_core/, dataDir=/usr/home/hudson/hudson-slave/workspace/Lucene-Solr-NightlyTests-trunk/solr/build/solr-core/test/J1/OpenCloseCoreStressTest_/00009_core/data/
[junit4:junit4]   2> 1462 T3013 oasc.SolrCore.<init> [00007_core] Opening new SolrCore at /usr/home/hudson/hudson-slave/workspace/Lucene-Solr-NightlyTests-trunk/solr/build/solr-core/test/J1/./OpenCloseCoreStressTest_/00007_core/, dataDir=/usr/home/hudson/hudson-slave/workspace/Lucene-Solr-NightlyTests-trunk/solr/build/solr-core/test/J1/OpenCloseCoreStressTest_/00007_core/data/
[junit4:junit4]   2> 1462 T3005 oasc.SolrCore.initDirectoryFactory org.apache.solr.core.MockFSDirectoryFactory
[junit4:junit4]   2> 1464 T3014 oasc.JmxMonitoredMap.<init> JMX monitoring is enabled. Adding Solr mbeans to JMX Server: com.sun.jmx.mbeanserver.JmxMBeanServer@33192410
[junit4:junit4]   2> 1462 T3003 oasc.SolrCore.<init> [00006_core] Opening new SolrCore at /usr/home/hudson/hudson-slave/workspace/Lucene-Solr-NightlyTests-trunk/solr/build/solr-core/test/J1/./OpenCloseCoreStressTest_/00006_core/, dataDir=/usr/home/hudson/hudson-slave/workspace/Lucene-Solr-NightlyTests-trunk/solr/build/solr-core/test/J1/OpenCloseCoreStressTest_/00006_core/data/
[junit4:junit4]   2> 1465 T3009 oasc.SolrCore.initDirectoryFactory org.apache.solr.core.MockFSDirectoryFactory
[junit4:junit4]   2> 1465 T2954 C151 UPDATE [00016_core] webapp=/solr path=/update params={wt=javabin&version=2} {add=[id23]} 0 14
[junit4:junit4]   2> 1465 T3014 oasc.SolrCore.initDirectoryFactory org.apache.solr.core.MockFSDirectoryFactory
[junit4:junit4]   2> 1464 T3000 oass.IndexSchema.readSchema unique key field: id
[junit4:junit4]   2> 1465 T2994 C151 UPDATE [00016_core] webapp=/solr path=/update params={wt=javabin&version=2} {add=[id11]} 0 14
[junit4:junit4]   2> 1465 T3005 oasc.SolrCore.<init> [00004_core] Opening new SolrCore at /usr/home/hudson/hudson-slave/workspace/Lucene-Solr-NightlyTests-trunk/solr/build/solr-core/test/J1/./OpenCloseCoreStressTest_/00004_core/, dataDir=/usr/home/hudson/hudson-slave/workspace/Lucene-Solr-NightlyTests-trunk/solr/build/solr-core/test/J1/OpenCloseCoreStressTest_/00004_core/data/
[junit4:junit4]   2> 1466 T3013 oasc.JmxMonitoredMap.<init> JMX monitoring is enabled. Adding Solr mbeans to JMX Server: com.sun.jmx.mbeanserver.JmxMBeanServer@33192410
[junit4:junit4]   2> 1466 T3003 oasc.JmxMonitoredMap.<init> JMX monitoring is enabled. Adding Solr mbeans to JMX Server: com.sun.jmx.mbeanserver.JmxMBeanServer@33192410
[junit4:junit4]   2> 1466 T3009 oasc.SolrCore.<init> [00010_core] Opening new SolrCore at /usr/home/hudson/hudson-slave/workspace/Lucene-Solr-NightlyTests-trunk/solr/build/solr-core/test/J1/./OpenCloseCoreStressTest_/00010_core/, dataDir=/usr/home/hudson/hudson-slave/workspace/Lucene-Solr-NightlyTests-trunk/solr/build/solr-core/test/J1/OpenCloseCoreStressTest_/00010_core/data/
[junit4:junit4]   2> 1466 T3004 oasc.SolrCore.initDirectoryFactory org.apache.solr.core.MockFSDirectoryFactory
[junit4:junit4]   2> 1467 T3014 oasc.CachingDirectoryFactory.get return new directory for /usr/home/hudson/hudson-slave/workspace/Lucene-Solr-NightlyTests-trunk/solr/build/solr-core/test/J1/OpenCloseCoreStressTest_/00009_core/data
[junit4:junit4]   2> 1467 T3009 oasc.JmxMonitoredMap.<init> JMX monitoring is enabled. Adding Solr mbeans to JMX Server: com.sun.jmx.mbeanserver.JmxMBeanServer@33192410
[junit4:junit4]   2> 1467 T3003 oasc.SolrCore.initDirectoryFactory org.apache.solr.core.MockFSDirectoryFactory
[junit4:junit4]   2> 1468 T3013 oasc.SolrCore.initDirectoryFactory org.apache.solr.core.MockFSDirectoryFactory
[junit4:junit4]   2> 1468 T3004 oasc.SolrCore.<init> [00003_core] Opening new SolrCore at /usr/home/hudson/hudson-slave/workspace/Lucene-Solr-NightlyTests-trunk/solr/build/solr-core/test/J1/./OpenCloseCoreStressTest_/00003_core/, dataDir=/usr/home/hudson/hudson-slave/workspace/Lucene-Solr-NightlyTests-trunk/solr/build/solr-core/test/J1/OpenCloseCoreStressTest_/00003_core/data/
[junit4:junit4]   2> 1468 T3014 oasc.SolrCore.getNewIndexDir New index directory detected: old=null new=/usr/home/hudson/hudson-slave/workspace/Lucene-Solr-NightlyTests-trunk/solr/build/solr-core/test/J1/OpenCloseCoreStressTest_/00009_core/data/index/
[junit4:junit4]   2> 1467 T3005 oasc.JmxMonitoredMap.<init> JMX monitoring is enabled. Adding Solr mbeans to JMX Server: com.sun.jmx.mbeanserver.JmxMBeanServer@33192410
[junit4:junit4]   2> 1468 T2986 C150 UPDATE [00002_core] webapp=/solr path=/update params={wt=javabin&version=2} {add=[id8]} 0 11
[junit4:junit4]   2> 1468 T2995 C150 UPDATE [00002_core] webapp=/solr path=/update params={wt=javabin&version=2} {add=[id20]} 0 12
[junit4:junit4]   2> 1469 T3005 oasc.SolrCore.initDirectoryFactory org.apache.solr.core.MockFSDirectoryFactory
[junit4:junit4]   2> 1468 T2957 C150 UPDATE [00002_core] webapp=/solr path=/update params={wt=javabin&version=2} {add=[id17]} 0 11
[junit4:junit4]   2> 1468 T3000 oasc.SolrCore.initDirectoryFactory org.apache.solr.core.MockFSDirectoryFactory
[junit4:junit4]   2> 1470 T3004 oasc.JmxMonitoredMap.<init> JMX monitoring is enabled. Adding Solr mbeans to JMX Server: com.sun.jmx.mbeanserver.JmxMBeanServer@33192410
[junit4:junit4]   2> 1469 T3014 oasc.SolrCore.initIndex WARNING [00009_core] Solr index directory '/usr/home/hudson/hudson-slave/workspace/Lucene-Solr-NightlyTests-trunk/solr/build/solr-core/test/J1/OpenCloseCoreStressTest_/00009_core/data/index' doesn't exist. Creating new index...
[junit4:junit4]   2> 1470 T3013 oasc.CachingDirectoryFactory.get return new directory for /usr/home/hudson/hudson-slave/workspace/Lucene-Solr-NightlyTests-trunk/solr/build/solr-core/test/J1/OpenCloseCoreStressTest_/00007_core/data
[junit4:junit4]   2> 1470 T3003 oasc.CachingDirectoryFactory.get return new directory for /usr/home/hudson/hudson-slave/workspace/Lucene-Solr-NightlyTests-trunk/solr/build/solr-core/test/J1/OpenCloseCoreStressTest_/00006_core/data
[junit4:junit4]   2> 1470 T3000 oasc.SolrCore.<init> [00018_core] Opening new SolrCore at /usr/home/hudson/hudson-slave/workspace/Lucene-Solr-NightlyTests-trunk/solr/build/solr-core/test/J1/./OpenCloseCoreStressTest_/00018_core/, dataDir=/usr/home/hudson/hudson-slave/workspace/Lucene-Solr-NightlyTests-trunk/solr/build/solr-core/test/J1/OpenCloseCoreStressTest_/00018_core/data/
[junit4:junit4]   2> 1470 T3004 oasc.SolrCore.initDirectoryFactory org.apache.solr.core.MockFSDirectoryFactory
[junit4:junit4]   2> 1470 T3005 oasc.CachingDirectoryFactory.get return new directory for /usr/home/hudson/hudson-slave/workspace/Lucene-Solr-NightlyTests-trunk/solr/build/solr-core/test/J1/OpenCloseCoreStressTest_/00004_core/data
[junit4:junit4]   2> 1471 T3000 oasc.JmxMonitoredMap.<init> JMX monitoring is enabled. Adding Solr mbeans to JMX Server: com.sun.jmx.mbeanserver.JmxMBeanServer@33192410
[junit4:junit4]   2> 1470 T3009 oasc.SolrCore.initDirectoryFactory org.apache.solr.core.MockFSDirectoryFactory
[junit4:junit4]   2> 1471 T3014 oasc.CachingDirectoryFactory.get return new directory for /usr/home/hudson/hudson-slave/workspace/Lucene-Solr-NightlyTests-trunk/solr/build/solr-core/test/J1/OpenCloseCoreStressTest_/00009_core/data/index
[junit4:junit4]   2> 1471 T3000 oasc.SolrCore.initDirectoryFactory org.apache.solr.core.MockFSDirectoryFactory
[junit4:junit4]   2> 1472 T3013 oasc.SolrCore.getNewIndexDir New index directory detected: old=null new=/usr/home/hudson/hudson-slave/workspace/Lucene-Solr-NightlyTests-trunk/solr/build/solr-core/test/J1/OpenCloseCoreStressTest_/00007_core/data/index/
[junit4:junit4]   2> 1472 T3005 oasc.SolrCore.getNewIndexDir New index directory detected: old=null new=/usr/home/hudson/hudson-slave/workspace/Lucene-Solr-NightlyTests-trunk/solr/build/solr-core/test/J1/OpenCloseCoreStressTest_/00004_core/data/index/
[junit4:junit4]   2> 1472 T3003 oasc.SolrCore.getNewIndexDir New index directory detected: old=null new=/usr/home/hudson/hudson-slave/workspace/Lucene-Solr-NightlyTests-trunk/solr/build/solr-core/test/J1/OpenCloseCoreStressTest_/00006_core/data/index/
[junit4:junit4]   2> 1473 T3000 oasc.CachingDirectoryFactory.get return new directory for /usr/home/hudson/hudson-slave/workspace/Lucene-Solr-NightlyTests-trunk/solr/build/solr-core/test/J1/OpenCloseCoreStressTest_/00018_core/data
[junit4:junit4]   2> 1473 T3009 oasc.CachingDirectoryFactory.get return new directory for /usr/home/hudson/hudson-slave/workspace/Lucene-Solr-NightlyTests-trunk/solr/build/solr-core/test/J1/OpenCloseCoreStressTest_/00010_core/data
[junit4:junit4]   2> 1473 T3004 oasc.CachingDirectoryFactory.get return new directory for /usr/home/hudson/hudson-slave/workspace/Lucene-Solr-NightlyTests-trunk/solr/build/solr-core/test/J1/OpenCloseCoreStressTest_/00003_core/data
[junit4:junit4]   2> 1473 T3013 oasc.SolrCore.initIndex WARNING [00007_core] Solr index directory '/usr/home/hudson/hudson-slave/workspace/Lucene-Solr-NightlyTests-trunk/solr/build/solr-core/test/J1/OpenCloseCoreStressTest_/00007_core/data/index' doesn't exist. Creating new index...
[junit4:junit4]   2> 1473 T3005 oasc.SolrCore.initIndex WARNING [00004_core] Solr index directory '/usr/home/hudson/hudson-slave/workspace/Lucene-Solr-NightlyTests-trunk/solr/build/solr-core/test/J1/OpenCloseCoreStressTest_/00004_core/data/index' doesn't exist. Creating new index...
[junit4:junit4]   2> 1474 T3003 oasc.SolrCore.initIndex WARNING [00006_core] Solr index directory '/usr/home/hudson/hudson-slave/workspace/Lucene-Solr-NightlyTests-trunk/solr/build/solr-core/test/J1/OpenCloseCoreStressTest_/00006_core/data/index' doesn't exist. Creating new index...
[junit4:junit4]   2> 1474 T3000 oasc.SolrCore.getNewIndexDir New index directory detected: old=null new=/usr/home/hudson/hudson-slave/workspace/Lucene-Solr-NightlyTests-trunk/solr/build/solr-core/test/J1/OpenCloseCoreStressTest_/00018_core/data/index/
[junit4:junit4]   2> 1475 T3009 oasc.SolrCore.getNewIndexDir New index directory detected: old=null new=/usr/home/hudson/hudson-slave/workspace/Lucene-Solr-NightlyTests-trunk/solr/build/solr-core/test/J1/OpenCloseCoreStressTest_/00010_core/data/index/
[junit4:junit4]   2> 1475 T3005 oasc.CachingDirectoryFactory.get return new directory for /usr/home/hudson/hudson-slave/workspace/Lucene-Solr-NightlyTests-trunk/solr/build/solr-core/test/J1/OpenCloseCoreStressTest_/00004_core/data/index
[junit4:junit4]   2> 1475 T3004 oasc.SolrCore.getNewIndexDir New index directory detected: old=null new=/usr/home/hudson/hudson-slave/workspace/Lucene-Solr-NightlyTests-trunk/solr/build/solr-core/test/J1/OpenCloseCoreStressTest_/00003_core/data/index/
[junit4:junit4]   2> 1475 T3013 oasc.CachingDirectoryFactory.get return new directory for /usr/home/hudson/hudson-slave/workspace/Lucene-Solr-NightlyTests-trunk/solr/build/solr-core/test/J1/OpenCloseCoreStressTest_/00007_core/data/index
[junit4:junit4]   2> 1475 T3003 oasc.CachingDirectoryFactory.get return new directory for /usr/home/hudson/hudson-slave/workspace/Lucene-Solr-NightlyTests-trunk/solr/build/solr-core/test/J1/OpenCloseCoreStressTest_/00006_core/data/index
[junit4:junit4]   2> 1476 T3000 oasc.SolrCore.initIndex WARNING [00018_core] Solr index directory '/usr/home/hudson/hudson-slave/workspace/Lucene-Solr-NightlyTests-trunk/solr/build/solr-core/test/J1/OpenCloseCoreStressTest_/00018_core/data/index' doesn't exist. Creating new index...
[junit4:junit4]   2> 1476 T3009 oasc.SolrCore.initIndex WARNING [00010_core] Solr index directory '/usr/home/hudson/hudson-slave/workspace/Lucene-Solr-NightlyTests-trunk/solr/build/solr-core/test/J1/OpenCloseCoreStressTest_/00010_core/data/index' doesn't exist. Creating new index...
[junit4:junit4]   2> 1477 T3000 oasc.CachingDirectoryFactory.get return new directory for /usr/home/hudson/hudson-slave/workspace/Lucene-Solr-NightlyTests-trunk/solr/build/solr-core/test/J1/OpenCloseCoreStressTest_/00018_core/data/index
[junit4:junit4]   2> 1477 T3004 oasc.SolrCore.initIndex WARNING [00003_core] Solr index directory '/usr/home/hudson/hudson-slave/workspace/Lucene-Solr-NightlyTests-trunk/solr/build/solr-core/test/J1/OpenCloseCoreStressTest_/00003_core/data/index' doesn't exist. Creating new index...
[junit4:junit4]   2> 1477 T3009 oasc.CachingDirectoryFactory.get return new directory for /usr/home/hudson/hudson-slave/workspace/Lucene-Solr-NightlyTests-trunk/solr/build/solr-core/test/J1/OpenCloseCoreStressTest_/00010_core/data/index
[junit4:junit4]   2> 1478 T3004 oasc.CachingDirectoryFactory.get return new directory for /usr/home/hudson/hudson-slave/workspace/Lucene-Solr-NightlyTests-trunk/solr/build/solr-core/test/J1/OpenCloseCoreStressTest_/00003_core/data/index
[junit4:junit4]   2> 1497 T3014 oasc.SolrDeletionPolicy.onCommit SolrDeletionPolicy.onCommit: commits:num=1
[junit4:junit4]   2> 		commit{dir=MockDirWrapper(org.apache.lucene.store.MMapDirectory@/usr/home/hudson/hudson-slave/workspace/Lucene-Solr-NightlyTests-trunk/solr/build/solr-core/test/J1/OpenCloseCoreStressTest_/00009_core/data/index lockFactory=org.apache.lucene.store.NativeFSLockFactory@4328e1dc),segFN=segments_1,generation=1,filenames=[segments_1]
[junit4:junit4]   2> 1497 T3014 oasc.SolrDeletionPolicy.updateCommits newest commit = 1[segments_1]
[junit4:junit4]   2> 1499 T3014 oasc.SolrCore.initWriters created json: solr.JSONResponseWriter
[junit4:junit4]   2> 1501 T3014 oasc.RequestHandlers.initHandlersFromConfig created /admin/: solr.admin.AdminHandlers
[junit4:junit4]   2> 1501 T3014 oasc.RequestHandlers.initHandlersFromConfig created /select: solr.SearchHandler
[junit4:junit4]   2> 1502 T3014 oasc.RequestHandlers.initHandlersFromConfig created /update: solr.UpdateRequestHandler
[junit4:junit4]   2> 1506 T3001 C142 REQ [00000_core] webapp=/solr path=/select params={q=*:*&wt=javabin&qt=/select&version=2} hits=0 status=0 QTime=0 
[junit4:junit4]   2> 1506 T3010 C148 REQ [00008_core] webapp=/solr path=/select params={q=*:*&wt=javabin&qt=/select&version=2} hits=0 status=0 QTime=0 
[junit4:junit4]   2> 1507 T3002 C150 REQ [00002_core] webapp=/solr path=/select params={q=*:*&wt=javabin&qt=/select&version=2} hits=0 status=0 QTime=0 
[junit4:junit4]   2> 1507 T3006 C143 REQ [00014_core] webapp=/solr path=/select params={q=*:*&wt=javabin&qt=/select&version=2} hits=0 status=0 QTime=0 
[junit4:junit4]   2> 1509 T3005 oasc.SolrDeletionPolicy.onCommit SolrDeletionPolicy.onCommit: commits:num=1
[junit4:junit4]   2> 		commit{dir=MockDirWrapper(org.apache.lucene.store.MMapDirectory@/usr/home/hudson/hudson-slave/workspace/Lucene-Solr-NightlyTests-trunk/solr/build/solr-core/test/J1/OpenCloseCoreStressTest_/00004_core/data/index lockFactory=org.apache.lucene.store.NativeFSLockFactory@2bfb45af),segFN=segments_1,generation=1,filenames=[segments_1]
[junit4:junit4]   2> 1509 T3005 oasc.SolrDeletionPolicy.updateCommits newest commit = 1[segments_1]
[junit4:junit4]   2> 1509 T3000 oasc.SolrDeletionPolicy.onCommit SolrDeletionPolicy.onCommit: commits:num=1
[junit4:junit4]   2> 		commit{dir=MockDirWrapper(org.apache.lucene.store.MMapDirectory@/usr/home/hudson/hudson-slave/workspace/Lucene-Solr-NightlyTests-trunk/solr/build/solr-core/test/J1/OpenCloseCoreStressTest_/00018_core/data/index lockFactory=org.apache.lucene.store.NativeFSLockFactory@2560c8ea),segFN=segments_1,generation=1,filenames=[segments_1]
[junit4:junit4]   2> 1509 T3004 oasc.SolrDeletionPolicy.onCommit SolrDeletionPolicy.onCommit: commits:num=1
[junit4:junit4]   2> 		commit{dir=MockDirWrapper(org.apache.lucene.store.MMapDirectory@/usr/home/hudson/hudson-slave/workspace/Lucene-Solr-NightlyTests-trunk/solr/build/solr-core/test/J1/OpenCloseCoreStressTest_/00003_core/data/index lockFactory=org.apache.lucene.store.NativeFSLockFactory@4de2a7d7),segFN=segments_1,generation=1,filenames=[segments_1]
[junit4:junit4]   2> 1510 T3000 oasc.SolrDeletionPolicy.updateCommits newest commit = 1[segments_1]
[junit4:junit4]   2> 1510 T3004 oasc.SolrDeletionPolicy.updateCommits newest commit = 1[segments_1]
[junit4:junit4]   2> 1509 T3013 oasc.SolrDeletionPolicy.onCommit SolrDeletionPolicy.onCommit: commits:num=1
[junit4:junit4]   2> 		commit{dir=MockDirWrapper(org.apache.lucene.store.MMapDirectory@/usr/home/hudson/hudson-slave/workspace/Lucene-Solr-NightlyTests-trunk/solr/build/solr-core/test/J1/OpenCloseCoreStressTest_/00007_core/data/index lockFactory=org.apache.lucene.store.NativeFSLockFactory@2c24363c),segFN=segments_1,generation=1,filenames=[segments_1]
[junit4:junit4]   2> 1509 T3003 oasc.SolrDeletionPolicy.onCommit SolrDeletionPolicy.onCommit: commits:num=1
[junit4:junit4]   2> 		commit{dir=MockDirWrapper(org.apache.lucene.store.MMapDirectory@/usr/home/hudson/hudson-slave/workspace/Lucene-Solr-NightlyTests-trunk/solr/build/solr-core/test/J1/OpenCloseCoreStressTest_/00006_core/data/index lockFactory=org.apache.lucene.store.NativeFSLockFactory@7d64b3c7),segFN=segments_1,generation=1,filenames=[segments_1]
[junit4:junit4]   2> 1511 T3013 oasc.SolrDeletionPolicy.updateCommits newest commit = 1[segments_1]
[junit4:junit4]   2> 1511 T3003 oasc.SolrDeletionPolicy.updateCommits newest commit = 1[segments_1]
[junit4:junit4]   2> 1509 T3009 oasc.SolrDeletionPolicy.onCommit SolrDeletionPolicy.onCommit: commits:num=1
[junit4:junit4]   2> 		commit{dir=MockDirWrapper(org.apache.lucene.store.MMapDirectory@/usr/home/hudson/hudson-slave/workspace/Lucene-Solr-NightlyTests-trunk/solr/build/solr-core/test/J1/OpenCloseCoreStressTest_/00010_core/data/index lockFactory=org.apache.lucene.store.NativeFSLockFactory@318bbfe2),segFN=segments_1,generation=1,filenames=[segments_1]
[junit4:junit4]   2> 1511 T3005 oasc.SolrCore.initWriters created json: solr.JSONResponseWriter
[junit4:junit4]   2> 1510 T3012 C150 REQ [00002_core] webapp=/solr path=/select params={q=*:*&wt=javabin&qt=/select&version=2} hits=0 status=0 QTime=0 
[junit4:junit4]   2> 1512 T3009 oasc.SolrDeletionPolicy.updateCommits newest commit = 1[segments_1]
[junit4:junit4]   2> 1512 T3000 oasc.SolrCore.initWriters created json: solr.JSONResponseWriter
[junit4:junit4]   2> 1513 T3004 oasc.SolrCore.initWriters created json: solr.JSONResponseWriter
[junit4:junit4]   2> 1514 T3005 oasc.RequestHandlers.initHandlersFromConfig created /admin/: solr.admin.AdminHandlers
[junit4:junit4]   2> 1514 T3003 oasc.SolrCore.initWriters created json: solr.JSONResponseWriter
[junit4:junit4]   2> 1514 T3000 oasc.RequestHandlers.initHandlersFromConfig created /admin/: solr.admin.AdminHandlers
[junit4:junit4]   2> 1514 T3013 oasc.SolrCore.initWriters created json: solr.JSONResponseWriter
[junit4:junit4]   2> 1514 T3005 oasc.RequestHandlers.initHandlersFromConfig created /select: solr.SearchHandler
[junit4:junit4]   2> 1515 T3000 oasc.RequestHandlers.initHandlersFromConfig created /select: solr.SearchHandler
[junit4:junit4]   2> 1515 T3009 oasc.SolrCore.initWriters created json: solr.JSONResponseWriter
[junit4:junit4]   2> 1515 T3005 oasc.RequestHandlers.initHandlersFromConfig created /update: solr.UpdateRequestHandler
[junit4:junit4]   2> 1515 T3004 oasc.RequestHandlers.initHandlersFromConfig created /admin/: solr.admin.AdminHandlers
[junit4:junit4]   2> 1516 T3000 oasc.RequestHandlers.initHandlersFromConfig created /update: solr.UpdateRequestHandler
[junit4:junit4]   2> 1516 T3004 oasc.RequestHandlers.initHandlersFromConfig created /select: solr.SearchHandler
[junit4:junit4]   2> 1516 T3003 oasc.RequestHandlers.initHandlersFromConfig created /admin/: solr.admin.AdminHandlers
[junit4:junit4]   2> 1517 T3013 oasc.RequestHandlers.initHandlersFromConfig created /admin/: solr.admin.AdminHandlers
[junit4:junit4]   2> 1517 T3004 oasc.RequestHandlers.initHandlersFromConfig created /update: solr.UpdateRequestHandler
[junit4:junit4]   2> 1517 T3003 oasc.RequestHandlers.initHandlersFromConfig created /select: solr.SearchHandler
[junit4:junit4]   2> 1518 T3009 oasc.RequestHandlers.initHandlersFromConfig created /admin/: solr.admin.AdminHandlers
[junit4:junit4]   2> 1518 T3013 oasc.RequestHandlers.initHandlersFromConfig created /select: solr.SearchHandler
[junit4:junit4]   2> 1518 T3003 oasc.RequestHandlers.initHandlersFromConfig created /update: solr.UpdateRequestHandler
[junit4:junit4]   2> 1519 T3009 oasc.RequestHandlers.initHandlersFromConfig created /select: solr.SearchHandler
[junit4:junit4]   2> 1519 T3013 oasc.RequestHandlers.initHandlersFromConfig created /update: solr.UpdateRequestHandler
[junit4:junit4]   2> 1520 T3009 oasc.RequestHandlers.initHandlersFromConfig created /update: solr.UpdateRequestHandler
[junit4:junit4]   2> 1538 T3014 oashl.XMLLoader.init xsltCacheLifetimeSeconds=60
[junit4:junit4]   2> 1546 T3000 oashl.XMLLoader.init xsltCacheLifetimeSeconds=60
[junit4:junit4]   2> 1546 T3005 oashl.XMLLoader.init xsltCacheLifetimeSeconds=60
[junit4:junit4]   2> 1546 T3009 oashl.XMLLoader.init xsltCacheLifetimeSeconds=60
[junit4:junit4]   2> 1547 T3013 oashl.XMLLoader.init xsltCacheLifetimeSeconds=60
[junit4:junit4]   2> 1547 T3003 oashl.XMLLoader.init xsltCacheLifetimeSeconds=60
[junit4:junit4]   2> 1547 T3004 oashl.XMLLoader.init xsltCacheLifetimeSeconds=60
[junit4:junit4]   2> 1550 T3014 oass.SolrIndexSearcher.<init> Opening Searcher@22f13d12 main
[junit4:junit4]   2> 1551 T3014 oasc.SolrCore.registerSearcher [00009_core] Registered new searcher Searcher@22f13d12 main{StandardDirectoryReader(segments_1:1)}
[junit4:junit4]   2> 1551 T3014 oasu.CommitTracker.<init> Hard AutoCommit: disabled
[junit4:junit4]   2> 1552 T3014 oasu.CommitTracker.<init> Soft AutoCommit: disabled
[junit4:junit4]   2> 1556 T3005 oass.SolrIndexSearcher.<init> Opening Searcher@2ef9ac59 main
[junit4:junit4]   2> 1556 T3014 oasc.CoreMaps.putTransientCore Opening transient core 00009_core
[junit4:junit4]   2> 1556 T3000 oass.SolrIndexSearcher.<init> Opening Searcher@2031913a main
[junit4:junit4]   2> 1557 T3014 oasc.CoreContainer.registerCore registering core: 00009_core
[junit4:junit4]   2> 1557 T3005 oasc.SolrCore.registerSearcher [00004_core] Registered new searcher Searcher@2ef9ac59 main{StandardDirectoryReader(segments_1:1)}
[junit4:junit4]   2> 1557 T3009 oass.SolrIndexSearcher.<init> Opening Searcher@7bb68a78 main
[junit4:junit4]   2> 1557 T3005 oasu.CommitTracker.<init> Hard AutoCommit: disabled
[junit4:junit4]   2> 1557 T3000 oasc.SolrCore.registerSearcher [00018_core] Registered new searcher Searcher@2031913a main{StandardDirectoryReader(segments_1:1)}
[junit4:junit4]   2> 1558 T3005 oasu.CommitTracker.<init> Soft AutoCommit: disabled
[junit4:junit4]   2> 1558 T3009 oasc.SolrCore.registerSearcher [00010_core] Registered new searcher Searcher@7bb68a78 main{StandardDirectoryReader(segments_1:1)}
[junit4:junit4]   2> 1558 T3000 oasu.CommitTracker.<init> Hard AutoCommit: disabled
[junit4:junit4]   2> 1558 T3003 oass.SolrIndexSearcher.<init> Opening Searcher@61f548d9 main
[junit4:junit4]   2> 1558 T3000 oasu.CommitTracker.<init> Soft AutoCommit: disabled
[junit4:junit4]   2> 1558 T3013 oass.SolrIndexSearcher.<init> Opening Searcher@1300138a main
[junit4:junit4]   2> 1558 T3009 oasu.CommitTracker.<init> Hard AutoCommit: disabled
[junit4:junit4]   2> 1559 T3004 oass.SolrIndexSearcher.<init> Opening Searcher@6e329a65 main
[junit4:junit4]   2> 1559 T3009 oasu.CommitTracker.<init> Soft AutoCommit: disabled
[junit4:junit4]   2> 1559 T3003 oasc.SolrCore.registerSearcher [00006_core] Registered new searcher Searcher@61f548d9 main{StandardDirectoryReader(segments_1:1)}
[junit4:junit4]   2> 1560 T3013 oasc.SolrCore.registerSearcher [00007_core] Registered new searcher Searcher@1300138a main{StandardDirectoryReader(segments_1:1)}
[junit4:junit4]   2> 1560 T3003 oasu.CommitTracker.<init> Hard AutoCommit: disabled
[junit4:junit4]   2> 1561 T3013 oasu.CommitTracker.<init> Hard AutoCommit: disabled
[junit4:junit4]   2> 1561 T3004 oasc.SolrCore.registerSearcher [00003_core] Registered new searcher Searcher@6e329a65 main{StandardDirectoryReader(segments_1:1)}
[junit4:junit4]   2> 1561 T3013 oasu.CommitTracker.<init> Soft AutoCommit: disabled
[junit4:junit4]   2> 1561 T3003 oasu.CommitTracker.<init> Soft AutoCommit: disabled
[junit4:junit4]   2> 1562 T3004 oasu.CommitTracker.<init> Hard AutoCommit: disabled
[junit4:junit4]   2> 1562 T3004 oasu.CommitTracker.<init> Soft AutoCommit: disabled
[junit4:junit4]   2> 1563 T3005 oasc.CoreMaps.putTransientCore Opening transient core 00004_core
[junit4:junit4]   2> ASYNC  NEW_CORE C152 name=00009_core org.apache.solr.core.SolrCore@4b1c0471
[junit4:junit4]   2> 1563 T3014 C152 REQ [00009_core] webapp=/solr path=/select params={q=*:*&wt=javabin&qt=/select&version=2} hits=0 status=0 QTime=0 
[junit4:junit4]   2> 1564 T3005 oasc.CoreContainer.registerCore registering core: 00004_core
[junit4:junit4]   2> 1563 T3008 C146 REQ [00019_core] webapp=/solr path=/select params={q=*:*&wt=javabin&qt=/select&version=2} hits=0 status=0 QTime=0 
[junit4:junit4]   2> 1564 T3000 oasc.CoreMaps.putTransientCore Opening transient core 00018_core
[junit4:junit4]   2> 1565 T3000 oasc.CoreContainer.registerCore registering core: 00018_core
[junit4:junit4]   2> 1565 T3009 oasc.CoreMaps.putTransientCore Opening transient core 00010_core
[junit4:junit4]   2> 1566 T3009 oasc.CoreContainer.registerCore registering core: 00010_core
[junit4:junit4]   2> 1568 T3003 oasc.CoreMaps.putTransientCore Opening transient core 00006_core
[junit4:junit4]   2> 1569 T3003 oasc.CoreContainer.registerCore registering core: 00006_core
[junit4:junit4]   2> 1569 T3013 oasc.CoreMaps.putTransientCore Opening transient core 00007_core
[junit4:junit4]   2> 1570 T3013 oasc.CoreContainer.registerCore registering core: 00007_core
[junit4:junit4]   2> 1570 T3004 oasc.CoreMaps.putTransientCore Opening transient core 00003_core
[junit4:junit4]   2> 1570 T3004 oasc.CoreContainer.registerCore registering core: 00003_core
[junit4:junit4]   2> 1577 T2961 C141 oasc.SolrDeletionPolicy.onCommit SolrDeletionPolicy.onCommit: commits:num=2
[junit4:junit4]   2> 		commit{dir=MockDirWrapper(org.apache.lucene.store.MMapDirectory@/usr/home/hudson/hudson-slave/workspace/Lucene-Solr-NightlyTests-trunk/solr/build/solr-core/test/J1/OpenCloseCoreStressTest_/00013_core/data/index lockFactory=org.apache.lucene.store.NativeFSLockFactory@24ad93a0),segFN=segments_1,generation=1,filenames=[segments_1]
[junit4:junit4]   2> 		commit{dir=MockDirWrapper(org.apache.lucene.store.MMapDirectory@/usr/home/hudson/hudson-slave/workspace/Lucene-Solr-NightlyTests-trunk/solr/build/solr-core/test/J1/OpenCloseCoreStressTest_/00013_core/data/index lockFactory=org.apache.lucene.store.NativeFSLockFactory@24ad93a0),segFN=segments_2,generation=2,filenames=[_0.fnm, _0_MockFixedIntBlock_0.pos, _0.nvm, _0_MockFixedIntBlock_0.tib, _0_MockFixedIntBlock_0.frq, _0_Pulsing41_0.doc, _0_Pulsing41_0.pos, _0_MockFixedIntBlock_0.pyl, _0_MockFixedIntBlock_0.skp, _0_Pulsing41_0.tim, _0_MockFixedIntBlock_0.tii, _0_MockFixedIntBlock_0.doc, _0_Pulsing41_0.tip, _0.nvd, segments_2, _0.fdx, _0.si, _0.fdt]
[junit4:junit4]   2> 1581 T2961 C141 oasc.SolrDeletionPolicy.updateCommits newest commit = 2[_0.fnm, _0_MockFixedIntBlock_0.pos, _0.nvm, _0_MockFixedIntBlock_0.tib, _0_MockFixedIntBlock_0.frq, _0_Pulsing41_0.doc, _0_Pulsing41_0.pos, _0_MockFixedIntBlock_0.pyl, _0_MockFixedIntBlock_0.skp, _0_Pulsing41_0.tim, _0_MockFixedIntBlock_0.tii, _0_MockFixedIntBlock_0.doc, _0_Pulsing41_0.tip, _0.nvd, segments_2, _0.fdx, _0.si, _0.fdt]
[junit4:junit4]   2> 1627 T3001 C146 REQ [00019_core] webapp=/solr path=/select params={q=*:*&wt=javabin&qt=/select&version=2} hits=0 status=0 QTime=0 
[junit4:junit4]   2> 1629 T3006 C152 REQ [00009_core] webapp=/solr path=/select params={q=*:*&wt=javabin&qt=/select&version=2} hits=0 status=0 QTime=0 
[junit4:junit4]   2> 1630 T3002 C152 REQ [00009_core] webapp=/solr path=/select params={q=*:*&wt=javabin&qt=/select&version=2} hits=0 status=0 QTime=0 
[junit4:junit4]   2> 1638 T2961 oasc.SolrCore.closeSearcher [00013_core] Closing main searcher on request.
[junit4:junit4]   2> 1639 T2961 oasc.CachingDirectoryFactory.close Closing directory when closing factory: /usr/home/hudson/hudson-slave/workspace/Lucene-Solr-NightlyTests-trunk/solr/build/solr-core/test/J1/OpenCloseCoreStressTest_/00013_core/data/index
[junit4:junit4]   2> 1639 T2961 oasc.CachingDirectoryFactory.closeDirectory Closing directory: /usr/home/hudson/hudson-slave/workspace/Lucene-Solr-NightlyTests-trunk/solr/build/solr-core/test/J1/OpenCloseCoreStressTest_/00013_core/data/index
[junit4:junit4]   2> ASYNC  NEW_CORE C153 name=00004_core org.apache.solr.core.SolrCore@311930b7
[junit4:junit4]   2> 1644 T3011 C153 REQ [00004_core] webapp=/solr path=/select params={q=*:*&wt=javabin&qt=/select&version=2} hits=0 status=0 QTime=1 
[junit4:junit4]   2> 1646 T3005 C153 REQ [00004_core] webapp=/solr path=/select params={q=*:*&wt=javabin&qt=/select&version=2} hits=0 status=0 QTime=0 
[junit4:junit4]   2> ASYNC  NEW_CORE C154 name=00007_core org.apache.solr.core.SolrCore@2d17648a
[junit4:junit4]   2> 1646 T3013 C154 REQ [00007_core] webapp=/solr path=/select params={q=*:*&wt=javabin&qt=/select&version=2} hits=0 status=0 QTime=0 
[junit4:junit4]   2> ASYNC  NEW_CORE C155 name=00018_core org.apache.solr.core.SolrCore@74a8bfcc
[junit4:junit4]   2> 1648 T3007 C155 REQ [00018_core] webapp=/solr path=/select params={q=*:*&wt=javabin&qt=/select&version=2} hits=0 status=0 QTime=1 
[junit4:junit4]   2> ASYNC  NEW_CORE C156 name=00003_core org.apache.solr.core.SolrCore@900bacd
[junit4:junit4]   2> 1649 T3004 C156 REQ [00003_core] webapp=/solr path=/select params={q=*:*&wt=javabin&qt=/select&version=2} hits=0 status=0 QTime=0 
[junit4:junit4]   2> 1650 T2958 C152 oasc.SolrDeletionPolicy.onInit SolrDeletionPolicy.onInit: commits:num=1
[junit4:junit4]   2> 		commit{dir=MockDirWrapper(org.apache.lucene.store.MMapDirectory@/usr/home/hudson/hudson-slave/workspace/Lucene-Solr-NightlyTests-trunk/solr/build/solr-core/test/J1/OpenCloseCoreStressTest_/00009_core/data/index lockFactory=org.apache.lucene.store.NativeFSLockFactory@4328e1dc),segFN=segments_1,generation=1,filenames=[segments_1]
[junit4:junit4]   2> 1651 T2958 C152 oasc.SolrDeletionPolicy.updateCommits newest commit = 1[segments_1]
[junit4:junit4]   2> 1652 T3000 C155 REQ [00018_core] webapp=/solr path=/select params={q=*:*&wt=javabin&qt=/select&version=2} hits=0 status=0 QTime=0 
[junit4:junit4]   2> ASYNC  NEW_CORE C157 name=00006_core org.apache.solr.core.SolrCore@2d6e6e7b
[junit4:junit4]   2> 1653 T3003 C157 REQ [00006_core] webapp=/solr path=/select params={q=*:*&wt=javabin&qt=/select&version=2} hits=0 status=0 QTime=0 
[junit4:junit4]   2> ASYNC  NEW_CORE C158 name=00010_core org.apache.solr.core.SolrCore@3a526e62
[junit4:junit4]   2> 1655 T3009 C158 REQ [00010_core] webapp=/solr path=/select params={q=*:*&wt=javabin&qt=/select&version=2} hits=0 status=0 QTime=1 
[junit4:junit4]   2> 1657 T2958 C152 UPDATE [00009_core] webapp=/solr path=/update params={wt=javabin&version=2} {add=[id28]} 0 92
[junit4:junit4]   2> 1660 T2996 C153 oasc.SolrDeletionPolicy.onInit SolrDeletionPolicy.onInit: commits:num=1
[junit4:junit4]   2> 		commit{dir=MockDirWrapper(org.apache.lucene.store.MMapDirectory@/usr/home/hudson/hudson-slave/workspace/Lucene-Solr-NightlyTests-trunk/solr/build/solr-core/test/J1/OpenCloseCoreStressTest_/00004_core/data/index lockFactory=org.apache.lucene.store.NativeFSLockFactory@2bfb45af),segFN=segments_1,generation=1,filenames=[segments_1]
[junit4:junit4]   2> 1660 T2998 C158 oasc.SolrDeletionPolicy.onInit SolrDeletionPolicy.onInit: commits:num=1
[junit4:junit4]   2> 		commit{dir=MockDirWrapper(org.apache.lucene.store.MMapDirectory@/usr/home/hudson/hudson-slave/workspace/Lucene-Solr-NightlyTests-trunk/solr/build/solr-core/test/J1/OpenCloseCoreStressTest_/00010_core/data/index lockFactory=org.apache.lucene.store.NativeFSLockFactory@318bbfe2),segFN=segments_1,generation=1,filenames=[segments_1]
[junit4:junit4]   2> 1661 T2959 oasc.SolrConfig.<init> Using Lucene MatchVersion: LUCENE_41
[junit4:junit4]   2> 1661 T2990 C154 oasc.SolrDeletionPolicy.onInit SolrDeletionPolicy.onInit: commits:num=1
[junit4:junit4]   2> 		commit{dir=MockDirWrapper(org.apache.lucene.store.MMapDirectory@/usr/home/hudson/hudson-slave/workspace/Lucene-Solr-NightlyTests-trunk/solr/build/solr-core/test/J1/OpenCloseCoreStressTest_/00007_core/data/index lockFactory=org.apache.lucene.store.NativeFSLockFactory@2c24363c),segFN=segments_1,generation=1,filenames=[segments_1]
[junit4:junit4]   2> 1661 T2958 C150 UPDATE [00002_core] webapp=/solr path=/update params={wt=javabin&version=2} {add=[id40]} 0 1
[junit4:junit4]   2> 1661 T2996 C153 oasc.SolrDeletionPolicy.updateCommits newest commit = 1[segments_1]
[junit4:junit4]   2> 1662 T2990 C154 oasc.SolrDeletionPolicy.updateCommits newest commit = 1[segments_1]
[junit4:junit4]   2> 1661 T2997 C155 oasc.SolrDeletionPolicy.onInit SolrDeletionPolicy.onInit: commits:num=1
[junit4:junit4]   2> 		commit{dir=MockDirWrapper(org.apache.lucene.store.MMapDirectory@/usr/home/hudson/hudson-slave/workspace/Lucene-Solr-NightlyTests-trunk/solr/build/solr-core/test/J1/OpenCloseCoreStressTest_/00018_core/data/index lockFactory=org.apache.lucene.store.NativeFSLockFactory@2560c8ea),segFN=segments_1,generation=1,filenames=[segments_1]
[junit4:junit4]   2> 1661 T2998 C158 oasc.SolrDeletionPolicy.updateCommits newest commit = 1[segments_1]
[junit4:junit4]   2> 1663 T2997 C155 oasc.SolrDeletionPolicy.updateCommits newest commit = 1[segments_1]
[junit4:junit4]   2> 1667 T2994 C153 UPDATE [00004_core] webapp=/solr path=/update params={wt=javabin&version=2} {add=[id36]} 0 18
[junit4:junit4]   2> 1667 T2996 C153 UPDATE [00004_core] webapp=/solr path=/update params={wt=javabin&version=2} {add=[id16]} 0 20
[junit4:junit4]   2> 1667 T2990 C154 UPDATE [00007_core] webapp=/solr path=/update params={wt=javabin&version=2} {add=[id29]} 0 21
[junit4:junit4]   2> 1668 T3014 C157 REQ [00006_core] webapp=/solr path=/select params={q=*:*&wt=javabin&qt=/select&version=2} hits=0 status=0 QTime=1 
[junit4:junit4]   2> 1669 T2997 C155 UPDATE [00018_core] webapp=/solr path=/update params={wt=javabin&version=2} {add=[id34]} 0 20
[junit4:junit4]   2> 1670 T2955 oasc.SolrConfig.<init> Using Lucene MatchVersion: LUCENE_41
[junit4:junit4]   2> 1673 T2997 C143 UPDATE [00014_core] webapp=/solr path=/update params={wt=javabin&version=2} {add=[id45]} 0 1
[junit4:junit4]   2> 1673 T2960 C158 UPDATE [00010_core] webapp=/solr path=/update params={wt=javabin&version=2} {add=[id21]} 0 25
[junit4:junit4]   2> 1674 T2956 C158 UPDATE [00010_core] webapp=/solr path=/update params={wt=javabin&version=2} {add=[id18]} 0 25
[junit4:junit4]   2> 1674 T2995 C158 UPDATE [00010_core] webapp=/solr path=/update params={wt=javabin&version=2} {add=[id38]} 0 21
[junit4:junit4]   2> 1674 T2998 C158 UPDATE [00010_core] webapp=/solr path=/update params={wt=javabin&version=2} {add=[id19]} 0 28
[junit4:junit4]   2> 1675 T2958 C156 oasc.SolrDeletionPolicy.onInit SolrDeletionPolicy.onInit: commits:num=1
[junit4:junit4]   2> 		commit{dir=MockDirWrapper(org.apache.lucene.store.MMapDirectory@/usr/home/hudson/hudson-slave/workspace/Lucene-Solr-NightlyTests-trunk/solr/build/solr-core/test/J1/OpenCloseCoreStressTest_/00003_core/data/index lockFactory=org.apache.lucene.store.NativeFSLockFactory@4de2a7d7),segFN=segments_1,generation=1,filenames=[segments_1]
[junit4:junit4]   2> 1676 T2958 C156 oasc.SolrDeletionPolicy.updateCommits newest commit = 1[segments_1]
[junit4:junit4]   2> 1678 T2997 C150 UPDATE [00002_core] webapp=/solr path=/update params={wt=javabin&version=2} {add=[id49]} 0 1
[junit4:junit4]   2> 1679 T2995 C152 UPDATE [00009_core] webapp=/solr path=/update params={wt=javabin&version=2} {add=[id48]} 0 2
[junit4:junit4]   2> 1681 T2990 C157 oasc.SolrDeletionPolicy.onInit SolrDeletionPolicy.onInit: commits:num=1
[junit4:junit4]   2> 		commit{dir=MockDirWrapper(org.apache.lucene.store.MMapDirectory@/usr/home/hudson/hudson-slave/workspace/Lucene-Solr-NightlyTests-trunk/solr/build/solr-core/test/J1/OpenCloseCoreStressTest_/00006_core/data/index lockFactory=org.apache.lucene.store.NativeFSLockFactory@7d64b3c7),segFN=segments_1,generation=1,filenames=[segments_1]
[junit4:junit4]   2> 1683 T2997 C143 UPDATE [00014_core] webapp=/solr path=/update params={wt=javabin&version=2} {add=[id51]} 0 0
[junit4:junit4]   2> 1683 T2990 C157 oasc.SolrDeletionPolicy.updateCommits newest commit = 1[segments_1]
[junit4:junit4]   2> 1684 T2958 C156 UPDATE [00003_core] webapp=/solr path=/update params={wt=javabin&version=2} {add=[id41]} 0 18
[junit4:junit4]   2> 1684 T2998 C156 UPDATE [00003_core] webapp=/solr path=/update params={wt=javabin&version=2} {add=[id50]} 0 7
[junit4:junit4]   2> 1686 T2958 C150 UPDATE [00002_core] webapp=/solr path=/update params={wt=javabin&version=2} {add=[id54]} 0 0
[junit4:junit4]   2> 1687 T2960 C157 UPDATE [00006_core] webapp=/solr path=/update params={wt=javabin&version=2} {add=[id46]} 0 11
[junit4:junit4]   2> 1687 T2990 C157 UPDATE [00006_core] webapp=/solr path=/update params={wt=javabin&version=2} {add=[id44]} 0 17
[junit4:junit4]   2> 1686 T2997 C150 UPDATE [00002_core] webapp=/solr path=/update params={wt=javabin&version=2} {add=[id53]} 0 0
[junit4:junit4]   2> 1688 T2998 C156 UPDATE [00003_core] webapp=/solr path=/update params={wt=javabin&version=2} {add=[id55]} 0 1
[junit4:junit4]   2> 1690 T2958 C158 UPDATE [00010_core] webapp=/solr path=/update params={wt=javabin&version=2} {add=[id56]} 0 1
[junit4:junit4]   2> 1692 T2961 oasc.CachingDirectoryFactory.close Closing directory when closing factory: /usr/home/hudson/hudson-slave/workspace/Lucene-Solr-NightlyTests-trunk/solr/build/solr-core/test/J1/OpenCloseCoreStressTest_/00013_core/data
[junit4:junit4]   2> 1692 T2961 oasc.CachingDirectoryFactory.closeDirectory Closing directory: /usr/home/hudson/hudson-slave/workspace/Lucene-Solr-NightlyTests-trunk/solr/build/solr-core/test/J1/OpenCloseCoreStressTest_/00013_core/data
[junit4:junit4]   2> 1692 T2958 C158 UPDATE [00010_core] webapp=/solr path=/update params={wt=javabin&version=2} {add=[id61]} 0 0
[junit4:junit4]   2> 1693 T2961 oasc.SolrCore.close [00015_core]  CLOSING SolrCore org.apache.solr.core.SolrCore@7f50f5c3
[junit4:junit4]   2> 1693 T2957 oasc.CoreContainer.create Creating SolrCore '00013_core' using instanceDir: /usr/home/hudson/hudson-slave/workspace/Lucene-Solr-NightlyTests-trunk/solr/build/solr-core/test/J1/./OpenCloseCoreStressTest_/00013_core
[junit4:junit4]   2> 1694 T2957 oasc.SolrResourceLoader.<init> new SolrResourceLoader for directory: '/usr/home/hudson/hudson-slave/workspace/Lucene-Solr-NightlyTests-trunk/solr/build/solr-core/test/J1/./OpenCloseCoreStressTest_/00013_core/'
[junit4:junit4]   2> 1698 T2961 oasu.DirectUpdateHandler2.close closing DirectUpdateHandler2{commits=0,autocommits=0,soft autocommits=0,optimizes=0,rollbacks=0,expungeDeletes=0,docsPending=1,adds=1,deletesById=0,deletesByQuery=0,errors=0,cumulative_adds=1,cumulative_deletesById=0,cumulative_deletesByQuery=0,cumulative_errors=0}
[junit4:junit4]   2> 1698 T2961 oasu.SolrCoreState.decrefSolrCoreState Closing SolrCoreState
[junit4:junit4]   2> 1699 T2961 oasu.DefaultSolrCoreState.closeIndexWriter SolrCoreState ref count has reached 0 - closing IndexWriter
[junit4:junit4]   2> 1699 T2961 oasu.DefaultSolrCoreState.closeIndexWriter closing IndexWriter with IndexWriterCloser
[junit4:junit4]   2> 1731 T3001 C153 REQ [00004_core] webapp=/solr path=/select params={q=*:*&wt=javabin&qt=/select&version=2} hits=0 status=0 QTime=0 
[junit4:junit4]   2> 1750 T3005 C153 REQ [00004_core] webapp=/solr path=/select params={q=*:*&wt=javabin&qt=/select&version=2} hits=0 status=0 QTime=0 
[junit4:junit4]   2> 1752 T2959 oasc.SolrConfig.<init> Loaded SolrConfig: solrconfig-minimal.xml
[junit4:junit4]   2> 1752 T2955 oasc.SolrConfig.<init> Loaded SolrConfig: solrconfig-minimal.xml
[junit4:junit4]   2> 1753 T2959 oass.IndexSchema.readSchema Reading Solr Schema
[junit4:junit4]   2> 1753 T2955 oass.IndexSchema.readSchema Reading Solr Schema
[junit4:junit4]   2> 1756 T3000 C156 REQ [00003_core] webapp=/solr path=/select params={q=*:*&wt=javabin&qt=/select&version=2} hits=0 status=0 QTime=0 
[junit4:junit4]   2> 1757 T2959 oass.IndexSchema.readSchema Schema name=tiny
[junit4:junit4]   2> 1757 T2955 oass.IndexSchema.readSchema Schema name=tiny
[junit4:junit4]   2> 1758 T3009 C157 REQ [00006_core] webapp=/solr path=/select params={q=*:*&wt=javabin&qt=/select&version=2} hits=0 status=0 QTime=0 
[junit4:junit4]   2> 1771 T3014 C150 REQ [00002_core] webapp=/solr path=/select params={q=*:*&wt=javabin&qt=/select&version=2} hits=0 status=0 QTime=0 
[junit4:junit4]   2> 1777 T2961 C147 oasc.SolrDeletionPolicy.onCommit SolrDeletionPolicy.onCommit: commits:num=2
[junit4:junit4]   2> 		commit{dir=MockDirWrapper(org.apache.lucene.store.MMapDirectory@/usr/home/hudson/hudson-slave/workspace/Lucene-Solr-NightlyTests-trunk/solr/build/solr-core/test/J1/OpenCloseCoreStressTest_/00015_core/data/index lockFactory=org.apache.lucene.store.NativeFSLockFactory@62d00791),segFN=segments_1,generation=1,filenames=[segments_1]
[junit4:junit4]   2> 		commit{dir=MockDirWrapper(org.apache.lucene.store.MMapDirectory@/usr/home/hudson/hudson-slave/workspace/Lucene-Solr-NightlyTests-trunk/solr/build/solr-core/test/J1/OpenCloseCoreStressTest_/00015_core/data/index lockFactory=org.apache.lucene.store.NativeFSLockFactory@62d00791),segFN=segments_2,generation=2,filenames=[_0.fnm, _0_MockFixedIntBlock_0.pos, _0.nvm, _0_MockFixedIntBlock_0.tib, _0_MockFixedIntBlock_0.frq, _0_Pulsing41_0.doc, _0_Pulsing41_0.pos, _0_MockFixedIntBlock_0.pyl, _0_MockFixedIntBlock_0.skp, _0_Pulsing41_0.tim, _0_MockFixedIntBlock_0.tii, _0_MockFixedIntBlock_0.doc, _0_Pulsing41_0.tip, _0.nvd, segments_2, _0.fdx, _0.si, _0.fdt]
[junit4:junit4]   2> 1777 T2961 C147 oasc.SolrDeletionPolicy.updateCommits newest commit = 2[_0.fnm, _0_MockFixedIntBlock_0.pos, _0.nvm, _0_MockFixedIntBlock_0.tib, _0_MockFixedIntBlock_0.frq, _0_Pulsing41_0.doc, _0_Pulsing41_0.pos, _0_MockFixedIntBlock_0.pyl, _0_MockFixedIntBlock_0.skp, _0_Pulsing41_0.tim, _0_MockFixedIntBlock_0.tii, _0_MockFixedIntBlock_0.doc, _0_Pulsing41_0.tip, _0.nvd, segments_2, _0.fdx, _0.si, _0.fdt]
[junit4:junit4]   2> 1781 T2961 oasc.SolrCore.closeSearcher [00015_core] Closing main searcher on request.
[junit4:junit4]   2> 1781 T2961 oasc.CachingDirectoryFactory.close Closing directory when closing factory: /usr/home/hudson/hudson-slave/workspace/Lucene-Solr-NightlyTests-trunk/solr/build/solr-core/test/J1/OpenCloseCoreStressTest_/00015_core/data
[junit4:junit4]   2> 1781 T2961 oasc.CachingDirectoryFactory.closeDirectory Closing directory: /usr/home/hudson/hudson-slave/workspace/Lucene-Solr-NightlyTests-trunk/solr/build/solr-core/test/J1/OpenCloseCoreStressTest_/00015_core/data
[junit4:junit4]   2> 1782 T2961 oasc.CachingDirectoryFactory.close Closing directory when closing factory: /usr/home/hudson/hudson-slave/workspace/Lucene-Solr-NightlyTests-trunk/solr/build/solr-core/test/J1/OpenCloseCoreStressTest_/00015_core/data/index
[junit4:junit4]   2> 1783 T2961 oasc.CachingDirectoryFactory.closeDirectory Closing directory: /usr/home/hudson/hudson-slave/workspace/Lucene-Solr-NightlyTests-trunk/solr/build/solr-core/test/J1/OpenCloseCoreStressTest_/00015_core/data/index
[junit4:junit4]   2> 1795 T2957 oasc.SolrConfig.<init> Using Lucene MatchVersion: LUCENE_41
[junit4:junit4]   2> 1797 T2955 oass.IndexSchema.readSchema unique key field: id
[junit4:junit4]   2> 1797 T2959 oass.IndexSchema.readSchema unique key field: id
[junit4:junit4]   2> 1799 T2955 oasc.SolrCore.initDirectoryFactory org.apache.solr.core.MockFSDirectoryFactory
[junit4:junit4]   2> 1799 T2959 oasc.SolrCore.initDirectoryFactory org.apache.solr.core.MockFSDirectoryFactory
[junit4:junit4]   2> 1799 T2955 oasc.SolrCore.<init> [00011_core] Opening new SolrCore at /usr/home/hudson/hudson-slave/workspace/Lucene-Solr-NightlyTests-trunk/solr/build/solr-core/test/J1/./OpenCloseCoreStressTest_/00011_core/, dataDir=/usr/home/hudson/hudson-slave/workspace/Lucene-Solr-NightlyTests-trunk/solr/build/solr-core/test/J1/OpenCloseCoreStressTest_/00011_core/data/
[junit4:junit4]   2> 1799 T2959 oasc.SolrCore.<init> [00001_core] Opening new SolrCore at /usr/home/hudson/hudson-slave/workspace/Lucene-Solr-NightlyTests-trunk/solr/build/solr-core/test/J1/./OpenCloseCoreStressTest_/00001_core/, dataDir=/usr/home/hudson/hudson-slave/workspace/Lucene-Solr-NightlyTests-trunk/solr/build/solr-core/test/J1/OpenCloseCoreStressTest_/00001_core/data/
[junit4:junit4]   2> 1800 T2955 oasc.JmxMonitoredMap.<init> JMX monitoring is enabled. Adding Solr mbeans to JMX Server: com.sun.jmx.mbeanserver.JmxMBeanServer@33192410
[junit4:junit4]   2> 1800 T2959 oasc.JmxMonitoredMap.<init> JMX monitoring is enabled. Adding Solr mbeans to JMX Server: com.sun.jmx.mbeanserver.JmxMBeanServer@33192410
[junit4:junit4]   2> 1800 T2955 oasc.SolrCore.initDirectoryFactory org.apache.solr.core.MockFSDirectoryFactory
[junit4:junit4]   2> 1800 T2959 oasc.SolrCore.initDirectoryFactory org.apache.solr.core.MockFSDirectoryFactory
[junit4:junit4]   2> 1802 T2955 oasc.CachingDirectoryFactory.get return new directory for /usr/home/hudson/hudson-slave/workspace/Lucene-Solr-NightlyTests-trunk/solr/build/solr-core/test/J1/OpenCloseCoreStressTest_/00011_core/data
[junit4:junit4]   2> 1803 T2959 oasc.CachingDirectoryFactory.get return new directory for /usr/home/hudson/hudson-slave/workspace/Lucene-Solr-NightlyTests-trunk/solr/build/solr-core/test/J1/OpenCloseCoreStressTest_/00001_core/data
[junit4:junit4]   2> 1804 T2955 oasc.SolrCore.getNewIndexDir New index directory detected: old=null new=/usr/home/hudson/hudson-slave/workspace/Lucene-Solr-NightlyTests-trunk/solr/build/solr-core/test/J1/OpenCloseCoreStressTest_/00011_core/data/index/
[junit4:junit4]   2> 1804 T2959 oasc.SolrCore.getNewIndexDir New index directory detected: old=null new=/usr/home/hudson/hudson-slave/workspace/Lucene-Solr-NightlyTests-trunk/solr/build/solr-core/test/J1/OpenCloseCoreStressTest_/00001_core/data/index/
[junit4:junit4]   2> 1805 T2955 oasc.SolrCore.initIndex WARNING [00011_core] Solr index directory '/usr/home/hudson/hudson-slave/workspace/Lucene-Solr-NightlyTests-trunk/solr/build/solr-core/test/J1/OpenCloseCoreStressTest_/00011_core/data/index' doesn't exist. Creating new index...
[junit4:junit4]   2> 1805 T2956 oasc.CoreContainer.create Creating SolrCore '00015_core' using instanceDir: /usr/home/hudson/hudson-slave/workspace/Lucene-Solr-NightlyTests-trunk/solr/build/solr-core/test/J1/./OpenCloseCoreStressTest_/00015_core
[junit4:junit4]   2> 1805 T2961 oasc.SolrCore.close [00005_core]  CLOSING SolrCore org.apache.solr.core.SolrCore@48f1b6e
[junit4:junit4]   2> 1805 T2959 oasc.SolrCore.initIndex WARNING [00001_core] Solr index directory '/usr/home/hudson/hudson-slave/workspace/Lucene-Solr-NightlyTests-trunk/solr/build/solr-core/test/J1/OpenCloseCoreStressTest_/00001_core/data/index' doesn't exist. Creating new index...
[junit4:junit4]   2> 1806 T2955 oasc.CachingDirectoryFactory.get return new directory for /usr/home/hudson/hudson-slave/workspace/Lucene-Solr-NightlyTests-trunk/solr/build/solr-core/test/J1/OpenCloseCoreStressTest_/00011_core/data/index
[junit4:junit4]   2> 1806 T2956 oasc.SolrResourceLoader.<init> new SolrResourceLoader for directory: '/usr/home/hudson/hudson-slave/workspace/Lucene-Solr-NightlyTests-trunk/solr/build/solr-core/test/J1/./OpenCloseCoreStressTest_/00015_core/'
[junit4:junit4]   2> 1806 T2959 oasc.CachingDirectoryFactory.get return new directory for /usr/home/hudson/hudson-slave/workspace/Lucene-Solr-NightlyTests-trunk/solr/build/solr-core/test/J1/OpenCloseCoreStressTest_/00001_core/data/index
[junit4:junit4]   2> 1809 T2961 oasu.DirectUpdateHandler2.close closing DirectUpdateHandler2{commits=0,autocommits=0,soft autocommits=0,optimizes=0,rollbacks=0,expungeDeletes=0,docsPending=2,adds=2,deletesById=0,deletesByQuery=0,errors=0,cumulative_adds=2,cumulative_deletesById=0,cumulative_deletesByQuery=0,cumulative_errors=0}
[junit4:junit4]   2> 1810 T2961 oasu.SolrCoreState.decrefSolrCoreState Closing SolrCoreState
[junit4:junit4]   2> 1810 T2961 oasu.DefaultSolrCoreState.closeIndexWriter SolrCoreState ref count has reached 0 - closing IndexWriter
[junit4:junit4]   2> 1810 T2961 oasu.DefaultSolrCoreState.closeIndexWriter closing IndexWriter with IndexWriterCloser
[junit4:junit4]   2> 1823 T2955 oasc.SolrDeletionPolicy.onCommit SolrDeletionPolicy.onCommit: commits:num=1
[junit4:junit4]   2> 		commit{dir=MockDirWrapper(org.apache.lucene.store.NIOFSDirectory@/usr/home/hudson/hudson-slave/workspace/Lucene-Solr-NightlyTests-trunk/solr/build/solr-core/test/J1/OpenCloseCoreStressTest_/00011_core/data/index lockFactory=org.apache.lucene.store.NativeFSLockFactory@2797bf6),segFN=segments_1,generation=1,filenames=[segments_1]
[junit4:junit4]   2> 1824 T2955 oasc.SolrDeletionPolicy.updateCommits newest commit = 1[segments_1]
[junit4:junit4]   2> 1824 T2959 oasc.SolrDeletionPolicy.onCommit SolrDeletionPolicy.onCommit: commits:num=1
[junit4:junit4]   2> 		commit{dir=MockDirWrapper(org.apache.lucene.store.MMapDirectory@/usr/home/hudson/hudson-slave/workspace/Lucene-Solr-NightlyTests-trunk/solr/build/solr-core/test/J1/OpenCloseCoreStressTest_/00001_core/data/index lockFactory=org.apache.lucene.store.NativeFSLockFactory@75b954be),segFN=segments_1,generation=1,filenames=[segments_1]
[junit4:junit4]   2> 1824 T2959 oasc.SolrDeletionPolicy.updateCommits newest commit = 1[segments_1]
[junit4:junit4]   2> 1825 T2955 oasc.SolrCore.initWriters created json: solr.JSONResponseWriter
[junit4:junit4]   2> 1826 T2959 oasc.SolrCore.initWriters created json: solr.JSONResponseWriter
[junit4:junit4]   2> 1827 T2955 oasc.RequestHandlers.initHandlersFromConfig created /admin/: solr.admin.AdminHandlers
[junit4:junit4]   2> 1828 T2955 oasc.RequestHandlers.initHandlersFromConfig created /select: solr.SearchHandler
[junit4:junit4]   2> 1828 T2959 oasc.RequestHandlers.initHandlersFromConfig created /admin/: solr.admin.AdminHandlers
[junit4:junit4]   2> 1828 T2955 oasc.RequestHandlers.initHandlersFromConfig created /update: solr.UpdateRequestHandler
[junit4:junit4]   2> 1828 T2959 oasc.RequestHandlers.initHandlersFromConfig created /select: solr.SearchHandler
[junit4:junit4]   2> 1829 T2959 oasc.RequestHandlers.initHandlersFromConfig created /update: solr.UpdateRequestHandler
[junit4:junit4]   2> 1854 T2959 oashl.XMLLoader.init xsltCacheLifetimeSeconds=60
[junit4:junit4]   2> 1855 T2955 oashl.XMLLoader.init xsltCacheLifetimeSeconds=60
[junit4:junit4]   2> 1859 T3000 C143 REQ [00014_core] webapp=/solr path=/select params={q=*:*&wt=javabin&qt=/select&version=2} hits=0 status=0 QTime=0 
[junit4:junit4]   2> 1862 T3009 C158 REQ [00010_core] webapp=/solr path=/select params={q=*:*&wt=javabin&qt=/select&version=2} hits=0 status=0 QTime=0 
[junit4:junit4]   2> 1863 T2959 oass.SolrIndexSearcher.<init> Opening Searcher@2569dc7d main
[junit4:junit4]   2> 1863 T2955 oass.SolrIndexSearcher.<init> Opening Searcher@490aa5bb main
[junit4:junit4]   2> 1864 T2959 oasc.SolrCore.registerSearcher [00001_core] Registered new searcher Searcher@2569dc7d main{StandardDirectoryReader(segments_1:1)}
[junit4:junit4]   2> 1864 T2955 oasc.SolrCore.registerSearcher [00011_core] Registered new searcher Searcher@490aa5bb main{StandardDirectoryReader(segments_1:1)}
[junit4:junit4]   2> 1864 T2959 oasu.CommitTracker.<init> Hard AutoCommit: disabled
[junit4:junit4]   2> 1864 T2955 oasu.CommitTracker.<init> Hard AutoCommit: disabled
[junit4:junit4]   2> 1864 T2959 oasu.CommitTracker.<init> Soft AutoCommit: disabled
[junit4:junit4]   2> 1865 T2955 oasu.CommitTracker.<init> Soft AutoCommit: disabled
[junit4:junit4]   2> 1869 T2959 oasc.CoreMaps.putTransientCore Opening transient core 00001_core
[junit4:junit4]   2> 1869 T2955 oasc.CoreMaps.putTransientCore Opening transient core 00011_core
[junit4:junit4]   2> 1869 T2959 oasc.CoreContainer.registerCore registering core: 00001_core
[junit4:junit4]   2> 1870 T2955 oasc.CoreContainer.registerCore registering core: 00011_core
[junit4:junit4]   2> 1871 T2957 oasc.SolrConfig.<init> Loaded SolrConfig: solrconfig-minimal.xml
[junit4:junit4]   2> 1872 T2957 oass.IndexSchema.readSchema Reading Solr Schema
[junit4:junit4]   2> 1875 T3014 C152 REQ [00009_core] webapp=/solr path=/select params={q=*:*&wt=javabin&qt=/select&version=2} hits=0 status=0 QTime=0 
[junit4:junit4]   2> 1877 T2957 oass.IndexSchema.readSchema Schema name=tiny
[junit4:junit4]   2> ASYNC  NEW_CORE C159 name=00001_core org.apache.solr.core.SolrCore@6ad818b7
[junit4:junit4]   2> 1878 T3002 C159 REQ [00001_core] webapp=/solr path=/select params={q=*:*&wt=javabin&qt=/select&version=2} hits=0 status=0 QTime=0 
[junit4:junit4]   2> 1882 T2959 C159 oasc.SolrDeletionPolicy.onInit SolrDeletionPolicy.onInit: commits:num=1
[junit4:junit4]   2> 		commit{dir=MockDirWrapper(org.apache.lucene.store.MMapDirectory@/usr/home/hudson/hudson-slave/workspace/Lucene-Solr-NightlyTests-trunk/solr/build/solr-core/test/J1/OpenCloseCoreStressTest_/00001_core/data/index lockFactory=org.apache.lucene.store.NativeFSLockFactory@75b954be),segFN=segments_1,generation=1,filenames=[segments_1]
[junit4:junit4]   2> ASYNC  NEW_CORE C160 name=00011_core org.apache.solr.core.SolrCore@4c4e6453
[junit4:junit4]   2> 1882 T2999 C160 oasc.SolrDeletionPolicy.onInit SolrDeletionPolicy.onInit: commits:num=1
[junit4:junit4]   2> 		commit{dir=MockDirWrapper(org.apache.lucene.store.NIOFSDirectory@/usr/home/hudson/hudson-slave/workspace/Lucene-Solr-NightlyTests-trunk/solr/build/solr-core/test/J1/OpenCloseCoreStressTest_/00011_core/data/index lockFactory=org.apache.lucene.store.NativeFSLockFactory@2797bf6),segFN=segments_1,generation=1,filenames=[segments_1]
[junit4:junit4]   2> 1883 T2959 C159 oasc.SolrDeletionPolicy.updateCommits newest commit = 1[segments_1]
[junit4:junit4]   2> 1883 T2999 C160 oasc.SolrDeletionPolicy.updateCommits newest commit = 1[segments_1]
[junit4:junit4]   2> 1885 T2959 C159 UPDATE [00001_core] webapp=/solr path=/update params={wt=javabin&version=2} {add=[id25]} 0 8
[junit4:junit4]   2> 1885 T2999 C160 UPDATE [00011_core] webapp=/solr path=/update params={wt=javabin&version=2} {add=[id31]} 0 7
[junit4:junit4]   2> 1886 T2954 C159 UPDATE [00001_core] webapp=/solr path=/update params={wt=javabin&version=2} {add=[id35]} 0 8
[junit4:junit4]   2> 1886 T2955 C160 UPDATE [00011_core] webapp=/solr path=/update params={wt=javabin&version=2} {add=[id26]} 0 6
[junit4:junit4]   2> 1886 T2960 C160 UPDATE [00011_core] webapp=/solr path=/update params={wt=javabin&version=2} {add=[id57]} 0 6
[junit4:junit4]   2> 1886 T2996 C159 UPDATE [00001_core] webapp=/solr path=/update params={wt=javabin&version=2} {add=[id43]} 0 5
[junit4:junit4]   2> 1888 T2954 C160 UPDATE [00011_core] webapp=/solr path=/update params={wt=javabin&version=2} {add=[id65]} 0 0
[junit4:junit4]   2> 1889 T2955 C160 UPDATE [00011_core] webapp=/solr path=/update params={wt=javabin&version=2} {add=[id66]} 0 0
[junit4:junit4]   2> 1889 T2960 C146 UPDATE [00019_core] webapp=/solr path=/update params={wt=javabin&version=2} {add=[id67]} 0 0
[junit4:junit4]   2> 1889 T2996 C159 UPDATE [00001_core] webapp=/solr path=/update params={wt=javabin&version=2} {add=[id68]} 0 0
[junit4:junit4]   2> 1892 T2955 C152 UPDATE [00009_core] webapp=/solr path=/update params={wt=javabin&version=2} {add=[id70]} 0 0
[junit4:junit4]   2> 1895 T2955 C152 UPDATE [00009_core] webapp=/solr path=/update params={wt=javabin&version=2} {add=[id73]} 0 0
[junit4:junit4]   2> 1898 T2955 C150 UPDATE [00002_core] webapp=/solr path=/update params={wt=javabin&version=2} {add=[id74]} 0 0
[junit4:junit4]   2> 1899 T2956 oasc.SolrConfig.<init> Using Lucene MatchVersion: LUCENE_41
[junit4:junit4]   2> 1901 T2955 C150 UPDATE [00002_core] webapp=/solr path=/update params={wt=javabin&version=2} {add=[id75]} 0 0
[junit4:junit4]   2> 1904 T2955 C160 UPDATE [00011_core] webapp=/solr path=/update params={wt=javabin&version=2} {add=[id76]} 0 0
[junit4:junit4]   2> 1907 T2957 oass.IndexSchema.readSchema unique key field: id
[junit4:junit4]   2> 1907 T2955 C152 UPDATE [00009_core] webapp=/solr path=/update params={wt=javabin&version=2} {add=[id77]} 0 0
[junit4:junit4]   2> 1908 T2957 oasc.SolrCore.initDirectoryFactory org.apache.solr.core.MockFSDirectoryFactory
[junit4:junit4]   2> 1909 T2957 oasc.SolrCore.<init> [00013_core] Opening new SolrCore at /usr/home/hudson/hudson-slave/workspace/Lucene-Solr-NightlyTests-trunk/solr/build/solr-core/test/J1/./OpenCloseCoreStressTest_/00013_core/, dataDir=/usr/home/hudson/hudson-slave/workspace/Lucene-Solr-NightlyTests-trunk/solr/build/solr-core/test/J1/OpenCloseCoreStressTest_/00013_core/data/
[junit4:junit4]   2> 1909 T2957 oasc.JmxMonitoredMap.<init> JMX monitoring is enabled. Adding Solr mbeans to JMX Server: com.sun.jmx.mbeanserver.JmxMBeanServer@33192410
[junit4:junit4]   2> 1910 T2957 oasc.SolrCore.initDirectoryFactory org.apache.solr.core.MockFSDirectoryFactory
[junit4:junit4]   2> 1910 T2955 C152 UPDATE [00009_core] webapp=/solr path=/update params={wt=javabin&version=2} {add=[id78]} 0 0
[junit4:junit4]   2> 1911 T2957 oasc.CachingDirectoryFactory.get return new directory for /usr/home/hudson/hudson-slave/workspace/Lucene-Solr-NightlyTests-trunk/solr/build/solr-core/test/J1/OpenCloseCoreStressTest_/00013_core/data
[junit4:junit4]   2> 1912 T2957 oasc.SolrCore.getNewIndexDir New index directory detected: old=null new=/usr/home/hudson/hudson-slave/workspace/Lucene-Solr-NightlyTests-trunk/solr/build/solr-core/test/J1/OpenCloseCoreStressTest_/00013_core/data/index/
[junit4:junit4]   2> 1913 T2957 oasc.SolrCore.initWriters created json: solr.JSONResponseWriter
[junit4:junit4]   2> 1914 T2957 oasc.RequestHandlers.initHandlersFromConfig created /admin/: solr.admin.AdminHandlers
[junit4:junit4]   2> 1915 T2957 oasc.RequestHandlers.initHandlersFromConfig created /select: solr.SearchHandler
[junit4:junit4]   2> 1915 T2957 oasc.RequestHandlers.initHandlersFromConfig created /update: solr.UpdateRequestHandler
[junit4:junit4]   2> 1918 T2957 oashl.XMLLoader.init xsltCacheLifetimeSeconds=60
[junit4:junit4]   2> 1921 T2957 oasc.CachingDirectoryFactory.get return new directory for /usr/home/hudson/hudson-slave/workspace/Lucene-Solr-NightlyTests-trunk/solr/build/solr-core/test/J1/OpenCloseCoreStressTest_/00013_core/data/index
[junit4:junit4]   2> 1934 T2957 oass.SolrIndexSearcher.<init> Opening Searcher@7dcf11d3 main
[junit4:junit4]   2> 1935 T2957 oasc.SolrCore.registerSearcher [00013_core] Registered new searcher Searcher@7dcf11d3 main{StandardDirectoryReader(segments_2:3 _0(5.0):C1)}
[junit4:junit4]   2> 1935 T2957 oasu.CommitTracker.<init> Hard AutoCommit: disabled
[junit4:junit4]   2> 1936 T2957 oasu.CommitTracker.<init> Soft AutoCommit: disabled
[junit4:junit4]   2> 1940 T2957 oasc.CoreMaps.putTransientCore Opening transient core 00013_core
[junit4:junit4]   2> 1940 T2957 oasc.CoreContainer.registerCore registering core: 00013_core
[junit4:junit4]   2> ASYNC  NEW_CORE C161 name=00013_core org.apache.solr.core.SolrCore@6bf5f367
[junit4:junit4]   2> 1953 T2957 C161 oasc.SolrDeletionPolicy.onInit SolrDeletionPolicy.onInit: commits:num=1
[junit4:junit4]   2> 		commit{dir=MockDirWrapper(org.apache.lucene.store.NIOFSDirectory@/usr/home/hudson/hudson-slave/workspace/Lucene-Solr-NightlyTests-trunk/solr/build/solr-core/test/J1/OpenCloseCoreStressTest_/00013_core/data/index lockFactory=org.apache.lucene.store.NativeFSLockFactory@a6ab4aa),segFN=segments_2,generation=2,filenames=[_0.fnm, _0_MockFixedIntBlock_0.pos, _0.nvm, _0_MockFixedIntBlock_0.tib, _0_MockFixedIntBlock_0.frq, _0_Pulsing41_0.doc, _0_Pulsing41_0.pos, _0_MockFixedIntBlock_0.pyl, _0_MockFixedIntBlock_0.skp, _0_Pulsing41_0.tim, _0_Pulsing41_0.tip, _0_MockFixedIntBlock_0.tii, _0_MockFixedIntBlock_0.doc, _0.nvd, segments_2, _0.fdx, _0.si, _0.fdt]
[junit4:junit4]   2> 1954 T2957 C161 oasc.SolrDeletionPolicy.updateCommits newest commit = 2[_0.fnm, _0_MockFixedIntBlock_0.pos, _0.nvm, _0_MockFixedIntBlock_0.tib, _0_MockFixedIntBlock_0.frq, _0_Pulsing41_0.doc, _0_Pulsing41_0.pos, _0_MockFixedIntBlock_0.pyl, _0_MockFixedIntBlock_0.skp, _0_Pulsing41_0.tim, _0_Pulsing41_0.tip, _0_MockFixedIntBlock_0.tii, _0_MockFixedIntBlock_0.doc, _0.nvd, segments_2, _0.fdx, _0.si, _0.fdt]
[junit4:junit4]   2> 1956 T2957 C161 UPDATE [00013_core] webapp=/solr path=/update params={wt=javabin&version=2} {add=[id39]} 0 9
[junit4:junit4]   2> 1958 T2954 C161 UPDATE [00013_core] webapp=/solr path=/update params={wt=javabin&version=2} {add=[id69]} 0 11
[junit4:junit4]   2> 1958 T2986 C161 UPDATE [00013_core] webapp=/solr path=/update params={wt=javabin&version=2} {add=[id37]} 0 11
[junit4:junit4]   2> 1960 T2956 oasc.SolrConfig.<init> Loaded SolrConfig: solrconfig-minimal.xml
[junit4:junit4]   2> 1961 T2956 oass.IndexSchema.readSchema Reading Solr Schema
[junit4:junit4]   2> 1961 T2954 C150 UPDATE [00002_core] webapp=/solr path=/update params={wt=javabin&version=2} {add=[id81]} 0 0
[junit4:junit4]   2> 1963 T3000 C146 REQ [00019_core] webapp=/solr path=/select params={q=*:*&wt=javabin&qt=/select&version=2} hits=0 status=0 QTime=0 
[junit4:junit4]   2> 1964 T2956 oass.IndexSchema.readSchema Schema name=tiny
[junit4:junit4]   2> 1979 T3014 C146 REQ [00019_core] webapp=/solr path=/select params={q=*:*&wt=javabin&qt=/select&version=2} hits=0 status=0 QTime=0 
[junit4:junit4]   2> 1982 T3002 C161 REQ [00013_core] webapp=/solr path=/select params={q=*:*&wt=javabin&qt=/select&version=2} hits=1 status=0 QTime=0 
[junit4:junit4]   2> 1983 T2961 C149 oasc.SolrDeletionPolicy.onCommit SolrDeletionPolicy.onCommit: commits:num=2
[junit4:junit4]   2> 		commit{dir=MockDirWrapper(org.apache.lucene.store.MMapDirectory@/usr/home/hudson/hudson-slave/workspace/Lucene-Solr-NightlyTests-trunk/solr/build/solr-core/test/J1/OpenCloseCoreStressTest_/00005_core/data/index lockFactory=org.apache.lucene.store.NativeFSLockFactory@3a79526c),segFN=segments_1,generation=1,filenames=[segments_1]
[junit4:junit4]   2> 		commit{dir=MockDirWrapper(org.apache.lucene.store.MMapDirectory@/usr/home/hudson/hudson-slave/workspace/Lucene-Solr-NightlyTests-trunk/solr/build/solr-core/test/J1/OpenCloseCoreStressTest_/00005_core/data/index lockFactory=org.apache.lucene.store.NativeFSLockFactory@3a79526c),segFN=segments_2,generation=2,filenames=[_1_MockFixedIntBlock_0.doc, _1_MockFixedIntBlock_0.pyl, _0_MockFixedIntBlock_0.tib, _1.fnm, _0_MockFixedIntBlock_0.skp, _0_MockFixedIntBlock_0.pyl, _0_Pulsing41_0.tim, _0_Pulsing41_0.tip, _0_MockFixedIntBlock_0.tii, _0.nvd, _0.si, _1.nvm, _1_MockFixedIntBlock_0.tii, _0.fnm, _1_MockFixedIntBlock_0.frq, _1.nvd, _1_Pulsing41_0.doc, _0_MockFixedIntBlock_0.pos, _0.nvm, _1_Pulsing41_0.pos, _0_MockFixedIntBlock_0.frq, _1.fdx, _0_Pulsing41_0.pos, _0_Pulsing41_0.doc, _1_Pulsing41_0.tip, _1_MockFixedIntBlock_0.skp, _1.fdt, _1_Pulsing41_0.tim, _0_MockFixedIntBlock_0.doc, _1.si, _1_MockFixedIntBlock_0.tib, segments_2, _0.fdx, _1_MockFixedIntBlock_0.pos, _0.fdt]
[junit4:junit4]   2> 1983 T2961 C149 oasc.SolrDeletionPolicy.updateCommits newest commit = 2[_1_MockFixedIntBlock_0.doc, _1_MockFixedIntBlock_0.pyl, _0_MockFixedIntBlock_0.tib, _1.fnm, _0_MockFixedIntBlock_0.skp, _0_MockFixedIntBlock_0.pyl, _0_Pulsing41_0.tim, _0_Pulsing41_0.tip, _0_MockFixedIntBlock_0.tii, _0.nvd, _0.si, _1.nvm, _1_MockFixedIntBlock_0.tii, _0.fnm, _1_MockFixedIntBlock_0.frq, _1.nvd, _1_Pulsing41_0.doc, _0_MockFixedIntBlock_0.pos, _0.nvm, _1_Pulsing41_0.pos, _0_MockFixedIntBlock_0.frq, _1.fdx, _0_Pulsing41_0.pos, _0_Pulsing41_0.doc, _1_Pulsing41_0.tip, _1_MockFixedIntBlock_0.skp, _1.fdt, _1_Pulsing41_0.tim, _0_MockFixedIntBlock_0.doc, _1.si, _1_MockFixedIntBlock_0.tib, segments_2, _0.fdx, _1_MockFixedIntBlock_0.pos, _0.fdt]
[junit4:junit4]   2> 1986 T2961 oasc.SolrCore.closeSearcher [00005_core] Closing main searcher on request.
[junit4:junit4]   2> 1986 T2961 oasc.CachingDirectoryFactory.close Closing directory when closing factory: /usr/home/hudson/hudson-slave/workspace/Lucene-Solr-NightlyTests-trunk/solr/build/solr-core/test/J1/OpenCloseCoreStressTest_/00005_core/data
[junit4:junit4]   2> 1986 T2961 oasc.CachingDirectoryFactory.closeDirectory Closing directory: /usr/home/hudson/hudson-slave/workspace/Lucene-Solr-NightlyTests-trunk/solr/build/solr-core/test/J1/OpenCloseCoreStressTest_/00005_core/data
[junit4:junit4]   2> 1988 T2961 oasc.CachingDirectoryFactory.close Closing directory when closing factory: /usr/home/hudson/hudson-slave/workspace/Lucene-Solr-NightlyTests-trunk/solr/build/solr-core/test/J1/OpenCloseCoreStressTest_/00005_core/data/index
[junit4:junit4]   2> 1988 T2961 oasc.CachingDirectoryFactory.closeDirectory Closing directory: /usr/home/hudson/hudson-slave/workspace/Lucene-Solr-NightlyTests-trunk/solr/build/solr-core/test/J1/OpenCloseCoreStressTest_/00005_core/data/index
[junit4:junit4]   2> 1993 T2956 oass.IndexSchema.readSchema unique key field: id
[junit4:junit4]   2> 1995 T2956 oasc.SolrCore.initDirectoryFactory org.apache.solr.core.MockFSDirectoryFactory
[junit4:junit4]   2> 1996 T2956 oasc.SolrCore.<init> [00015_core] Opening new SolrCore at /usr/home/hudson/hudson-slave/workspace/Lucene-Solr-NightlyTests-trunk/solr/build/solr-core/test/J1/./OpenCloseCoreStressTest_/00015_core/, dataDir=/usr/home/hudson/hudson-slave/workspace/Lucene-Solr-NightlyTests-trunk/solr/build/solr-core/test/J1/OpenCloseCoreStressTest_/00015_core/data/
[junit4:junit4]   2> 1996 T2956 oasc.JmxMonitoredMap.<init> JMX monitoring is enabled. Adding Solr mbeans to JMX Server: com.sun.jmx.mbeanserver.JmxMBeanServer@33192410
[junit4:junit4]   2> 1997 T2956 oasc.SolrCore.initDirectoryFactory org.apache.solr.core.MockFSDirectoryFactory
[junit4:junit4]   2> 1998 T2956 oasc.CachingDirectoryFactory.get return new directory for /usr/home/hudson/hudson-slave/workspace/Lucene-Solr-NightlyTests-trunk/solr/build/solr-core/test/J1/OpenCloseCoreStressTest_/00015_core/data
[junit4:junit4]   2> 1999 T2956 oasc.SolrCore.getNewIndexDir New index directory detected: old=null new=/usr/home/hudson/hudson-slave/workspace/Lucene-Solr-NightlyTests-trunk/solr/build/solr-core/test/J1/OpenCloseCoreStressTest_/00015_core/data/index/
[junit4:junit4]   2> 2000 T2956 oasc.SolrCore.initWriters created json: solr.JSONResponseWriter
[junit4:junit4]   2> 2002 T2956 oasc.RequestHandlers.initHandlersFromConfig created /admin/: solr.admin.AdminHandlers
[junit4:junit4]   2> 2002 T2956 oasc.RequestHandlers.initHandlersFromConfig created /select: solr.SearchHandler
[junit4:junit4]   2> 2003 T2956 oasc.RequestHandlers.initHandlersFromConfig created /update: solr.UpdateRequestHandler
[junit4:junit4]   2> 2017 T2956 oashl.XMLLoader.init xsltCacheLifetimeSeconds=60
[junit4:junit4]   2> 2021 T2956 oasc.CachingDirectoryFactory.get return new directory for /usr/home/hudson/hudson-slave/workspace/Lucene-Solr-NightlyTests-trunk/solr/build/solr-core/test/J1/OpenCloseCoreStressTest_/00015_core/data/index
[junit4:junit4]   2> 2021 T2957 oasc.CoreContainer.create Creating SolrCore '00005_core' using instanceDir: /usr/home/hudson/hudson-slave/workspace/Lucene-Solr-NightlyTests-trunk/solr/build/solr-core/test/J1/./OpenCloseCoreStressTest_/00005_core
[junit4:junit4]   2> 2021 T2961 oasc.SolrCore.close [00017_core]  CLOSING SolrCore org.apache.solr.core.SolrCore@64206cad
[junit4:junit4]   2> 2022 T2957 oasc.SolrResourceLoader.<init> new SolrResourceLoader for directory: '/usr/home/hudson/hudson-slave/workspace/Lucene-Solr-NightlyTests-trunk/solr/build/solr-core/test/J1/./OpenCloseCoreStressTest_/00005_core/'
[junit4:junit4]   2> 2025 T2961 oasu.DirectUpdateHandler2.close closing DirectUpdateHandler2{commits=0,autocommits=0,soft autocommits=0,optimizes=0,rollbacks=0,expungeDeletes=0,docsPending=2,adds=2,deletesById=0,deletesByQuery=0,errors=0,cumulative_adds=2,cumulative_deletesById=0,cumulative_deletesByQuery=0,cumulative_errors=0}
[junit4:junit4]   2> 2026 T2961 oasu.SolrCoreState.decrefSolrCoreState Closing SolrCoreState
[junit4:junit4]   2> 2026 T2961 oasu.DefaultSolrCoreState.closeIndexWriter SolrCoreState ref count has reached 0 - closing IndexWriter
[junit4:junit4]   2> 2026 T2961 oasu.DefaultSolrCoreState.closeIndexWriter closing IndexWriter with IndexWriterCloser
[junit4:junit4]   2> 2035 T2956 oass.SolrIndexSearcher.<init> Opening Searcher@22776527 main
[junit4:junit4]   2> 2036 T2956 oasc.SolrCore.registerSearcher [00015_core] Registered new searcher Searcher@22776527 main{StandardDirectoryReader(segments_2:3 _0(5.0):C1)}
[junit4:junit4]   2> 2037 T2956 oasu.CommitTracker.<init> Hard AutoCommit: disabled
[junit4:junit4]   2> 2037 T2956 oasu.CommitTracker.<init> Soft AutoCommit: disabled
[junit4:junit4]   2> 2048 T2956 oasc.CoreMaps.putTransientCore Opening transient core 00015_core
[junit4:junit4]   2> 2049 T2956 oasc.CoreContainer.registerCore registering core: 00015_core
[junit4:junit4]   2> ASYNC  NEW_CORE C162 name=00015_core org.apache.solr.core.SolrCore@1f3ae4db
[junit4:junit4]   2> 2056 T3005 C162 REQ [00015_core] webapp=/solr path=/select params={q=*:*&wt=javabin&qt=/select&version=2} hits=1 status=0 QTime=0 
[junit4:junit4]   2> 2062 T2956 C162 oasc.SolrDeletionPolicy.onInit SolrDeletionPolicy.onInit: commits:num=1
[junit4:junit4]   2> 		commit{dir=MockDirWrapper(org.apache.lucene.store.NIOFSDirectory@/usr/home/hudson/hudson-slave/workspace/Lucene-Solr-NightlyTests-trunk/solr/build/solr-core/test/J1/OpenCloseCoreStressTest_/00015_core/data/index lockFactory=org.apache.lucene.store.NativeFSLockFactory@3e50acdc),segFN=segments_2,generation=2,filenames=[_0.fnm, _0_MockFixedIntBlock_0.pos, _0.nvm, _0_MockFixedIntBlock_0.tib, _0_MockFixedIntBlock_0.frq, _0_Pulsing41_0.doc, _0_Pulsing41_0.pos, _0_MockFixedIntBlock_0.pyl, _0_MockFixedIntBlock_0.skp, _0_Pulsing41_0.tim, _0_Pulsing41_0.tip, _0_MockFixedIntBlock_0.tii, _0_MockFixedIntBlock_0.doc, _0.nvd, segments_2, _0.fdx, _0.si, _0.fdt]
[junit4:junit4]   2> 2063 T2956 C162 oasc.SolrDeletionPolicy.updateCommits newest commit = 2[_0.fnm, _0_MockFixedIntBlock_0.pos, _0.nvm, _0_MockFixedIntBlock_0.tib, _0_MockFixedIntBlock_0.frq, _0_Pulsing41_0.doc, _0_Pulsing41_0.pos, _0_MockFixedIntBlock_0.pyl, _0_MockFixedIntBlock_0.skp, _0_Pulsing41_0.tim, _0_Pulsing41_0.tip, _0_MockFixedIntBlock_0.tii, _0_MockFixedIntBlock_0.doc, _0.nvd, segments_2, _0.fdx, _0.si, _0.fdt]
[junit4:junit4]   2> 2065 T2956 C162 UPDATE [00015_core] webapp=/solr path=/update params={wt=javabin&version=2} {add=[id47]} 0 10
[junit4:junit4]   2> 2065 T2998 C162 UPDATE [00015_core] webapp=/solr path=/update params={wt=javabin&version=2} {add=[id60]} 0 9
[junit4:junit4]   2> 2068 T2956 C162 UPDATE [00015_core] webapp=/solr path=/update params={wt=javabin&version=2} {add=[id84]} 0 0
[junit4:junit4]   2> 2071 T2956 C146 UPDATE [00019_core] webapp=/solr path=/update params={wt=javabin&version=2} {add=[id86]} 0 0
[junit4:junit4]   2> 2074 T2956 C162 UPDATE [00015_core] webapp=/solr path=/update params={wt=javabin&version=2} {add=[id87]} 0 0
[junit4:junit4]   2> 2077 T2956 C159 UPDATE [00001_core] webapp=/solr path=/update params={wt=javabin&version=2} {add=[id88]} 0 0
[junit4:junit4]   2> 2100 T2957 oasc.SolrConfig.<init> Using Lucene MatchVersion: LUCENE_41
[junit4:junit4]   2> 2106 T2961 C145 oasc.SolrDeletionPolicy.onCommit SolrDeletionPolicy.onCommit: commits:num=2
[junit4:junit4]   2> 		commit{dir=MockDirWrapper(org.apache.lucene.store.MMapDirectory@/usr/home/hudson/hudson-slave/workspace/Lucene-Solr-NightlyTests-trunk/solr/build/solr-core/test/J1/OpenCloseCoreStressTest_/00017_core/data/index lockFactory=org.apache.lucene.store.NativeFSLockFactory@5c5cd3),segFN=segments_1,generation=1,filenames=[segments_1]
[junit4:junit4]   2> 		commit{dir=MockDirWrapper(org.apache.lucene.store.MMapDirectory@/usr/home/hudson/hudson-slave/workspace/Lucene-Solr-NightlyTests-trunk/solr/build/solr-core/test/J1/OpenCloseCoreStressTest_/00017_core/data/index lockFactory=org.apache.lucene.store.NativeFSLockFactory@5c5cd3),segFN=segments_2,generation=2,filenames=[_0.fnm, _0_MockFixedIntBlock_0.pos, _0.nvm, _0_MockFixedIntBlock_0.tib, _0_MockFixedIntBlock_0.frq, _0_Pulsing41_0.doc, _0_Pulsing41_0.pos, _0_MockFixedIntBlock_0.pyl, _0_MockFixedIntBlock_0.skp, _0_Pulsing41_0.tim, _0_MockFixedIntBlock_0.tii, _0_MockFixedIntBlock_0.doc, _0_Pulsing41_0.tip, _0.nvd, segments_2, _0.fdx, _0.si, _0.fdt]
[junit4:junit4]   2> 2106 T2961 C145 oasc.SolrDeletionPolicy.updateCommits newest commit = 2[_0.fnm, _0_MockFixedIntBlock_0.pos, _0.nvm, _0_MockFixedIntBlock_0.tib, _0_MockFixedIntBlock_0.frq, _0_Pulsing41_0.doc, _0_Pulsing41_0.pos, _0_MockFixedIntBlock_0.pyl, _0_MockFixedIntBlock_0.skp, _0_Pulsing41_0.tim, _0_MockFixedIntBlock_0.tii, _0_MockFixedIntBlock_0.doc, _0_Pulsing41_0.tip, _0.nvd, segments_2, _0.fdx, _0.si, _0.fdt]
[junit4:junit4]   2> 2109 T2961 oasc.SolrCore.closeSearcher [00017_core] Closing main searcher on request.
[junit4:junit4]   2> 2110 T2961 oasc.CachingDirectoryFactory.close Closing directory when closing factory: /usr/home/hudson/hudson-slave/workspace/Lucene-Solr-NightlyTests-trunk/solr/build/solr-core/test/J1/OpenCloseCoreStressTest_/00017_core/data
[junit4:junit4]   2> 2110 T2961 oasc.CachingDirectoryFactory.closeDirectory Closing directory: /usr/home/hudson/hudson-slave/workspace/Lucene-Solr-NightlyTests-trunk/solr/build/solr-core/test/J1/OpenCloseCoreStressTest_/00017_core/data
[junit4:junit4]   2> 2111 T2961 oasc.CachingDirectoryFactory.close Closing directory when closing factory: /usr/home/hudson/hudson-slave/workspace/Lucene-Solr-NightlyTests-trunk/solr/build/solr-core/test/J1/OpenCloseCoreStressTest_/00017_core/data/index
[junit4:junit4]   2> 2111 T2961 oasc.CachingDirectoryFactory.closeDirectory Closing directory: /usr/home/hudson/hudson-slave/workspace/Lucene-Solr-NightlyTests-trunk/solr/build/solr-core/test/J1/OpenCloseCoreStressTest_/00017_core/data/index
[junit4:junit4]   2> 2129 T2961 oasc.SolrCore.close [00016_core]  CLOSING SolrCore org.apache.solr.core.SolrCore@3054f69d
[junit4:junit4]   2> 2129 T2999 oasc.CoreContainer.create Creating SolrCore '00017_core' using instanceDir: /usr/home/hudson/hudson-slave/workspace/Lucene-Solr-NightlyTests-trunk/solr/build/solr-core/test/J1/./OpenCloseCoreStressTest_/00017_core
[junit4:junit4]   2> 2130 T2999 oasc.SolrResourceLoader.<init> new SolrResourceLoader for directory: '/usr/home/hudson/hudson-slave/workspace/Lucene-Solr-NightlyTests-trunk/solr/build/solr-core/test/J1/./OpenCloseCoreStressTest_/00017_core/'
[junit4:junit4]   2> 2133 T2961 oasu.DirectUpdateHandler2.close closing DirectUpdateHandler2{commits=0,autocommits=0,soft autocommits=0,optimizes=0,rollbacks=0,expungeDeletes=0,docsPending=2,adds=2,deletesById=0,deletesByQuery=0,errors=0,cumulative_adds=2,cumulative_deletesById=0,cumulative_deletesByQuery=0,cumulative_errors=0}
[junit4:junit4]   2> 2134 T2961 oasu.SolrCoreState.decrefSolrCoreState Closing SolrCoreState
[junit4:junit4]   2> 2134 T2961 oasu.DefaultSolrCoreState.closeIndexWriter SolrCoreState ref count has reached 0 - closing IndexWriter
[junit4:junit4]   2> 2134 T2961 oasu.DefaultSolrCoreState.closeIndexWriter closing IndexWriter with IndexWriterCloser
[junit4:junit4]   2> 2167 T2957 oasc.SolrConfig.<init> Loaded SolrConfig: solrconfig-minimal.xml
[junit4:junit4]   2> 2169 T2957 oass.IndexSchema.readSchema Reading Solr Schema
[junit4:junit4]   2> 2180 T2957 oass.IndexSchema.readSchema Schema name=tiny
[junit4:junit4]   2> 2202 T2961 C151 oasc.SolrDeletionPolicy.onCommit SolrDeletionPolicy.onCommit: commits:num=2
[junit4:junit4]   2> 		commit{dir=MockDirWrapper(org.apache.lucene.store.MMapDirectory@/usr/home/hudson/hudson-slave/workspace/Lucene-Solr-NightlyTests-trunk/solr/build/solr-core/test/J1/OpenCloseCoreStressTest_/00016_core/data/index lockFactory=org.apache.lucene.store.NativeFSLockFactory@7d296660),segFN=segments_1,generation=1,filenames=[segments_1]
[junit4:junit4]   2> 		commit{dir=MockDirWrapper(org.apache.lucene.store.MMapDirectory@/usr/home/hudson/hudson-slave/workspace/Lucene-Solr-NightlyTests-trunk/solr/build/solr-core/test/J1/OpenCloseCoreStressTest_/00016_core/data/index lockFactory=org.apache.lucene.store.NativeFSLockFactory@7d296660),segFN=segments_2,generation=2,filenames=[_0.fnm, _0_MockFixedIntBlock_0.pos, _0.nvm, _0_MockFixedIntBlock_0.tib, _0_MockFixedIntBlock_0.frq, _0_Pulsing41_0.doc, _0_Pulsing41_0.pos, _0_MockFixedIntBlock_0.pyl, _0_MockFixedIntBlock_0.skp, _0_Pulsing41_0.tim, _0_MockFixedIntBlock_0.tii, _0_MockFixedIntBlock_0.doc, _0_Pulsing41_0.tip, _0.nvd, segments_2, _0.fdx, _0.si, _0.fdt]
[junit4:junit4]   2> 2202 T2961 C151 oasc.SolrDeletionPolicy.updateCommits newest commit = 2[_0.fnm, _0_MockFixedIntBlock_0.pos, _0.nvm, _0_MockFixedIntBlock_0.tib, _0_MockFixedIntBlock_0.frq, _0_Pulsing41_0.doc, _0_Pulsing41_0.pos, _0_MockFixedIntBlock_0.pyl, _0_MockFixedIntBlock_0.skp, _0_Pulsing41_0.tim, _0_MockFixedIntBlock_0.tii, _0_MockFixedIntBlock_0.doc, _0_Pulsing41_0.tip, _0.nvd, segments_2, _0.fdx, _0.si, _0.fdt]
[junit4:junit4]   2> 2205 T2961 oasc.SolrCore.closeSearcher [00016_core] Closing main searcher on request.
[junit4:junit4]   2> 2205 T2961 oasc.CachingDirectoryFactory.close Closing directory when closing factory: /usr/home/hudson/hudson-slave/workspace/Lucene-Solr-NightlyTests-trunk/solr/build/solr-core/test/J1/OpenCloseCoreStressTest_/00016_core/data
[junit4:junit4]   2> 2205 T2961 oasc.CachingDirectoryFactory.closeDirectory Closing directory: /usr/home/hudson/hudson-slave/workspace/Lucene-Solr-NightlyTests-trunk/solr/build/solr-core/test/J1/OpenCloseCoreStressTest_/00016_core/data
[junit4:junit4]   2> 2207 T2961 oasc.CachingDirectoryFactory.close Closing directory when closing factory: /usr/home/hudson/hudson-slave/workspace/Lucene-Solr-NightlyTests-trunk/solr/build/solr-core/test/J1/OpenCloseCoreStressTest_/00016_core/data/index
[junit4:junit4]   2> 2207 T2961 oasc.CachingDirectoryFactory.closeDirectory Closing directory: /usr/home/hudson/hudson-slave/workspace/Lucene-Solr-NightlyTests-trunk/solr/build/solr-core/test/J1/OpenCloseCoreStressTest_/00016_core/data/index
[junit4:junit4]   2> 2219 T2999 oasc.SolrConfig.<init> Using Lucene MatchVersion: LUCENE_41
[junit4:junit4]   2> 2219 T2957 oass.IndexSchema.readSchema unique key field: id
[junit4:junit4]   2> 2221 T2957 oasc.SolrCore.initDirectoryFactory org.apache.solr.core.MockFSDirectoryFactory
[junit4:junit4]   2> 2222 T2957 oasc.SolrCore.<init> [00005_core] Opening new SolrCore at /usr/home/hudson/hudson-slave/workspace/Lucene-Solr-NightlyTests-trunk/solr/build/solr-core/test/J1/./OpenCloseCoreStressTest_/00005_core/, dataDir=/usr/home/hudson/hudson-slave/workspace/Lucene-Solr-NightlyTests-trunk/solr/build/solr-core/test/J1/OpenCloseCoreStressTest_/00005_core/data/
[junit4:junit4]   2> 2222 T2957 oasc.JmxMonitoredMap.<init> JMX monitoring is enabled. Adding Solr mbeans to JMX Server: com.sun.jmx.mbeanserver.JmxMBeanServer@33192410
[junit4:junit4]   2> 2223 T2957 oasc.SolrCore.initDirectoryFactory org.apache.solr.core.MockFSDirectoryFactory
[junit4:junit4]   2> 2224 T2957 oasc.CachingDirectoryFactory.get return new directory for /usr/home/hudson/hudson-slave/workspace/Lucene-Solr-NightlyTests-trunk/solr/build/solr-core/test/J1/OpenCloseCoreStressTest_/00005_core/data
[junit4:junit4]   2> 2224 T2957 oasc.SolrCore.getNewIndexDir New index directory detected: old=null new=/usr/home/hudson/hudson-slave/workspace/Lucene-Solr-NightlyTests-trunk/solr/build/solr-core/test/J1/OpenCloseCoreStressTest_/00005_core/data/index/
[junit4:junit4]   2> 2225 T2957 oasc.SolrCore.initWriters created json: solr.JSONResponseWriter
[junit4:junit4]   2> 2226 T2961 oasc.SolrCore.close [00012_core]  CLOSING SolrCore org.apache.solr.core.SolrCore@11967031
[junit4:junit4]   2> 2226 T3010 oasc.CoreContainer.create Creating SolrCore '00016_core' using instanceDir: /usr/home/hudson/hudson-slave/workspace/Lucene-Solr-NightlyTests-trunk/solr/build/solr-core/test/J1/./OpenCloseCoreStressTest_/00016_core
[junit4:junit4]   2> 2227 T3010 oasc.SolrResourceLoader.<init> new SolrResourceLoader for directory: '/usr/home/hudson/hudson-slave/workspace/Lucene-Solr-NightlyTests-trunk/solr/build/solr-core/test/J1/./OpenCloseCoreStressTest_/00016_core/'
[junit4:junit4]   2> 2227 T2957 oasc.RequestHandlers.initHandlersFromConfig created /admin/: solr.admin.AdminHandlers
[junit4:junit4]   2> 2228 T2957 oasc.RequestHandlers.initHandlersFromConfig created /select: solr.SearchHandler
[junit4:junit4]   2> 2228 T2957 oasc.RequestHandlers.initHandlersFromConfig created /update: solr.UpdateRequestHandler
[junit4:junit4]   2> 2230 T2961 oasu.DirectUpdateHandler2.close closing DirectUpdateHandler2{commits=0,autocommits=0,soft autocommits=0,optimizes=0,rollbacks=0,expungeDeletes=0,docsPending=3,adds=3,deletesById=0,deletesByQuery=0,errors=0,cumulative_adds=3,cumulative_deletesById=0,cumulative_deletesByQuery=0,cumulative_errors=0}
[junit4:junit4]   2> 2230 T2961 oasu.SolrCoreState.decrefSolrCoreState Closing SolrCoreState
[junit4:junit4]   2> 2230 T2961 oasu.DefaultSolrCoreState.closeIndexWriter SolrCoreState ref count has reached 0 - closing IndexWriter
[junit4:junit4]   2> 2230 T2961 oasu.DefaultSolrCoreState.closeIndexWriter closing IndexWriter with IndexWriterCloser
[junit4:junit4]   2> 2251 T2957 oashl.XMLLoader.init xsltCacheLifetimeSeconds=60
[junit4:junit4]   2> 2255 T2957 oasc.CachingDirectoryFactory.get return new directory for /usr/home/hudson/hudson-slave/workspace/Lucene-Solr-NightlyTests-trunk/solr/build/solr-core/test/J1/OpenCloseCoreStressTest_/00005_core/data/index
[junit4:junit4]   2> 2282 T2957 oass.SolrIndexSearcher.<init> Opening Searcher@39686efa main
[junit4:junit4]   2> 2282 T2999 oasc.SolrConfig.<init> Loaded SolrConfig: solrconfig-minimal.xml
[junit4:junit4]   2> 2283 T2957 oasc.SolrCore.registerSearcher [00005_core] Registered new searcher Searcher@39686efa main{StandardDirectoryReader(segments_2:5 _0(5.0):C1 _1(5.0):C1)}
[junit4:junit4]   2> 2283 T2999 oass.IndexSchema.readSchema Reading Solr Schema
[junit4:junit4]   2> 2284 T2957 oasu.CommitTracker.<init> Hard AutoCommit: disabled
[junit4:junit4]   2> 2284 T2957 oasu.CommitTracker.<init> Soft AutoCommit: disabled
[junit4:junit4]   2> 2287 T2999 oass.IndexSchema.readSchema Schema name=tiny
[junit4:junit4]   2> 2288 T2957 oasc.CoreMaps.putTransientCore Opening transient core 00005_core
[junit4:junit4]   2> 2288 T2957 oasc.CoreContainer.registerCore registering core: 00005_core
[junit4:junit4]   2> ASYNC  NEW_CORE C163 name=00005_core org.apache.solr.core.SolrCore@ac1480e
[junit4:junit4]   2> 2296 T3008 C163 REQ [00005_core] webapp=/solr path=/select params={q=*:*&wt=javabin&qt=/select&version=2} hits=2 status=0 QTime=0 
[junit4:junit4]   2> 2296 T3006 C163 REQ [00005_core] webapp=/solr path=/select params={q=*:*&wt=javabin&qt=/select&version=2} hits=2 status=0 QTime=0 
[junit4:junit4]   2> 2300 T2961 C144 oasc.SolrDeletionPolicy.onCommit SolrDeletionPolicy.onCommit: commits:num=2
[junit4:junit4]   2> 		commit{dir=MockDirWrapper(org.apache.lucene.store.MMapDirectory@/usr/home/hudson/hudson-slave/workspace/Lucene-Solr-NightlyTests-trunk/solr/build/solr-core/test/J1/OpenCloseCoreStressTest_/00012_core/data/index lockFactory=org.apache.lucene.store.NativeFSLockFactory@6fb5bd0e),segFN=segments_1,generation=1,filenames=[segments_1]
[junit4:junit4]   2> 		commit{dir=MockDirWrapper(org.apache.lucene.store.MMapDirectory@/usr/home/hudson/hudson-slave/workspace/Lucene-Solr-NightlyTests-trunk/solr/build/solr-core/test/J1/OpenCloseCoreStressTest_/00012_core/data/index lockFactory=org.apache.lucene.store.NativeFSLockFactory@6fb5bd0e),segFN=segments_2,generation=2,filenames=[_0.fnm, _0_MockFixedIntBlock_0.pos, _0.nvm, _0_MockFixedIntBlock_0.tib, _0_MockFixedIntBlock_0.frq, _0_Pulsing41_0.doc, _0_Pulsing41_0.pos, _0_MockFixedIntBlock_0.pyl, _0_MockFixedIntBlock_0.skp, _0_Pulsing41_0.tim, _0_MockFixedIntBlock_0.tii, _0_MockFixedIntBlock_0.doc, _0_Pulsing41_0.tip, _0.nvd, segments_2, _0.fdx, _0.si, _0.fdt]
[junit4:junit4]   2> 2300 T2961 C144 oasc.SolrDeletionPolicy.updateCommits newest commit = 2[_0.fnm, _0_MockFixedIntBlock_0.pos, _0.nvm, _0_MockFixedIntBlock_0.tib, _0_MockFixedIntBlock_0.frq, _0_Pulsing41_0.doc, _0_Pulsing41_0.pos, _0_MockFixedIntBlock_0.pyl, _0_MockFixedIntBlock_0.skp, _0_Pulsing41_0.tim, _0_MockFixedIntBlock_0.tii, _0_MockFixedIntBlock_0.doc, _0_Pulsing41_0.tip, _0.nvd, segments_2, _0.fdx, _0.si, _0.fdt]
[junit4:junit4]   2> 2303 T2961 oasc.SolrCore.closeSearcher [00012_core] Closing main searcher on request.
[junit4:junit4]   2> 2304 T2961 oasc.CachingDirectoryFactory.close Closing directory when closing factory: /usr/home/hudson/hudson-slave/workspace/Lucene-Solr-NightlyTests-trunk/solr/build/solr-core/test/J1/OpenCloseCoreStressTest_/00012_core/data/index
[junit4:junit4]   2> 2304 T2961 oasc.CachingDirectoryFactory.closeDirectory Closing directory: /usr/home/hudson/hudson-slave/workspace/Lucene-Solr-NightlyTests-trunk/solr/build/solr-core/test/J1/OpenCloseCoreStressTest_/00012_core/data/index
[junit4:junit4]   2> 2320 T3010 oasc.SolrConfig.<init> Using Lucene MatchVersion: LUCENE_41
[junit4:junit4]   2> 2326 T2961 oasc.CachingDirectoryFactory.close Closing directory when closing factory: /usr/home/hudson/hudson-slave/workspace/Lucene-Solr-NightlyTests-trunk/solr/build/solr-core/test/J1/OpenCloseCoreStressTest_/00012_core/data
[junit4:junit4]   2> 2326 T2961 oasc.CachingDirectoryFactory.closeDirectory Closing directory: /usr/home/hudson/hudson-slave/workspace/Lucene-Solr-NightlyTests-trunk/solr/build/solr-core/test/J1/OpenCloseCoreStressTest_/00012_core/data
[junit4:junit4]   2> 2327 T2999 oass.IndexSchema.readSchema unique key field: id
[junit4:junit4]   2> 2327 T2961 oasc.SolrCore.close [00000_core]  CLOSING SolrCore org.apache.solr.core.SolrCore@e7263f4
[junit4:junit4]   2> 2327 T3004 oasc.CoreContainer.create Creating SolrCore '00012_core' using instanceDir: /usr/home/hudson/hudson-slave/workspace/Lucene-Solr-NightlyTests-trunk/solr/build/solr-core/test/J1/./OpenCloseCoreStressTest_/00012_core
[junit4:junit4]   2> 2328 T2957 C163 oasc.SolrDeletionPolicy.onInit SolrDeletionPolicy.onInit: commits:num=1
[junit4:junit4]   2> 		commit{dir=MockDirWrapper(org.apache.lucene.store.NIOFSDirectory@/usr/home/hudson/hudson-slave/workspace/Lucene-Solr-NightlyTests-trunk/solr/build/solr-core/test/J1/OpenCloseCoreStressTest_/00005_core/data/index lockFactory=org.apache.lucene.store.NativeFSLockFactory@75818e6a),segFN=segments_2,generation=2,filenames=[_1_MockFixedIntBlock_0.doc, _1_MockFixedIntBlock_0.pyl, _0_MockFixedIntBlock_0.tib, _1.fnm, _0_MockFixedIntBlock_0.skp, _0_MockFixedIntBlock_0.pyl, _0_Pulsing41_0.tim, _0_MockFixedIntBlock_0.tii, _0_Pulsing41_0.tip, _0.nvd, _0.si, _1.nvm, _1_MockFixedIntBlock_0.tii, _0.fnm, _1_MockFixedIntBlock_0.frq, _1.nvd, _1_Pulsing41_0.doc, _0_MockFixedIntBlock_0.pos, _0.nvm, _1_Pulsing41_0.pos, _0_MockFixedIntBlock_0.frq, _1.fdx, _0_Pulsing41_0.pos, _0_Pulsing41_0.doc, _1_Pulsing41_0.tip, _1_MockFixedIntBlock_0.skp, _1.fdt, _1_Pulsing41_0.tim, _0_MockFixedIntBlock_0.doc, _1.si, _1_MockFixedIntBlock_0.tib, segments_2, _0.fdx, _1_MockFixedIntBlock_0.pos, _0.fdt]
[junit4:junit4]   2> 2328 T3004 oasc.SolrResourceLoader.<init> new SolrResourceLoader for directory: '/usr/home/hudson/hudson-slave/workspace/Lucene-Solr-NightlyTests-trunk/solr/build/solr-core/test/J1/./OpenCloseCoreStressTest_/00012_core/'
[junit4:junit4]   2> 2328 T2957 C163 oasc.SolrDeletionPolicy.updateCommits newest commit = 2[_1_MockFixedIntBlock_0.doc, _1_MockFixedIntBlock_0.pyl, _0_MockFixedIntBlock_0.tib, _1.fnm, _0_MockFixedIntBlock_0.skp, _0_MockFixedIntBlock_0.pyl, _0_Pulsing41_0.tim, _0_MockFixedIntBlock_0.tii, _0_Pulsing41_0.tip, _0.nvd, _0.si, _1.nvm, _1_MockFixedIntBlock_0.tii, _0.fnm, _1_MockFixedIntBlock_0.frq, _1.nvd, _1_Pulsing41_0.doc, _0_MockFixedIntBlock_0.pos, _0.nvm, _1_Pulsing41_0.pos, _0_MockFixedIntBlock_0.frq, _1.fdx, _0_Pulsing41_0.pos, _0_Pulsing41_0.doc, _1_Pulsing41_0.tip, _1_MockFixedIntBlock_0.skp, _1.fdt, _1_Pulsing41_0.tim, _0_MockFixedIntBlock_0.doc, _1.si, _1_MockFixedIntBlock_0.tib, segments_2, _0.fdx, _1_MockFixedIntBlock_0.pos, _0.fdt]
[junit4:junit4]   2> 2328 T2999 oasc.SolrCore.initDirectoryFactory org.apache.solr.core.MockFSDirectoryFactory
[junit4:junit4]   2> 2329 T2999 oasc.SolrCore.<init> [00017_core] Opening new SolrCore at /usr/home/hudson/hudson-slave/workspace/Lucene-Solr-NightlyTests-trunk/solr/build/solr-core/test/J1/./OpenCloseCoreStressTest_/00017_core/, dataDir=/usr/home/hudson/hudson-slave/workspace/Lucene-Solr-NightlyTests-trunk/solr/build/solr-core/test/J1/OpenCloseCoreStressTest_/00017_core/data/
[junit4:junit4]   2> 2330 T2999 oasc.JmxMonitoredMap.<init> JMX monitoring is enabled. Adding Solr mbeans to JMX Server: com.sun.jmx.mbeanserver.JmxMBeanServer@33192410
[junit4:junit4]   2> 2330 T2999 oasc.SolrCore.initDirectoryFactory org.apache.solr.core.MockFSDirectoryFactory
[junit4:junit4]   2> 2331 T2957 C163 UPDATE [00005_core] webapp=/solr path=/update params={wt=javabin&version=2} {add=[id80]} 0 35
[junit4:junit4]   2> 2331 T2995 C163 UPDATE [00005_core] webapp=/solr path=/update params={wt=javabin&version=2} {add=[id52]} 0 35
[junit4:junit4]   2> 2331 T2994 C163 UPDATE [00005_core] webapp=/solr path=/update params={wt=javabin&version=2} {add=[id42]} 0 35
[junit4:junit4]   2> 2332 T2999 oasc.CachingDirectoryFactory.get return new directory for /usr/home/hudson/hudson-slave/workspace/Lucene-Solr-NightlyTests-trunk/solr/build/solr-core/test/J1/OpenCloseCoreStressTest_/00017_core/data
[junit4:junit4]   2> 2331 T2961 oasu.DirectUpdateHandler2.close closing DirectUpdateHandler2{commits=0,autocommits=0,soft autocommits=0,optimizes=0,rollbacks=0,expungeDeletes=0,docsPending=1,adds=1,deletesById=0,deletesByQuery=0,errors=0,cumulative_adds=1,cumulative_deletesById=0,cumulative_deletesByQuery=0,cumulative_errors=0}
[junit4:junit4]   2> 2332 T2961 oasu.SolrCoreState.decrefSolrCoreState Closing SolrCoreState
[junit4:junit4]   2> 2333 T2999 oasc.SolrCore.getNewIndexDir New index directory detected: old=null new=/usr/home/hudson/hudson-slave/workspace/Lucene-Solr-NightlyTests-trunk/solr/build/solr-core/test/J1/OpenCloseCoreStressTest_/00017_core/data/index/
[junit4:junit4]   2> 2333 T2961 oasu.DefaultSolrCoreState.closeIndexWriter SolrCoreState ref count has reached 0 - closing IndexWriter
[junit4:junit4]   2> 2333 T2961 oasu.DefaultSolrCoreState.closeIndexWriter closing IndexWriter with IndexWriterCloser
[junit4:junit4]   2> 2334 T2999 oasc.SolrCore.initWriters created json: solr.JSONResponseWriter
[junit4:junit4]   2> 2335 T2995 C160 UPDATE [00011_core] webapp=/solr path=/update params={wt=javabin&version=2} {add=[id91]} 0 1
[junit4:junit4]   2> 2335 T2999 oasc.RequestHandlers.initHandlersFromConfig created /admin/: solr.admin.AdminHandlers
[junit4:junit4]   2> 2336 T2999 oasc.RequestHandlers.initHandlersFromConfig created /select: solr.SearchHandler
[junit4:junit4]   2> 2337 T2999 oasc.RequestHandlers.initHandlersFromConfig created /update: solr.UpdateRequestHandler
[junit4:junit4]   2> 2356 T2999 oashl.XMLLoader.init xsltCacheLifetimeSeconds=60
[junit4:junit4]   2> 2360 T2999 oasc.CachingDirectoryFactory.get return new directory for /usr/home/hudson/hudson-slave/workspace/Lucene-Solr-NightlyTests-trunk/solr/build/solr-core/test/J1/OpenCloseCoreStressTest_/00017_core/data/index
[junit4:junit4]   2> 2375 T2999 oass.SolrIndexSearcher.<init> Opening Searcher@629269f3 main
[junit4:junit4]   2> 2376 T2999 oasc.SolrCore.registerSearcher [00017_core] Registered new searcher Searcher@629269f3 main{StandardDirectoryReader(segments_2:3 _0(5.0):C2)}
[junit4:junit4]   2> 2376 T2999 oasu.CommitTracker.<init> Hard AutoCommit: disabled
[junit4:junit4]   2> 2376 T2999 oasu.CommitTracker.<init> Soft AutoCommit: disabled
[junit4:junit4]   2> 2381 T2999 oasc.CoreMaps.putTransientCore Opening transient core 00017_core
[junit4:junit4]   2> 2381 T2999 oasc.CoreContainer.registerCore registering core: 00017_core
[junit4:junit4]   2> 2389 T3010 oasc.SolrConfig.<init> Loaded SolrConfig: solrconfig-minimal.xml
[junit4:junit4]   2> 2390 T3010 oass.IndexSchema.readSchema Reading Solr Schema
[junit4:junit4]   2> ASYNC  NEW_CORE C164 name=00017_core org.apache.solr.core.SolrCore@cad0d6b
[junit4:junit4]   2> 2391 T3012 C164 REQ [00017_core] webapp=/solr path=/select params={q=*:*&wt=javabin&qt=/select&version=2} hits=2 status=0 QTime=1 
[junit4:junit4]   2> 2394 T3010 oass.IndexSchema.readSchema Schema name=tiny
[junit4:junit4]   2> 2398 T2999 C164 oasc.SolrDeletionPolicy.onInit SolrDeletionPolicy.onInit: commits:num=1
[junit4:junit4]   2> 		commit{dir=MockDirWrapper(org.apache.lucene.store.MMapDirectory@/usr/home/hudson/hudson-slave/workspace/Lucene-Solr-NightlyTests-trunk/solr/build/solr-core/test/J1/OpenCloseCoreStressTest_/00017_core/data/index lockFactory=org.apache.lucene.store.NativeFSLockFactory@6f28b1),segFN=segments_2,generation=2,filenames=[_0.fnm, _0_MockFixedIntBlock_0.pos, _0.nvm, _0_MockFixedIntBlock_0.tib, _0_MockFixedIntBlock_0.frq, _0_Pulsing41_0.doc, _0_Pulsing41_0.pos, _0_MockFixedIntBlock_0.pyl, _0_MockFixedIntBlock_0.skp, _0_Pulsing41_0.tim, _0_Pulsing41_0.tip, _0_MockFixedIntBlock_0.tii, _0_MockFixedIntBlock_0.doc, _0.nvd, segments_2, _0.fdx, _0.si, _0.fdt]
[junit4:junit4]   2> 2399 T2999 C164 oasc.SolrDeletionPolicy.updateCommits newest commit = 2[_0.fnm, _0_MockFixedIntBlock_0.pos, _0.nvm, _0_MockFixedIntBlock_0.tib, _0_MockFixedIntBlock_0.frq, _0_Pulsing41_0.doc, _0_Pulsing41_0.pos, _0_MockFixedIntBlock_0.pyl, _0_MockFixedIntBlock_0.skp, _0_Pulsing41_0.tim, _0_Pulsing41_0.tip, _0_MockFixedIntBlock_0.tii, _0_MockFixedIntBlock_0.doc, _0.nvd, segments_2, _0.fdx, _0.si, _0.fdt]
[junit4:junit4]   2> 2400 T3006 C162 REQ [00015_core] webapp=/solr path=/select params={q=*:*&wt=javabin&qt=/select&version=2} hits=1 status=0 QTime=0 
[junit4:junit4]   2> 2401 T2999 C164 UPDATE [00017_core] webapp=/solr path=/update params={wt=javabin&version=2} {add=[id64]} 0 11
[junit4:junit4]   2> 2401 T2990 C164 UPDATE [00017_core] webapp=/solr path=/update params={wt=javabin&version=2} {add=[id58]} 0 11
[junit4:junit4]   2> 2411 T2961 C142 oasc.SolrDeletionPolicy.onCommit SolrDeletionPolicy.onCommit: commits:num=2
[junit4:junit4]   2> 		commit{dir=MockDirWrapper(org.apache.lucene.store.MMapDirectory@/usr/home/hudson/hudson-slave/workspace/Lucene-Solr-NightlyTests-trunk/solr/build/solr-core/test/J1/OpenCloseCoreStressTest_/00000_core/data/index lockFactory=org.apache.lucene.store.NativeFSLockFactory@4a4e0809),segFN=segments_1,generation=1,filenames=[segments_1]
[junit4:junit4]   2> 		commit{dir=MockDirWrapper(org.apache.lucene.store.MMapDirectory@/usr/home/hudson/hudson-slave/workspace/Lucene-Solr-NightlyTests-trunk/solr/build/solr-core/test/J1/OpenCloseCoreStressTest_/00000_core/data/index lockFactory=org.apache.lucene.store.NativeFSLockFactory@4a4e0809),segFN=segments_2,generation=2,filenames=[_0.fnm, _0_MockFixedIntBlock_0.pos, _0.nvm, _0_MockFixedIntBlock_0.tib, _0_MockFixedIntBlock_0.frq, _0_Pulsing41_0.doc, _0_Pulsing41_0.pos, _0_MockFixedIntBlock_0.pyl, _0_MockFixedIntBlock_0.skp, _0_Pulsing41_0.tim, _0_MockFixedIntBlock_0.tii, _0_MockFixedIntBlock_0.doc, _0_Pulsing41_0.tip, _0.nvd, segments_2, _0.fdx, _0.si, _0.fdt]
[junit4:junit4]   2> 2412 T2961 C142 oasc.SolrDeletionPolicy.updateCommits newest commit = 2[_0.fnm, _0_MockFixedIntBlock_0.pos, _0.nvm, _0_MockFixedIntBlock_0.tib, _0_MockFixedIntBlock_0.frq, _0_Pulsing41_0.doc, _0_Pulsing41_0.pos, _0_MockFixedIntBlock_0.pyl, _0_MockFixedIntBlock_0.skp, _0_Pulsing41_0.tim, _0_MockFixedIntBlock_0.tii, _0_MockFixedIntBlock_0.doc, _0_Pulsing41_0.tip, _0.nvd, segments_2, _0.fdx, _0.si, _0.fdt]
[junit4:junit4]   2> 2411 T2990 C146 UPDATE [00019_core] webapp=/solr path=/update params={wt=javabin&version=2} {add=[id95]} 0 0
[junit4:junit4]   2> 2416 T2961 oasc.SolrCore.closeSearcher [00000_core] Closing main searcher on request.
[junit4:junit4]   2> 2416 T2961 oasc.CachingDirectoryFactory.close Closing directory when closing factory: /usr/home/hudson/hudson-slave/workspace/Lucene-Solr-NightlyTests-trunk/solr/build/solr-core/test/J1/OpenCloseCoreStressTest_/00000_core/data
[junit4:junit4]  

[...truncated too long message...]

FixedIntBlock_0.skp, _e0.fdx, _ej_MockFixedIntBlock_0.doc, _en.fnm, _er_MockFixedIntBlock_0.tii, _ei_Pulsing41_0.tim, _er_MockFixedIntBlock_0.tib, _ei_Pulsing41_0.tip, _da_Pulsing41_0.tip, _e0.nvd, _er.nvm, _da_Pulsing41_0.tim, _eq.nvm, _ek_MockFixedIntBlock_0.frq, _ej_Pulsing41_0.pos, _em_Pulsing41_0.tim, _er.si, _en_Pulsing41_0.pos, _da_MockFixedIntBlock_0.skp, _em_Pulsing41_0.tip, _ej_MockFixedIntBlock_0.skp, _er_Pulsing41_0.pos, _ep_MockFixedIntBlock_0.pos, _eo_MockFixedIntBlock_0.tib, _el_MockFixedIntBlock_0.pyl, _eo_MockFixedIntBlock_0.tii, _ek_MockFixedIntBlock_0.doc, _ej_MockFixedIntBlock_0.pyl, _ei.si, _el_MockFixedIntBlock_0.tib, _em.fnm, _em_MockFixedIntBlock_0.frq, _er.nvd, _ei.nvd, _en_Pulsing41_0.tim, _en_MockFixedIntBlock_0.pyl, _en_Pulsing41_0.tip, _ep.si, _ei.nvm, _en_Pulsing41_0.doc, _ei_MockFixedIntBlock_0.pyl, _ej_Pulsing41_0.doc, _e0_Pulsing41_0.doc, _er_Pulsing41_0.tip, _ei_MockFixedIntBlock_0.tii, _e0_MockFixedIntBlock_0.pos, _er_Pulsing41_0.tim, _eo.si, _en_MockFixedIntBlock_0.tib, _er.fdx, _er_Pulsing41_0.doc, _ei_MockFixedIntBlock_0.tib, _el_Pulsing41_0.tip, _ej_Pulsing41_0.tim, _el_Pulsing41_0.tim, _en_MockFixedIntBlock_0.tii, _ej.fdt, _er.fdt, _ej_Pulsing41_0.tip, _eo.nvm, _ej_MockFixedIntBlock_0.frq, _el_MockFixedIntBlock_0.skp, _en_MockFixedIntBlock_0.doc, _ej.fdx, _ei_MockFixedIntBlock_0.doc, _ek_MockFixedIntBlock_0.pyl, _ei.fdx, _e0.si, _ei.fdt, _eo_Pulsing41_0.pos, _el_MockFixedIntBlock_0.tii, _eq_MockFixedIntBlock_0.pos, _em_Pulsing41_0.pos, _ep_MockFixedIntBlock_0.tii, _ek.fdt, _ep_MockFixedIntBlock_0.tib, _da_Pulsing41_0.doc, _ej.si, _ek.fdx, _da_MockFixedIntBlock_0.pos, _da_MockFixedIntBlock_0.doc, _er_MockFixedIntBlock_0.pos, _em_MockFixedIntBlock_0.doc, _ep.nvm, _da_MockFixedIntBlock_0.frq, _el.fdx, _eq.fnm, _ep_MockFixedIntBlock_0.doc, _eq_Pulsing41_0.doc, _ek.nvd, _ei_Pulsing41_0.pos, _em_MockFixedIntBlock_0.pyl, _eq_MockFixedIntBlock_0.skp, _el.fdt, _eo_Pulsing41_0.doc, _da_Pulsing41_0.pos, _em_MockFixedIntBlock_0.skp, _ek.nvm, _eq_MockFixedIntBlock_0.doc, _eo.nvd, _en.nvm, _ej.nvd, _ek_MockFixedIntBlock_0.tib, _ej_MockFixedIntBlock_0.tii, _da.si, _en.nvd, _ei_Pulsing41_0.doc, _ej.nvm, _eo_MockFixedIntBlock_0.pyl, _ek_MockFixedIntBlock_0.tii, _ej_MockFixedIntBlock_0.tib, _e0_Pulsing41_0.tip, _ep_Pulsing41_0.doc, _e0_MockFixedIntBlock_0.doc, _e0_Pulsing41_0.tim, _el_Pulsing41_0.doc, _da.fdx, _ek.si, _eo.fdt, _eo.fdx, _en.fdt, _eo_MockFixedIntBlock_0.frq, _ep_MockFixedIntBlock_0.pyl, _da.fdt, _en.fdx, _el.nvm, _ep_Pulsing41_0.pos, _en_MockFixedIntBlock_0.frq, _el.nvd, _eq_Pulsing41_0.tim, _eq_Pulsing41_0.tip, _ei_MockFixedIntBlock_0.frq, segments_2, _e0_MockFixedIntBlock_0.skp, _e0.fnm]
[junit4:junit4]   2> 		commit{dir=MockDirWrapper(org.apache.lucene.store.NIOFSDirectory@/usr/home/hudson/hudson-slave/workspace/Lucene-Solr-NightlyTests-trunk/solr/build/solr-core/test/J1/OpenCloseCoreStressTest_/00003_core/data/index lockFactory=org.apache.lucene.store.NativeFSLockFactory@6eb1caaf),segFN=segments_3,generation=3,filenames=[_e0_Pulsing41_0.pos, _da_MockFixedIntBlock_0.frq, _es_MockFixedIntBlock_0.tib, _es_MockFixedIntBlock_0.frq, _e0_MockFixedIntBlock_0.frq, _es_MockFixedIntBlock_0.tii, _es_Pulsing41_0.pos, _es.fnm, _da_Pulsing41_0.pos, _e0_MockFixedIntBlock_0.pyl, _e0_MockFixedIntBlock_0.tib, _es_Pulsing41_0.tim, _es.fdt, _es_Pulsing41_0.tip, _es.fdx, _e0.nvm, _e0_MockFixedIntBlock_0.tii, _es.si, _es_MockFixedIntBlock_0.pyl, _es_MockFixedIntBlock_0.doc, _es.nvm, _da_MockFixedIntBlock_0.pyl, _e0.fdt, _e0_Pulsing41_0.doc, _da.si, _e0.fdx, _e0_MockFixedIntBlock_0.pos, _da.fnm, _es.nvd, _e0_Pulsing41_0.tip, _da.nvd, _e0_MockFixedIntBlock_0.doc, _e0_Pulsing41_0.tim, _es_MockFixedIntBlock_0.pos, _da.fdx, _da.nvm, _da_Pulsing41_0.tip, _e0.nvd, _da_Pulsing41_0.tim, _da.fdt, _e0.si, _es_Pulsing41_0.doc, _es_MockFixedIntBlock_0.skp, _da_MockFixedIntBlock_0.skp, _da_Pulsing41_0.doc, _da_MockFixedIntBlock_0.tii, _da_MockFixedIntBlock_0.tib, _e0_MockFixedIntBlock_0.skp, _e0.fnm, segments_3, _da_MockFixedIntBlock_0.pos, _da_MockFixedIntBlock_0.doc]
[junit4:junit4]   2> 809402 T2951 C1288 oasc.SolrDeletionPolicy.updateCommits newest commit = 3[_e0_Pulsing41_0.pos, _da_MockFixedIntBlock_0.frq, _es_MockFixedIntBlock_0.tib, _es_MockFixedIntBlock_0.frq, _e0_MockFixedIntBlock_0.frq, _es_MockFixedIntBlock_0.tii, _es_Pulsing41_0.pos, _es.fnm, _da_Pulsing41_0.pos, _e0_MockFixedIntBlock_0.pyl, _e0_MockFixedIntBlock_0.tib, _es_Pulsing41_0.tim, _es.fdt, _es_Pulsing41_0.tip, _es.fdx, _e0.nvm, _e0_MockFixedIntBlock_0.tii, _es.si, _es_MockFixedIntBlock_0.pyl, _es_MockFixedIntBlock_0.doc, _es.nvm, _da_MockFixedIntBlock_0.pyl, _e0.fdt, _e0_Pulsing41_0.doc, _da.si, _e0.fdx, _e0_MockFixedIntBlock_0.pos, _da.fnm, _es.nvd, _e0_Pulsing41_0.tip, _da.nvd, _e0_MockFixedIntBlock_0.doc, _e0_Pulsing41_0.tim, _es_MockFixedIntBlock_0.pos, _da.fdx, _da.nvm, _da_Pulsing41_0.tip, _e0.nvd, _da_Pulsing41_0.tim, _da.fdt, _e0.si, _es_Pulsing41_0.doc, _es_MockFixedIntBlock_0.skp, _da_MockFixedIntBlock_0.skp, _da_Pulsing41_0.doc, _da_MockFixedIntBlock_0.tii, _da_MockFixedIntBlock_0.tib, _e0_MockFixedIntBlock_0.skp, _e0.fnm, segments_3, _da_MockFixedIntBlock_0.pos, _da_MockFixedIntBlock_0.doc]
[junit4:junit4]   2> 809467 T2951 oasc.SolrCore.closeSearcher [00003_core] Closing main searcher on request.
[junit4:junit4]   2> 809501 T2951 oasc.CachingDirectoryFactory.close Closing directory when closing factory: /usr/home/hudson/hudson-slave/workspace/Lucene-Solr-NightlyTests-trunk/solr/build/solr-core/test/J1/OpenCloseCoreStressTest_/00003_core/data
[junit4:junit4]   2> 809502 T2951 oasc.CachingDirectoryFactory.closeDirectory Closing directory: /usr/home/hudson/hudson-slave/workspace/Lucene-Solr-NightlyTests-trunk/solr/build/solr-core/test/J1/OpenCloseCoreStressTest_/00003_core/data
[junit4:junit4]   2> 809503 T2951 oasc.CachingDirectoryFactory.close Closing directory when closing factory: /usr/home/hudson/hudson-slave/workspace/Lucene-Solr-NightlyTests-trunk/solr/build/solr-core/test/J1/OpenCloseCoreStressTest_/00003_core/data/index
[junit4:junit4]   2> 809503 T2951 oasc.CachingDirectoryFactory.closeDirectory Closing directory: /usr/home/hudson/hudson-slave/workspace/Lucene-Solr-NightlyTests-trunk/solr/build/solr-core/test/J1/OpenCloseCoreStressTest_/00003_core/data/index
[junit4:junit4]   2> 815231 T2951 oejsh.ContextHandler.doStop stopped o.e.j.s.ServletContextHandler{/solr,null}
[junit4:junit4]   2> 816248 T2951 oas.SolrTestCaseJ4.tearDown ###Ending test10MinutesOld
[junit4:junit4]   2> 816250 T2951 oas.SolrTestCaseJ4.deleteCore ###deleteCore
[junit4:junit4]   2> NOTE: test params are: codec=Lucene42: {id=Pulsing41(freqCutoff=10 minBlockSize=17 maxBlockSize=55), text=MockFixedIntBlock(blockSize=1252)}, docValues:{}, sim=RandomSimilarityProvider(queryNorm=true,coord=crazy): {}, locale=lv_LV, timezone=Etc/GMT0
[junit4:junit4]   2> NOTE: FreeBSD 9.0-RELEASE amd64/Oracle Corporation 1.7.0_17 (64-bit)/cpus=16,threads=1,free=355202544,total=465502208
[junit4:junit4]   2> NOTE: All tests run in this JVM: [OpenExchangeRatesOrgProviderTest, TestFastOutputStream, TestStressReorder, TestZkChroot, SortByFunctionTest, SpellCheckCollatorTest, DebugComponentTest, TestUpdate, SolrCoreCheckLockOnStartupTest, TestIndexSearcher, TestFieldTypeResource, HardAutoCommitTest, CoreContainerCoreInitFailuresTest, TestDynamicFieldCollectionResource, FieldAnalysisRequestHandlerTest, TestReload, TestSolrDiscoveryProperties, IndexBasedSpellCheckerTest, ClusterStateTest, CurrencyFieldXmlFileTest, IndexReaderFactoryTest, UpdateParamsTest, TermVectorComponentDistributedTest, TestJmxMonitoredMap, PingRequestHandlerTest, StandardRequestHandlerTest, TestElisionMultitermQuery, TimeZoneUtilsTest, StatsComponentTest, URLClassifyProcessorTest, SolrCmdDistributorTest, TestQuerySenderNoQuery, XmlUpdateRequestHandlerTest, DOMUtilTest, JSONWriterTest, DirectSolrSpellCheckerTest, ZkSolrClientTest, TestArbitraryIndexDir, UniqFieldsUpdateProcessorFactoryTest, SimplePostToolTest, ConvertedLegacyTest, DistanceFunctionTest, TestOmitPositions, SpellPossibilityIteratorTest, BadIndexSchemaTest, SolrTestCaseJ4Test, TestRTGBase, TestDistributedSearch, TestJmxIntegration, ChaosMonkeySafeLeaderTest, TestSolrXMLSerializer, CurrencyFieldOpenExchangeTest, TestSolrJ, TestPartialUpdateDeduplication, RequestHandlersTest, BasicDistributedZk2Test, NotRequiredUniqueKeyTest, SignatureUpdateProcessorFactoryTest, CollectionsAPIDistributedZkTest, TestIndexingPerformance, PathHierarchyTokenizerFactoryTest, TestLuceneMatchVersion, ShardRoutingCustomTest, DefaultValueUpdateProcessorTest, CopyFieldTest, OpenCloseCoreStressTest]
[junit4:junit4] Completed on J1 in 816.28s, 6 tests, 1 failure, 2 skipped <<< FAILURES!

[...truncated 411 lines...]
BUILD FAILED
/usr/home/hudson/hudson-slave/workspace/Lucene-Solr-NightlyTests-trunk/build.xml:382: The following error occurred while executing this line:
/usr/home/hudson/hudson-slave/workspace/Lucene-Solr-NightlyTests-trunk/build.xml:355: The following error occurred while executing this line:
/usr/home/hudson/hudson-slave/workspace/Lucene-Solr-NightlyTests-trunk/build.xml:39: The following error occurred while executing this line:
/usr/home/hudson/hudson-slave/workspace/Lucene-Solr-NightlyTests-trunk/solr/build.xml:183: The following error occurred while executing this line:
/usr/home/hudson/hudson-slave/workspace/Lucene-Solr-NightlyTests-trunk/solr/common-build.xml:449: The following error occurred while executing this line:
/usr/home/hudson/hudson-slave/workspace/Lucene-Solr-NightlyTests-trunk/lucene/common-build.xml:1210: The following error occurred while executing this line:
/usr/home/hudson/hudson-slave/workspace/Lucene-Solr-NightlyTests-trunk/lucene/common-build.xml:874: There were test failures: 272 suites, 1146 tests, 1 failure, 25 ignored (6 assumptions)

Total time: 97 minutes 35 seconds
Build step 'Invoke Ant' marked build as failure
Archiving artifacts
Recording test results
Email was triggered for: Failure
Sending email for trigger: Failure



Mime
View raw message