lucene-dev mailing list archives

Site index · List index
Message view « Date » · « Thread »
Top « Date » · « Thread »
From Policeman Jenkins Server <jenk...@thetaphi.de>
Subject [JENKINS] Lucene-Solr-trunk-Linux (32bit/jdk1.8.0-ea-b79) - Build # 4594 - Still Failing!
Date Wed, 06 Mar 2013 12:34:29 GMT
Build: http://jenkins.thetaphi.de/job/Lucene-Solr-trunk-Linux/4594/
Java: 32bit/jdk1.8.0-ea-b79 -client -XX:+UseConcMarkSweepGC

4 tests failed.
REGRESSION:  org.apache.solr.cloud.UnloadDistributedZkTest.testDistribSearch

Error Message:
Still found shard

Stack Trace:
java.lang.AssertionError: Still found shard
	at __randomizedtesting.SeedInfo.seed([6E9A2F599977315B:EF7CA141EE285167]:0)
	at org.junit.Assert.fail(Assert.java:93)
	at org.apache.solr.cloud.UnloadDistributedZkTest.testUnloadShardAndCollection(UnloadDistributedZkTest.java:124)
	at org.apache.solr.cloud.UnloadDistributedZkTest.doTest(UnloadDistributedZkTest.java:77)
	at org.apache.solr.BaseDistributedSearchTestCase.testDistribSearch(BaseDistributedSearchTestCase.java:806)
	at sun.reflect.NativeMethodAccessorImpl.invoke0(Native Method)
	at sun.reflect.NativeMethodAccessorImpl.invoke(NativeMethodAccessorImpl.java:57)
	at sun.reflect.DelegatingMethodAccessorImpl.invoke(DelegatingMethodAccessorImpl.java:43)
	at java.lang.reflect.Method.invoke(Method.java:487)
	at com.carrotsearch.randomizedtesting.RandomizedRunner.invoke(RandomizedRunner.java:1559)
	at com.carrotsearch.randomizedtesting.RandomizedRunner.access$600(RandomizedRunner.java:79)
	at com.carrotsearch.randomizedtesting.RandomizedRunner$6.evaluate(RandomizedRunner.java:737)
	at com.carrotsearch.randomizedtesting.RandomizedRunner$7.evaluate(RandomizedRunner.java:773)
	at com.carrotsearch.randomizedtesting.RandomizedRunner$8.evaluate(RandomizedRunner.java:787)
	at com.carrotsearch.randomizedtesting.rules.SystemPropertiesRestoreRule$1.evaluate(SystemPropertiesRestoreRule.java:53)
	at org.apache.lucene.util.TestRuleSetupTeardownChained$1.evaluate(TestRuleSetupTeardownChained.java:50)
	at org.apache.lucene.util.TestRuleFieldCacheSanity$1.evaluate(TestRuleFieldCacheSanity.java:51)
	at org.apache.lucene.util.AbstractBeforeAfterRule$1.evaluate(AbstractBeforeAfterRule.java:46)
	at com.carrotsearch.randomizedtesting.rules.SystemPropertiesInvariantRule$1.evaluate(SystemPropertiesInvariantRule.java:55)
	at org.apache.lucene.util.TestRuleThreadAndTestName$1.evaluate(TestRuleThreadAndTestName.java:49)
	at org.apache.lucene.util.TestRuleIgnoreAfterMaxFailures$1.evaluate(TestRuleIgnoreAfterMaxFailures.java:70)
	at org.apache.lucene.util.TestRuleMarkFailure$1.evaluate(TestRuleMarkFailure.java:48)
	at com.carrotsearch.randomizedtesting.rules.StatementAdapter.evaluate(StatementAdapter.java:36)
	at com.carrotsearch.randomizedtesting.ThreadLeakControl$StatementRunner.run(ThreadLeakControl.java:358)
	at com.carrotsearch.randomizedtesting.ThreadLeakControl.forkTimeoutingTask(ThreadLeakControl.java:782)
	at com.carrotsearch.randomizedtesting.ThreadLeakControl$3.evaluate(ThreadLeakControl.java:442)
	at com.carrotsearch.randomizedtesting.RandomizedRunner.runSingleTest(RandomizedRunner.java:746)
	at com.carrotsearch.randomizedtesting.RandomizedRunner$3.evaluate(RandomizedRunner.java:648)
	at com.carrotsearch.randomizedtesting.RandomizedRunner$4.evaluate(RandomizedRunner.java:682)
	at com.carrotsearch.randomizedtesting.RandomizedRunner$5.evaluate(RandomizedRunner.java:693)
	at com.carrotsearch.randomizedtesting.rules.StatementAdapter.evaluate(StatementAdapter.java:36)
	at com.carrotsearch.randomizedtesting.rules.SystemPropertiesRestoreRule$1.evaluate(SystemPropertiesRestoreRule.java:53)
	at org.apache.lucene.util.AbstractBeforeAfterRule$1.evaluate(AbstractBeforeAfterRule.java:46)
	at org.apache.lucene.util.TestRuleStoreClassName$1.evaluate(TestRuleStoreClassName.java:42)
	at com.carrotsearch.randomizedtesting.rules.SystemPropertiesInvariantRule$1.evaluate(SystemPropertiesInvariantRule.java:55)
	at com.carrotsearch.randomizedtesting.rules.NoShadowingOrOverridesOnMethodsRule$1.evaluate(NoShadowingOrOverridesOnMethodsRule.java:39)
	at com.carrotsearch.randomizedtesting.rules.NoShadowingOrOverridesOnMethodsRule$1.evaluate(NoShadowingOrOverridesOnMethodsRule.java:39)
	at com.carrotsearch.randomizedtesting.rules.StatementAdapter.evaluate(StatementAdapter.java:36)
	at org.apache.lucene.util.TestRuleAssertionsRequired$1.evaluate(TestRuleAssertionsRequired.java:43)
	at org.apache.lucene.util.TestRuleMarkFailure$1.evaluate(TestRuleMarkFailure.java:48)
	at org.apache.lucene.util.TestRuleIgnoreAfterMaxFailures$1.evaluate(TestRuleIgnoreAfterMaxFailures.java:70)
	at org.apache.lucene.util.TestRuleIgnoreTestSuites$1.evaluate(TestRuleIgnoreTestSuites.java:55)
	at com.carrotsearch.randomizedtesting.rules.StatementAdapter.evaluate(StatementAdapter.java:36)
	at com.carrotsearch.randomizedtesting.ThreadLeakControl$StatementRunner.run(ThreadLeakControl.java:358)
	at java.lang.Thread.run(Thread.java:722)


FAILED:  org.apache.solr.cloud.BasicDistributedZk2Test.testDistribSearch

Error Message:
Server at http://127.0.0.1:40109/_fus/v/onenodecollectioncore returned non ok status:404, message:Can not find: /_fus/v/onenodecollectioncore/update

Stack Trace:
org.apache.solr.common.SolrException: Server at http://127.0.0.1:40109/_fus/v/onenodecollectioncore returned non ok status:404, message:Can not find: /_fus/v/onenodecollectioncore/update
	at __randomizedtesting.SeedInfo.seed([6E9A2F599977315B:EF7CA141EE285167]:0)
	at org.apache.solr.client.solrj.impl.HttpSolrServer.request(HttpSolrServer.java:375)
	at org.apache.solr.client.solrj.impl.HttpSolrServer.request(HttpSolrServer.java:181)
	at org.apache.solr.client.solrj.request.AbstractUpdateRequest.process(AbstractUpdateRequest.java:117)
	at org.apache.solr.client.solrj.SolrServer.add(SolrServer.java:116)
	at org.apache.solr.client.solrj.SolrServer.add(SolrServer.java:102)
	at org.apache.solr.cloud.BasicDistributedZk2Test.testNodeWithoutCollectionForwarding(BasicDistributedZk2Test.java:200)
	at org.apache.solr.cloud.BasicDistributedZk2Test.doTest(BasicDistributedZk2Test.java:89)
	at org.apache.solr.BaseDistributedSearchTestCase.testDistribSearch(BaseDistributedSearchTestCase.java:806)
	at sun.reflect.NativeMethodAccessorImpl.invoke0(Native Method)
	at sun.reflect.NativeMethodAccessorImpl.invoke(NativeMethodAccessorImpl.java:57)
	at sun.reflect.DelegatingMethodAccessorImpl.invoke(DelegatingMethodAccessorImpl.java:43)
	at java.lang.reflect.Method.invoke(Method.java:487)
	at com.carrotsearch.randomizedtesting.RandomizedRunner.invoke(RandomizedRunner.java:1559)
	at com.carrotsearch.randomizedtesting.RandomizedRunner.access$600(RandomizedRunner.java:79)
	at com.carrotsearch.randomizedtesting.RandomizedRunner$6.evaluate(RandomizedRunner.java:737)
	at com.carrotsearch.randomizedtesting.RandomizedRunner$7.evaluate(RandomizedRunner.java:773)
	at com.carrotsearch.randomizedtesting.RandomizedRunner$8.evaluate(RandomizedRunner.java:787)
	at com.carrotsearch.randomizedtesting.rules.SystemPropertiesRestoreRule$1.evaluate(SystemPropertiesRestoreRule.java:53)
	at org.apache.lucene.util.TestRuleSetupTeardownChained$1.evaluate(TestRuleSetupTeardownChained.java:50)
	at org.apache.lucene.util.TestRuleFieldCacheSanity$1.evaluate(TestRuleFieldCacheSanity.java:51)
	at org.apache.lucene.util.AbstractBeforeAfterRule$1.evaluate(AbstractBeforeAfterRule.java:46)
	at com.carrotsearch.randomizedtesting.rules.SystemPropertiesInvariantRule$1.evaluate(SystemPropertiesInvariantRule.java:55)
	at org.apache.lucene.util.TestRuleThreadAndTestName$1.evaluate(TestRuleThreadAndTestName.java:49)
	at org.apache.lucene.util.TestRuleIgnoreAfterMaxFailures$1.evaluate(TestRuleIgnoreAfterMaxFailures.java:70)
	at org.apache.lucene.util.TestRuleMarkFailure$1.evaluate(TestRuleMarkFailure.java:48)
	at com.carrotsearch.randomizedtesting.rules.StatementAdapter.evaluate(StatementAdapter.java:36)
	at com.carrotsearch.randomizedtesting.ThreadLeakControl$StatementRunner.run(ThreadLeakControl.java:358)
	at com.carrotsearch.randomizedtesting.ThreadLeakControl.forkTimeoutingTask(ThreadLeakControl.java:782)
	at com.carrotsearch.randomizedtesting.ThreadLeakControl$3.evaluate(ThreadLeakControl.java:442)
	at com.carrotsearch.randomizedtesting.RandomizedRunner.runSingleTest(RandomizedRunner.java:746)
	at com.carrotsearch.randomizedtesting.RandomizedRunner$3.evaluate(RandomizedRunner.java:648)
	at com.carrotsearch.randomizedtesting.RandomizedRunner$4.evaluate(RandomizedRunner.java:682)
	at com.carrotsearch.randomizedtesting.RandomizedRunner$5.evaluate(RandomizedRunner.java:693)
	at com.carrotsearch.randomizedtesting.rules.StatementAdapter.evaluate(StatementAdapter.java:36)
	at com.carrotsearch.randomizedtesting.rules.SystemPropertiesRestoreRule$1.evaluate(SystemPropertiesRestoreRule.java:53)
	at org.apache.lucene.util.AbstractBeforeAfterRule$1.evaluate(AbstractBeforeAfterRule.java:46)
	at org.apache.lucene.util.TestRuleStoreClassName$1.evaluate(TestRuleStoreClassName.java:42)
	at com.carrotsearch.randomizedtesting.rules.SystemPropertiesInvariantRule$1.evaluate(SystemPropertiesInvariantRule.java:55)
	at com.carrotsearch.randomizedtesting.rules.NoShadowingOrOverridesOnMethodsRule$1.evaluate(NoShadowingOrOverridesOnMethodsRule.java:39)
	at com.carrotsearch.randomizedtesting.rules.NoShadowingOrOverridesOnMethodsRule$1.evaluate(NoShadowingOrOverridesOnMethodsRule.java:39)
	at com.carrotsearch.randomizedtesting.rules.StatementAdapter.evaluate(StatementAdapter.java:36)
	at org.apache.lucene.util.TestRuleAssertionsRequired$1.evaluate(TestRuleAssertionsRequired.java:43)
	at org.apache.lucene.util.TestRuleMarkFailure$1.evaluate(TestRuleMarkFailure.java:48)
	at org.apache.lucene.util.TestRuleIgnoreAfterMaxFailures$1.evaluate(TestRuleIgnoreAfterMaxFailures.java:70)
	at org.apache.lucene.util.TestRuleIgnoreTestSuites$1.evaluate(TestRuleIgnoreTestSuites.java:55)
	at com.carrotsearch.randomizedtesting.rules.StatementAdapter.evaluate(StatementAdapter.java:36)
	at com.carrotsearch.randomizedtesting.ThreadLeakControl$StatementRunner.run(ThreadLeakControl.java:358)
	at java.lang.Thread.run(Thread.java:722)


FAILED:  org.apache.solr.rest.TestFieldCollectionResource.testGetAllFields

Error Message:
Exception during query

Stack Trace:
java.lang.RuntimeException: Exception during query
	at __randomizedtesting.SeedInfo.seed([6E9A2F599977315B:8234659D6384C8C3]:0)
	at org.apache.solr.util.RestTestBase.assertQ(RestTestBase.java:143)
	at org.apache.solr.rest.TestFieldCollectionResource.testGetAllFields(TestFieldCollectionResource.java:26)
	at sun.reflect.NativeMethodAccessorImpl.invoke0(Native Method)
	at sun.reflect.NativeMethodAccessorImpl.invoke(NativeMethodAccessorImpl.java:57)
	at sun.reflect.DelegatingMethodAccessorImpl.invoke(DelegatingMethodAccessorImpl.java:43)
	at java.lang.reflect.Method.invoke(Method.java:487)
	at com.carrotsearch.randomizedtesting.RandomizedRunner.invoke(RandomizedRunner.java:1559)
	at com.carrotsearch.randomizedtesting.RandomizedRunner.access$600(RandomizedRunner.java:79)
	at com.carrotsearch.randomizedtesting.RandomizedRunner$6.evaluate(RandomizedRunner.java:737)
	at com.carrotsearch.randomizedtesting.RandomizedRunner$7.evaluate(RandomizedRunner.java:773)
	at com.carrotsearch.randomizedtesting.RandomizedRunner$8.evaluate(RandomizedRunner.java:787)
	at com.carrotsearch.randomizedtesting.rules.SystemPropertiesRestoreRule$1.evaluate(SystemPropertiesRestoreRule.java:53)
	at org.apache.lucene.util.TestRuleSetupTeardownChained$1.evaluate(TestRuleSetupTeardownChained.java:50)
	at org.apache.lucene.util.TestRuleFieldCacheSanity$1.evaluate(TestRuleFieldCacheSanity.java:51)
	at org.apache.lucene.util.AbstractBeforeAfterRule$1.evaluate(AbstractBeforeAfterRule.java:46)
	at com.carrotsearch.randomizedtesting.rules.SystemPropertiesInvariantRule$1.evaluate(SystemPropertiesInvariantRule.java:55)
	at org.apache.lucene.util.TestRuleThreadAndTestName$1.evaluate(TestRuleThreadAndTestName.java:49)
	at org.apache.lucene.util.TestRuleIgnoreAfterMaxFailures$1.evaluate(TestRuleIgnoreAfterMaxFailures.java:70)
	at org.apache.lucene.util.TestRuleMarkFailure$1.evaluate(TestRuleMarkFailure.java:48)
	at com.carrotsearch.randomizedtesting.rules.StatementAdapter.evaluate(StatementAdapter.java:36)
	at com.carrotsearch.randomizedtesting.ThreadLeakControl$StatementRunner.run(ThreadLeakControl.java:358)
	at com.carrotsearch.randomizedtesting.ThreadLeakControl.forkTimeoutingTask(ThreadLeakControl.java:782)
	at com.carrotsearch.randomizedtesting.ThreadLeakControl$3.evaluate(ThreadLeakControl.java:442)
	at com.carrotsearch.randomizedtesting.RandomizedRunner.runSingleTest(RandomizedRunner.java:746)
	at com.carrotsearch.randomizedtesting.RandomizedRunner$3.evaluate(RandomizedRunner.java:648)
	at com.carrotsearch.randomizedtesting.RandomizedRunner$4.evaluate(RandomizedRunner.java:682)
	at com.carrotsearch.randomizedtesting.RandomizedRunner$5.evaluate(RandomizedRunner.java:693)
	at com.carrotsearch.randomizedtesting.rules.StatementAdapter.evaluate(StatementAdapter.java:36)
	at com.carrotsearch.randomizedtesting.rules.SystemPropertiesRestoreRule$1.evaluate(SystemPropertiesRestoreRule.java:53)
	at org.apache.lucene.util.AbstractBeforeAfterRule$1.evaluate(AbstractBeforeAfterRule.java:46)
	at org.apache.lucene.util.TestRuleStoreClassName$1.evaluate(TestRuleStoreClassName.java:42)
	at com.carrotsearch.randomizedtesting.rules.SystemPropertiesInvariantRule$1.evaluate(SystemPropertiesInvariantRule.java:55)
	at com.carrotsearch.randomizedtesting.rules.NoShadowingOrOverridesOnMethodsRule$1.evaluate(NoShadowingOrOverridesOnMethodsRule.java:39)
	at com.carrotsearch.randomizedtesting.rules.NoShadowingOrOverridesOnMethodsRule$1.evaluate(NoShadowingOrOverridesOnMethodsRule.java:39)
	at com.carrotsearch.randomizedtesting.rules.StatementAdapter.evaluate(StatementAdapter.java:36)
	at org.apache.lucene.util.TestRuleAssertionsRequired$1.evaluate(TestRuleAssertionsRequired.java:43)
	at org.apache.lucene.util.TestRuleMarkFailure$1.evaluate(TestRuleMarkFailure.java:48)
	at org.apache.lucene.util.TestRuleIgnoreAfterMaxFailures$1.evaluate(TestRuleIgnoreAfterMaxFailures.java:70)
	at org.apache.lucene.util.TestRuleIgnoreTestSuites$1.evaluate(TestRuleIgnoreTestSuites.java:55)
	at com.carrotsearch.randomizedtesting.rules.StatementAdapter.evaluate(StatementAdapter.java:36)
	at com.carrotsearch.randomizedtesting.ThreadLeakControl$StatementRunner.run(ThreadLeakControl.java:358)
	at java.lang.Thread.run(Thread.java:722)
Caused by: java.lang.RuntimeException: REQUEST FAILED: xpath=(/response/arr[@name='fields']/lst/str[@name='name'])[1] = 'custstopfilt'
	xml response was: <?xml version="1.0" encoding="UTF-8"?>
<response>

<lst name="responseHeader">
  <int name="status">0</int>
  <int name="QTime">2</int>
</lst>
<arr name="fields">
  <lst>
    <str name="name">sindsto</str>
    <str name="type">string</str>
    <bool name="indexed">true</bool>
    <bool name="stored">true</bool>
  </lst>
  <lst>
    <str name="name">protectedsubword</str>
    <str name="type">protectedsubword</str>
    <bool name="indexed">true</bool>
    <bool name="stored">true</bool>
  </lst>
  <lst>
    <str name="name">custstopfilt</str>
    <str name="type">custstopfilt</str>
    <bool name="indexed">true</bool>
    <bool name="stored">true</bool>
  </lst>
  <lst>
    <str name="name">title</str>
    <str name="type">nametext</str>
    <bool name="indexed">true</bool>
    <bool name="stored">true</bool>
  </lst>
  <lst>
    <str name="name">nouniq</str>
    <str name="type">string</str>
    <bool name="indexed">true</bool>
    <bool name="stored">true</bool>
    <bool name="multiValued">true</bool>
  </lst>
  <lst>
    <str name="name">standardtok</str>
    <str name="type">standardtok</str>
    <bool name="indexed">true</bool>
    <bool name="stored">true</bool>
  </lst>
  <lst>
    <str name="name">nullfirst</str>
    <str name="type">string</str>
    <bool name="indexed">true</bool>
    <bool name="stored">true</bool>
    <bool name="sortMissingFirst">true</bool>
  </lst>
  <lst>
    <str name="name">pointD</str>
    <str name="type">xyd</str>
    <bool name="indexed">true</bool>
    <bool name="stored">true</bool>
    <bool name="multiValued">false</bool>
  </lst>
  <lst>
    <str name="name">HTMLstandardtok</str>
    <str name="type">HTMLstandardtok</str>
    <bool name="indexed">true</bool>
    <bool name="stored">true</bool>
  </lst>
  <lst>
    <str name="name">bday</str>
    <str name="type">date</str>
    <bool name="indexed">true</bool>
    <bool name="stored">true</bool>
  </lst>
  <lst>
    <str name="name">signatureField</str>
    <str name="type">string</str>
    <bool name="indexed">true</bool>
    <bool name="stored">false</bool>
  </lst>
  <lst>
    <str name="name">title_stemmed</str>
    <str name="type">text</str>
    <bool name="indexed">true</bool>
    <bool name="stored">false</bool>
  </lst>
  <lst>
    <str name="name">keywordtok</str>
    <str name="type">keywordtok</str>
    <bool name="indexed">true</bool>
    <bool name="stored">true</bool>
  </lst>
  <lst>
    <str name="name">patternreplacefilt</str>
    <str name="type">patternreplacefilt</str>
    <bool name="indexed">true</bool>
    <bool name="stored">true</bool>
  </lst>
  <lst>
    <str name="name">standardtokfilt</str>
    <str name="type">standardtokfilt</str>
    <bool name="indexed">true</bool>
    <bool name="stored">true</bool>
  </lst>
  <lst>
    <str name="name">test_notv</str>
    <str name="type">text</str>
    <bool name="termVectors">false</bool>
  </lst>
  <lst>
    <str name="name">name</str>
    <str name="type">nametext</str>
    <bool name="indexed">true</bool>
    <bool name="stored">true</bool>
  </lst>
  <lst>
    <str name="name">sku1</str>
    <str name="type">skutype1</str>
    <bool name="indexed">true</bool>
    <bool name="stored">true</bool>
  </lst>
  <lst>
    <str name="name">wdf_preserve</str>
    <str name="type">wdf_preserve</str>
    <bool name="indexed">true</bool>
    <bool name="stored">true</bool>
  </lst>
  <lst>
    <str name="name">test_hlt</str>
    <str name="type">highlittext</str>
    <bool name="indexed">true</bool>
    <bool name="compressed">true</bool>
  </lst>
  <lst>
    <str name="name">text_np</str>
    <str name="type">text_np</str>
    <bool name="indexed">true</bool>
    <bool name="stored">false</bool>
  </lst>
  <lst>
    <str name="name">iind</str>
    <str name="type">int</str>
    <bool name="indexed">true</bool>
    <bool name="stored">false</bool>
  </lst>
  <lst>
    <str name="name">teststop</str>
    <str name="type">teststop</str>
    <bool name="indexed">true</bool>
    <bool name="stored">true</bool>
  </lst>
  <lst>
    <str name="name">test_basictv</str>
    <str name="type">text</str>
    <bool name="termVectors">true</bool>
  </lst>
  <lst>
    <str name="name">title_lettertok</str>
    <str name="type">lettertok</str>
    <bool name="indexed">true</bool>
    <bool name="stored">false</bool>
  </lst>
  <lst>
    <str name="name">sku2</str>
    <str name="type">skutype2</str>
    <bool name="indexed">true</bool>
    <bool name="stored">true</bool>
  </lst>
  <lst>
    <str name="name">syn</str>
    <str name="type">syn</str>
    <bool name="indexed">true</bool>
    <bool name="stored">true</bool>
  </lst>
  <lst>
    <str name="name">bind</str>
    <str name="type">boolean</str>
    <bool name="indexed">true</bool>
    <bool name="stored">false</bool>
  </lst>
  <lst>
    <str name="name">_version_</str>
    <str name="type">long</str>
    <bool name="indexed">true</bool>
    <bool name="stored">true</bool>
  </lst>
  <lst>
    <str name="name">ssto</str>
    <str name="type">string</str>
    <bool name="indexed">false</bool>
    <bool name="stored">true</bool>
  </lst>
  <lst>
    <str name="name">id</str>
    <str name="type">string</str>
    <bool name="required">true</bool>
    <bool name="indexed">true</bool>
    <bool name="stored">true</bool>
    <bool name="multiValued">false</bool>
    <bool name="uniqueKey">true</bool>
  </lst>
  <lst>
    <str name="name">engporterfilt</str>
    <str name="type">engporterfilt</str>
    <bool name="indexed">true</bool>
    <bool name="stored">true</bool>
  </lst>
  <lst>
    <str name="name">HTMLwhitetok</str>
    <str name="type">HTMLwhitetok</str>
    <bool name="indexed">true</bool>
    <bool name="stored">true</bool>
  </lst>
  <lst>
    <str name="name">lengthfilt</str>
    <str name="type">lengthfilt</str>
    <bool name="indexed">true</bool>
    <bool name="stored">true</bool>
  </lst>
  <lst>
    <str name="name">uuid</str>
    <str name="type">uuid</str>
    <bool name="stored">true</bool>
  </lst>
  <lst>
    <str name="name">wdf_nocase</str>
    <str name="type">wdf_nocase</str>
    <bool name="indexed">true</bool>
    <bool name="stored">true</bool>
  </lst>
  <lst>
    <str name="name">whitetok</str>
    <str name="type">whitetok</str>
    <bool name="indexed">true</bool>
    <bool name="stored">true</bool>
  </lst>
  <lst>
    <str name="name">bsto</str>
    <str name="type">boolean</str>
    <bool name="indexed">false</bool>
    <bool name="stored">true</bool>
  </lst>
  <lst>
    <str name="name">dedup</str>
    <str name="type">dedup</str>
    <bool name="indexed">true</bool>
    <bool name="stored">true</bool>
  </lst>
  <lst>
    <str name="name">isto</str>
    <str name="type">int</str>
    <bool name="indexed">false</bool>
    <bool name="stored">true</bool>
  </lst>
  <lst>
    <str name="name">uniq2</str>
    <str name="type">string</str>
    <bool name="indexed">true</bool>
    <bool name="stored">true</bool>
    <bool name="multiValued">true</bool>
  </lst>
  <lst>
    <str name="name">lowertok</str>
    <str name="type">lowertok</str>
    <bool name="indexed">true</bool>
    <bool name="stored">true</bool>
  </lst>
  <lst>
    <str name="name">lettertok</str>
    <str name="type">lettertok</str>
    <bool name="indexed">true</bool>
    <bool name="stored">true</bool>
  </lst>
  <lst>
    <str name="name">sind</str>
    <str name="type">string</str>
    <bool name="indexed">true</bool>
    <bool name="stored">false</bool>
  </lst>
  <lst>
    <str name="name">numericsubword</str>
    <str name="type">numericsubword</str>
    <bool name="indexed">true</bool>
    <bool name="stored">true</bool>
  </lst>
  <lst>
    <str name="name">custengporterfilt</str>
    <str name="type">custengporterfilt</str>
    <bool name="indexed">true</bool>
    <bool name="stored">true</bool>
  </lst>
  <lst>
    <str name="name">test_offtv</str>
    <str name="type">text</str>
    <bool name="termVectors">true</bool>
    <bool name="termOffsets">true</bool>
  </lst>
  <lst>
    <str name="name">copyfield_source</str>
    <str name="type">string</str>
    <bool name="indexed">true</bool>
    <bool name="stored">true</bool>
    <bool name="multiValued">true</bool>
  </lst>
  <lst>
    <str name="name">test_postv</str>
    <str name="type">text</str>
    <bool name="termPositions">true</bool>
    <bool name="termVectors">true</bool>
  </lst>
  <lst>
    <str name="name">numberpartfail</str>
    <str name="type">failtype1</str>
    <bool name="indexed">true</bool>
    <bool name="stored">true</bool>
  </lst>
  <lst>
    <str name="name">test_hlt_off</str>
    <str name="type">highlittext</str>
    <bool name="indexed">true</bool>
    <bool name="compressed">false</bool>
  </lst>
  <lst>
    <str name="name">shouldbeunindexed</str>
    <str name="type">unstored</str>
    <bool name="indexed">false</bool>
    <bool name="stored">true</bool>
  </lst>
  <lst>
    <str name="name">standardfilt</str>
    <str name="type">standardfilt</str>
    <bool name="indexed">true</bool>
    <bool name="stored">true</bool>
  </lst>
  <lst>
    <str name="name">shouldbeunstored</str>
    <str name="type">unstored</str>
  </lst>
  <lst>
    <str name="name">test_posofftv</str>
    <str name="type">text</str>
    <bool name="termPositions">true</bool>
    <bool name="termVectors">true</bool>
    <bool name="termOffsets">true</bool>
  </lst>
  <lst>
    <str name="name">uniq</str>
    <str name="type">string</str>
    <bool name="indexed">true</bool>
    <bool name="stored">true</bool>
    <bool name="multiValued">true</bool>
  </lst>
  <lst>
    <str name="name">timestamp</str>
    <str name="type">date</str>
    <bool name="indexed">true</bool>
    <bool name="stored">true</bool>
  </lst>
  <lst>
    <str name="name">textgap</str>
    <str name="type">textgap</str>
    <bool name="indexed">true</bool>
    <bool name="stored">true</bool>
  </lst>
  <lst>
    <str name="name">porterfilt</str>
    <str name="type">porterfilt</str>
    <bool name="indexed">true</bool>
    <bool name="stored">true</bool>
  </lst>
  <lst>
    <str name="name">shouldbestored</str>
    <str name="type">unstored</str>
    <bool name="stored">true</bool>
  </lst>
  <lst>
    <str name="name">stopfilt</str>
    <str name="type">stopfilt</str>
    <bool name="indexed">true</bool>
    <bool name="stored">true</bool>
  </lst>
  <lst>
    <str name="name">text</str>
    <str name="type">text</str>
    <bool name="indexed">true</bool>
    <bool name="stored">false</bool>
    <bool name="multiValued">true</bool>
  </lst>
  <lst>
    <str name="name">point_hash</str>
    <str name="type">geohash</str>
    <bool name="indexed">true</bool>
    <bool name="stored">true</bool>
    <bool name="multiValued">false</bool>
  </lst>
  <lst>
    <str name="name">weight</str>
    <str name="type">float</str>
    <bool name="indexed">true</bool>
    <bool name="stored">true</bool>
  </lst>
  <lst>
    <str name="name">point</str>
    <str name="type">xy</str>
    <bool name="indexed">true</bool>
    <bool name="stored">true</bool>
    <bool name="multiValued">false</bool>
  </lst>
  <lst>
    <str name="name">subject</str>
    <str name="type">text</str>
    <bool name="indexed">true</bool>
    <bool name="stored">true</bool>
  </lst>
  <lst>
    <str name="name">subword</str>
    <str name="type">subword</str>
    <bool name="indexed">true</bool>
    <bool name="stored">true</bool>
  </lst>
  <lst>
    <str name="name">lowerfilt</str>
    <str name="type">lowerfilt</str>
    <bool name="indexed">true</bool>
    <bool name="stored">true</bool>
  </lst>
  <lst>
    <str name="name">bindsto</str>
    <str name="type">boolean</str>
    <bool name="indexed">true</bool>
    <bool name="stored">true</bool>
  </lst>
  <lst>
    <str name="name">uniq3</str>
    <str name="type">string</str>
    <bool name="indexed">true</bool>
    <bool name="stored">true</bool>
  </lst>
  <lst>
    <str name="name">store</str>
    <str name="type">location</str>
    <bool name="indexed">true</bool>
    <bool name="stored">true</bool>
  </lst>
</arr>
</response>

	request was:/schema/fields?indent=on&wt=xml
	at org.apache.solr.util.RestTestBase.assertQ(RestTestBase.java:136)
	... 41 more


FAILED:  org.apache.solr.rest.TestFieldCollectionResource.testJsonGetAllFields

Error Message:
mismatch: 'custstopfilt'!='sindsto' @ fields/[0]/name

Stack Trace:
java.lang.RuntimeException: mismatch: 'custstopfilt'!='sindsto' @ fields/[0]/name
	at __randomizedtesting.SeedInfo.seed([6E9A2F599977315B:E79A5DD539C47D7D]:0)
	at org.apache.solr.util.RestTestBase.assertJQ(RestTestBase.java:242)
	at org.apache.solr.util.RestTestBase.assertJQ(RestTestBase.java:186)
	at org.apache.solr.rest.TestFieldCollectionResource.testJsonGetAllFields(TestFieldCollectionResource.java:50)
	at sun.reflect.NativeMethodAccessorImpl.invoke0(Native Method)
	at sun.reflect.NativeMethodAccessorImpl.invoke(NativeMethodAccessorImpl.java:57)
	at sun.reflect.DelegatingMethodAccessorImpl.invoke(DelegatingMethodAccessorImpl.java:43)
	at java.lang.reflect.Method.invoke(Method.java:487)
	at com.carrotsearch.randomizedtesting.RandomizedRunner.invoke(RandomizedRunner.java:1559)
	at com.carrotsearch.randomizedtesting.RandomizedRunner.access$600(RandomizedRunner.java:79)
	at com.carrotsearch.randomizedtesting.RandomizedRunner$6.evaluate(RandomizedRunner.java:737)
	at com.carrotsearch.randomizedtesting.RandomizedRunner$7.evaluate(RandomizedRunner.java:773)
	at com.carrotsearch.randomizedtesting.RandomizedRunner$8.evaluate(RandomizedRunner.java:787)
	at com.carrotsearch.randomizedtesting.rules.SystemPropertiesRestoreRule$1.evaluate(SystemPropertiesRestoreRule.java:53)
	at org.apache.lucene.util.TestRuleSetupTeardownChained$1.evaluate(TestRuleSetupTeardownChained.java:50)
	at org.apache.lucene.util.TestRuleFieldCacheSanity$1.evaluate(TestRuleFieldCacheSanity.java:51)
	at org.apache.lucene.util.AbstractBeforeAfterRule$1.evaluate(AbstractBeforeAfterRule.java:46)
	at com.carrotsearch.randomizedtesting.rules.SystemPropertiesInvariantRule$1.evaluate(SystemPropertiesInvariantRule.java:55)
	at org.apache.lucene.util.TestRuleThreadAndTestName$1.evaluate(TestRuleThreadAndTestName.java:49)
	at org.apache.lucene.util.TestRuleIgnoreAfterMaxFailures$1.evaluate(TestRuleIgnoreAfterMaxFailures.java:70)
	at org.apache.lucene.util.TestRuleMarkFailure$1.evaluate(TestRuleMarkFailure.java:48)
	at com.carrotsearch.randomizedtesting.rules.StatementAdapter.evaluate(StatementAdapter.java:36)
	at com.carrotsearch.randomizedtesting.ThreadLeakControl$StatementRunner.run(ThreadLeakControl.java:358)
	at com.carrotsearch.randomizedtesting.ThreadLeakControl.forkTimeoutingTask(ThreadLeakControl.java:782)
	at com.carrotsearch.randomizedtesting.ThreadLeakControl$3.evaluate(ThreadLeakControl.java:442)
	at com.carrotsearch.randomizedtesting.RandomizedRunner.runSingleTest(RandomizedRunner.java:746)
	at com.carrotsearch.randomizedtesting.RandomizedRunner$3.evaluate(RandomizedRunner.java:648)
	at com.carrotsearch.randomizedtesting.RandomizedRunner$4.evaluate(RandomizedRunner.java:682)
	at com.carrotsearch.randomizedtesting.RandomizedRunner$5.evaluate(RandomizedRunner.java:693)
	at com.carrotsearch.randomizedtesting.rules.StatementAdapter.evaluate(StatementAdapter.java:36)
	at com.carrotsearch.randomizedtesting.rules.SystemPropertiesRestoreRule$1.evaluate(SystemPropertiesRestoreRule.java:53)
	at org.apache.lucene.util.AbstractBeforeAfterRule$1.evaluate(AbstractBeforeAfterRule.java:46)
	at org.apache.lucene.util.TestRuleStoreClassName$1.evaluate(TestRuleStoreClassName.java:42)
	at com.carrotsearch.randomizedtesting.rules.SystemPropertiesInvariantRule$1.evaluate(SystemPropertiesInvariantRule.java:55)
	at com.carrotsearch.randomizedtesting.rules.NoShadowingOrOverridesOnMethodsRule$1.evaluate(NoShadowingOrOverridesOnMethodsRule.java:39)
	at com.carrotsearch.randomizedtesting.rules.NoShadowingOrOverridesOnMethodsRule$1.evaluate(NoShadowingOrOverridesOnMethodsRule.java:39)
	at com.carrotsearch.randomizedtesting.rules.StatementAdapter.evaluate(StatementAdapter.java:36)
	at org.apache.lucene.util.TestRuleAssertionsRequired$1.evaluate(TestRuleAssertionsRequired.java:43)
	at org.apache.lucene.util.TestRuleMarkFailure$1.evaluate(TestRuleMarkFailure.java:48)
	at org.apache.lucene.util.TestRuleIgnoreAfterMaxFailures$1.evaluate(TestRuleIgnoreAfterMaxFailures.java:70)
	at org.apache.lucene.util.TestRuleIgnoreTestSuites$1.evaluate(TestRuleIgnoreTestSuites.java:55)
	at com.carrotsearch.randomizedtesting.rules.StatementAdapter.evaluate(StatementAdapter.java:36)
	at com.carrotsearch.randomizedtesting.ThreadLeakControl$StatementRunner.run(ThreadLeakControl.java:358)
	at java.lang.Thread.run(Thread.java:722)




Build Log:
[...truncated 8795 lines...]
[junit4:junit4] Suite: org.apache.solr.rest.TestFieldCollectionResource
[junit4:junit4]   2> 56 T10 oas.SolrJettyTestBase.beforeSolrJettyTestBase Randomized ssl (false) and clientAuth (true)
[junit4:junit4]   2> 94 T10 oas.SolrTestCaseJ4.initCore ####initCore
[junit4:junit4]   2> Creating dataDir: /mnt/ssd/jenkins/workspace/Lucene-Solr-trunk-Linux/solr/build/solr-core/test/J0/./solrtest-TestFieldCollectionResource-1362572203721
[junit4:junit4]   2> 96 T10 oas.SolrTestCaseJ4.initCore ####initCore end
[junit4:junit4]   2> 216 T10 oejs.Server.doStart jetty-8.1.8.v20121106
[junit4:junit4]   2> 352 T10 oejs.AbstractConnector.doStart Started SelectChannelConnector@127.0.0.1:46406
[junit4:junit4]   2> 372 T10 oass.SolrDispatchFilter.init SolrDispatchFilter.init()
[junit4:junit4]   2> 419 T10 oasc.SolrResourceLoader.locateSolrHome JNDI not configured for solr (NoInitialContextEx)
[junit4:junit4]   2> 420 T10 oasc.SolrResourceLoader.locateSolrHome using system property solr.solr.home: /mnt/ssd/jenkins/workspace/Lucene-Solr-trunk-Linux/solr/build/solr-core/test-files/solr
[junit4:junit4]   2> 438 T10 oasc.CoreContainer$Initializer.initialize looking for solr config file: /mnt/ssd/jenkins/workspace/Lucene-Solr-trunk-Linux/solr/build/solr-core/test-files/solr/solr.xml
[junit4:junit4]   2> 442 T10 oasc.CoreContainer.<init> New CoreContainer 26058681
[junit4:junit4]   2> 443 T10 oasc.CoreContainer.load Loading CoreContainer using Solr Home: '/mnt/ssd/jenkins/workspace/Lucene-Solr-trunk-Linux/solr/build/solr-core/test-files/solr/'
[junit4:junit4]   2> 444 T10 oasc.SolrResourceLoader.<init> new SolrResourceLoader for directory: '/mnt/ssd/jenkins/workspace/Lucene-Solr-trunk-Linux/solr/build/solr-core/test-files/solr/'
[junit4:junit4]   2> 659 T10 oashc.HttpShardHandlerFactory.getParameter Setting socketTimeout to: 120000
[junit4:junit4]   2> 660 T10 oashc.HttpShardHandlerFactory.getParameter Setting urlScheme to: http://
[junit4:junit4]   2> 660 T10 oashc.HttpShardHandlerFactory.getParameter Setting connTimeout to: 15000
[junit4:junit4]   2> 660 T10 oashc.HttpShardHandlerFactory.getParameter Setting maxConnectionsPerHost to: 20
[junit4:junit4]   2> 661 T10 oashc.HttpShardHandlerFactory.getParameter Setting corePoolSize to: 0
[junit4:junit4]   2> 661 T10 oashc.HttpShardHandlerFactory.getParameter Setting maximumPoolSize to: 2147483647
[junit4:junit4]   2> 662 T10 oashc.HttpShardHandlerFactory.getParameter Setting maxThreadIdleTime to: 5
[junit4:junit4]   2> 662 T10 oashc.HttpShardHandlerFactory.getParameter Setting sizeOfQueue to: -1
[junit4:junit4]   2> 663 T10 oashc.HttpShardHandlerFactory.getParameter Setting fairnessPolicy to: false
[junit4:junit4]   2> 677 T10 oascsi.HttpClientUtil.createClient Creating new http client, config:maxConnectionsPerHost=20&maxConnections=10000&socketTimeout=120000&connTimeout=15000&retry=false
[junit4:junit4]   2> 1058 T10 oasc.CoreContainer.load Registering Log Listener
[junit4:junit4]   2> 1139 T21 oasc.CoreContainer.create Creating SolrCore 'collection1' using instanceDir: /mnt/ssd/jenkins/workspace/Lucene-Solr-trunk-Linux/solr/build/solr-core/test-files/solr/collection1
[junit4:junit4]   2> 1141 T21 oasc.SolrResourceLoader.<init> new SolrResourceLoader for directory: '/mnt/ssd/jenkins/workspace/Lucene-Solr-trunk-Linux/solr/build/solr-core/test-files/solr/collection1/'
[junit4:junit4]   2> 1143 T21 oasc.SolrResourceLoader.replaceClassLoader Adding 'file:/mnt/ssd/jenkins/workspace/Lucene-Solr-trunk-Linux/solr/build/solr-core/test-files/solr/collection1/lib/README' to classloader
[junit4:junit4]   2> 1143 T21 oasc.SolrResourceLoader.replaceClassLoader Adding 'file:/mnt/ssd/jenkins/workspace/Lucene-Solr-trunk-Linux/solr/build/solr-core/test-files/solr/collection1/lib/classes/' to classloader
[junit4:junit4]   2> 1251 T21 oasc.SolrConfig.<init> Using Lucene MatchVersion: LUCENE_50
[junit4:junit4]   2> 1359 T21 oasc.SolrConfig.<init> Loaded SolrConfig: solrconfig.xml
[junit4:junit4]   2> 1366 T21 oass.IndexSchema.readSchema Reading Solr Schema
[junit4:junit4]   2> 1400 T21 oass.IndexSchema.readSchema Schema name=test-rest
[junit4:junit4]   2> 2374 T21 oass.IndexSchema.readSchema default search field in schema is text
[junit4:junit4]   2> 2378 T21 oass.IndexSchema.readSchema unique key field: id
[junit4:junit4]   2> 2383 T21 oass.IndexSchema.readSchema WARNING Field title is not multivalued and destination for multiple copyFields (3)
[junit4:junit4]   2> 2532 T21 oasc.SolrCore.<init> [collection1] Opening new SolrCore at /mnt/ssd/jenkins/workspace/Lucene-Solr-trunk-Linux/solr/build/solr-core/test-files/solr/collection1/, dataDir=/mnt/ssd/jenkins/workspace/Lucene-Solr-trunk-Linux/solr/build/solr-core/test/J0/solrtest-TestFieldCollectionResource-1362572203721/
[junit4:junit4]   2> 2540 T21 oasc.JmxMonitoredMap.<init> JMX monitoring is enabled. Adding Solr mbeans to JMX Server: com.sun.jmx.mbeanserver.JmxMBeanServer@12bdbb8
[junit4:junit4]   2> 2605 T21 oasc.SolrCore.initDirectoryFactory org.apache.solr.core.MockDirectoryFactory
[junit4:junit4]   2> 2649 T21 oasc.CachingDirectoryFactory.get return new directory for /mnt/ssd/jenkins/workspace/Lucene-Solr-trunk-Linux/solr/build/solr-core/test/J0/solrtest-TestFieldCollectionResource-1362572203721 forceNew:false
[junit4:junit4]   2> 2649 T21 oasc.CachingDirectoryFactory.close Releasing directory:/mnt/ssd/jenkins/workspace/Lucene-Solr-trunk-Linux/solr/build/solr-core/test/J0/solrtest-TestFieldCollectionResource-1362572203721
[junit4:junit4]   2> 2650 T21 oasc.SolrCore.getNewIndexDir New index directory detected: old=null new=/mnt/ssd/jenkins/workspace/Lucene-Solr-trunk-Linux/solr/build/solr-core/test/J0/solrtest-TestFieldCollectionResource-1362572203721/index/
[junit4:junit4]   2> 2650 T21 oasc.SolrCore.initIndex WARNING [collection1] Solr index directory '/mnt/ssd/jenkins/workspace/Lucene-Solr-trunk-Linux/solr/build/solr-core/test/J0/solrtest-TestFieldCollectionResource-1362572203721/index' doesn't exist. Creating new index...
[junit4:junit4]   2> 2666 T21 oasc.CachingDirectoryFactory.get return new directory for /mnt/ssd/jenkins/workspace/Lucene-Solr-trunk-Linux/solr/build/solr-core/test/J0/solrtest-TestFieldCollectionResource-1362572203721/index forceNew:false
[junit4:junit4]   2> 2786 T21 oasc.SolrDeletionPolicy.onCommit SolrDeletionPolicy.onCommit: commits:num=1
[junit4:junit4]   2> 		commit{dir=RateLimitedDirectoryWrapper(MockDirWrapper(RateLimitedDirectoryWrapper(org.apache.lucene.store.RAMDirectory@c83d66 lockFactory=org.apache.lucene.store.NativeFSLockFactory@10ed03e))),segFN=segments_1,generation=1,filenames=[segments_1]
[junit4:junit4]   2> 2787 T21 oasc.SolrDeletionPolicy.updateCommits newest commit = 1[segments_1]
[junit4:junit4]   2> 2788 T21 oasc.CachingDirectoryFactory.close Releasing directory:/mnt/ssd/jenkins/workspace/Lucene-Solr-trunk-Linux/solr/build/solr-core/test/J0/solrtest-TestFieldCollectionResource-1362572203721/index
[junit4:junit4]   2> 2796 T21 oasc.SolrCore.initWriters created xml: solr.XMLResponseWriter
[junit4:junit4]   2> 3037 T21 oasup.UpdateRequestProcessorChain.init inserting DistributedUpdateProcessorFactory into updateRequestProcessorChain "dedupe"
[junit4:junit4]   2> 3038 T21 oasup.UpdateRequestProcessorChain.init inserting DistributedUpdateProcessorFactory into updateRequestProcessorChain "dedupe-allfields"
[junit4:junit4]   2> 3038 T21 oasup.UpdateRequestProcessorChain.init inserting DistributedUpdateProcessorFactory into updateRequestProcessorChain "stored_sig"
[junit4:junit4]   2> 3040 T21 oasup.UpdateRequestProcessorChain.init inserting DistributedUpdateProcessorFactory into updateRequestProcessorChain "uniq-fields"
[junit4:junit4]   2> 3064 T21 oasup.UpdateRequestProcessorChain.init inserting DistributedUpdateProcessorFactory into updateRequestProcessorChain "distrib-dup-test-chain-implicit"
[junit4:junit4]   2> 3067 T21 oasc.RequestHandlers.initHandlersFromConfig adding lazy requestHandler: solr.ReplicationHandler
[junit4:junit4]   2> 3069 T21 oasc.RequestHandlers.initHandlersFromConfig created /replication: solr.ReplicationHandler
[junit4:junit4]   2> 3077 T21 oasc.RequestHandlers.initHandlersFromConfig created standard: solr.StandardRequestHandler
[junit4:junit4]   2> 3082 T21 oasc.RequestHandlers.initHandlersFromConfig created /get: solr.RealTimeGetHandler
[junit4:junit4]   2> 3103 T21 oasc.RequestHandlers.initHandlersFromConfig created dismax: solr.SearchHandler
[junit4:junit4]   2> 3105 T21 oasc.RequestHandlers.initHandlersFromConfig created mock: org.apache.solr.core.MockQuerySenderListenerReqHandler
[junit4:junit4]   2> 3107 T21 oasc.RequestHandlers.initHandlersFromConfig created /admin/: org.apache.solr.handler.admin.AdminHandlers
[junit4:junit4]   2> 3108 T21 oasc.RequestHandlers.initHandlersFromConfig created defaults: solr.StandardRequestHandler
[junit4:junit4]   2> 3108 T21 oasc.RequestHandlers.initHandlersFromConfig adding lazy requestHandler: solr.StandardRequestHandler
[junit4:junit4]   2> 3108 T21 oasc.RequestHandlers.initHandlersFromConfig created lazy: solr.StandardRequestHandler
[junit4:junit4]   2> 3117 T21 oasc.RequestHandlers.initHandlersFromConfig created /update: solr.UpdateRequestHandler
[junit4:junit4]   2> 3118 T21 oasc.RequestHandlers.initHandlersFromConfig created /terms: org.apache.solr.handler.component.SearchHandler
[junit4:junit4]   2> 3119 T21 oasc.RequestHandlers.initHandlersFromConfig created spellCheckCompRH: org.apache.solr.handler.component.SearchHandler
[junit4:junit4]   2> 3120 T21 oasc.RequestHandlers.initHandlersFromConfig created spellCheckCompRH_Direct: org.apache.solr.handler.component.SearchHandler
[junit4:junit4]   2> 3121 T21 oasc.RequestHandlers.initHandlersFromConfig created spellCheckWithWordbreak: org.apache.solr.handler.component.SearchHandler
[junit4:junit4]   2> 3122 T21 oasc.RequestHandlers.initHandlersFromConfig created spellCheckWithWordbreak_Direct: org.apache.solr.handler.component.SearchHandler
[junit4:junit4]   2> 3123 T21 oasc.RequestHandlers.initHandlersFromConfig created spellCheckCompRH1: org.apache.solr.handler.component.SearchHandler
[junit4:junit4]   2> 3124 T21 oasc.RequestHandlers.initHandlersFromConfig created mltrh: org.apache.solr.handler.component.SearchHandler
[junit4:junit4]   2> 3125 T21 oasc.RequestHandlers.initHandlersFromConfig created tvrh: org.apache.solr.handler.component.SearchHandler
[junit4:junit4]   2> 3131 T21 oasc.RequestHandlers.initHandlersFromConfig created /mlt: solr.MoreLikeThisHandler
[junit4:junit4]   2> 3136 T21 oasc.RequestHandlers.initHandlersFromConfig created /debug/dump: solr.DumpRequestHandler
[junit4:junit4]   2> 3175 T21 oashl.XMLLoader.init xsltCacheLifetimeSeconds=60
[junit4:junit4]   2> 3182 T21 oasc.SolrCore.initDeprecatedSupport WARNING solrconfig.xml uses deprecated <admin/gettableFiles>, Please update your config to use the ShowFileRequestHandler.
[junit4:junit4]   2> 3188 T21 oasc.SolrCore.initDeprecatedSupport WARNING adding ShowFileRequestHandler with hidden files: [STOP-1.TXT, SYNONYMS.TXT, TRIVIAL.UPDATEPROCESSOR0.JS, ELEVATE.XML, BAD-SCHEMA-ANALYZER-CLASS-AND-NESTED.XML, ADDFIELDS.UPDATEPROCESSOR.JS, SOLRCONFIG-NATIVELOCK.XML, SOLRCONFIG-DELPOLICY1.XML, REGEX-BOOST-PROCESSOR-TEST.TXT, SOLRCONFIG-REPEATER.XML, SOLRCONFIG-TLOG.XML, SOLRCONFIG-NOCACHE.XML, SOLRCONFIG-COMPONENTS-NAME.XML, BAD-SCHEMA-CURRENCY-FT-BOGUS-CODE-IN-XML.XML, SOLRCONFIG-FUNCTIONQUERY.XML, SCHEMA-TFIDF.XML, SCHEMA-REVERSED.XML, STOP-SNOWBALL.TXT, SOLRCONFIG-SPELLCHECKER.XML, SOLRCONFIG-MASTER1-KEEPONEBACKUP.XML, SOLRCONFIG-TRANSFORMERS.XML, BAD-SCHEMA-NONTEXT-ANALYZER.XML, SOLRCONFIG-SPELLCHECKCOMPONENT.XML, BAD-SCHEMA-UNSUPPORTED-DOCVALUES.XML, SOLRCONFIG-PROPINJECT.XML, SCHEMA-COPYFIELD-TEST.XML, SOLRCONFIG-POSTINGSHIGHLIGHT.XML, MAPPING-ISOLATIN1ACCENT.TXT, PHRASESUGGEST.TXT, KEEP-1.TXT, PROTWORDS.TXT, SCHEMA-XINCLUDE.XML, SOLRCONFIG-SOLR-749.XML, SCHEMA-BEHAVIOR.XML, STOPTYPES-1.TXT, SOLRCONFIG-ENABLEPLUGIN.XML, BAD-SCHEMA-NOT-INDEXED-BUT-TF.XML, STOP-2.TXT, BAD-SOLRCONFIG-MISSING-SCRIPTFILE.XML, WDFTYPES.TXT, BAD-SCHEMA-SIM-GLOBAL-VS-FT-MISMATCH.XML, SOLRCONFIG-XINCLUDE.XML, STOPTYPES-2.TXT, SCHEMA-NUMERIC.XML, SOLRCONFIG-MASTER3.XML, BAD-SCHEMA-CURRENCY-MULTIVALUED.XML, SOLRCONFIG-QUERYSENDER-NOQUERY.XML, SOLRCONFIG-CACHING.XML, BAD-SCHEMA-UNIQUEKEY-IS-COPYFIELD-DEST.XML, SCHEMA-MINIMAL.XML, SCHEMA-SNIPPET-TYPE.XML, BAD-SCHEMA-NOT-INDEXED-BUT-POS.XML, BAD-SCHEMA-OMIT-TF-BUT-NOT-POS.XML, BAD-SCHEMA-DUP-FIELD.XML, STOPWORDSWRONGENCODING.TXT, SCHEMA-SNIPPET-FIELD.XML, SOLRCONFIG-UPDATE-PROCESSOR-CHAINS.XML, SOLRCONFIG-LAZYWRITER.XML, BAD-SCHEMA-SWEETSPOT-PARTIAL-BASELINE.XML, SOLRCONFIG-MASTER2.XML, SCHEMA-TRIE.XML, SOLRCONFIG-SIMPLELOCK.XML, BAD-SCHEMA-DOCVALUES-NOT-REQUIRED-NO-DEFAULT.XML, BAD-SCHEMA-DUP-DYNAMICFIELD.XML, SCHEMA12.XML, MISSING.FUNCTIONS.UPDATEPROCESSOR.JS, SCHEMA-PHRASESUGGEST.XML, SOLRCONFIG-DELPOLICY2.XML, DA_UTF8.XML, SOLRCONFIG-HIGHLIGHT.XML, SOLRCONFIG-SLAVE.XML, BAD-SCHEMA-CURRENCY-FT-BOGUS-DEFAULT-CODE.XML, BAD-SCHEMA-SWEETSPOT-BOTH-TF.XML, SOLRCONFIG-RESPONSE-LOG-COMPONENT.XML, STOPWORDS.TXT, BAD-SCHEMA-NOT-INDEXED-BUT-NORMS.XML, OLD_SYNONYMS.TXT, SCHEMA_CODEC.XML, SCHEMA-DFR.XML, SCHEMA-TINY.XML, SCHEMA-LMDIRICHLET.XML, HUNSPELL-TEST.AFF, SOLRCONFIG-ALTDIRECTORY.XML, KEEP-2.TXT, SCHEMA-LUCENEMATCHVERSION.XML, SCHEMA-REQUIRED-FIELDS.XML, BAD-SOLRCONFIG-INVALID-SCRIPTFILE.XML, BAD-SCHEMA-UNIQUEKEY-MULTIVALUED.XML, BAD-SCHEMA-DUP-FIELDTYPE.XML, SCHEMA-BINARYFIELD.XML, BAD-SOLRCONFIG-BOGUS-SCRIPTENGINE-NAME.XML, SCHEMA-DOCVALUES.XML, SCHEMA-SIM.XML, BAD-SCHEMA-UNIQUEKEY-USES-DEFAULT.XML, COMPOUNDDICTIONARY.TXT, SOLRCONFIG-MINIMAL.XML, SOLRCONFIG-TERMINDEX.XML, HYPHENATION.DTD, SCHEMA-DOCVALUESFACETING.XML, BAD-SCHEMA-EXTERNAL-FILEFIELD.XML, BAD-MP-SOLRCONFIG.XML, SCHEMASURROUND.XML, STOPWITHBOM.TXT, BAD-SCHEMA-CODEC-GLOBAL-VS-FT-MISMATCH.XML, SCHEMA-SPATIAL.XML, STEMDICT.TXT, SCHEMA-EFF.XML, CONDITIONAL.UPDATEPROCESSOR.JS, SOLRCONFIG-QUERYSENDER.XML, SCHEMA-POSTINGSHIGHLIGHT.XML, SCHEMA-CHARFILTERS.XML, SCHEMA15.XML, SCHEMA-DOCVALUESMULTI.XML, SOLRCONFIG-MASTER1.XML, SOLRCONFIG-SOLCOREPROPERTIES.XML, OPEN-EXCHANGE-RATES.JSON, SCHEMA-REPLICATION1.XML, SCHEMA-NOT-REQUIRED-UNIQUE-KEY.XML, FUZZYSUGGEST.TXT, SCHEMA-SWEETSPOT.XML, SCHEMA-REST.XML, SCHEMA-BM25.XML, BAD-SCHEMA-CURRENCY-DYNAMIC-MULTIVALUED.XML, SCHEMA-LMJELINEKMERCER.XML, XSLT, SCHEMA-STOP-KEEP.XML, BAD-SCHEMA-SWEETSPOT-PARTIAL-HYPERBOLIC.XML, SOLRCONFIG-PHRASESUGGEST.XML, CURRENCY.XML, SCHEMA-COLLATE.XML, SOLRCONFIG-SCRIPT-UPDATEPROCESSOR.XML, SCHEMA-REPLICATION2.XML, SOLRCONFIG-REQHANDLER.INCL, JASUGGEST.TXT, TRIVIAL.UPDATEPROCESSOR1.JS, FRENCHARTICLES.TXT, BAD-SCHEMA-SWEETSPOT-PARTIAL-NORMS.XML, SCHEMA-FOLDING.XML, SOLRCONFIG-ELEVATE.XML, SOLRCONFIG_CODEC.XML, SOLRCONFIG-SNIPPET-PROCESSOR.XML, SOLRCONFIG-BASIC.XML, BAD-SCHEMA-CURRENCY-FT-OER-NORATES.XML, SOLRCONFIG-INDEXCONFIG.XML, SOLRCONFIG-PROPINJECT-INDEXDEFAULT.XML, SOLRCONFIG_PERF.XML, MISSLEADING.EXTENSION.UPDATEPROCESSOR.JS.TXT, SOLRCONFIG-MERGEPOLICY.XML, BAD-CURRENCY.XML, HUNSPELL-TEST.DIC, BAD_SOLRCONFIG.XML, SCHEMA11.XML, BAD-SCHEMA-CURRENCY-FT-MULTIVALUED.XML, SCHEMA-SYNONYM-TOKENIZER.XML, SOLRCONFIG-MASTER.XML, SCHEMA-IB.XML, SOLRCONFIG-SLAVE1.XML, THROW.ERROR.ON.ADD.UPDATEPROCESSOR.JS, SCHEMA-SPELLCHECKER.XML, DA_COMPOUNDDICTIONARY.TXT]
[junit4:junit4]   2> 3194 T21 oasc.CachingDirectoryFactory.close Releasing directory:/mnt/ssd/jenkins/workspace/Lucene-Solr-trunk-Linux/solr/build/solr-core/test/J0/solrtest-TestFieldCollectionResource-1362572203721
[junit4:junit4]   2> 3211 T21 oass.SolrIndexSearcher.<init> Opening Searcher@bef200 main
[junit4:junit4]   2> 3232 T21 oasu.CommitTracker.<init> Hard AutoCommit: disabled
[junit4:junit4]   2> 3232 T21 oasu.CommitTracker.<init> Soft AutoCommit: disabled
[junit4:junit4]   2> 3233 T21 oashc.SpellCheckComponent.inform Initializing spell checkers
[junit4:junit4]   2> 3298 T21 oass.DirectSolrSpellChecker.init init: {name=direct,classname=DirectSolrSpellChecker,field=lowerfilt,minQueryLength=3}
[junit4:junit4]   2> 3408 T22 oasc.SolrCore.registerSearcher [collection1] Registered new searcher Searcher@bef200 main{StandardDirectoryReader(segments_1:1)}
[junit4:junit4]   2> 3421 T21 oasc.CoreContainer.registerCore registering core: collection1
[junit4:junit4]   2> 3425 T10 oass.SolrDispatchFilter.init user.dir=/mnt/ssd/jenkins/workspace/Lucene-Solr-trunk-Linux/solr/build/solr-core/test/J0
[junit4:junit4]   2> 3425 T10 oass.SolrDispatchFilter.init SolrDispatchFilter.init() done
[junit4:junit4]   2> 3426 T10 oas.SolrJettyTestBase.createJetty Jetty Assigned Port#46406
[junit4:junit4]   2> 3450 T10 oas.SolrTestCaseJ4.setUp ###Starting testGetTwoFields
[junit4:junit4]   2> ASYNC  NEW_CORE C0 name=collection1 org.apache.solr.core.SolrCore@100e354
[junit4:junit4]   2> 4263 T15 C0 oejsh.ContextHandler$Context.log SchemaRestApi: [Restlet] Attaching application: org.apache.solr.rest.SchemaRestApi@c6cd47 to URI: /solr/schema
[junit4:junit4]   2> 4295 T15 C0 oasr.SchemaRestApi.createInboundRoot createInboundRoot started
[junit4:junit4]   2> 4308 T15 C0 oasr.SchemaRestApi.createInboundRoot createInboundRoot complete
[junit4:junit4]   2> 4333 T15 C0 oasr.BaseSchemaResource.handlePostExecution [collection1] webapp=/solr path=/schema/fields params={indent=on&wt=xml&fl=id,_version_} status=0 QTime=311 
[junit4:junit4]   2> 4337 T15 C0 orel.LogFilter.afterHandle 2013-03-06	13:16:47	127.0.0.1	-	127.0.0.1	46406	GET	/solr/schema/fields	indent=on&wt=xml&fl=id,_version_	200	-	0	51	http://127.0.0.1:46406	Java/1.8.0-ea	-
[junit4:junit4]   2> 4396 T10 oas.SolrTestCaseJ4.tearDown ###Ending testGetTwoFields
[junit4:junit4]   2> 4410 T10 oas.SolrTestCaseJ4.setUp ###Starting testNotFoundFields
[junit4:junit4]   2> 4415 T19 C0 oasr.BaseSchemaResource.handlePostExecution [collection1] webapp=/solr path=/schema/fields params={indent=on&wt=xml&fl=not_in_there,this_one_either} status=0 QTime=3 
[junit4:junit4]   2> 4417 T19 C0 orel.LogFilter.afterHandle 2013-03-06	13:16:48	127.0.0.1	-	127.0.0.1	46406	GET	/solr/schema/fields	indent=on&wt=xml&fl=not_in_there,this_one_either	200	-	0	4	http://127.0.0.1:46406	Java/1.8.0-ea	-
[junit4:junit4]   2> 4424 T10 oas.SolrTestCaseJ4.tearDown ###Ending testNotFoundFields
[junit4:junit4]   2> 4434 T10 oas.SolrTestCaseJ4.setUp ###Starting testGetAllFields
[junit4:junit4]   2> 4437 T14 C0 oasr.BaseSchemaResource.handlePostExecution [collection1] webapp=/solr path=/schema/fields params={indent=on&wt=xml} status=0 QTime=2 
[junit4:junit4]   2> 4438 T14 C0 orel.LogFilter.afterHandle 2013-03-06	13:16:48	127.0.0.1	-	127.0.0.1	46406	GET	/solr/schema/fields	indent=on&wt=xml	200	-	0	2	http://127.0.0.1:46406	Java/1.8.0-ea	-
[junit4:junit4]   2> 4472 T10 oasu.RestTestBase.assertQ SEVERE REQUEST FAILED: xpath=(/response/arr[@name='fields']/lst/str[@name='name'])[1] = 'custstopfilt'
[junit4:junit4]   2> 		xml response was: <?xml version="1.0" encoding="UTF-8"?>
[junit4:junit4]   2> 	<response>
[junit4:junit4]   2> 	
[junit4:junit4]   2> 	<lst name="responseHeader">
[junit4:junit4]   2> 	  <int name="status">0</int>
[junit4:junit4]   2> 	  <int name="QTime">2</int>
[junit4:junit4]   2> 	</lst>
[junit4:junit4]   2> 	<arr name="fields">
[junit4:junit4]   2> 	  <lst>
[junit4:junit4]   2> 	    <str name="name">sindsto</str>
[junit4:junit4]   2> 	    <str name="type">string</str>
[junit4:junit4]   2> 	    <bool name="indexed">true</bool>
[junit4:junit4]   2> 	    <bool name="stored">true</bool>
[junit4:junit4]   2> 	  </lst>
[junit4:junit4]   2> 	  <lst>
[junit4:junit4]   2> 	    <str name="name">protectedsubword</str>
[junit4:junit4]   2> 	    <str name="type">protectedsubword</str>
[junit4:junit4]   2> 	    <bool name="indexed">true</bool>
[junit4:junit4]   2> 	    <bool name="stored">true</bool>
[junit4:junit4]   2> 	  </lst>
[junit4:junit4]   2> 	  <lst>
[junit4:junit4]   2> 	    <str name="name">custstopfilt</str>
[junit4:junit4]   2> 	    <str name="type">custstopfilt</str>
[junit4:junit4]   2> 	    <bool name="indexed">true</bool>
[junit4:junit4]   2> 	    <bool name="stored">true</bool>
[junit4:junit4]   2> 	  </lst>
[junit4:junit4]   2> 	  <lst>
[junit4:junit4]   2> 	    <str name="name">title</str>
[junit4:junit4]   2> 	    <str name="type">nametext</str>
[junit4:junit4]   2> 	    <bool name="indexed">true</bool>
[junit4:junit4]   2> 	    <bool name="stored">true</bool>
[junit4:junit4]   2> 	  </lst>
[junit4:junit4]   2> 	  <lst>
[junit4:junit4]   2> 	    <str name="name">nouniq</str>
[junit4:junit4]   2> 	    <str name="type">string</str>
[junit4:junit4]   2> 	    <bool name="indexed">true</bool>
[junit4:junit4]   2> 	    <bool name="stored">true</bool>
[junit4:junit4]   2> 	    <bool name="multiValued">true</bool>
[junit4:junit4]   2> 	  </lst>
[junit4:junit4]   2> 	  <lst>
[junit4:junit4]   2> 	    <str name="name">standardtok</str>
[junit4:junit4]   2> 	    <str name="type">standardtok</str>
[junit4:junit4]   2> 	    <bool name="indexed">true</bool>
[junit4:junit4]   2> 	    <bool name="stored">true</bool>
[junit4:junit4]   2> 	  </lst>
[junit4:junit4]   2> 	  <lst>
[junit4:junit4]   2> 	    <str name="name">nullfirst</str>
[junit4:junit4]   2> 	    <str name="type">string</str>
[junit4:junit4]   2> 	    <bool name="indexed">true</bool>
[junit4:junit4]   2> 	    <bool name="stored">true</bool>
[junit4:junit4]   2> 	    <bool name="sortMissingFirst">true</bool>
[junit4:junit4]   2> 	  </lst>
[junit4:junit4]   2> 	  <lst>
[junit4:junit4]   2> 	    <str name="name">pointD</str>
[junit4:junit4]   2> 	    <str name="type">xyd</str>
[junit4:junit4]   2> 	    <bool name="indexed">true</bool>
[junit4:junit4]   2> 	    <bool name="stored">true</bool>
[junit4:junit4]   2> 	    <bool name="multiValued">false</bool>
[junit4:junit4]   2> 	  </lst>
[junit4:junit4]   2> 	  <lst>
[junit4:junit4]   2> 	    <str name="name">HTMLstandardtok</str>
[junit4:junit4]   2> 	    <str name="type">HTMLstandardtok</str>
[junit4:junit4]   2> 	    <bool name="indexed">true</bool>
[junit4:junit4]   2> 	    <bool name="stored">true</bool>
[junit4:junit4]   2> 	  </lst>
[junit4:junit4]   2> 	  <lst>
[junit4:junit4]   2> 	    <str name="name">bday</str>
[junit4:junit4]   2> 	    <str name="type">date</str>
[junit4:junit4]   2> 	    <bool name="indexed">true</bool>
[junit4:junit4]   2> 	    <bool name="stored">true</bool>
[junit4:junit4]   2> 	  </lst>
[junit4:junit4]   2> 	  <lst>
[junit4:junit4]   2> 	    <str name="name">signatureField</str>
[junit4:junit4]   2> 	    <str name="type">string</str>
[junit4:junit4]   2> 	    <bool name="indexed">true</bool>
[junit4:junit4]   2> 	    <bool name="stored">false</bool>
[junit4:junit4]   2> 	  </lst>
[junit4:junit4]   2> 	  <lst>
[junit4:junit4]   2> 	    <str name="name">title_stemmed</str>
[junit4:junit4]   2> 	    <str name="type">text</str>
[junit4:junit4]   2> 	    <bool name="indexed">true</bool>
[junit4:junit4]   2> 	    <bool name="stored">false</bool>
[junit4:junit4]   2> 	  </lst>
[junit4:junit4]   2> 	  <lst>
[junit4:junit4]   2> 	    <str name="name">keywordtok</str>
[junit4:junit4]   2> 	    <str name="type">keywordtok</str>
[junit4:junit4]   2> 	    <bool name="indexed">true</bool>
[junit4:junit4]   2> 	    <bool name="stored">true</bool>
[junit4:junit4]   2> 	  </lst>
[junit4:junit4]   2> 	  <lst>
[junit4:junit4]   2> 	    <str name="name">patternreplacefilt</str>
[junit4:junit4]   2> 	    <str name="type">patternreplacefilt</str>
[junit4:junit4]   2> 	    <bool name="indexed">true</bool>
[junit4:junit4]   2> 	    <bool name="stored">true</bool>
[junit4:junit4]   2> 	  </lst>
[junit4:junit4]   2> 	  <lst>
[junit4:junit4]   2> 	    <str name="name">standardtokfilt</str>
[junit4:junit4]   2> 	    <str name="type">standardtokfilt</str>
[junit4:junit4]   2> 	    <bool name="indexed">true</bool>
[junit4:junit4]   2> 	    <bool name="stored">true</bool>
[junit4:junit4]   2> 	  </lst>
[junit4:junit4]   2> 	  <lst>
[junit4:junit4]   2> 	    <str name="name">test_notv</str>
[junit4:junit4]   2> 	    <str name="type">text</str>
[junit4:junit4]   2> 	    <bool name="termVectors">false</bool>
[junit4:junit4]   2> 	  </lst>
[junit4:junit4]   2> 	  <lst>
[junit4:junit4]   2> 	    <str name="name">name</str>
[junit4:junit4]   2> 	    <str name="type">nametext</str>
[junit4:junit4]   2> 	    <bool name="indexed">true</bool>
[junit4:junit4]   2> 	    <bool name="stored">true</bool>
[junit4:junit4]   2> 	  </lst>
[junit4:junit4]   2> 	  <lst>
[junit4:junit4]   2> 	    <str name="name">sku1</str>
[junit4:junit4]   2> 	    <str name="type">skutype1</str>
[junit4:junit4]   2> 	    <bool name="indexed">true</bool>
[junit4:junit4]   2> 	    <bool name="stored">true</bool>
[junit4:junit4]   2> 	  </lst>
[junit4:junit4]   2> 	  <lst>
[junit4:junit4]   2> 	    <str name="name">wdf_preserve</str>
[junit4:junit4]   2> 	    <str name="type">wdf_preserve</str>
[junit4:junit4]   2> 	    <bool name="indexed">true</bool>
[junit4:junit4]   2> 	    <bool name="stored">true</bool>
[junit4:junit4]   2> 	  </lst>
[junit4:junit4]   2> 	  <lst>
[junit4:junit4]   2> 	    <str name="name">test_hlt</str>
[junit4:junit4]   2> 	    <str name="type">highlittext</str>
[junit4:junit4]   2> 	    <bool name="indexed">true</bool>
[junit4:junit4]   2> 	    <bool name="compressed">true</bool>
[junit4:junit4]   2> 	  </lst>
[junit4:junit4]   2> 	  <lst>
[junit4:junit4]   2> 	    <str name="name">text_np</str>
[junit4:junit4]   2> 	    <str name="type">text_np</str>
[junit4:junit4]   2> 	    <bool name="indexed">true</bool>
[junit4:junit4]   2> 	    <bool name="stored">false</bool>
[junit4:junit4]   2> 	  </lst>
[junit4:junit4]   2> 	  <lst>
[junit4:junit4]   2> 	    <str name="name">iind</str>
[junit4:junit4]   2> 	    <str name="type">int</str>
[junit4:junit4]   2> 	    <bool name="indexed">true</bool>
[junit4:junit4]   2> 	    <bool name="stored">false</bool>
[junit4:junit4]   2> 	  </lst>
[junit4:junit4]   2> 	  <lst>
[junit4:junit4]   2> 	    <str name="name">teststop</str>
[junit4:junit4]   2> 	    <str name="type">teststop</str>
[junit4:junit4]   2> 	    <bool name="indexed">true</bool>
[junit4:junit4]   2> 	    <bool name="stored">true</bool>
[junit4:junit4]   2> 	  </lst>
[junit4:junit4]   2> 	  <lst>
[junit4:junit4]   2> 	    <str name="name">test_basictv</str>
[junit4:junit4]   2> 	    <str name="type">text</str>
[junit4:junit4]   2> 	    <bool name="termVectors">true</bool>
[junit4:junit4]   2> 	  </lst>
[junit4:junit4]   2> 	  <lst>
[junit4:junit4]   2> 	    <str name="name">title_lettertok</str>
[junit4:junit4]   2> 	    <str name="type">lettertok</str>
[junit4:junit4]   2> 	    <bool name="indexed">true</bool>
[junit4:junit4]   2> 	    <bool name="stored">false</bool>
[junit4:junit4]   2> 	  </lst>
[junit4:junit4]   2> 	  <lst>
[junit4:junit4]   2> 	    <str name="name">sku2</str>
[junit4:junit4]   2> 	    <str name="type">skutype2</str>
[junit4:junit4]   2> 	    <bool name="indexed">true</bool>
[junit4:junit4]   2> 	    <bool name="stored">true</bool>
[junit4:junit4]   2> 	  </lst>
[junit4:junit4]   2> 	  <lst>
[junit4:junit4]   2> 	    <str name="name">syn</str>
[junit4:junit4]   2> 	    <str name="type">syn</str>
[junit4:junit4]   2> 	    <bool name="indexed">true</bool>
[junit4:junit4]   2> 	    <bool name="stored">true</bool>
[junit4:junit4]   2> 	  </lst>
[junit4:junit4]   2> 	  <lst>
[junit4:junit4]   2> 	    <str name="name">bind</str>
[junit4:junit4]   2> 	    <str name="type">boolean</str>
[junit4:junit4]   2> 	    <bool name="indexed">true</bool>
[junit4:junit4]   2> 	    <bool name="stored">false</bool>
[junit4:junit4]   2> 	  </lst>
[junit4:junit4]   2> 	  <lst>
[junit4:junit4]   2> 	    <str name="name">_version_</str>
[junit4:junit4]   2> 	    <str name="type">long</str>
[junit4:junit4]   2> 	    <bool name="indexed">true</bool>
[junit4:junit4]   2> 	    <bool name="stored">true</bool>
[junit4:junit4]   2> 	  </lst>
[junit4:junit4]   2> 	  <lst>
[junit4:junit4]   2> 	    <str name="name">ssto</str>
[junit4:junit4]   2> 	    <str name="type">string</str>
[junit4:junit4]   2> 	    <bool name="indexed">false</bool>
[junit4:junit4]   2> 	    <bool name="stored">true</bool>
[junit4:junit4]   2> 	  </lst>
[junit4:junit4]   2> 	  <lst>
[junit4:junit4]   2> 	    <str name="name">id</str>
[junit4:junit4]   2> 	    <str name="type">string</str>
[junit4:junit4]   2> 	    <bool name="required">true</bool>
[junit4:junit4]   2> 	    <bool name="indexed">true</bool>
[junit4:junit4]   2> 	    <bool name="stored">true</bool>
[junit4:junit4]   2> 	    <bool name="multiValued">false</bool>
[junit4:junit4]   2> 	    <bool name="uniqueKey">true</bool>
[junit4:junit4]   2> 	  </lst>
[junit4:junit4]   2> 	  <lst>
[junit4:junit4]   2> 	    <str name="name">engporterfilt</str>
[junit4:junit4]   2> 	    <str name="type">engporterfilt</str>
[junit4:junit4]   2> 	    <bool name="indexed">true</bool>
[junit4:junit4]   2> 	    <bool name="stored">true</bool>
[junit4:junit4]   2> 	  </lst>
[junit4:junit4]   2> 	  <lst>
[junit4:junit4]   2> 	    <str name="name">HTMLwhitetok</str>
[junit4:junit4]   2> 	    <str name="type">HTMLwhitetok</str>
[junit4:junit4]   2> 	    <bool name="indexed">true</bool>
[junit4:junit4]   2> 	    <bool name="stored">true</bool>
[junit4:junit4]   2> 	  </lst>
[junit4:junit4]   2> 	  <lst>
[junit4:junit4]   2> 	    <str name="name">lengthfilt</str>
[junit4:junit4]   2> 	    <str name="type">lengthfilt</str>
[junit4:junit4]   2> 	    <bool name="indexed">true</bool>
[junit4:junit4]   2> 	    <bool name="stored">true</bool>
[junit4:junit4]   2> 	  </lst>
[junit4:junit4]   2> 	  <lst>
[junit4:junit4]   2> 	    <str name="name">uuid</str>
[junit4:junit4]   2> 	    <str name="type">uuid</str>
[junit4:junit4]   2> 	    <bool name="stored">true</bool>
[junit4:junit4]   2> 	  </lst>
[junit4:junit4]   2> 	  <lst>
[junit4:junit4]   2> 	    <str name="name">wdf_nocase</str>
[junit4:junit4]   2> 	    <str name="type">wdf_nocase</str>
[junit4:junit4]   2> 	    <bool name="indexed">true</bool>
[junit4:junit4]   2> 	    <bool name="stored">true</bool>
[junit4:junit4]   2> 	  </lst>
[junit4:junit4]   2> 	  <lst>
[junit4:junit4]   2> 	    <str name="name">whitetok</str>
[junit4:junit4]   2> 	    <str name="type">whitetok</str>
[junit4:junit4]   2> 	    <bool name="indexed">true</bool>
[junit4:junit4]   2> 	    <bool name="stored">true</bool>
[junit4:junit4]   2> 	  </lst>
[junit4:junit4]   2> 	  <lst>
[junit4:junit4]   2> 	    <str name="name">bsto</str>
[junit4:junit4]   2> 	    <str name="type">boolean</str>
[junit4:junit4]   2> 	    <bool name="indexed">false</bool>
[junit4:junit4]   2> 	    <bool name="stored">true</bool>
[junit4:junit4]   2> 	  </lst>
[junit4:junit4]   2> 	  <lst>
[junit4:junit4]   2> 	    <str name="name">dedup</str>
[junit4:junit4]   2> 	    <str name="type">dedup</str>
[junit4:junit4]   2> 	    <bool name="indexed">true</bool>
[junit4:junit4]   2> 	    <bool name="stored">true</bool>
[junit4:junit4]   2> 	  </lst>
[junit4:junit4]   2> 	  <lst>
[junit4:junit4]   2> 	    <str name="name">isto</str>
[junit4:junit4]   2> 	    <str name="type">int</str>
[junit4:junit4]   2> 	    <bool name="indexed">false</bool>
[junit4:junit4]   2> 	    <bool name="stored">true</bool>
[junit4:junit4]   2> 	  </lst>
[junit4:junit4]   2> 	  <lst>
[junit4:junit4]   2> 	    <str name="name">uniq2</str>
[junit4:junit4]   2> 	    <str name="type">string</str>
[junit4:junit4]   2> 	    <bool name="indexed">true</bool>
[junit4:junit4]   2> 	    <bool name="stored">true</bool>
[junit4:junit4]   2> 	    <bool name="multiValued">true</bool>
[junit4:junit4]   2> 	  </lst>
[junit4:junit4]   2> 	  <lst>
[junit4:junit4]   2> 	    <str name="name">lowertok</str>
[junit4:junit4]   2> 	    <str name="type">lowertok</str>
[junit4:junit4]   2> 	    <bool name="indexed">true</bool>
[junit4:junit4]   2> 	    <bool name="stored">true</bool>
[junit4:junit4]   2> 	  </lst>
[junit4:junit4]   2> 	  <lst>
[junit4:junit4]   2> 	    <str name="name">lettertok</str>
[junit4:junit4]   2> 	    <str name="type">lettertok</str>
[junit4:junit4]   2> 	    <bool name="indexed">true</bool>
[junit4:junit4]   2> 	    <bool name="stored">true</bool>
[junit4:junit4]   2> 	  </lst>
[junit4:junit4]   2> 	  <lst>
[junit4:junit4]   2> 	    <str name="name">sind</str>
[junit4:junit4]   2> 	    <str name="type">string</str>
[junit4:junit4]   2> 	    <bool name="indexed">true</bool>
[junit4:junit4]   2> 	    <bool name="stored">false</bool>
[junit4:junit4]   2> 	  </lst>
[junit4:junit4]   2> 	  <lst>
[junit4:junit4]   2> 	    <str name="name">numericsubword</str>
[junit4:junit4]   2> 	    <str name="type">numericsubword</str>
[junit4:junit4]   2> 	    <bool name="indexed">true</bool>
[junit4:junit4]   2> 	    <bool name="stored">true</bool>
[junit4:junit4]   2> 	  </lst>
[junit4:junit4]   2> 	  <lst>
[junit4:junit4]   2> 	    <str name="name">custengporterfilt</str>
[junit4:junit4]   2> 	    <str name="type">custengporterfilt</str>
[junit4:junit4]   2> 	    <bool name="indexed">true</bool>
[junit4:junit4]   2> 	    <bool name="stored">true</bool>
[junit4:junit4]   2> 	  </lst>
[junit4:junit4]   2> 	  <lst>
[junit4:junit4]   2> 	    <str name="name">test_offtv</str>
[junit4:junit4]   2> 	    <str name="type">text</str>
[junit4:junit4]   2> 	    <bool name="termVectors">true</bool>
[junit4:junit4]   2> 	    <bool name="termOffsets">true</bool>
[junit4:junit4]   2> 	  </lst>
[junit4:junit4]   2> 	  <lst>
[junit4:junit4]   2> 	    <str name="name">copyfield_source</str>
[junit4:junit4]   2> 	    <str name="type">string</str>
[junit4:junit4]   2> 	    <bool name="indexed">true</bool>
[junit4:junit4]   2> 	    <bool name="stored">true</bool>
[junit4:junit4]   2> 	    <bool name="multiValued">true</bool>
[junit4:junit4]   2> 	  </lst>
[junit4:junit4]   2> 	  <lst>
[junit4:junit4]   2> 	    <str name="name">test_postv</str>
[junit4:junit4]   2> 	    <str name="type">text</str>
[junit4:junit4]   2> 	    <bool name="termPositions">true</bool>
[junit4:junit4]   2> 	    <bool name="termVectors">true</bool>
[junit4:junit4]   2> 	  </lst>
[junit4:junit4]   2> 	  <lst>
[junit4:junit4]   2> 	    <str name="name">numberpartfail</str>
[junit4:junit4]   2> 	    <str name="type">failtype1</str>
[junit4:junit4]   2> 	    <bool name="indexed">true</bool>
[junit4:junit4]   2> 	    <bool name="stored">true</bool>
[junit4:junit4]   2> 	  </lst>
[junit4:junit4]   2> 	  <lst>
[junit4:junit4]   2> 	    <str name="name">test_hlt_off</str>
[junit4:junit4]   2> 	    <str name="type">highlittext</str>
[junit4:junit4]   2> 	    <bool name="indexed">true</bool>
[junit4:junit4]   2> 	    <bool name="compressed">false</bool>
[junit4:junit4]   2> 	  </lst>
[junit4:junit4]   2> 	  <lst>
[junit4:junit4]   2> 	    <str name="name">shouldbeunindexed</str>
[junit4:junit4]   2> 	    <str name="type">unstored</str>
[junit4:junit4]   2> 	    <bool name="indexed">false</bool>
[junit4:junit4]   2> 	    <bool name="stored">true</bool>
[junit4:junit4]   2> 	  </lst>
[junit4:junit4]   2> 	  <lst>
[junit4:junit4]   2> 	    <str name="name">standardfilt</str>
[junit4:junit4]   2> 	    <str name="type">standardfilt</str>
[junit4:junit4]   2> 	    <bool name="indexed">true</bool>
[junit4:junit4]   2> 	    <bool name="stored">true</bool>
[junit4:junit4]   2> 	  </lst>
[junit4:junit4]   2> 	  <lst>
[junit4:junit4]   2> 	    <str name="name">shouldbeunstored</str>
[junit4:junit4]   2> 	    <str name="type">unstored</str>
[junit4:junit4]   2> 	  </lst>
[junit4:junit4]   2> 	  <lst>
[junit4:junit4]   2> 	    <str name="name">test_posofftv</str>
[junit4:junit4]   2> 	    <str name="type">text</str>
[junit4:junit4]   2> 	    <bool name="termPositions">true</bool>
[junit4:junit4]   2> 	    <bool name="termVectors">true</bool>
[junit4:junit4]   2> 	    <bool name="termOffsets">true</bool>
[junit4:junit4]   2> 	  </lst>
[junit4:junit4]   2> 	  <lst>
[junit4:junit4]   2> 	    <str name="name">uniq</str>
[junit4:junit4]   2> 	    <str name="type">string</str>
[junit4:junit4]   2> 	    <bool name="indexed">true</bool>
[junit4:junit4]   2> 	    <bool name="stored">true</bool>
[junit4:junit4]   2> 	    <bool name="multiValued">true</bool>
[junit4:junit4]   2> 	  </lst>
[junit4:junit4]   2> 	  <lst>
[junit4:junit4]   2> 	    <str name="name">timestamp</str>
[junit4:junit4]   2> 	    <str name="type">date</str>
[junit4:junit4]   2> 	    <bool name="indexed">true</bool>
[junit4:junit4]   2> 	    <bool name="stored">true</bool>
[junit4:junit4]   2> 	  </lst>
[junit4:junit4]   2> 	  <lst>
[junit4:junit4]   2> 	    <str name="name">textgap</str>
[junit4:junit4]   2> 	    <str name="type">textgap</str>
[junit4:junit4]   2> 	    <bool name="indexed">true</bool>
[junit4:junit4]   2> 	    <bool name="stored">true</bool>
[junit4:junit4]   2> 	  </lst>
[junit4:junit4]   2> 	  <lst>
[junit4:junit4]   2> 	    <str name="name">porterfilt</str>
[junit4:junit4]   2> 	    <str name="type">porterfilt</str>
[junit4:junit4]   2> 	    <bool name="indexed">true</bool>
[junit4:junit4]   2> 	    <bool name="stored">true</bool>
[junit4:junit4]   2> 	  </lst>
[junit4:junit4]   2> 	  <lst>
[junit4:junit4]   2> 	    <str name="name">shouldbestored</str>
[junit4:junit4]   2> 	    <str name="type">unstored</str>
[junit4:junit4]   2> 	    <bool name="stored">true</bool>
[junit4:junit4]   2> 	  </lst>
[junit4:junit4]   2> 	  <lst>
[junit4:junit4]   2> 	    <str name="name">stopfilt</str>
[junit4:junit4]   2> 	    <str name="type">stopfilt</str>
[junit4:junit4]   2> 	    <bool name="indexed">true</bool>
[junit4:junit4]   2> 	    <bool name="stored">true</bool>
[junit4:junit4]   2> 	  </lst>
[junit4:junit4]   2> 	  <lst>
[junit4:junit4]   2> 	    <str name="name">text</str>
[junit4:junit4]   2> 	    <str name="type">text</str>
[junit4:junit4]   2> 	    <bool name="indexed">true</bool>
[junit4:junit4]   2> 	    <bool name="stored">false</bool>
[junit4:junit4]   2> 	    <bool name="multiValued">true</bool>
[junit4:junit4]   2> 	  </lst>
[junit4:junit4]   2> 	  <lst>
[junit4:junit4]   2> 	    <str name="name">point_hash</str>
[junit4:junit4]   2> 	    <str name="type">geohash</str>
[junit4:junit4]   2> 	    <bool name="indexed">true</bool>
[junit4:junit4]   2> 	    <bool name="stored">true</bool>
[junit4:junit4]   2> 	    <bool name="multiValued">false</bool>
[junit4:junit4]   2> 	  </lst>
[junit4:junit4]   2> 	  <lst>
[junit4:junit4]   2> 	    <str name="name">weight</str>
[junit4:junit4]   2> 	    <str name="type">float</str>
[junit4:junit4]   2> 	    <bool name="indexed">true</bool>
[junit4:junit4]   2> 	    <bool name="stored">true</bool>
[junit4:junit4]   2> 	  </lst>
[junit4:junit4]   2> 	  <lst>
[junit4:junit4]   2> 	    <str name="name">point</str>
[junit4:junit4]   2> 	    <str name="type">xy</str>
[junit4:junit4]   2> 	    <bool name="indexed">true</bool>
[junit4:junit4]   2> 	    <bool name="stored">true</bool>
[junit4:junit4]   2> 	    <bool name="multiValued">false</bool>
[junit4:junit4]   2> 	  </lst>
[junit4:junit4]   2> 	  <lst>
[junit4:junit4]   2> 	    <str name="name">subject</str>
[junit4:junit4]   2> 	    <str name="type">text</str>
[junit4:junit4]   2> 	    <bool name="indexed">true</bool>
[junit4:junit4]   2> 	    <bool name="stored">true</bool>
[junit4:junit4]   2> 	  </lst>
[junit4:junit4]   2> 	  <lst>
[junit4:junit4]   2> 	    <str name="name">subword</str>
[junit4:junit4]   2> 	    <str name="type">subword</str>
[junit4:junit4]   2> 	    <bool name="indexed">true</bool>
[junit4:junit4]   2> 	    <bool name="stored">true</bool>
[junit4:junit4]   2> 	  </lst>
[junit4:junit4]   2> 	  <lst>
[junit4:junit4]   2> 	    <str name="name">lowerfilt</str>
[junit4:junit4]   2> 	    <str name="type">lowerfilt</str>
[junit4:junit4]   2> 	    <bool name="indexed">true</bool>
[junit4:junit4]   2> 	    <bool name="stored">true</bool>
[junit4:junit4]   2> 	  </lst>
[junit4:junit4]   2> 	  <lst>
[junit4:junit4]   2> 	    <str name="name">bindsto</str>
[junit4:junit4]   2> 	    <str name="type">boolean</str>
[junit4:junit4]   2> 	    <bool name="indexed">true</bool>
[junit4:junit4]   2> 	    <bool name="stored">true</bool>
[junit4:junit4]   2> 	  </lst>
[junit4:junit4]   2> 	  <lst>
[junit4:junit4]   2> 	    <str name="name">uniq3</str>
[junit4:junit4]   2> 	    <str name="type">string</str>
[junit4:junit4]   2> 	    <bool name="indexed">true</bool>
[junit4:junit4]   2> 	    <bool name="stored">true</bool>
[junit4:junit4]   2> 	  </lst>
[junit4:junit4]   2> 	  <lst>
[junit4:junit4]   2> 	    <str name="name">store</str>
[junit4:junit4]   2> 	    <str name="type">location</str>
[junit4:junit4]   2> 	    <bool name="indexed">true</bool>
[junit4:junit4]   2> 	    <bool name="stored">true</bool>
[junit4:junit4]   2> 	  </lst>
[junit4:junit4]   2> 	</arr>
[junit4:junit4]   2> 	</response>
[junit4:junit4]   2> 	
[junit4:junit4]   2> 		request was:/schema/fields?indent=on&wt=xml
[junit4:junit4]   2> 4482 T10 oasc.SolrException.log SEVERE REQUEST FAILED: /schema/fields?indent=on&wt=xml:java.lang.RuntimeException: REQUEST FAILED: xpath=(/response/arr[@name='fields']/lst/str[@name='name'])[1] = 'custstopfilt'
[junit4:junit4]   2> 		xml response was: <?xml version="1.0" encoding="UTF-8"?>
[junit4:junit4]   2> 	<response>
[junit4:junit4]   2> 	
[junit4:junit4]   2> 	<lst name="responseHeader">
[junit4:junit4]   2> 	  <int name="status">0</int>
[junit4:junit4]   2> 	  <int name="QTime">2</int>
[junit4:junit4]   2> 	</lst>
[junit4:junit4]   2> 	<arr name="fields">
[junit4:junit4]   2> 	  <lst>
[junit4:junit4]   2> 	    <str name="name">sindsto</str>
[junit4:junit4]   2> 	    <str name="type">string</str>
[junit4:junit4]   2> 	    <bool name="indexed">true</bool>
[junit4:junit4]   2> 	    <bool name="stored">true</bool>
[junit4:junit4]   2> 	  </lst>
[junit4:junit4]   2> 	  <lst>
[junit4:junit4]   2> 	    <str name="name">protectedsubword</str>
[junit4:junit4]   2> 	    <str name="type">protectedsubword</str>
[junit4:junit4]   2> 	    <bool name="indexed">true</bool>
[junit4:junit4]   2> 	    <bool name="stored">true</bool>
[junit4:junit4]   2> 	  </lst>
[junit4:junit4]   2> 	  <lst>
[junit4:junit4]   2> 	    <str name="name">custstopfilt</str>
[junit4:junit4]   2> 	    <str name="type">custstopfilt</str>
[junit4:junit4]   2> 	    <bool name="indexed">true</bool>
[junit4:junit4]   2> 	    <bool name="stored">true</bool>
[junit4:junit4]   2> 	  </lst>
[junit4:junit4]   2> 	  <lst>
[junit4:junit4]   2> 	    <str name="name">title</str>
[junit4:junit4]   2> 	    <str name="type">nametext</str>
[junit4:junit4]   2> 	    <bool name="indexed">true</bool>
[junit4:junit4]   2> 	    <bool name="stored">true</bool>
[junit4:junit4]   2> 	  </lst>
[junit4:junit4]   2> 	  <lst>
[junit4:junit4]   2> 	    <str name="name">nouniq</str>
[junit4:junit4]   2> 	    <str name="type">string</str>
[junit4:junit4]   2> 	    <bool name="indexed">true</bool>
[junit4:junit4]   2> 	    <bool name="stored">true</bool>
[junit4:junit4]   2> 	    <bool name="multiValued">true</bool>
[junit4:junit4]   2> 	  </lst>
[junit4:junit4]   2> 	  <lst>
[junit4:junit4]   2> 	    <str name="name">standardtok</str>
[junit4:junit4]   2> 	    <str name="type">standardtok</str>
[junit4:junit4]   2> 	    <bool name="indexed">true</bool>
[junit4:junit4]   2> 	    <bool name="stored">true</bool>
[junit4:junit4]   2> 	  </lst>
[junit4:junit4]   2> 	  <lst>
[junit4:junit4]   2> 	    <str name="name">nullfirst</str>
[junit4:junit4]   2> 	    <str name="type">string</str>
[junit4:junit4]   2> 	    <bool name="indexed">true</bool>
[junit4:junit4]   2> 	    <bool name="stored">true</bool>
[junit4:junit4]   2> 	    <bool name="sortMissingFirst">true</bool>
[junit4:junit4]   2> 	  </lst>
[junit4:junit4]   2> 	  <lst>
[junit4:junit4]   2> 	    <str name="name">pointD</str>
[junit4:junit4]   2> 	    <str name="type">xyd</str>
[junit4:junit4]   2> 	    <bool name="indexed">true</bool>
[junit4:junit4]   2> 	    <bool name="stored">true</bool>
[junit4:junit4]   2> 	    <bool name="multiValued">false</bool>
[junit4:junit4]   2> 	  </lst>
[junit4:junit4]   2> 	  <lst>
[junit4:junit4]   2> 	    <str name="name">HTMLstandardtok</str>
[junit4:junit4]   2> 	    <str name="type">HTMLstandardtok</str>
[junit4:junit4]   2> 	    <bool name="indexed">true</bool>
[junit4:junit4]   2> 	    <bool name="stored">true</bool>
[junit4:junit4]   2> 	  </lst>
[junit4:junit4]   2> 	  <lst>
[junit4:junit4]   2> 	    <str name="name">bday</str>
[junit4:junit4]   2> 	    <str name="type">date</str>
[junit4:junit4]   2> 	    <bool name="indexed">true</bool>
[junit4:junit4]   2> 	    <bool name="stored">true</bool>
[junit4:junit4]   2> 	  </lst>
[junit4:junit4]   2> 	  <lst>
[junit4:junit4]   2> 	    <str name="name">signatureField</str>
[junit4:junit4]   2> 	    <str name="type">string</str>
[junit4:junit4]   2> 	    <bool name="indexed">true</bool>
[junit4:junit4]   2> 	    <bool name="stored">false</bool>
[junit4:junit4]   2> 	  </lst>
[junit4:junit4]   2> 	  <lst>
[junit4:junit4]   2> 	    <str name="name">title_stemmed</str>
[junit4:junit4]   2> 	    <str name="type">text</str>
[junit4:junit4]   2> 	    <bool name="indexed">true</bool>
[junit4:junit4]   2> 	    <bool name="stored">false</bool>
[junit4:junit4]   2> 	  </lst>
[junit4:junit4]   2> 	  <lst>
[junit4:junit4]   2> 	    <str name="name">keywordtok</str>
[junit4:junit4]   2> 	    <str name="type">keywordtok</str>
[junit4:junit4]   2> 	    <bool name="indexed">true</bool>
[junit4:junit4]   2> 	    <bool name="stored">true</bool>
[junit4:junit4]   2> 	  </lst>
[junit4:junit4]   2> 	  <lst>
[junit4:junit4]   2> 	    <str name="name">patternreplacefilt</str>
[junit4:junit4]   2> 	    <str name="type">patternreplacefilt</str>
[junit4:junit4]   2> 	    <bool name="indexed">true</bool>
[junit4:junit4]   2> 	    <bool name="stored">true</bool>
[junit4:junit4]   2> 	  </lst>
[junit4:junit4]   2> 	  <lst>
[junit4:junit4]   2> 	    <str name="name">standardtokfilt</str>
[junit4:junit4]   2> 	    <str name="type">standardtokfilt</str>
[junit4:junit4]   2> 	    <bool name="indexed">true</bool>
[junit4:junit4]   2> 	    <bool name="stored">true</bool>
[junit4:junit4]   2> 	  </lst>
[junit4:junit4]   2> 	  <lst>
[junit4:junit4]   2> 	    <str name="name">test_notv</str>
[junit4:junit4]   2> 	    <str name="type">text</str>
[junit4:junit4]   2> 	    <bool name="termVectors">false</bool>
[junit4:junit4]   2> 	  </lst>
[junit4:junit4]   2> 	  <lst>
[junit4:junit4]   2> 	    <str name="name">name</str>
[junit4:junit4]   2> 	    <str name="type">nametext</str>
[junit4:junit4]   2> 	    <bool name="indexed">true</bool>
[junit4:junit4]   2> 	    <bool name="stored">true</bool>
[junit4:junit4]   2> 	  </lst>
[junit4:junit4]   2> 	  <lst>
[junit4:junit4]   2> 	    <str name="name">sku1</str>
[junit4:junit4]   2> 	    <str name="type">skutype1</str>
[junit4:junit4]   2> 	    <bool name="indexed">true</bool>
[junit4:junit4]   2> 	    <bool name="stored">true</bool>
[junit4:junit4]   2> 	  </lst>
[junit4:junit4]   2> 	  <lst>
[junit4:junit4]   2> 	    <str name="name">wdf_preserve</str>
[junit4:junit4]   2> 	    <str name="type">wdf_preserve</str>
[junit4:junit4]   2> 	    <bool name="indexed">true</bool>
[junit4:junit4]   2> 	    <bool name="stored">true</bool>
[junit4:junit4]   2> 	  </lst>
[junit4:junit4]   2> 	  <lst>
[junit4:junit4]   2> 	    <str name="name">test_hlt</str>
[junit4:junit4]   2> 	    <str name="type">highlittext</str>
[junit4:junit4]   2> 	    <bool name="indexed">true</bool>
[junit4:junit4]   2> 	    <bool name="compressed">true</bool>
[junit4:junit4]   2> 	  </lst>
[junit4:junit4]   2> 	  <lst>
[junit4:junit4]   2> 	    <str name="name">text_np</str>
[junit4:junit4]   2> 	    <str name="type">text_np</str>
[junit4:junit4]   2> 	    <bool name="indexed">true</bool>
[junit4:junit4]   2> 	    <bool name="stored">false</bool>
[junit4:junit4]   2> 	  </lst>
[junit4:junit4]   2> 	  <lst>
[junit4:junit4]   2> 	    <str name="name">iind</str>
[junit4:junit4]   2> 	    <str name="type">int</str>
[junit4:junit4]   2> 	    <bool name="indexed">true</bool>
[junit4:junit4]   2> 	    <bool name="stored">false</bool>
[junit4:junit4]   2> 	  </lst>
[junit4:junit4]   2> 	  <lst>
[junit4:junit4]   2> 	    <str name="name">teststop</str>
[junit4:junit4]   2> 	    <str name="type">teststop</str>
[junit4:junit4]   2> 	    <bool name="indexed">true</bool>
[junit4:junit4]   2> 	    <bool name="stored">true</bool>
[junit4:junit4]   2> 	  </lst>
[junit4:junit4]   2> 	  <lst>
[junit4:junit4]   2> 	    <str name="name">test_basictv</str>
[junit4:junit4]   2> 	    <str name="type">text</str>
[junit4:junit4]   2> 	    <bool name="termVectors">true</bool>
[junit4:junit4]   2> 	  </lst>
[junit4:junit4]   2> 	  <lst>
[junit4:junit4]   2> 	    <str name="name">title_lettertok</str>
[junit4:junit4]   2> 	    <str name="type">lettertok</str>
[junit4:junit4]   2> 	    <bool name="indexed">true</bool>
[junit4:junit4]   2> 	    <bool name="stored">false</bool>
[junit4:junit4]   2> 	  </lst>
[junit4:junit4]   2> 	  <lst>
[junit4:junit4]   2> 	    <str name="name">sku2</str>
[junit4:junit4]   2> 	    <str name="type">skutype2</str>
[junit4:junit4]   2> 	    <bool name="indexed">true</bool>
[junit4:junit4]   2> 	    <bool name="stored">true</bool>
[junit4:junit4]   2> 	  </lst>
[junit4:junit4]   2> 	  <lst>
[junit4:junit4]   2> 	    <str name="name">syn</str>
[junit4:junit4]   2> 	    <str name="type">syn</str>
[junit4:junit4]   2> 	    <bool name="indexed">true</bool>
[junit4:junit4]   2> 	    <bool name="stored">true</bool>
[junit4:junit4]   2> 	  </lst>
[junit4:junit4]   2> 	  <lst>
[junit4:junit4]   2> 	    <str name="name">bind</str>
[junit4:junit4]   2> 	    <str name="type">boolean</str>
[junit4:junit4]   2> 	    <bool name="indexed">true</bool>
[junit4:junit4]   2> 	    <bool name="stored">false</bool>
[junit4:junit4]   2> 	  </lst>
[junit4:junit4]   2> 	  <lst>
[junit4:junit4]   2> 	    <str name="name">_version_</str>
[junit4:junit4]   2> 	    <str name="type">long</str>
[junit4:junit4]   2> 	    <bool name="indexed">true</bool>
[junit4:junit4]   2> 	    <bool name="stored">true</bool>
[junit4:junit4]   2> 	  </lst>
[junit4:junit4]   2> 	  <lst>
[junit4:junit4]   2> 	    <str name="name">ssto</str>
[junit4:junit4]   2> 	    <str name="type">string</str>
[junit4:junit4]   2> 	    <bool name="indexed">false</bool>
[junit4:junit4]   2> 	    <bool name="stored">true</bool>
[junit4:junit4]   2> 	  </lst>
[junit4:junit4]   2> 	  <lst>
[junit4:junit4]   2> 	    <str name="name">id</str>
[junit4:junit4]   2> 	    <str name="type">string</str>
[junit4:junit4]   2> 	    <bool name="required">true</bool>
[junit4:junit4]   2> 	    <bool name="indexed">true</bool>
[junit4:junit4]   2> 	    <bool name="stored">true</bool>
[junit4:junit4]   2> 	    <bool name="multiValued">false</bool>
[junit4:junit4]   2> 	    <bool name="uniqueKey">true</bool>
[junit4:junit4]   2> 	  </lst>
[junit4:junit4]   2> 	  <lst>
[junit4:junit4]   2> 	    <str name="name">engporterfilt</str>
[junit4:junit4]   2> 	    <str name="type">engporterfilt</str>
[junit4:junit4]   2> 	    <bool name="indexed">true</bool>
[junit4:junit4]   2> 	    <bool name="stored">true</bool>
[junit4:junit4]   2> 	  </lst>
[junit4:junit4]   2> 	  <lst>
[junit4:junit4]   2> 	    <str name="name">HTMLwhitetok</str>
[junit4:junit4]   2> 	    <str name="type">HTMLwhitetok</str>
[junit4:junit4]   2> 	    <bool name="indexed">true</bool>
[junit4:junit4]   2> 	    <bool name="stored">true</bool>
[junit4:junit4]   2> 	  </lst>
[junit4:junit4]   2> 	  <lst>
[junit4:junit4]   2> 	    <str name="name">lengthfilt</str>
[junit4:junit4]   2> 	    <str name="type">lengthfilt</str>
[junit4:junit4]   2> 	    <bool name="indexed">true</bool>
[junit4:junit4]   2> 	    <bool name="stored">true</bool>
[junit4:junit4]   2> 	  </lst>
[junit4:junit4]   2> 	  <lst>
[junit4:junit4]   2> 	    <str name="name">uuid</str>
[junit4:junit4]   2> 	    <str name="type">uuid</str>
[junit4:junit4]   2> 	    <bool name="stored">true</bool>
[junit4:junit4]   2> 	  </lst>
[junit4:junit4]   2> 	  <lst>
[junit4:junit4]   2> 	    <str name="name">wdf_nocase</str>
[junit4:junit4]   2> 	    <str name="type">wdf_nocase</str>
[junit4:junit4]   2> 	    <bool name="indexed">true</bool>
[junit4:junit4]   2> 	    <bool name="stored">true</bool>
[junit4:junit4]   2> 	  </lst>
[junit4:junit4]   2> 	  <lst>
[junit4:junit4]   2> 	    <str name="name">whitetok</str>
[junit4:junit4]   2> 	    <str name="type">whitetok</str>
[junit4:junit4]   2> 	    <bool name="indexed">true</bool>
[junit4:junit4]   2> 	    <bool name="stored">true</bool>
[junit4:junit4]   2> 	  </lst>
[junit4:junit4]   2> 	  <lst>
[junit4:junit4]   2> 	    <str name="name">bsto</str>
[junit4:junit4]   2> 	    <str name="type">boolean</str>
[junit4:junit4]   2> 	    <bool name="indexed">false</bool>
[junit4:junit4]   2> 	    <bool name="stored">true</bool>
[junit4:junit4]   2> 	  </lst>
[junit4:junit4]   2> 	  <lst>
[junit4:junit4]   2> 	    <str name="name">dedup</str>
[junit4:junit4]   2> 	    <str name="type">dedup</str>
[junit4:junit4]   2> 	    <bool name="indexed">true</bool>
[junit4:junit4]   2> 	    <bool name="stored">true</bool>
[junit4:junit4]   2> 	  </lst>
[junit4:junit4]   2> 	  <lst>
[junit4:junit4]   2> 	    <str name="name">isto</str>
[junit4:junit4]   2> 	    <str name="type">int</str>
[junit4:junit4]   2> 	    <bool name="indexed">false</bool>
[junit4:junit4]   2> 	    <bool name="stored">true</bool>
[junit4:junit4]   2> 	  </lst>
[junit4:junit4]   2> 	  <lst>
[junit4:junit4]   2> 	    <str name="name">uniq2</str>
[junit4:junit4]   2> 	    <str name="type">string</str>
[junit4:junit4]   2> 	    <bool name="indexed">true</bool>
[junit4:junit4]   2> 	    <bool name="stored">true</bool>
[junit4:junit4]   2> 	    <bool name="multiValued">true</bool>
[junit4:junit4]   2> 	  </lst>
[junit4:junit4]   2> 	  <lst>
[junit4:junit4]   2> 	    <str name="name">lowertok</str>
[junit4:junit4]   2> 	    <str name="type">lowertok</str>
[junit4:junit4]   2> 	    <bool name="indexed">true</bool>
[junit4:junit4]   2> 	    <bool name="stored">true</bool>
[junit4:junit4]   2> 	  </lst>
[junit4:junit4]   2> 	  <lst>
[junit4:junit4]   2> 	    <str name="name">lettertok</str>
[junit4:junit4]   2> 	    <str name="type">lettertok</str>
[junit4:junit4]   2> 	    <bool name="indexed">true</bool>
[junit4:junit4]   2> 	    <bool name="stored">true</bool>
[junit4:junit4]   2> 	  </lst>
[junit4:junit4]   2> 	  <lst>
[junit4:junit4]   2> 	    <str name="name">sind</str>
[junit4:junit4]   2> 	    <str name="type">string</str>
[junit4:junit4]   2> 	    <bool name="indexed">true</bool>
[junit4:junit4]   2> 	    <bool name="stored">false</bool>
[junit4:junit4]   2> 	  </lst>
[junit4:junit4]   2> 	  <lst>
[junit4:junit4]   2> 	    <str name="name">numericsubword</str>
[junit4:junit4]   2> 	    <str name="type">numericsubword</str>
[junit4:junit4]   2> 	    <bool name="indexed">true</bool>
[junit4:junit4]   2> 	    <bool name="stored">true</bool>
[junit4:junit4]   2> 	  </lst>
[junit4:junit4]   2> 	  <lst>
[junit4:junit4]   2> 	    <str name="name">custengporterfilt</str>
[junit4:junit4]   2> 	    <str name="type">custengporterfilt</str>
[junit4:junit4]   2> 	    <bool name="indexed">true</bool>
[junit4:junit4]   2> 	    <bool name="stored">true</bool>
[junit4:junit4]   2> 	  </lst>
[junit4:junit4]   2> 	  <lst>
[junit4:junit4]   2> 	    <str name="name">test_offtv</str>
[junit4:junit4]   2> 	    <str name="type">text</str>
[junit4:junit4]   2> 	    <bool name="termVectors">true</bool>
[junit4:junit4]   2> 	    <bool name="termOffsets">true</bool>
[junit4:junit4]   2> 	  </lst>
[junit4:junit4]   2> 	  <lst>
[junit4:junit4]   2> 	    <str name="name">copyfield_source</str>
[junit4:junit4]   2> 	    <str name="type">string</str>
[junit4:junit4]   2> 	    <bool name="indexed">true</bool>
[junit4:junit4]   2> 	    <bool name="stored">true</bool>
[junit4:junit4]   2> 	    <bool name="multiValued">true</bool>
[junit4:junit4]   2> 	  </lst>
[junit4:junit4]   2> 	  <lst>
[junit4:junit4]   2> 	    <str name="name">test_postv</str>
[junit4:junit4]   2> 	    <str name="type">text</str>
[junit4:junit4]   2> 	    <bool name="termPositions">true</bool>
[junit4:junit4]   2> 	    <bool name="termVectors">true</bool>
[junit4:junit4]   2> 	  </lst>
[junit4:junit4]   2> 	  <lst>
[junit4:junit4]   2> 	    <str name="name">numberpartfail</str>
[junit4:junit4]   2> 	    <str name="type">failtype1</str>
[junit4:junit4]   2> 	    <bool name="indexed">true</bool>
[junit4:junit4]   2> 	    <bool name="stored">true</bool>
[junit4:junit4]   2> 	  </lst>
[junit4:junit4]   2> 	  <lst>
[junit4:junit4]   2> 	    <str name="name">test_hlt_off</str>
[junit4:junit4]   2> 	    <str name="type">highlittext</str>
[junit4:junit4]   2> 	    <bool name="indexed">true</bool>
[junit4:junit4]   2> 	    <bool name="compressed">false</bool>
[junit4:junit4]   2> 	  </lst>
[junit4:junit4]   2> 	  <lst>
[junit4:junit4]   2> 	    <str name="name">shouldbeunindexed</str>
[junit4:junit4]   2> 	    <str name="type">unstored</str>
[junit4:junit4]   2> 	    <bool name="indexed">false</bool>
[junit4:junit4]   2> 	    <bool name="stored">true</bool>
[junit4:junit4]   2> 	  </lst>
[junit4:junit4]   2> 	  <lst>
[junit4:junit4]   2> 	    <str name="name">standardfilt</str>
[junit4:junit4]   2> 	    <str name="type">standardfilt</str>
[junit4:junit4]   2> 	    <bool name="indexed">true</bool>
[junit4:junit4]   2> 	    <bool name="stored">true</bool>
[junit4:junit4]   2> 	  </lst>
[junit4:junit4]   2> 	  <lst>
[junit4:junit4]   2> 	    <str name="name">shouldbeunstored</str>
[junit4:junit4]   2> 	    <str name="type">unstored</str>
[junit4:junit4]   2> 	  </lst>
[junit4:junit4]   2> 	  <lst>
[junit4:junit4]   2> 	    <str name="name">test_posofftv</str>
[junit4:junit4]   2> 	    <str name="type">text</str>
[junit4:junit4]   2> 	    <bool name="termPositions">true</bool>
[junit4:junit4]   2> 	    <bool name="termVectors">true</bool>
[junit4:junit4]   2> 	    <bool name="termOffsets">true</bool>
[junit4:junit4]   2> 	  </lst>
[junit4:junit4]   2> 	  <lst>
[junit4:junit4]   2> 	    <str name="name">uniq</str>
[junit4:junit4]   2> 	    <str name="type">string</str>
[junit4:junit4]   2> 	    <bool name="indexed">true</bool>
[junit4:junit4]   2> 	    <bool name="stored">true</bool>
[junit4:junit4]   2> 	    <bool name="multiValued">true</bool>
[junit4:junit4]   2> 	  </lst>
[junit4:junit4]   2> 	  <lst>
[junit4:junit4]   2> 	    <str name="name">timestamp</str>
[junit4:junit4]   2> 	    <str name="type">date</str>
[junit4:junit4]   2> 	    <bool name="indexed">true</bool>
[junit4:junit4]   2> 	    <bool name="stored">true</bool>
[junit4:junit4]   2> 	  </lst>
[junit4:junit4]   2> 	  <lst>
[junit4:junit4]   2> 	    <str name="name">textgap</str>
[junit4:junit4]   2> 	    <str name="type">textgap</str>
[junit4:junit4]   2> 	    <bool name="indexed">true</bool>
[junit4:junit4]   2> 	    <bool name="stored">true</bool>
[junit4:junit4]   2> 	  </lst>
[junit4:junit4]   2> 	  <lst>
[junit4:junit4]   2> 	    <str name="name">porterfilt</str>
[junit4:junit4]   2> 	    <str name="type">porterfilt</str>
[junit4:junit4]   2> 	    <bool name="indexed">true</bool>
[junit4:junit4]   2> 	    <bool name="stored">true</bool>
[junit4:junit4]   2> 	  </lst>
[junit4:junit4]   2> 	  <lst>
[junit4:junit4]   2> 	    <str name="name">shouldbestored</str>
[junit4:junit4]   2> 	    <str name="type">unstored</str>
[junit4:junit4]   2> 	    <bool name="stored">true</bool>
[junit4:junit4]   2> 	  </lst>
[junit4:junit4]   2> 	  <lst>
[junit4:junit4]   2> 	    <str name="name">stopfilt</str>
[junit4:junit4]   2> 	    <str name="type">stopfilt</str>
[junit4:junit4]   2> 	    <bool name="indexed">true</bool>
[junit4:junit4]   2> 	    <bool name="stored">true</bool>
[junit4:junit4]   2> 	  </lst>
[junit4:junit4]   2> 	  <lst>
[junit4:junit4]   2> 	    <str name="name">text</str>
[junit4:junit4]   2> 	    <str name="type">text</str>
[junit4:junit4]   2> 	    <bool name="indexed">true</bool>
[junit4:junit4]   2> 	    <bool name="stored">false</bool>
[junit4:junit4]   2> 	    <bool name="multiValued">true</bool>
[junit4:junit4]   2> 	  </lst>
[junit4:junit4]   2> 	  <lst>
[junit4:junit4]   2> 	    <str name="name">point_hash</str>
[junit4:junit4]   2> 	    <str name="type">geohash</str>
[junit4:junit4]   2> 	    <bool name="indexed">true</bool>
[junit4:junit4]   2> 	    <bool name="stored">true</bool>
[junit4:junit4]   2> 	    <bool name="multiValued">false</bool>
[junit4:junit4]   2> 	  </lst>
[junit4:junit4]   2> 	  <lst>
[junit4:junit4]   2> 	    <str name="name">weight</str>
[junit4:junit4]   2> 	    <str name="type">float</str>
[junit4:junit4]   2> 	    <bool name="indexed">true</bool>
[junit4:junit4]   2> 	    <bool name="stored">true</bool>
[junit4:junit4]   2> 	  </lst>
[junit4:junit4]   2> 	  <lst>
[junit4:junit4]   2> 	    <str name="name">point</str>
[junit4:junit4]   2> 	    <str name="type">xy</str>
[junit4:junit4]   2> 	    <bool name="indexed">true</bool>
[junit4:junit4]   2> 	    <bool name="stored">true</bool>
[junit4:junit4]   2> 	    <bool name="multiValued">false</bool>
[junit4:junit4]   2> 	  </lst>
[junit4:junit4]   2> 	  <lst>
[junit4:junit4]   2> 	    <str name="name">subject</str>
[junit4:junit4]   2> 	    <str name="type">text</str>
[junit4:junit4]   2> 	    <bool name="indexed">true</bool>
[junit4:junit4]   2> 	    <bool name="stored">true</bool>
[junit4:junit4]   2> 	  </lst>
[junit4:junit4]   2> 	  <lst>
[junit4:junit4]   2> 	    <str name="name">subword</str>
[junit4:junit4]   2> 	    <str name="type">subword</str>
[junit4:junit4]   2> 	    <bool name="indexed">true</bool>
[junit4:junit4]   2> 	    <bool name="stored">true</bool>
[junit4:junit4]   2> 	  </lst>
[junit4:junit4]   2> 	  <lst>
[junit4:junit4]   2> 	    <str name="name">lowerfilt</str>
[junit4:junit4]   2> 	    <str name="type">lowerfilt</str>
[junit4:junit4]   2> 	    <bool name="indexed">true</bool>
[junit4:junit4]   2> 	    <bool name="stored">true</bool>
[junit4:junit4]   2> 	  </lst>
[junit4:junit4]   2> 	  <lst>
[junit4:junit4]   2> 	    <str name="name">bindsto</str>
[junit4:junit4]   2> 	    <str name="type">boolean</str>
[junit4:junit4]   2> 	    <bool name="indexed">true</bool>
[junit4:junit4]   2> 	    <bool name="stored">true</bool>
[junit4:junit4]   2> 	  </lst>
[junit4:junit4]   2> 	  <lst>
[junit4:junit4]   2> 	    <str name="name">uniq3</str>
[junit4:junit4]   2> 	    <str name="type">string</str>
[junit4:junit4]   2> 	    <bool name="indexed">true</bool>
[junit4:junit4]   2> 	    <bool name="stored">true</bool>
[junit4:junit4]   2> 	  </lst>
[junit4:junit4]   2> 	  <lst>
[junit4:junit4]   2> 	    <str name="name">store</str>
[junit4:junit4]   2> 	    <str name="type">location</str>
[junit4:junit4]   2> 	    <bool name="indexed">true</bool>
[junit4:junit4]   2> 	    <bool name="stored">true</bool>
[junit4:junit4]   2> 	  </lst>
[junit4:junit4]   2> 	</arr>
[junit4:junit4]   2> 	</response>
[junit4:junit4]   2> 	
[junit4:junit4]   2> 		request was:/schema/fields?indent=on&wt=xml
[junit4:junit4]   2> 		at org.apache.solr.util.RestTestBase.assertQ(RestTestBase.java:136)
[junit4:junit4]   2> 		at org.apache.solr.rest.TestFieldCollectionResource.testGetAllFields(TestFieldCollectionResource.java:26)
[junit4:junit4]   2> 		at sun.reflect.NativeMethodAccessorImpl.invoke0(Native Method)
[junit4:junit4]   2> 		at sun.reflect.NativeMethodAccessorImpl.invoke(NativeMethodAccessorImpl.java:57)
[junit4:junit4]   2> 		at sun.reflect.DelegatingMethodAccessorImpl.invoke(DelegatingMethodAccessorImpl.java:43)
[junit4:junit4]   2> 		at java.lang.reflect.Method.invoke(Method.java:487)
[junit4:junit4]   2> 		at com.carrotsearch.randomizedtesting.RandomizedRunner.invoke(RandomizedRunner.java:1559)
[junit4:junit4]   2> 		at com.carrotsearch.randomizedtesting.RandomizedRunner.access$600(RandomizedRunner.java:79)
[junit4:junit4]   2> 		at com.carrotsearch.randomizedtesting.RandomizedRunner$6.evaluate(RandomizedRunner.java:737)
[junit4:junit4]   2> 		at com.carrotsearch.randomizedtesting.RandomizedRunner$7.evaluate(RandomizedRunner.java:773)
[junit4:junit4]   2> 		at com.carrotsearch.randomizedtesting.RandomizedRunner$8.evaluate(RandomizedRunner.java:787)
[junit4:junit4]   2> 		at com.carrotsearch.randomizedtesting.rules.SystemPropertiesRestoreRule$1.evaluate(SystemPropertiesRestoreRule.java:53)
[junit4:junit4]   2> 		at org.apache.lucene.util.TestRuleSetupTeardownChained$1.evaluate(TestRuleSetupTeardownChained.java:50)
[junit4:junit4]   2> 		at org.apache.lucene.util.TestRuleFieldCacheSanity$1.evaluate(TestRuleFieldCacheSanity.java:51)
[junit4:junit4]   2> 		at org.apache.lucene.util.AbstractBeforeAfterRule$1.evaluate(AbstractBeforeAfterRule.java:46)
[junit4:junit4]   2> 		at com.carrotsearch.randomizedtesting.rules.SystemPropertiesInvariantRule$1.evaluate(SystemPropertiesInvariantRule.java:55)
[junit4:junit4]   2> 		at org.apache.lucene.util.TestRuleThreadAndTestName$1.evaluate(TestRuleThreadAndTestName.java:49)
[junit4:junit4]   2> 		at org.apache.lucene.util.TestRuleIgnoreAfterMaxFailures$1.evaluate(TestRuleIgnoreAfterMaxFailures.java:70)
[junit4:junit4]   2> 		at org.apache.lucene.util.TestRuleMarkFailure$1.evaluate(TestRuleMarkFailure.java:48)
[junit4:junit4]   2> 		at com.carrotsearch.randomizedtesting.rules.StatementAdapter.evaluate(StatementAdapter.java:36)
[junit4:junit4]   2> 		at com.carrotsearch.randomizedtesting.ThreadLeakControl$StatementRunner.run(ThreadLeakControl.java:358)
[junit4:junit4]   2> 		at com.carrotsearch.randomizedtesting.ThreadLeakControl.forkTimeoutingTask(ThreadLeakControl.java:782)
[junit4:junit4]   2> 		at com.carrotsearch.randomizedtesting.ThreadLeakControl$3.evaluate(ThreadLeakControl.java:442)
[junit4:junit4]   2> 		at com.carrotsearch.randomizedtesting.RandomizedRunner.runSingleTest(RandomizedRunner.java:746)
[junit4:junit4]   2> 		at com.carrotsearch.randomizedtesting.RandomizedRunner$3.evaluate(RandomizedRunner.java:648)
[junit4:junit4]   2> 		at com.carrotsearch.randomizedtesting.RandomizedRunner$4.evaluate(RandomizedRunner.java:682)
[junit4:junit4]   2> 		at com.carrotsearch.randomizedtesting.RandomizedRunner$5.evaluate(RandomizedRunner.java:693)
[junit4:junit4]   2> 		at com.carrotsearch.randomizedtesting.rules.StatementAdapter.evaluate(StatementAdapter.java:36)
[junit4:junit4]   2> 		at com.carrotsearch.randomizedtesting.rules.SystemPropertiesRestoreRule$1.evaluate(SystemPropertiesRestoreRule.java:53)
[junit4:junit4]   2> 		at org.apache.lucene.util.AbstractBeforeAfterRule$1.evaluate(AbstractBeforeAfterRule.java:46)
[junit4:junit4]   2> 		at org.apache.lucene.util.TestRuleStoreClassName$1.evaluate(TestRuleStoreClassName.java:42)
[junit4:junit4]   2> 		at com.carrotsearch.randomizedtesting.rules.SystemPropertiesInvariantRule$1.evaluate(SystemPropertiesInvariantRule.java:55)
[junit4:junit4]   2> 		at com.carrotsearch.randomizedtesting.rules.NoShadowingOrOverridesOnMethodsRule$1.evaluate(NoShadowingOrOverridesOnMethodsRule.java:39)
[junit4:junit4]   2> 		at com.carrotsearch.randomizedtesting.rules.NoShadowingOrOverridesOnMethodsRule$1.evaluate(NoShadowingOrOverridesOnMethodsRule.java:39)
[junit4:junit4]   2> 		at com.carrotsearch.randomizedtesting.rules.StatementAdapter.evaluate(StatementAdapter.java:36)
[junit4:junit4]   2> 		at org.apache.lucene.util.TestRuleAssertionsRequired$1.evaluate(TestRuleAssertionsRequired.java:43)
[junit4:junit4]   2> 		at org.apache.lucene.util.TestRuleMarkFailure$1.evaluate(TestRuleMarkFailure.java:48)
[junit4:junit4]   2> 		at org.apache.lucene.util.TestRuleIgnoreAfterMaxFailures$1.evaluate(TestRuleIgnoreAfterMaxFailures.java:70)
[junit4:junit4]   2> 		at org.apache.lucene.util.TestRuleIgnoreTestSuites$1.evaluate(TestRuleIgnoreTestSuites.java:55)
[junit4:junit4]   2> 		at com.carrotsearch.randomizedtesting.rules.StatementAdapter.evaluate(StatementAdapter.java:36)
[junit4:junit4]   2> 		at com.carrotsearch.randomizedtesting.ThreadLeakControl$StatementRunner.run(ThreadLeakControl.java:358)
[junit4:junit4]   2> 		at java.lang.Thread.run(Thread.java:722)
[junit4:junit4]   2> 	
[junit4:junit4]   2> 4487 T10 oas.SolrTestCaseJ4.tearDown ###Ending testGetAllFields
[junit4:junit4]   2> NOTE: reproduce with: ant test  -Dtestcase=TestFieldCollectionResource -Dtests.method=testGetAllFields -Dtests.seed=6E9A2F599977315B -Dtests.multiplier=3 -Dtests.slow=true -Dtests.locale=vi_VN -Dtests.timezone=Europe/Vatican -Dtests.file.encoding=UTF-8
[junit4:junit4] ERROR   0.12s J0 | TestFieldCollectionResource.testGetAllFields <<<
[junit4:junit4]    > Throwable #1: java.lang.RuntimeException: Exception during query
[junit4:junit4]    > 	at __randomizedtesting.SeedInfo.seed([6E9A2F599977315B:8234659D6384C8C3]:0)
[junit4:junit4]    > 	at org.apache.solr.util.RestTestBase.assertQ(RestTestBase.java:143)
[junit4:junit4]    > 	at org.apache.solr.rest.TestFieldCollectionResource.testGetAllFields(TestFieldCollectionResource.java:26)
[junit4:junit4]    > 	at sun.reflect.NativeMethodAccessorImpl.invoke0(Native Method)
[junit4:junit4]    > 	at sun.reflect.NativeMethodAccessorImpl.invoke(NativeMethodAccessorImpl.java:57)
[junit4:junit4]    > 	at sun.reflect.DelegatingMethodAccessorImpl.invoke(DelegatingMethodAccessorImpl.java:43)
[junit4:junit4]    > 	at java.lang.reflect.Method.invoke(Method.java:487)
[junit4:junit4]    > 	at com.carrotsearch.randomizedtesting.RandomizedRunner.invoke(RandomizedRunner.java:1559)
[junit4:junit4]    > 	at com.carrotsearch.randomizedtesting.RandomizedRunner.access$600(RandomizedRunner.java:79)
[junit4:junit4]    > 	at com.carrotsearch.randomizedtesting.RandomizedRunner$6.evaluate(RandomizedRunner.java:737)
[junit4:junit4]    > 	at com.carrotsearch.randomizedtesting.RandomizedRunner$7.evaluate(RandomizedRunner.java:773)
[junit4:junit4]    > 	at com.carrotsearch.randomizedtesting.RandomizedRunner$8.evaluate(RandomizedRunner.java:787)
[junit4:junit4]    > 	at com.carrotsearch.randomizedtesting.rules.SystemPropertiesRestoreRule$1.evaluate(SystemPropertiesRestoreRule.java:53)
[junit4:junit4]    > 	at org.apache.lucene.util.TestRuleSetupTeardownChained$1.evaluate(TestRuleSetupTeardownChained.java:50)
[junit4:junit4]    > 	at org.apache.lucene.util.TestRuleFieldCacheSanity$1.evaluate(TestRuleFieldCacheSanity.java:51)
[junit4:junit4]    > 	at org.apache.lucene.util.AbstractBeforeAfterRule$1.evaluate(AbstractBeforeAfterRule.java:46)
[junit4:junit4]    > 	at com.carrotsearch.randomizedtesting.rules.SystemPropertiesInvariantRule$1.evaluate(SystemPropertiesInvariantRule.java:55)
[junit4:junit4]    > 	at org.apache.lucene.util.TestRuleThreadAndTestName$1.evaluate(TestRuleThreadAndTestName.java:49)
[junit4:junit4]    > 	at org.apache.lucene.util.TestRuleIgnoreAfterMaxFailures$1.evaluate(TestRuleIgnoreAfterMaxFailures.java:70)
[junit4:junit4]    > 	at org.apache.lucene.util.TestRuleMarkFailure$1.evaluate(TestRuleMarkFailure.java:48)
[junit4:junit4]    > 	at com.carrotsearch.randomizedtesting.rules.StatementAdapter.evaluate(StatementAdapter.java:36)
[junit4:junit4]    > 	at com.carrotsearch.randomizedtesting.ThreadLeakControl$StatementRunner.run(ThreadLeakControl.java:358)
[junit4:junit4]    > 	at com.carrotsearch.randomizedtesting.ThreadLeakControl.forkTimeoutingTask(ThreadLeakControl.java:782)
[junit4:junit4]    > 	at com.carrotsearch.randomizedtesting.ThreadLeakControl$3.evaluate(ThreadLeakControl.java:442)
[junit4:junit4]    > 	at com.carrotsearch.randomizedtesting.RandomizedRunner.runSingleTest(RandomizedRunner.java:746)
[junit4:junit4]    > 	at com.carrotsearch.randomizedtesting.RandomizedRunner$3.evaluate(RandomizedRunner.java:648)
[junit4:junit4]    > 	at com.carrotsearch.randomizedtesting.RandomizedRunner$4.evaluate(RandomizedRunner.java:682)
[junit4:junit4]    > 	at com.carrotsearch.randomizedtesting.RandomizedRunner$5.evaluate(RandomizedRunner.java:693)
[junit4:junit4]    > 	at com.carrotsearch.randomizedtesting.rules.StatementAdapter.evaluate(StatementAdapter.java:36)
[junit4:junit4]    > 	at com.carrotsearch.randomizedtesting.rules.SystemPropertiesRestoreRule$1.evaluate(SystemPropertiesRestoreRule.java:53)
[junit4:junit4]    > 	at org.apache.lucene.util.AbstractBeforeAfterRule$1.evaluate(AbstractBeforeAfterRule.java:46)
[junit4:junit4]    > 	at org.apache.lucene.util.TestRuleStoreClassName$1.evaluate(TestRuleStoreClassName.java:42)
[junit4:junit4]    > 	at com.carrotsearch.randomizedtesting.rules.SystemPropertiesInvariantRule$1.evaluate(SystemPropertiesInvariantRule.java:55)
[junit4:junit4]    > 	at com.carrotsearch.randomizedtesting.rules.NoShadowingOrOverridesOnMethodsRule$1.evaluate(NoShadowingOrOverridesOnMethodsRule.java:39)
[junit4:junit4]    > 	at com.carrotsearch.randomizedtesting.rules.NoShadowingOrOverridesOnMethodsRule$1.evaluate(NoShadowingOrOverridesOnMethodsRule.java:39)
[junit4:junit4]    > 	at com.carrotsearch.randomizedtesting.rules.StatementAdapter.evaluate(StatementAdapter.java:36)
[junit4:junit4]    > 	at org.apache.lucene.util.TestRuleAssertionsRequired$1.evaluate(TestRuleAssertionsRequired.java:43)
[junit4:junit4]    > 	at org.apache.lucene.util.TestRuleMarkFailure$1.evaluate(TestRuleMarkFailure.java:48)
[junit4:junit4]    > 	at org.apache.lucene.util.TestRuleIgnoreAfterMaxFailures$1.evaluate(TestRuleIgnoreAfterMaxFailures.java:70)
[junit4:junit4]    > 	at org.apache.lucene.util.TestRuleIgnoreTestSuites$1.evaluate(TestRuleIgnoreTestSuites.java:55)
[junit4:junit4]    > 	at com.carrotsearch.randomizedtesting.rules.StatementAdapter.evaluate(StatementAdapter.java:36)
[junit4:junit4]    > 	at com.carrotsearch.randomizedtesting.ThreadLeakControl$StatementRunner.run(ThreadLeakControl.java:358)
[junit4:junit4]    > 	at java.lang.Thread.run(Thread.java:722)
[junit4:junit4]    > Caused by: java.lang.RuntimeException: REQUEST FAILED: xpath=(/response/arr[@name='fields']/lst/str[@name='name'])[1] = 'custstopfilt'
[junit4:junit4]    > 	xml response was: <?xml version="1.0" encoding="UTF-8"?>
[junit4:junit4]    > <response>
[junit4:junit4]    > 
[junit4:junit4]    > <lst name="responseHeader">
[junit4:junit4]    >   <int name="status">0</int>
[junit4:junit4]    >   <int name="QTime">2</int>
[junit4:junit4]    > </lst>
[junit4:junit4]    > <arr name="fields">
[junit4:junit4]    >   <lst>
[junit4:junit4]    >     <str name="name">sindsto</str>
[junit4:junit4]    >     <str name="type">string</str>
[junit4:junit4]    >     <bool name="indexed">true</bool>
[junit4:junit4]    >     <bool name="stored">true</bool>
[junit4:junit4]    >   </lst>
[junit4:junit4]    >   <lst>
[junit4:junit4]    >     <str name="name">protectedsubword</str>
[junit4:junit4]    >     <str name="type">protectedsubword</str>
[junit4:junit4]    >     <bool name="indexed">true</bool>
[junit4:junit4]    >     <bool name="stored">true</bool>
[junit4:junit4]    >   </lst>
[junit4:junit4]    >   <lst>
[junit4:junit4]    >     <str name="name">custstopfilt</str>
[junit4:junit4]    >     <str name="type">custstopfilt</str>
[junit4:junit4]    >     <bool name="indexed">true</bool>
[junit4:junit4]    >     <bool name="stored">true</bool>
[junit4:junit4]    >   </lst>
[junit4:junit4]    >   <lst>
[junit4:junit4]    >     <str name="name">title</str>
[junit4:junit4]    >     <str name="type">nametext</str>
[junit4:junit4]    >     <bool name="indexed">true</bool>
[junit4:junit4]    >     <bool name="stored">true</bool>
[junit4:junit4]    >   </lst>
[junit4:junit4]    >   <lst>
[junit4:junit4]    >     <str name="name">nouniq</str>
[junit4:junit4]    >     <str name="type">string</str>
[junit4:junit4]    >     <bool name="indexed">true</bool>
[junit4:junit4]    >     <bool name="stored">true</bool>
[junit4:junit4]    >     <bool name="multiValued">true</bool>
[junit4:junit4]    >   </lst>
[junit4:junit4]    >   <lst>
[junit4:junit4]    >     <str name="name">standardtok</str>
[junit4:junit4]    >     <str name="type">standardtok</str>
[junit4:junit4]    >     <bool name="indexed">true</bool>
[junit4:junit4]    >     <bool name="stored">true</bool>
[junit4:junit4]    >   </lst>
[junit4:junit4]    >   <lst>
[junit4:junit4]    >     <str name="name">nullfirst</str>
[junit4:junit4]    >     <str name="type">string</str>
[junit4:junit4]    >     <bool name="indexed">true</bool>
[junit4:junit4]    >     <bool name="stored">true</bool>
[junit4:junit4]    >     <bool name="sortMissingFirst">true</bool>
[junit4:junit4]    >   </lst>
[junit4:junit4]    >   <lst>
[junit4:junit4]    >     <str name="name">pointD</str>
[junit4:junit4]    >     <str name="type">xyd</str>
[junit4:junit4]    >     <bool name="indexed">true</bool>
[junit4:junit4]    >     <bool name="stored">true</bool>
[junit4:junit4]    >     <bool name="multiValued">false</bool>
[junit4:junit4]    >   </lst>
[junit4:junit4]    >   <lst>
[junit4:junit4]    >     <str name="name">HTMLstandardtok</str>
[junit4:junit4]    >     <str name="type">HTMLstandardtok</str>
[junit4:junit4]    >     <bool name="indexed">true</bool>
[junit4:junit4]    >     <bool name="stored">true</bool>
[junit4:junit4]    >   </lst>
[junit4:junit4]    >   <lst>
[junit4:junit4]    >     <str name="name">bday</str>
[junit4:junit4]    >     <str name="type">date</str>
[junit4:junit4]    >     <bool name="indexed">true</bool>
[junit4:junit4]    >     <bool name="stored">true</bool>
[junit4:junit4]    >   </lst>
[junit4:junit4]    >   <lst>
[junit4:junit4]    >     <str name="name">signatureField</str>
[junit4:junit4]    >     <str name="type">string</str>
[junit4:junit4]    >     <bool name="indexed">true</bool>
[junit4:junit4]    >     <bool name="stored">false</bool>
[junit4:junit4]    >   </lst>
[junit4:junit4]    >   <lst>
[junit4:junit4]    >     <str name="name">title_stemmed</str>
[junit4:junit4]    >     <str name="type">text</str>
[junit4:junit4]    >     <bool name="indexed">true</bool>
[junit4:junit4]    >     <bool name="stored">false</bool>
[junit4:junit4]    >   </lst>
[junit4:junit4]    >   <lst>
[junit4:junit4]    >     <str name="name">keywordtok</str>
[junit4:junit4]    >     <str name="type">keywordtok</str>
[junit4:junit4]    >     <bool name="indexed">true</bool>
[junit4:junit4]    >     <bool name="stored">true</bool>
[junit4:junit4]    >   </lst>
[junit4:junit4]    >   <lst>
[junit4:junit4]    >     <str name="name">patternreplacefilt</str>
[junit4:junit4]    >     <str name="type">patternreplacefilt</str>
[junit4:junit4]    >     <bool name="indexed">true</bool>
[junit4:junit4]    >     <bool name="stored">true</bool>
[junit4:junit4]    >   </lst>
[junit4:junit4]    >   <lst>
[junit4:junit4]    >     <str name="name">standardtokfilt</str>
[junit4:junit4]    >     <str name="type">standardtokfilt</str>
[junit4:junit4]    >     <bool name="indexed">true</bool>
[junit4:junit4]    >     <bool name="stored">true</bool>
[junit4:junit4]    >   </lst>
[junit4:junit4]    >   <lst>
[junit4:junit4]    >     <str name="name">test_notv</str>
[junit4:junit4]    >     <str name="type">text</str>
[junit4:junit4]    >     <bool name="termVectors">false</bool>
[junit4:junit4]    >   </lst>
[junit4:junit4]    >   <lst>
[junit4:junit4]    >     <str name="name">name</str>
[junit4:junit4]    >     <str name="type">nametext</str>
[junit4:junit4]    >     <bool name="indexed">true</bool>
[junit4:junit4]    >     <bool name="stored">true</bool>
[junit4:junit4]    >   </lst>
[junit4:junit4]    >   <lst>
[junit4:junit4]    >     <str name="name">sku1</str>
[junit4:junit4]    >     <str name="type">skutype1</str>
[junit4:junit4]    >     <bool name="indexed">true</bool>
[junit4:junit4]    >     <bool name="stored">true</bool>
[junit4:junit4]    >   </lst>
[junit4:junit4]    >   <lst>
[junit4:junit4]    >     <str name="name">wdf_preserve</str>
[junit4:junit4]    >     <str name="type">wdf_preserve</str>
[junit4:junit4]    >     <bool name="indexed">true</bool>
[junit4:junit4]    >     <bool name="stored">true</bool>
[junit4:junit4]    >   </lst>
[junit4:junit4]    >   <lst>
[junit4:junit4]    >     <str name="name">test_hlt</str>
[junit4:junit4]    >     <str name="type">highlittext</str>
[junit4:junit4]    >     <bool name="indexed">true</bool>
[junit4:junit4]    >     <bool name="compressed">true</bool>
[junit4:junit4]    >   </lst>
[junit4:junit4]    >   <lst>
[junit4:junit4]    >     <str name="name">text_np</str>
[junit4:junit4]    >     <str name="type">text_np</str>
[junit4:junit4]    >     <bool name="indexed">true</bool>
[junit4:junit4]    >     <bool name="stored">false</bool>
[junit4:junit4]    >   </lst>
[junit4:junit4]    >   <lst>
[junit4:junit4]    >     <str name="name">iind</str>
[junit4:junit4]    >     <str name="type">int</str>
[junit4:junit4]    >     <bool name="indexed">true</bool>
[junit4:junit4]    >     <bool name="stored">false</bool>
[junit4:junit4]    >   </lst>
[junit4:junit4]    >   <lst>
[junit4:junit4]    >     <str name="name">teststop</str>
[junit4:junit4]    >     <str name="type">teststop</str>
[junit4:junit4]    >     <bool name="indexed">true</bool>
[junit4:junit4]    >     <bool name="stored">true</bool>
[junit4:junit4]    >   </lst>
[junit4:junit4]    >   <lst>
[junit4:junit4]    >     <str name="name">test_basictv</str>
[junit4:junit4]    >     <str name="type">text</str>
[junit4:junit4]    >     <bool name="termVectors">true</bool>
[junit4:junit4]    >   </lst>
[junit4:junit4]    >   <lst>
[junit4:junit4]    >     <str name="name">title_lettertok</str>
[junit4:junit4]    >     <str name="type">lettertok</str>
[junit4:junit4]    >     <bool name="indexed">true</bool>
[junit4:junit4]    >     <bool name="stored">false</bool>
[junit4:junit4]    >   </lst>
[junit4:junit4]    >   <lst>
[junit4:junit4]    >     <str name="name">sku2</str>
[junit4:junit4]    >     <str name="type">skutype2</str>
[junit4:junit4]    >     <bool name="indexed">true</bool>
[junit4:junit4]    >     <bool name="stored">true</bool>
[junit4:junit4]    >   </lst>
[junit4:junit4]    >   <lst>
[junit4:junit4]    >     <str name="name">syn</str>
[junit4:junit4]    >     <str name="type">syn</str>
[junit4:junit4]    >     <bool name="indexed">true</bool>
[junit4:junit4]    >     <bool name="stored">true</bool>
[junit4:junit4]    >   </lst>
[junit4:junit4]    >   <lst>
[junit4:junit4]    >     <str name="name">bind</str>
[junit4:junit4]    >     <str name="type">boolean</str>
[junit4:junit4]    >     <bool name="indexed">true</bool>
[junit4:junit4]    >     <bool name="stored">false</bool>
[junit4:junit4]    >   </lst>
[junit4:junit4]    >   <lst>
[junit4:junit4]    >     <str name="name">_version_</str>
[junit4:junit4]    >     <str name="type">long</str>
[junit4:junit4]    >     <bool name="indexed">true</bool>
[junit4:junit4]    >     <bool name="stored">true</bool>
[junit4:junit4]    >   </lst>
[junit4:junit4]    >   <lst>
[junit4:junit4]    >     <str name="name">ssto</str>
[junit4:junit4]    >     <str name="type">string</str>
[junit4:junit4]    >     <bool name="indexed">false</bool>
[junit4:junit4]    >     <bool name="stored">true</bool>
[junit4:junit4]    >   </lst>
[junit4:junit4]    >   <lst>
[junit4:junit4]    >     <str name="name">id</str>
[junit4:junit4]    >     <str name="type">string</str>
[junit4:junit4]    >     <bool name="required">true</bool>
[junit4:junit4]    >     <bool name="indexed">true</bool>
[junit4:junit4]    >     <bool name="stored">true</bool>
[junit4:junit4]    >     <bool name="multiValued">false</bool>
[junit4:junit4]    >     <bool name="uniqueKey">true</bool>
[junit4:junit4]    >   </lst>
[junit4:junit4]    >   <lst>
[junit4:junit4]    >     <str name="name">engporterfilt</str>
[junit4:junit4]    >     <str name="type">engporterfilt</str>
[junit4:junit4]    >     <bool name="indexed">true</bool>
[junit4:junit4]    >     <bool name="stored">true</bool>
[junit4:junit4]    >   </lst>
[junit4:junit4]    >   <lst>
[junit4:junit4]    >     <str name="name">HTMLwhitetok</str>
[junit4:junit4]    >     <str name="type">HTMLwhitetok</str>
[junit4:junit4]    >     <bool name="indexed">true</bool>
[junit4:junit4]    >     <bool name="stored">true</bool>
[junit4:junit4]    >   </lst>
[junit4:junit4]    >   <lst>
[junit4:junit4]    >     <str name="name">lengthfilt</str>
[junit4:junit4]    >     <str name="type">lengthfilt</str>
[junit4:junit4]    >     <bool name="indexed">true</bool>
[junit4:junit4]    >     <bool name="stored">true</bool>
[junit4:junit4]    >   </lst>
[junit4:junit4]    >   <lst>
[junit4:junit4]    >     <str name="name">uuid</str>
[junit4:junit4]    >     <str name="type">uuid</str>
[junit4:junit4]    >     <bool name="stored">true</bool>
[junit4:junit4]    >   </lst>
[junit4:junit4]    >   <lst>
[junit4:junit4]    >     <str name="name">wdf_nocase</str>
[junit4:junit4]    >     <str name="type">wdf_nocase</str>
[junit4:junit4]    >     <bool name="indexed">true</bool>
[junit4:junit4]    >     <bool name="stored">true</bool>
[junit4:junit4]    >   </lst>
[junit4:junit4]    >   <lst>
[junit4:junit4]    >     <str name="name">whitetok</str>
[junit4:junit4]    >     <str name="type">whitetok</str>
[junit4:junit4]    >     <bool name="indexed">true</bool>
[junit4:junit4]    >     <bool name="stored">true</bool>
[junit4:junit4]    >   </lst>
[junit4:junit4]    >   <lst>
[junit4:junit4]    >     <str name="name">bsto</str>
[junit4:junit4]    >     <str name="type">boolean</str>
[junit4:junit4]    >     <bool name="indexed">false</bool>
[junit4:junit4]    >     <bool name="stored">true</bool>
[junit4:junit4]    >   </lst>
[junit4:junit4]    >   <lst>
[junit4:junit4]    >     <str name="name">dedup</str>
[junit4:junit4]    >     <str name="type">dedup</str>
[junit4:junit4]    >     <bool name="indexed">true</bool>
[junit4:junit4]    >     <bool name="stored">true</bool>
[junit4:junit4]    >   </lst>
[junit4:junit4]    >   <lst>
[junit4:junit4]    >     <str name="name">isto</str>
[junit4:junit4]    >     <str name="type">int</str>
[junit4:junit4]    >     <bool name="indexed">false</bool>
[junit4:junit4]    >     <bool name="stored">true</bool>
[junit4:junit4]    >   </lst>
[junit4:junit4]    >   <lst>
[junit4:junit4]    >     <str name="name">uniq2</str>
[junit4:junit4]    >     <str name="type">string</str>
[junit4:junit4]    >     <bool name="indexed">true</bool>
[junit4:junit4]    >     <bool name="stored">true</bool>
[junit4:junit4]    >     <bool name="multiValued">true</bool>
[junit4:junit4]    >   </lst>
[junit4:junit4]    >   <lst>
[junit4:junit4]    >     <str name="name">lowertok</str>
[junit4:junit4]    >     <str name="type">lowertok</str>
[junit4:junit4]    >     <bool name="indexed">true</bool>
[junit4:junit4]    >     <bool name="stored">true</bool>
[junit4:junit4]    >   </lst>
[junit4:junit4]    >   <lst>
[junit4:junit4]    >     <str name="name">lettertok</str>
[junit4:junit4]    >     <str name="type">lettertok</str>
[junit4:junit4]    >     <bool name="indexed">true</bool>
[junit4:junit4]    >     <bool name="stored">true</bool>
[junit4:junit4]    >   </lst>
[junit4:junit4]    >   <lst>
[junit4:junit4]    >     <str name="name">sind</str>
[junit4:junit4]    >     <str name="type">string</str>
[junit4:junit4]    >     <bool name="indexed">true</bool>
[junit4:junit4]    >     <bool name="stored">false</bool>
[junit4:junit4]    >   </lst>
[junit4:junit4]    >   <lst>
[junit4:junit4]    >     <str name="name">numericsubword</str>
[junit4:junit4]    >     <str name="type">numericsubword</str>
[junit4:junit4]    >     <bool name="indexed">true</bool>
[junit4:junit4]    >     <bool name="stored">true</bool>
[junit4:junit4]    >   </lst>
[junit4:junit4]    >   <lst>
[junit4:junit4]    >     <str name="name">custengporterfilt</str>
[junit4:junit4]    >     <str name="type">custengporterfilt</str>
[junit4:junit4]    >     <bool name="indexed">true</bool>
[junit4:junit4]    >     <bool name="stored">true</bool>
[junit4:junit4]    >   </lst>
[junit4:junit4]    >   <lst>
[junit4:junit4]    >     <str name="name">test_offtv</str>
[junit4:junit4]    >     <str name="type">text</str>
[junit4:junit4]    >     <bool name="termVectors">true</bool>
[junit4:junit4]    >     <bool name="termOffsets">true</bool>
[junit4:junit4]    >   </lst>
[junit4:junit4]    >   <lst>
[junit4:junit4]    >     <str name="name">copyfield_source</str>
[junit4:junit4]    >     <str name="type">string</str>
[junit4:junit4]    >     <bool name="indexed">true</bool>
[junit4:junit4]    >     <bool name="stored">true</bool>
[junit4:junit4]    >     <bool name="multiValued">true</bool>
[junit4:junit4]    >   </lst>
[junit4:junit4]    >   <lst>
[junit4:junit4]    >     <str name="name">test_postv</str>
[junit4:junit4]    >     <str name="type">text</str>
[junit4:junit4]    >     <bool name="termPositions">true</bool>
[junit4:junit4]    >     <bool name="termVectors">true</bool>
[junit4:junit4]    >   </lst>
[junit4:junit4]    >   <lst>
[junit4:junit4]    >     <str name="name">numberpartfail</str>
[junit4:junit4]    >     <str name="type">failtype1</str>
[junit4:junit4]    >     <bool name="indexed">true</bool>
[junit4:junit4]    >     <bool name="stored">true</bool>
[junit4:junit4]    >   </lst>
[junit4:junit4]    >   <lst>
[junit4:junit4]    >     <str name="name">test_hlt_off</str>
[junit4:junit4]    >     <str name="type">highlittext</str>
[junit4:junit4]    >     <bool name="indexed">true</bool>
[junit4:junit4]    >     <bool name="compressed">false</bool>
[junit4:junit4]    >   </lst>
[junit4:junit4]    >   <lst>
[junit4:junit4]    >     <str name="name">shouldbeunindexed</str>
[junit4:junit4]    >     <str name="type">unstored</str>
[junit4:junit4]    >     <bool name="indexed">false</bool>
[junit4:junit4]    >     <bool name="stored">true</bool>
[junit4:junit4]    >   </lst>
[junit4:junit4]    >   <lst>
[junit4:junit4]    >     <str name="name">standardfilt</str>
[junit4:junit4]    >     <str name="type">standardfilt</str>
[junit4:junit4]    >     <bool name="indexed">true</bool>
[junit4:junit4]    >     <bool name="stored">true</bool>
[junit4:junit4]    >   </lst>
[junit4:junit4]    >   <lst>
[junit4:junit4]    >     <str name="name">shouldbeunstored</str>
[junit4:junit4]    >     <str name="type">unstored</str>
[junit4:junit4]    >   </lst>
[junit4:junit4]    >   <lst>
[junit4:junit4]    >     <str name="name">test_posofftv</str>
[junit4:junit4]    >     <str name="type">text</str>
[junit4:junit4]    >     <bool name="termPositions">true</bool>
[junit4:junit4]    >     <bool name="termVectors">true</bool>
[junit4:junit4]    >     <bool name="termOffsets">true</bool>
[junit4:junit4]    >   </lst>
[junit4:junit4]    >   <lst>
[junit4:junit4]    >     <str name="name">uniq</str>
[junit4:junit4]    >     <str name="type">string</str>
[junit4:junit4]    >     <bool name="indexed">true</bool>
[junit4:junit4]    >     <bool name="stored">true</bool>
[junit4:junit4]    >     <bool name="multiValued">true</bool>
[junit4:junit4]    >   </lst>
[junit4:junit4]    >   <lst>
[junit4:junit4]    >     <str name="name">timestamp</str>
[junit4:junit4]    >     <str name="type">date</str>
[junit4:junit4]    >     <bool name="indexed">true</bool>
[junit4:junit4]    >     <bool name="stored">true</bool>
[junit4:junit4]    >   </lst>
[junit4:junit4]    >   <lst>
[junit4:junit4]    >     <str name="name">textgap</str>
[junit4:junit4]    >     <str name="type">textgap</str>
[junit4:junit4]    >     <bool name="indexed">true</bool>
[junit4:junit4]    >     <bool name="stored">true</bool>
[junit4:junit4]    >   </lst>
[junit4:junit4]    >   <lst>
[junit4:junit4]    >     <str name="name">porterfilt</str>
[junit4:junit4]    >     <str name="type">porterfilt</str>
[junit4:junit4]    >     <bool name="indexed">true</bool>
[junit4:junit4]    >     <bool name="stored">true</bool>
[junit4:junit4]    >   </lst>
[junit4:junit4]    >   <lst>
[junit4:junit4]    >     <str name="name">shouldbestored</str>
[junit4:junit4]    >     <str name="type">unstored</str>
[junit4:junit4]    >     <bool name="stored">true</bool>
[junit4:junit4]    >   </lst>
[junit4:junit4]    >   <lst>
[junit4:junit4]    >     <str name="name">stopfilt</str>
[junit4:junit4]    >     <str name="type">stopfilt</str>
[junit4:junit4]    >     <bool name="indexed">true</bool>
[junit4:junit4]    >     <bool name="stored">true</bool>
[junit4:junit4]    >   </lst>
[junit4:junit4]    >   <lst>
[junit4:junit4]    >     <str name="name">text</str>
[junit4:junit4]    >     <str name="type">text</str>
[junit4:junit4]    >     <bool name="indexed">true</bool>
[junit4:junit4]    >     <bool name="stored">false</bool>
[junit4:junit4]    >     <bool name="multiValued">true</bool>
[junit4:junit4]    >   </lst>
[junit4:junit4]    >   <lst>
[junit4:junit4]    >     <str name="name">point_hash</str>
[junit4:junit4]    >     <str name="type">geohash</str>
[junit4:junit4]    >     <bool name="indexed">true</bool>
[junit4:junit4]    >     <bool name="stored">true</bool>
[junit4:junit4]    >     <bool name="multiValued">false</bool>
[junit4:junit4]    >   </lst>
[junit4:junit4]    >   <lst>
[junit4:junit4]    >     <str name="name">weight</str>
[junit4:junit4]    >     <str name="type">float</str>
[junit4:junit4]    >     <bool name="indexed">true</bool>
[junit4:junit4]    >     <bool name="stored">true</bool>
[junit4:junit4]    >   </lst>
[junit4:junit4]    >   <lst>
[junit4:junit4]    >     <str name="name">point</str>
[junit4:junit4]    >     <str name="type">xy</str>
[junit4:junit4]    >     <bool name="indexed">true</bool>
[junit4:junit4]    >     <bool name="stored">true</bool>
[junit4:junit4]    >     <bool name="multiValued">false</bool>
[junit4:junit4]    >   </lst>
[junit4:junit4]    >   <lst>
[junit4:junit4]    >     <str name="name">subject</str>
[junit4:junit4]    >     <str name="type">text</str>
[junit4:junit4]    >     <bool name="indexed">true</bool>
[junit4:junit4]    >     <bool name="stored">true</bool>
[junit4:junit4]    >   </lst>
[junit4:junit4]    >   <lst>
[junit4:junit4]    >     <str name="name">subword</str>
[junit4:junit4]    >     <str name="type">subword</str>
[junit4:junit4]    >     <bool name="indexed">true</bool>
[junit4:junit4]    >     <bool name="stored">true</bool>
[junit4:junit4]    >   </lst>
[junit4:junit4]    >   <lst>
[junit4:junit4]    >     <str name="name">lowerfilt</str>
[junit4:junit4]    >     <str name="type">lowerfilt</str>
[junit4:junit4]    >     <bool name="indexed">true</bool>
[junit4:junit4]    >     <bool name="stored">true</bool>
[junit4:junit4]    >   </lst>
[junit4:junit4]    >   <lst>
[junit4:junit4]    >     <str name="name">bindsto</str>
[junit4:junit4]    >     <str name="type">boolean</str>
[junit4:junit4]    >     <bool name="indexed">true</bool>
[junit4:junit4]    >     <bool name="stored">true</bool>
[junit4:junit4]    >   </lst>
[junit4:junit4]    >   <lst>
[junit4:junit4]    >     <str name="name">uniq3</str>
[junit4:junit4]    >     <str name="type">string</str>
[junit4:junit4]    >     <bool name="indexed">true</bool>
[junit4:junit4]    >     <bool name="stored">true</bool>
[junit4:junit4]    >   </lst>
[junit4:junit4]    >   <lst>
[junit4:junit4]    >     <str name="name">store</str>
[junit4:junit4]    >     <str name="type">location</str>
[junit4:junit4]    >     <bool name="indexed">true</bool>
[junit4:junit4]    >     <bool name="stored">true</bool>
[junit4:junit4]    >   </lst>
[junit4:junit4]    > </arr>
[junit4:junit4]    > </response>
[junit4:junit4]    > 
[junit4:junit4]    > 	request was:/schema/fields?indent=on&wt=xml
[junit4:junit4]    > 	at org.apache.solr.util.RestTestBase.assertQ(RestTestBase.java:136)
[junit4:junit4]    > 	... 41 more
[junit4:junit4]   2> 4553 T10 oas.SolrTestCaseJ4.setUp ###Starting testJsonGetTwoFields
[junit4:junit4]   2> 4556 T15 C0 oasr.BaseSchemaResource.handlePostExecution [collection1] webapp=/solr path=/schema/fields params={indent=on&wt=json&fl=id,_version_} status=0 QTime=1 
[junit4:junit4]   2> 4557 T15 C0 orel.LogFilter.afterHandle 2013-03-06	13:16:48	127.0.0.1	-	127.0.0.1	46406	GET	/solr/schema/fields	indent=on&fl=id,_version_&wt=json	200	-	0	2	http://127.0.0.1:46406	Java/1.8.0-ea	-
[junit4:junit4]   2> 4567 T10 oas.SolrTestCaseJ4.tearDown ###Ending testJsonGetTwoFields
[junit4:junit4]   2> 4575 T10 oas.SolrTestCaseJ4.setUp ###Starting testJsonGetAllFields
[junit4:junit4]   2> 4577 T20 C0 oasr.BaseSchemaResource.handlePostExecution [collection1] webapp=/solr path=/schema/fields params={indent=on&wt=json} status=0 QTime=1 
[junit4:junit4]   2> 4578 T20 C0 orel.LogFilter.afterHandle 2013-03-06	13:16:48	127.0.0.1	-	127.0.0.1	46406	GET	/solr/schema/fields	indent=on&wt=json	200	-	0	2	http://127.0.0.1:46406	Java/1.8.0-ea	-
[junit4:junit4]   2> 4582 T10 oasu.RestTestBase.assertJQ SEVERE query failed JSON validation. error=mismatch: 'custstopfilt'!='sindsto' @ fields/[0]/name
[junit4:junit4]   2> 	 expected =/fields/[0]/name=="custstopfilt"
[junit4:junit4]   2> 	 response = {
[junit4:junit4]   2> 	  "responseHeader":{
[junit4:junit4]   2> 	    "status":0,
[junit4:junit4]   2> 	    "QTime":1},
[junit4:junit4]   2> 	  "fields":[{
[junit4:junit4]   2> 	      "name":"sindsto",
[junit4:junit4]   2> 	      "type":"string",
[junit4:junit4]   2> 	      "indexed":true,
[junit4:junit4]   2> 	      "stored":true},
[junit4:junit4]   2> 	    {
[junit4:junit4]   2> 	      "name":"protectedsubword",
[junit4:junit4]   2> 	      "type":"protectedsubword",
[junit4:junit4]   2> 	      "indexed":true,
[junit4:junit4]   2> 	      "stored":true},
[junit4:junit4]   2> 	    {
[junit4:junit4]   2> 	      "name":"custstopfilt",
[junit4:junit4]   2> 	      "type":"custstopfilt",
[junit4:junit4]   2> 	      "indexed":true,
[junit4:junit4]   2> 	      "stored":true},
[junit4:junit4]   2> 	    {
[junit4:junit4]   2> 	      "name":"title",
[junit4:junit4]   2> 	      "type":"nametext",
[junit4:junit4]   2> 	      "indexed":true,
[junit4:junit4]   2> 	      "stored":true},
[junit4:junit4]   2> 	    {
[junit4:junit4]   2> 	      "name":"nouniq",
[junit4:junit4]   2> 	      "type":"string",
[junit4:junit4]   2> 	      "indexed":true,
[junit4:junit4]   2> 	      "stored":true,
[junit4:junit4]   2> 	      "multiValued":true},
[junit4:junit4]   2> 	    {
[junit4:junit4]   2> 	      "name":"standardtok",
[junit4:junit4]   2> 	      "type":"standardtok",
[junit4:junit4]   2> 	      "indexed":true,
[junit4:junit4]   2> 	      "stored":true},
[junit4:junit4]   2> 	    {
[junit4:junit4]   2> 	      "name":"nullfirst",
[junit4:junit4]   2> 	      "type":"string",
[junit4:junit4]   2> 	      "indexed":true,
[junit4:junit4]   2> 	      "stored":true,
[junit4:junit4]   2> 	      "sortMissingFirst":true},
[junit4:junit4]   2> 	    {
[junit4:junit4]   2> 	      "name":"pointD",
[junit4:junit4]   2> 	      "type":"xyd",
[junit4:junit4]   2> 	      "indexed":true,
[junit4:junit4]   2> 	      "stored":true,
[junit4:junit4]   2> 	      "multiValued":false},
[junit4:junit4]   2> 	    {
[junit4:junit4]   2> 	      "name":"HTMLstandardtok",
[junit4:junit4]   2> 	      "type":"HTMLstandardtok",
[junit4:junit4]   2> 	      "indexed":true,
[junit4:junit4]   2> 	      "stored":true},
[junit4:junit4]   2> 	    {
[junit4:junit4]   2> 	      "name":"bday",
[junit4:junit4]   2> 	      "type":"date",
[junit4:junit4]   2> 	      "indexed":true,
[junit4:junit4]   2> 	      "stored":true},
[junit4:junit4]   2> 	    {
[junit4:junit4]   2> 	      "name":"signatureField",
[junit4:junit4]   2> 	      "type":"string",
[junit4:junit4]   2> 	      "indexed":true,
[junit4:junit4]   2> 	      "stored":false},
[junit4:junit4]   2> 	    {
[junit4:junit4]   2> 	      "name":"title_stemmed",
[junit4:junit4]   2> 	      "type":"text",
[junit4:junit4]   2> 	      "indexed":true,
[junit4:junit4]   2> 	      "stored":false},
[junit4:junit4]   2> 	    {
[junit4:junit4]   2> 	      "name":"keywordtok",
[junit4:junit4]   2> 	      "type":"keywordtok",
[junit4:junit4]   2> 	      "indexed":true,
[junit4:junit4]   2> 	      "stored":true},
[junit4:junit4]   2> 	    {
[junit4:junit4]   2> 	      "name":"patternreplacefilt",
[junit4:junit4]   2> 	      "type":"patternreplacefilt",
[junit4:junit4]   2> 	      "indexed":true,
[junit4:junit4]   2> 	      "stored":true},
[junit4:junit4]   2> 	    {
[junit4:junit4]   2> 	      "name":"standardtokfilt",
[junit4:junit4]   2> 	      "type":"standardtokfilt",
[junit4:junit4]   2> 	      "indexed":true,
[junit4:junit4]   2> 	      "stored":true},
[junit4:junit4]   2> 	    {
[junit4:junit4]   2> 	      "name":"test_notv",
[junit4:junit4]   2> 	      "type":"text",
[junit4:junit4]   2> 	      "termVectors":false},
[junit4:junit4]   2> 	    {
[junit4:junit4]   2> 	      "name":"name",
[junit4:junit4]   2> 	      "type":"nametext",
[junit4:junit4]   2> 	      "indexed":true,
[junit4:junit4]   2> 	      "stored":true},
[junit4:junit4]   2> 	    {
[junit4:junit4]   2> 	      "name":"sku1",
[junit4:junit4]   2> 	      "type":"skutype1",
[junit4:junit4]   2> 	      "indexed":true,
[junit4:junit4]   2> 	      "stored":true},
[junit4:junit4]   2> 	    {
[junit4:junit4]   2> 	      "name":"wdf_preserve",
[junit4:junit4]   2> 	      "type":"wdf_preserve",
[junit4:junit4]   2> 	      "indexed":true,
[junit4:junit4]   2> 	      "stored":true},
[junit4:junit4]   2> 	    {
[junit4:junit4]   2> 	      "name":"test_hlt",
[junit4:junit4]   2> 	      "type":"highlittext",
[junit4:junit4]   2> 	      "indexed":true,
[junit4:junit4]   2> 	      "compressed":true},
[junit4:junit4]   2> 	    {
[junit4:junit4]   2> 	      "name":"text_np",
[junit4:junit4]   2> 	      "type":"text_np",
[junit4:junit4]   2> 	      "indexed":true,
[junit4:junit4]   2> 	      "stored":false},
[junit4:junit4]   2> 	    {
[junit4:junit4]   2> 	      "name":"iind",
[junit4:junit4]   2> 	      "type":"int",
[junit4:junit4]   2> 	      "indexed":true,
[junit4:junit4]   2> 	      "stored":false},
[junit4:junit4]   2> 	    {
[junit4:junit4]   2> 	      "name":"teststop",
[junit4:junit4]   2> 	      "type":"teststop",
[junit4:junit4]   2> 	      "indexed":true,
[junit4:junit4]   2> 	      "stored":true},
[junit4:junit4]   2> 	    {
[junit4:junit4]   2> 	      "name":"test_basictv",
[junit4:junit4]   2> 	      "type":"text",
[junit4:junit4]   2> 	      "termVectors":true},
[junit4:junit4]   2> 	    {
[junit4:junit4]   2> 	      "name":"title_lettertok",
[junit4:junit4]   2> 	      "type":"lettertok",
[junit4:junit4]   2> 	      "indexed":true,
[junit4:junit4]   2> 	      "stored":false},
[junit4:junit4]   2> 	    {
[junit4:junit4]   2> 	      "name":"sku2",
[junit4:junit4]   2> 	      "type":"skutype2",
[junit4:junit4]   2> 	      "indexed":true,
[junit4:junit4]   2> 	      "stored":true},
[junit4:junit4]   2> 	    {
[junit4:junit4]   2> 	      "name":"syn",
[junit4:junit4]   2> 	      "type":"syn",
[junit4:junit4]   2> 	      "indexed":true,
[junit4:junit4]   2> 	      "stored":true},
[junit4:junit4]   2> 	    {
[junit4:junit4]   2> 	      "name":"bind",
[junit4:junit4]   2> 	      "type":"boolean",
[junit4:junit4]   2> 	      "indexed":true,
[junit4:junit4]   2> 	      "stored":false},
[junit4:junit4]   2> 	    {
[junit4:junit4]   2> 	      "name":"_version_",
[junit4:junit4]   2> 	      "type":"long",
[junit4:junit4]   2> 	      "indexed":true,
[junit4:junit4]   2> 	      "stored":true},
[junit4:junit4]   2> 	    {
[junit4:junit4]   2> 	      "name":"ssto",
[junit4:junit4]   2> 	      "type":"string",
[junit4:junit4]   2> 	      "indexed":false,
[junit4:junit4]   2> 	      "stored":true},
[junit4:junit4]   2> 	    {
[junit4:junit4]   2> 	      "name":"id",
[junit4:junit4]   2> 	      "type":"string",
[junit4:junit4]   2> 	      "required":true,
[junit4:junit4]   2> 	      "indexed":true,
[junit4:junit4]   2> 	      "stored":true,
[junit4:junit4]   2> 	      "multiValued":false,
[junit4:junit4]   2> 	      "uniqueKey":true},
[junit4:junit4]   2> 	    {
[junit4:junit4]   2> 	      "name":"engporterfilt",
[junit4:junit4]   2> 	      "type":"engporterfilt",
[junit4:junit4]   2> 	      "indexed":true,
[junit4:junit4]   2> 	      "stored":true},
[junit4:junit4]   2> 	    {
[junit4:junit4]   2> 	      "name":"HTMLwhitetok",
[junit4:junit4]   2> 	      "type":"HTMLwhitetok",
[junit4:junit4]   2> 	      "indexed":true,
[junit4:junit4]   2> 	      "stored":true},
[junit4:junit4]   2> 	    {
[junit4:junit4]   2> 	      "name":"lengthfilt",
[junit4:junit4]   2> 	      "type":"lengthfilt",
[junit4:junit4]   2> 	      "indexed":true,
[junit4:junit4]   2> 	      "stored":true},
[junit4:junit4]   2> 	    {
[junit4:junit4]   2> 	      "name":"uuid",
[junit4:junit4]   2> 	      "type":"uuid",
[junit4:junit4]   2> 	      "stored":true},
[junit4:junit4]   2> 	    {
[junit4:junit4]   2> 	      "name":"wdf_nocase",
[junit4:junit4]   2> 	      "type":"wdf_nocase",
[junit4:junit4]   2> 	      "indexed":true,
[junit4:junit4]   2> 	      "stored":true},
[junit4:junit4]   2> 	    {
[junit4:junit4]   2> 	      "name":"whitetok",
[junit4:junit4]   2> 	      "type":"whitetok",
[junit4:junit4]   2> 	      "indexed":true,
[junit4:junit4]   2> 	      "stored":true},
[junit4:junit4]   2> 	    {
[junit4:junit4]   2> 	      "name":"bsto",
[junit4:junit4]   2> 	      "type":"boolean",
[junit4:junit4]   2> 	      "indexed":false,
[junit4:junit4]   2> 	      "stored":true},
[junit4:junit4]   2> 	    {
[junit4:junit4]   2> 	      "name":"dedup",
[junit4:junit4]   2> 	      "type":"dedup",
[junit4:junit4]   2> 	      "indexed":true,
[junit4:junit4]   2> 	      "stored":true},
[junit4:junit4]   2> 	    {
[junit4:junit4]   2> 	      "name":"isto",
[junit4:junit4]   2> 	      "type":"int",
[junit4:junit4]   2> 	      "indexed":false,
[junit4:junit4]   2> 	      "stored":true},
[junit4:junit4]   2> 	    {
[junit4:junit4]   2> 	      "name":"uniq2",
[junit4:junit4]   2> 	      "type":"string",
[junit4:junit4]   2> 	      "indexed":true,
[junit4:junit4]   2> 	      "stored":true,
[junit4:junit4]   2> 	      "multiValued":true},
[junit4:junit4]   2> 	    {
[junit4:junit4]   2> 	      "name":"lowertok",
[junit4:junit4]   2> 	      "type":"lowertok",
[junit4:junit4]   2> 	      "indexed":true,
[junit4:junit4]   2> 	      "stored":true},
[junit4:junit4]   2> 	    {
[junit4:junit4]   2> 	      "name":"lettertok",
[junit4:junit4]   2> 	      "type":"lettertok",
[junit4:junit4]   2> 	      "indexed":true,
[junit4:junit4]   2> 	      "stored":true},
[junit4:junit4]   2> 	    {
[junit4:junit4]   2> 	      "name":"sind",
[junit4:junit4]   2> 	      "type":"string",
[junit4:junit4]   2> 	      "indexed":true,
[junit4:junit4]   2> 	      "stored":false},
[junit4:junit4]   2> 	    {
[junit4:junit4]   2> 	      "name":"numericsubword",
[junit4:junit4]   2> 	      "type":"numericsubword",
[junit4:junit4]   2> 	      "indexed":true,
[junit4:junit4]   2> 	      "stored":true},
[junit4:junit4]   2> 	    {
[junit4:junit4]   2> 	      "name":"custengporterfilt",
[junit4:junit4]   2> 	      "type":"custengporterfilt",
[junit4:junit4]   2> 	      "indexed":true,
[junit4:junit4]   2> 	      "stored":true},
[junit4:junit4]   2> 	    {
[junit4:junit4]   2> 	      "name":"test_offtv",
[junit4:junit4]   2> 	      "type":"text",
[junit4:junit4]   2> 	      "termVectors":true,
[junit4:junit4]   2> 	      "termOffsets":true},
[junit4:junit4]   2> 	    {
[junit4:junit4]   2> 	      "name":"copyfield_source",
[junit4:junit4]   2> 	      "type":"string",
[junit4:junit4]   2> 	      "indexed":true,
[junit4:junit4]   2> 	      "stored":true,
[junit4:junit4]   2> 	      "multiValued":true},
[junit4:junit4]   2> 	    {
[junit4:junit4]   2> 	      "name":"test_postv",
[junit4:junit4]   2> 	      "type":"text",
[junit4:junit4]   2> 	      "termPositions":true,
[junit4:junit4]   2> 	      "termVectors":true},
[junit4:junit4]   2> 	    {
[junit4:junit4]   2> 	      "name":"numberpartfail",
[junit4:junit4]   2> 	      "type":"failtype1",
[junit4:junit4]   2> 	      "indexed":true,
[junit4:junit4]   2> 	      "stored":true},
[junit4:junit4]   2> 	    {
[junit4:junit4]   2> 	      "name":"test_hlt_off",
[junit4:junit4]   2> 	      "type":"highlittext",
[junit4:junit4]   2> 	      "indexed":true,
[junit4:junit4]   2> 	      "compressed":false},
[junit4:junit4]   2> 	    {
[junit4:junit4]   2> 	      "name":"shouldbeunindexed",
[junit4:junit4]   2> 	      "type":"unstored",
[junit4:junit4]   2> 	      "indexed":false,
[junit4:junit4]   2> 	      "stored":true},
[junit4:junit4]   2> 	    {
[junit4:junit4]   2> 	      "name":"standardfilt",
[junit4:junit4]   2> 	      "type":"standardfilt",
[junit4:junit4]   2> 	      "indexed":true,
[junit4:junit4]   2> 	      "stored":true},
[junit4:junit4]   2> 	    {
[junit4:junit4]   2> 	      "name":"shouldbeunstored",
[junit4:junit4]   2> 	      "type":"unstored"},
[junit4:junit4]   2> 	    {
[junit4:junit4]   2> 	      "name":"test_posofftv",
[junit4:junit4]   2> 	      "type":"text",
[junit4:junit4]   2> 	      "termPositions":true,
[junit4:junit4]   2> 	      "termVectors":true,
[junit4:junit4]   2> 	      "termOffsets":true},
[junit4:junit4]   2> 	    {
[junit4:junit4]   2> 	      "name":"uniq",
[junit4:junit4]   2> 	      "type":"string",
[junit4:junit4]   2> 	      "indexed":true,
[junit4:junit4]   2> 	      "stored":true,
[junit4:junit4]   2> 	      "multiValued":true},
[junit4:junit4]   2> 	    {
[junit4:junit4]   2> 	      "name":"timestamp",
[junit4:junit4]   2> 	      "type":"date",
[junit4:junit4]   2> 	      "indexed":true,
[junit4:junit4]   2> 	      "stored":true},
[junit4:junit4]   2> 	    {
[junit4:junit4]   2> 	      "name":"textgap",
[junit4:junit4]   2> 	      "type":"textgap",
[junit4:junit4]   2> 	      "indexed":true,
[junit4:junit4]   2> 	      "stored":true},
[junit4:junit4]   2> 	    {
[junit4:junit4]   2> 	      "name":"porterfilt",
[junit4:junit4]   2> 	      "type":"porterfilt",
[junit4:junit4]   2> 	      "indexed":true,
[junit4:junit4]   2> 	      "stored":true},
[junit4:junit4]   2> 	    {
[junit4:junit4]   2> 	      "name":"shouldbestored",
[junit4:junit4]   2> 	      "type":"unstored",
[junit4:junit4]   2> 	      "stored":true},
[junit4:junit4]   2> 	    {
[junit4:junit4]   2> 	      "name":"stopfilt",
[junit4:junit4]   2> 	      "type":"stopfilt",
[junit4:junit4]   2> 	      "indexed":true,
[junit4:junit4]   2> 	      "stored":true},
[junit4:junit4]   2> 	    {
[junit4:junit4]   2> 	      "name":"text",
[junit4:junit4]   2> 	      "type":"text",
[junit4:junit4]   2> 	      "indexed":true,
[junit4:junit4]   2> 	      "stored":false,
[junit4:junit4]   2> 	      "multiValued":true},
[junit4:junit4]   2> 	    {
[junit4:junit4]   2> 	      "name":"point_hash",
[junit4:junit4]   2> 	      "type":"geohash",
[junit4:junit4]   2> 	      "indexed":true,
[junit4:junit4]   2> 	      "stored":true,
[junit4:junit4]   2> 	      "multiValued":false},
[junit4:junit4]   2> 	    {
[junit4:junit4]   2> 	      "name":"weight",
[junit4:junit4]   2> 	      "type":"float",
[junit4:junit4]   2> 	      "indexed":true,
[junit4:junit4]   2> 	      "stored":true},
[junit4:junit4]   2> 	    {
[junit4:junit4]   2> 	      "name":"point",
[junit4:junit4]   2> 	      "type":"xy",
[junit4:junit4]   2> 	      "indexed":true,
[junit4:junit4]   2> 	      "stored":true,
[junit4:junit4]   2> 	      "multiValued":false},
[junit4:junit4]   2> 	    {
[junit4:junit4]   2> 	      "name":"subject",
[junit4:junit4]   2> 	      "type":"text",
[junit4:junit4]   2> 	      "indexed":true,
[junit4:junit4]   2> 	      "stored":true},
[junit4:junit4]   2> 	    {
[junit4:junit4]   2> 	      "name":"subword",
[junit4:junit4]   2> 	      "type":"subword",
[junit4:junit4]   2> 	      "indexed":true,
[junit4:junit4]   2> 	      "stored":true},
[junit4:junit4]   2> 	    {
[junit4:junit4]   2> 	      "name":"lowerfilt",
[junit4:junit4]   2> 	      "type":"lowerfilt",
[junit4:junit4]   2> 	      "indexed":true,
[junit4:junit4]   2> 	      "stored":true},
[junit4:junit4]   2> 	    {
[junit4:junit4]   2> 	      "name":"bindsto",
[junit4:junit4]   2> 	      "type":"boolean",
[junit4:junit4]   2> 	      "indexed":true,
[junit4:junit4]   2> 	      "stored":true},
[junit4:junit4]   2> 	    {
[junit4:junit4]   2> 	      "name":"uniq3",
[junit4:junit4]   2> 	      "type":"string",
[junit4:junit4]   2> 	      "indexed":true,
[junit4:junit4]   2> 	      "stored":true},
[junit4:junit4]   2> 	    {
[junit4:junit4]   2> 	      "name":"store",
[junit4:junit4]   2> 	      "type":"location",
[junit4:junit4]   2> 	      "indexed":true,
[junit4:junit4]   2> 	      "stored":true}]}
[junit4:junit4]   2> 	
[junit4:junit4]   2> 	 request = /schema/fields?indent=on&wt=json
[junit4:junit4]   2> 	
[junit4:junit4]   2> 4586 T10 oas.SolrTestCaseJ4.tearDown ###Ending testJsonGetAllFields
[junit4:junit4]   2> NOTE: reproduce with: ant test  -Dtestcase=TestFieldCollectionResource -Dtests.method=testJsonGetAllFields -Dtests.seed=6E9A2F599977315B -Dtests.multiplier=3 -Dtests.slow=true -Dtests.locale=vi_VN -Dtests.timezone=Europe/Vatican -Dtests.file.encoding=UTF-8
[junit4:junit4] ERROR   0.02s J0 | TestFieldCollectionResource.testJsonGetAllFields <<<
[junit4:junit4]    > Throwable #1: java.lang.RuntimeException: mismatch: 'custstopfilt'!='sindsto' @ fields/[0]/name
[junit4:junit4]    > 	at __randomizedtesting.SeedInfo.seed([6E9A2F599977315B:E79A5DD539C47D7D]:0)
[junit4:junit4]    > 	at org.apache.solr.util.RestTestBase.assertJQ(RestTestBase.java:242)
[junit4:junit4]    > 	at org.apache.solr.util.RestTestBase.assertJQ(RestTestBase.java:186)
[junit4:junit4]    > 	at org.apache.solr.rest.TestFieldCollectionResource.testJsonGetAllFields(TestFieldCollectionResource.java:50)
[junit4:junit4]    > 	at sun.reflect.NativeMethodAccessorImpl.invoke0(Native Method)
[junit4:junit4]    > 	at sun.reflect.NativeMethodAccessorImpl.invoke(NativeMethodAccessorImpl.java:57)
[junit4:junit4]    > 	at sun.reflect.DelegatingMethodAccessorImpl.invoke(DelegatingMethodAccessorImpl.java:43)
[junit4:junit4]    > 	at java.lang.reflect.Method.invoke(Method.java:487)
[junit4:junit4]    > 	at com.carrotsearch.randomizedtesting.RandomizedRunner.invoke(RandomizedRunner.java:1559)
[junit4:junit4]    > 	at com.carrotsearch.randomizedtesting.RandomizedRunner.access$600(RandomizedRunner.java:79)
[junit4:junit4]    > 	at com.carrotsearch.randomizedtesting.RandomizedRunner$6.evaluate(RandomizedRunner.java:737)
[junit4:junit4]    > 	at com.carrotsearch.randomizedtesting.RandomizedRunner$7.evaluate(RandomizedRunner.java:773)
[junit4:junit4]    > 	at com.carrotsearch.randomizedtesting.RandomizedRunner$8.evaluate(RandomizedRunner.java:787)
[junit4:junit4]    > 	at com.carrotsearch.randomizedtesting.rules.SystemPropertiesRestoreRule$1.evaluate(SystemPropertiesRestoreRule.java:53)
[junit4:junit4]    > 	at org.apache.lucene.util.TestRuleSetupTeardownChained$1.evaluate(TestRuleSetupTeardownChained.java:50)
[junit4:junit4]    > 	at org.apache.lucene.util.TestRuleFieldCacheSanity$1.evaluate(TestRuleFieldCacheSanity.java:51)
[junit4:junit4]    > 	at org.apache.lucene.util.AbstractBeforeAfterRule$1.evaluate(AbstractBeforeAfterRule.java:46)
[junit4:junit4]    > 	at com.carrotsearch.randomizedtesting.rules.SystemPropertiesInvariantRule$1.evaluate(SystemPropertiesInvariantRule.java:55)
[junit4:junit4]    > 	at org.apache.lucene.util.TestRuleThreadAndTestName$1.evaluate(TestRuleThreadAndTestName.java:49)
[junit4:junit4]    > 	at org.apache.lucene.util.TestRuleIgnoreAfterMaxFailures$1.evaluate(TestRuleIgnoreAfterMaxFailures.java:70)
[junit4:junit4]    > 	at org.apache.lucene.util.TestRuleMarkFailure$1.evaluate(TestRuleMarkFailure.java:48)
[junit4:junit4]    > 	at com.carrotsearch.randomizedtesting.rules.StatementAdapter.evaluate(StatementAdapter.java:36)
[junit4:junit4]    > 	at com.carrotsearch.randomizedtesting.ThreadLeakControl$StatementRunner.run(ThreadLeakControl.java:358)
[junit4:junit4]    > 	at com.carrotsearch.randomizedtesting.ThreadLeakControl.forkTimeoutingTask(ThreadLeakControl.java:782)
[junit4:junit4]    > 	at com.carrotsearch.randomizedtesting.ThreadLeakControl$3.evaluate(ThreadLeakControl.java:442)
[junit4:junit4]    > 	at com.carrotsearch.randomizedtesting.RandomizedRunner.runSingleTest(RandomizedRunner.java:746)
[junit4:junit4]    > 	at com.carrotsearch.randomizedtesting.RandomizedRunner$3.evaluate(RandomizedRunner.java:648)
[junit4:junit4]    > 	at com.carrotsearch.randomizedtesting.RandomizedRunner$4.evaluate(RandomizedRunner.java:682)
[junit4:junit4]    > 	at com.carrotsearch.randomizedtesting.RandomizedRunner$5.evaluate(RandomizedRunner.java:693)
[junit4:junit4]    > 	at com.carrotsearch.randomizedtesting.rules.StatementAdapter.evaluate(StatementAdapter.java:36)
[junit4:junit4]    > 	at com.carrotsearch.randomizedtesting.rules.SystemPropertiesRestoreRule$1.evaluate(SystemPropertiesRestoreRule.java:53)
[junit4:junit4]    > 	at org.apache.lucene.util.AbstractBeforeAfterRule$1.evaluate(AbstractBeforeAfterRule.java:46)
[junit4:junit4]    > 	at org.apache.lucene.util.TestRuleStoreClassName$1.evaluate(TestRuleStoreClassName.java:42)
[junit4:junit4]    > 	at com.carrotsearch.randomizedtesting.rules.SystemPropertiesInvariantRule$1.evaluate(SystemPropertiesInvariantRule.java:55)
[junit4:junit4]    > 	at com.carrotsearch.randomizedtesting.rules.NoShadowingOrOverridesOnMethodsRule$1.evaluate(NoShadowingOrOverridesOnMethodsRule.java:39)
[junit4:junit4]    > 	at com.carrotsearch.randomizedtesting.rules.NoShadowingOrOverridesOnMethodsRule$1.evaluate(NoShadowingOrOverridesOnMethodsRule.java:39)
[junit4:junit4]    > 	at com.carrotsearch.randomizedtesting.rules.StatementAdapter.evaluate(StatementAdapter.java:36)
[junit4:junit4]    > 	at org.apache.lucene.util.TestRuleAssertionsRequired$1.evaluate(TestRuleAssertionsRequired.java:43)
[junit4:junit4]    > 	at org.apache.lucene.util.TestRuleMarkFailure$1.evaluate(TestRuleMarkFailure.java:48)
[junit4:junit4]    > 	at org.apache.lucene.util.TestRuleIgnoreAfterMaxFailures$1.evaluate(TestRuleIgnoreAfterMaxFailures.java:70)
[junit4:junit4]    > 	at org.apache.lucene.util.TestRuleIgnoreTestSuites$1.evaluate(TestRuleIgnoreTestSuites.java:55)
[junit4:junit4]    > 	at com.carrotsearch.randomizedtesting.rules.StatementAdapter.evaluate(StatementAdapter.java:36)
[junit4:junit4]    > 	at com.carrotsearch.randomizedtesting.ThreadLeakControl$StatementRunner.run(ThreadLeakControl.java:358)
[junit4:junit4]    > 	at java.lang.Thread.run(Thread.java:722)
[junit4:junit4]   2> 4613 T10 oasc.CoreContainer.shutdown Shutting down CoreContainer instance=26058681
[junit4:junit4]   2> 4622 T10 oasc.SolrCore.close [collection1]  CLOSING SolrCore org.apache.solr.core.SolrCore@100e354
[junit4:junit4]   2> 4644 T10 oasu.DirectUpdateHandler2.close closing DirectUpdateHandler2{commits=0,autocommits=0,soft autocommits=0,optimizes=0,rollbacks=0,expungeDeletes=0,docsPending=0,adds=0,deletesById=0,deletesByQuery=0,errors=0,cumulative_adds=0,cumulative_deletesById=0,cumulative_deletesByQuery=0,cumulative_errors=0}
[junit4:junit4]   2> 4645 T10 oasu.SolrCoreState.decrefSolrCoreState Closing SolrCoreState
[junit4:junit4]   2> 4645 T10 oasu.DefaultSolrCoreState.closeIndexWriter SolrCoreState ref count has reached 0 - closing IndexWriter
[junit4:junit4]   2> 4646 T10 oasu.DefaultSolrCoreState.closeIndexWriter closing IndexWriter with IndexWriterCloser
[junit4:junit4]   2> 4647 T10 oasc.SolrCore.closeSearcher [collection1] Closing main searcher on request.
[junit4:junit4]   2> 4648 T10 oasc.CachingDirectoryFactory.close Releasing directory:/mnt/ssd/jenkins/workspace/Lucene-Solr-trunk-Linux/solr/build/solr-core/test/J0/solrtest-TestFieldCollectionResource-1362572203721/index
[junit4:junit4]   2> 4648 T10 oasc.CachingDirectoryFactory.close Closing directory when closing factory:/mnt/ssd/jenkins/workspace/Lucene-Solr-trunk-Linux/solr/build/solr-core/test/J0/solrtest-TestFieldCollectionResource-1362572203721/index
[junit4:junit4]   2> 4649 T10 oasc.CachingDirectoryFactory.closeDirectory Closing directory:/mnt/ssd/jenkins/workspace/Lucene-Solr-trunk-Linux/solr/build/solr-core/test/J0/solrtest-TestFieldCollectionResource-1362572203721/index
[junit4:junit4]   2> 4649 T10 oasc.CachingDirectoryFactory.close Closing directory when closing factory:/mnt/ssd/jenkins/workspace/Lucene-Solr-trunk-Linux/solr/build/solr-core/test/J0/solrtest-TestFieldCollectionResource-1362572203721
[junit4:junit4]   2> 4650 T10 oasc.CachingDirectoryFactory.closeDirectory Closing directory:/mnt/ssd/jenkins/workspace/Lucene-Solr-trunk-Linux/solr/build/solr-core/test/J0/solrtest-TestFieldCollectionResource-1362572203721
[junit4:junit4]   2> 4651 T10 oejsh.ContextHandler.doStop stopped o.e.j.s.ServletContextHandler{/solr,null}
[junit4:junit4]   2> 4704 T10 oas.SolrTestCaseJ4.deleteCore ###deleteCore
[junit4:junit4]   2> NOTE: test params are: codec=Lucene42: {}, docValues:{}, sim=RandomSimilarityProvider(queryNorm=false,coord=crazy): {}, locale=vi_VN, timezone=Europe/Vatican
[junit4:junit4]   2> NOTE: Linux 3.2.0-38-generic i386/Oracle Corporation 1.8.0-ea (32-bit)/cpus=8,threads=1,free=8092488,total=25305088
[junit4:junit4]   2> NOTE: All tests run in this JVM: [TestFieldCollectionResource]
[junit4:junit4] Completed on J0 in 5.23s, 5 tests, 2 errors <<< FAILURES!

[...truncated 361 lines...]
[junit4:junit4] Suite: org.apache.solr.cloud.BasicDistributedZk2Test
[junit4:junit4]   2> 0 T2003 oas.BaseDistributedSearchTestCase.initHostContext Setting hostContext system property: /_fus/v
[junit4:junit4]   2> 3 T2003 oas.SolrTestCaseJ4.setUp ###Starting testDistribSearch
[junit4:junit4]   2> Creating dataDir: /mnt/ssd/jenkins/workspace/Lucene-Solr-trunk-Linux/solr/build/solr-core/test/J1/./solrtest-BasicDistributedZk2Test-1362572766444
[junit4:junit4]   2> 4 T2003 oasc.ZkTestServer.run STARTING ZK TEST SERVER
[junit4:junit4]   2> 4 T2004 oasc.ZkTestServer$ZKServerMain.runFromConfig Starting server
[junit4:junit4]   2> 5 T2004 oazs.ZooKeeperServer.setTickTime tickTime set to 1000
[junit4:junit4]   2> 5 T2004 oazs.ZooKeeperServer.setMinSessionTimeout minSessionTimeout set to -1
[junit4:junit4]   2> 5 T2004 oazs.ZooKeeperServer.setMaxSessionTimeout maxSessionTimeout set to -1
[junit4:junit4]   2> 6 T2004 oazs.NIOServerCnxnFactory.configure binding to port 0.0.0.0/0.0.0.0:0
[junit4:junit4]   2> 6 T2004 oazsp.FileTxnSnapLog.save Snapshotting: 0x0 to /mnt/ssd/jenkins/workspace/Lucene-Solr-trunk-Linux/solr/build/solr-core/test/J1/./org.apache.solr.cloud.BasicDistributedZk2Test-1362572766444/zookeeper/server1/data/version-2/snapshot.0
[junit4:junit4]   2> 104 T2003 oasc.ZkTestServer.run start zk server on port:59150
[junit4:junit4]   2> 105 T2003 oaz.ZooKeeper.<init> Initiating client connection, connectString=127.0.0.1:59150 sessionTimeout=10000 watcher=org.apache.solr.common.cloud.ConnectionManager@190f838
[junit4:junit4]   2> 106 T2003 oascc.ConnectionManager.waitForConnected Waiting for client to connect to ZooKeeper
[junit4:junit4]   2> 106 T2009 oaz.ClientCnxn$SendThread.logStartConnect Opening socket connection to server localhost.localdomain/127.0.0.1:59150. Will not attempt to authenticate using SASL (access denied ("javax.security.auth.AuthPermission" "getLoginConfiguration"))
[junit4:junit4]   2> 107 T2009 oaz.ClientCnxn$SendThread.primeConnection Socket connection established to localhost.localdomain/127.0.0.1:59150, initiating session
[junit4:junit4]   2> 107 T2005 oazs.NIOServerCnxnFactory.run Accepted socket connection from /127.0.0.1:40913
[junit4:junit4]   2> 107 T2005 oazs.ZooKeeperServer.processConnectRequest Client attempting to establish new session at /127.0.0.1:40913
[junit4:junit4]   2> 107 T2007 oazsp.FileTxnLog.append Creating new log file: log.1
[junit4:junit4]   2> 185 T2007 oazs.ZooKeeperServer.finishSessionInit Established session 0x13d3faa6cef0000 with negotiated timeout 10000 for client /127.0.0.1:40913
[junit4:junit4]   2> 185 T2009 oaz.ClientCnxn$SendThread.onConnected Session establishment complete on server localhost.localdomain/127.0.0.1:59150, sessionid = 0x13d3faa6cef0000, negotiated timeout = 10000
[junit4:junit4]   2> 186 T2010 oascc.ConnectionManager.process Watcher org.apache.solr.common.cloud.ConnectionManager@190f838 name:ZooKeeperConnection Watcher:127.0.0.1:59150 got event WatchedEvent state:SyncConnected type:None path:null path:null type:None
[junit4:junit4]   2> 186 T2003 oascc.ConnectionManager.waitForConnected Client is connected to ZooKeeper
[junit4:junit4]   2> 186 T2003 oascc.SolrZkClient.makePath makePath: /solr
[junit4:junit4]   2> 189 T2008 oazs.PrepRequestProcessor.pRequest2Txn Processed session termination for sessionid: 0x13d3faa6cef0000
[junit4:junit4]   2> 190 T2010 oaz.ClientCnxn$EventThread.run EventThread shut down
[junit4:junit4]   2> 190 T2005 oazs.NIOServerCnxn.closeSock Closed socket connection for client /127.0.0.1:40913 which had sessionid 0x13d3faa6cef0000
[junit4:junit4]   2> 190 T2003 oaz.ZooKeeper.close Session: 0x13d3faa6cef0000 closed
[junit4:junit4]   2> 191 T2003 oaz.ZooKeeper.<init> Initiating client connection, connectString=127.0.0.1:59150/solr sessionTimeout=10000 watcher=org.apache.solr.common.cloud.ConnectionManager@15708ba
[junit4:junit4]   2> 192 T2003 oascc.ConnectionManager.waitForConnected Waiting for client to connect to ZooKeeper
[junit4:junit4]   2> 192 T2011 oaz.ClientCnxn$SendThread.logStartConnect Opening socket connection to server localhost.localdomain/127.0.0.1:59150. Will not attempt to authenticate using SASL (access denied ("javax.security.auth.AuthPermission" "getLoginConfiguration"))
[junit4:junit4]   2> 192 T2011 oaz.ClientCnxn$SendThread.primeConnection Socket connection established to localhost.localdomain/127.0.0.1:59150, initiating session
[junit4:junit4]   2> 192 T2005 oazs.NIOServerCnxnFactory.run Accepted socket connection from /127.0.0.1:40914
[junit4:junit4]   2> 193 T2005 oazs.ZooKeeperServer.processConnectRequest Client attempting to establish new session at /127.0.0.1:40914
[junit4:junit4]   2> 193 T2007 oazs.ZooKeeperServer.finishSessionInit Established session 0x13d3faa6cef0001 with negotiated timeout 10000 for client /127.0.0.1:40914
[junit4:junit4]   2> 193 T2011 oaz.ClientCnxn$SendThread.onConnected Session establishment complete on server localhost.localdomain/127.0.0.1:59150, sessionid = 0x13d3faa6cef0001, negotiated timeout = 10000
[junit4:junit4]   2> 194 T2012 oascc.ConnectionManager.process Watcher org.apache.solr.common.cloud.ConnectionManager@15708ba name:ZooKeeperConnection Watcher:127.0.0.1:59150/solr got event WatchedEvent state:SyncConnected type:None path:null path:null type:None
[junit4:junit4]   2> 194 T2003 oascc.ConnectionManager.waitForConnected Client is connected to ZooKeeper
[junit4:junit4]   2> 194 T2003 oascc.SolrZkClient.makePath makePath: /collections/collection1
[junit4:junit4]   2> 197 T2003 oascc.SolrZkClient.makePath makePath: /collections/collection1/shards
[junit4:junit4]   2> 198 T2003 oascc.SolrZkClient.makePath makePath: /collections/control_collection
[junit4:junit4]   2> 200 T2003 oascc.SolrZkClient.makePath makePath: /collections/control_collection/shards
[junit4:junit4]   2> 202 T2003 oasc.AbstractZkTestCase.putConfig put /mnt/ssd/jenkins/workspace/Lucene-Solr-trunk-Linux/solr/build/solr-core/test-files/solr/collection1/conf/solrconfig-tlog.xml to /configs/conf1/solrconfig.xml
[junit4:junit4]   2> 202 T2003 oascc.SolrZkClient.makePath makePath: /configs/conf1/solrconfig.xml
[junit4:junit4]   2> 205 T2003 oasc.AbstractZkTestCase.putConfig put /mnt/ssd/jenkins/workspace/Lucene-Solr-trunk-Linux/solr/build/solr-core/test-files/solr/collection1/conf/schema.xml to /configs/conf1/schema.xml
[junit4:junit4]   2> 206 T2003 oascc.SolrZkClient.makePath makePath: /configs/conf1/schema.xml
[junit4:junit4]   2> 208 T2003 oasc.AbstractZkTestCase.putConfig put /mnt/ssd/jenkins/workspace/Lucene-Solr-trunk-Linux/solr/build/solr-core/test-files/solr/collection1/conf/stopwords.txt to /configs/conf1/stopwords.txt
[junit4:junit4]   2> 209 T2003 oascc.SolrZkClient.makePath makePath: /configs/conf1/stopwords.txt
[junit4:junit4]   2> 210 T2003 oasc.AbstractZkTestCase.putConfig put /mnt/ssd/jenkins/workspace/Lucene-Solr-trunk-Linux/solr/build/solr-core/test-files/solr/collection1/conf/protwords.txt to /configs/conf1/protwords.txt
[junit4:junit4]   2> 211 T2003 oascc.SolrZkClient.makePath makePath: /configs/conf1/protwords.txt
[junit4:junit4]   2> 212 T2003 oasc.AbstractZkTestCase.putConfig put /mnt/ssd/jenkins/workspace/Lucene-Solr-trunk-Linux/solr/build/solr-core/test-files/solr/collection1/conf/currency.xml to /configs/conf1/currency.xml
[junit4:junit4]   2> 213 T2003 oascc.SolrZkClient.makePath makePath: /configs/conf1/currency.xml
[junit4:junit4]   2> 215 T2003 oasc.AbstractZkTestCase.putConfig put /mnt/ssd/jenkins/workspace/Lucene-Solr-trunk-Linux/solr/build/solr-core/test-files/solr/collection1/conf/open-exchange-rates.json to /configs/conf1/open-exchange-rates.json
[junit4:junit4]   2> 215 T2003 oascc.SolrZkClient.makePath makePath: /configs/conf1/open-exchange-rates.json
[junit4:junit4]   2> 217 T2003 oasc.AbstractZkTestCase.putConfig put /mnt/ssd/jenkins/workspace/Lucene-Solr-trunk-Linux/solr/build/solr-core/test-files/solr/collection1/conf/mapping-ISOLatin1Accent.txt to /configs/conf1/mapping-ISOLatin1Accent.txt
[junit4:junit4]   2> 217 T2003 oascc.SolrZkClient.makePath makePath: /configs/conf1/mapping-ISOLatin1Accent.txt
[junit4:junit4]   2> 219 T2003 oasc.AbstractZkTestCase.putConfig put /mnt/ssd/jenkins/workspace/Lucene-Solr-trunk-Linux/solr/build/solr-core/test-files/solr/collection1/conf/old_synonyms.txt to /configs/conf1/old_synonyms.txt
[junit4:junit4]   2> 219 T2003 oascc.SolrZkClient.makePath makePath: /configs/conf1/old_synonyms.txt
[junit4:junit4]   2> 221 T2003 oasc.AbstractZkTestCase.putConfig put /mnt/ssd/jenkins/workspace/Lucene-Solr-trunk-Linux/solr/build/solr-core/test-files/solr/collection1/conf/synonyms.txt to /configs/conf1/synonyms.txt
[junit4:junit4]   2> 221 T2003 oascc.SolrZkClient.makePath makePath: /configs/conf1/synonyms.txt
[junit4:junit4]   2> 223 T2008 oazs.PrepRequestProcessor.pRequest2Txn Processed session termination for sessionid: 0x13d3faa6cef0001
[junit4:junit4]   2> 224 T2012 oaz.ClientCnxn$EventThread.run EventThread shut down
[junit4:junit4]   2> 224 T2005 oazs.NIOServerCnxn.closeSock Closed socket connection for client /127.0.0.1:40914 which had sessionid 0x13d3faa6cef0001
[junit4:junit4]   2> 224 T2003 oaz.ZooKeeper.close Session: 0x13d3faa6cef0001 closed
[junit4:junit4]   2> 278 T2003 oejs.Server.doStart jetty-8.1.8.v20121106
[junit4:junit4]   2> 285 T2003 oejs.AbstractConnector.doStart Started SelectChannelConnector@127.0.0.1:49048
[junit4:junit4]   2> 285 T2003 oass.SolrDispatchFilter.init SolrDispatchFilter.init()
[junit4:junit4]   2> 286 T2003 oasc.SolrResourceLoader.locateSolrHome JNDI not configured for solr (NoInitialContextEx)
[junit4:junit4]   2> 286 T2003 oasc.SolrResourceLoader.locateSolrHome using system property solr.solr.home: /mnt/ssd/jenkins/workspace/Lucene-Solr-trunk-Linux/solr/build/solr-core/test/J1/./org.apache.solr.cloud.BasicDistributedZk2Test-controljetty-1362572766664
[junit4:junit4]   2> 286 T2003 oasc.CoreContainer$Initializer.initialize looking for solr config file: /mnt/ssd/jenkins/workspace/Lucene-Solr-trunk-Linux/solr/build/solr-core/test/J1/./org.apache.solr.cloud.BasicDistributedZk2Test-controljetty-1362572766664/solr.xml
[junit4:junit4]   2> 287 T2003 oasc.CoreContainer.<init> New CoreContainer 30929419
[junit4:junit4]   2> 287 T2003 oasc.CoreContainer.load Loading CoreContainer using Solr Home: '/mnt/ssd/jenkins/workspace/Lucene-Solr-trunk-Linux/solr/build/solr-core/test/J1/./org.apache.solr.cloud.BasicDistributedZk2Test-controljetty-1362572766664/'
[junit4:junit4]   2> 288 T2003 oasc.SolrResourceLoader.<init> new SolrResourceLoader for directory: '/mnt/ssd/jenkins/workspace/Lucene-Solr-trunk-Linux/solr/build/solr-core/test/J1/./org.apache.solr.cloud.BasicDistributedZk2Test-controljetty-1362572766664/'
[junit4:junit4]   2> 311 T2003 oashc.HttpShardHandlerFactory.getParameter Setting socketTimeout to: 120000
[junit4:junit4]   2> 311 T2003 oashc.HttpShardHandlerFactory.getParameter Setting urlScheme to: http://
[junit4:junit4]   2> 311 T2003 oashc.HttpShardHandlerFactory.getParameter Setting connTimeout to: 15000
[junit4:junit4]   2> 312 T2003 oashc.HttpShardHandlerFactory.getParameter Setting maxConnectionsPerHost to: 20
[junit4:junit4]   2> 312 T2003 oashc.HttpShardHandlerFactory.getParameter Setting corePoolSize to: 0
[junit4:junit4]   2> 312 T2003 oashc.HttpShardHandlerFactory.getParameter Setting maximumPoolSize to: 2147483647
[junit4:junit4]   2> 313 T2003 oashc.HttpShardHandlerFactory.getParameter Setting maxThreadIdleTime to: 5
[junit4:junit4]   2> 313 T2003 oashc.HttpShardHandlerFactory.getParameter Setting sizeOfQueue to: -1
[junit4:junit4]   2> 313 T2003 oashc.HttpShardHandlerFactory.getParameter Setting fairnessPolicy to: false
[junit4:junit4]   2> 314 T2003 oascsi.HttpClientUtil.createClient Creating new http client, config:maxConnectionsPerHost=20&maxConnections=10000&socketTimeout=120000&connTimeout=15000&retry=false
[junit4:junit4]   2> 321 T2003 oasc.CoreContainer.load Registering Log Listener
[junit4:junit4]   2> 333 T2003 oasc.CoreContainer.initZooKeeper Zookeeper client=127.0.0.1:59150/solr
[junit4:junit4]   2> 333 T2003 oasc.ZkController.checkChrootPath zkHost includes chroot
[junit4:junit4]   2> 333 T2003 oaz.ZooKeeper.<init> Initiating client connection, connectString=127.0.0.1:59150 sessionTimeout=60000 watcher=org.apache.solr.common.cloud.ConnectionManager@1ae6e3b
[junit4:junit4]   2> 334 T2003 oascc.ConnectionManager.waitForConnected Waiting for client to connect to ZooKeeper
[junit4:junit4]   2> 334 T2022 oaz.ClientCnxn$SendThread.logStartConnect Opening socket connection to server localhost.localdomain/127.0.0.1:59150. Will not attempt to authenticate using SASL (access denied ("javax.security.auth.AuthPermission" "getLoginConfiguration"))
[junit4:junit4]   2> 335 T2022 oaz.ClientCnxn$SendThread.primeConnection Socket connection established to localhost.localdomain/127.0.0.1:59150, initiating session
[junit4:junit4]   2> 335 T2005 oazs.NIOServerCnxnFactory.run Accepted socket connection from /127.0.0.1:40915
[junit4:junit4]   2> 336 T2005 oazs.ZooKeeperServer.processConnectRequest Client attempting to establish new session at /127.0.0.1:40915
[junit4:junit4]   2> 336 T2007 oazs.ZooKeeperServer.finishSessionInit Established session 0x13d3faa6cef0002 with negotiated timeout 20000 for client /127.0.0.1:40915
[junit4:junit4]   2> 336 T2022 oaz.ClientCnxn$SendThread.onConnected Session establishment complete on server localhost.localdomain/127.0.0.1:59150, sessionid = 0x13d3faa6cef0002, negotiated timeout = 20000
[junit4:junit4]   2> 336 T2023 oascc.ConnectionManager.process Watcher org.apache.solr.common.cloud.ConnectionManager@1ae6e3b name:ZooKeeperConnection Watcher:127.0.0.1:59150 got event WatchedEvent state:SyncConnected type:None path:null path:null type:None
[junit4:junit4]   2> 337 T2003 oascc.ConnectionManager.waitForConnected Client is connected to ZooKeeper
[junit4:junit4]   2> 338 T2008 oazs.PrepRequestProcessor.pRequest2Txn Processed session termination for sessionid: 0x13d3faa6cef0002
[junit4:junit4]   2> 338 T2023 oaz.ClientCnxn$EventThread.run EventThread shut down
[junit4:junit4]   2> 338 T2005 oazs.NIOServerCnxn.closeSock Closed socket connection for client /127.0.0.1:40915 which had sessionid 0x13d3faa6cef0002
[junit4:junit4]   2> 338 T2003 oaz.ZooKeeper.close Session: 0x13d3faa6cef0002 closed
[junit4:junit4]   2> 339 T2003 oascsi.HttpClientUtil.createClient Creating new http client, config:maxConnections=500&maxConnectionsPerHost=16&socketTimeout=120000&connTimeout=15000
[junit4:junit4]   2> 342 T2003 oaz.ZooKeeper.<init> Initiating client connection, connectString=127.0.0.1:59150/solr sessionTimeout=30000 watcher=org.apache.solr.common.cloud.ConnectionManager@14fcc0b
[junit4:junit4]   2> 343 T2024 oaz.ClientCnxn$SendThread.logStartConnect Opening socket connection to server localhost.localdomain/127.0.0.1:59150. Will not attempt to authenticate using SASL (access denied ("javax.security.auth.AuthPermission" "getLoginConfiguration"))
[junit4:junit4]   2> 342 T2003 oascc.ConnectionManager.waitForConnected Waiting for client to connect to ZooKeeper
[junit4:junit4]   2> 343 T2024 oaz.ClientCnxn$SendThread.primeConnection Socket connection established to localhost.localdomain/127.0.0.1:59150, initiating session
[junit4:junit4]   2> 343 T2005 oazs.NIOServerCnxnFactory.run Accepted socket connection from /127.0.0.1:40916
[junit4:junit4]   2> 343 T2005 oazs.ZooKeeperServer.processConnectRequest Client attempting to establish new session at /127.0.0.1:40916
[junit4:junit4]   2> 344 T2007 oazs.ZooKeeperServer.finishSessionInit Established session 0x13d3faa6cef0003 with negotiated timeout 20000 for client /127.0.0.1:40916
[junit4:junit4]   2> 344 T2024 oaz.ClientCnxn$SendThread.onConnected Session establishment complete on server localhost.localdomain/127.0.0.1:59150, sessionid = 0x13d3faa6cef0003, negotiated timeout = 20000
[junit4:junit4]   2> 344 T2025 oascc.ConnectionManager.process Watcher org.apache.solr.common.cloud.ConnectionManager@14fcc0b name:ZooKeeperConnection Watcher:127.0.0.1:59150/solr got event WatchedEvent state:SyncConnected type:None path:null path:null type:None
[junit4:junit4]   2> 345 T2003 oascc.ConnectionManager.waitForConnected Client is connected to ZooKeeper
[junit4:junit4]   2> 346 T2008 oazs.PrepRequestProcessor.pRequest Got user-level KeeperException when processing sessionid:0x13d3faa6cef0003 type:create cxid:0x2 zxid:0x1a txntype:-1 reqpath:n/a Error Path:/solr/overseer Error:KeeperErrorCode = NodeExists for /solr/overseer
[junit4:junit4]   2> 347 T2003 oascc.SolrZkClient.makePath makePath: /live_nodes
[junit4:junit4]   2> 348 T2003 oasc.ZkController.createEphemeralLiveNode Register node as live in ZooKeeper:/live_nodes/127.0.0.1:49048__fus%2Fv
[junit4:junit4]   2> 349 T2008 oazs.PrepRequestProcessor.pRequest Got user-level KeeperException when processing sessionid:0x13d3faa6cef0003 type:delete cxid:0x8 zxid:0x1c txntype:-1 reqpath:n/a Error Path:/solr/live_nodes/127.0.0.1:49048__fus%2Fv Error:KeeperErrorCode = NoNode for /solr/live_nodes/127.0.0.1:49048__fus%2Fv
[junit4:junit4]   2> 349 T2003 oascc.SolrZkClient.makePath makePath: /live_nodes/127.0.0.1:49048__fus%2Fv
[junit4:junit4]   2> 351 T2003 oascc.SolrZkClient.makePath makePath: /overseer_elect/election
[junit4:junit4]   2> 354 T2008 oazs.PrepRequestProcessor.pRequest Got user-level KeeperException when processing sessionid:0x13d3faa6cef0003 type:delete cxid:0x16 zxid:0x21 txntype:-1 reqpath:n/a Error Path:/solr/overseer_elect/leader Error:KeeperErrorCode = NoNode for /solr/overseer_elect/leader
[junit4:junit4]   2> 354 T2003 oascc.SolrZkClient.makePath makePath: /overseer_elect/leader
[junit4:junit4]   2> 356 T2003 oasc.Overseer.start Overseer (id=89297568821870595-127.0.0.1:49048__fus%2Fv-n_0000000000) starting
[junit4:junit4]   2> 357 T2008 oazs.PrepRequestProcessor.pRequest Got user-level KeeperException when processing sessionid:0x13d3faa6cef0003 type:create cxid:0x1b zxid:0x23 txntype:-1 reqpath:n/a Error Path:/solr/overseer Error:KeeperErrorCode = NodeExists for /solr/overseer
[junit4:junit4]   2> 358 T2008 oazs.PrepRequestProcessor.pRequest Got user-level KeeperException when processing sessionid:0x13d3faa6cef0003 type:create cxid:0x1c zxid:0x24 txntype:-1 reqpath:n/a Error Path:/solr/overseer Error:KeeperErrorCode = NodeExists for /solr/overseer
[junit4:junit4]   2> 358 T2008 oazs.PrepRequestProcessor.pRequest Got user-level KeeperException when processing sessionid:0x13d3faa6cef0003 type:create cxid:0x1d zxid:0x25 txntype:-1 reqpath:n/a Error Path:/solr/overseer Error:KeeperErrorCode = NodeExists for /solr/overseer
[junit4:junit4]   2> 359 T2008 oazs.PrepRequestProcessor.pRequest Got user-level KeeperException when processing sessionid:0x13d3faa6cef0003 type:create cxid:0x1e zxid:0x26 txntype:-1 reqpath:n/a Error Path:/solr/overseer Error:KeeperErrorCode = NodeExists for /solr/overseer
[junit4:junit4]   2> 359 T2027 oasc.OverseerCollectionProcessor.run Process current queue of collection creations
[junit4:junit4]   2> 360 T2003 oascc.SolrZkClient.makePath makePath: /clusterstate.json
[junit4:junit4]   2> 365 T2003 oascc.ZkStateReader.createClusterStateWatchersAndUpdate Updating cluster state from ZooKeeper... 
[junit4:junit4]   2> 366 T2026 oasc.Overseer$ClusterStateUpdater.run Starting to work on the main queue
[junit4:junit4]   2> 370 T2028 oasc.CoreContainer.create Creating SolrCore 'collection1' using instanceDir: /mnt/ssd/jenkins/workspace/Lucene-Solr-trunk-Linux/solr/build/solr-core/test/J1/./org.apache.solr.cloud.BasicDistributedZk2Test-controljetty-1362572766664/collection1
[junit4:junit4]   2> 371 T2028 oasc.ZkController.createCollectionZkNode Check for collection zkNode:control_collection
[junit4:junit4]   2> 371 T2028 oasc.ZkController.createCollectionZkNode Collection zkNode exists
[junit4:junit4]   2> 371 T2028 oasc.ZkController.readConfigName Load collection config from:/collections/control_collection
[junit4:junit4]   2> 372 T2028 oasc.SolrResourceLoader.<init> new SolrResourceLoader for directory: '/mnt/ssd/jenkins/workspace/Lucene-Solr-trunk-Linux/solr/build/solr-core/test/J1/./org.apache.solr.cloud.BasicDistributedZk2Test-controljetty-1362572766664/collection1/'
[junit4:junit4]   2> 373 T2028 oasc.SolrResourceLoader.replaceClassLoader Adding 'file:/mnt/ssd/jenkins/workspace/Lucene-Solr-trunk-Linux/solr/build/solr-core/test/J1/org.apache.solr.cloud.BasicDistributedZk2Test-controljetty-1362572766664/collection1/lib/README' to classloader
[junit4:junit4]   2> 373 T2028 oasc.SolrResourceLoader.replaceClassLoader Adding 'file:/mnt/ssd/jenkins/workspace/Lucene-Solr-trunk-Linux/solr/build/solr-core/test/J1/org.apache.solr.cloud.BasicDistributedZk2Test-controljetty-1362572766664/collection1/lib/classes/' to classloader
[junit4:junit4]   2> 399 T2028 oasc.SolrConfig.<init> Using Lucene MatchVersion: LUCENE_50
[junit4:junit4]   2> 447 T2028 oasc.SolrConfig.<init> Loaded SolrConfig: solrconfig.xml
[junit4:junit4]   2> 448 T2028 oass.IndexSchema.readSchema Reading Solr Schema
[junit4:junit4]   2> 455 T2028 oass.IndexSchema.readSchema Schema name=test
[junit4:junit4]   2> 908 T2028 oass.OpenExchangeRatesOrgProvider.init Initialized with rates=open-exchange-rates.json, refreshInterval=1440.
[junit4:junit4]   2> 914 T2028 oass.IndexSchema.readSchema default search field in schema is text
[junit4:junit4]   2> 917 T2028 oass.IndexSchema.readSchema unique key field: id
[junit4:junit4]   2> 926 T2028 oass.FileExchangeRateProvider.reload Reloading exchange rates from file currency.xml
[junit4:junit4]   2> 929 T2028 oass.FileExchangeRateProvider.reload Reloading exchange rates from file currency.xml
[junit4:junit4]   2> 932 T2028 oass.OpenExchangeRatesOrgProvider.reload Reloading exchange rates from open-exchange-rates.json
[junit4:junit4]   2> 933 T2028 oass.OpenExchangeRatesOrgProvider$OpenExchangeRates.<init> WARNING Unknown key IMPORTANT NOTE
[junit4:junit4]   2> 933 T2028 oass.OpenExchangeRatesOrgProvider$OpenExchangeRates.<init> WARNING Expected key, got STRING
[junit4:junit4]   2> 933 T2028 oass.OpenExchangeRatesOrgProvider.reload Reloading exchange rates from open-exchange-rates.json
[junit4:junit4]   2> 934 T2028 oass.OpenExchangeRatesOrgProvider$OpenExchangeRates.<init> WARNING Unknown key IMPORTANT NOTE
[junit4:junit4]   2> 934 T2028 oass.OpenExchangeRatesOrgProvider$OpenExchangeRates.<init> WARNING Expected key, got STRING
[junit4:junit4]   2> 935 T2028 oasc.SolrCore.<init> [collection1] Opening new SolrCore at /mnt/ssd/jenkins/workspace/Lucene-Solr-trunk-Linux/solr/build/solr-core/test/J1/./org.apache.solr.cloud.BasicDistributedZk2Test-controljetty-1362572766664/collection1/, dataDir=./org.apache.solr.cloud.BasicDistributedZk2Test-1362572766444/control/data/
[junit4:junit4]   2> 935 T2028 oasc.JmxMonitoredMap.<init> JMX monitoring is enabled. Adding Solr mbeans to JMX Server: com.sun.jmx.mbeanserver.JmxMBeanServer@422150
[junit4:junit4]   2> 935 T2028 oasc.SolrCore.initDirectoryFactory org.apache.solr.core.MockDirectoryFactory
[junit4:junit4]   2> 936 T2028 oasc.CachingDirectoryFactory.get return new directory for /mnt/ssd/jenkins/workspace/Lucene-Solr-trunk-Linux/solr/build/solr-core/test/J1/./org.apache.solr.cloud.BasicDistributedZk2Test-1362572766444/control/data forceNew:false
[junit4:junit4]   2> 936 T2028 oasc.CachingDirectoryFactory.close Releasing directory:/mnt/ssd/jenkins/workspace/Lucene-Solr-trunk-Linux/solr/build/solr-core/test/J1/./org.apache.solr.cloud.BasicDistributedZk2Test-1362572766444/control/data
[junit4:junit4]   2> 936 T2028 oasc.SolrCore.getNewIndexDir New index directory detected: old=null new=./org.apache.solr.cloud.BasicDistributedZk2Test-1362572766444/control/data/index/
[junit4:junit4]   2> 936 T2028 oasc.SolrCore.initIndex WARNING [collection1] Solr index directory './org.apache.solr.cloud.BasicDistributedZk2Test-1362572766444/control/data/index' doesn't exist. Creating new index...
[junit4:junit4]   2> 937 T2028 oasc.CachingDirectoryFactory.get return new directory for /mnt/ssd/jenkins/workspace/Lucene-Solr-trunk-Linux/solr/build/solr-core/test/J1/./org.apache.solr.cloud.BasicDistributedZk2Test-1362572766444/control/data/index forceNew:false
[junit4:junit4]   2> 938 T2028 oasc.SolrDeletionPolicy.onCommit SolrDeletionPolicy.onCommit: commits:num=1
[junit4:junit4]   2> 		commit{dir=MockDirWrapper(org.apache.lucene.store.RAMDirectory@1f0d070 lockFactory=org.apache.lucene.store.NativeFSLockFactory@1fe35e3),segFN=segments_1,generation=1,filenames=[segments_1]
[junit4:junit4]   2> 938 T2028 oasc.SolrDeletionPolicy.updateCommits newest commit = 1[segments_1]
[junit4:junit4]   2> 938 T2028 oasc.CachingDirectoryFactory.close Releasing directory:/mnt/ssd/jenkins/workspace/Lucene-Solr-trunk-Linux/solr/build/solr-core/test/J1/./org.apache.solr.cloud.BasicDistributedZk2Test-1362572766444/control/data/index
[junit4:junit4]   2> 939 T2028 oasup.UpdateRequestProcessorChain.init inserting DistributedUpdateProcessorFactory into updateRequestProcessorChain "dedupe"
[junit4:junit4]   2> 940 T2028 oasup.UpdateRequestProcessorChain.init inserting DistributedUpdateProcessorFactory into updateRequestProcessorChain "stored_sig"
[junit4:junit4]   2> 940 T2028 oasup.UpdateRequestProcessorChain.init inserting DistributedUpdateProcessorFactory into updateRequestProcessorChain "distrib-dup-test-chain-implicit"
[junit4:junit4]   2> 940 T2028 oasc.RequestHandlers.initHandlersFromConfig created standard: solr.StandardRequestHandler
[junit4:junit4]   2> 941 T2028 oasc.RequestHandlers.initHandlersFromConfig created /get: solr.RealTimeGetHandler
[junit4:junit4]   2> 941 T2028 oasc.RequestHandlers.initHandlersFromConfig adding lazy requestHandler: solr.ReplicationHandler
[junit4:junit4]   2> 941 T2028 oasc.RequestHandlers.initHandlersFromConfig created /replication: solr.ReplicationHandler
[junit4:junit4]   2> 941 T2028 oasc.RequestHandlers.initHandlersFromConfig created /update: solr.UpdateRequestHandler
[junit4:junit4]   2> 942 T2028 oasc.RequestHandlers.initHandlersFromConfig created /admin/: org.apache.solr.handler.admin.AdminHandlers
[junit4:junit4]   2> 955 T2028 oashl.XMLLoader.init xsltCacheLifetimeSeconds=60
[junit4:junit4]   2> 957 T2028 oasc.CachingDirectoryFactory.close Releasing directory:/mnt/ssd/jenkins/workspace/Lucene-Solr-trunk-Linux/solr/build/solr-core/test/J1/./org.apache.solr.cloud.BasicDistributedZk2Test-1362572766444/control/data
[junit4:junit4]   2> 957 T2028 oass.SolrIndexSearcher.<init> Opening Searcher@1092f7b main
[junit4:junit4]   2> 958 T2028 oasu.UpdateHandler.clearLog Clearing tlog files, tlogDir=./org.apache.solr.cloud.BasicDistributedZk2Test-1362572766444/control/data/tlog
[junit4:junit4]   2> 958 T2028 oasu.CommitTracker.<init> Hard AutoCommit: disabled
[junit4:junit4]   2> 959 T2028 oasu.CommitTracker.<init> Soft AutoCommit: disabled
[junit4:junit4]   2> 961 T2028 oasc.CachingDirectoryFactory.close Releasing directory:/mnt/ssd/jenkins/workspace/Lucene-Solr-trunk-Linux/solr/build/solr-core/test/J1/./org.apache.solr.cloud.BasicDistributedZk2Test-1362572766444/control/data
[junit4:junit4]   2> 962 T2029 oasc.SolrCore.registerSearcher [collection1] Registered new searcher Searcher@1092f7b main{StandardDirectoryReader(segments_1:1)}
[junit4:junit4]   2> 962 T2028 oasc.ZkController.publish publishing core=collection1 state=down
[junit4:junit4]   2> 962 T2028 oasc.ZkController.publish numShards not found on descriptor - reading it from system property
[junit4:junit4]   2> 963 T2008 oazs.PrepRequestProcessor.pRequest Got user-level KeeperException when processing sessionid:0x13d3faa6cef0003 type:create cxid:0x50 zxid:0x29 txntype:-1 reqpath:n/a Error Path:/solr/overseer/queue Error:KeeperErrorCode = NoNode for /solr/overseer/queue
[junit4:junit4]   2> 1869 T2026 oascc.ZkStateReader.updateClusterState Updating cloud state from ZooKeeper... 
[junit4:junit4]   2> 1870 T2026 oasc.Overseer$ClusterStateUpdater.updateState Update state numShards=1 message={
[junit4:junit4]   2> 	  "shard":null,
[junit4:junit4]   2> 	  "collection":"control_collection",
[junit4:junit4]   2> 	  "operation":"state",
[junit4:junit4]   2> 	  "base_url":"http://127.0.0.1:49048/_fus/v",
[junit4:junit4]   2> 	  "roles":null,
[junit4:junit4]   2> 	  "core":"collection1",
[junit4:junit4]   2> 	  "core_node_name":null,
[junit4:junit4]   2> 	  "numShards":"1",
[junit4:junit4]   2> 	  "state":"down",
[junit4:junit4]   2> 	  "node_name":"127.0.0.1:49048__fus%2Fv"}
[junit4:junit4]   2> 1870 T2026 oasc.Overseer$ClusterStateUpdater.createCollection Create collection control_collection with numShards 1
[junit4:junit4]   2> 1870 T2026 oasc.Overseer$ClusterStateUpdater.updateState Assigning new node to shard shard=shard1
[junit4:junit4]   2> 1871 T2008 oazs.PrepRequestProcessor.pRequest Got user-level KeeperException when processing sessionid:0x13d3faa6cef0003 type:create cxid:0x58 zxid:0x2c txntype:-1 reqpath:n/a Error Path:/solr/overseer/queue-work Error:KeeperErrorCode = NoNode for /solr/overseer/queue-work
[junit4:junit4]   2> 1875 T2025 oascc.ZkStateReader$2.process A cluster state change: WatchedEvent state:SyncConnected type:NodeDataChanged path:/clusterstate.json, has occurred - updating... (live nodes size: 1)
[junit4:junit4]   2> 1965 T2028 oasc.CoreContainer.registerCore registering core: collection1
[junit4:junit4]   2> 1965 T2028 oasc.ZkController.register Register replica - core:collection1 address:http://127.0.0.1:49048/_fus/v collection:control_collection shard:shard1
[junit4:junit4]   2> 1966 T2028 oascc.SolrZkClient.makePath makePath: /collections/control_collection/leader_elect/shard1/election
[junit4:junit4]   2> 1970 T2008 oazs.PrepRequestProcessor.pRequest Got user-level KeeperException when processing sessionid:0x13d3faa6cef0003 type:delete cxid:0x72 zxid:0x36 txntype:-1 reqpath:n/a Error Path:/solr/collections/control_collection/leaders Error:KeeperErrorCode = NoNode for /solr/collections/control_collection/leaders
[junit4:junit4]   2> 1971 T2028 oasc.ShardLeaderElectionContext.runLeaderProcess Running the leader process.
[junit4:junit4]   2> 1971 T2008 oazs.PrepRequestProcessor.pRequest Got user-level KeeperException when processing sessionid:0x13d3faa6cef0003 type:create cxid:0x73 zxid:0x37 txntype:-1 reqpath:n/a Error Path:/solr/overseer Error:KeeperErrorCode = NodeExists for /solr/overseer
[junit4:junit4]   2> 1972 T2028 oasc.ShardLeaderElectionContext.waitForReplicasToComeUp Enough replicas found to continue.
[junit4:junit4]   2> 1972 T2028 oasc.ShardLeaderElectionContext.runLeaderProcess I may be the new leader - try and sync
[junit4:junit4]   2> 1973 T2028 oasc.SyncStrategy.sync Sync replicas to http://127.0.0.1:49048/_fus/v/collection1/
[junit4:junit4]   2> 1973 T2028 oasc.SyncStrategy.syncReplicas Sync Success - now sync replicas to me
[junit4:junit4]   2> 1973 T2028 oasc.SyncStrategy.syncToMe http://127.0.0.1:49048/_fus/v/collection1/ has no replicas
[junit4:junit4]   2> 1973 T2028 oasc.ShardLeaderElectionContext.runLeaderProcess I am the new leader: http://127.0.0.1:49048/_fus/v/collection1/
[junit4:junit4]   2> 1973 T2028 oascc.SolrZkClient.makePath makePath: /collections/control_collection/leaders/shard1
[junit4:junit4]   2> 1976 T2008 oazs.PrepRequestProcessor.pRequest Got user-level KeeperException when processing sessionid:0x13d3faa6cef0003 type:create cxid:0x7d zxid:0x3b txntype:-1 reqpath:n/a Error Path:/solr/overseer Error:KeeperErrorCode = NodeExists for /solr/overseer
[junit4:junit4]   2> 3378 T2026 oascc.ZkStateReader.updateClusterState Updating cloud state from ZooKeeper... 
[junit4:junit4]   2> 3386 T2025 oascc.ZkStateReader$2.process A cluster state change: WatchedEvent state:SyncConnected type:NodeDataChanged path:/clusterstate.json, has occurred - updating... (live nodes size: 1)
[junit4:junit4]   2> 3430 T2028 oasc.ZkController.register We are http://127.0.0.1:49048/_fus/v/collection1/ and leader is http://127.0.0.1:49048/_fus/v/collection1/
[junit4:junit4]   2> 3430 T2028 oasc.ZkController.register No LogReplay needed for core=collection1 baseURL=http://127.0.0.1:49048/_fus/v
[junit4:junit4]   2> 3431 T2028 oasc.ZkController.checkRecovery I am the leader, no recovery necessary
[junit4:junit4]   2> 3431 T2028 oasc.ZkController.publish publishing core=collection1 state=active
[junit4:junit4]   2> 3431 T2028 oasc.ZkController.publish numShards not found on descriptor - reading it from system property
[junit4:junit4]   2> 3432 T2028 oascc.ZkStateReader.updateClusterState Updating cloud state from ZooKeeper... 
[junit4:junit4]   2> 3433 T2003 oass.SolrDispatchFilter.init user.dir=/mnt/ssd/jenkins/workspace/Lucene-Solr-trunk-Linux/solr/build/solr-core/test/J1
[junit4:junit4]   2> 3434 T2003 oass.SolrDispatchFilter.init SolrDispatchFilter.init() done
[junit4:junit4]   2> 3434 T2003 oascsi.HttpClientUtil.createClient Creating new http client, config:maxConnections=128&maxConnectionsPerHost=32&followRedirects=false
[junit4:junit4]   2> 3437 T2003 oascsi.HttpClientUtil.createClient Creating new http client, config:
[junit4:junit4]   2> 3438 T2003 oaz.ZooKeeper.<init> Initiating client connection, connectString=127.0.0.1:59150/solr sessionTimeout=10000 watcher=org.apache.solr.common.cloud.ConnectionManager@1e2fcc8
[junit4:junit4]   2> 3439 T2003 oascc.ConnectionManager.waitForConnected Waiting for client to connect to ZooKeeper
[junit4:junit4]   2> 3439 T2031 oaz.ClientCnxn$SendThread.logStartConnect Opening socket connection to server localhost.localdomain/127.0.0.1:59150. Will not attempt to authenticate using SASL (access denied ("javax.security.auth.AuthPermission" "getLoginConfiguration"))
[junit4:junit4]   2> 3440 T2031 oaz.ClientCnxn$SendThread.primeConnection Socket connection established to localhost.localdomain/127.0.0.1:59150, initiating session
[junit4:junit4]   2> 3440 T2005 oazs.NIOServerCnxnFactory.run Accepted socket connection from /127.0.0.1:40919
[junit4:junit4]   2> 3441 T2005 oazs.ZooKeeperServer.processConnectRequest Client attempting to establish new session at /127.0.0.1:40919
[junit4:junit4]   2> 3441 T2007 oazs.ZooKeeperServer.finishSessionInit Established session 0x13d3faa6cef0004 with negotiated timeout 10000 for client /127.0.0.1:40919
[junit4:junit4]   2> 3441 T2031 oaz.ClientCnxn$SendThread.onConnected Session establishment complete on server localhost.localdomain/127.0.0.1:59150, sessionid = 0x13d3faa6cef0004, negotiated timeout = 10000
[junit4:junit4]   2> 3442 T2032 oascc.ConnectionManager.process Watcher org.apache.solr.common.cloud.ConnectionManager@1e2fcc8 name:ZooKeeperConnection Watcher:127.0.0.1:59150/solr got event WatchedEvent state:SyncConnected type:None path:null path:null type:None
[junit4:junit4]   2> 3442 T2003 oascc.ConnectionManager.waitForConnected Client is connected to ZooKeeper
[junit4:junit4]   2> 3443 T2003 oascc.ZkStateReader.createClusterStateWatchersAndUpdate Updating cluster state from ZooKeeper... 
[junit4:junit4]   2> 3444 T2003 oasc.ChaosMonkey.monkeyLog monkey: init - expire sessions:true cause connection loss:true
[junit4:junit4]   2> 3503 T2003 oejs.Server.doStart jetty-8.1.8.v20121106
[junit4:junit4]   2> 3507 T2003 oejs.AbstractConnector.doStart Started SelectChannelConnector@127.0.0.1:34329
[junit4:junit4]   2> 3508 T2003 oass.SolrDispatchFilter.init SolrDispatchFilter.init()
[junit4:junit4]   2> 3509 T2003 oasc.SolrResourceLoader.locateSolrHome JNDI not configured for solr (NoInitialContextEx)
[junit4:junit4]   2> 3509 T2003 oasc.SolrResourceLoader.locateSolrHome using system property solr.solr.home: /mnt/ssd/jenkins/workspace/Lucene-Solr-trunk-Linux/solr/build/solr-core/test/J1/./org.apache.solr.cloud.BasicDistributedZk2Test-jetty1-1362572769885
[junit4:junit4]   2> 3509 T2003 oasc.CoreContainer$Initializer.initialize looking for solr config file: /mnt/ssd/jenkins/workspace/Lucene-Solr-trunk-Linux/solr/build/solr-core/test/J1/./org.apache.solr.cloud.BasicDistributedZk2Test-jetty1-1362572769885/solr.xml
[junit4:junit4]   2> 3510 T2003 oasc.CoreContainer.<init> New CoreContainer 22282728
[junit4:junit4]   2> 3510 T2003 oasc.CoreContainer.load Loading CoreContainer using Solr Home: '/mnt/ssd/jenkins/workspace/Lucene-Solr-trunk-Linux/solr/build/solr-core/test/J1/./org.apache.solr.cloud.BasicDistributedZk2Test-jetty1-1362572769885/'
[junit4:junit4]   2> 3511 T2003 oasc.SolrResourceLoader.<init> new SolrResourceLoader for directory: '/mnt/ssd/jenkins/workspace/Lucene-Solr-trunk-Linux/solr/build/solr-core/test/J1/./org.apache.solr.cloud.BasicDistributedZk2Test-jetty1-1362572769885/'
[junit4:junit4]   2> 3532 T2003 oashc.HttpShardHandlerFactory.getParameter Setting socketTimeout to: 120000
[junit4:junit4]   2> 3533 T2003 oashc.HttpShardHandlerFactory.getParameter Setting urlScheme to: http://
[junit4:junit4]   2> 3533 T2003 oashc.HttpShardHandlerFactory.getParameter Setting connTimeout to: 15000
[junit4:junit4]   2> 3533 T2003 oashc.HttpShardHandlerFactory.getParameter Setting maxConnectionsPerHost to: 20
[junit4:junit4]   2> 3534 T2003 oashc.HttpShardHandlerFactory.getParameter Setting corePoolSize to: 0
[junit4:junit4]   2> 3534 T2003 oashc.HttpShardHandlerFactory.getParameter Setting maximumPoolSize to: 2147483647
[junit4:junit4]   2> 3535 T2003 oashc.HttpShardHandlerFactory.getParameter Setting maxThreadIdleTime to: 5
[junit4:junit4]   2> 3535 T2003 oashc.HttpShardHandlerFactory.getParameter Setting sizeOfQueue to: -1
[junit4:junit4]   2> 3536 T2003 oashc.HttpShardHandlerFactory.getParameter Setting fairnessPolicy to: false
[junit4:junit4]   2> 3536 T2003 oascsi.HttpClientUtil.createClient Creating new http client, config:maxConnectionsPerHost=20&maxConnections=10000&socketTimeout=120000&connTimeout=15000&retry=false
[junit4:junit4]   2> 3550 T2003 oasc.CoreContainer.load Registering Log Listener
[junit4:junit4]   2> 3564 T2003 oasc.CoreContainer.initZooKeeper Zookeeper client=127.0.0.1:59150/solr
[junit4:junit4]   2> 3565 T2003 oasc.ZkController.checkChrootPath zkHost includes chroot
[junit4:junit4]   2> 3565 T2003 oaz.ZooKeeper.<in

[...truncated too long message...]

keeper (1)
[junit4:junit4]   1>  DATA:
[junit4:junit4]   1>      
[junit4:junit4]   1> 
[junit4:junit4]   2> NOTE: reproduce with: ant test  -Dtestcase=UnloadDistributedZkTest -Dtests.method=testDistribSearch -Dtests.seed=6E9A2F599977315B -Dtests.multiplier=3 -Dtests.slow=true -Dtests.locale=lv -Dtests.timezone=Asia/Ashgabat -Dtests.file.encoding=UTF-8
[junit4:junit4] FAILURE  138s J1 | UnloadDistributedZkTest.testDistribSearch <<<
[junit4:junit4]    > Throwable #1: java.lang.AssertionError: Still found shard
[junit4:junit4]    > 	at __randomizedtesting.SeedInfo.seed([6E9A2F599977315B:EF7CA141EE285167]:0)
[junit4:junit4]    > 	at org.junit.Assert.fail(Assert.java:93)
[junit4:junit4]    > 	at org.apache.solr.cloud.UnloadDistributedZkTest.testUnloadShardAndCollection(UnloadDistributedZkTest.java:124)
[junit4:junit4]    > 	at org.apache.solr.cloud.UnloadDistributedZkTest.doTest(UnloadDistributedZkTest.java:77)
[junit4:junit4]    > 	at org.apache.solr.BaseDistributedSearchTestCase.testDistribSearch(BaseDistributedSearchTestCase.java:806)
[junit4:junit4]    > 	at sun.reflect.NativeMethodAccessorImpl.invoke0(Native Method)
[junit4:junit4]    > 	at sun.reflect.NativeMethodAccessorImpl.invoke(NativeMethodAccessorImpl.java:57)
[junit4:junit4]    > 	at sun.reflect.DelegatingMethodAccessorImpl.invoke(DelegatingMethodAccessorImpl.java:43)
[junit4:junit4]    > 	at java.lang.reflect.Method.invoke(Method.java:487)
[junit4:junit4]    > 	at com.carrotsearch.randomizedtesting.RandomizedRunner.invoke(RandomizedRunner.java:1559)
[junit4:junit4]    > 	at com.carrotsearch.randomizedtesting.RandomizedRunner.access$600(RandomizedRunner.java:79)
[junit4:junit4]    > 	at com.carrotsearch.randomizedtesting.RandomizedRunner$6.evaluate(RandomizedRunner.java:737)
[junit4:junit4]    > 	at com.carrotsearch.randomizedtesting.RandomizedRunner$7.evaluate(RandomizedRunner.java:773)
[junit4:junit4]    > 	at com.carrotsearch.randomizedtesting.RandomizedRunner$8.evaluate(RandomizedRunner.java:787)
[junit4:junit4]    > 	at com.carrotsearch.randomizedtesting.rules.SystemPropertiesRestoreRule$1.evaluate(SystemPropertiesRestoreRule.java:53)
[junit4:junit4]    > 	at org.apache.lucene.util.TestRuleSetupTeardownChained$1.evaluate(TestRuleSetupTeardownChained.java:50)
[junit4:junit4]    > 	at org.apache.lucene.util.TestRuleFieldCacheSanity$1.evaluate(TestRuleFieldCacheSanity.java:51)
[junit4:junit4]    > 	at org.apache.lucene.util.AbstractBeforeAfterRule$1.evaluate(AbstractBeforeAfterRule.java:46)
[junit4:junit4]    > 	at com.carrotsearch.randomizedtesting.rules.SystemPropertiesInvariantRule$1.evaluate(SystemPropertiesInvariantRule.java:55)
[junit4:junit4]    > 	at org.apache.lucene.util.TestRuleThreadAndTestName$1.evaluate(TestRuleThreadAndTestName.java:49)
[junit4:junit4]    > 	at org.apache.lucene.util.TestRuleIgnoreAfterMaxFailures$1.evaluate(TestRuleIgnoreAfterMaxFailures.java:70)
[junit4:junit4]    > 	at org.apache.lucene.util.TestRuleMarkFailure$1.evaluate(TestRuleMarkFailure.java:48)
[junit4:junit4]    > 	at com.carrotsearch.randomizedtesting.rules.StatementAdapter.evaluate(StatementAdapter.java:36)
[junit4:junit4]    > 	at com.carrotsearch.randomizedtesting.ThreadLeakControl$StatementRunner.run(ThreadLeakControl.java:358)
[junit4:junit4]    > 	at com.carrotsearch.randomizedtesting.ThreadLeakControl.forkTimeoutingTask(ThreadLeakControl.java:782)
[junit4:junit4]    > 	at com.carrotsearch.randomizedtesting.ThreadLeakControl$3.evaluate(ThreadLeakControl.java:442)
[junit4:junit4]    > 	at com.carrotsearch.randomizedtesting.RandomizedRunner.runSingleTest(RandomizedRunner.java:746)
[junit4:junit4]    > 	at com.carrotsearch.randomizedtesting.RandomizedRunner$3.evaluate(RandomizedRunner.java:648)
[junit4:junit4]    > 	at com.carrotsearch.randomizedtesting.RandomizedRunner$4.evaluate(RandomizedRunner.java:682)
[junit4:junit4]    > 	at com.carrotsearch.randomizedtesting.RandomizedRunner$5.evaluate(RandomizedRunner.java:693)
[junit4:junit4]    > 	at com.carrotsearch.randomizedtesting.rules.StatementAdapter.evaluate(StatementAdapter.java:36)
[junit4:junit4]    > 	at com.carrotsearch.randomizedtesting.rules.SystemPropertiesRestoreRule$1.evaluate(SystemPropertiesRestoreRule.java:53)
[junit4:junit4]    > 	at org.apache.lucene.util.AbstractBeforeAfterRule$1.evaluate(AbstractBeforeAfterRule.java:46)
[junit4:junit4]    > 	at org.apache.lucene.util.TestRuleStoreClassName$1.evaluate(TestRuleStoreClassName.java:42)
[junit4:junit4]    > 	at com.carrotsearch.randomizedtesting.rules.SystemPropertiesInvariantRule$1.evaluate(SystemPropertiesInvariantRule.java:55)
[junit4:junit4]    > 	at com.carrotsearch.randomizedtesting.rules.NoShadowingOrOverridesOnMethodsRule$1.evaluate(NoShadowingOrOverridesOnMethodsRule.java:39)
[junit4:junit4]    > 	at com.carrotsearch.randomizedtesting.rules.NoShadowingOrOverridesOnMethodsRule$1.evaluate(NoShadowingOrOverridesOnMethodsRule.java:39)
[junit4:junit4]    > 	at com.carrotsearch.randomizedtesting.rules.StatementAdapter.evaluate(StatementAdapter.java:36)
[junit4:junit4]    > 	at org.apache.lucene.util.TestRuleAssertionsRequired$1.evaluate(TestRuleAssertionsRequired.java:43)
[junit4:junit4]    > 	at org.apache.lucene.util.TestRuleMarkFailure$1.evaluate(TestRuleMarkFailure.java:48)
[junit4:junit4]    > 	at org.apache.lucene.util.TestRuleIgnoreAfterMaxFailures$1.evaluate(TestRuleIgnoreAfterMaxFailures.java:70)
[junit4:junit4]    > 	at org.apache.lucene.util.TestRuleIgnoreTestSuites$1.evaluate(TestRuleIgnoreTestSuites.java:55)
[junit4:junit4]    > 	at com.carrotsearch.randomizedtesting.rules.StatementAdapter.evaluate(StatementAdapter.java:36)
[junit4:junit4]    > 	at com.carrotsearch.randomizedtesting.ThreadLeakControl$StatementRunner.run(ThreadLeakControl.java:358)
[junit4:junit4]    > 	at java.lang.Thread.run(Thread.java:722)
[junit4:junit4]   2> 137878 T2094 oas.SolrTestCaseJ4.deleteCore ###deleteCore
[junit4:junit4]   2> 137900 T2093 ccr.ThreadLeakControl.checkThreadLeaks WARNING Will linger awaiting termination of 2 leaked thread(s).
[junit4:junit4]   2> 137957 T2097 oazs.SessionTrackerImpl.run SessionTrackerImpl exited loop!
[junit4:junit4]   2> NOTE: test params are: codec=Lucene42: {range_facet_si=MockFixedIntBlock(blockSize=172), range_facet_l=MockVariableIntBlock(baseBlockSize=21), id=PostingsFormat(name=MockSep), intDefault=MockVariableIntBlock(baseBlockSize=21), a_si=MockFixedIntBlock(blockSize=172), multiDefault=MockFixedIntBlock(blockSize=172), text=Pulsing41(freqCutoff=4 minBlockSize=4 maxBlockSize=34), range_facet_sl=Pulsing41(freqCutoff=4 minBlockSize=4 maxBlockSize=34), other_tl1=MockVariableIntBlock(baseBlockSize=21), timestamp=MockVariableIntBlock(baseBlockSize=21), _version_=MockVariableIntBlock(baseBlockSize=21), a_t=MockVariableIntBlock(baseBlockSize=21)}, docValues:{timestamp=DocValuesFormat(name=Disk)}, sim=DefaultSimilarity, locale=lv, timezone=Asia/Ashgabat
[junit4:junit4]   2> NOTE: Linux 3.2.0-38-generic i386/Oracle Corporation 1.8.0-ea (32-bit)/cpus=8,threads=2,free=72738736,total=217796608
[junit4:junit4]   2> NOTE: All tests run in this JVM: [MultiTermTest, FileUtilsTest, TestDefaultSimilarityFactory, ClusterStateTest, DirectSolrSpellCheckerTest, TestQuerySenderNoQuery, TestBM25SimilarityFactory, SignatureUpdateProcessorFactoryTest, CoreContainerCoreInitFailuresTest, SolrCoreCheckLockOnStartupTest, JSONWriterTest, SuggesterTSTTest, DateMathParserTest, TestSolr4Spatial, NoCacheHeaderTest, TestSolrXMLSerializer, TestNumberUtils, SimplePostToolTest, TestJmxMonitoredMap, TestDynamicFieldCollectionResource, DisMaxRequestHandlerTest, PathHierarchyTokenizerFactoryTest, TestCollationField, TestArbitraryIndexDir, TestDistributedGrouping, HardAutoCommitTest, EchoParamsTest, SolrCmdDistributorTest, FullSolrCloudDistribCmdsTest, TestBinaryResponseWriter, PingRequestHandlerTest, TestJmxIntegration, TestCodecSupport, BasicZkTest, HighlighterConfigTest, ZkNodePropsTest, SolrRequestParserTest, IndexBasedSpellCheckerTest, DocValuesMultiTest, TestComponentsName, CurrencyFieldOpenExchangeTest, TestPropInject, TestAtomicUpdateErrorCases, TestLMJelinekMercerSimilarityFactory, TestFoldingMultitermQuery, SpellPossibilityIteratorTest, TestRangeQuery, OpenCloseCoreStressTest, TestPostingsSolrHighlighter, TestMultiCoreConfBootstrap, NotRequiredUniqueKeyTest, DistanceFunctionTest, BadIndexSchemaTest, UniqFieldsUpdateProcessorFactoryTest, OutputWriterTest, TestRandomFaceting, TestStressLucene, XmlUpdateRequestHandlerTest, TestFieldTypeCollectionResource, TestWordDelimiterFilterFactory, TestElisionMultitermQuery, TestIndexSearcher, ChaosMonkeySafeLeaderTest, CopyFieldTest, SampleTest, BasicDistributedZk2Test, UnloadDistributedZkTest]
[junit4:junit4] Completed on J1 in 138.18s, 1 test, 1 failure <<< FAILURES!

[...truncated 411 lines...]
BUILD FAILED
/mnt/ssd/jenkins/workspace/Lucene-Solr-trunk-Linux/build.xml:381: The following error occurred while executing this line:
/mnt/ssd/jenkins/workspace/Lucene-Solr-trunk-Linux/build.xml:361: The following error occurred while executing this line:
/mnt/ssd/jenkins/workspace/Lucene-Solr-trunk-Linux/build.xml:39: The following error occurred while executing this line:
/mnt/ssd/jenkins/workspace/Lucene-Solr-trunk-Linux/solr/build.xml:183: The following error occurred while executing this line:
/mnt/ssd/jenkins/workspace/Lucene-Solr-trunk-Linux/solr/common-build.xml:449: The following error occurred while executing this line:
/mnt/ssd/jenkins/workspace/Lucene-Solr-trunk-Linux/lucene/common-build.xml:1213: The following error occurred while executing this line:
/mnt/ssd/jenkins/workspace/Lucene-Solr-trunk-Linux/lucene/common-build.xml:877: There were test failures: 268 suites, 1134 tests, 3 errors, 1 failure, 13 ignored (7 assumptions)

Total time: 46 minutes 27 seconds
Build step 'Invoke Ant' marked build as failure
Archiving artifacts
Recording test results
Description set: Java: 32bit/jdk1.8.0-ea-b79 -client -XX:+UseConcMarkSweepGC
Email was triggered for: Failure
Sending email for trigger: Failure



Mime
View raw message