lucene-dev mailing list archives

Site index · List index
Message view « Date » · « Thread »
Top « Date » · « Thread »
From Apache Jenkins Server <jenk...@builds.apache.org>
Subject [JENKINS-MAVEN] Lucene-Solr-Maven-trunk #799: POMs out of sync
Date Thu, 14 Mar 2013 01:25:44 GMT
Build: https://builds.apache.org/job/Lucene-Solr-Maven-trunk/799/

4 tests failed.
REGRESSION:  org.apache.solr.cloud.BasicDistributedZk2Test.testDistribSearch

Error Message:
No registered leader was found, collection:collection1 slice:shard1

Stack Trace:
org.apache.solr.common.SolrException: No registered leader was found, collection:collection1
slice:shard1
	at __randomizedtesting.SeedInfo.seed([178595AF5561F1CC:96631BB7223E91F0]:0)
	at org.apache.solr.common.cloud.ZkStateReader.getLeaderRetry(ZkStateReader.java:484)
	at org.apache.solr.cloud.BasicDistributedZk2Test.brindDownShardIndexSomeDocsAndRecover(BasicDistributedZk2Test.java:291)
	at org.apache.solr.cloud.BasicDistributedZk2Test.doTest(BasicDistributedZk2Test.java:116)


FAILED:  org.apache.solr.cloud.RecoveryZkTest.org.apache.solr.cloud.RecoveryZkTest

Error Message:
Resource in scope SUITE failed to close. Resource was registered from thread Thread[id=299,
name=coreLoadExecutor-213-thread-1, state=RUNNABLE, group=TGRP-RecoveryZkTest], registration
stack trace below.

Stack Trace:
com.carrotsearch.randomizedtesting.ResourceDisposalError: Resource in scope SUITE failed to
close. Resource was registered from thread Thread[id=299, name=coreLoadExecutor-213-thread-1,
state=RUNNABLE, group=TGRP-RecoveryZkTest], registration stack trace below.
	at org.junit.Assert.fail(Assert.java:93)
	at org.apache.lucene.util.CloseableDirectory.close(CloseableDirectory.java:47)
	at com.carrotsearch.randomizedtesting.RandomizedRunner$2$1.apply(RandomizedRunner.java:602)
	at com.carrotsearch.randomizedtesting.RandomizedRunner$2$1.apply(RandomizedRunner.java:599)
	at com.carrotsearch.randomizedtesting.RandomizedContext.closeResources(RandomizedContext.java:167)
	at com.carrotsearch.randomizedtesting.RandomizedRunner$2.afterAlways(RandomizedRunner.java:615)
	at com.carrotsearch.randomizedtesting.rules.StatementAdapter.evaluate(StatementAdapter.java:43)
	at com.carrotsearch.randomizedtesting.ThreadLeakControl$StatementRunner.run(ThreadLeakControl.java:358)
	at java.lang.Thread.run(Thread.java:679)


FAILED:  org.apache.solr.cloud.RecoveryZkTest.org.apache.solr.cloud.RecoveryZkTest

Error Message:
Resource in scope SUITE failed to close. Resource was registered from thread Thread[id=301,
name=RecoveryThread, state=RUNNABLE, group=TGRP-RecoveryZkTest], registration stack trace
below.

Stack Trace:
com.carrotsearch.randomizedtesting.ResourceDisposalError: Resource in scope SUITE failed to
close. Resource was registered from thread Thread[id=301, name=RecoveryThread, state=RUNNABLE,
group=TGRP-RecoveryZkTest], registration stack trace below.
	at org.junit.Assert.fail(Assert.java:93)
	at org.apache.lucene.util.CloseableDirectory.close(CloseableDirectory.java:47)
	at com.carrotsearch.randomizedtesting.RandomizedRunner$2$1.apply(RandomizedRunner.java:602)
	at com.carrotsearch.randomizedtesting.RandomizedRunner$2$1.apply(RandomizedRunner.java:599)
	at com.carrotsearch.randomizedtesting.RandomizedContext.closeResources(RandomizedContext.java:167)
	at com.carrotsearch.randomizedtesting.RandomizedRunner$2.afterAlways(RandomizedRunner.java:615)
	at com.carrotsearch.randomizedtesting.rules.StatementAdapter.evaluate(StatementAdapter.java:43)
	at com.carrotsearch.randomizedtesting.ThreadLeakControl$StatementRunner.run(ThreadLeakControl.java:358)
	at java.lang.Thread.run(Thread.java:679)


REGRESSION:  org.apache.solr.cloud.SyncSliceTest.testDistribSearch

Error Message:
Test Setup Failure: shard1 should have just been set up to be inconsistent - but it's still
consistent. Leader:http://127.0.0.1:18173/_/collection1skip list:[CloudJettyRunner [url=http://127.0.0.1:11335/_/collection1],
CloudJettyRunner [url=http://127.0.0.1:11335/_/collection1]]

Stack Trace:
java.lang.AssertionError: Test Setup Failure: shard1 should have just been set up to be inconsistent
- but it's still consistent. Leader:http://127.0.0.1:18173/_/collection1skip list:[CloudJettyRunner
[url=http://127.0.0.1:11335/_/collection1], CloudJettyRunner [url=http://127.0.0.1:11335/_/collection1]]
	at __randomizedtesting.SeedInfo.seed([93F5251826B9CEDA:1213AB0051E6AEE6]:0)
	at org.junit.Assert.fail(Assert.java:93)
	at org.junit.Assert.assertTrue(Assert.java:43)
	at org.junit.Assert.assertNotNull(Assert.java:526)
	at org.apache.solr.cloud.SyncSliceTest.doTest(SyncSliceTest.java:212)




Build Log:
[...truncated 22796 lines...]



Mime
View raw message