lucene-dev mailing list archives

Site index · List index
Message view « Date » · « Thread »
Top « Date » · « Thread »
From Apache Jenkins Server <jenk...@builds.apache.org>
Subject [JENKINS] Lucene-Solr-Tests-4.x-Java6 - Build # 1400 - Failure
Date Thu, 07 Mar 2013 09:17:53 GMT
Build: https://builds.apache.org/job/Lucene-Solr-Tests-4.x-Java6/1400/

1 tests failed.
REGRESSION:  org.apache.solr.cloud.SyncSliceTest.testDistribSearch

Error Message:
Test Setup Failure: shard1 should have just been set up to be inconsistent - but it's still consistent. Leader:http://127.0.0.1:22055/collection1skip list:[CloudJettyRunner [url=http://127.0.0.1:17553/collection1], CloudJettyRunner [url=http://127.0.0.1:32078/collection1]]

Stack Trace:
java.lang.AssertionError: Test Setup Failure: shard1 should have just been set up to be inconsistent - but it's still consistent. Leader:http://127.0.0.1:22055/collection1skip list:[CloudJettyRunner [url=http://127.0.0.1:17553/collection1], CloudJettyRunner [url=http://127.0.0.1:32078/collection1]]
	at __randomizedtesting.SeedInfo.seed([99BF8B6D2AA5E597:185905755DFA85AB]:0)
	at org.junit.Assert.fail(Assert.java:93)
	at org.junit.Assert.assertTrue(Assert.java:43)
	at org.junit.Assert.assertNotNull(Assert.java:526)
	at org.apache.solr.cloud.SyncSliceTest.doTest(SyncSliceTest.java:212)
	at org.apache.solr.BaseDistributedSearchTestCase.testDistribSearch(BaseDistributedSearchTestCase.java:806)
	at sun.reflect.NativeMethodAccessorImpl.invoke0(Native Method)
	at sun.reflect.NativeMethodAccessorImpl.invoke(NativeMethodAccessorImpl.java:57)
	at sun.reflect.DelegatingMethodAccessorImpl.invoke(DelegatingMethodAccessorImpl.java:43)
	at java.lang.reflect.Method.invoke(Method.java:616)
	at com.carrotsearch.randomizedtesting.RandomizedRunner.invoke(RandomizedRunner.java:1559)
	at com.carrotsearch.randomizedtesting.RandomizedRunner.access$600(RandomizedRunner.java:79)
	at com.carrotsearch.randomizedtesting.RandomizedRunner$6.evaluate(RandomizedRunner.java:737)
	at com.carrotsearch.randomizedtesting.RandomizedRunner$7.evaluate(RandomizedRunner.java:773)
	at com.carrotsearch.randomizedtesting.RandomizedRunner$8.evaluate(RandomizedRunner.java:787)
	at com.carrotsearch.randomizedtesting.rules.SystemPropertiesRestoreRule$1.evaluate(SystemPropertiesRestoreRule.java:53)
	at org.apache.lucene.util.TestRuleSetupTeardownChained$1.evaluate(TestRuleSetupTeardownChained.java:50)
	at org.apache.lucene.util.TestRuleFieldCacheSanity$1.evaluate(TestRuleFieldCacheSanity.java:51)
	at org.apache.lucene.util.AbstractBeforeAfterRule$1.evaluate(AbstractBeforeAfterRule.java:46)
	at com.carrotsearch.randomizedtesting.rules.SystemPropertiesInvariantRule$1.evaluate(SystemPropertiesInvariantRule.java:55)
	at org.apache.lucene.util.TestRuleThreadAndTestName$1.evaluate(TestRuleThreadAndTestName.java:49)
	at org.apache.lucene.util.TestRuleIgnoreAfterMaxFailures$1.evaluate(TestRuleIgnoreAfterMaxFailures.java:70)
	at org.apache.lucene.util.TestRuleMarkFailure$1.evaluate(TestRuleMarkFailure.java:48)
	at com.carrotsearch.randomizedtesting.rules.StatementAdapter.evaluate(StatementAdapter.java:36)
	at com.carrotsearch.randomizedtesting.ThreadLeakControl$StatementRunner.run(ThreadLeakControl.java:358)
	at com.carrotsearch.randomizedtesting.ThreadLeakControl.forkTimeoutingTask(ThreadLeakControl.java:782)
	at com.carrotsearch.randomizedtesting.ThreadLeakControl$3.evaluate(ThreadLeakControl.java:442)
	at com.carrotsearch.randomizedtesting.RandomizedRunner.runSingleTest(RandomizedRunner.java:746)
	at com.carrotsearch.randomizedtesting.RandomizedRunner$3.evaluate(RandomizedRunner.java:648)
	at com.carrotsearch.randomizedtesting.RandomizedRunner$4.evaluate(RandomizedRunner.java:682)
	at com.carrotsearch.randomizedtesting.RandomizedRunner$5.evaluate(RandomizedRunner.java:693)
	at com.carrotsearch.randomizedtesting.rules.StatementAdapter.evaluate(StatementAdapter.java:36)
	at com.carrotsearch.randomizedtesting.rules.SystemPropertiesRestoreRule$1.evaluate(SystemPropertiesRestoreRule.java:53)
	at org.apache.lucene.util.AbstractBeforeAfterRule$1.evaluate(AbstractBeforeAfterRule.java:46)
	at org.apache.lucene.util.TestRuleStoreClassName$1.evaluate(TestRuleStoreClassName.java:42)
	at com.carrotsearch.randomizedtesting.rules.SystemPropertiesInvariantRule$1.evaluate(SystemPropertiesInvariantRule.java:55)
	at com.carrotsearch.randomizedtesting.rules.NoShadowingOrOverridesOnMethodsRule$1.evaluate(NoShadowingOrOverridesOnMethodsRule.java:39)
	at com.carrotsearch.randomizedtesting.rules.NoShadowingOrOverridesOnMethodsRule$1.evaluate(NoShadowingOrOverridesOnMethodsRule.java:39)
	at com.carrotsearch.randomizedtesting.rules.StatementAdapter.evaluate(StatementAdapter.java:36)
	at org.apache.lucene.util.TestRuleAssertionsRequired$1.evaluate(TestRuleAssertionsRequired.java:43)
	at org.apache.lucene.util.TestRuleMarkFailure$1.evaluate(TestRuleMarkFailure.java:48)
	at org.apache.lucene.util.TestRuleIgnoreAfterMaxFailures$1.evaluate(TestRuleIgnoreAfterMaxFailures.java:70)
	at org.apache.lucene.util.TestRuleIgnoreTestSuites$1.evaluate(TestRuleIgnoreTestSuites.java:55)
	at com.carrotsearch.randomizedtesting.rules.StatementAdapter.evaluate(StatementAdapter.java:36)
	at com.carrotsearch.randomizedtesting.ThreadLeakControl$StatementRunner.run(ThreadLeakControl.java:358)
	at java.lang.Thread.run(Thread.java:679)




Build Log:
[...truncated 8575 lines...]
[junit4:junit4] Suite: org.apache.solr.cloud.SyncSliceTest
[junit4:junit4]   2> 0 T1731 oas.BaseDistributedSearchTestCase.initHostContext Setting hostContext system property: /
[junit4:junit4]   2> 4 T1731 oas.SolrTestCaseJ4.setUp ###Starting testDistribSearch
[junit4:junit4]   2> Creating dataDir: /usr/home/hudson/hudson-slave/workspace/Lucene-Solr-Tests-4.x-Java6/solr/build/solr-core/test/J0/./solrtest-SyncSliceTest-1362647095390
[junit4:junit4]   2> 5 T1731 oasc.ZkTestServer.run STARTING ZK TEST SERVER
[junit4:junit4]   2> 5 T1732 oasc.ZkTestServer$ZKServerMain.runFromConfig Starting server
[junit4:junit4]   2> 8 T1732 oazs.ZooKeeperServer.setTickTime tickTime set to 1000
[junit4:junit4]   2> 8 T1732 oazs.ZooKeeperServer.setMinSessionTimeout minSessionTimeout set to -1
[junit4:junit4]   2> 8 T1732 oazs.ZooKeeperServer.setMaxSessionTimeout maxSessionTimeout set to -1
[junit4:junit4]   2> 8 T1732 oazs.NIOServerCnxnFactory.configure binding to port 0.0.0.0/0.0.0.0:0
[junit4:junit4]   2> 9 T1732 oazsp.FileTxnSnapLog.save Snapshotting: 0x0 to /usr/home/hudson/hudson-slave/workspace/Lucene-Solr-Tests-4.x-Java6/solr/build/solr-core/test/J0/./org.apache.solr.cloud.SyncSliceTest-1362647095390/zookeeper/server1/data/version-2/snapshot.0
[junit4:junit4]   2> 106 T1731 oasc.ZkTestServer.run start zk server on port:58213
[junit4:junit4]   2> 106 T1731 oaz.ZooKeeper.<init> Initiating client connection, connectString=127.0.0.1:58213 sessionTimeout=10000 watcher=org.apache.solr.common.cloud.ConnectionManager@5ef4141b
[junit4:junit4]   2> 107 T1731 oascc.ConnectionManager.waitForConnected Waiting for client to connect to ZooKeeper
[junit4:junit4]   2> 107 T1737 oaz.ClientCnxn$SendThread.logStartConnect Opening socket connection to server localhost/127.0.0.1:58213. Will not attempt to authenticate using SASL (access denied (javax.security.auth.AuthPermission getLoginConfiguration))
[junit4:junit4]   2> 108 T1737 oaz.ClientCnxn$SendThread.primeConnection Socket connection established to localhost/127.0.0.1:58213, initiating session
[junit4:junit4]   2> 108 T1733 oazs.NIOServerCnxnFactory.run Accepted socket connection from /140.211.11.196:58214
[junit4:junit4]   2> 108 T1733 oazs.ZooKeeperServer.processConnectRequest Client attempting to establish new session at /140.211.11.196:58214
[junit4:junit4]   2> 109 T1735 oazsp.FileTxnLog.append Creating new log file: log.1
[junit4:junit4]   2> 141 T1735 oazs.ZooKeeperServer.finishSessionInit Established session 0x13d441898640000 with negotiated timeout 10000 for client /140.211.11.196:58214
[junit4:junit4]   2> 141 T1737 oaz.ClientCnxn$SendThread.onConnected Session establishment complete on server localhost/127.0.0.1:58213, sessionid = 0x13d441898640000, negotiated timeout = 10000
[junit4:junit4]   2> 141 T1738 oascc.ConnectionManager.process Watcher org.apache.solr.common.cloud.ConnectionManager@5ef4141b name:ZooKeeperConnection Watcher:127.0.0.1:58213 got event WatchedEvent state:SyncConnected type:None path:null path:null type:None
[junit4:junit4]   2> 141 T1731 oascc.ConnectionManager.waitForConnected Client is connected to ZooKeeper
[junit4:junit4]   2> 142 T1731 oascc.SolrZkClient.makePath makePath: /solr
[junit4:junit4]   2> 156 T1736 oazs.PrepRequestProcessor.pRequest2Txn Processed session termination for sessionid: 0x13d441898640000
[junit4:junit4]   2> 157 T1738 oaz.ClientCnxn$EventThread.run EventThread shut down
[junit4:junit4]   2> 158 T1733 oazs.NIOServerCnxn.closeSock Closed socket connection for client /140.211.11.196:58214 which had sessionid 0x13d441898640000
[junit4:junit4]   2> 157 T1731 oaz.ZooKeeper.close Session: 0x13d441898640000 closed
[junit4:junit4]   2> 158 T1731 oaz.ZooKeeper.<init> Initiating client connection, connectString=127.0.0.1:58213/solr sessionTimeout=10000 watcher=org.apache.solr.common.cloud.ConnectionManager@b593a85
[junit4:junit4]   2> 158 T1731 oascc.ConnectionManager.waitForConnected Waiting for client to connect to ZooKeeper
[junit4:junit4]   2> 159 T1739 oaz.ClientCnxn$SendThread.logStartConnect Opening socket connection to server localhost/127.0.0.1:58213. Will not attempt to authenticate using SASL (access denied (javax.security.auth.AuthPermission getLoginConfiguration))
[junit4:junit4]   2> 159 T1739 oaz.ClientCnxn$SendThread.primeConnection Socket connection established to localhost/127.0.0.1:58213, initiating session
[junit4:junit4]   2> 159 T1733 oazs.NIOServerCnxnFactory.run Accepted socket connection from /140.211.11.196:58215
[junit4:junit4]   2> 159 T1733 oazs.ZooKeeperServer.processConnectRequest Client attempting to establish new session at /140.211.11.196:58215
[junit4:junit4]   2> 160 T1735 oazs.ZooKeeperServer.finishSessionInit Established session 0x13d441898640001 with negotiated timeout 10000 for client /140.211.11.196:58215
[junit4:junit4]   2> 160 T1739 oaz.ClientCnxn$SendThread.onConnected Session establishment complete on server localhost/127.0.0.1:58213, sessionid = 0x13d441898640001, negotiated timeout = 10000
[junit4:junit4]   2> 161 T1740 oascc.ConnectionManager.process Watcher org.apache.solr.common.cloud.ConnectionManager@b593a85 name:ZooKeeperConnection Watcher:127.0.0.1:58213/solr got event WatchedEvent state:SyncConnected type:None path:null path:null type:None
[junit4:junit4]   2> 161 T1731 oascc.ConnectionManager.waitForConnected Client is connected to ZooKeeper
[junit4:junit4]   2> 161 T1731 oascc.SolrZkClient.makePath makePath: /collections/collection1
[junit4:junit4]   2> 170 T1731 oascc.SolrZkClient.makePath makePath: /collections/collection1/shards
[junit4:junit4]   2> 173 T1731 oascc.SolrZkClient.makePath makePath: /collections/control_collection
[junit4:junit4]   2> 181 T1731 oascc.SolrZkClient.makePath makePath: /collections/control_collection/shards
[junit4:junit4]   2> 184 T1731 oasc.AbstractZkTestCase.putConfig put /usr/home/hudson/hudson-slave/workspace/Lucene-Solr-Tests-4.x-Java6/solr/build/solr-core/test-files/solr/collection1/conf/solrconfig-tlog.xml to /configs/conf1/solrconfig.xml
[junit4:junit4]   2> 184 T1731 oascc.SolrZkClient.makePath makePath: /configs/conf1/solrconfig.xml
[junit4:junit4]   2> 195 T1731 oasc.AbstractZkTestCase.putConfig put /usr/home/hudson/hudson-slave/workspace/Lucene-Solr-Tests-4.x-Java6/solr/build/solr-core/test-files/solr/collection1/conf/schema.xml to /configs/conf1/schema.xml
[junit4:junit4]   2> 196 T1731 oascc.SolrZkClient.makePath makePath: /configs/conf1/schema.xml
[junit4:junit4]   2> 300 T1731 oasc.AbstractZkTestCase.putConfig put /usr/home/hudson/hudson-slave/workspace/Lucene-Solr-Tests-4.x-Java6/solr/build/solr-core/test-files/solr/collection1/conf/stopwords.txt to /configs/conf1/stopwords.txt
[junit4:junit4]   2> 300 T1731 oascc.SolrZkClient.makePath makePath: /configs/conf1/stopwords.txt
[junit4:junit4]   2> 303 T1731 oasc.AbstractZkTestCase.putConfig put /usr/home/hudson/hudson-slave/workspace/Lucene-Solr-Tests-4.x-Java6/solr/build/solr-core/test-files/solr/collection1/conf/protwords.txt to /configs/conf1/protwords.txt
[junit4:junit4]   2> 304 T1731 oascc.SolrZkClient.makePath makePath: /configs/conf1/protwords.txt
[junit4:junit4]   2> 316 T1731 oasc.AbstractZkTestCase.putConfig put /usr/home/hudson/hudson-slave/workspace/Lucene-Solr-Tests-4.x-Java6/solr/build/solr-core/test-files/solr/collection1/conf/currency.xml to /configs/conf1/currency.xml
[junit4:junit4]   2> 316 T1731 oascc.SolrZkClient.makePath makePath: /configs/conf1/currency.xml
[junit4:junit4]   2> 319 T1731 oasc.AbstractZkTestCase.putConfig put /usr/home/hudson/hudson-slave/workspace/Lucene-Solr-Tests-4.x-Java6/solr/build/solr-core/test-files/solr/collection1/conf/open-exchange-rates.json to /configs/conf1/open-exchange-rates.json
[junit4:junit4]   2> 320 T1731 oascc.SolrZkClient.makePath makePath: /configs/conf1/open-exchange-rates.json
[junit4:junit4]   2> 323 T1731 oasc.AbstractZkTestCase.putConfig put /usr/home/hudson/hudson-slave/workspace/Lucene-Solr-Tests-4.x-Java6/solr/build/solr-core/test-files/solr/collection1/conf/mapping-ISOLatin1Accent.txt to /configs/conf1/mapping-ISOLatin1Accent.txt
[junit4:junit4]   2> 323 T1731 oascc.SolrZkClient.makePath makePath: /configs/conf1/mapping-ISOLatin1Accent.txt
[junit4:junit4]   2> 326 T1731 oasc.AbstractZkTestCase.putConfig put /usr/home/hudson/hudson-slave/workspace/Lucene-Solr-Tests-4.x-Java6/solr/build/solr-core/test-files/solr/collection1/conf/old_synonyms.txt to /configs/conf1/old_synonyms.txt
[junit4:junit4]   2> 326 T1731 oascc.SolrZkClient.makePath makePath: /configs/conf1/old_synonyms.txt
[junit4:junit4]   2> 334 T1731 oasc.AbstractZkTestCase.putConfig put /usr/home/hudson/hudson-slave/workspace/Lucene-Solr-Tests-4.x-Java6/solr/build/solr-core/test-files/solr/collection1/conf/synonyms.txt to /configs/conf1/synonyms.txt
[junit4:junit4]   2> 334 T1731 oascc.SolrZkClient.makePath makePath: /configs/conf1/synonyms.txt
[junit4:junit4]   2> 337 T1736 oazs.PrepRequestProcessor.pRequest2Txn Processed session termination for sessionid: 0x13d441898640001
[junit4:junit4]   2> 338 T1740 oaz.ClientCnxn$EventThread.run EventThread shut down
[junit4:junit4]   2> 338 T1731 oaz.ZooKeeper.close Session: 0x13d441898640001 closed
[junit4:junit4]   2> 338 T1733 oazs.NIOServerCnxn.closeSock Closed socket connection for client /140.211.11.196:58215 which had sessionid 0x13d441898640001
[junit4:junit4]   2> 472 T1731 oejs.Server.doStart jetty-8.1.8.v20121106
[junit4:junit4]   2> 475 T1731 oejs.AbstractConnector.doStart Started SocketConnector@127.0.0.1:65328
[junit4:junit4]   2> 476 T1731 oass.SolrDispatchFilter.init SolrDispatchFilter.init()
[junit4:junit4]   2> 476 T1731 oasc.SolrResourceLoader.locateSolrHome JNDI not configured for solr (NoInitialContextEx)
[junit4:junit4]   2> 477 T1731 oasc.SolrResourceLoader.locateSolrHome using system property solr.solr.home: /usr/home/hudson/hudson-slave/workspace/Lucene-Solr-Tests-4.x-Java6/solr/build/solr-core/test/J0/./org.apache.solr.cloud.SyncSliceTest-controljetty-1362647095724
[junit4:junit4]   2> 477 T1731 oasc.CoreContainer$Initializer.initialize looking for solr.xml: /usr/home/hudson/hudson-slave/workspace/Lucene-Solr-Tests-4.x-Java6/solr/build/solr-core/test/J0/./org.apache.solr.cloud.SyncSliceTest-controljetty-1362647095724/solr.xml
[junit4:junit4]   2> 477 T1731 oasc.CoreContainer.<init> New CoreContainer 1189430502
[junit4:junit4]   2> 478 T1731 oasc.CoreContainer.load Loading CoreContainer using Solr Home: '/usr/home/hudson/hudson-slave/workspace/Lucene-Solr-Tests-4.x-Java6/solr/build/solr-core/test/J0/./org.apache.solr.cloud.SyncSliceTest-controljetty-1362647095724/'
[junit4:junit4]   2> 478 T1731 oasc.SolrResourceLoader.<init> new SolrResourceLoader for directory: '/usr/home/hudson/hudson-slave/workspace/Lucene-Solr-Tests-4.x-Java6/solr/build/solr-core/test/J0/./org.apache.solr.cloud.SyncSliceTest-controljetty-1362647095724/'
[junit4:junit4]   2> 514 T1731 oashc.HttpShardHandlerFactory.getParameter Setting socketTimeout to: 120000
[junit4:junit4]   2> 515 T1731 oashc.HttpShardHandlerFactory.getParameter Setting urlScheme to: http://
[junit4:junit4]   2> 515 T1731 oashc.HttpShardHandlerFactory.getParameter Setting connTimeout to: 15000
[junit4:junit4]   2> 516 T1731 oashc.HttpShardHandlerFactory.getParameter Setting maxConnectionsPerHost to: 20
[junit4:junit4]   2> 516 T1731 oashc.HttpShardHandlerFactory.getParameter Setting corePoolSize to: 0
[junit4:junit4]   2> 516 T1731 oashc.HttpShardHandlerFactory.getParameter Setting maximumPoolSize to: 2147483647
[junit4:junit4]   2> 516 T1731 oashc.HttpShardHandlerFactory.getParameter Setting maxThreadIdleTime to: 5
[junit4:junit4]   2> 517 T1731 oashc.HttpShardHandlerFactory.getParameter Setting sizeOfQueue to: -1
[junit4:junit4]   2> 517 T1731 oashc.HttpShardHandlerFactory.getParameter Setting fairnessPolicy to: false
[junit4:junit4]   2> 517 T1731 oascsi.HttpClientUtil.createClient Creating new http client, config:maxConnectionsPerHost=20&maxConnections=10000&socketTimeout=120000&connTimeout=15000&retry=false
[junit4:junit4]   2> 531 T1731 oasc.CoreContainer.load Registering Log Listener
[junit4:junit4]   2> 546 T1731 oasc.CoreContainer.initZooKeeper Zookeeper client=127.0.0.1:58213/solr
[junit4:junit4]   2> 546 T1731 oasc.ZkController.checkChrootPath zkHost includes chroot
[junit4:junit4]   2> 547 T1731 oaz.ZooKeeper.<init> Initiating client connection, connectString=127.0.0.1:58213 sessionTimeout=60000 watcher=org.apache.solr.common.cloud.ConnectionManager@31094917
[junit4:junit4]   2> 547 T1731 oascc.ConnectionManager.waitForConnected Waiting for client to connect to ZooKeeper
[junit4:junit4]   2> 548 T1750 oaz.ClientCnxn$SendThread.logStartConnect Opening socket connection to server localhost/127.0.0.1:58213. Will not attempt to authenticate using SASL (access denied (javax.security.auth.AuthPermission getLoginConfiguration))
[junit4:junit4]   2> 549 T1750 oaz.ClientCnxn$SendThread.primeConnection Socket connection established to localhost/127.0.0.1:58213, initiating session
[junit4:junit4]   2> 549 T1733 oazs.NIOServerCnxnFactory.run Accepted socket connection from /140.211.11.196:38314
[junit4:junit4]   2> 549 T1733 oazs.ZooKeeperServer.processConnectRequest Client attempting to establish new session at /140.211.11.196:38314
[junit4:junit4]   2> 551 T1735 oazs.ZooKeeperServer.finishSessionInit Established session 0x13d441898640002 with negotiated timeout 20000 for client /140.211.11.196:38314
[junit4:junit4]   2> 551 T1750 oaz.ClientCnxn$SendThread.onConnected Session establishment complete on server localhost/127.0.0.1:58213, sessionid = 0x13d441898640002, negotiated timeout = 20000
[junit4:junit4]   2> 551 T1751 oascc.ConnectionManager.process Watcher org.apache.solr.common.cloud.ConnectionManager@31094917 name:ZooKeeperConnection Watcher:127.0.0.1:58213 got event WatchedEvent state:SyncConnected type:None path:null path:null type:None
[junit4:junit4]   2> 552 T1731 oascc.ConnectionManager.waitForConnected Client is connected to ZooKeeper
[junit4:junit4]   2> 553 T1736 oazs.PrepRequestProcessor.pRequest2Txn Processed session termination for sessionid: 0x13d441898640002
[junit4:junit4]   2> 554 T1751 oaz.ClientCnxn$EventThread.run EventThread shut down
[junit4:junit4]   2> 554 T1733 oazs.NIOServerCnxn.closeSock Closed socket connection for client /140.211.11.196:38314 which had sessionid 0x13d441898640002
[junit4:junit4]   2> 554 T1731 oaz.ZooKeeper.close Session: 0x13d441898640002 closed
[junit4:junit4]   2> 554 T1731 oascsi.HttpClientUtil.createClient Creating new http client, config:maxConnections=500&maxConnectionsPerHost=16&socketTimeout=120000&connTimeout=15000
[junit4:junit4]   2> 560 T1731 oaz.ZooKeeper.<init> Initiating client connection, connectString=127.0.0.1:58213/solr sessionTimeout=30000 watcher=org.apache.solr.common.cloud.ConnectionManager@45fdc0dc
[junit4:junit4]   2> 561 T1731 oascc.ConnectionManager.waitForConnected Waiting for client to connect to ZooKeeper
[junit4:junit4]   2> 561 T1752 oaz.ClientCnxn$SendThread.logStartConnect Opening socket connection to server localhost/127.0.0.1:58213. Will not attempt to authenticate using SASL (access denied (javax.security.auth.AuthPermission getLoginConfiguration))
[junit4:junit4]   2> 562 T1752 oaz.ClientCnxn$SendThread.primeConnection Socket connection established to localhost/127.0.0.1:58213, initiating session
[junit4:junit4]   2> 562 T1733 oazs.NIOServerCnxnFactory.run Accepted socket connection from /140.211.11.196:21473
[junit4:junit4]   2> 562 T1733 oazs.ZooKeeperServer.processConnectRequest Client attempting to establish new session at /140.211.11.196:21473
[junit4:junit4]   2> 563 T1735 oazs.ZooKeeperServer.finishSessionInit Established session 0x13d441898640003 with negotiated timeout 20000 for client /140.211.11.196:21473
[junit4:junit4]   2> 563 T1752 oaz.ClientCnxn$SendThread.onConnected Session establishment complete on server localhost/127.0.0.1:58213, sessionid = 0x13d441898640003, negotiated timeout = 20000
[junit4:junit4]   2> 564 T1753 oascc.ConnectionManager.process Watcher org.apache.solr.common.cloud.ConnectionManager@45fdc0dc name:ZooKeeperConnection Watcher:127.0.0.1:58213/solr got event WatchedEvent state:SyncConnected type:None path:null path:null type:None
[junit4:junit4]   2> 564 T1731 oascc.ConnectionManager.waitForConnected Client is connected to ZooKeeper
[junit4:junit4]   2> 565 T1736 oazs.PrepRequestProcessor.pRequest Got user-level KeeperException when processing sessionid:0x13d441898640003 type:create cxid:0x2 zxid:0x1a txntype:-1 reqpath:n/a Error Path:/solr/overseer Error:KeeperErrorCode = NodeExists for /solr/overseer
[junit4:junit4]   2> 567 T1731 oascc.SolrZkClient.makePath makePath: /live_nodes
[junit4:junit4]   2> 568 T1731 oasc.ZkController.createEphemeralLiveNode Register node as live in ZooKeeper:/live_nodes/127.0.0.1:65328_
[junit4:junit4]   2> 569 T1736 oazs.PrepRequestProcessor.pRequest Got user-level KeeperException when processing sessionid:0x13d441898640003 type:delete cxid:0x8 zxid:0x1c txntype:-1 reqpath:n/a Error Path:/solr/live_nodes/127.0.0.1:65328_ Error:KeeperErrorCode = NoNode for /solr/live_nodes/127.0.0.1:65328_
[junit4:junit4]   2> 570 T1731 oascc.SolrZkClient.makePath makePath: /live_nodes/127.0.0.1:65328_
[junit4:junit4]   2> 573 T1731 oascc.SolrZkClient.makePath makePath: /overseer_elect/election
[junit4:junit4]   2> 584 T1736 oazs.PrepRequestProcessor.pRequest Got user-level KeeperException when processing sessionid:0x13d441898640003 type:delete cxid:0x16 zxid:0x21 txntype:-1 reqpath:n/a Error Path:/solr/overseer_elect/leader Error:KeeperErrorCode = NoNode for /solr/overseer_elect/leader
[junit4:junit4]   2> 586 T1731 oascc.SolrZkClient.makePath makePath: /overseer_elect/leader
[junit4:junit4]   2> 588 T1731 oasc.Overseer.start Overseer (id=89302440043872259-127.0.0.1:65328_-n_0000000000) starting
[junit4:junit4]   2> 589 T1736 oazs.PrepRequestProcessor.pRequest Got user-level KeeperException when processing sessionid:0x13d441898640003 type:create cxid:0x1b zxid:0x23 txntype:-1 reqpath:n/a Error Path:/solr/overseer Error:KeeperErrorCode = NodeExists for /solr/overseer
[junit4:junit4]   2> 590 T1736 oazs.PrepRequestProcessor.pRequest Got user-level KeeperException when processing sessionid:0x13d441898640003 type:create cxid:0x1c zxid:0x24 txntype:-1 reqpath:n/a Error Path:/solr/overseer Error:KeeperErrorCode = NodeExists for /solr/overseer
[junit4:junit4]   2> 591 T1736 oazs.PrepRequestProcessor.pRequest Got user-level KeeperException when processing sessionid:0x13d441898640003 type:create cxid:0x1d zxid:0x25 txntype:-1 reqpath:n/a Error Path:/solr/overseer Error:KeeperErrorCode = NodeExists for /solr/overseer
[junit4:junit4]   2> 592 T1736 oazs.PrepRequestProcessor.pRequest Got user-level KeeperException when processing sessionid:0x13d441898640003 type:create cxid:0x1e zxid:0x26 txntype:-1 reqpath:n/a Error Path:/solr/overseer Error:KeeperErrorCode = NodeExists for /solr/overseer
[junit4:junit4]   2> 601 T1755 oasc.OverseerCollectionProcessor.run Process current queue of collection creations
[junit4:junit4]   2> 602 T1731 oascc.SolrZkClient.makePath makePath: /clusterstate.json
[junit4:junit4]   2> 613 T1731 oascc.SolrZkClient.makePath makePath: /aliases.json
[junit4:junit4]   2> 664 T1731 oascc.ZkStateReader.createClusterStateWatchersAndUpdate Updating cluster state from ZooKeeper... 
[junit4:junit4]   2> 667 T1754 oasc.Overseer$ClusterStateUpdater.run Starting to work on the main queue
[junit4:junit4]   2> 670 T1756 oasc.CoreContainer.create Creating SolrCore 'collection1' using instanceDir: /usr/home/hudson/hudson-slave/workspace/Lucene-Solr-Tests-4.x-Java6/solr/build/solr-core/test/J0/./org.apache.solr.cloud.SyncSliceTest-controljetty-1362647095724/collection1
[junit4:junit4]   2> 670 T1756 oasc.ZkController.createCollectionZkNode Check for collection zkNode:control_collection
[junit4:junit4]   2> 671 T1756 oasc.ZkController.createCollectionZkNode Collection zkNode exists
[junit4:junit4]   2> 671 T1756 oasc.ZkController.readConfigName Load collection config from:/collections/control_collection
[junit4:junit4]   2> 673 T1756 oasc.SolrResourceLoader.<init> new SolrResourceLoader for directory: '/usr/home/hudson/hudson-slave/workspace/Lucene-Solr-Tests-4.x-Java6/solr/build/solr-core/test/J0/./org.apache.solr.cloud.SyncSliceTest-controljetty-1362647095724/collection1/'
[junit4:junit4]   2> 690 T1756 oasc.SolrResourceLoader.replaceClassLoader Adding 'file:/usr/home/hudson/hudson-slave/workspace/Lucene-Solr-Tests-4.x-Java6/solr/build/solr-core/test/J0/org.apache.solr.cloud.SyncSliceTest-controljetty-1362647095724/collection1/lib/classes/' to classloader
[junit4:junit4]   2> 690 T1756 oasc.SolrResourceLoader.replaceClassLoader Adding 'file:/usr/home/hudson/hudson-slave/workspace/Lucene-Solr-Tests-4.x-Java6/solr/build/solr-core/test/J0/org.apache.solr.cloud.SyncSliceTest-controljetty-1362647095724/collection1/lib/README' to classloader
[junit4:junit4]   2> 741 T1756 oasc.SolrConfig.<init> Using Lucene MatchVersion: LUCENE_42
[junit4:junit4]   2> 796 T1756 oasc.SolrConfig.<init> Loaded SolrConfig: solrconfig.xml
[junit4:junit4]   2> 897 T1756 oass.IndexSchema.readSchema Reading Solr Schema
[junit4:junit4]   2> 914 T1756 oass.IndexSchema.readSchema Schema name=test
[junit4:junit4]   2> 1422 T1756 oass.OpenExchangeRatesOrgProvider.init Initialized with rates=open-exchange-rates.json, refreshInterval=1440.
[junit4:junit4]   2> 1429 T1756 oass.IndexSchema.readSchema default search field in schema is text
[junit4:junit4]   2> 1432 T1756 oass.IndexSchema.readSchema unique key field: id
[junit4:junit4]   2> 1444 T1756 oass.FileExchangeRateProvider.reload Reloading exchange rates from file currency.xml
[junit4:junit4]   2> 1448 T1756 oass.FileExchangeRateProvider.reload Reloading exchange rates from file currency.xml
[junit4:junit4]   2> 1452 T1756 oass.OpenExchangeRatesOrgProvider.reload Reloading exchange rates from open-exchange-rates.json
[junit4:junit4]   2> 1452 T1756 oass.OpenExchangeRatesOrgProvider$OpenExchangeRates.<init> WARNING Unknown key IMPORTANT NOTE
[junit4:junit4]   2> 1453 T1756 oass.OpenExchangeRatesOrgProvider$OpenExchangeRates.<init> WARNING Expected key, got STRING
[junit4:junit4]   2> 1453 T1756 oass.OpenExchangeRatesOrgProvider.reload Reloading exchange rates from open-exchange-rates.json
[junit4:junit4]   2> 1454 T1756 oass.OpenExchangeRatesOrgProvider$OpenExchangeRates.<init> WARNING Unknown key IMPORTANT NOTE
[junit4:junit4]   2> 1454 T1756 oass.OpenExchangeRatesOrgProvider$OpenExchangeRates.<init> WARNING Expected key, got STRING
[junit4:junit4]   2> 1454 T1756 oasc.SolrCore.<init> [collection1] Opening new SolrCore at /usr/home/hudson/hudson-slave/workspace/Lucene-Solr-Tests-4.x-Java6/solr/build/solr-core/test/J0/./org.apache.solr.cloud.SyncSliceTest-controljetty-1362647095724/collection1/, dataDir=./org.apache.solr.cloud.SyncSliceTest-1362647095390/control/data/
[junit4:junit4]   2> 1454 T1756 oasc.JmxMonitoredMap.<init> JMX monitoring is enabled. Adding Solr mbeans to JMX Server: com.sun.jmx.mbeanserver.JmxMBeanServer@5c4b82d2
[junit4:junit4]   2> 1455 T1756 oasc.SolrCore.initDirectoryFactory org.apache.solr.core.MockDirectoryFactory
[junit4:junit4]   2> 1455 T1756 oasc.CachingDirectoryFactory.get return new directory for /usr/home/hudson/hudson-slave/workspace/Lucene-Solr-Tests-4.x-Java6/solr/build/solr-core/test/J0/./org.apache.solr.cloud.SyncSliceTest-1362647095390/control/data forceNew: false
[junit4:junit4]   2> 1456 T1756 oasc.SolrCore.getNewIndexDir New index directory detected: old=null new=./org.apache.solr.cloud.SyncSliceTest-1362647095390/control/data/index/
[junit4:junit4]   2> 1456 T1756 oasc.SolrCore.initIndex WARNING [collection1] Solr index directory './org.apache.solr.cloud.SyncSliceTest-1362647095390/control/data/index' doesn't exist. Creating new index...
[junit4:junit4]   2> 1456 T1756 oasc.CachingDirectoryFactory.get return new directory for /usr/home/hudson/hudson-slave/workspace/Lucene-Solr-Tests-4.x-Java6/solr/build/solr-core/test/J0/./org.apache.solr.cloud.SyncSliceTest-1362647095390/control/data/index forceNew: false
[junit4:junit4]   2> 1459 T1756 oasc.SolrDeletionPolicy.onCommit SolrDeletionPolicy.onCommit: commits:num=1
[junit4:junit4]   2> 		commit{dir=MockDirWrapper(org.apache.lucene.store.RAMDirectory@36fea922 lockFactory=org.apache.lucene.store.NativeFSLockFactory@1b6cd3c),segFN=segments_1,generation=1,filenames=[segments_1]
[junit4:junit4]   2> 1459 T1756 oasc.SolrDeletionPolicy.updateCommits newest commit = 1[segments_1]
[junit4:junit4]   2> 1460 T1756 oasup.UpdateRequestProcessorChain.init inserting DistributedUpdateProcessorFactory into updateRequestProcessorChain "dedupe"
[junit4:junit4]   2> 1461 T1756 oasup.UpdateRequestProcessorChain.init inserting DistributedUpdateProcessorFactory into updateRequestProcessorChain "stored_sig"
[junit4:junit4]   2> 1461 T1756 oasup.UpdateRequestProcessorChain.init inserting DistributedUpdateProcessorFactory into updateRequestProcessorChain "distrib-dup-test-chain-implicit"
[junit4:junit4]   2> 1461 T1756 oasc.RequestHandlers.initHandlersFromConfig created standard: solr.StandardRequestHandler
[junit4:junit4]   2> 1462 T1756 oasc.RequestHandlers.initHandlersFromConfig created /get: solr.RealTimeGetHandler
[junit4:junit4]   2> 1462 T1756 oasc.RequestHandlers.initHandlersFromConfig adding lazy requestHandler: solr.ReplicationHandler
[junit4:junit4]   2> 1462 T1756 oasc.RequestHandlers.initHandlersFromConfig created /replication: solr.ReplicationHandler
[junit4:junit4]   2> 1462 T1756 oasc.RequestHandlers.initHandlersFromConfig created /update: solr.UpdateRequestHandler
[junit4:junit4]   2> 1463 T1756 oasc.RequestHandlers.initHandlersFromConfig created /admin/: org.apache.solr.handler.admin.AdminHandlers
[junit4:junit4]   2> 1467 T1756 oashl.XMLLoader.init xsltCacheLifetimeSeconds=60
[junit4:junit4]   2> 1471 T1756 oass.SolrIndexSearcher.<init> Opening Searcher@5a42a678 main
[junit4:junit4]   2> 1472 T1756 oasu.UpdateHandler.clearLog Clearing tlog files, tlogDir=./org.apache.solr.cloud.SyncSliceTest-1362647095390/control/data/tlog
[junit4:junit4]   2> 1473 T1756 oasu.CommitTracker.<init> Hard AutoCommit: disabled
[junit4:junit4]   2> 1473 T1756 oasu.CommitTracker.<init> Soft AutoCommit: disabled
[junit4:junit4]   2> 1475 T1757 oasc.SolrCore.registerSearcher [collection1] Registered new searcher Searcher@5a42a678 main{StandardDirectoryReader(segments_1:1)}
[junit4:junit4]   2> 1476 T1756 oasc.ZkController.publish publishing core=collection1 state=down
[junit4:junit4]   2> 1476 T1756 oasc.ZkController.publish numShards not found on descriptor - reading it from system property
[junit4:junit4]   2> 1477 T1736 oazs.PrepRequestProcessor.pRequest Got user-level KeeperException when processing sessionid:0x13d441898640003 type:create cxid:0x55 zxid:0x2a txntype:-1 reqpath:n/a Error Path:/solr/overseer/queue Error:KeeperErrorCode = NoNode for /solr/overseer/queue
[junit4:junit4]   2> 2170 T1754 oascc.ZkStateReader.updateClusterState Updating cloud state from ZooKeeper... 
[junit4:junit4]   2> 2171 T1754 oasc.Overseer$ClusterStateUpdater.updateState Update state numShards=1 message={
[junit4:junit4]   2> 	  "operation":"state",
[junit4:junit4]   2> 	  "core_node_name":"1",
[junit4:junit4]   2> 	  "numShards":"1",
[junit4:junit4]   2> 	  "shard":null,
[junit4:junit4]   2> 	  "roles":null,
[junit4:junit4]   2> 	  "state":"down",
[junit4:junit4]   2> 	  "core":"collection1",
[junit4:junit4]   2> 	  "collection":"control_collection",
[junit4:junit4]   2> 	  "node_name":"127.0.0.1:65328_",
[junit4:junit4]   2> 	  "base_url":"http://127.0.0.1:65328"}
[junit4:junit4]   2> 2171 T1754 oasc.Overseer$ClusterStateUpdater.createCollection Create collection control_collection with numShards 1
[junit4:junit4]   2> 2171 T1754 oasc.Overseer$ClusterStateUpdater.updateState Assigning new node to shard shard=shard1
[junit4:junit4]   2> 2172 T1736 oazs.PrepRequestProcessor.pRequest Got user-level KeeperException when processing sessionid:0x13d441898640003 type:create cxid:0x5d zxid:0x2d txntype:-1 reqpath:n/a Error Path:/solr/overseer/queue-work Error:KeeperErrorCode = NoNode for /solr/overseer/queue-work
[junit4:junit4]   2> 2212 T1753 oascc.ZkStateReader$2.process A cluster state change: WatchedEvent state:SyncConnected type:NodeDataChanged path:/clusterstate.json, has occurred - updating... (live nodes size: 1)
[junit4:junit4]   2> 2517 T1756 oasc.CoreContainer.registerCore registering core: collection1
[junit4:junit4]   2> 2517 T1756 oasc.ZkController.register Register replica - core:collection1 address:http://127.0.0.1:65328 collection:control_collection shard:shard1
[junit4:junit4]   2> 2518 T1756 oascc.SolrZkClient.makePath makePath: /collections/control_collection/leader_elect/shard1/election
[junit4:junit4]   2> 2536 T1736 oazs.PrepRequestProcessor.pRequest Got user-level KeeperException when processing sessionid:0x13d441898640003 type:delete cxid:0x77 zxid:0x37 txntype:-1 reqpath:n/a Error Path:/solr/collections/control_collection/leaders Error:KeeperErrorCode = NoNode for /solr/collections/control_collection/leaders
[junit4:junit4]   2> 2537 T1756 oasc.ShardLeaderElectionContext.runLeaderProcess Running the leader process.
[junit4:junit4]   2> 2538 T1736 oazs.PrepRequestProcessor.pRequest Got user-level KeeperException when processing sessionid:0x13d441898640003 type:create cxid:0x78 zxid:0x38 txntype:-1 reqpath:n/a Error Path:/solr/overseer Error:KeeperErrorCode = NodeExists for /solr/overseer
[junit4:junit4]   2> 2560 T1756 oasc.ShardLeaderElectionContext.waitForReplicasToComeUp Enough replicas found to continue.
[junit4:junit4]   2> 2561 T1756 oasc.ShardLeaderElectionContext.runLeaderProcess I may be the new leader - try and sync
[junit4:junit4]   2> 2561 T1756 oasc.SyncStrategy.sync Sync replicas to http://127.0.0.1:65328/collection1/
[junit4:junit4]   2> 2561 T1756 oasc.SyncStrategy.syncReplicas Sync Success - now sync replicas to me
[junit4:junit4]   2> 2561 T1756 oasc.SyncStrategy.syncToMe http://127.0.0.1:65328/collection1/ has no replicas
[junit4:junit4]   2> 2562 T1756 oasc.ShardLeaderElectionContext.runLeaderProcess I am the new leader: http://127.0.0.1:65328/collection1/
[junit4:junit4]   2> 2562 T1756 oascc.SolrZkClient.makePath makePath: /collections/control_collection/leaders/shard1
[junit4:junit4]   2> 2573 T1736 oazs.PrepRequestProcessor.pRequest Got user-level KeeperException when processing sessionid:0x13d441898640003 type:create cxid:0x82 zxid:0x3c txntype:-1 reqpath:n/a Error Path:/solr/overseer Error:KeeperErrorCode = NodeExists for /solr/overseer
[junit4:junit4]   2> 3726 T1754 oascc.ZkStateReader.updateClusterState Updating cloud state from ZooKeeper... 
[junit4:junit4]   2> 3747 T1753 oascc.ZkStateReader$2.process A cluster state change: WatchedEvent state:SyncConnected type:NodeDataChanged path:/clusterstate.json, has occurred - updating... (live nodes size: 1)
[junit4:junit4]   2> 3799 T1756 oasc.ZkController.register We are http://127.0.0.1:65328/collection1/ and leader is http://127.0.0.1:65328/collection1/
[junit4:junit4]   2> 3799 T1756 oasc.ZkController.register No LogReplay needed for core=collection1 baseURL=http://127.0.0.1:65328
[junit4:junit4]   2> 3799 T1756 oasc.ZkController.checkRecovery I am the leader, no recovery necessary
[junit4:junit4]   2> 3799 T1756 oasc.ZkController.publish publishing core=collection1 state=active
[junit4:junit4]   2> 3800 T1756 oasc.ZkController.publish numShards not found on descriptor - reading it from system property
[junit4:junit4]   2> 3801 T1756 oascc.ZkStateReader.updateClusterState Updating cloud state from ZooKeeper... 
[junit4:junit4]   2> 3802 T1731 oass.SolrDispatchFilter.init user.dir=/usr/home/hudson/hudson-slave/workspace/Lucene-Solr-Tests-4.x-Java6/solr/build/solr-core/test/J0
[junit4:junit4]   2> 3803 T1731 oass.SolrDispatchFilter.init SolrDispatchFilter.init() done
[junit4:junit4]   2> 3804 T1731 oascsi.HttpClientUtil.createClient Creating new http client, config:maxConnections=128&maxConnectionsPerHost=32&followRedirects=false
[junit4:junit4]   2> 3817 T1731 oascsi.HttpClientUtil.createClient Creating new http client, config:
[junit4:junit4]   2> 3818 T1731 oaz.ZooKeeper.<init> Initiating client connection, connectString=127.0.0.1:58213/solr sessionTimeout=10000 watcher=org.apache.solr.common.cloud.ConnectionManager@71e39149
[junit4:junit4]   2> 3818 T1731 oascc.ConnectionManager.waitForConnected Waiting for client to connect to ZooKeeper
[junit4:junit4]   2> 3819 T1758 oaz.ClientCnxn$SendThread.logStartConnect Opening socket connection to server localhost/127.0.0.1:58213. Will not attempt to authenticate using SASL (access denied (javax.security.auth.AuthPermission getLoginConfiguration))
[junit4:junit4]   2> 3819 T1758 oaz.ClientCnxn$SendThread.primeConnection Socket connection established to localhost/127.0.0.1:58213, initiating session
[junit4:junit4]   2> 3820 T1733 oazs.NIOServerCnxnFactory.run Accepted socket connection from /140.211.11.196:51439
[junit4:junit4]   2> 3820 T1733 oazs.ZooKeeperServer.processConnectRequest Client attempting to establish new session at /140.211.11.196:51439
[junit4:junit4]   2> 3821 T1735 oazs.ZooKeeperServer.finishSessionInit Established session 0x13d441898640004 with negotiated timeout 10000 for client /140.211.11.196:51439
[junit4:junit4]   2> 3821 T1758 oaz.ClientCnxn$SendThread.onConnected Session establishment complete on server localhost/127.0.0.1:58213, sessionid = 0x13d441898640004, negotiated timeout = 10000
[junit4:junit4]   2> 3821 T1759 oascc.ConnectionManager.process Watcher org.apache.solr.common.cloud.ConnectionManager@71e39149 name:ZooKeeperConnection Watcher:127.0.0.1:58213/solr got event WatchedEvent state:SyncConnected type:None path:null path:null type:None
[junit4:junit4]   2> 3821 T1731 oascc.ConnectionManager.waitForConnected Client is connected to ZooKeeper
[junit4:junit4]   2> 3822 T1731 oascc.ZkStateReader.createClusterStateWatchersAndUpdate Updating cluster state from ZooKeeper... 
[junit4:junit4]   2> 3824 T1731 oasc.ChaosMonkey.monkeyLog monkey: init - expire sessions:true cause connection loss:true
[junit4:junit4]   2> 4015 T1731 oejs.Server.doStart jetty-8.1.8.v20121106
[junit4:junit4]   2> 4018 T1731 oejs.AbstractConnector.doStart Started SocketConnector@127.0.0.1:61855
[junit4:junit4]   2> 4018 T1731 oass.SolrDispatchFilter.init SolrDispatchFilter.init()
[junit4:junit4]   2> 4019 T1731 oasc.SolrResourceLoader.locateSolrHome JNDI not configured for solr (NoInitialContextEx)
[junit4:junit4]   2> 4019 T1731 oasc.SolrResourceLoader.locateSolrHome using system property solr.solr.home: /usr/home/hudson/hudson-slave/workspace/Lucene-Solr-Tests-4.x-Java6/solr/build/solr-core/test/J0/./org.apache.solr.cloud.SyncSliceTest-jetty1-1362647099210
[junit4:junit4]   2> 4020 T1731 oasc.CoreContainer$Initializer.initialize looking for solr.xml: /usr/home/hudson/hudson-slave/workspace/Lucene-Solr-Tests-4.x-Java6/solr/build/solr-core/test/J0/./org.apache.solr.cloud.SyncSliceTest-jetty1-1362647099210/solr.xml
[junit4:junit4]   2> 4020 T1731 oasc.CoreContainer.<init> New CoreContainer 1092870364
[junit4:junit4]   2> 4021 T1731 oasc.CoreContainer.load Loading CoreContainer using Solr Home: '/usr/home/hudson/hudson-slave/workspace/Lucene-Solr-Tests-4.x-Java6/solr/build/solr-core/test/J0/./org.apache.solr.cloud.SyncSliceTest-jetty1-1362647099210/'
[junit4:junit4]   2> 4021 T1731 oasc.SolrResourceLoader.<init> new SolrResourceLoader for directory: '/usr/home/hudson/hudson-slave/workspace/Lucene-Solr-Tests-4.x-Java6/solr/build/solr-core/test/J0/./org.apache.solr.cloud.SyncSliceTest-jetty1-1362647099210/'
[junit4:junit4]   2> 4078 T1731 oashc.HttpShardHandlerFactory.getParameter Setting socketTimeout to: 120000
[junit4:junit4]   2> 4078 T1731 oashc.HttpShardHandlerFactory.getParameter Setting urlScheme to: http://
[junit4:junit4]   2> 4079 T1731 oashc.HttpShardHandlerFactory.getParameter Setting connTimeout to: 15000
[junit4:junit4]   2> 4079 T1731 oashc.HttpShardHandlerFactory.getParameter Setting maxConnectionsPerHost to: 20
[junit4:junit4]   2> 4080 T1731 oashc.HttpShardHandlerFactory.getParameter Setting corePoolSize to: 0
[junit4:junit4]   2> 4080 T1731 oashc.HttpShardHandlerFactory.getParameter Setting maximumPoolSize to: 2147483647
[junit4:junit4]   2> 4081 T1731 oashc.HttpShardHandlerFactory.getParameter Setting maxThreadIdleTime to: 5
[junit4:junit4]   2> 4081 T1731 oashc.HttpShardHandlerFactory.getParameter Setting sizeOfQueue to: -1
[junit4:junit4]   2> 4082 T1731 oashc.HttpShardHandlerFactory.getParameter Setting fairnessPolicy to: false
[junit4:junit4]   2> 4082 T1731 oascsi.HttpClientUtil.createClient Creating new http client, config:maxConnectionsPerHost=20&maxConnections=10000&socketTimeout=120000&connTimeout=15000&retry=false
[junit4:junit4]   2> 4103 T1731 oasc.CoreContainer.load Registering Log Listener
[junit4:junit4]   2> 4123 T1731 oasc.CoreContainer.initZooKeeper Zookeeper client=127.0.0.1:58213/solr
[junit4:junit4]   2> 4123 T1731 oasc.ZkController.checkChrootPath zkHost includes chroot
[junit4:junit4]   2> 4124 T1731 oaz.ZooKeeper.<init> Initiating client connection, connectString=127.0.0.1:58213 sessionTimeout=60000 watcher=org.apache.solr.common.cloud.ConnectionManager@34320932
[junit4:junit4]   2> 4125 T1731 oascc.ConnectionManager.waitForConnected Waiting for client to connect to ZooKeeper
[junit4:junit4]   2> 4125 T1769 oaz.ClientCnxn$SendThread.logStartConnect Opening socket connection to server localhost/127.0.0.1:58213. Will not attempt to authenticate using SASL (access denied (javax.security.auth.AuthPermission getLoginConfiguration))
[junit4:junit4]   2> 4127 T1769 oaz.ClientCnxn$SendThread.primeConnection Socket connection established to localhost/127.0.0.1:58213, initiating session
[junit4:junit4]   2> 4127 T1733 oazs.NIOServerCnxnFactory.run Accepted socket connection from /140.211.11.196:13469
[junit4:junit4]   2> 4128 T1733 oazs.ZooKeeperServer.processConnectRequest Client attempting to establish new session at /140.211.11.196:13469
[junit4:junit4]   2> 4129 T1735 oazs.ZooKeeperServer.finishSessionInit Established session 0x13d441898640005 with negotiated timeout 20000 for client /140.211.11.196:13469
[junit4:junit4]   2> 4130 T1769 oaz.ClientCnxn$SendThread.onConnected Session establishment complete on server localhost/127.0.0.1:58213, sessionid = 0x13d441898640005, negotiated timeout = 20000
[junit4:junit4]   2> 4130 T1770 oascc.ConnectionManager.process Watcher org.apache.solr.common.cloud.ConnectionManager@34320932 name:ZooKeeperConnection Watcher:127.0.0.1:58213 got event WatchedEvent state:SyncConnected type:None path:null path:null type:None
[junit4:junit4]   2> 4130 T1731 oascc.ConnectionManager.waitForConnected Client is connected to ZooKeeper
[junit4:junit4]   2> 4131 T1736 oazs.PrepRequestProcessor.pRequest2Txn Processed session termination for sessionid: 0x13d441898640005
[junit4:junit4]   2> 4171 T1770 oaz.ClientCnxn$EventThread.run EventThread shut down
[junit4:junit4]   2> 4171 T1733 oazs.NIOServerCnxn.closeSock Closed socket connection for client /140.211.11.196:13469 which had sessionid 0x13d441898640005
[junit4:junit4]   2> 4171 T1731 oaz.ZooKeeper.close Session: 0x13d441898640005 closed
[junit4:junit4]   2> 4172 T1731 oascsi.HttpClientUtil.createClient Creating new http client, config:maxConnections=500&maxConnectionsPerHost=16&socketTimeout=120000&connTimeout=15000
[junit4:junit4]   2> 4182 T1731 oaz.ZooKeeper.<init> Initiating client connection, connectString=127.0.0.1:58213/solr sessionTimeout=30000 watcher=org.apache.solr.common.cloud.ConnectionManager@4e02f273
[junit4:junit4]   2> 4183 T1731 oascc.ConnectionManager.waitForConnected Waiting for client to connect to ZooKeeper
[junit4:junit4]   2> 4184 T1771 oaz.ClientCnxn$SendThread.logStartConnect Opening socket connection to server localhost/127.0.0.1:58213. Will not attempt to authenticate using SASL (access denied (javax.security.auth.AuthPermission getLoginConfiguration))
[junit4:junit4]   2> 4184 T1771 oaz.ClientCnxn$SendThread.primeConnection Socket connection established to localhost/127.0.0.1:58213, initiating session
[junit4:junit4]   2> 4184 T1733 oazs.NIOServerCnxnFactory.run Accepted socket connection from /140.211.11.196:26994
[junit4:junit4]   2> 4185 T1733 oazs.ZooKeeperServer.processConnectRequest Client attempting to establish new session at /140.211.11.196:26994
[junit4:junit4]   2> 4186 T1735 oazs.ZooKeeperServer.finishSessionInit Established session 0x13d441898640006 with negotiated timeout 20000 for client /140.211.11.196:26994
[junit4:junit4]   2> 4186 T1771 oaz.ClientCnxn$SendThread.onConnected Session establishment complete on server localhost/127.0.0.1:58213, sessionid = 0x13d441898640006, negotiated timeout = 20000
[junit4:junit4]   2> 4186 T1772 oascc.ConnectionManager.process Watcher org.apache.solr.common.cloud.ConnectionManager@4e02f273 name:ZooKeeperConnection Watcher:127.0.0.1:58213/solr got event WatchedEvent state:SyncConnected type:None path:null path:null type:None
[junit4:junit4]   2> 4186 T1731 oascc.ConnectionManager.waitForConnected Client is connected to ZooKeeper
[junit4:junit4]   2> 4187 T1736 oazs.PrepRequestProcessor.pRequest Got user-level KeeperException when processing sessionid:0x13d441898640006 type:create cxid:0x1 zxid:0x4a txntype:-1 reqpath:n/a Error Path:/solr/overseer Error:KeeperErrorCode = NodeExists for /solr/overseer
[junit4:junit4]   2> 4189 T1736 oazs.PrepRequestProcessor.pRequest Got user-level KeeperException when processing sessionid:0x13d441898640006 type:create cxid:0x2 zxid:0x4b txntype:-1 reqpath:n/a Error Path:/solr/overseer Error:KeeperErrorCode = NodeExists for /solr/overseer
[junit4:junit4]   2> 4222 T1731 oascc.ZkStateReader.createClusterStateWatchersAndUpdate Updating cluster state from ZooKeeper... 
[junit4:junit4]   2> 5225 T1731 oasc.ZkController.createEphemeralLiveNode Register node as live in ZooKeeper:/live_nodes/127.0.0.1:61855_
[junit4:junit4]   2> 5226 T1736 oazs.PrepRequestProcessor.pRequest Got user-level KeeperException when processing sessionid:0x13d441898640006 type:delete cxid:0xb zxid:0x4c txntype:-1 reqpath:n/a Error Path:/solr/live_nodes/127.0.0.1:61855_ Error:KeeperErrorCode = NoNode for /solr/live_nodes/127.0.0.1:61855_
[junit4:junit4]   2> 5229 T1731 oascc.SolrZkClient.makePath makePath: /live_nodes/127.0.0.1:61855_
[junit4:junit4]   2> 5232 T1753 oascc.ZkStateReader$2.process A cluster state change: WatchedEvent state:SyncConnected type:NodeChildrenChanged path:/live_nodes, has occurred - updating... (live nodes size: 1)
[junit4:junit4]   2> 5233 T1772 oascc.ZkStateReader$3.process Updating live nodes... (2)
[junit4:junit4]   2> 5233 T1759 oascc.ZkStateReader$3.process Updating live nodes... (2)
[junit4:junit4]   2> 5234 T1753 oascc.ZkStateReader$3.process Updating live nodes... (2)
[junit4:junit4]   2> 5256 T1754 oascc.ZkStateReader.updateClusterState Updating cloud state from ZooKeeper... 
[junit4:junit4]   2> 5257 T1754 oasc.Overseer$ClusterStateUpdater.updateState Update state numShards=1 message={
[junit4:junit4]   2> 	  "operation":"state",
[junit4:junit4]   2> 	  "core_node_name":"1",
[junit4:junit4]   2> 	  "numShards":"1",
[junit4:junit4]   2> 	  "shard":"shard1",
[junit4:junit4]   2> 	  "roles":null,
[junit4:junit4]   2> 	  "state":"active",
[junit4:junit4]   2> 	  "core":"collection1",
[junit4:junit4]   2> 	  "collection":"control_collection",
[junit4:junit4]   2> 	  "node_name":"127.0.0.1:65328_",
[junit4:junit4]   2> 	  "base_url":"http://127.0.0.1:65328"}
[junit4:junit4]   2> 5257 T1773 oasc.CoreContainer.create Creating SolrCore 'collection1' using instanceDir: /usr/home/hudson/hudson-slave/workspace/Lucene-Solr-Tests-4.x-Java6/solr/build/solr-core/test/J0/./org.apache.solr.cloud.SyncSliceTest-jetty1-1362647099210/collection1
[junit4:junit4]   2> 5258 T1773 oasc.ZkController.createCollectionZkNode Check for collection zkNode:collection1
[junit4:junit4]   2> 5259 T1773 oasc.ZkController.createCollectionZkNode Collection zkNode exists
[junit4:junit4]   2> 5259 T1773 oasc.ZkController.readConfigName Load collection config from:/collections/collection1
[junit4:junit4]   2> 5260 T1773 oasc.SolrResourceLoader.<init> new SolrResourceLoader for directory: '/usr/home/hudson/hudson-slave/workspace/Lucene-Solr-Tests-4.x-Java6/solr/build/solr-core/test/J0/./org.apache.solr.cloud.SyncSliceTest-jetty1-1362647099210/collection1/'
[junit4:junit4]   2> 5262 T1773 oasc.SolrResourceLoader.replaceClassLoader Adding 'file:/usr/home/hudson/hudson-slave/workspace/Lucene-Solr-Tests-4.x-Java6/solr/build/solr-core/test/J0/org.apache.solr.cloud.SyncSliceTest-jetty1-1362647099210/collection1/lib/classes/' to classloader
[junit4:junit4]   2> 5263 T1773 oasc.SolrResourceLoader.replaceClassLoader Adding 'file:/usr/home/hudson/hudson-slave/workspace/Lucene-Solr-Tests-4.x-Java6/solr/build/solr-core/test/J0/org.apache.solr.cloud.SyncSliceTest-jetty1-1362647099210/collection1/lib/README' to classloader
[junit4:junit4]   2> 5263 T1753 oascc.ZkStateReader$2.process A cluster state change: WatchedEvent state:SyncConnected type:NodeDataChanged path:/clusterstate.json, has occurred - updating... (live nodes size: 2)
[junit4:junit4]   2> 5263 T1759 oascc.ZkStateReader$2.process A cluster state change: WatchedEvent state:SyncConnected type:NodeDataChanged path:/clusterstate.json, has occurred - updating... (live nodes size: 2)
[junit4:junit4]   2> 5263 T1772 oascc.ZkStateReader$2.process A cluster state change: WatchedEvent state:SyncConnected type:NodeDataChanged path:/clusterstate.json, has occurred - updating... (live nodes size: 2)
[junit4:junit4]   2> 5324 T1773 oasc.SolrConfig.<init> Using Lucene MatchVersion: LUCENE_42
[junit4:junit4]   2> 5387 T1773 oasc.SolrConfig.<init> Loaded SolrConfig: solrconfig.xml
[junit4:junit4]   2> 5488 T1773 oass.IndexSchema.readSchema Reading Solr Schema
[junit4:junit4]   2> 5507 T1773 oass.IndexSchema.readSchema Schema name=test
[junit4:junit4]   2> 6156 T1773 oass.OpenExchangeRatesOrgProvider.init Initialized with rates=open-exchange-rates.json, refreshInterval=1440.
[junit4:junit4]   2> 6168 T1773 oass.IndexSchema.readSchema default search field in schema is text
[junit4:junit4]   2> 6173 T1773 oass.IndexSchema.readSchema unique key field: id
[junit4:junit4]   2> 6187 T1773 oass.FileExchangeRateProvider.reload Reloading exchange rates from file currency.xml
[junit4:junit4]   2> 6192 T1773 oass.FileExchangeRateProvider.reload Reloading exchange rates from file currency.xml
[junit4:junit4]   2> 6197 T1773 oass.OpenExchangeRatesOrgProvider.reload Reloading exchange rates from open-exchange-rates.json
[junit4:junit4]   2> 6198 T1773 oass.OpenExchangeRatesOrgProvider$OpenExchangeRates.<init> WARNING Unknown key IMPORTANT NOTE
[junit4:junit4]   2> 6199 T1773 oass.OpenExchangeRatesOrgProvider$OpenExchangeRates.<init> WARNING Expected key, got STRING
[junit4:junit4]   2> 6199 T1773 oass.OpenExchangeRatesOrgProvider.reload Reloading exchange rates from open-exchange-rates.json
[junit4:junit4]   2> 6200 T1773 oass.OpenExchangeRatesOrgProvider$OpenExchangeRates.<init> WARNING Unknown key IMPORTANT NOTE
[junit4:junit4]   2> 6200 T1773 oass.OpenExchangeRatesOrgProvider$OpenExchangeRates.<init> WARNING Expected key, got STRING
[junit4:junit4]   2> 6201 T1773 oasc.SolrCore.<init> [collection1] Opening new SolrCore at /usr/home/hudson/hudson-slave/workspace/Lucene-Solr-Tests-4.x-Java6/solr/build/solr-core/test/J0/./org.apache.solr.cloud.SyncSliceTest-jetty1-1362647099210/collection1/, dataDir=./org.apache.solr.cloud.SyncSliceTest-1362647095390/jetty1/
[junit4:junit4]   2> 6201 T1773 oasc.JmxMonitoredMap.<init> JMX monitoring is enabled. Adding Solr mbeans to JMX Server: com.sun.jmx.mbeanserver.JmxMBeanServer@5c4b82d2
[junit4:junit4]   2> 6201 T1773 oasc.SolrCore.initDirectoryFactory org.apache.solr.core.MockDirectoryFactory
[junit4:junit4]   2> 6202 T1773 oasc.CachingDirectoryFactory.get return new directory for /usr/home/hudson/hudson-slave/workspace/Lucene-Solr-Tests-4.x-Java6/solr/build/solr-core/test/J0/./org.apache.solr.cloud.SyncSliceTest-1362647095390/jetty1 forceNew: false
[junit4:junit4]   2> 6202 T1773 oasc.SolrCore.getNewIndexDir New index directory detected: old=null new=./org.apache.solr.cloud.SyncSliceTest-1362647095390/jetty1/index/
[junit4:junit4]   2> 6203 T1773 oasc.SolrCore.initIndex WARNING [collection1] Solr index directory './org.apache.solr.cloud.SyncSliceTest-1362647095390/jetty1/index' doesn't exist. Creating new index...
[junit4:junit4]   2> 6203 T1773 oasc.CachingDirectoryFactory.get return new directory for /usr/home/hudson/hudson-slave/workspace/Lucene-Solr-Tests-4.x-Java6/solr/build/solr-core/test/J0/./org.apache.solr.cloud.SyncSliceTest-1362647095390/jetty1/index forceNew: false
[junit4:junit4]   2> 6206 T1773 oasc.SolrDeletionPolicy.onCommit SolrDeletionPolicy.onCommit: commits:num=1
[junit4:junit4]   2> 		commit{dir=MockDirWrapper(org.apache.lucene.store.RAMDirectory@285896a2 lockFactory=org.apache.lucene.store.NativeFSLockFactory@1e411c06),segFN=segments_1,generation=1,filenames=[segments_1]
[junit4:junit4]   2> 6206 T1773 oasc.SolrDeletionPolicy.updateCommits newest commit = 1[segments_1]
[junit4:junit4]   2> 6209 T1773 oasup.UpdateRequestProcessorChain.init inserting DistributedUpdateProcessorFactory into updateRequestProcessorChain "dedupe"
[junit4:junit4]   2> 6209 T1773 oasup.UpdateRequestProcessorChain.init inserting DistributedUpdateProcessorFactory into updateRequestProcessorChain "stored_sig"
[junit4:junit4]   2> 6210 T1773 oasup.UpdateRequestProcessorChain.init inserting DistributedUpdateProcessorFactory into updateRequestProcessorChain "distrib-dup-test-chain-implicit"
[junit4:junit4]   2> 6210 T1773 oasc.RequestHandlers.initHandlersFromConfig created standard: solr.StandardRequestHandler
[junit4:junit4]   2> 6211 T1773 oasc.RequestHandlers.initHandlersFromConfig created /get: solr.RealTimeGetHandler
[junit4:junit4]   2> 6211 T1773 oasc.RequestHandlers.initHandlersFromConfig adding lazy requestHandler: solr.ReplicationHandler
[junit4:junit4]   2> 6211 T1773 oasc.RequestHandlers.initHandlersFromConfig created /replication: solr.ReplicationHandler
[junit4:junit4]   2> 6212 T1773 oasc.RequestHandlers.initHandlersFromConfig created /update: solr.UpdateRequestHandler
[junit4:junit4]   2> 6212 T1773 oasc.RequestHandlers.initHandlersFromConfig created /admin/: org.apache.solr.handler.admin.AdminHandlers
[junit4:junit4]   2> 6221 T1773 oashl.XMLLoader.init xsltCacheLifetimeSeconds=60
[junit4:junit4]   2> 6227 T1773 oass.SolrIndexSearcher.<init> Opening Searcher@4163a125 main
[junit4:junit4]   2> 6228 T1773 oasu.UpdateHandler.clearLog Clearing tlog files, tlogDir=./org.apache.solr.cloud.SyncSliceTest-1362647095390/jetty1/tlog
[junit4:junit4]   2> 6229 T1773 oasu.CommitTracker.<init> Hard AutoCommit: disabled
[junit4:junit4]   2> 6229 T1773 oasu.CommitTracker.<init> Soft AutoCommit: disabled
[junit4:junit4]   2> 6233 T1774 oasc.SolrCore.registerSearcher [collection1] Registered new searcher Searcher@4163a125 main{StandardDirectoryReader(segments_1:1)}
[junit4:junit4]   2> 6235 T1773 oasc.ZkController.publish publishing core=collection1 state=down
[junit4:junit4]   2> 6235 T1773 oasc.ZkController.publish numShards not found on descriptor - reading it from system property
[junit4:junit4]   2> 6776 T1754 oascc.ZkStateReader.updateClusterState Updating cloud state from ZooKeeper... 
[junit4:junit4]   2> 6777 T1754 oasc.Overseer$ClusterStateUpdater.updateState Update state numShards=1 message={
[junit4:junit4]   2> 	  "operation":"state",
[junit4:junit4]   2> 	  "core_node_name":"2",
[junit4:junit4]   2> 	  "numShards":"1",
[junit4:junit4]   2> 	  "shard":null,
[junit4:junit4]   2> 	  "roles":null,
[junit4:junit4]   2> 	  "state":"down",
[junit4:junit4]   2> 	  "core":"collection1",
[junit4:junit4]   2> 	  "collection":"collection1",
[junit4:junit4]   2> 	  "node_name":"127.0.0.1:61855_",
[junit4:junit4]   2> 	  "base_url":"http://127.0.0.1:61855"}
[junit4:junit4]   2> 6777 T1754 oasc.Overseer$ClusterStateUpdater.createCollection Create collection collection1 with numShards 1
[junit4:junit4]   2> 6778 T1754 oasc.Overseer$ClusterStateUpdater.updateState Assigning new node to shard shard=shard1
[junit4:junit4]   2> 6796 T1772 oascc.ZkStateReader$2.process A cluster state change: WatchedEvent state:SyncConnected type:NodeDataChanged path:/clusterstate.json, has occurred - updating... (live nodes size: 2)
[junit4:junit4]   2> 6796 T1759 oascc.ZkStateReader$2.process A cluster state change: WatchedEvent state:SyncConnected type:NodeDataChanged path:/clusterstate.json, has occurred - updating... (live nodes size: 2)
[junit4:junit4]   2> 6797 T1753 oascc.ZkStateReader$2.process A cluster state change: WatchedEvent state:SyncConnected type:NodeDataChanged path:/clusterstate.json, has occurred - updating... (live nodes size: 2)
[junit4:junit4]   2> 7238 T1773 oasc.CoreContainer.registerCore registering core: collection1
[junit4:junit4]   2> 7238 T1773 oasc.ZkController.register Register replica - core:collection1 address:http://127.0.0.1:61855 collection:collection1 shard:shard1
[junit4:junit4]   2> 7239 T1773 oascc.SolrZkClient.makePath makePath: /collections/collection1/leader_elect/shard1/election
[junit4:junit4]   2> 7259 T1736 oazs.PrepRequestProcessor.pRequest Got user-level KeeperException when processing sessionid:0x13d441898640006 type:delete cxid:0x48 zxid:0x5c txntype:-1 reqpath:n/a Error Path:/solr/collections/collection1/leaders Error:KeeperErrorCode = NoNode for /solr/collections/collection1/leaders
[junit4:junit4]   2> 7264 T1773 oasc.ShardLeaderElectionContext.runLeaderProcess Running the leader process.
[junit4:junit4]   2> 7265 T1736 oazs.PrepRequestProcessor.pRequest Got user-level KeeperException when processing sessionid:0x13d441898640006 type:create cxid:0x49 zxid:0x5d txntype:-1 reqpath:n/a Error Path:/solr/overseer Error:KeeperErrorCode = NodeExists for /solr/overseer
[junit4:junit4]   2> 7268 T1773 oasc.ShardLeaderElectionContext.waitForReplicasToComeUp Enough replicas found to continue.
[junit4:junit4]   2> 7268 T1773 oasc.ShardLeaderElectionContext.runLeaderProcess I may be the new leader - try and sync
[junit4:junit4]   2> 7268 T1773 oasc.SyncStrategy.sync Sync replicas to http://127.0.0.1:61855/collection1/
[junit4:junit4]   2> 7269 T1773 oasc.SyncStrategy.syncReplicas Sync Success - now sync replicas to me
[junit4:junit4]   2> 7269 T1773 oasc.SyncStrategy.syncToMe http://127.0.0.1:61855/collection1/ has no replicas
[junit4:junit4]   2> 7269 T1773 oasc.ShardLeaderElectionContext.runLeaderProcess I am the new leader: http://127.0.0.1:61855/collection1/
[junit4:junit4]   2> 7270 T1773 oascc.SolrZkClient.makePath makePath: /collections/collection1/leaders/shard1
[junit4:junit4]   2> 7282 T1736 oazs.PrepRequestProcessor.pRequest Got user-level KeeperException when processing sessionid:0x13d441898640006 type:create cxid:0x53 zxid:0x61 txntype:-1 reqpath:n/a Error Path:/solr/overseer Error:KeeperErrorCode = NodeExists for /solr/overseer
[junit4:junit4]   2> 8310 T1754 oascc.ZkStateReader.updateClusterState Updating cloud state from ZooKeeper... 
[junit4:junit4]   2> 8343 T1753 oascc.ZkStateReader$2.process A cluster state change: WatchedEvent state:SyncConnected type:NodeDataChanged path:/clusterstate.json, has occurred - updating... (live nodes size: 2)
[junit4:junit4]   2> 8343 T1772 oascc.ZkStateReader$2.process A cluster state change: WatchedEvent state:SyncConnected type:NodeDataChanged path:/clusterstate.json, has occurred - updating... (live nodes size: 2)
[junit4:junit4]   2> 8343 T1759 oascc.ZkStateReader$2.process A cluster state change: WatchedEvent state:SyncConnected type:NodeDataChanged path:/clusterstate.json, has occurred - updating... (live nodes size: 2)
[junit4:junit4]   2> 8363 T1773 oasc.ZkController.register We are http://127.0.0.1:61855/collection1/ and leader is http://127.0.0.1:61855/collection1/
[junit4:junit4]   2> 8363 T1773 oasc.ZkController.register No LogReplay needed for core=collection1 baseURL=http://127.0.0.1:61855
[junit4:junit4]   2> 8363 T1773 oasc.ZkController.checkRecovery I am the leader, no recovery necessary
[junit4:junit4]   2> 8364 T1773 oasc.ZkController.publish publishing core=collection1 state=active
[junit4:junit4]   2> 8364 T1773 oasc.ZkController.publish numShards not found on descriptor - reading it from system property
[junit4:junit4]   2> 8367 T1773 oascc.ZkStateReader.updateClusterState Updating cloud state from ZooKeeper... 
[junit4:junit4]   2> 8368 T1731 oass.SolrDispatchFilter.init user.dir=/usr/home/hudson/hudson-slave/workspace/Lucene-Solr-Tests-4.x-Java6/solr/build/solr-core/test/J0
[junit4:junit4]   2> 8369 T1731 oass.SolrDispatchFilter.init SolrDispatchFilter.init() done
[junit4:junit4]   2> 8369 T1731 oascsi.HttpClientUtil.createClient Creating new http client, config:maxConnections=128&maxConnectionsPerHost=32&followRedirects=false
[junit4:junit4]   2> 8774 T1731 oejs.Server.doStart jetty-8.1.8.v20121106
[junit4:junit4]   2> 8777 T1731 oejs.AbstractConnector.doStart Started SocketConnector@127.0.0.1:22055
[junit4:junit4]   2> 8778 T1731 oass.SolrDispatchFilter.init SolrDispatchFilter.init()
[junit4:junit4]   2> 8778 T1731 oasc.SolrResourceLoader.locateSolrHome JNDI not configured for solr (NoInitialContextEx)
[junit4:junit4]   2> 8779 T1731 oasc.SolrResourceLoader.locateSolrHome using system property solr.solr.home: /usr/home/hudson/hudson-slave/workspace/Lucene-Solr-Tests-4.x-Java6/solr/build/solr-core/test/J0/./org.apache.solr.cloud.SyncSliceTest-jetty2-1362647103775
[junit4:junit4]   2> 8780 T1731 oasc.CoreContainer$Initializer.initialize looking for solr.xml: /usr/home/hudson/hudson-slave/workspace/Lucene-Solr-Tests-4.x-Java6/solr/build/solr-core/test/J0/./org.apache.solr.cloud.SyncSliceTest-jetty2-1362647103775/solr.xml
[junit4:junit4]   2> 8781 T1731 oasc.CoreContainer.<init> New CoreContainer 767639987
[junit4:junit4]   2> 8781 T1731 oasc.CoreContainer.load Loading CoreContainer using Solr Home: '/usr/home/hudson/hudson-slave/workspace/Lucene-Solr-Tests-4.x-Java6/solr/build/solr-core/test/J0/./org.apache.solr.cloud.SyncSliceTest-jetty2-1362647103775/'
[junit4:junit4]   2> 8782 T1731 oasc.SolrResourceLoader.<init> new SolrResourceLoader for directory: '/usr/home/hudson/hudson-slave/workspace/Lucene-Solr-Tests-4.x-Java6/solr/build/solr-core/test/J0/./org.apache.solr.cloud.SyncSliceTest-jetty2-1362647103775/'
[junit4:junit4]   2> 8867 T1731 oashc.HttpShardHandlerFactory.getParameter Setting socketTimeout to: 120000
[junit4:junit4]   2> 8868 T1731 oashc.HttpShardHandlerFactory.getParameter Setting urlScheme to: http://
[junit4:junit4]   2> 8868 T1731 oashc.HttpShardHandlerFactory.getParameter Setting connTimeout to: 15000
[junit4:junit4]   2> 8869 T1731 oashc.HttpShardHandlerFactory.getParameter Setting maxConnectionsPerHost to: 20
[junit4:junit4]   2> 8869 T1731 oashc.HttpShardHandlerFactory.getParameter Setting corePoolSize to: 0
[junit4:junit4]   2> 8870 T1731 oashc.HttpShardHandlerFactory.getParameter Setting maximumPoolSize to: 2147483647
[junit4:junit4]   2> 8870 T1731 oashc.HttpShardHandlerFactory.getParameter Setting maxThreadIdleTime to: 5
[junit4:junit4]   2> 8871 T1731 oashc.HttpShardHandlerFactory.getParameter Setting sizeOfQueue to: -1
[junit4:junit4]   2> 8872 T1731 oashc.HttpShardHandlerFactory.getParameter Setting fairnessPolicy to: false
[junit4:junit4]   2> 8873 T1731 oascsi.HttpClientUtil.createClient Creating new http client, config:maxConnectionsPerHost=20&maxConnections=10000&socketTimeout=120000&connTimeout=15000&retry=false
[junit4:junit4]   2> 8899 T1731 oasc.CoreContainer.load Registering Log Listener
[junit4:junit4]   2> 8922 T1731 oasc.CoreContainer.initZooKeeper Zookeeper client=127.0.0.1:58213/solr
[junit4:junit4]   2> 8923 T1731 oasc.ZkController.checkChrootPath zkHost includes chroot
[junit4:junit4]   2> 8924 T1731 oaz.ZooKeeper.<init> Initiating client connection, connectString=127.0.0.1:58213 sessionTimeout=60000 watcher=org.apache.solr.common.cloud.ConnectionManager@7d7823e4
[junit4:junit4]   2> 8925 T1731 oascc.ConnectionManager.waitForConnected Waiting for client to connect to ZooKeeper
[junit4:junit4]   2> 8926 T1784 oaz.ClientCnxn$SendThread.logStartConnect Opening socket connection to server localhost/127.0.0.1:58213. Will not attempt to authenticate using SASL (access denied (javax.security.auth.AuthPermission getLoginConfiguration))
[junit4:junit4]   2> 8927 T1784 oaz.ClientCnxn$SendThread.primeConnection Socket connection established to localhost/127.0.0.1:58213, initiating session
[junit4:junit4]   2> 8927 T1733 oazs.NIOServerCnxnFactory.run Accepted socket connection from /140.211.11.196:42404
[junit4:junit4]   2> 8928 T1733 oazs.ZooKeeperServer.processConnectRequest Client attempting to establish new session at /140.211.11.196:42404
[junit4:junit4]   2> 8929 T1735 oazs.ZooKeeperServer.finishSessionInit Established session 0x13d441898640007 with negotiated timeout 20000 for client /140.211.11.196:42404
[junit4:junit4]   2> 8930 T1784 oaz.ClientCnxn$SendThread.onConnected Session establishment complete on server localhost/127.0.0.1:58213, sessionid = 0x13d441898640007, negotiated timeout = 20000
[junit4:junit4]   2> 8930 T1785 oascc.ConnectionManager.process Watcher org.apache.solr.common.cloud.ConnectionManager@7d7823e4 name:ZooKeeperConnection Watcher:127.0.0.1:58213 got event WatchedEvent state:SyncConnected type:None path:null path:null type:None
[junit4:junit4]   2> 8930 T1731 oascc.ConnectionManager.waitForConnected Client is connected to ZooKeeper
[junit4:junit4]   2> 8932 T1736 oazs.PrepRequestProcessor.pRequest2Txn Processed session termination for sessionid: 0x13d441898640007
[junit4:junit4]   2> 8942 T1785 oaz.ClientCnxn$EventThread.run EventThread shut down
[junit4:junit4]   2> 8942 T1733 oazs.NIOServerCnxn.closeSock Closed socket connection for client /140.211.11.196:42404 which had sessionid 0x13d441898640007
[junit4:junit4]   2> 8942 T1731 oaz.ZooKeeper.close Session: 0x13d441898640007 closed
[junit4:junit4]   2> 8943 T1731 oascsi.HttpClientUtil.createClient Creating new http client, config:maxConnections=500&maxConnectionsPerHost=16&socketTimeout=120000&connTimeout=15000
[junit4:junit4]   2> 8955 T1731 oaz.ZooKeeper.<init> Initiating client connection, connectString=127.0.0.1:58213/solr sessionTimeout=30000 watcher=org.apache.solr.common.cloud.ConnectionManager@63af5931
[junit4:junit4]   2> 8956 T1731 oascc.ConnectionManager.waitForConnected Waiting for client to connect to ZooKeeper
[junit4:junit4]   2> 8957 T1786 oaz.ClientCnxn$SendThread.logStartConnect Opening socket connection to server localhost/127.0.0.1:58213. Will not attempt to authenticate using SASL (access denied (javax.security.auth.AuthPermission getLoginConfiguration))
[junit4:junit4]   2> 8957 T1786 oaz.ClientCnxn$SendThread.primeConnection Socket connection established to localhost/127.0.0.1:58213, initiating session
[junit4:junit4]   2> 8958 T1733 oazs.NIOServerCnxnFactory.run Accepted socket connection from /140.211.11.196:61355
[junit4:junit4]   2> 8958 T1733 oazs.ZooKeeperServer.processConnectRequest Client attempting to establish new session at /140.211.11.196:61355
[junit4:junit4]   2> 8959 T1735 oazs.ZooKeeperServer.finishSessionInit Established session 0x13d441898640008 with negotiated timeout 20000 for client /140.211.11.196:61355
[junit4:junit4]   2> 8960 T1786 oaz.ClientCnxn$SendThread.onConnected Session establishment complete on server localhost/127.0.0.1:58213, sessionid = 0x13d441898640008, negotiated timeout = 20000
[junit4:junit4]   2> 8960 T1787 oascc.ConnectionManager.process Watcher org.apache.solr.common.cloud.ConnectionManager@63af5931 name:ZooKeeperConnection Watcher:127.0.0.1:58213/solr got event WatchedEvent state:SyncConnected type:None path:null path:null type:None
[junit4:junit4]   2> 8960 T1731 oascc.ConnectionManager.waitForConnected Client is connected to ZooKeeper
[junit4:junit4]   2> 8961 T1736 oazs.PrepRequestProcessor.pRequest Got user-level KeeperException when processing sessionid:0x13d441898640008 type:create cxid:0x1 zxid:0x6e txntype:-1 reqpath:n/a Error Path:/solr/overseer Error:KeeperErrorCode = NodeExists for /solr/overseer
[junit4:junit4]   2> 8965 T1736 oazs.PrepRequestProcessor.pRequest Got user-level KeeperException when processing sessionid:0x13d441898640008 type:create cxid:0x2 zxid:0x6f txntype:-1 reqpath:n/a Error Path:/solr/overseer Error:KeeperErrorCode = NodeExists for /solr/overseer
[junit4:junit4]   2> 8967 T1731 oascc.ZkStateReader.createClusterStateWatchersAndUpdate Updating cluster state from ZooKeeper... 
[junit4:junit4]   2> 9855 T1754 oascc.ZkStateReader.updateClusterState Updating cloud state from ZooKeeper... 
[junit4:junit4]   2> 9856 T1754 oasc.Overseer$ClusterStateUpdater.updateState Update state numShards=1 message={
[junit4:junit4]   2> 	  "operation":"state",
[junit4:junit4]   2> 	  "core_node_name":"2",
[junit4:junit4]   2> 	  "numShards":"1",
[junit4:junit4]   2> 	  "shard":"shard1",
[junit4:junit4]   2> 	  "roles":null,
[junit4:junit4]   2> 	  "state":"active",
[junit4:junit4]   2> 	  "core":"collection1",
[junit4:junit4]   2> 	  "collection":"collection1",
[junit4:junit4]   2> 	  "node_name":"127.0.0.1:61855_",
[junit4:junit4]   2> 	  "base_url":"http://127.0.0.1:61855"}
[junit4:junit4]   2> 9867 T1787 oascc.ZkStateReader$2.process A cluster state change: WatchedEvent state:SyncConnected type:NodeDataChanged path:/clusterstate.json, has occurred - updating... (live nodes size: 2)
[junit4:junit4]   2> 9867 T1772 oascc.ZkStateReader$2.process A cluster state change: WatchedEvent state:SyncConnected type:NodeDataChanged path:/clusterstate.json, has occurred - updating... (live nodes size: 2)
[junit4:junit4]   2> 9867 T1759 oascc.ZkStateReader$2.process A cluster state change: WatchedEvent state:SyncConnected type:NodeDataChanged path:/clusterstate.json, has occurred - updating... (live nodes size: 2)
[junit4:junit4]   2> 9867 T1753 oascc.ZkStateReader$2.process A cluster state change: WatchedEvent state:SyncConnected type:NodeDataChanged path:/clusterstate.json, has occurred - updating... (live nodes size: 2)
[junit4:junit4]   2> 9971 T1731 oasc.ZkController.createEphemeralLiveNode Register node as live in ZooKeeper:/live_nodes/127.0.0.1:22055_
[junit4:junit4]   2> 9973 T1736 oazs.PrepRequestProcessor.pRequest Got user-level KeeperException when processing sessionid:0x13d441898640008 type:delete cxid:0xd zxid:0x74 txntype:-1 reqpath:n/a Error Path:/solr/live_nodes/127.0.0.1:22055_ Error:KeeperErrorCode = NoNode for /solr/live_nodes/127.0.0.1:22055_
[junit4:junit4]   2> 9974 T1731 oascc.SolrZkClient.makePath makePath: /live_nodes/127.0.0.1:22055_
[junit4:junit4]   2> 9977 T1772 oascc.ZkStateReader$2.process A cluster state change: WatchedEvent state:SyncConnected type:NodeChildrenChanged path:/live_nodes, has occurred - updating... (live nodes size: 2)
[junit4:junit4]   2> 9977 T1753 oascc.ZkStateReader$2.process A cluster state change: WatchedEvent state:SyncConnected type:NodeChildrenChanged path:/live_nodes, has occurred - updating... (live nodes size: 2)
[junit4:junit4]   2> 9977 T1787 oascc.ZkStateReader$3.process Updating live nodes... (3)
[junit4:junit4]   2> 9978 T1759 oascc.ZkStateReader$3.process Updating live nodes... (3)
[junit4:junit4]   2> 9978 T1787 oascc.ZkStateReader$2.process A cluster state change: WatchedEvent state:SyncConnected type:NodeChildrenChanged path:/live_nodes, has occurred - updating... (live nodes size: 3)
[junit4:junit4]   2> 9978 T1759 oascc.ZkStateReader$2.process A cluster state change: WatchedEvent state:SyncConnected type:NodeChildrenChanged path:/live_nodes, has occurred - updating... (live nodes size: 3)
[junit4:junit4]   2> 9979 T1772 oascc.ZkStateReader$3.process Updating live nodes... (3)
[junit4:junit4]   2> 9988 T1753 oascc.ZkStateReader$3.process Updating live nodes... (3)
[junit4:junit4]   2> 9997 T1788 oasc.CoreContainer.create Creating SolrCore 'collection1' using instanceDir: /usr/home/hudson/hudson-slave/workspace/Lucene-Solr-Tests-4.x-Java6/solr/build/solr-core/test/J0/./org.apache.solr.cloud.SyncSliceTest-jetty2-1362647103775/collection1
[junit4:junit4]   2> 9997 T1788 oasc.ZkController.createCollectionZkNode Check for collection zkNode:collection1
[junit4:junit4]   2> 9998 T1788 oasc.ZkController.createCollectionZkNode Collection zkNode exists
[junit4:junit4]   2> 9998 T1788 oasc.ZkController.readConfigName Load collection config from:/collections/collection1
[junit4:junit4]   2> 10000 T1788 oasc.SolrResourceLoader.<init> new SolrResourceLoader for directory: '/usr/home/hudson/hudson-slave/workspace/Lucene-Solr-Tests-4.x-Java6/solr/build/solr-core/test/J0/./org.apache.solr.cloud.SyncSliceTest-jetty2-1362647103775/collection1/'
[junit4:junit4]   2> 10002 T1788 oasc.SolrResourceLoader.replaceClassLoader Adding 'file:/usr/home/hudson/hudson-slave/workspace/Lucene-Solr-Tests-4.x-Java6/solr/build/solr-core/test/J0/org.apache.solr.cloud.SyncSliceTest-jetty2-1362647103775/collection1/lib/classes/' to classloader
[junit4:junit4]   2> 10002 T1788 oasc.SolrResourceLoader.replaceClassLoader Adding 'file:/usr/home/hudson/hudson-slave/workspace/Lucene-Solr-Tests-4.x-Java6/solr/build/solr-core/test/J0/org.apache.solr.cloud.SyncSliceTest-jetty2-1362647103775/collection1/lib/README' to classloader
[junit4:junit4]   2> 10064 T1788 oasc.SolrConfig.<init> Using Lucene MatchVersion: LUCENE_42
[junit4:junit4]   2> 10144 T1788 oasc.SolrConfig.<init> Loaded SolrConfig: solrconfig.xml
[junit4:junit4]   2> 10246 T1788 oass.IndexSchema.readSchema Reading Solr Schema
[junit4:junit4]   2> 10273 T1788 oass.IndexSchema.readSchema Schema name=test
[junit4:junit4]   2> 11063 T1788 oass.OpenExchangeRatesOrgProvider.init Initialized with rates=open-exchange-rates.json, refreshInterval=1440.
[junit4:junit4]   2> 11074 T1788 oass.IndexSchema.readSchema default search field in schema is text
[junit4:junit4]   2> 11079 T1788 oass.IndexSchema.readSchema unique key field: id
[junit4:junit4]   2> 11093 T1788 oass.FileExchangeRateProvider.reload Reloading exchange rates from file currency.xml
[junit4:junit4]   2> 11099 T1788 oass.FileExchangeRateProvider.reload Reloading exchange rates from file currency.xml
[junit4:junit4]   2> 11103 T1788 oass.OpenExchangeRatesOrgProvider.reload Reloading exchange rates from open-exchange-rates.json
[junit4:junit4]   2> 11104 T1788 oass.OpenExchangeRatesOrgProvider$OpenExchangeRates.<init> WARNING Unknown key IMPORTANT NOTE
[junit4:junit4]   2> 11105 T1788 oass.OpenExchangeRatesOrgProvider$OpenExchangeRates.<init> WARNING Expected key, got STRING
[junit4:junit4]   2> 11105 T1788 oass.OpenExchangeRatesOrgProvider.reload Reloading exchange rates from open-exchange-rates.json
[junit4:junit4]   2> 11106 T1788 oass.OpenExchangeRatesOrgProvider$OpenExchangeRates.<init> WARNING Unknown key IMPORTANT NOTE
[junit4:junit4]   2> 11107 T1788 oass.OpenExchangeRatesOrgProvider$OpenExchangeRates.<init> WARNING Expected key, got STRING
[junit4:junit4]   2> 11107 T1788 oasc.SolrCore.<init> [collection1] Opening new SolrCore at /usr/home/hudson/hudson-slave/workspace/Lucene-Solr-Tests-4.x-Java6/solr/build/solr-core/test/J0/./org.apache.solr.cloud.SyncSliceTest-jetty2-1362647103775/collection1/, dataDir=./org.apache.solr.cloud.SyncSliceTest-1362647095390/jetty2/
[junit4:junit4]   2> 11107 T1788 oasc.JmxMonitoredMap.<init> JMX monitoring is enabled. Adding Solr mbeans to JMX Server: com.sun.jmx.mbeanserver.JmxMBeanServer@5c4b82d2
[junit4:junit4]   2> 11108 T1788 oasc.SolrCore.initDirectoryFactory org.apache.solr.core.MockDirectoryFactory
[junit4:junit4]   2> 11109 T1788 oasc.CachingDirectoryFactory.get return new directory for /usr/home/hudson/hudson-slave/workspace/Lucene-Solr-Tests-4.x-Java6/solr/build/solr-core/test/J0/./org.apache.solr.cloud.SyncSliceTest-1362647095390/jetty2 forceNew: false
[junit4:junit4]   2> 11109 T1788 oasc.SolrCore.getNewIndexDir New index directory detected: old=null new=./org.apache.solr.cloud.SyncSliceTest-1362647095390/jetty2/index/
[junit4:junit4]   2> 11109 T1788 oasc.SolrCore.initIndex WARNING [collection1] Solr index directory './org.apache.solr.cloud.SyncSliceTest-1362647095390/jetty2/index' doesn't exist. Creating new index...
[junit4:junit4]   2> 11110 T1788 oasc.CachingDirectoryFactory.get return new directory for /usr/home/hudson/hudson-slave/workspace/Lucene-Solr-Tests-4.x-Java6/solr/build/solr-core/test/J0/./org.apache.solr.cloud.SyncSliceTest-1362647095390/jetty2/index forceNew: false
[junit4:junit4]   2> 11112 T1788 oasc.SolrDeletionPolicy.onCommit SolrDeletionPolicy.onCommit: commits:num=1
[junit4:junit4]   2> 		commit{dir=MockDirWrapper(org.apache.lucene.store.RAMDirectory@583a1bd lockFactory=org.apache.lucene.store.NativeFSLockFactory@847c3c1),segFN=segments_1,generation=1,filenames=[segments_1]
[junit4:junit4]   2> 11113 T1788 oasc.SolrDeletionPolicy.updateCommits newest commit = 1[segments_1]
[junit4:junit4]   2> 11115 T1788 oasup.UpdateRequestProcessorChain.init inserting DistributedUpdateProcessorFactory into updateRequestProcessorChain "dedupe"
[junit4:junit4]   2> 11115 T1788 oasup.UpdateRequestProcessorChain.init inserting DistributedUpdateProcessorFactory into updateRequestProcessorChain "stored_sig"
[junit4:junit4]   2> 11116 T1788 oasup.UpdateRequestProcessorChain.init inserting DistributedUpdateProcessorFactory into updateRequestProcessorChain "distrib-dup-test-chain-implicit"
[junit4:junit4]   2> 11117 T1788 oasc.RequestHandlers.initHandlersFromConfig created standard: solr.StandardRequestHandler
[junit4:junit4]   2> 11117 T1788 oasc.RequestHandlers.initHandlersFromConfig created /get: solr.RealTimeGetHandler
[junit4:junit4]   2> 11117 T1788 oasc.RequestHandlers.initHandlersFromConfig adding lazy requestHandler: solr.ReplicationHandler
[junit4:junit4]   2> 11118 T1788 oasc.RequestHandlers.initHandlersFromConfig created /replication: solr.ReplicationHandler
[junit4:junit4]   2> 11118 T1788 oasc.RequestHandlers.initHandlersFromConfig created /update: solr.UpdateRequestHandler
[junit4:junit4]   2> 11119 T1788 oasc.RequestHandlers.initHandlersFromConfig created /admin/: org.apache.solr.handler.admin.AdminHandlers
[junit4:junit4]   2> 11126 T1788 oashl.XMLLoader.init xsltCacheLifetimeSeconds=60
[junit4:junit4]   2> 11132 T1788 oass.SolrIndexSearcher.<init> Opening Searcher@25d2076d main
[junit4:junit4]   2> 11132 T1788 oasu.UpdateHandler.clearLog Clearing tlog files, tlogDir=./org.apache.solr.cloud.SyncSliceTest-1362647095390/jetty2/tlog
[junit4:junit4]   2> 11133 T1788 oasu.CommitTracker.<init> Hard AutoCommit: disabled
[junit4:junit4]   2> 11133 T1788 oasu.CommitTracker.<init> Soft AutoCommit: disabled
[junit4:junit4]   2> 11137 T1789 oasc.SolrCore.registerSearcher [collection1] Registered new searcher Searcher@25d2076d main{StandardDirectoryReader(segments_1:1)}
[junit4:junit4]   2> 11139 T1788 oasc.ZkController.publish publishing core=collection1 state=down
[junit4:junit4]   2> 11139 T1788 oasc.ZkController.publish numShards not found on descriptor - reading it from system property
[junit4:junit4]   2> 11375 T1754 oascc.ZkStateReader.updateClusterState Updating cloud state from ZooKeeper... 
[junit4:junit4]   2> 11376 T1754 oasc.Overseer$ClusterStateUpdater.updateState Update state numShards=1 message={
[junit4:junit4]   2> 	  "operation":"state",
[junit4:junit4]   2> 	  "core_node_name":"3",
[junit4:junit4]   2> 	  "numShards":"1",
[junit4:junit4]   2> 	  "shard":null,
[junit4:junit4]   2> 	  "roles":null,
[junit4:junit4]   2> 	  "state":"down",
[junit4:junit4]   2> 	  "core":"collection1",
[junit4:junit4]   2> 	  "collection":"collection1",
[junit4:junit4]   2> 	  "node_name":"127.0.0.1:22055_",
[junit4:junit4]   2> 	  "base_url":"http://127.0.0.1:22055"}
[junit4:junit4]   2> 11376 T1754 oasc.Overseer$ClusterStateUpdater.updateState Collection already exists with numShards=1
[junit4:junit4]   2> 11376 T1754 oasc.Overseer$ClusterStateUpdater.updateState Assigning new node to shard shard=shard1
[junit4:junit4]   2> 11384 T1753 oascc.ZkStateReader$2.process A cluster state change: WatchedEvent state:SyncConnected type:NodeDataChanged path:/clusterstate.json, has occurred - updating... (live nodes size: 3)
[junit4:junit4]   2> 11384 T1787 oascc.ZkStateReader$2.process A cluster state change: WatchedEvent state:SyncConnected type:NodeDataChanged path:/clusterstate.json, has occurred - updating... (live nodes size: 3)
[junit4:junit4]   2> 11384 T1772 oascc.ZkStateReader$2.process A cluster state change: WatchedEvent state:SyncConnected type:NodeDataChanged path:/clusterstate.json, has occurred - updating... (live nodes size: 3)
[junit4:junit4]   2> 11384 T1759 oascc.ZkStateReader$2.process A cluster state change: WatchedEvent state:SyncConnected type:NodeDataChanged path:/clusterstate.json, has occurred - updating... (live nodes size: 3)
[junit4:junit4]   2> 12147 T1788 oasc.CoreContainer.registerCore registering core: collection1
[junit4:junit4]   2> 12147 T1788 oasc.ZkController.register Register replica - core:collection1 address:http://127.0.0.1:22055 collection:collection1 shard:shard1
[junit4:junit4]   2> 12153 T1788 oasc.ZkController.register We are http://127.0.0.1:22055/collection1/ and leader is http://127.0.0.1:61855/collection1/
[junit4:junit4]   2> 12154 T1788 oasc.ZkController.register No LogReplay needed for core=collection1 baseURL=http://127.0.0.1:22055
[junit4:junit4]   2> 12154 T1788 oasc.ZkController.checkRecovery Core needs to recover:collection1
[junit4:junit4]   2> 12154 T1788 oasu.DefaultSolrCoreState.doRecovery Running recovery - first canceling any ongoing recovery
[junit4:junit4]   2> ASYNC  NEW_CORE C119 name=collection1 org.apache.solr.core.SolrCore@4e3eecd4 url=http://127.0.0.1:22055/collection1 node=127.0.0.1:22055_ C119_STATE=coll:collection1 core:collection1 props:{state=down, core=collection1, collection=collection1, node_name=127.0.0.1:22055_, base_url=http://127.0.0.1:22055}
[junit4:junit4]   2> 12156 T1790 C119 P22055 oasc.RecoveryStrategy.run Starting recovery process.  core=collection1 recoveringAfterStartup=true
[junit4:junit4]   2> 12157 T1790 C119 P22055 oasc.RecoveryStrategy.doRecovery ###### startupVersions=[]
[junit4:junit4]   2> 12157 T1790 C119 P22055 oasc.ZkController.publish publishing core=collection1 state=recovering
[junit4:junit4]   2> 12157 T1790 C119 P22055 oasc.ZkController.publish numShards not found on descriptor - reading it from system property
[junit4:junit4]   2> 12158 T1788 oascc.ZkStateReader.updateClusterState Updating cloud state from ZooKeeper... 
[junit4:junit4]   2> 12159 T1790 C119 P22055 oascsi.HttpClientUtil.createClient Creating new http client, config:maxConnections=128&maxConnectionsPerHost=32&followRedirects=false
[junit4:junit4]   2> 12160 T1731 oass.SolrDispatchFilter.init user.dir=/usr/home/hudson/hudson-slave/workspace/Lucene-Solr-Tests-4.x-Java6/solr/build/solr-core/test/J0
[junit4:junit4]   2> 12160 T1731 oass.SolrDispatchFilter.init SolrDispatchFilter.init() done
[junit4:junit4]   2> 12161 T1731 oascsi.HttpClientUtil.createClient Creating new http client, config:maxConnections=128&maxConnectionsPerHost=32&followRedirects=false
[junit4:junit4]   2> 12504 T1731 oejs.Server.doStart jetty-8.1.8.v20121106
[junit4:junit4]   2> 12507 T1731 oejs.AbstractConnector.doStart Started SocketConnector@127.0.0.1:32078
[junit4:junit4]   2> 12508 T1731 oass.SolrDispatchFilter.init SolrDispatchFilter.init()
[junit4:junit4]   2> 12509 T1731 oasc.SolrResourceLoader.locateSolrHome JNDI not configured for solr (NoInitialContextEx)
[junit4:junit4]   2> 12510 T1731 oasc.SolrResourceLoader.locateSolrHome using system property solr.solr.home: /usr/home/hudson/hudson-slave/workspace/Lucene-Solr-Tests-4.x-Java6/solr/build/solr-core/test/J0/./org.apache.solr.cloud.SyncSliceTest-jetty3-1362647107568
[junit4:junit4]   2> 12510 T1731 oasc.CoreContainer$Initializer.initialize looking for solr.xml: /usr/home/hudson/hudson-slave/workspace/Lucene-Solr-Tests-4.x-Java6/solr/build/solr-core/test/J0/./org.apache.solr.cloud.SyncSliceTest-jetty3-1362647107568/solr.xml
[junit4:junit4]   2> 12511 T1731 oasc.CoreContainer.<init> New CoreContainer 1898351998
[junit4:junit4]   2> 12512 T1731 oasc.CoreContainer.load Loading CoreContainer using Solr Home: '/usr/home/hudson/hudson-slave/workspace/Lucene-Solr-Tests-4.x-Java6/solr/build/solr-core/test/J0/./org.apache.solr.cloud.SyncSliceTest-jetty3-1362647107568/'
[junit4:junit4]   2> 12513 T1731 oasc.SolrResourceLoader.<init> new SolrResourceLoader for directory: '/usr/home/hudson/hudson-slave/workspace/Lucene-Solr-Tests-4.x-Java6/solr/build/solr-core/test/J0/./org.apache.solr.cloud.SyncSliceTest-jetty3-1362647107568/'
[junit4:junit4]   2> 12613 T1731 oashc.HttpShardHandlerFactory.getParameter Setting socketTimeout to: 120000
[junit4:junit4]   2> 12614 T1731 oashc.HttpShardHandlerFactory.getParameter Setting urlScheme to: http://
[junit4:junit4]   2> 12615 T1731 oashc.HttpShardHandlerFactory.getParameter Setting connTimeout to: 15000
[junit4:junit4]   2> 12616 T1731 oashc.HttpShardHandlerFactory.getParameter Setting maxConnectionsPerHost to: 20
[junit4:junit4]   2> 12616 T1731 oashc.HttpShardHandlerFactory.getParameter Setting corePoolSize to: 0
[junit4:junit4]   2> 12617 T1731 oashc.HttpShardHandlerFactory.getParameter Setting maximumPoolSize to: 2147483647
[junit4:junit4]   2> 12618 T1731 oashc.HttpShardHandlerFactory.getParameter Setting maxThreadIdleTime to: 5
[junit4:junit4]   2> 12618 T1731 oashc.HttpShardHandlerFactory.getParameter Setting sizeOfQueue to: -1
[junit4:junit4]   2> 12619 T1731 oashc.HttpShardHandlerFactory.getParameter Setting fairnessPolicy to: false
[junit4:junit4]   2> 12620 T1731 oascsi.HttpClientUtil.createClient Creating new http client, config:maxConnectionsPerHost=20&maxConnections=10000&socketTimeout=120000&connTimeout=15000&retry=false
[junit4:junit4]   2> 12651 T1731 oasc.CoreContainer.load Registering Log Listener
[junit4:junit4]   2> 12681 T1731 oasc.CoreContainer.initZooKeeper Zookeeper client=127.0.0.1:58213/solr
[junit4:junit4]   2> 12682 T1731 oasc.ZkController.checkChrootPath zkHost includes chroot
[junit4:junit4]   2> 12683 T1731 oaz.ZooKeeper.<init> Initiating client connection, connectString=127.0.0.1:58213 sessionTimeout=60000 watcher=org.apache.solr.common.cloud.ConnectionManager@778ff1dc
[junit4:junit4]   2> 12685 T1731 oascc.ConnectionManager.waitForConnected Waiting for client to connect to ZooKeeper
[junit4:junit4]   2> 12685 T1800 oaz.ClientCnxn$SendThread.logStartConnect Opening socket connection to server localhost/127.0.0.1:58213. Will not attempt to authenticate using SASL (access denied (javax.security.auth.AuthPermission getLoginConfiguration))
[junit4:junit4]   2> 12687 T1800 oaz.ClientCnxn$SendThread.primeConnection Socket connection established to localhost/127.0.0.1:58213, initiating session
[junit4:junit4]   2> 12687 T1733 oazs.NIOServerCnxnFactory.run Accepted socket connection from /140.211.11.196:10979
[junit4:junit4]   2> 12688 T1733 oazs.ZooKeeperServer.processConnectRequest Client attempting to establish new session at /140.211.11.196:10979
[junit4:junit4]   2> 12690 T1735 oazs.ZooKeeperServer.finishSessionInit Established session 0x13d441898640009 with negotiated timeout 20000 for client /140.211.11.196:10979
[junit4:junit4]   2> 12690 T1800 oaz.ClientCnxn$SendThread.onConnected Session establishment complete on server localhost/127.0.0.1:58213, sessionid = 0x13d441898640009, negotiated timeout = 20000
[junit4:junit4]   2> 12691 T1801 oascc.ConnectionManager.process Watcher org.apache.solr.common.cloud.ConnectionManager@778ff1dc name:ZooKeeperConnection Watcher:127.0.0.1:58213 got event WatchedEvent state:SyncConnected type:None path:null path:null type:None
[junit4:junit4]   2> 12691 T1731 oascc.ConnectionManager.waitForConnected Client is connected to ZooKeeper
[junit4:junit4]   2> 12692 T1736 oazs.PrepRequestProcessor.pRequest2Txn Processed session termination for sessionid: 0x13d441898640009
[junit4:junit4]   2> 12694 T1801 oaz.ClientCnxn$EventThread.run EventThread shut down
[junit4:junit4]   2> 12694 T1731 oaz.ZooKeeper.close Session: 0x13d441898640009 closed
[junit4:junit4]   2> 12694 T1731 oascsi.HttpClientUtil.createClient Creating new http client, config:maxConnections=500&maxConnectionsPerHost=16&socketTimeout=120000&connTimeout=15000
[junit4:junit4]   2> 12695 T1733 oazs.NIOServerCnxn.doIO WARNING caught end of stream exception EndOfStreamException: Unable to read additional data from client sessionid 0x13d441898640009, likely client has closed socket
[junit4:junit4]   2> 	at org.apache.zookeeper.server.NIOServerCnxn.doIO(NIOServerCnxn.java:220)
[junit4:junit4]   2> 	at org.apache.zookeeper.server.NIOServerCnxnFactory.run(NIOServerCnxnFactory.java:208)
[junit4:junit4]   2> 	at java.lang.Thread.run(Thread.java:679)
[junit4:junit4]   2> 
[junit4:junit4]   2> 12696 T1733 oazs.NIOServerCnxn.closeSock Closed socket connection for client /140.211.11.196:10979 which had sessionid 0x13d441898640009
[junit4:junit4]   2> 12705 T1731 oaz.ZooKeeper.<init> Initiating client connection, connectString=127.0.0.1:58213/solr sessionTimeout=30000 watcher=org.apache.solr.common.cloud.ConnectionManager@5ac43679
[junit4:junit4]   2> 12706 T1731 oascc.ConnectionManager.waitForConnected Waiting for client to connect to ZooKeeper
[junit4:junit4]   2> 12707 T1802 oaz.ClientCnxn$SendThread.logStartConnect Opening socket connection to server localhost/127.0.0.1:58213. Will not attempt to authenticate using SASL (access denied (javax.security.auth.AuthPermission getLoginConfiguration))
[junit4:junit4]   2> 12707 T1802 oaz.ClientCnxn$SendThread.primeConnection Socket connection established to localhost/127.0.0.1:58213, initiating session
[junit4:junit4]   2> 12708 T1733 oazs.NIOServerCnxnFactory.run Accepted socket connection from /140.211.11.196:30771
[junit4:junit4]   2> 12708 T1733 oazs.ZooKeeperServer.processConnectRequest Client attempting to establish new session at /140.211.11.196:30771
[junit4:junit4]   2> 12710 T1735 oazs.ZooKeeperServer.finishSessionInit Established session 0x13d44189864000a with negotiated timeout 20000 for client /140.211.11.196:30771
[junit4:junit4]   2> 12710 T1802 oaz.ClientCnxn$SendThread.onConnected Session establishment complete on server localhost/127.0.0.1:58213, sessionid = 0x13d44189864000a, negotiated timeout = 20000
[junit4:junit4]   2> 12710 T1803 oascc.ConnectionManager.process Watcher org.apache.solr.common.cloud.ConnectionManager@5ac43679 name:ZooKeeperConnection Watcher:127.0.0.1:58213/solr got event WatchedEvent state:SyncConnected type:None path:null path:null type:None
[junit4:junit4]   2> 12711 T1731 oascc.ConnectionManager.waitForConnected Client is connected to ZooKeeper
[junit4:junit4]   2> 12712 T1736 oazs.PrepRequestProcessor.pRequest Got user-level KeeperException when processing sessionid:0x13d44189864000a type:create cxid:0x1 zxid:0x81 txntype:-1 reqpath:n/a Error Path:/solr/overseer Error:KeeperErrorCode = NodeExists for /solr/overseer
[junit4:junit4]   2> 12715 T1736 oazs.PrepRequestProcessor.pRequest Got user-level KeeperException when processing sessionid:0x13d44189864000a type:create cxid:0x2 zxid:0x82 txntype:-1 reqpath:n/a Error Path:/solr/overseer Error:KeeperErrorCode = NodeExists for /solr/overseer
[junit4:junit4]   2> 12718 T1731 oascc.ZkStateReader.createClusterStateWatchersAndUpdate Updating cluster state from ZooKeeper... 
[junit4:junit4]   2> 12898 T1754 oascc.ZkStateReader.updateClusterState Updating cloud state from ZooKeeper... 
[junit4:junit4]   2> 12900 T1754 oasc.Overseer$ClusterStateUpdater.updateState Update state numShards=1 message={
[junit4:junit4]   2> 	  "operation":"state",
[junit4:junit4]   2> 	  "core_node_name":"3",
[junit4:junit4]   2> 	  "numShards":"1",
[junit4:junit4]   2> 	  "shard":"shard1",
[junit4:junit4]   2> 	  "roles":null,
[junit4:junit4]   2> 	  "state":"recovering",
[junit4:junit4]   2> 	  "core":"collection1",
[junit4:junit4]   2> 	  "collection":"collection1",
[junit4:junit4]   2> 	  "node_name":"127.0.0.1:22055_",
[junit4:junit4]   2> 	  "base_url":"http://127.0.0.1:22055"}
[junit4:junit4]   2> 12910 T1753 oascc.ZkStateReader$2.process A cluster state change: WatchedEvent state:SyncConnected type:NodeDataChanged path:/clusterstate.json, has occurred - updating... (live nodes size: 3)
[junit4:junit4]   2> 12910 T1772 oascc.ZkStateReader$2.process A cluster state change: WatchedEvent state:SyncConnected type:NodeDataChanged path:/clusterstate.json, has occurred - updating... (live nodes size: 3)
[junit4:junit4]   2> 12910 T1787 oascc.ZkStateReader$2.process A cluster state change: WatchedEvent state:SyncConnected type:NodeDataChanged path:/clusterstate.json, has occurred - updating... (live nodes size: 3)
[junit4:junit4]   2> 12910 T1759 oascc.ZkStateReader$2.process A cluster state change: WatchedEvent state:SyncConnected type:NodeDataChanged path:/clusterstate.json, has occurred - updating... (live nodes size: 3)
[junit4:junit4]   2> 12910 T1803 oascc.ZkStateReader$2.process A cluster state change: WatchedEvent state:SyncConnected type:NodeDataChanged path:/clusterstate.json, has occurred - updating... (live nodes size: 3)
[junit4:junit4]   2> 13185 T1762 oass.SolrDispatchFilter.handleAdminRequest /admin/cores {coreNodeName=3&state=recovering&nodeName=127.0.0.1:22055_&action=PREPRECOVERY&checkLive=true&core=collection1&wt=javabin&onlyIfLeader=true&version=2} status=0 QTime=1001 
[junit4:junit4]   2> 13724 T1731 oasc.ZkController.createEphemeralLiveNode Register node as live in ZooKeeper:/live_nodes/127.0.0.1:32078_
[junit4:junit4]   2> 13725 T1736 oazs.PrepRequestProcessor.pRequest Got user-level KeeperException when processing sessionid:0x13d44189864000a type:delete cxid:0xd zxid:0x87 txntype:-1 reqpath:n/a Error Path:/solr/live_nodes/127.0.0.1:32078_ Error:KeeperErrorCode = NoNode for /solr/live_nodes/127.0.0.1:32078_
[junit4:junit4]   2> 13727 T1731 oascc.SolrZkClient.makePath makePath: /live_nodes/127.0.0.1:32078_
[junit4:junit4]   2> 13730 T1772 oascc.ZkStateReader$2.process A cluster state change: WatchedEvent state:SyncConnected type:NodeChildrenChanged path:/live_nodes, has occurred - updating... (live nodes size: 3)
[junit4:junit4]   2> 13730 T1753 oascc.ZkStateReader$2.process A cluster state change: WatchedEvent state:SyncConnected type:NodeChildrenChanged path:/live_nodes, has occurred - updating... (live nodes size: 3)
[junit4:junit4]   2> 13730 T1803 oascc.ZkStateReader$3.process Updating live nodes... (4)
[junit4:junit4]   2> 13731 T1787 oascc.ZkStateReader$3.process Updating live nodes... (4)
[junit4:junit4]   2> 13731 T1803 oascc.ZkStateReader$2.process A cluster state change: WatchedEvent state:SyncConnected type:NodeChildrenChanged path:/live_nodes, has occurred - updating... (live nodes size: 4)
[junit4:junit4]   2> 13731 T1787 oascc.ZkStateReader$2.process A cluster state change: WatchedEvent state:SyncConnected type:NodeChildrenChanged path:/live_nodes, has occurred - updating... (live nodes size: 4)
[junit4:junit4]   2> 13731 T1759 oascc.ZkStateReader$3.process Updating live nodes... (4)
[junit4:junit4]   2> 13731 T1759 oascc.ZkStateReader$2.process A cluster state change: WatchedEvent state:SyncConnected type:NodeChildrenChanged path:/live_nodes, has occurred - updating... (live nodes size: 4)
[junit4:junit4]   2> 13732 T1753 oascc.ZkStateReader$3.process Updating live nodes... (4)
[junit4:junit4]   2> 13732 T1772 oascc.ZkStateReader$3.process Updating live nodes... (4)
[junit4:junit4]   2> 13748 T1804 oasc.CoreContainer.create Creating SolrCore 'collection1' using instanceDir: /usr/home/hudson/hudson-slave/workspace/Lucene-Solr-Tests-4.x-Java6/solr/build/solr-core/test/J0/./org.apache.solr.cloud.SyncSliceTest-jetty3-1362647107568/collection1
[junit4:junit4]   2> 13748 T1804 oasc.ZkController.createCollectionZkNode Check for collection zkNode:collection1
[junit4:junit4]   2> 13749 T1804 oasc.ZkController.createCollectionZkNode Collection zkNode exists
[junit4:junit4]   2> 13749 T1804 oasc.ZkController.readConfigName Load collection config from:/collections/collection1
[junit4:junit4]   2> 13751 T1804 oasc.SolrResourceLoader.<init> new SolrResourceLoader for directory: '/usr/home/hudson/hudson-slave/workspace/Lucene-Solr-Tests-4.x-Java6/solr/build/solr-core/test/J0/./org.apache.solr.cloud.SyncSliceTest-jetty3-1362647107568/collection1/'
[junit4:junit4]   2> 13753 T1804 oasc.SolrResourceLoader.replaceClassLoader Adding 'file:/usr/home/hudson/hudson-slave/workspace/Lucene-Solr-Tests-4.x-Java6/solr/build/solr-core/test/J0/org.apache.solr.cloud.SyncSliceTest-jetty3-1362647107568/collection1/lib/classes/' to classloader
[junit4:junit4]   2> 13753 T1804 oasc.SolrResourceLoader.replaceClassLoader Adding 'file:/usr/home/hudson/hudson-slave/workspace/Lucene-Solr-Tests-4.x-Java6/solr/build/solr-core/test/J0/org.apache.solr.cloud.SyncSliceTest-jetty3-1362647107568/collection1/lib/README' to classloader
[junit4:junit4]   2> 13827 T1804 oasc.SolrConfig.<init> Using Lucene MatchVersion: LUCENE_42
[junit4:junit4]   2> 13908 T1804 oasc.SolrConfig.<init> Loaded SolrConfig: solrconfig.xml
[junit4:junit4]   2> 14009 T1804 oass.IndexSchema.readSchema Reading Solr Schema
[junit4:junit4]   2> 14030 T1804 oass.IndexSchema.readSchema Schema name=test
[junit4:junit4]   2> 14863 T1804 oass.OpenExchangeRatesOrgProvider.init Initialized with rates=open-exchange-rates.json, refreshInterval=1440.
[junit4:junit4]   2> 14874 T1804 oass.IndexSchema.readSchema default search field in schema is text
[junit4:junit4]   2> 14879 T1804 oass.IndexSchema.readSchema unique key field: id
[junit4:junit4]   2> 14900 T1804 oass.FileExchangeRateProvider.reload Reloading exchange rates from file currency.xml
[junit4:junit4]   2> 14910 T1804 oass.FileExchangeRateProvider.reload Reloading exchange rates from file currency.xml
[junit4:junit4]   2> 14919 T1804 oass.OpenExchangeRatesOrgProvider.reload Reloading exchange rates from open-exchange-rates.json
[junit4:junit4]   2> 14921 T1804 oass.OpenExchangeRatesOrgProvider$OpenExchangeRates.<init> WARNING Unknown key IMPORTANT NOTE
[junit4:junit4]   2> 14923 T1804 oass.OpenExchangeRatesOrgProvider$OpenExchangeRates.<init> WARNING Expected key, got STRING
[junit4:junit4]   2> 14923 T1804 oass.OpenExchangeRatesOrgProvider.reload Reloading exchange rates from open-exchange-rates.json
[junit4:junit4]   2> 14925 T1804 oass.OpenExchangeRatesOrgProvider$OpenExchangeRates.<init> WARNING Unknown key IMPORTANT NOTE
[junit4:junit4]   2> 14925 T1804 oass.OpenExchangeRatesOrgProvider$OpenExchangeRates.<init> WARNING Expected key, got STRING
[junit4:junit4]   2> 14925 T1804 oasc.SolrCore.<init> [collection1] Opening new SolrCore at /usr/home/hudson/hudson-slave/workspace/Lucene-Solr-Tests-4.x-Java6/solr/build/solr-core/test/J0/./org.apache.solr.cloud.SyncSliceTest-jetty3-1362647107568/collection1/, dataDir=./org.apache.solr.cloud.SyncSliceTest-1362647095390/jetty3/
[junit4:junit4]   2> 14926 T1804 oasc.JmxMonitoredMap.<init> JMX monitoring is enabled. Adding Solr mbeans to JMX Server: com.sun.jmx.mbeanserver.JmxMBeanServer@5c4b82d2
[junit4:junit4]   2> 14927 T1804 oasc.SolrCore.initDirectoryFactory org.apache.solr.core.MockDirectoryFactory
[junit4:junit4]   2> 14928 T1804 oasc.CachingDirectoryFactory.get return new directory for /usr/home/hudson/hudson-slave/workspace/Lucene-Solr-Tests-4.x-Java6/solr/build/solr-core/test/J0/./org.apache.solr.cloud.SyncSliceTest-1362647095390/jetty3 forceNew: false
[junit4:junit4]   2> 14928 T1804 oasc.SolrCore.getNewIndexDir New index directory detected: old=null new=./org.apache.solr.cloud.SyncSliceTest-1362647095390/jetty3/index/
[junit4:junit4]   2> 14929 T1804 oasc.SolrCore.initIndex WARNING [collection1] Solr index directory './org.apache.solr.cloud.SyncSliceTest-1362647095390/jetty3/index' doesn't exist. Creating new index...
[junit4:junit4]   2> 14930 T1804 oasc.CachingDirectoryFactory.get return new directory for /usr/home/hudson/hudson-slave/workspace/Lucene-Solr-Tests-4.x-Java6/solr/build/solr-core/test/J0/./org.apache.solr.cloud.SyncSliceTest-1362647095390/jetty3/index forceNew: false
[junit4:junit4]   2> 14934 T1804 oasc.SolrDeletionPolicy.onCommit SolrDeletionPolicy.onCommit: commits:num=1
[junit4:junit4]   2> 		commit{dir=MockDirWrapper(org.apache.lucene.store.RAMDirectory@6f11f895 lockFactory=org.apache.lucene.store.NativeFSLockFactory@4d66ea88),segFN=segments_1,generation=1,filenames=[segments_1]
[junit4:junit4]   2> 14934 T1804 oasc.SolrDeletionPolicy.updateCommits newest commit = 1[segments_1]
[junit4:junit4]   2> 14937 T1804 oasup.UpdateRequestProcessorChain.init inserting DistributedUpdateProcessorFactory into updateRequestProcessorChain "dedupe"
[junit4:junit4]   2> 14937 T1804 oasup.UpdateRequestProcessorChain.init inserting DistributedUpdateProcessorFactory into updateRequestProcessorChain "stored_sig"
[junit4:junit4]   2> 14938 T1804 oasup.UpdateRequestProcessorChain.init inserting DistributedUpdateProcessorFactory into updateRequestProcessorChain "distrib-dup-test-chain-implicit"
[junit4:junit4]   2> 14938 T1804 oasc.RequestHandlers.initHandlersFromConfig created standard: solr.StandardRequestHandler
[junit4:junit4]   2> 14939 T1804 oasc.RequestHandlers.initHandlersFromConfig created /get: solr.RealTimeGetHandler
[junit4:junit4]   2> 14939 T1804 oasc.RequestHandlers.initHandlersFromConfig adding lazy requestHandler: solr.ReplicationHandler
[junit4:junit4]   2> 14940 T1804 oasc.RequestHandlers.initHandlersFromConfig created /replication: solr.ReplicationHandler
[junit4:junit4]   2> 14940 T1804 oasc.RequestHandlers.initHandlersFromConfig created /update: solr.UpdateRequestHandler
[junit4:junit4]   2> 14941 T1804 oasc.RequestHandlers.initHandlersFromConfig created /admin/: org.apache.solr.handler.admin.AdminHandlers
[junit4:junit4]   2> 14953 T1804 oashl.XMLLoader.init xsltCacheLifetimeSeconds=60
[junit4:junit4]   2> 14959 T1804 oass.SolrIndexSearcher.<init> Opening Searcher@589f393 main
[junit4:junit4]   2> 14960 T1804 oasu.UpdateHandler.clearLog Clearing tlog files, tlogDir=./org.apache.solr.cloud.SyncSliceTest-1362647095390/jetty3/tlog
[junit4:junit4]   2> 14961 T1804 oasu.CommitTracker.<init> Hard AutoCommit: disabled
[junit4:junit4]   2> 14961 T1804 oasu.CommitTracker.<init> Soft AutoCommit: disabled
[junit4:junit4]   2> 14966 T1805 oasc.SolrCore.registerSearcher [collection1] Registered new searcher Searcher@589f393 main{StandardDirectoryReader(segments_1:1)}
[junit4:junit4]   2> 14969 T1804 oasc.ZkController.publish publishing core=collection1 state=down
[junit4:junit4]   2> 14970 T1804 oasc.ZkController.publish numShards not found on descriptor - reading it from system property
[junit4:junit4]   2>  C119_STATE=coll:collection1 core:collection1 props:{shard=shard1, state=recovering, core=collection1, collection=collection1, node_name=127.0.0.1:22055_, base_url=http://127.0.0.1:22055}
[junit4:junit4]   2> 15187 T1790 C119 P22055 oasc.RecoveryStrategy.doRecovery Attempting to PeerSync from http://127.0.0.1:61855/collection1/ core=collection1 - recoveringAfterStartup=true
[junit4:junit4]   2> 15187 T1790 C119 P22055 oasu.PeerSync.sync PeerSync: core=collection1 url=http://127.0.0.1:22055 START replicas=[http://127.0.0.1:61855/collection1/] nUpdates=100
[junit4:junit4]   2> 15188 T1790 C119 P22055 oasu.PeerSync.sync WARNING no frame of reference to tell of we've missed updates
[junit4:junit4]   2> 15188 T1790 C119 P22055 oasc.RecoveryStrategy.doRecovery PeerSync Recovery was not successful - trying replication. core=collection1
[junit4:junit4]   2> 15188 T1790 C119 P22055 oasc.RecoveryStrategy.doRecovery Starting Replication Recovery. core=collection1
[junit4:junit4]   2> 15189 T1790 C119 P22055 oasc.RecoveryStrategy.doRecovery Begin buffering updates. core=collection1
[junit4:junit4]   2> 15189 T1790 C119 P22055 oasu.UpdateLog.bufferUpdates Starting to buffer updates. FSUpdateLog{state=ACTIVE, tlog=null}
[junit4:junit4]   2> 15189 T1790 C119 P22055 oasc.RecoveryStrategy.replicate Attempting to replicate from http://127.0.0.1:61855/collection1/. core=collection1
[junit4:junit4]   2> 15189 T1790 C119 P22055 oascsi.HttpClientUtil.createClient Creating new http client, config:maxConnections=128&maxConnectionsPerHost=32&followRedirects=false
[junit4:junit4]   2> ASYNC  NEW_CORE C120 name=collection1 org.apache.solr.core.SolrCore@5d042698 url=http://127.0.0.1:61855/collection1 node=127.0.0.1:61855_ C120_STATE=coll:collection1 core:collection1 props:{shard=shard1, state=active, core=collection1, collection=collection1, node_name=127.0.0.1:61855_, base_url=http://127.0.0.1:61855, leader=true}
[junit4:junit4]   2> 15206 T1763 C120 P61855 REQ /get {getVersions=100&distrib=false&wt=javabin&qt=/get&version=2} status=0 QTime=0 
[junit4:junit4]   2> 15218 T1764 C120 P61855 oasu.DirectUpdateHandler2.commit start commit{,optimize=false,openSearcher=false,waitSearcher=true,expungeDeletes=false,softCommit=false,prepareCommit=false}
[junit4:junit4]   2> 15222 T1764 C120 P61855 oasc.SolrDeletionPolicy.onInit SolrDeletionPolicy.onInit: commits:num=1
[junit4:junit4]   2> 		commit{dir=MockDirWrapper(org.apache.lucene.store.RAMDirectory@285896a2 lockFactory=org.apache.lucene.store.NativeFSLockFactory@1e411c06),segFN=segments_1,generation=1,filenames=[segments_1]
[junit4:junit4]   2> 15223 T1764 C120 P61855 oasc.SolrDeletionPolicy.updateCommits newest commit = 1[segments_1]
[junit4:junit4]   2> 15224 T1764 C120 P61855 oasc.SolrDeletionPolicy.onCommit SolrDeletionPolicy.onCommit: commits:num=2
[junit4:junit4]   2> 		commit{dir=MockDirWrapper(org.apache.lucene.store.RAMDirectory@285896a2 lockFactory=org.apache.lucene.store.NativeFSLockFactory@1e411c06),segFN=segments_1,generation=1,filenames=[segments_1]
[junit4:junit4]   2> 		commit{dir=MockDirWrapper(org.apache.lucene.store.RAMDirectory@285896a2 lockFactory=org.apache.lucene.store.NativeFSLockFactory@1e411c06),segFN=segments_2,generation=2,filenames=[segments_2]
[junit4:junit4]   2> 15224 T1764 C120 P61855 oasc.SolrDeletionPolicy.updateCommits newest commit = 2[segments_2]
[junit4:junit4]   2> 15225 T1764 C120 P61855 oass.SolrIndexSearcher.<init> Opening Searcher@750e589 realtime
[junit4:junit4]   2> 15225 T1764 C120 P61855 oasu.DirectUpdateHandler2.commit end_commit_flush
[junit4:junit4]   2> 15226 T1764 C120 P61855 /update {waitSearcher=true&openSearcher=false&commit=true&wt=javabin&commit_end_point=true&version=2&softCommit=false} {commit=} 0 8
[junit4:junit4]   2> 15227 T1790 C119 P22055 oash.ReplicationHandler.inform Commits will be reserved for  10000
[junit4:junit4]   2> 15227 T1790 C119 P22055 oash.SnapPuller.<init>  No value set for 'pollInterval'. Timer Task not started.
[junit4:junit4]   2> 15229 T1765 C120 P61855 oash.ReplicationHandler.inform Commits will be reserved for  10000
[junit4:junit4]   2> 15230 T1765 C120 P61855 REQ /replication {command=indexversion&qt=/replication&wt=javabin&version=2} status=0 QTime=1 
[junit4:junit4]   2> 15231 T1790 C119 P22055 oash.SnapPuller.fetchLatestIndex Master's generation: 2
[junit4:junit4]   2> 15231 T1790 C119 P22055 oash.SnapPuller.fetchLatestIndex Slave's generation: 1
[junit4:junit4]   2> 15231 T1790 C119 P22055 oash.SnapPuller.fetchLatestIndex Starting replication process
[junit4:junit4]   2> 15233 T1765 C120 P61855 REQ /replication {command=filelist&qt=/replication&wt=javabin&generation=2&version=2} status=0 QTime=0 
[junit4:junit4]   2> 15234 T1790 C119 P22055 oash.SnapPuller.fetchLatestIndex Number of files in latest index in master: 1
[junit4:junit4]   2> 15235 T1790 C119 P22055 oasc.CachingDirectoryFactory.get return new directory for /usr/home/hudson/hudson-slave/workspace/Lucene-Solr-Tests-4.x-Java6/solr/build/solr-core/test/J0/./org.apache.solr.cloud.SyncSliceTest-1362647095390/jetty2/index.20130307030510620 forceNew: false
[junit4:junit4]   2> 15235 T1790 C119 P22055 oash.SnapPuller.fetchLatestIndex Starting download to MockDirWrapper(org.apache.lucene.store.RAMDirectory@797a1389 lockFactory=org.apache.lucene.store.NativeFSLockFactory@78da0072) fullCopy=false
[junit4:junit4]   2> 15238 T1765 C120 P61855 REQ /replication {file=segments_2&command=filecontent&checksum=true&wt=filestream&qt=/replication&generation=2} status=0 QTime=0 
[junit4:junit4]   2> 15240 T1790 C119 P22055 oash.SnapPuller.fetchLatestIndex Total time taken for download : 0 secs
[junit4:junit4]   2> 15241 T1790 C119 P22055 oasu.DefaultSolrCoreState.newIndexWriter Creating new IndexWriter...
[junit4:junit4]   2> 15241 T1790 C119 P22055 oasu.DefaultSolrCoreState.newIndexWriter Waiting until IndexWriter is unused... core=collection1
[junit4:junit4]   2> 15244 T1790 C119 P22055 oasc.SolrDeletionPolicy.onInit SolrDeletionPolicy.onInit: commits:num=2
[junit4:junit4]   2> 		commit{dir=MockDirWrapper(org.apache.lucene.store.RAMDirectory@583a1bd lockFactory=org.apache.lucene.store.NativeFSLockFactory@847c3c1),segFN=segments_1,generation=1,filenames=[segments_1]
[junit4:junit4]   2> 		commit{dir=MockDirWrapper(org.apache.lucene.store.RAMDirectory@583a1bd lockFactory=org.apache.lucene.store.NativeFSLockFactory@847c3c1),segFN=segments_2,generation=2,filenames=[segments_2]
[junit4:junit4]   2> 15244 T1790 C119 P22055 oasc.SolrDeletionPolicy.updateCommits newest commit = 2[segments_2]
[junit4:junit4]   2> 15245 T1790 C119 P22055 oasu.DefaultSolrCoreState.newIndexWriter New IndexWriter is ready to be used.
[junit4:junit4]   2> 15245 T1790 C119 P22055 oass.SolrIndexSearcher.<init> Opening Searcher@1b00b6ba main
[junit4:junit4]   2> 15247 T1789 oasc.SolrCore.registerSearcher [collection1] Registered new searcher Searcher@1b00b6ba main{StandardDirectoryReader(segments_2:1:nrt)}
[junit4:junit4]   2> 15247 T1790 C119 P22055 oash.SnapPuller.fetchLatestIndex removing temporary index download directory files MockDirWrapper(org.apache.lucene.store.RAMDirectory@797a1389 lockFactory=org.apache.lucene.store.NativeFSLockFactory@78da0072)
[junit4:junit4]   2> 15248 T1790 C119 P22055 oasc.RecoveryStrategy.replay No replay needed. core=collection1
[junit4:junit4]   2> 15248 T1790 C119 P22055 oasc.RecoveryStrategy.doRecovery Replication Recovery was successful - registering as Active. core=collection1
[junit4:junit4]   2> 15248 T1790 C119 P22055 oasc.ZkController.publish publishing core=collection1 state=active
[junit4:junit4]   2> 15248 T1790 C119 P22055 oasc.ZkController.publish numShards not found on descriptor - reading it from system property
[junit4:junit4]   2> 15251 T1790 C119 P22055 oasc.RecoveryStrategy.doRecovery Finished recovery process. core=collection1
[junit4:junit4]   2> 15927 T1754 oascc.ZkStateReader.updateClusterState Updating cloud state from ZooKeeper... 
[junit4:junit4]   2> 15928 T1754 oasc.Overseer$ClusterStateUpdater.updateState Update state numShards=1 message={
[junit4:junit4]   2> 	  "operation":"state",
[junit4:junit4]   2> 	  "core_node_name":"4",
[junit4:junit4]   2> 	  "numShards":"1",
[junit4:junit4]   2> 	  "shard":null,
[junit4:junit4]   2> 	  "roles":null,
[junit4:junit4]   2> 	  "state":"down",
[junit4:junit4]   2> 	  "core":"collection1",
[junit4:junit4]   2> 	  "collection":"collection1",
[junit4:junit4]   2> 	  "node_name":"127.0.0.1:32078_",
[junit4:junit4]   2> 	  "base_url":"http://127.0.0.1:32078"}
[junit4:junit4]   2> 15928 T1754 oasc.Overseer$ClusterStateUpdater.updateState Collection already exists with numShards=1
[junit4:junit4]   2> 15928 T1754 oasc.Overseer$ClusterStateUpdater.updateState Assigning new node to shard shard=shard1
[junit4:junit4]   2> 15964 T1754 oasc.Overseer$ClusterStateUpdater.updateState Update state numShards=1 message={
[junit4:junit4]   2> 	  "operation":"state",
[junit4:junit4]   2> 	  "core_node_name":"3",
[junit4:junit4]   2> 	  "numShards":"1",
[junit4:junit4]   2> 	  "shard":"shard1",
[junit4:junit4]   2> 	  "roles":null,
[junit4:junit4]   2> 	  "state":"active",
[junit4:junit4]   2> 	  "core":"collection1",
[junit4:junit4]   2> 	  "collection":"collection1",
[junit4:junit4]   2> 	  "node_name":"127.0.0.1:22055_",
[junit4:junit4]   2> 	  "base_url":"http://127.0.0.1:22055"}
[junit4:junit4]   2> 15986 T1753 oascc.ZkStateReader$2.process A cluster state change: WatchedEvent state:SyncConnected type:NodeDataChanged path:/clusterstate.json, has occurred - updating... (live nodes size: 4)
[junit4:junit4]   2> 15986 T1772 oascc.ZkStateReader$2.process A cluster state change: WatchedEvent state:SyncConnected type:NodeDataChanged path:/clusterstate.json, has occurred - updating... (live nodes size: 4)
[junit4:junit4]   2> 15986 T1803 oascc.ZkStateReader$2.process A cluster state change: WatchedEvent state:SyncConnected type:NodeDataChanged path:/clusterstate.json, has occurred - updating... (live nodes size: 4)
[junit4:junit4]   2> 15986 T1759 oascc.ZkStateReader$2.process A cluster state change: WatchedEvent state:SyncConnected type:NodeDataChanged path:/clusterstate.json, has occurred - updating... (live nodes size: 4)
[junit4:junit4]   2> 15986 T1787 oascc.ZkStateReader$2.process A cluster state change: WatchedEvent state:SyncConnected type:NodeDataChanged path:/clusterstate.json, has occurred - updating... (live nodes size: 4)
[junit4:junit4]   2> 16983 T1804 oasc.CoreContainer.registerCore registering core: collection1
[junit4:junit4]   2> 16983 T1804 oasc.ZkController.register Register replica - core:collection1 address:http://127.0.0.1:32078 collection:collection1 shard:shard1
[junit4:junit4]   2> 16987 T1804 oasc.ZkController.register We are http://127.0.0.1:32078/collection1/ and leader is http://127.0.0.1:61855/collection1/
[junit4:junit4]   2> 16987 T1804 oasc.ZkController.register No LogReplay needed for core=collection1 baseURL=http://127.0.0.1:32078
[junit4:junit4]   2> 16987 T1804 oasc.ZkController.checkRecovery Core needs to recover:collection1
[junit4:junit4]   2> 16988 T1804 oasu.DefaultSolrCoreState.doRecovery Running recovery - first canceling any ongoing recovery
[junit4:junit4]   2> ASYNC  NEW_CORE C121 name=collection1 org.apache.solr.core.SolrCore@f0ad2ea url=http://127.0.0.1:32078/collection1 node=127.0.0.1:32078_ C121_STATE=coll:collection1 core:collection1 props:{state=down, core=collection1, collection=collection1, node_name=127.0.0.1:32078_, base_url=http://127.0.0.1:32078}
[junit4:junit4]   2> 16989 T1808 C121 P32078 oasc.RecoveryStrategy.run Starting recovery process.  core=collection1 recoveringAfterStartup=true
[junit4:junit4]   2> 16989 T1808 C121 P32078 oasc.RecoveryStrategy.doRecovery ###### startupVersions=[]
[junit4:junit4]   2> 16990 T1804 oascc.ZkStateReader.updateClusterState Updating cloud state from ZooKeeper... 
[junit4:junit4]   2> 16990 T1808 C121 P32078 oasc.ZkController.publish publishing core=collection1 state=recovering
[junit4:junit4]   2> 16990 T1808 C121 P32078 oasc.ZkController.publish numShards not found on descriptor - reading it from system property
[junit4:junit4]   2> 16990 T1731 oass.SolrDispatchFilter.init user.dir=/usr/home/hudson/hudson-slave/workspace/Lucene-Solr-Tests-4.x-Java6/solr/build/solr-core/test/J0
[junit4:junit4]   2> 16991 T1731 oass.SolrDispatchFilter.init SolrDispatchFilter.init() done
[junit4:junit4]   2> 16991 T1808 C121 P32078 oascsi.HttpClientUtil.createClient Creating new http client, config:maxConnections=128&maxConnectionsPerHost=32&followRedirects=false
[junit4:junit4]   2> 16992 T1731 oascsi.HttpClientUtil.createClient Creating new http client, config:maxConnections=128&maxConnectionsPerHost=32&followRedirects=false
[junit4:junit4]   2> 17197 T1731 oejs.Server.doStart jetty-8.1.8.v20121106
[junit4:junit4]   2> 17200 T1731 oejs.AbstractConnector.doStart Started SocketConnector@127.0.0.1:17553
[junit4:junit4]   2> 17200 T1731 oass.SolrDispatchFilter.init SolrDispatchFilter.init()
[junit4:junit4]   2> 17201 T1731 oasc.SolrResourceLoader.locateSolrHome JNDI not configured for solr (NoInitialContextEx)
[junit4:junit4]   2> 17201 T1731 oasc.SolrResourceLoader.locateSolrHome using system property solr.solr.home: /usr/home/hudson/hudson-slave/workspace/Lucene-Solr-Tests-4.x-Java6/solr/build/solr-core/test/J0/./org.apache.solr.cloud.SyncSliceTest-jetty4-1362647112388
[junit4:junit4]   2> 17202 T1731 oasc.CoreContainer$Initializer.initialize looking for solr.xml: /usr/home/hudson/hudson-slave/workspace/Lucene-Solr-Tests-4.x-Java6/solr/build/solr-core/test/J0/./org.apache.solr.cloud.SyncSliceTest-jetty4-1362647112388/solr.xml
[junit4:junit4]   2> 17202 T1731 oasc.CoreContainer.<init> New CoreContainer 1644595198
[junit4:junit4]   2> 17203 T1731 oasc.CoreContainer.load Loading CoreContainer using Solr Home: '/usr/home/hudson/hudson-slave/workspace/Lucene-Solr-Tests-4.x-Java6/solr/build/solr-core/test/J0/./org.apache.solr.cloud.SyncSliceTest-jetty4-1362647112388/'
[junit4:junit4]   2> 17203 T1731 oasc.SolrResourceLoader.<init> new SolrResourceLoader for directory: '/usr/home/hudson/hudson-slave/workspace/Lucene-Solr-Tests-4.x-Java6/solr/build/solr-core/test/J0/./org.apache.solr.cloud.SyncSliceTest-jetty4-1362647112388/'
[junit4:junit4]   2> 17258 T1731 oashc.HttpShardHandlerFactory.getParameter Setting socketTimeout to: 120000
[junit4:junit4]   2> 17259 T1731 oashc.HttpShardHandlerFactory.getParameter Setting urlScheme to: http://
[junit4:junit4]   2> 17259 T1731 oashc.HttpShardHandlerFactory.getParameter Setting connTimeout to: 15000
[junit4:junit4]   2> 17260 T1731 oashc.HttpShardHandlerFactory.getParameter Setting maxConnectionsPerHost to: 20
[junit4:junit4]   2> 17260 T1731 oashc.HttpShardHandlerFactory.getParameter Setting corePoolSize to: 0
[junit4:junit4]   2> 17261 T1731 oashc.HttpShardHandlerFactory.getParameter Setting maximumPoolSize to: 2147483647
[junit4:junit4]   2> 17261 T1731 oashc.HttpShardHandlerFactory.getParameter Setting maxThreadIdleTime to: 5
[junit4:junit4]   2> 17262 T1731 oashc.HttpShardHandlerFactory.getParameter Setting sizeOfQueue to: -1
[junit4:junit4]   2> 17262 T1731 oashc.HttpShardHandlerFactory.getParameter Setting fairnessPolicy to: false
[junit4:junit4]   2> 17263 T1731 oascsi.HttpClientUtil.createClient Creating new http client, config:maxConnectionsPerHost=20&maxConnections=10000&socketTimeout=120000&connTimeout=15000&retry=false
[junit4:junit4]   2> 17283 T1731 oasc.CoreContainer.load Registering Log Listener
[junit4:junit4]   2> 17304 T1731 oasc.CoreContainer.initZooKeeper Zookeeper client=127.0.0.1:58213/solr
[junit4:junit4]   2> 17304 T1731 oasc.ZkController.checkChrootPath zkHost includes chroot
[junit4:junit4]   2> 17305 T1731 oaz.ZooKeeper.<init> Initiating client connection, connectString=127.0.0.1:58213 sessionTimeout=60000 watcher=org.apache.solr.common.cloud.ConnectionManager@5e2e732c
[junit4:junit4]   2> 17306 T1731 oascc.ConnectionManager.waitForConnected Waiting for client to connect to ZooKeeper
[junit4:junit4]   2> 17306 T1818 oaz.ClientCnxn$SendThread.logStartConnect Opening socket connection to server localhost/127.0.0.1:58213. Will not attempt to authenticate using SASL (access denied (javax.security.auth.AuthPermission getLoginConfiguration))
[junit4:junit4]   2> 17307 T1818 oaz.ClientCnxn$SendThread.primeConnection Socket connection established to localhost/127.0.0.1:58213, initiating session
[junit4:junit4]   2> 17308 T1733 oazs.NIOServerCnxnFactory.run Accepted socket connection from /140.211.11.196:57546
[junit4:junit4]   2> 17308 T1733 oazs.ZooKeeperServer.processConnectRequest Client attempting to establish new session at /140.211.11.196:57546
[junit4:junit4]   2> 17310 T1735 oazs.ZooKeeperServer.finishSessionInit Established session 0x13d44189864000b with negotiated timeout 20000 for client /140.211.11.196:57546
[junit4:junit4]   2> 17310 T1818 oaz.ClientCnxn$SendThread.onConnected Session establishment complete on server localhost/127.0.0.1:58213, sessionid = 0x13d44189864000b, negotiated timeout = 20000
[junit4:junit4]   2> 17311 T1819 oascc.ConnectionManager.process Watcher org.apache.solr.common.cloud.ConnectionManager@5e2e732c name:ZooKeeperConnection Watcher:127.0.0.1:58213 got event WatchedEvent state:SyncConnected type:None path:null path:null type:None
[junit4:junit4]   2> 17311 T1731 oascc.ConnectionManager.waitForConnected Client is connected to ZooKeeper
[junit4:junit4]   2> 17312 T1736 oazs.PrepRequestProcessor.pRequest2Txn Processed session termination for sessionid: 0x13d44189864000b
[junit4:junit4]   2> 17313 T1819 oaz.ClientCnxn$EventThread.run EventThread shut down
[junit4:junit4]   2> 17313 T1733 oazs.NIOServerCnxn.closeSock Closed socket connection for client /140.211.11.196:57546 which had sessionid 0x13d44189864000b
[junit4:junit4]   2> 17313 T1731 oaz.ZooKeeper.close Session: 0x13d44189864000b closed
[junit4:junit4]   2> 17314 T1731 oascsi.HttpClientUtil.createClient Creating new http client, config:maxConnections=500&maxConnectionsPerHost=16&socketTimeout=120000&connTimeout=15000
[junit4:junit4]   2> 17323 T1731 oaz.ZooKeeper.<init> Initiating client connection, connectString=127.0.0.1:58213/solr sessionTimeout=30000 watcher=org.apache.solr.common.cloud.ConnectionManager@80b5cdb
[junit4:junit4]   2> 17324 T1731 oascc.ConnectionManager.waitForConnected Waiting for client to connect to ZooKeeper
[junit4:junit4]   2> 17324 T1820 oaz.ClientCnxn$SendThread.logStartConnect Opening socket connection to server localhost/127.0.0.1:58213. Will not attempt to authenticate using SASL (access denied (javax.security.auth.AuthPermission getLoginConfiguration))
[junit4:junit4]   2> 17325 T1820 oaz.ClientCnxn$SendThread.primeConnection Socket connection established to localhost/127.0.0.1:58213, initiating session
[junit4:junit4]   2> 17325 T1733 oazs.NIOServerCnxnFactory.run Accepted socket connection from /140.211.11.196:35534
[junit4:junit4]   2> 17326 T1733 oazs.ZooKeeperServer.processConnectRequest Client attempting to establish new session at /140.211.11.196:35534
[junit4:junit4]   2> 17328 T1735 oazs.ZooKeeperServer.finishSessionInit Established session 0x13d44189864000c with negotiated timeout 20000 for client /140.211.11.196:35534
[junit4:junit4]   2> 17328 T1820 oaz.ClientCnxn$SendThread.onConnected Session establishment complete on server localhost/127.0.0.1:58213, sessionid = 0x13d44189864000c, negotiated timeout = 20000
[junit4:junit4]   2> 17328 T1821 oascc.ConnectionManager.process Watcher org.apache.solr.common.cloud.ConnectionManager@80b5cdb name:ZooKeeperConnection Watcher:127.0.0.1:58213/solr got event WatchedEvent state:SyncConnected type:None path:null path:null type:None
[junit4:junit4]   2> 17329 T1731 oascc.ConnectionManager.waitForConnected Client is connected to ZooKeeper
[junit4:junit4]   2> 17329 T1736 oazs.PrepRequestProcessor.pRequest Got user-level KeeperException when processing sessionid:0x13d44189864000c type:create cxid:0x1 zxid:0x98 txntype:-1 reqpath:n/a Error Path:/solr/overseer Error:KeeperErrorCode = NodeExists for /solr/overseer
[junit4:junit4]   2> 17331 T1736 oazs.PrepRequestProcessor.pRequest Got user-level KeeperException when processing sessionid:0x13d44189864000c type:create cxid:0x2 zxid:0x99 txntype:-1 reqpath:n/a Error Path:/solr/overseer Error:KeeperErrorCode = NodeExists for /solr/overseer
[junit4:junit4]   2> 17333 T1731 oascc.ZkStateReader.createClusterStateWatchersAndUpdate Updating cluster state from ZooKeeper... 
[junit4:junit4]   2> 17496 T1754 oascc.ZkStateReader.updateClusterState Updating cloud state from ZooKeeper... 
[junit4:junit4]   2> 17497 T1754 oasc.Overseer$ClusterStateUpdater.updateState Update state numShards=1 message={
[junit4:junit4]   2> 	  "operation":"state",
[junit4:junit4]   2> 	  "core_node_name":"4",
[junit4:junit4]   2> 	  "numShards":"1",
[junit4:junit4]   2> 	  "shard":"shard1",
[junit4:junit4]   2> 	  "roles":null,
[junit4:junit4]   2> 	  "state":"recovering",
[junit4:junit4]   2> 	  "core":"collection1",
[junit4:junit4]   2> 	  "collection":"collection1",
[junit4:junit4]   2> 	  "node_name":"127.0.0.1:32078_",
[junit4:junit4]   2> 	  "base_url":"http://127.0.0.1:32078"}
[junit4:junit4]   2> 17502 T1821 oascc.ZkStateReader$2.process A cluster state change: WatchedEvent state:SyncConnected type:NodeDataChanged path:/clusterstate.json, has occurred - updating... (live nodes size: 4)
[junit4:junit4]   2> 17502 T1759 oascc.ZkStateReader$2.process A cluster state change: WatchedEvent state:SyncConnected type:NodeDataChanged path:/clusterstate.json, has occurred - updating... (live nodes size: 4)
[junit4:junit4]   2> 17502 T1753 oascc.ZkStateReader$2.process A cluster state change: WatchedEvent state:SyncConnected type:NodeDataChanged path:/clusterstate.json, has occurred - updating... (live nodes size: 4)
[junit4:junit4]   2> 17502 T1787 oascc.ZkStateReader$2.process A cluster state change: WatchedEvent state:SyncConnected type:NodeDataChanged path:/clusterstate.json, has occurred - updating... (live nodes size: 4)
[junit4:junit4]   2> 17502 T1803 oascc.ZkStateReader$2.process A cluster state change: WatchedEvent state:SyncConnected type:NodeDataChanged path:/clusterstate.json, has occurred - updating... (live nodes size: 4)
[junit4:junit4]   2> 17502 T1772 oascc.ZkStateReader$2.process A cluster state change: WatchedEvent state:SyncConnected type:NodeDataChanged path:/clusterstate.json, has occurred - updating... (live nodes size: 4)
[junit4:junit4]   2> 18004 T1766 oass.SolrDispatchFilter.handleAdminRequest /admin/cores {coreNodeName=4&state=recovering&nodeName=127.0.0.1:32078_&action=PREPRECOVERY&checkLive=true&core=collection1&wt=javabin&onlyIfLeader=true&version=2} status=0 QTime=1001 
[junit4:junit4]   2> 18336 T1731 oasc.ZkController.createEphemeralLiveNode Register node as live in ZooKeeper:/live_nodes/127.0.0.1:17553_
[junit4:junit4]   2> 18337 T1736 oazs.PrepRequestProcessor.pRequest Got user-level KeeperException when processing sessionid:0x13d44189864000c type:delete cxid:0xd zxid:0x9e txntype:-1 reqpath:n/a Error Path:/solr/live_nodes/127.0.0.1:17553_ Error:KeeperErrorCode = NoNode for /solr/live_nodes/127.0.0.1:17553_
[junit4:junit4]   2> 18339 T1731 oascc.SolrZkClient.makePath makePath: /live_nodes/127.0.0.1:17553_
[junit4:junit4]   2> 18350 T1772 oascc.ZkStateReader$2.process A cluster state change: WatchedEvent state:SyncConnected type:NodeChildrenChanged path:/live_nodes, has occurred - updating... (live nodes size: 4)
[junit4:junit4]   2> 18350 T1753 oascc.ZkStateReader$2.process A cluster state change: WatchedEvent state:SyncConnected type:NodeChildrenChanged path:/live_nodes, has occurred - updating... (live nodes size: 4)
[junit4:junit4]   2> 18350 T1803 oascc.ZkStateReader$3.process Updating live nodes... (5)
[junit4:junit4]   2> 18350 T1787 oascc.ZkStateReader$3.process Updating live nodes... (5)
[junit4:junit4]   2> 18350 T1759 oascc.ZkStateReader$3.process Updating live nodes... (5)
[junit4:junit4]   2> 18350 T1803 oascc.ZkStateReader$2.process A cluster state change: WatchedEvent state:SyncConnected type:NodeChildrenChanged path:/live_nodes, has occurred - updating... (live nodes size: 5)
[junit4:junit4]   2> 18351 T1787 oascc.ZkStateReader$2.process A cluster state change: WatchedEvent state:SyncConnected type:NodeChildrenChanged path:/live_nodes, has occurred - updating... (live nodes size: 5)
[junit4:junit4]   2> 18351 T1759 oascc.ZkStateReader$2.process A cluster state change: WatchedEvent state:SyncConnected type:NodeChildrenChanged path:/live_nodes, has occurred - updating... (live nodes size: 5)
[junit4:junit4]   2> 18350 T1821 oascc.ZkStateReader$3.process Updating live nodes... (5)
[junit4:junit4]   2> 18351 T1821 oascc.ZkStateReader$2.process A cluster state change: WatchedEvent state:SyncConnected type:NodeChildrenChanged path:/live_nodes, has occurred - updating... (live nodes size: 5)
[junit4:junit4]   2> 18352 T1772 oascc.ZkStateReader$3.process Updating live nodes... (5)
[junit4:junit4]   2> 18352 T1753 oascc.ZkStateReader$3.process Updating live nodes... (5)
[junit4:junit4]   2> 18358 T1822 oasc.CoreContainer.create Creating SolrCore 'collection1' using instanceDir: /usr/home/hudson/hudson-slave/workspace/Lucene-Solr-Tests-4.x-Java6/solr/build/solr-core/test/J0/./org.apache.solr.cloud.SyncSliceTest-jetty4-1362647112388/collection1
[junit4:junit4]   2> 18358 T1822 oasc.ZkController.createCollectionZkNode Check for collection zkNode:collection1
[junit4:junit4]   2> 18358 T1822 oasc.ZkController.createCollectionZkNode Collection zkNode exists
[junit4:junit4]   2> 18358 T1822 oasc.ZkController.readConfigName Load collection config from:/collections/collection1
[junit4:junit4]   2> 18359 T1822 oasc.SolrResourceLoader.<init> new SolrResourceLoader for directory: '/usr/home/hudson/hudson-slave/workspace/Lucene-Solr-Tests-4.x-Java6/solr/build/solr-core/test/J0/./org.apache.solr.cloud.SyncSliceTest-jetty4-1362647112388/collection1/'
[junit4:junit4]   2> 18360 T1822 oasc.SolrResourceLoader.replaceClassLoader Adding 'file:/usr/home/hudson/hudson-slave/workspace/Lucene-Solr-Tests-4.x-Java6/solr/build/solr-core/test/J0/org.apache.solr.cloud.SyncSliceTest-jetty4-1362647112388/collection1/lib/README' to classloader
[junit4:junit4]   2> 18361 T1822 oasc.SolrResourceLoader.replaceClassLoader Adding 'file:/usr/home/hudson/hudson-slave/workspace/Lucene-Solr-Tests-4.x-Java6/solr/build/solr-core/test/J0/org.apache.solr.cloud.SyncSliceTest-jetty4-1362647112388/collection1/lib/classes/' to classloader
[junit4:junit4]   2> 18395 T1822 oasc.SolrConfig.<init> Using Lucene MatchVersion: LUCENE_42
[junit4:junit4]   2> 18435 T1822 oasc.SolrConfig.<init> Loaded SolrConfig: solrconfig.xml
[junit4:junit4]   2> 18535 T1822 oass.IndexSchema.readSchema Reading Solr Schema
[junit4:junit4]   2> 18552 T1822 oass.IndexSchema.readSchema Schema name=test
[junit4:junit4]   2> 18992 T1822 oass.OpenExchangeRatesOrgProvider.init Initialized with rates=open-exchange-rates.json, refreshInterval=1440.
[junit4:junit4]   2> 19000 T1822 oass.IndexSchema.readSchema default search field in schema is text
[junit4:junit4]   2> 19003 T1822 oass.IndexSchema.readSchema unique key field: id
[junit4:junit4]   2> 19023 T1822 oass.FileExchangeRateProvider.reload Reloading exchange rates from file currency.xml
[junit4:junit4]   2> 19028 T1822 oass.FileExchangeRateProvider.reload Reloading exchange rates from file currency.xml
[junit4:junit4]   2> 19032 T1822 oass.OpenExchangeRatesOrgProvider.reload Reloading exchange rates from open-exchange-rates.json
[junit4:junit4]   2> 19033 T1822 oass.OpenExchangeRatesOrgProvider$OpenExchangeRates.<init> WARNING Unknown key IMPORTANT NOTE
[junit4:junit4]   2> 19033 T1822 oass.OpenExchangeRatesOrgProvider$OpenExchangeRates.<init> WARNING Expected key, got STRING
[junit4:junit4]   2> 19033 T1822 oass.OpenExchangeRatesOrgProvider.reload Reloading exchange rates from open-exchange-rates.json
[junit4:junit4]   2> 19034 T1822 oass.OpenExchangeRatesOrgProvider$OpenExchangeRates.<init> WARNING Unknown key IMPORTANT NOTE
[junit4:junit4]   2> 19034 T1822 oass.OpenExchangeRatesOrgProvider$OpenExchangeRates.<init> WARNING Expected key, got STRING
[junit4:junit4]   2> 19034 T1822 oasc.SolrCore.<init> [collection1] Opening new SolrCore at /usr/home/hudson/hudson-slave/workspace/Lucene-Solr-Tests-4.x-Java6/solr/build/solr-core/test/J0/./org.apache.solr.cloud.SyncSliceTest-jetty4-1362647112388/collection1/, dataDir=./org.apache.solr.cloud.SyncSliceTest-1362647095390/jetty4/
[junit4:junit4]   2> 19035 T1822 oasc.JmxMonitoredMap.<init> JMX monitoring is enabled. Adding Solr mbeans to JMX Server: com.sun.jmx.mbeanserver.JmxMBeanServer@5c4b82d2
[junit4:junit4]   2> 19035 T1822 oasc.SolrCore.initDirectoryFactory org.apache.solr.core.MockDirectoryFactory
[junit4:junit4]   2> 19036 T1822 oasc.CachingDirectoryFactory.get return new directory for /usr/home/hudson/hudson-slave/workspace/Lucene-Solr-Tests-4.x-Java6/solr/build/solr-core/test/J0/./org.apache.solr.cloud.SyncSliceTest-1362647095390/jetty4 forceNew: false
[junit4:junit4]   2> 19036 T1822 oasc.SolrCore.getNewIndexDir New index directory detected: old=null new=./org.apache.solr.cloud.SyncSliceTest-1362647095390/jetty4/index/
[junit4:junit4]   2> 19037 T1822 oasc.SolrCore.initIndex WARNING [collection1] Solr index directory './org.apache.solr.cloud.SyncSliceTest-1362647095390/jetty4/index' doesn't exist. Creating new index...
[junit4:junit4]   2> 19037 T1822 oasc.CachingDirectoryFactory.get return new directory for /usr/home/hudson/hudson-slave/workspace/Lucene-Solr-Tests-4.x-Java6/solr/build/solr-core/test/J0/./org.apache.solr.cloud.SyncSliceTest-1362647095390/jetty4/index forceNew: false
[junit4:junit4]   2> 19045 T1822 oasc.SolrDeletionPolicy.onCommit SolrDeletionPolicy.onCommit: commits:num=1
[junit4:junit4]   2> 		commit{dir=MockDirWrapper(org.apache.lucene.store.RAMDirectory@28f9161a lockFactory=org.apache.lucene.store.NativeFSLockFactory@209f688c),segFN=segments_1,generation=1,filenames=[segments_1]
[junit4:junit4]   2> 19046 T1822 oasc.SolrDeletionPolicy.updateCommits newest commit = 1[segments_1]
[junit4:junit4]   2> 19050 T1822 oasup.UpdateRequestProcessorChain.init inserting DistributedUpdateProcessorFactory into updateRequestProcessorChain "dedupe"
[junit4:junit4]   2> 19051 T1822 oasup.UpdateRequestProcessorChain.init inserting DistributedUpdateProcessorFactory into updateRequestProcessorChain "stored_sig"
[junit4:junit4]   2> 19052 T1822 oasup.UpdateRequestProcessorChain.init inserting DistributedUpdateProcessorFactory into updateRequestProcessorChain "distrib-dup-test-chain-implicit"
[junit4:junit4]   2> 19052 T1822 oasc.RequestHandlers.initHandlersFromConfig created standard: solr.StandardRequestHandler
[junit4:junit4]   2> 19053 T1822 oasc.RequestHandlers.initHandlersFromConfig created /get: solr.RealTimeGetHandler
[junit4:junit4]   2> 19053 T1822 oasc.RequestHandlers.initHandlersFromConfig adding lazy requestHandler: solr.ReplicationHandler
[junit4:junit4]   2> 19053 T1822 oasc.RequestHandlers.initHandlersFromConfig created /replication: solr.ReplicationHandler
[junit4:junit4]   2> 19054 T1822 oasc.RequestHandlers.initHandlersFromConfig created /update: solr.UpdateRequestHandler
[junit4:junit4]   2> 19054 T1822 oasc.RequestHandlers.initHandlersFromConfig created /admin/: org.apache.solr.handler.admin.AdminHandlers
[junit4:junit4]   2> 19064 T1822 oashl.XMLLoader.init xsltCacheLifetimeSeconds=60
[junit4:junit4]   2> 19073 T1822 oass.SolrIndexSearcher.<init> Opening Searcher@695c84c1 main
[junit4:junit4]   2> 19074 T1822 oasu.UpdateHandler.clearLog Clearing tlog files, tlogDir=./org.apache.solr.cloud.SyncSliceTest-1362647095390/jetty4/tlog
[junit4:junit4]   2> 19075 T1822 oasu.CommitTracker.<init> Hard AutoCommit: disabled
[junit4:junit4]   2> 19076 T1822 oasu.CommitTracker.<init> Soft AutoCommit: disabled
[junit4:junit4]   2> 19081 T1823 oasc.SolrCore.registerSearcher [collection1] Registered new searcher Searcher@695c84c1 main{StandardDirectoryReader(segments_1:1)}
[junit4:junit4]   2> 19082 T1822 oasc.ZkController.publish publishing core=collection1 state=down
[junit4:junit4]   2> 19083 T1822 oasc.ZkController.publish numShards not found on descriptor - reading it from system property
[junit4:junit4]   2>  C121_STATE=coll:collection1 core:collection1 props:{shard=shard1, state=recovering, core=collection1, collection=collection1, node_name=127.0.0.1:32078_, base_url=http://127.0.0.1:32078}
[junit4:junit4]   2> 20005 T1808 C121 P32078 oasc.RecoveryStrategy.doRecovery Attempting to PeerSync from http://127.0.0.1:61855/collection1/ core=collection1 - recoveringAfterStartup=true
[junit4:junit4]   2> 20005 T1808 C121 P32078 oasu.PeerSync.sync PeerSync: core=collection1 url=http://127.0.0.1:32078 START replicas=[http://127.0.0.1:61855/collection1/] nUpdates=100
[junit4:junit4]   2> 20005 T1808 C121 P32078 oasu.PeerSync.sync WARNING no frame of reference to tell of we've missed updates
[junit4:junit4]   2> 20006 T1808 C121 P32078 oasc.RecoveryStrategy.doRecovery PeerSync Recovery was not successful - trying replication. core=collection1
[junit4:junit4]   2> 20007 T1808 C121 P32078 oasc.RecoveryStrategy.doRecovery Starting Replication Recovery. core=collection1
[junit4:junit4]   2> 20007 T1808 C121 P32078 oasc.RecoveryStrategy.doRecovery Begin buffering updates. core=collection1
[junit4:junit4]   2> 20007 T1808 C121 P32078 oasu.UpdateLog.bufferUpdates Starting to buffer updates. FSUpdateLog{state=ACTIVE, tlog=null}
[junit4:junit4]   2> 20007 T1808 C121 P32078 oasc.RecoveryStrategy.replicate Attempting to replicate from http://127.0.0.1:61855/collection1/. core=collection1
[junit4:junit4]   2> 20007 T1808 C121 P32078 oascsi.HttpClientUtil.createClient Creating new http client, config:maxConnections=128&maxConnectionsPerHost=32&followRedirects=false
[junit4:junit4]   2> 20008 T1763 C120 P61855 REQ /get {getVersions=100&distrib=false&wt=javabin&qt=/get&version=2} status=0 QTime=0 
[junit4:junit4]   2> 20025 T1767 C120 P61855 oasu.DirectUpdateHandler2.commit start commit{,optimize=false,openSearcher=false,waitSearcher=true,expungeDeletes=false,softCommit=false,prepareCommit=false}
[junit4:junit4]   2> 20026 T1767 C120 P61855 oasc.SolrDeletionPolicy.onCommit SolrDeletionPolicy.onCommit: commits:num=2
[junit4:junit4]   2> 		commit{dir=MockDirWrapper(org.apache.lucene.store.RAMDirectory@285896a2 lockFactory=org.apache.lucene.store.NativeFSLockFactory@1e411c06),segFN=segments_2,generation=2,filenames=[segments_2]
[junit4:junit4]   2> 		commit{dir=MockDirWrapper(org.apache.lucene.store.RAMDirectory@285896a2 lockFactory=org.apache.lucene.store.NativeFSLockFactory@1e411c06),segFN=segments_3,generation=3,filenames=[segments_3]
[junit4:junit4]   2> 20026 T1767 C120 P61855 oasc.SolrDeletionPolicy.updateCommits newest commit = 3[segments_3]
[junit4:junit4]   2> 20027 T1767 C120 P61855 oasu.DirectUpdateHandler2.commit end_commit_flush
[junit4:junit4]   2> 20027 T1767 C120 P61855 /update {waitSearcher=true&openSearcher=false&commit=true&wt=javabin&commit_end_point=true&version=2&softCommit=false} {commit=} 0 3
[junit4:junit4]   2> 20028 T1808 C121 P32078 oash.ReplicationHandler.inform Commits will be reserved for  10000
[junit4:junit4]   2> 20028 T1808 C121 P32078 oash.SnapPuller.<init>  No value set for 'pollInterval'. Timer Task not started.
[junit4:junit4]   2> 20030 T1765 C120 P61855 REQ /replication {command=indexversion&qt=/replication&wt=javabin&version=2} status=0 QTime=0 
[junit4:junit4]   2> 20031 T1808 C121 P32078 oash.SnapPuller.fetchLatestIndex Master's generation: 3
[junit4:junit4]   2> 20031 T1808 C121 P32078 oash.SnapPuller.fetchLatestIndex Slave's generation: 1
[junit4:junit4]   2> 20031 T1808 C121 P32078 oash.SnapPuller.fetchLatestIndex Starting replication process
[junit4:junit4]   2> 20033 T1765 C120 P61855 REQ /replication {command=filelist&qt=/replication&wt=javabin&generation=3&version=2} status=0 QTime=0 
[junit4:junit4]   2> 20034 T1808 C121 P32078 oash.SnapPuller.fetchLatestIndex Number of files in latest index in master: 1
[junit4:junit4]   2> 20035 T1808 C121 P32078 oasc.CachingDirectoryFactory.get return new directory for /usr/home/hudson/hudson-slave/workspace/Lucene-Solr-Tests-4.x-Java6/solr/build/solr-core/test/J0/./org.apache.solr.cloud.SyncSliceTest-1362647095390/jetty3/index.20130307030515420 forceNew: false
[junit4:junit4]   2> 20035 T1808 C121 P32078 oash.SnapPuller.fetchLatestIndex Starting download to MockDirWrapper(org.apache.lucene.store.RAMDirectory@37b53930 lockFactory=org.apache.lucene.store.NativeFSLockFactory@560399f8) fullCopy=false
[junit4:junit4]   2> 20038 T1765 C120 P61855 REQ /replication {file=segments_3&command=filecontent&checksum=true&wt=filestream&qt=/replication&generation=3} status=0 QTime=0 
[junit4:junit4]   2> 20039 T1808 C121 P32078 oash.SnapPuller.fetchLatestIndex Total time taken for download : 0 secs
[junit4:junit4]   2> 20040 T1808 C121 P32078 oasu.DefaultSolrCoreState.newIndexWriter Creating new IndexWriter...
[junit4:junit4]   2> 20040 T1808 C121 P32078 oasu.DefaultSolrCoreState.newIndexWriter Waiting until IndexWriter is unused... core=collection1
[junit4:junit4]   2> 20042 T1808 C121 P32078 oasc.SolrDeletionPolicy.onInit SolrDeletionPolicy.onInit: commits:num=2
[junit4:junit4]   2> 		commit{dir=MockDirWrapper(org.apache.lucene.store.RAMDirectory@6f11f895 lockFactory=org.apache.lucene.store.NativeFSLockFactory@4d66ea88),segFN=segments_1,generation=1,filenames=[segments_1]
[junit4:junit4]   2> 		commit{dir=MockDirWrapper(org.apache.lucene.store.RAMDirectory@6f11f895 lockFactory=org.apache.lucene.store.NativeFSLockFactory@4d66ea88),segFN=segments_3,generation=3,filenames=[segments_3]
[junit4:junit4]   2> 20042 T1808 C121 P32078 oasc.SolrDeletionPolicy.updateCommits newest commit = 3[segments_3]
[junit4:junit4]   2> 20043 T1808 C121 P32078 oasu.DefaultSolrCoreState.newIndexWriter New IndexWriter is ready to be used.
[junit4:junit4]   2> 20043 T1808 C121 P32078 oass.SolrIndexSearcher.<init> Opening Searcher@43e73c9a main
[junit4:junit4]   2> 20044 T1805 oasc.SolrCore.registerSearcher [collection1] Registered new searcher Searcher@43e73c9a main{StandardDirectoryReader(segments_3:1:nrt)}
[junit4:junit4]   2> 20044 T1808 C121 P32078 oash.SnapPuller.fetchLatestIndex removing temporary index download directory files MockDirWrapper(org.apache.lucene.store.RAMDirectory@37b53930 lockFactory=org.apache.lucene.store.NativeFSLockFactory@560399f8)
[junit4:junit4]   2> 20044 T1808 C121 P32078 oasc.RecoveryStrategy.replay No replay needed. core=collection1
[junit4:junit4]   2> 20045 T1808 C121 P32078 oasc.RecoveryStrategy.doRecovery Replication Recovery was successful - registering as Active. core=collection1
[junit4:junit4]   2> 20045 T1808 C121 P32078 oasc.ZkController.publish publishing core=collection1 state=active
[junit4:junit4]   2> 20045 T1808 C121 P32078 oasc.ZkController.publish numShards not found on descriptor - reading it from system property
[junit4:junit4]   2> 20048 T1808 C121 P32078 oasc.RecoveryStrategy.doRecovery Finished recovery process. core=collection1
[junit4:junit4]   2> 20523 T1754 oascc.ZkStateReader.updateClusterState Updating cloud state from ZooKeeper... 
[junit4:junit4]   2> 20524 T1754 oasc.Overseer$ClusterStateUpdater.updateState Update state numShards=1 message={
[junit4:junit4]   2> 	  "operation":"state",
[junit4:junit4]   2> 	  "core_node_name":"5",
[junit4:junit4]   2> 	  "numShards":"1",
[junit4:junit4]   2> 	  "shard":null,
[junit4:junit4]   2> 	  "roles":null,
[junit4:junit4]   2> 	  "state":"down",
[junit4:junit4]   2> 	  "core":"collection1",
[junit4:junit4]   2> 	  "collection":"collection1",
[junit4:junit4]   2> 	  "node_name":"127.0.0.1:17553_",
[junit4:junit4]   2> 	  "base_url":"http://127.0.0.1:17553"}
[junit4:junit4]   2> 20524 T1754 oasc.Overseer$ClusterStateUpdater.updateState Collection already exists with numShards=1
[junit4:junit4]   2> 20524 T1754 oasc.Overseer$ClusterStateUpdater.updateState Assigning new node to shard shard=shard1
[junit4:junit4]   2> 20528 T1754 oasc.Overseer$ClusterStateUpdater.updateState Update state numShards=1 message={
[junit4:junit4]   2> 	  "operation":"state",
[junit4:junit4]   2> 	  "core_node_name":"4",
[junit4:junit4]   2> 	  "numShards":"1",
[junit4:junit4]   2> 	  "shard":"shard1",
[junit4:junit4]   2> 	  "roles":null,
[junit4:junit4]   2> 	  "state":"active",
[junit4:junit4]   2> 	  "core":"collection1",
[junit4:junit4]   2> 	  "collection":"collection1",
[junit4:junit4]   2> 	  "node_name":"127.0.0.1:32078_",
[junit4:junit4]   2> 	  "base_url":"http://127.0.0.1:32078"}
[junit4:junit4]   2> 20543 T1803 oascc.ZkStateReader$2.process A cluster state change: WatchedEvent state:SyncConnected type:NodeDataChanged path:/clusterstate.json, has occurred - updating... (live nodes size: 5)
[junit4:junit4]   2> 20543 T1753 oascc.ZkStateReader$2.process A cluster state change: WatchedEvent state:SyncConnected type:NodeDataChanged path:/clusterstate.json, has occurred - updating... (live nodes size: 5)
[junit4:junit4]   2> 20543 T1772 oascc.ZkStateReader$2.process A cluster state change: WatchedEvent state:SyncConnected type:NodeDataChanged path:/clusterstate.json, has occurred - updating... (live nodes size: 5)
[junit4:junit4]   2> 20543 T1787 oascc.ZkStateReader$2.process A cluster state change: WatchedEvent state:SyncConnected type:NodeDataChanged path:/clusterstate.json, has occurred - updating... (live nodes size: 5)
[junit4:junit4]   2> 20543 T1759 oascc.ZkStateReader$2.process A cluster state change: WatchedEvent state:SyncConnected type:NodeDataChanged path:/clusterstate.json, has occurred - updating... (live nodes size: 5)
[junit4:junit4]   2> 20543 T1821 oascc.ZkStateReader$2.process A cluster state change: WatchedEvent state:SyncConnected type:NodeDataChanged path:/clusterstate.json, has occurred - updating... (live nodes size: 5)
[junit4:junit4]   2> 21123 T1822 oasc.CoreContainer.registerCore registering core: collection1
[junit4:junit4]   2> 21123 T1822 oasc.ZkController.register Register replica - core:collection1 address:http://127.0.0.1:17553 collection:collection1 shard:shard1
[junit4:junit4]   2> 21126 T1822 oasc.ZkController.register We are http://127.0.0.1:17553/collection1/ and leader is http://127.0.0.1:61855/collection1/
[junit4:junit4]   2> 21126 T1822 oasc.ZkController.register No LogReplay needed for core=collection1 baseURL=http://127.0.0.1:17553
[junit4:junit4]   2> 21126 T1822 oasc.ZkController.checkRecovery Core needs to recover:collection1
[junit4:junit4]   2> 21126 T1822 oasu.DefaultSolrCoreState.doRecovery Running recovery - first canceling any ongoing recovery
[junit4:junit4]   2> ASYNC  NEW_CORE C122 name=collection1 org.apache.solr.core.SolrCore@6aee2d7b url=http://127.0.0.1:17553/collection1 node=127.0.0.1:17553_ C122_STATE=coll:collection1 core:collection1 props:{state=down, core=collection1, collection=collection1, node_name=127.0.0.1:17553_, base_url=http://127.0.0.1:17553}
[junit4:junit4]   2> 21127 T1826 C122 P17553 oasc.RecoveryStrategy.run Starting recovery process.  core=collection1 recoveringAfterStartup=true
[junit4:junit4]   2> 21128 T1822 oascc.ZkStateReader.updateClusterState Updating cloud state from ZooKeeper... 
[junit4:junit4]   2> 21128 T1826 C122 P17553 oasc.RecoveryStrategy.doRecovery ###### startupVersions=[]
[junit4:junit4]   2> 21128 T1826 C122 P17553 oasc.ZkController.publish publishing core=collection1 state=recovering
[junit4:junit4]   2> 21128 T1826 C122 P17553 oasc.ZkController.publish numShards not found on descriptor - reading it from system property
[junit4:junit4]   2> 21129 T1731 oass.SolrDispatchFilter.init user.dir=/usr/home/hudson/hudson-slave/workspace/Lucene-Solr-Tests-4.x-Java6/solr/build/solr-core/test/J0
[junit4:junit4]   2> 21129 T1731 oass.SolrDispatchFilter.init SolrDispatchFilter.init() done
[junit4:junit4]   2> 21130 T1826 C122 P17553 oascsi.HttpClientUtil.createClient Creating new http client, config:maxConnections=128&maxConnectionsPerHost=32&followRedirects=false
[junit4:junit4]   2> 21130 T1731 oascsi.HttpClientUtil.createClient Creating new http client, config:maxConnections=128&maxConnectionsPerHost=32&followRedirects=false
[junit4:junit4]   2> 21144 T1731 oascc.ZkStateReader.updateClusterState Updating cloud state from ZooKeeper... 
[junit4:junit4]   2> 21145 T1731 oasc.AbstractFullDistribZkTestBase.waitForThingsToLevelOut Wait for recoveries to finish - wait 15 for each attempt
[junit4:junit4]   2> 21145 T1731 oasc.AbstractDistribZkTestBase.waitForRecoveriesToFinish Wait for recoveries to finish - collection: collection1 failOnTimeout:true timeout (sec):15
[junit4:junit4]   2> 21146 T1731 oascc.ZkStateReader.updateClusterState Updating cloud state from ZooKeeper... 
[junit4:junit4]   2> 22049 T1754 oascc.ZkStateReader.updateClusterState Updating cloud state from ZooKeeper... 
[junit4:junit4]   2> 22049 T1754 oasc.Overseer$ClusterStateUpdater.updateState Update state numShards=1 message={
[junit4:junit4]   2> 	  "operation":"state",
[junit4:junit4]   2> 	  "core_node_name":"5",
[junit4:junit4]   2> 	  "numShards":"1",
[junit4:junit4]   2> 	  "shard":"shard1",
[junit4:junit4]   2> 	  "roles":null,
[junit4:junit4]   2> 	  "state":"recovering",
[junit4:junit4]   2> 	  "core":"collection1",
[junit4:junit4]   2> 	  "collection":"collection1",
[junit4:junit4]   2> 	  "node_name":"127.0.0.1:17553_",
[junit4:junit4]   2> 	  "base_url":"http://127.0.0.1:17553"}
[junit4:junit4]   2> 22094 T1787 oascc.ZkStateReader$2.process A cluster state change: WatchedEvent state:SyncConnected type:NodeDataChanged path:/clusterstate.json, has occurred - updating... (live nodes size: 5)
[junit4:junit4]   2> 22094 T1772 oascc.ZkStateReader$2.process A cluster state change: WatchedEvent state:SyncConnected type:NodeDataChanged path:/clusterstate.json, has occurred - updating... (live nodes size: 5)
[junit4:junit4]   2> 22094 T1803 oascc.ZkStateReader$2.process A cluster state change: WatchedEvent state:SyncConnected type:NodeDataChanged path:/clusterstate.json, has occurred - updating... (live nodes size: 5)
[junit4:junit4]   2> 22094 T1759 oascc.ZkStateReader$2.process A cluster state change: WatchedEvent state:SyncConnected type:NodeDataChanged path:/clusterstate.json, has occurred - updating... (live nodes size: 5)
[junit4:junit4]   2> 22094 T1753 oascc.ZkStateReader$2.process A cluster state change: WatchedEvent state:SyncConnected type:NodeDataChanged path:/clusterstate.json, has occurred - updating... (live nodes size: 5)
[junit4:junit4]   2> 22094 T1821 oascc.ZkStateReader$2.process A cluster state change: WatchedEvent state:SyncConnected type:NodeDataChanged path:/clusterstate.json, has occurred - updating... (live nodes size: 5)
[junit4:junit4]   2> 22145 T1768 oass.SolrDispatchFilter.handleAdminRequest /admin/cores {coreNodeName=5&state=recovering&nodeName=127.0.0.1:17553_&action=PREPRECOVERY&checkLive=true&core=collection1&wt=javabin&onlyIfLeader=true&version=2} status=0 QTime=1001 
[junit4:junit4]   2> 22148 T1731 oascc.ZkStateReader.updateClusterState Updating cloud state from ZooKeeper... 
[junit4:junit4]   2> 23150 T1731 oascc.ZkStateReader.updateClusterState Updating cloud state from ZooKeeper... 
[junit4:junit4]   2>  C122_STATE=coll:collection1 core:collection1 props:{shard=shard1, state=recovering, core=collection1, collection=collection1, node_name=127.0.0.1:17553_, base_url=http://127.0.0.1:17553}
[junit4:junit4]   2> 24146 T1826 C122 P17553 oasc.RecoveryStrategy.doRecovery Attempting to PeerSync from http://127.0.0.1:61855/collection1/ core=collection1 - recoveringAfterStartup=true
[junit4:junit4]   2> 24146 T1826 C122 P17553 oasu.PeerSync.sync PeerSync: core=collection1 url=http://127.0.0.1:17553 START replicas=[http://127.0.0.1:61855/collection1/] nUpdates=100
[junit4:junit4]   2> 24147 T1826 C122 P17553 oasu.PeerSync.sync WARNING no frame of reference to tell of we've missed updates
[junit4:junit4]   2> 24147 T1826 C122 P17553 oasc.RecoveryStrategy.doRecovery PeerSync Recovery was not successful - trying replication. core=collection1
[junit4:junit4]   2> 24147 T1826 C122 P17553 oasc.RecoveryStrategy.doRecovery Starting Replication Recovery. core=collection1
[junit4:junit4]   2> 24147 T1826 C122 P17553 oasc.RecoveryStrategy.doRecovery Begin buffering updates. core=collection1
[junit4:junit4]   2> 24147 T1826 C122 P17553 oasu.UpdateLog.bufferUpdates Starting to buffer updates. FSUpdateLog{state=ACTIVE, tlog=null}
[junit4:junit4]   2> 24147 T1826 C122 P17553 oasc.RecoveryStrategy.replicate Attempting to replicate from http://127.0.0.1:61855/collection1/. core=collection1
[junit4:junit4]   2> 24148 T1826 C122 P17553 oascsi.HttpClientUtil.createClient Creating new http client, config:maxConnections=128&maxConnectionsPerHost=32&followRedirects=false
[junit4:junit4]   2> 24155 T1763 C120 P61855 REQ /get {getVersions=100&distrib=false&wt=javabin&qt=/get&version=2} status=0 QTime=0 
[junit4:junit4]   2> 24155 T1731 oascc.ZkStateReader.updateClusterState Updating cloud state from ZooKeeper... 
[junit4:junit4]   2> 24165 T1762 C120 P61855 oasu.DirectUpdateHandler2.commit start commit{,optimize=false,openSearcher=false,waitSearcher=true,expungeDeletes=false,softCommit=false,prepareCommit=false}
[junit4:junit4]   2> 24166 T1762 C120 P61855 oasc.SolrDeletionPolicy.onCommit SolrDeletionPolicy.onCommit: commits:num=3
[junit4:junit4]   2> 		commit{dir=MockDirWrapper(org.apache.lucene.store.RAMDirectory@285896a2 lockFactory=org.apache.lucene.store.NativeFSLockFactory@1e411c06),segFN=segments_2,generation=2,filenames=[segments_2]
[junit4:junit4]   2> 		commit{dir=MockDirWrapper(org.apache.lucene.store.RAMDirectory@285896a2 lockFactory=org.apache.lucene.store.NativeFSLockFactory@1e411c06),segFN=segments_3,generation=3,filenames=[segments_3]
[junit4:junit4]   2> 		commit{dir=MockDirWrapper(org.apache.lucene.store.RAMDirectory@285896a2 lockFactory=org.apache.lucene.store.NativeFSLockFactory@1e411c06),segFN=segments_4,generation=4,filenames=[segments_4]
[junit4:junit4]   2> 24166 T1762 C120 P61855 oasc.SolrDeletionPolicy.updateCommits newest commit = 4[segments_4]
[junit4:junit4]   2> 24167 T1762 C120 P61855 oasu.DirectUpdateHandler2.commit end_commit_flush
[junit4:junit4]   2> 24168 T1762 C120 P61855 /update {waitSearcher=true&openSearcher=false&commit=true&wt=javabin&commit_end_point=true&version=2&softCommit=false} {commit=} 0 4
[junit4:junit4]   2> 24169 T1826 C122 P17553 oash.ReplicationHandler.inform Commits will be reserved for  10000
[junit4:junit4]   2> 24169 T1826 C122 P17553 oash.SnapPuller.<init>  No value set for 'pollInterval'. Timer Task not started.
[junit4:junit4]   2> 24171 T1765 C120 P61855 REQ /replication {command=indexversion&qt=/replication&wt=javabin&version=2} status=0 QTime=0 
[junit4:junit4]   2> 24172 T1826 C122 P17553 oash.SnapPuller.fetchLatestIndex Master's generation: 4
[junit4:junit4]   2> 24172 T1826 C122 P17553 oash.SnapPuller.fetchLatestIndex Slave's generation: 1
[junit4:junit4]   2> 24172 T1826 C122 P17553 oash.SnapPuller.fetchLatestIndex Starting replication process
[junit4:junit4]   2> 24174 T1765 C120 P61855 REQ /replication {command=filelist&qt=/replication&wt=javabin&generation=4&version=2} status=0 QTime=0 
[junit4:junit4]   2> 24175 T1826 C122 P17553 oash.SnapPuller.fetchLatestIndex Number of files in latest index in master: 1
[junit4:junit4]   2> 24176 T1826 C122 P17553 oasc.CachingDirectoryFactory.get return new directory for /usr/home/hudson/hudson-slave/workspace/Lucene-Solr-Tests-4.x-Java6/solr/build/solr-core/test/J0/./org.apache.solr.cloud.SyncSliceTest-1362647095390/jetty4/index.20130307030519561 forceNew: false
[junit4:junit4]   2> 24176 T1826 C122 P17553 oash.SnapPuller.fetchLatestIndex Starting download to MockDirWrapper(org.apache.lucene.store.RAMDirectory@380f5730 lockFactory=org.apache.lucene.store.NativeFSLockFactory@29b1b28c) fullCopy=false
[junit4:junit4]   2> 24178 T1765 C120 P61855 REQ /replication {file=segments_4&command=filecontent&checksum=true&wt=filestream&qt=/replication&generation=4} status=0 QTime=0 
[junit4:junit4]   2> 24179 T1826 C122 P17553 oash.SnapPuller.fetchLatestIndex Total time taken for download : 0 secs
[junit4:junit4]   2> 24180 T1826 C122 P17553 oasu.DefaultSolrCoreState.newIndexWriter Creating new IndexWriter...
[junit4:junit4]   2> 24180 T1826 C122 P17553 oasu.DefaultSolrCoreState.newIndexWriter Waiting until IndexWriter is unused... core=collection1
[junit4:junit4]   2> 24181 T1826 C122 P17553 oasc.SolrDeletionPolicy.onInit SolrDeletionPolicy.onInit: commits:num=2
[junit4:junit4]   2> 		commit{dir=MockDirWrapper(org.apache.lucene.store.RAMDirectory@28f9161a lockFactory=org.apache.lucene.store.NativeFSLockFactory@209f688c),segFN=segments_1,generation=1,filenames=[segments_1]
[junit4:junit4]   2> 		commit{dir=MockDirWrapper(org.apache.lucene.store.RAMDirectory@28f9161a lockFactory=org.apache.lucene.store.NativeFSLockFactory@209f688c),segFN=segments_4,generation=4,filenames=[segments_4]
[junit4:junit4]   2> 24181 T1826 C122 P17553 oasc.SolrDeletionPolicy.updateCommits newest commit = 4[segments_4]
[junit4:junit4]   2> 24181 T1826 C122 P17553 oasu.DefaultSolrCoreState.newIndexWriter New IndexWriter is ready to be used.
[junit4:junit4]   2> 24182 T1826 C122 P17553 oass.SolrIndexSearcher.<init> Opening Searcher@cea6a05 main
[junit4:junit4]   2> 24183 T1823 oasc.SolrCore.registerSearcher [collection1] Registered new searcher Searcher@cea6a05 main{StandardDirectoryReader(segments_4:1:nrt)}
[junit4:junit4]   2> 24183 T1826 C122 P17553 oash.SnapPuller.fetchLatestIndex removing temporary index download directory files MockDirWrapper(org.apache.lucene.store.RAMDirectory@380f5730 lockFactory=org.apache.lucene.store.NativeFSLockFactory@29b1b28c)
[junit4:junit4]   2> 24184 T1826 C122 P17553 oasc.RecoveryStrategy.replay No replay needed. core=collection1
[junit4:junit4]   2> 24184 T1826 C122 P17553 oasc.RecoveryStrategy.doRecovery Replication Recovery was successful - registering as Active. core=collection1
[junit4:junit4]   2> 24184 T1826 C122 P17553 oasc.ZkController.publish publishing core=collection1 state=active
[junit4:junit4]   2> 24184 T1826 C122 P17553 oasc.ZkController.publish numShards not found on descriptor - reading it from system property
[junit4:junit4]   2> 24220 T1826 C122 P17553 oasc.RecoveryStrategy.doRecovery Finished recovery process. core=collection1
[junit4:junit4]   2> 25101 T1754 oascc.ZkStateReader.updateClusterState Updating cloud state from ZooKeeper... 
[junit4:junit4]   2> 25101 T1754 oasc.Overseer$ClusterStateUpdater.updateState Update state numShards=1 message={
[junit4:junit4]   2> 	  "operation":"state",
[junit4:junit4]   2> 	  "core_node_name":"5",
[junit4:junit4]   2> 	  "numShards":"1",
[junit4:junit4]   2> 	  "shard":"shard1",
[junit4:junit4]   2> 	  "roles":null,
[junit4:junit4]   2> 	  "state":"active",
[junit4:junit4]   2> 	  "core":"collection1",
[junit4:junit4]   2> 	  "collection":"collection1",
[junit4:junit4]   2> 	  "node_name":"127.0.0.1:17553_",
[junit4:junit4]   2> 	  "base_url":"http://127.0.0.1:17553"}
[junit4:junit4]   2> 25106 T1772 oascc.ZkStateReader$2.process A cluster state change: WatchedEvent state:SyncConnected type:NodeDataChanged path:/clusterstate.json, has occurred - updating... (live nodes size: 5)
[junit4:junit4]   2> 25106 T1821 oascc.ZkStateReader$2.process A cluster state change: WatchedEvent state:SyncConnected type:NodeDataChanged path:/clusterstate.json, has occurred - updating... (live nodes size: 5)
[junit4:junit4]   2> 25107 T1759 oascc.ZkStateReader$2.process A cluster state change: WatchedEvent state:SyncConnected type:NodeDataChanged path:/clusterstate.json, has occurred - updating... (live nodes size: 5)
[junit4:junit4]   2> 25107 T1787 oascc.ZkStateReader$2.process A cluster state change: WatchedEvent state:SyncConnected type:NodeDataChanged path:/clusterstate.json, has occurred - updating... (live nodes size: 5)
[junit4:junit4]   2> 25106 T1803 oascc.ZkStateReader$2.process A cluster state change: WatchedEvent state:SyncConnected type:NodeDataChanged path:/clusterstate.json, has occurred - updating... (live nodes size: 5)
[junit4:junit4]   2> 25106 T1753 oascc.ZkStateReader$2.process A cluster state change: WatchedEvent state:SyncConnected type:NodeDataChanged path:/clusterstate.json, has occurred - updating... (live nodes size: 5)
[junit4:junit4]   2> 25157 T1731 oascc.ZkStateReader.updateClusterState Updating cloud state from ZooKeeper... 
[junit4:junit4]   2> 25158 T1731 oasc.AbstractDistribZkTestBase.waitForRecoveriesToFinish Recoveries finished - collection: collection1
[junit4:junit4]   2> ASYNC  NEW_CORE C123 name=collection1 org.apache.solr.core.SolrCore@1f394b3c url=http://127.0.0.1:65328/collection1 node=127.0.0.1:65328_ C123_STATE=coll:control_collection core:collection1 props:{shard=shard1, state=active, core=collection1, collection=control_collection, node_name=127.0.0.1:65328_, base_url=http://127.0.0.1:65328, leader=true}
[junit4:junit4]   2> 25165 T1743 C123 P65328 oasu.DirectUpdateHandler2.commit start commit{,optimize=false,openSearcher=true,waitSearcher=true,expungeDeletes=false,softCommit=false,prepareCommit=false}
[junit4:junit4]   2> 25168 T1743 C123 P65328 oasc.SolrDeletionPolicy.onInit SolrDeletionPolicy.onInit: commits:num=1
[junit4:junit4]   2> 		commit{dir=MockDirWrapper(org.apache.lucene.store.RAMDirectory@36fea922 lockFactory=org.apache.lucene.store.NativeFSLockFactory@1b6cd3c),segFN=segments_1,generation=1,filenames=[segments_1]
[junit4:junit4]   2> 25169 T1743 C123 P65328 oasc.SolrDeletionPolicy.updateCommits newest commit = 1[segments_1]
[junit4:junit4]   2> 25170 T1743 C123 P65328 oasc.SolrDeletionPolicy.onCommit SolrDeletionPolicy.onCommit: commits:num=2
[junit4:junit4]   2> 		commit{dir=MockDirWrapper(org.apache.lucene.store.RAMDirectory@36fea922 lockFactory=org.apache.lucene.store.NativeFSLockFactory@1b6cd3c),segFN=segments_1,generation=1,filenames=[segments_1]
[junit4:junit4]   2> 		commit{dir=MockDirWrapper(org.apache.lucene.store.RAMDirectory@36fea922 lockFactory=org.apache.lucene.store.NativeFSLockFactory@1b6cd3c),segFN=segments_2,generation=2,filenames=[segments_2]
[junit4:junit4]   2> 25170 T1743 C123 P65328 oasc.SolrDeletionPolicy.updateCommits newest commit = 2[segments_2]
[junit4:junit4]   2> 25171 T1743 C123 P65328 oass.SolrIndexSearcher.<init> Opening Searcher@509809ab main
[junit4:junit4]   2> 25171 T1743 C123 P65328 oasu.DirectUpdateHandler2.commit end_commit_flush
[junit4:junit4]   2> 25172 T1757 oasc.SolrCore.registerSearcher [collection1] Registered new searcher Searcher@509809ab main{StandardDirectoryReader(segments_1:1)}
[junit4:junit4]   2> 25172 T1743 C123 P65328 /update {waitSearcher=true&commit=true&wt=javabin&version=2&softCommit=false} {commit=} 0 7
[junit4:junit4]   2> 25184 T1764 C120 P61855 oasu.DirectUpdateHandler2.commit start commit{,optimize=false,openSearcher=true,waitSearcher=true,expungeDeletes=false,softCommit=false,prepareCommit=false}
[junit4:junit4]   2> 25184 T1764 C120 P61855 oasc.SolrDeletionPolicy.onCommit SolrDeletionPolicy.onCommit: commits:num=4
[junit4:junit4]   2> 		commit{dir=MockDirWrapper(org.apache.lucene.store.RAMDirectory@285896a2 lockFactory=org.apache.lucene.store.NativeFSLockFactory@1e411c06),segFN=segments_2,generation=2,filenames=[segments_2]
[junit4:junit4]   2> 		commit{dir=MockDirWrapper(org.apache.lucene.store.RAMDirectory@285896a2 lockFactory=org.apache.lucene.store.NativeFSLockFactory@1e411c06),segFN=segments_3,generation=3,filenames=[segments_3]
[junit4:junit4]   2> 		commit{dir=MockDirWrapper(org.apache.lucene.store.RAMDirectory@285896a2 lockFactory=org.apache.lucene.store.NativeFSLockFactory@1e411c06),segFN=segments_4,generation=4,filenames=[segments_4]
[junit4:junit4]   2> 		commit{dir=MockDirWrapper(org.apache.lucene.store.RAMDirectory@285896a2 lockFactory=org.apache.lucene.store.NativeFSLockFactory@1e411c06),segFN=segments_5,generation=5,filenames=[segments_5]
[junit4:junit4]   2> 25185 T1764 C120 P61855 oasc.SolrDeletionPolicy.updateCommits newest commit = 5[segments_5]
[junit4:junit4]   2> 25185 T1764 C120 P61855 oass.SolrIndexSearcher.<init> Opening Searcher@6eaabe96 main
[junit4:junit4]   2> 25186 T1764 C120 P61855 oasu.DirectUpdateHandler2.commit end_commit_flush
[junit4:junit4]   2> 25186 T1774 oasc.SolrCore.registerSearcher [collection1] Registered new searcher Searcher@6eaabe96 main{StandardDirectoryReader(segments_2:1:nrt)}
[junit4:junit4]   2> 25187 T1764 C120 P61855 oasu.SolrCmdDistributor.distribCommit Distrib commit to:[StdNode: http://127.0.0.1:22055/collection1/, StdNode: http://127.0.0.1:32078/collection1/, StdNode: http://127.0.0.1:17553/collection1/] params:commit_end_point=true&commit=true&softCommit=false&waitSearcher=true&expungeDeletes=false
[junit4:junit4]   2>  C119_STATE=coll:collection1 core:collection1 props:{shard=shard1, state=active, core=collection1, collection=collection1, node_name=127.0.0.1:22055_, base_url=http://127.0.0.1:22055}
[junit4:junit4]   2> 25195 T1777 C119 P22055 oasu.DirectUpdateHandler2.commit start commit{,optimize=false,openSearcher=true,waitSearcher=true,expungeDeletes=false,softCommit=false,prepareCommit=false}
[junit4:junit4]   2>  C122_STATE=coll:collection1 core:collection1 props:{shard=shard1, state=active, core=collection1, collection=collection1, node_name=127.0.0.1:17553_, base_url=http://127.0.0.1:17553}
[junit4:junit4]   2> 25196 T1811 C122 P17553 oasu.DirectUpdateHandler2.commit start commit{,optimize=false,openSearcher=true,waitSearcher=true,expungeDeletes=false,softCommit=false,prepareCommit=false}
[junit4:junit4]   2>  C121_STATE=coll:collection1 core:collection1 props:{shard=shard1, state=active, core=collection1, collection=collection1, node_name=127.0.0.1:32078_, base_url=http://127.0.0.1:32078}
[junit4:junit4]   2> 25196 T1793 C121 P32078 oasu.DirectUpdateHandler2.commit start commit{,optimize=false,openSearcher=true,waitSearcher=true,expungeDeletes=false,softCommit=false,prepareCommit=false}
[junit4:junit4]   2> 25197 T1777 C119 P22055 oasc.SolrDeletionPolicy.onCommit SolrDeletionPolicy.onCommit: commits:num=2
[junit4:junit4]   2> 		commit{dir=MockDirWrapper(org.apache.lucene.store.RAMDirectory@583a1bd lockFactory=org.apache.lucene.store.NativeFSLockFactory@847c3c1),segFN=segments_2,generation=2,filenames=[segments_2]
[junit4:junit4]   2> 		commit{dir=MockDirWrapper(org.apache.lucene.store.RAMDirectory@583a1bd lockFactory=org.apache.lucene.store.NativeFSLockFactory@847c3c1),segFN=segments_3,generation=3,filenames=[segments_3]
[junit4:junit4]   2> 25197 T1811 C122 P17553 oasc.SolrDeletionPolicy.onCommit SolrDeletionPolicy.onCommit: commits:num=2
[junit4:junit4]   2> 		commit{dir=MockDirWrapper(org.apache.lucene.store.RAMDirectory@28f9161a lockFactory=org.apache.lucene.store.NativeFSLockFactory@209f688c),segFN=segments_4,generation=4,filenames=[segments_4]
[junit4:junit4]   2> 		commit{dir=MockDirWrapper(org.apache.lucene.store.RAMDirectory@28f9161a lockFactory=org.apache.lucene.store.NativeFSLockFactory@209f688c),segFN=segments_5,generation=5,filenames=[segments_5]
[junit4:junit4]   2> 25197 T1777 C119 P22055 oasc.SolrDeletionPolicy.updateCommits newest commit = 3[segments_3]
[junit4:junit4]   2> 25198 T1793 C121 P32078 oasc.SolrDeletionPolicy.onCommit SolrDeletionPolicy.onCommit: commits:num=2
[junit4:junit4]   2> 		commit{dir=MockDirWrapper(org.apache.lucene.store.RAMDirectory@6f11f895 lockFactory=org.apache.lucene.store.NativeFSLockFactory@4d66ea88),segFN=segments_3,generation=3,filenames=[segments_3]
[junit4:junit4]   2> 		commit{dir=MockDirWrapper(org.apache.lucene.store.RAMDirectory@6f11f895 lockFactory=org.apache.lucene.store.NativeFSLockFactory@4d66ea88),segFN=segments_4,generation=4,filenames=[segments_4]
[junit4:junit4]   2> 25198 T1811 C122 P17553 oasc.SolrDeletionPolicy.updateCommits newest commit = 5[segments_5]
[junit4:junit4]   2> 25198 T1777 C119 P22055 oass.SolrIndexSearcher.<init> Opening Searcher@5cbb68b4 main
[junit4:junit4]   2> 25199 T1793 C121 P32078 oasc.SolrDeletionPolicy.updateCommits newest commit = 4[segments_4]
[junit4:junit4]   2> 25199 T1811 C122 P17553 oass.SolrIndexSearcher.<init> Opening Searcher@14d0fa91 main
[junit4:junit4]   2> 25199 T1777 C119 P22055 oasu.DirectUpdateHandler2.commit end_commit_flush
[junit4:junit4]   2> 25199 T1811 C122 P17553 oasu.DirectUpdateHandler2.commit end_commit_flush
[junit4:junit4]   2> 25199 T1793 C121 P32078 oass.SolrIndexSearcher.<init> Opening Searcher@7973b2cb main
[junit4:junit4]   2> 25200 T1823 oasc.JmxMonitoredMap.put WARNING Failed to register info bean: searcher javax.management.InstanceAlreadyExistsException: solr/collection1:type=searcher,id=org.apache.solr.search.SolrIndexSearcher
[junit4:junit4]   2> 	at com.sun.jmx.mbeanserver.Repository.addMBean(Repository.java:467)
[junit4:junit4]   2> 	at com.sun.jmx.interceptor.DefaultMBeanServerInterceptor.internal_addObject(DefaultMBeanServerInterceptor.java:1520)
[junit4:junit4]   2> 	at com.sun.jmx.interceptor.DefaultMBeanServerInterceptor.registerDynamicMBean(DefaultMBeanServerInterceptor.java:986)
[junit4:junit4]   2> 	at com.sun.jmx.interceptor.DefaultMBeanServerInterceptor.registerObject(DefaultMBeanServerInterceptor.java:938)
[junit4:junit4]   2> 	at com.sun.jmx.interceptor.DefaultMBeanServerInterceptor.registerMBean(DefaultMBeanServerInterceptor.java:330)
[junit4:junit4]   2> 	at com.sun.jmx.mbeanserver.JmxMBeanServer.registerMBean(JmxMBeanServer.java:516)
[junit4:junit4]   2> 	at org.apache.solr.core.JmxMonitoredMap.put(JmxMonitoredMap.java:140)
[junit4:junit4]   2> 	at org.apache.solr.core.JmxMonitoredMap.put(JmxMonitoredMap.java:51)
[junit4:junit4]   2> 	at org.apache.solr.search.SolrIndexSearcher.register(SolrIndexSearcher.java:239)
[junit4:junit4]   2> 	at org.apache.solr.core.SolrCore.registerSearcher(SolrCore.java:1749)
[junit4:junit4]   2> 	at org.apache.solr.core.SolrCore.access$000(SolrCore.java:129)
[junit4:junit4]   2> 	at org.apache.solr.core.SolrCore$7.call(SolrCore.java:1626)
[junit4:junit4]   2> 	at java.util.concurrent.FutureTask$Sync.innerRun(FutureTask.java:334)
[junit4:junit4]   2> 	at java.util.concurrent.FutureTask.run(FutureTask.java:166)
[junit4:junit4]   2> 	at java.util.concurrent.ThreadPoolExecutor.runWorker(ThreadPoolExecutor.java:1110)
[junit4:junit4]   2> 	at java.util.concurrent.ThreadPoolExecutor$Worker.run(ThreadPoolExecutor.java:603)
[junit4:junit4]   2> 	at java.lang.Thread.run(Thread.java:679)
[junit4:junit4]   2> 
[junit4:junit4]   2> 25200 T1789 oasc.SolrCore.registerSearcher [collection1] Registered new searcher Searcher@5cbb68b4 main{StandardDirectoryReader(segments_2:1:nrt)}
[junit4:junit4]   2> 25200 T1793 C121 P32078 oasu.DirectUpdateHandler2.commit end_commit_flush
[junit4:junit4]   2> 25201 T1823 oasc.SolrCore.registerSearcher [collection1] Registered new searcher Searcher@14d0fa91 main{StandardDirectoryReader(segments_4:1:nrt)}
[junit4:junit4]   2> 25201 T1777 C119 P22055 /update {waitSearcher=true&commit=true&wt=javabin&expungeDeletes=false&commit_end_point=true&version=2&softCommit=false} {commit=} 0 6
[junit4:junit4]   2> 25201 T1805 oasc.SolrCore.registerSearcher [collection1] Registered new searcher Searcher@7973b2cb main{StandardDirectoryReader(segments_3:1:nrt)}
[junit4:junit4]   2> 25201 T1811 C122 P17553 /update {waitSearcher=true&commit=true&wt=javabin&expungeDeletes=false&commit_end_point=true&version=2&softCommit=false} {commit=} 0 5
[junit4:junit4]   2> 25202 T1793 C121 P32078 /update {waitSearcher=true&commit=true&wt=javabin&expungeDeletes=false&commit_end_point=true&version=2&softCommit=false} {commit=} 0 6
[junit4:junit4]   2> 25202 T1764 C120 P61855 /update {waitSearcher=true&commit=true&wt=javabin&version=2&softCommit=false} {commit=} 0 18
[junit4:junit4]   2> 25203 T1731 oascc.ZkStateReader.updateClusterState Updating cloud state from ZooKeeper... 
[junit4:junit4]   2> 25206 T1766 C120 P61855 REQ /select {tests=checkShardConsistency&q=*:*&distrib=false&wt=javabin&version=2&rows=0} hits=0 status=0 QTime=0 
[junit4:junit4]   2> 25208 T1778 C119 P22055 REQ /select {tests=checkShardConsistency&q=*:*&distrib=false&wt=javabin&version=2&rows=0} hits=0 status=0 QTime=0 
[junit4:junit4]   2> 25210 T1794 C121 P32078 REQ /select {tests=checkShardConsistency&q=*:*&distrib=false&wt=javabin&version=2&rows=0} hits=0 status=0 QTime=1 
[junit4:junit4]   2> 25211 T1812 C122 P17553 REQ /select {tests=checkShardConsistency&q=*:*&distrib=false&wt=javabin&version=2&rows=0} hits=0 status=0 QTime=0 
[junit4:junit4]   2> 27217 T1743 C123 P65328 oass.SolrIndexSearcher.<init> Opening Searcher@2f29239a realtime
[junit4:junit4]   2> 27218 T1743 C123 P65328 /update {wt=javabin&version=2} {deleteByQuery=*:* (-1428839069229514752)} 0 3
[junit4:junit4]   2> 27224 T1811 C122 P17553 /update {update.distrib=FROMLEADER&_version_=-1428839069233709056&update.from=http://127.0.0.1:61855/collection1/&wt=javabin&version=2} {deleteByQuery=*:* (-1428839069233709056)} 0 1
[junit4:junit4]   2> 27224 T1777 C119 P22055 /update {update.distrib=FROMLEADER&_version_=-1428839069233709056&update.from=http://127.0.0.1:61855/collection1/&wt=javabin&version=2} {deleteByQuery=*:* (-1428839069233709056)} 0 1
[junit4:junit4]   2> 27224 T1793 C121 P32078 /update {update.distrib=FROMLEADER&_version_=-1428839069233709056&update.from=http://127.0.0.1:61855/collection1/&wt=javabin&version=2} {deleteByQuery=*:* (-1428839069233709056)} 0 1
[junit4:junit4]   2> 27225 T1764 C120 P61855 /update {wt=javabin&version=2} {deleteByQuery=*:* (-1428839069233709056)} 0 5
[junit4:junit4]   2> 27229 T1743 C123 P65328 /update {wt=javabin&version=2} {add=[0 (1428839069242097664)]} 0 1
[junit4:junit4]   2> 27236 T1811 C122 P17553 /update {distrib.from=http://127.0.0.1:61855/collection1/&update.distrib=FROMLEADER&wt=javabin&version=2} {add=[0 (1428839069246291968)]} 0 1
[junit4:junit4]   2> 27237 T1777 C119 P22055 /update {distrib.from=http://127.0.0.1:61855/collection1/&update.distrib=FROMLEADER&wt=javabin&version=2} {add=[0 (1428839069246291968)]} 0 2
[junit4:junit4]   2> 27237 T1793 C121 P32078 /update {distrib.from=http://127.0.0.1:61855/collection1/&update.distrib=FROMLEADER&wt=javabin&version=2} {add=[0 (1428839069246291968)]} 0 2
[junit4:junit4]   2> 27237 T1764 C120 P61855 /update {wt=javabin&version=2} {add=[0 (1428839069246291968)]} 0 5
[junit4:junit4]   2> 27241 T1743 C123 P65328 /update {wt=javabin&version=2} {add=[1 (1428839069254680576)]} 0 1
[junit4:junit4]   2> 27247 T1793 C121 P32078 /update {distrib.from=http://127.0.0.1:61855/collection1/&update.distrib=FROMLEADER&wt=javabin&version=2} {add=[1 (1428839069257826304)]} 0 1
[junit4:junit4]   2> 27247 T1811 C122 P17553 /update {distrib.from=http://127.0.0.1:61855/collection1/&update.distrib=FROMLEADER&wt=javabin&version=2} {add=[1 (1428839069257826304)]} 0 1
[junit4:junit4]   2> 27247 T1777 C119 P22055 /update {distrib.from=http://127.0.0.1:61855/collection1/&update.distrib=FROMLEADER&wt=javabin&version=2} {add=[1 (1428839069257826304)]} 0 1
[junit4:junit4]   2> 27247 T1764 C120 P61855 /update {wt=javabin&version=2} {add=[1 (1428839069257826304)]} 0 4
[junit4:junit4]   2> 27251 T1743 C123 P65328 /update {wt=javabin&version=2} {add=[2 (1428839069265166336)]} 0 1
[junit4:junit4]   2> 27257 T1793 C121 P32078 /update {distrib.from=http://127.0.0.1:61855/collection1/&update.distrib=FROMLEADER&wt=javabin&version=2} {add=[2 (1428839069268312064)]} 0 1
[junit4:junit4]   2> 27257 T1811 C122 P17553 /update {distrib.from=http://127.0.0.1:61855/collection1/&update.distrib=FROMLEADER&wt=javabin&version=2} {add=[2 (1428839069268312064)]} 0 1
[junit4:junit4]   2> 27257 T1764 C120 P61855 /update {test.distrib.skip.servers=http://127.0.0.1:22055/collection1/&wt=javabin&version=2} {add=[2 (1428839069268312064)]} 0 4
[junit4:junit4]   2> 27261 T1743 C123 P65328 /update {wt=javabin&version=2} {add=[3 (1428839069275652096)]} 0 1
[junit4:junit4]   2> 27267 T1811 C122 P17553 /update {distrib.from=http://127.0.0.1:61855/collection1/&update.distrib=FROMLEADER&wt=javabin&version=2} {add=[3 (1428839069278797824)]} 0 1
[junit4:junit4]   2> 27267 T1764 C120 P61855 /update {test.distrib.skip.servers=http://127.0.0.1:22055/collection1/&test.distrib.skip.servers=http://127.0.0.1:32078/collection1/&wt=javabin&version=2} {add=[3 (1428839069278797824)]} 0 4
[junit4:junit4]   2> 27270 T1743 C123 P65328 oasu.DirectUpdateHandler2.commit start commit{,optimize=false,openSearcher=true,waitSearcher=true,expungeDeletes=false,softCommit=false,prepareCommit=false}
[junit4:junit4]   2> 27273 T1743 C123 P65328 oasc.SolrDeletionPolicy.onCommit SolrDeletionPolicy.onCommit: commits:num=2
[junit4:junit4]   2> 		commit{dir=MockDirWrapper(org.apache.lucene.store.RAMDirectory@36fea922 lockFactory=org.apache.lucene.store.NativeFSLockFactory@1b6cd3c),segFN=segments_2,generation=2,filenames=[segments_2]
[junit4:junit4]   2> 		commit{dir=MockDirWrapper(org.apache.lucene.store.RAMDirectory@36fea922 lockFactory=org.apache.lucene.store.NativeFSLockFactory@1b6cd3c),segFN=segments_3,generation=3,filenames=[_0.fnm, _0.pos, _0.tim, _0.nvd, _0.fdx, _0.si, _0.nvm, _0.doc, _0.tip, _0.fdt, segments_3]
[junit4:junit4]   2> 27274 T1743 C123 P65328 oasc.SolrDeletionPolicy.updateCommits newest commit = 3[_0.fnm, _0.pos, _0.tim, _0.nvd, _0.fdx, _0.si, _0.nvm, _0.doc, _0.tip, _0.fdt, segments_3]
[junit4:junit4]   2> 27275 T1743 C123 P65328 oass.SolrIndexSearcher.<init> Opening Searcher@1133b916 main
[junit4:junit4]   2> 27276 T1743 C123 P65328 oasu.DirectUpdateHandler2.commit end_commit_flush
[junit4:junit4]   2> 27276 T1757 oasc.SolrCore.registerSearcher [collection1] Registered new searcher Searcher@1133b916 main{StandardDirectoryReader(segments_3:3:nrt _0(4.2):C4)}
[junit4:junit4]   2> 27277 T1743 C123 P65328 /update {waitSearcher=true&commit=true&wt=javabin&version=2&softCommit=false} {commit=} 0 7
[junit4:junit4]   2> 27279 T1764 C120 P61855 oasu.DirectUpdateHandler2.commit start commit{,optimize=false,openSearcher=true,waitSearcher=true,expungeDeletes=false,softCommit=false,prepareCommit=false}
[junit4:junit4]   2> 27282 T1764 C120 P61855 oasc.SolrDeletionPolicy.onCommit SolrDeletionPolicy.onCommit: commits:num=5
[junit4:junit4]   2> 		commit{dir=MockDirWrapper(org.apache.lucene.store.RAMDirectory@285896a2 lockFactory=org.apache.lucene.store.NativeFSLockFactory@1e411c06),segFN=segments_2,generation=2,filenames=[segments_2]
[junit4:junit4]   2> 		commit{dir=MockDirWrapper(org.apache.lucene.store.RAMDirectory@285896a2 lockFactory=org.apache.lucene.store.NativeFSLockFactory@1e411c06),segFN=segments_3,generation=3,filenames=[segments_3]
[junit4:junit4]   2> 		commit{dir=MockDirWrapper(org.apache.lucene.store.RAMDirectory@285896a2 lockFactory=org.apache.lucene.store.NativeFSLockFactory@1e411c06),segFN=segments_4,generation=4,filenames=[segments_4]
[junit4:junit4]   2> 		commit{dir=MockDirWrapper(org.apache.lucene.store.RAMDirectory@285896a2 lockFactory=org.apache.lucene.store.NativeFSLockFactory@1e411c06),segFN=segments_5,generation=5,filenames=[segments_5]
[junit4:junit4]   2> 		commit{dir=MockDirWrapper(org.apache.lucene.store.RAMDirectory@285896a2 lockFactory=org.apache.lucene.store.NativeFSLockFactory@1e411c06),segFN=segments_6,generation=6,filenames=[_0.fnm, _0.pos, _0.tim, _0.nvd, _0.fdx, _0.si, _0.nvm, _0.doc, _0.tip, segments_6, _0.fdt]
[junit4:junit4]   2> 27283 T1764 C120 P61855 oasc.SolrDeletionPolicy.updateCommits newest commit = 6[_0.fnm, _0.pos, _0.tim, _0.nvd, _0.fdx, _0.si, _0.nvm, _0.doc, _0.tip, segments_6, _0.fdt]
[junit4:junit4]   2> 27284 T1764 C120 P61855 oass.SolrIndexSearcher.<init> Opening Searcher@59692eec main
[junit4:junit4]   2> 27284 T1764 C120 P61855 oasu.DirectUpdateHandler2.commit end_commit_flush
[junit4:junit4]   2> 27285 T1774 oasc.SolrCore.registerSearcher [collection1] Registered new searcher Searcher@59692eec main{StandardDirectoryReader(segments_6:3:nrt _0(4.2):C4)}
[junit4:junit4]   2> 27285 T1764 C120 P61855 oasu.SolrCmdDistributor.distribCommit Distrib commit to:[StdNode: http://127.0.0.1:22055/collection1/, StdNode: http://127.0.0.1:32078/collection1/, StdNode: http://127.0.0.1:17553/collection1/] params:commit_end_point=true&commit=true&softCommit=false&waitSearcher=true&expungeDeletes=false
[junit4:junit4]   2> 27287 T1811 C122 P17553 oasu.DirectUpdateHandler2.commit start commit{,optimize=false,openSearcher=true,waitSearcher=true,expungeDeletes=false,softCommit=false,prepareCommit=false}
[junit4:junit4]   2> 27287 T1777 C119 P22055 oasu.DirectUpdateHandler2.commit start commit{,optimize=false,openSearcher=true,waitSearcher=true,expungeDeletes=false,softCommit=false,prepareCommit=false}
[junit4:junit4]   2> 27287 T1793 C121 P32078 oasu.DirectUpdateHandler2.commit start commit{,optimize=false,openSearcher=true,waitSearcher=true,expungeDeletes=false,softCommit=false,prepareCommit=false}
[junit4:junit4]   2> 27290 T1777 C119 P22055 oasc.SolrDeletionPolicy.onCommit SolrDeletionPolicy.onCommit: commits:num=2
[junit4:junit4]   2> 		commit{dir=MockDirWrapper(org.apache.lucene.store.RAMDirectory@583a1bd lockFactory=org.apache.lucene.store.NativeFSLockFactory@847c3c1),segFN=segments_3,generation=3,filenames=[segments_3]
[junit4:junit4]   2> 		commit{dir=MockDirWrapper(org.apache.lucene.store.RAMDirectory@583a1bd lockFactory=org.apache.lucene.store.NativeFSLockFactory@847c3c1),segFN=segments_4,generation=4,filenames=[_0.fnm, _0.pos, _0.tim, _0.nvd, _0.fdx, _0.si, _0.nvm, _0.doc, _0.tip, _0.fdt, segments_4]
[junit4:junit4]   2> 27290 T1793 C121 P32078 oasc.SolrDeletionPolicy.onCommit SolrDeletionPolicy.onCommit: commits:num=2
[junit4:junit4]   2> 		commit{dir=MockDirWrapper(org.apache.lucene.store.RAMDirectory@6f11f895 lockFactory=org.apache.lucene.store.NativeFSLockFactory@4d66ea88),segFN=segments_4,generation=4,filenames=[segments_4]
[junit4:junit4]   2> 		commit{dir=MockDirWrapper(org.apache.lucene.store.RAMDirectory@6f11f895 lockFactory=org.apache.lucene.store.NativeFSLockFactory@4d66ea88),segFN=segments_5,generation=5,filenames=[_0.fnm, _0.pos, _0.tim, _0.nvd, _0.fdx, _0.si, _0.nvm, segments_5, _0.doc, _0.tip, _0.fdt]
[junit4:junit4]   2> 27291 T1777 C119 P22055 oasc.SolrDeletionPolicy.updateCommits newest commit = 4[_0.fnm, _0.pos, _0.tim, _0.nvd, _0.fdx, _0.si, _0.nvm, _0.doc, _0.tip, _0.fdt, segments_4]
[junit4:junit4]   2> 27291 T1811 C122 P17553 oasc.SolrDeletionPolicy.onCommit SolrDeletionPolicy.onCommit: commits:num=2
[junit4:junit4]   2> 		commit{dir=MockDirWrapper(org.apache.lucene.store.RAMDirectory@28f9161a lockFactory=org.apache.lucene.store.NativeFSLockFactory@209f688c),segFN=segments_5,generation=5,filenames=[segments_5]
[junit4:junit4]   2> 		commit{dir=MockDirWrapper(org.apache.lucene.store.RAMDirectory@28f9161a lockFactory=org.apache.lucene.store.NativeFSLockFactory@209f688c),segFN=segments_6,generation=6,filenames=[_0.fnm, _0.pos, _0.tim, _0.nvd, _0.fdx, _0.si, _0.nvm, _0.doc, _0.tip, segments_6, _0.fdt]
[junit4:junit4]   2> 27291 T1793 C121 P32078 oasc.SolrDeletionPolicy.updateCommits newest commit = 5[_0.fnm, _0.pos, _0.tim, _0.nvd, _0.fdx, _0.si, _0.nvm, segments_5, _0.doc, _0.tip, _0.fdt]
[junit4:junit4]   2> 27291 T1811 C122 P17553 oasc.SolrDeletionPolicy.updateCommits newest commit = 6[_0.fnm, _0.pos, _0.tim, _0.nvd, _0.fdx, _0.si, _0.nvm, _0.doc, _0.tip, segments_6, _0.fdt]
[junit4:junit4]   2> 27292 T1777 C119 P22055 oass.SolrIndexSearcher.<init> Opening Searcher@1863c8ed main
[junit4:junit4]   2> 27292 T1793 C121 P32078 oass.SolrIndexSearcher.<init> Opening Searcher@1b897a77 main
[junit4:junit4]   2> 27292 T1777 C119 P22055 oasu.DirectUpdateHandler2.commit end_commit_flush
[junit4:junit4]   2> 27293 T1793 C121 P32078 oasu.DirectUpdateHandler2.commit end_commit_flush
[junit4:junit4]   2> 27293 T1811 C122 P17553 oass.SolrIndexSearcher.<init> Opening Searcher@4d3ccab7 main
[junit4:junit4]   2> 27293 T1805 oasc.JmxMonitoredMap.put WARNING Failed to register info bean: searcher javax.management.InstanceNotFoundException: solr/collection1:type=searcher,id=org.apache.solr.search.SolrIndexSearcher
[junit4:junit4]   2> 	at com.sun.jmx.interceptor.DefaultMBeanServerInterceptor.getMBean(DefaultMBeanServerInterceptor.java:1118)
[junit4:junit4]   2> 	at com.sun.jmx.interceptor.DefaultMBeanServerInterceptor.exclusiveUnregisterMBean(DefaultMBeanServerInterceptor.java:433)
[junit4:junit4]   2> 	at com.sun.jmx.interceptor.DefaultMBeanServerInterceptor.unregisterMBean(DefaultMBeanServerInterceptor.java:421)
[junit4:junit4]   2> 	at com.sun.jmx.mbeanserver.JmxMBeanServer.unregisterMBean(JmxMBeanServer.java:540)
[junit4:junit4]   2> 	at org.apache.solr.core.JmxMonitoredMap.put(JmxMonitoredMap.java:138)
[junit4:junit4]   2> 	at org.apache.solr.core.JmxMonitoredMap.put(JmxMonitoredMap.java:51)
[junit4:junit4]   2> 	at org.apache.solr.search.SolrIndexSearcher.register(SolrIndexSearcher.java:239)
[junit4:junit4]   2> 	at org.apache.solr.core.SolrCore.registerSearcher(SolrCore.java:1749)
[junit4:junit4]   2> 	at org.apache.solr.core.SolrCore.access$000(SolrCore.java:129)
[junit4:junit4]   2> 	at org.apache.solr.core.SolrCore$7.call(SolrCore.java:1626)
[junit4:junit4]   2> 	at java.util.concurrent.FutureTask$Sync.innerRun(FutureTask.java:334)
[junit4:junit4]   2> 	at java.util.concurrent.FutureTask.run(FutureTask.java:166)
[junit4:junit4]   2> 	at java.util.concurrent.ThreadPoolExecutor.runWorker(ThreadPoolExecutor.java:1110)
[junit4:junit4]   2> 	at java.util.concurrent.ThreadPoolExecutor$Worker.run(ThreadPoolExecutor.java:603)
[junit4:junit4]   2> 	at java.lang.Thread.run(Thread.java:679)
[junit4:junit4]   2> 
[junit4:junit4]   2> 27293 T1789 oasc.SolrCore.registerSearcher [collection1] Registered new searcher Searcher@1863c8ed main{StandardDirectoryReader(segments_4:3:nrt _0(4.2):C2)}
[junit4:junit4]   2> 27294 T1811 C122 P17553 oasu.DirectUpdateHandler2.commit end_commit_flush
[junit4:junit4]   2> 27294 T1777 C119 P22055 /update {waitSearcher=true&commit=true&wt=javabin&expungeDeletes=false&commit_end_point=true&version=2&softCommit=false} {commit=} 0 7
[junit4:junit4]   2> 27294 T1823 oasc.SolrCore.registerSearcher [collection1] Registered new searcher Searcher@4d3ccab7 main{StandardDirectoryReader(segments_6:3:nrt _0(4.2):C4)}
[junit4:junit4]   2> 27294 T1805 oasc.SolrCore.registerSearcher [collection1] Registered new searcher Searcher@1b897a77 main{StandardDirectoryReader(segments_5:3:nrt _0(4.2):C3)}
[junit4:junit4]   2> 27295 T1811 C122 P17553 /update {waitSearcher=true&commit=true&wt=javabin&expungeDeletes=false&commit_end_point=true&version=2&softCommit=false} {commit=} 0 8
[junit4:junit4]   2> 27295 T1793 C121 P32078 /update {waitSearcher=true&commit=true&wt=javabin&expungeDeletes=false&commit_end_point=true&version=2&softCommit=false} {commit=} 0 8
[junit4:junit4]   2> 27295 T1764 C120 P61855 /update {waitSearcher=true&commit=true&wt=javabin&version=2&softCommit=false} {commit=} 0 16
[junit4:junit4]   2> 27296 T1731 oasc.AbstractDistribZkTestBase.waitForRecoveriesToFinish Wait for recoveries to finish - collection: collection1 failOnTimeout:true timeout (sec):230
[junit4:junit4]   2> 27297 T1731 oascc.ZkStateReader.updateClusterState Updating cloud state from ZooKeeper... 
[junit4:junit4]   2> 27298 T1731 oasc.AbstractDistribZkTestBase.waitForRecoveriesToFinish Recoveries finished - collection: collection1
[junit4:junit4]   2> 27300 T1766 C120 P61855 REQ /select {tests=checkShardConsistency&q=*:*&distrib=false&wt=javabin&version=2&rows=0} hits=4 status=0 QTime=0 
[junit4:junit4]   2> 27303 T1778 C119 P22055 REQ /select {tests=checkShardConsistency&q=*:*&distrib=false&wt=javabin&version=2&rows=0} hits=2 status=0 QTime=0 
[junit4:junit4]   2> 27306 T1794 C121 P32078 REQ /select {tests=checkShardConsistency&q=*:*&distrib=false&wt=javabin&version=2&rows=0} hits=3 status=0 QTime=0 
[junit4:junit4]   2> 27309 T1812 C122 P17553 REQ /select {tests=checkShardConsistency&q=*:*&distrib=false&wt=javabin&version=2&rows=0} hits=4 status=0 QTime=0 
[junit4:junit4]   2> 27315 T1731 oascsi.HttpClientUtil.createClient Creating new http client, config:maxConnections=128&maxConnectionsPerHost=32&followRedirects=false
[junit4:junit4]   2> 27330 T1795 oasha.CollectionsHandler.handleSyncShardAction Syncing shard : shard=shard1&action=SYNCSHARD&collection=collection1&wt=javabin&version=2
[junit4:junit4]   2> 27330 T1795 oascsi.HttpClientUtil.createClient Creating new http client, config:maxConnections=128&maxConnectionsPerHost=32&followRedirects=false
[junit4:junit4]   2> 27339 T1767 oasha.CoreAdminHandler.handleRequestSyncAction I have been requested to sync up my shard
[junit4:junit4]   2> 27340 T1767 oasc.SyncStrategy.sync Sync replicas to http://127.0.0.1:61855/collection1/
[junit4:junit4]   2> 27340 T1767 oasu.PeerSync.sync PeerSync: core=collection1 url=http://127.0.0.1:61855 START replicas=[http://127.0.0.1:22055/collection1/, http://127.0.0.1:32078/collection1/, http://127.0.0.1:17553/collection1/] nUpdates=100
[junit4:junit4]   2> 27342 T1779 C119 P22055 REQ /get {getVersions=100&distrib=false&wt=javabin&qt=/get&version=2} status=0 QTime=0 
[junit4:junit4]   2> 27342 T1796 C121 P32078 REQ /get {getVersions=100&distrib=false&wt=javabin&qt=/get&version=2} status=0 QTime=0 
[junit4:junit4]   2> 27343 T1813 C122 P17553 REQ /get {getVersions=100&distrib=false&wt=javabin&qt=/get&version=2} status=0 QTime=1 
[junit4:junit4]   2> 27343 T1767 oasu.PeerSync.handleVersions PeerSync: core=collection1 url=http://127.0.0.1:61855  Received 3 versions from 127.0.0.1:22055/collection1/
[junit4:junit4]   2> 27343 T1767 oasu.PeerSync.handleVersions PeerSync: core=collection1 url=http://127.0.0.1:61855  Our versions are newer. ourLowThreshold=1428839069233709056 otherHigh=1428839069257826304
[junit4:junit4]   2> 27344 T1767 oasu.PeerSync.handleVersions PeerSync: core=collection1 url=http://127.0.0.1:61855  Received 4 versions from 127.0.0.1:32078/collection1/
[junit4:junit4]   2> 27344 

[...truncated too long message...]

unit4]   2> 140741 T1803 oascc.ZkStateReader$2.process WARNING ZooKeeper watch triggered, but Solr cannot talk to ZK
[junit4:junit4]   2> 140742 T1803 oaz.ClientCnxn$EventThread.run EventThread shut down
[junit4:junit4]   2> 140742 T1731 oazs.ZooKeeperServer.shutdown shutting down
[junit4:junit4]   2> 140743 T1731 oazs.SessionTrackerImpl.shutdown Shutting down
[junit4:junit4]   2> 140743 T1731 oazs.PrepRequestProcessor.shutdown Shutting down
[junit4:junit4]   2> 140743 T1731 oazs.SyncRequestProcessor.shutdown Shutting down
[junit4:junit4]   2> 140743 T1731 oazs.FinalRequestProcessor.shutdown shutdown of request processor complete
[junit4:junit4]   1> client port:0.0.0.0/0.0.0.0:0
[junit4:junit4]   2> NOTE: reproduce with: ant test  -Dtestcase=SyncSliceTest -Dtests.method=testDistribSearch -Dtests.seed=99BF8B6D2AA5E597 -Dtests.multiplier=3 -Dtests.slow=true -Dtests.locale=en_IN -Dtests.timezone=US/Central -Dtests.file.encoding=US-ASCII
[junit4:junit4] FAILURE  141s J0 | SyncSliceTest.testDistribSearch <<<
[junit4:junit4]    > Throwable #1: java.lang.AssertionError: Test Setup Failure: shard1 should have just been set up to be inconsistent - but it's still consistent. Leader:http://127.0.0.1:22055/collection1skip list:[CloudJettyRunner [url=http://127.0.0.1:17553/collection1], CloudJettyRunner [url=http://127.0.0.1:32078/collection1]]
[junit4:junit4]    > 	at __randomizedtesting.SeedInfo.seed([99BF8B6D2AA5E597:185905755DFA85AB]:0)
[junit4:junit4]    > 	at org.junit.Assert.fail(Assert.java:93)
[junit4:junit4]    > 	at org.junit.Assert.assertTrue(Assert.java:43)
[junit4:junit4]    > 	at org.junit.Assert.assertNotNull(Assert.java:526)
[junit4:junit4]    > 	at org.apache.solr.cloud.SyncSliceTest.doTest(SyncSliceTest.java:212)
[junit4:junit4]    > 	at org.apache.solr.BaseDistributedSearchTestCase.testDistribSearch(BaseDistributedSearchTestCase.java:806)
[junit4:junit4]    > 	at sun.reflect.NativeMethodAccessorImpl.invoke0(Native Method)
[junit4:junit4]    > 	at sun.reflect.NativeMethodAccessorImpl.invoke(NativeMethodAccessorImpl.java:57)
[junit4:junit4]    > 	at sun.reflect.DelegatingMethodAccessorImpl.invoke(DelegatingMethodAccessorImpl.java:43)
[junit4:junit4]    > 	at java.lang.reflect.Method.invoke(Method.java:616)
[junit4:junit4]    > 	at com.carrotsearch.randomizedtesting.RandomizedRunner.invoke(RandomizedRunner.java:1559)
[junit4:junit4]    > 	at com.carrotsearch.randomizedtesting.RandomizedRunner.access$600(RandomizedRunner.java:79)
[junit4:junit4]    > 	at com.carrotsearch.randomizedtesting.RandomizedRunner$6.evaluate(RandomizedRunner.java:737)
[junit4:junit4]    > 	at com.carrotsearch.randomizedtesting.RandomizedRunner$7.evaluate(RandomizedRunner.java:773)
[junit4:junit4]    > 	at com.carrotsearch.randomizedtesting.RandomizedRunner$8.evaluate(RandomizedRunner.java:787)
[junit4:junit4]    > 	at com.carrotsearch.randomizedtesting.rules.SystemPropertiesRestoreRule$1.evaluate(SystemPropertiesRestoreRule.java:53)
[junit4:junit4]    > 	at org.apache.lucene.util.TestRuleSetupTeardownChained$1.evaluate(TestRuleSetupTeardownChained.java:50)
[junit4:junit4]    > 	at org.apache.lucene.util.TestRuleFieldCacheSanity$1.evaluate(TestRuleFieldCacheSanity.java:51)
[junit4:junit4]    > 	at org.apache.lucene.util.AbstractBeforeAfterRule$1.evaluate(AbstractBeforeAfterRule.java:46)
[junit4:junit4]    > 	at com.carrotsearch.randomizedtesting.rules.SystemPropertiesInvariantRule$1.evaluate(SystemPropertiesInvariantRule.java:55)
[junit4:junit4]    > 	at org.apache.lucene.util.TestRuleThreadAndTestName$1.evaluate(TestRuleThreadAndTestName.java:49)
[junit4:junit4]    > 	at org.apache.lucene.util.TestRuleIgnoreAfterMaxFailures$1.evaluate(TestRuleIgnoreAfterMaxFailures.java:70)
[junit4:junit4]    > 	at org.apache.lucene.util.TestRuleMarkFailure$1.evaluate(TestRuleMarkFailure.java:48)
[junit4:junit4]    > 	at com.carrotsearch.randomizedtesting.rules.StatementAdapter.evaluate(StatementAdapter.java:36)
[junit4:junit4]    > 	at com.carrotsearch.randomizedtesting.ThreadLeakControl$StatementRunner.run(ThreadLeakControl.java:358)
[junit4:junit4]    > 	at com.carrotsearch.randomizedtesting.ThreadLeakControl.forkTimeoutingTask(ThreadLeakControl.java:782)
[junit4:junit4]    > 	at com.carrotsearch.randomizedtesting.ThreadLeakControl$3.evaluate(ThreadLeakControl.java:442)
[junit4:junit4]    > 	at com.carrotsearch.randomizedtesting.RandomizedRunner.runSingleTest(RandomizedRunner.java:746)
[junit4:junit4]    > 	at com.carrotsearch.randomizedtesting.RandomizedRunner$3.evaluate(RandomizedRunner.java:648)
[junit4:junit4]    > 	at com.carrotsearch.randomizedtesting.RandomizedRunner$4.evaluate(RandomizedRunner.java:682)
[junit4:junit4]    > 	at com.carrotsearch.randomizedtesting.RandomizedRunner$5.evaluate(RandomizedRunner.java:693)
[junit4:junit4]    > 	at com.carrotsearch.randomizedtesting.rules.StatementAdapter.evaluate(StatementAdapter.java:36)
[junit4:junit4]    > 	at com.carrotsearch.randomizedtesting.rules.SystemPropertiesRestoreRule$1.evaluate(SystemPropertiesRestoreRule.java:53)
[junit4:junit4]    > 	at org.apache.lucene.util.AbstractBeforeAfterRule$1.evaluate(AbstractBeforeAfterRule.java:46)
[junit4:junit4]    > 	at org.apache.lucene.util.TestRuleStoreClassName$1.evaluate(TestRuleStoreClassName.java:42)
[junit4:junit4]    > 	at com.carrotsearch.randomizedtesting.rules.SystemPropertiesInvariantRule$1.evaluate(SystemPropertiesInvariantRule.java:55)
[junit4:junit4]    > 	at com.carrotsearch.randomizedtesting.rules.NoShadowingOrOverridesOnMethodsRule$1.evaluate(NoShadowingOrOverridesOnMethodsRule.java:39)
[junit4:junit4]    > 	at com.carrotsearch.randomizedtesting.rules.NoShadowingOrOverridesOnMethodsRule$1.evaluate(NoShadowingOrOverridesOnMethodsRule.java:39)
[junit4:junit4]    > 	at com.carrotsearch.randomizedtesting.rules.StatementAdapter.evaluate(StatementAdapter.java:36)
[junit4:junit4]    > 	at org.apache.lucene.util.TestRuleAssertionsRequired$1.evaluate(TestRuleAssertionsRequired.java:43)
[junit4:junit4]    > 	at org.apache.lucene.util.TestRuleMarkFailure$1.evaluate(TestRuleMarkFailure.java:48)
[junit4:junit4]    > 	at org.apache.lucene.util.TestRuleIgnoreAfterMaxFailures$1.evaluate(TestRuleIgnoreAfterMaxFailures.java:70)
[junit4:junit4]    > 	at org.apache.lucene.util.TestRuleIgnoreTestSuites$1.evaluate(TestRuleIgnoreTestSuites.java:55)
[junit4:junit4]    > 	at com.carrotsearch.randomizedtesting.rules.StatementAdapter.evaluate(StatementAdapter.java:36)
[junit4:junit4]    > 	at com.carrotsearch.randomizedtesting.ThreadLeakControl$StatementRunner.run(ThreadLeakControl.java:358)
[junit4:junit4]    > 	at java.lang.Thread.run(Thread.java:679)
[junit4:junit4]   2> 140756 T1731 oas.SolrTestCaseJ4.deleteCore ###deleteCore
[junit4:junit4]   2> 140759 T1730 ccr.ThreadLeakControl.checkThreadLeaks WARNING Will linger awaiting termination of 1 leaked thread(s).
[junit4:junit4]   2> 140932 T1821 oascc.ZkStateReader$3.process WARNING ZooKeeper watch triggered, but Solr cannot talk to ZK
[junit4:junit4]   2> 140932 T1821 oascc.ZkStateReader$2.process A cluster state change: WatchedEvent state:SyncConnected type:NodeChildrenChanged path:/live_nodes, has occurred - updating... (live nodes size: 1)
[junit4:junit4]   2> 140932 T1821 oascc.ZkStateReader$2.process WARNING ZooKeeper watch triggered, but Solr cannot talk to ZK
[junit4:junit4]   2> 140932 T1821 oaz.ClientCnxn$EventThread.run EventThread shut down
[junit4:junit4]   2> NOTE: test params are: codec=Asserting, sim=DefaultSimilarity, locale=en_IN, timezone=US/Central
[junit4:junit4]   2> NOTE: FreeBSD 9.0-RELEASE amd64/Sun Microsystems Inc. 1.6.0_32 (64-bit)/cpus=16,threads=5,free=92833680,total=465567744
[junit4:junit4]   2> NOTE: All tests run in this JVM: [TestWriterPerf, DirectSolrConnectionTest, CacheHeaderTest, BasicDistributedZkTest, ZkCLITest, TestIndexSearcher, TestFastWriter, TestSolrDeletionPolicy2, HardAutoCommitTest, TestBadConfig, TestLazyCores, TestPseudoReturnFields, TestDistributedGrouping, TestFieldTypeCollectionResource, SOLR749Test, PluginInfoTest, ScriptEngineTest, TestSweetSpotSimilarityFactory, TestSurroundQueryParser, IndexSchemaRuntimeFieldTest, ExternalFileFieldSortTest, TestReplicationHandler, DistributedTermsComponentTest, TestQueryTypes, ChaosMonkeyNothingIsSafeTest, TestAnalyzedSuggestions, ShardRoutingCustomTest, CSVRequestHandlerTest, ShowFileRequestHandlerTest, TestOmitPositions, TestCopyFieldCollectionResource, SuggesterTSTTest, DateFieldTest, BasicZkTest, TestDocumentBuilder, SearchHandlerTest, TestSolrDeletionPolicy1, TestCSVResponseWriter, CircularListTest, TestDistributedSearch, TestXIncludeConfig, UUIDFieldTest, SyncSliceTest]
[junit4:junit4] Completed on J0 in 141.03s, 1 test, 1 failure <<< FAILURES!

[...truncated 533 lines...]
BUILD FAILED
/usr/home/hudson/hudson-slave/workspace/Lucene-Solr-Tests-4.x-Java6/build.xml:381: The following error occurred while executing this line:
/usr/home/hudson/hudson-slave/workspace/Lucene-Solr-Tests-4.x-Java6/build.xml:361: The following error occurred while executing this line:
/usr/home/hudson/hudson-slave/workspace/Lucene-Solr-Tests-4.x-Java6/build.xml:39: The following error occurred while executing this line:
/usr/home/hudson/hudson-slave/workspace/Lucene-Solr-Tests-4.x-Java6/solr/build.xml:183: The following error occurred while executing this line:
/usr/home/hudson/hudson-slave/workspace/Lucene-Solr-Tests-4.x-Java6/solr/common-build.xml:449: The following error occurred while executing this line:
/usr/home/hudson/hudson-slave/workspace/Lucene-Solr-Tests-4.x-Java6/lucene/common-build.xml:1213: The following error occurred while executing this line:
/usr/home/hudson/hudson-slave/workspace/Lucene-Solr-Tests-4.x-Java6/lucene/common-build.xml:877: There were test failures: 268 suites, 1128 tests, 1 failure, 23 ignored (4 assumptions)

Total time: 46 minutes 58 seconds
Build step 'Invoke Ant' marked build as failure
Archiving artifacts
Recording test results
Email was triggered for: Failure
Sending email for trigger: Failure



Mime
View raw message