lucene-dev mailing list archives

Site index · List index
Message view « Date » · « Thread »
Top « Date » · « Thread »
From Policeman Jenkins Server <jenk...@thetaphi.de>
Subject [JENKINS] Lucene-Solr-trunk-Linux (64bit/jdk1.8.0-ea-b79) - Build # 4785 - Still Failing!
Date Wed, 20 Mar 2013 01:23:09 GMT
Build: http://jenkins.thetaphi.de/job/Lucene-Solr-trunk-Linux/4785/
Java: 64bit/jdk1.8.0-ea-b79 -XX:+UseSerialGC

2 tests failed.
REGRESSION:  org.apache.solr.cloud.BasicDistributedZk2Test.testDistribSearch

Error Message:
Server at http://127.0.0.1:37870/dlifn/oc/onenodecollectioncore returned non ok status:404, message:Can not find: /dlifn/oc/onenodecollectioncore/update

Stack Trace:
org.apache.solr.common.SolrException: Server at http://127.0.0.1:37870/dlifn/oc/onenodecollectioncore returned non ok status:404, message:Can not find: /dlifn/oc/onenodecollectioncore/update
	at __randomizedtesting.SeedInfo.seed([3F8AF6FDA3FB4BCB:BE6C78E5D4A42BF7]:0)
	at org.apache.solr.client.solrj.impl.HttpSolrServer.request(HttpSolrServer.java:375)
	at org.apache.solr.client.solrj.impl.HttpSolrServer.request(HttpSolrServer.java:181)
	at org.apache.solr.client.solrj.request.AbstractUpdateRequest.process(AbstractUpdateRequest.java:117)
	at org.apache.solr.client.solrj.SolrServer.add(SolrServer.java:116)
	at org.apache.solr.client.solrj.SolrServer.add(SolrServer.java:102)
	at org.apache.solr.cloud.BasicDistributedZk2Test.testNodeWithoutCollectionForwarding(BasicDistributedZk2Test.java:196)
	at org.apache.solr.cloud.BasicDistributedZk2Test.doTest(BasicDistributedZk2Test.java:89)
	at org.apache.solr.BaseDistributedSearchTestCase.testDistribSearch(BaseDistributedSearchTestCase.java:806)
	at sun.reflect.NativeMethodAccessorImpl.invoke0(Native Method)
	at sun.reflect.NativeMethodAccessorImpl.invoke(NativeMethodAccessorImpl.java:57)
	at sun.reflect.DelegatingMethodAccessorImpl.invoke(DelegatingMethodAccessorImpl.java:43)
	at java.lang.reflect.Method.invoke(Method.java:487)
	at com.carrotsearch.randomizedtesting.RandomizedRunner.invoke(RandomizedRunner.java:1559)
	at com.carrotsearch.randomizedtesting.RandomizedRunner.access$600(RandomizedRunner.java:79)
	at com.carrotsearch.randomizedtesting.RandomizedRunner$6.evaluate(RandomizedRunner.java:737)
	at com.carrotsearch.randomizedtesting.RandomizedRunner$7.evaluate(RandomizedRunner.java:773)
	at com.carrotsearch.randomizedtesting.RandomizedRunner$8.evaluate(RandomizedRunner.java:787)
	at com.carrotsearch.randomizedtesting.rules.SystemPropertiesRestoreRule$1.evaluate(SystemPropertiesRestoreRule.java:53)
	at org.apache.lucene.util.TestRuleSetupTeardownChained$1.evaluate(TestRuleSetupTeardownChained.java:50)
	at org.apache.lucene.util.TestRuleFieldCacheSanity$1.evaluate(TestRuleFieldCacheSanity.java:51)
	at org.apache.lucene.util.AbstractBeforeAfterRule$1.evaluate(AbstractBeforeAfterRule.java:46)
	at com.carrotsearch.randomizedtesting.rules.SystemPropertiesInvariantRule$1.evaluate(SystemPropertiesInvariantRule.java:55)
	at org.apache.lucene.util.TestRuleThreadAndTestName$1.evaluate(TestRuleThreadAndTestName.java:49)
	at org.apache.lucene.util.TestRuleIgnoreAfterMaxFailures$1.evaluate(TestRuleIgnoreAfterMaxFailures.java:70)
	at org.apache.lucene.util.TestRuleMarkFailure$1.evaluate(TestRuleMarkFailure.java:48)
	at com.carrotsearch.randomizedtesting.rules.StatementAdapter.evaluate(StatementAdapter.java:36)
	at com.carrotsearch.randomizedtesting.ThreadLeakControl$StatementRunner.run(ThreadLeakControl.java:358)
	at com.carrotsearch.randomizedtesting.ThreadLeakControl.forkTimeoutingTask(ThreadLeakControl.java:782)
	at com.carrotsearch.randomizedtesting.ThreadLeakControl$3.evaluate(ThreadLeakControl.java:442)
	at com.carrotsearch.randomizedtesting.RandomizedRunner.runSingleTest(RandomizedRunner.java:746)
	at com.carrotsearch.randomizedtesting.RandomizedRunner$3.evaluate(RandomizedRunner.java:648)
	at com.carrotsearch.randomizedtesting.RandomizedRunner$4.evaluate(RandomizedRunner.java:682)
	at com.carrotsearch.randomizedtesting.RandomizedRunner$5.evaluate(RandomizedRunner.java:693)
	at com.carrotsearch.randomizedtesting.rules.StatementAdapter.evaluate(StatementAdapter.java:36)
	at com.carrotsearch.randomizedtesting.rules.SystemPropertiesRestoreRule$1.evaluate(SystemPropertiesRestoreRule.java:53)
	at org.apache.lucene.util.AbstractBeforeAfterRule$1.evaluate(AbstractBeforeAfterRule.java:46)
	at org.apache.lucene.util.TestRuleStoreClassName$1.evaluate(TestRuleStoreClassName.java:42)
	at com.carrotsearch.randomizedtesting.rules.SystemPropertiesInvariantRule$1.evaluate(SystemPropertiesInvariantRule.java:55)
	at com.carrotsearch.randomizedtesting.rules.NoShadowingOrOverridesOnMethodsRule$1.evaluate(NoShadowingOrOverridesOnMethodsRule.java:39)
	at com.carrotsearch.randomizedtesting.rules.NoShadowingOrOverridesOnMethodsRule$1.evaluate(NoShadowingOrOverridesOnMethodsRule.java:39)
	at com.carrotsearch.randomizedtesting.rules.StatementAdapter.evaluate(StatementAdapter.java:36)
	at org.apache.lucene.util.TestRuleAssertionsRequired$1.evaluate(TestRuleAssertionsRequired.java:43)
	at org.apache.lucene.util.TestRuleMarkFailure$1.evaluate(TestRuleMarkFailure.java:48)
	at org.apache.lucene.util.TestRuleIgnoreAfterMaxFailures$1.evaluate(TestRuleIgnoreAfterMaxFailures.java:70)
	at org.apache.lucene.util.TestRuleIgnoreTestSuites$1.evaluate(TestRuleIgnoreTestSuites.java:55)
	at com.carrotsearch.randomizedtesting.rules.StatementAdapter.evaluate(StatementAdapter.java:36)
	at com.carrotsearch.randomizedtesting.ThreadLeakControl$StatementRunner.run(ThreadLeakControl.java:358)
	at java.lang.Thread.run(Thread.java:722)


FAILED:  org.apache.solr.cloud.UnloadDistributedZkTest.testDistribSearch

Error Message:
Still found shard2 in collection test_unload_shard_and_collection

Stack Trace:
java.lang.AssertionError: Still found shard2 in collection test_unload_shard_and_collection
	at __randomizedtesting.SeedInfo.seed([3F8AF6FDA3FB4BCB:BE6C78E5D4A42BF7]:0)
	at org.junit.Assert.fail(Assert.java:93)
	at org.apache.solr.cloud.UnloadDistributedZkTest.testUnloadShardAndCollection(UnloadDistributedZkTest.java:124)
	at org.apache.solr.cloud.UnloadDistributedZkTest.doTest(UnloadDistributedZkTest.java:77)
	at org.apache.solr.BaseDistributedSearchTestCase.testDistribSearch(BaseDistributedSearchTestCase.java:806)
	at sun.reflect.NativeMethodAccessorImpl.invoke0(Native Method)
	at sun.reflect.NativeMethodAccessorImpl.invoke(NativeMethodAccessorImpl.java:57)
	at sun.reflect.DelegatingMethodAccessorImpl.invoke(DelegatingMethodAccessorImpl.java:43)
	at java.lang.reflect.Method.invoke(Method.java:487)
	at com.carrotsearch.randomizedtesting.RandomizedRunner.invoke(RandomizedRunner.java:1559)
	at com.carrotsearch.randomizedtesting.RandomizedRunner.access$600(RandomizedRunner.java:79)
	at com.carrotsearch.randomizedtesting.RandomizedRunner$6.evaluate(RandomizedRunner.java:737)
	at com.carrotsearch.randomizedtesting.RandomizedRunner$7.evaluate(RandomizedRunner.java:773)
	at com.carrotsearch.randomizedtesting.RandomizedRunner$8.evaluate(RandomizedRunner.java:787)
	at com.carrotsearch.randomizedtesting.rules.SystemPropertiesRestoreRule$1.evaluate(SystemPropertiesRestoreRule.java:53)
	at org.apache.lucene.util.TestRuleSetupTeardownChained$1.evaluate(TestRuleSetupTeardownChained.java:50)
	at org.apache.lucene.util.TestRuleFieldCacheSanity$1.evaluate(TestRuleFieldCacheSanity.java:51)
	at org.apache.lucene.util.AbstractBeforeAfterRule$1.evaluate(AbstractBeforeAfterRule.java:46)
	at com.carrotsearch.randomizedtesting.rules.SystemPropertiesInvariantRule$1.evaluate(SystemPropertiesInvariantRule.java:55)
	at org.apache.lucene.util.TestRuleThreadAndTestName$1.evaluate(TestRuleThreadAndTestName.java:49)
	at org.apache.lucene.util.TestRuleIgnoreAfterMaxFailures$1.evaluate(TestRuleIgnoreAfterMaxFailures.java:70)
	at org.apache.lucene.util.TestRuleMarkFailure$1.evaluate(TestRuleMarkFailure.java:48)
	at com.carrotsearch.randomizedtesting.rules.StatementAdapter.evaluate(StatementAdapter.java:36)
	at com.carrotsearch.randomizedtesting.ThreadLeakControl$StatementRunner.run(ThreadLeakControl.java:358)
	at com.carrotsearch.randomizedtesting.ThreadLeakControl.forkTimeoutingTask(ThreadLeakControl.java:782)
	at com.carrotsearch.randomizedtesting.ThreadLeakControl$3.evaluate(ThreadLeakControl.java:442)
	at com.carrotsearch.randomizedtesting.RandomizedRunner.runSingleTest(RandomizedRunner.java:746)
	at com.carrotsearch.randomizedtesting.RandomizedRunner$3.evaluate(RandomizedRunner.java:648)
	at com.carrotsearch.randomizedtesting.RandomizedRunner$4.evaluate(RandomizedRunner.java:682)
	at com.carrotsearch.randomizedtesting.RandomizedRunner$5.evaluate(RandomizedRunner.java:693)
	at com.carrotsearch.randomizedtesting.rules.StatementAdapter.evaluate(StatementAdapter.java:36)
	at com.carrotsearch.randomizedtesting.rules.SystemPropertiesRestoreRule$1.evaluate(SystemPropertiesRestoreRule.java:53)
	at org.apache.lucene.util.AbstractBeforeAfterRule$1.evaluate(AbstractBeforeAfterRule.java:46)
	at org.apache.lucene.util.TestRuleStoreClassName$1.evaluate(TestRuleStoreClassName.java:42)
	at com.carrotsearch.randomizedtesting.rules.SystemPropertiesInvariantRule$1.evaluate(SystemPropertiesInvariantRule.java:55)
	at com.carrotsearch.randomizedtesting.rules.NoShadowingOrOverridesOnMethodsRule$1.evaluate(NoShadowingOrOverridesOnMethodsRule.java:39)
	at com.carrotsearch.randomizedtesting.rules.NoShadowingOrOverridesOnMethodsRule$1.evaluate(NoShadowingOrOverridesOnMethodsRule.java:39)
	at com.carrotsearch.randomizedtesting.rules.StatementAdapter.evaluate(StatementAdapter.java:36)
	at org.apache.lucene.util.TestRuleAssertionsRequired$1.evaluate(TestRuleAssertionsRequired.java:43)
	at org.apache.lucene.util.TestRuleMarkFailure$1.evaluate(TestRuleMarkFailure.java:48)
	at org.apache.lucene.util.TestRuleIgnoreAfterMaxFailures$1.evaluate(TestRuleIgnoreAfterMaxFailures.java:70)
	at org.apache.lucene.util.TestRuleIgnoreTestSuites$1.evaluate(TestRuleIgnoreTestSuites.java:55)
	at com.carrotsearch.randomizedtesting.rules.StatementAdapter.evaluate(StatementAdapter.java:36)
	at com.carrotsearch.randomizedtesting.ThreadLeakControl$StatementRunner.run(ThreadLeakControl.java:358)
	at java.lang.Thread.run(Thread.java:722)




Build Log:
[...truncated 8920 lines...]
[junit4:junit4] Suite: org.apache.solr.cloud.UnloadDistributedZkTest
[junit4:junit4]   2> 0 T24 oas.BaseDistributedSearchTestCase.initHostContext Setting hostContext system property: /
[junit4:junit4]   2> 12 T24 oas.SolrTestCaseJ4.setUp ###Starting testDistribSearch
[junit4:junit4]   2> Creating dataDir: /mnt/ssd/jenkins/workspace/Lucene-Solr-trunk-Linux/solr/build/solr-core/test/J0/./solrtest-UnloadDistributedZkTest-1363741687132
[junit4:junit4]   2> 18 T24 oasc.ZkTestServer.run STARTING ZK TEST SERVER
[junit4:junit4]   2> 22 T25 oasc.ZkTestServer$ZKServerMain.runFromConfig Starting server
[junit4:junit4]   2> 72 T25 oaz.Environment.logEnv Server environment:zookeeper.version=3.4.5-1392090, built on 09/30/2012 17:52 GMT
[junit4:junit4]   2> 73 T25 oaz.Environment.logEnv Server environment:host.name=serv1
[junit4:junit4]   2> 73 T25 oaz.Environment.logEnv Server environment:java.version=1.8.0-ea
[junit4:junit4]   2> 74 T25 oaz.Environment.logEnv Server environment:java.vendor=Oracle Corporation
[junit4:junit4]   2> 74 T25 oaz.Environment.logEnv Server environment:java.home=/var/lib/jenkins/tools/java/64bit/jdk1.8.0-ea-b79/jre
[junit4:junit4]   2> 74 T25 oaz.Environment.logEnv Server environment:java.class.path=/mnt/ssd/jenkins/workspace/Lucene-Solr-trunk-Linux/solr/build/solr-core/classes/test:/mnt/ssd/jenkins/workspace/Lucene-Solr-trunk-Linux/solr/build/solr-test-framework/classes/java:/mnt/ssd/jenkins/workspace/Lucene-Solr-trunk-Linux/solr/build/solr-core/test-files:/mnt/ssd/jenkins/workspace/Lucene-Solr-trunk-Linux/lucene/build/test-framework/classes/java:/mnt/ssd/jenkins/workspace/Lucene-Solr-trunk-Linux/lucene/build/codecs/classes/java:/mnt/ssd/jenkins/workspace/Lucene-Solr-trunk-Linux/solr/build/solr-solrj/classes/java:/mnt/ssd/jenkins/workspace/Lucene-Solr-trunk-Linux/solr/build/solr-core/classes/java:/mnt/ssd/jenkins/workspace/Lucene-Solr-trunk-Linux/lucene/build/analysis/common/lucene-analyzers-common-5.0-SNAPSHOT.jar:/mnt/ssd/jenkins/workspace/Lucene-Solr-trunk-Linux/lucene/build/analysis/kuromoji/lucene-analyzers-kuromoji-5.0-SNAPSHOT.jar:/mnt/ssd/jenkins/workspace/Lucene-Solr-trunk-Linux/lucene/build/analysis/phonetic/lucene-analyzers-phonetic-5.0-SNAPSHOT.jar:/mnt/ssd/jenkins/workspace/Lucene-Solr-trunk-Linux/lucene/build/codecs/lucene-codecs-5.0-SNAPSHOT.jar:/mnt/ssd/jenkins/workspace/Lucene-Solr-trunk-Linux/lucene/build/highlighter/lucene-highlighter-5.0-SNAPSHOT.jar:/mnt/ssd/jenkins/workspace/Lucene-Solr-trunk-Linux/lucene/build/memory/lucene-memory-5.0-SNAPSHOT.jar:/mnt/ssd/jenkins/workspace/Lucene-Solr-trunk-Linux/lucene/build/misc/lucene-misc-5.0-SNAPSHOT.jar:/mnt/ssd/jenkins/workspace/Lucene-Solr-trunk-Linux/lucene/build/spatial/lucene-spatial-5.0-SNAPSHOT.jar:/mnt/ssd/jenkins/workspace/Lucene-Solr-trunk-Linux/lucene/build/suggest/lucene-suggest-5.0-SNAPSHOT.jar:/mnt/ssd/jenkins/workspace/Lucene-Solr-trunk-Linux/lucene/build/grouping/lucene-grouping-5.0-SNAPSHOT.jar:/mnt/ssd/jenkins/workspace/Lucene-Solr-trunk-Linux/lucene/build/queries/lucene-queries-5.0-SNAPSHOT.jar:/mnt/ssd/jenkins/workspace/Lucene-Solr-trunk-Linux/lucene/build/queryparser/lucene-queryparser-5.0-SNAPSHOT.jar:/mnt/ssd/jenkins/workspace/Lucene-Solr-trunk-Linux/solr/core/lib/cglib-nodep-2.2.jar:/mnt/ssd/jenkins/workspace/Lucene-Solr-trunk-Linux/solr/core/lib/commons-cli-1.2.jar:/mnt/ssd/jenkins/workspace/Lucene-Solr-trunk-Linux/solr/core/lib/commons-codec-1.7.jar:/mnt/ssd/jenkins/workspace/Lucene-Solr-trunk-Linux/solr/core/lib/commons-fileupload-1.2.1.jar:/mnt/ssd/jenkins/workspace/Lucene-Solr-trunk-Linux/solr/core/lib/commons-lang-2.6.jar:/mnt/ssd/jenkins/workspace/Lucene-Solr-trunk-Linux/solr/core/lib/easymock-3.0.jar:/mnt/ssd/jenkins/workspace/Lucene-Solr-trunk-Linux/solr/core/lib/guava-13.0.1.jar:/mnt/ssd/jenkins/workspace/Lucene-Solr-trunk-Linux/solr/core/lib/javax.servlet-api-3.0.1.jar:/mnt/ssd/jenkins/workspace/Lucene-Solr-trunk-Linux/solr/core/lib/objenesis-1.2.jar:/mnt/ssd/jenkins/workspace/Lucene-Solr-trunk-Linux/solr/core/lib/org.restlet-2.1.1.jar:/mnt/ssd/jenkins/workspace/Lucene-Solr-trunk-Linux/solr/core/lib/org.restlet.ext.servlet-2.1.1.jar:/mnt/ssd/jenkins/workspace/Lucene-Solr-trunk-Linux/solr/core/lib/spatial4j-0.3.jar:/mnt/ssd/jenkins/workspace/Lucene-Solr-trunk-Linux/solr/solrj/lib/commons-io-2.1.jar:/mnt/ssd/jenkins/workspace/Lucene-Solr-trunk-Linux/solr/solrj/lib/httpclient-4.2.3.jar:/mnt/ssd/jenkins/workspace/Lucene-Solr-trunk-Linux/solr/solrj/lib/httpcore-4.2.2.jar:/mnt/ssd/jenkins/workspace/Lucene-Solr-trunk-Linux/solr/solrj/lib/httpmime-4.2.3.jar:/mnt/ssd/jenkins/workspace/Lucene-Solr-trunk-Linux/solr/solrj/lib/jcl-over-slf4j-1.6.4.jar:/mnt/ssd/jenkins/workspace/Lucene-Solr-trunk-Linux/solr/solrj/lib/noggit-0.5.jar:/mnt/ssd/jenkins/workspace/Lucene-Solr-trunk-Linux/solr/solrj/lib/slf4j-api-1.6.4.jar:/mnt/ssd/jenkins/workspace/Lucene-Solr-trunk-Linux/solr/solrj/lib/slf4j-jdk14-1.6.4.jar:/mnt/ssd/jenkins/workspace/Lucene-Solr-trunk-Linux/solr/solrj/lib/wstx-asl-3.2.7.jar:/mnt/ssd/jenkins/workspace/Lucene-Solr-trunk-Linux/solr/solrj/lib/zookeeper-3.4.5.jar:/mnt/ssd/jenkins/workspace/Lucene-Solr-trunk-Linux/solr/example/lib/jetty-continuation-8.1.8.v20121106.jar:/mnt/ssd/jenkins/workspace/Lucene-Solr-trunk-Linux/solr/example/lib/jetty-deploy-8.1.8.v20121106.jar:/mnt/ssd/jenkins/workspace/Lucene-Solr-trunk-Linux/solr/example/lib/jetty-http-8.1.8.v20121106.jar:/mnt/ssd/jenkins/workspace/Lucene-Solr-trunk-Linux/solr/example/lib/jetty-io-8.1.8.v20121106.jar:/mnt/ssd/jenkins/workspace/Lucene-Solr-trunk-Linux/solr/example/lib/jetty-jmx-8.1.8.v20121106.jar:/mnt/ssd/jenkins/workspace/Lucene-Solr-trunk-Linux/solr/example/lib/jetty-security-8.1.8.v20121106.jar:/mnt/ssd/jenkins/workspace/Lucene-Solr-trunk-Linux/solr/example/lib/jetty-server-8.1.8.v20121106.jar:/mnt/ssd/jenkins/workspace/Lucene-Solr-trunk-Linux/solr/example/lib/jetty-servlet-8.1.8.v20121106.jar:/mnt/ssd/jenkins/workspace/Lucene-Solr-trunk-Linux/solr/example/lib/jetty-util-8.1.8.v20121106.jar:/mnt/ssd/jenkins/workspace/Lucene-Solr-trunk-Linux/solr/example/lib/jetty-webapp-8.1.8.v20121106.jar:/mnt/ssd/jenkins/workspace/Lucene-Solr-trunk-Linux/solr/example/lib/jetty-xml-8.1.8.v20121106.jar:/mnt/ssd/jenkins/workspace/Lucene-Solr-trunk-Linux/solr/example/lib/servlet-api-3.0.jar:/mnt/ssd/jenkins/workspace/Lucene-Solr-trunk-Linux/solr/example/example-DIH/solr/db/lib/derby-10.9.1.0.jar:/mnt/ssd/jenkins/workspace/Lucene-Solr-trunk-Linux/solr/example/example-DIH/solr/db/lib/hsqldb-1.8.0.10.jar:/mnt/ssd/jenkins/workspace/Lucene-Solr-trunk-Linux/lucene/build/core/classes/java:/mnt/ssd/jenkins/workspace/Lucene-Solr-trunk-Linux/lucene/test-framework/lib/junit-4.10.jar:/mnt/ssd/jenkins/workspace/Lucene-Solr-trunk-Linux/lucene/test-framework/lib/randomizedtesting-runner-2.0.8.jar:/var/lib/jenkins/tools/hudson.tasks.Ant_AntInstallation/ANT_1.8.2/lib/ant-launcher.jar:/var/lib/jenkins/.ant/lib/ivy-2.3.0.jar:/var/lib/jenkins/tools/hudson.tasks.Ant_AntInstallation/ANT_1.8.2/lib/ant-jai.jar:/var/lib/jenkins/tools/hudson.tasks.Ant_AntInstallation/ANT_1.8.2/lib/ant-swing.jar:/var/lib/jenkins/tools/hudson.tasks.Ant_AntInstallation/ANT_1.8.2/lib/ant-apache-oro.jar:/var/lib/jenkins/tools/hudson.tasks.Ant_AntInstallation/ANT_1.8.2/lib/ant-jmf.jar:/var/lib/jenkins/tools/hudson.tasks.Ant_AntInstallation/ANT_1.8.2/lib/ant-apache-xalan2.jar:/var/lib/jenkins/tools/hudson.tasks.Ant_AntInstallation/ANT_1.8.2/lib/ant-javamail.jar:/var/lib/jenkins/tools/hudson.tasks.Ant_AntInstallation/ANT_1.8.2/lib/ant-apache-resolver.jar:/var/lib/jenkins/tools/hudson.tasks.Ant_AntInstallation/ANT_1.8.2/lib/ant-testutil.jar:/var/lib/jenkins/tools/hudson.tasks.Ant_AntInstallation/ANT_1.8.2/lib/ant-commons-logging.jar:/var/lib/jenkins/tools/hudson.tasks.Ant_AntInstallation/ANT_1.8.2/lib/ant-apache-log4j.jar:/var/lib/jenkins/tools/hudson.tasks.Ant_AntInstallation/ANT_1.8.2/lib/ant-junit.jar:/var/lib/jenkins/tools/hudson.tasks.Ant_AntInstallation/ANT_1.8.2/lib/ant-jsch.jar:/var/lib/jenkins/tools/hudson.tasks.Ant_AntInstallation/ANT_1.8.2/lib/ant-commons-net.jar:/var/lib/jenkins/tools/hudson.tasks.Ant_AntInstallation/ANT_1.8.2/lib/ant-apache-bsf.jar:/var/lib/jenkins/tools/hudson.tasks.Ant_AntInstallation/ANT_1.8.2/lib/ant-jdepend.jar:/var/lib/jenkins/tools/hudson.tasks.Ant_AntInstallation/ANT_1.8.2/lib/ant-netrexx.jar:/var/lib/jenkins/tools/hudson.tasks.Ant_AntInstallation/ANT_1.8.2/lib/ant-apache-regexp.jar:/var/lib/jenkins/tools/hudson.tasks.Ant_AntInstallation/ANT_1.8.2/lib/ant-junit4.jar:/var/lib/jenkins/tools/hudson.tasks.Ant_AntInstallation/ANT_1.8.2/lib/ant.jar:/var/lib/jenkins/tools/hudson.tasks.Ant_AntInstallation/ANT_1.8.2/lib/ant-apache-bcel.jar:/var/lib/jenkins/tools/hudson.tasks.Ant_AntInstallation/ANT_1.8.2/lib/ant-antlr.jar:/var/lib/jenkins/tools/java/64bit/jdk1.8.0-ea-b79/lib/tools.jar:/var/lib/jenkins/.ivy2/cache/com.carrotsearch.randomizedtesting/junit4-ant/jars/junit4-ant-2.0.8.jar
[junit4:junit4]   2> 78 T25 oaz.Environment.logEnv Server environment:java.library.path=/usr/java/packages/lib/amd64:/usr/lib64:/lib64:/lib:/usr/lib
[junit4:junit4]   2> 79 T25 oaz.Environment.logEnv Server environment:java.io.tmpdir=.
[junit4:junit4]   2> 79 T25 oaz.Environment.logEnv Server environment:java.compiler=<NA>
[junit4:junit4]   2> 79 T25 oaz.Environment.logEnv Server environment:os.name=Linux
[junit4:junit4]   2> 80 T25 oaz.Environment.logEnv Server environment:os.arch=amd64
[junit4:junit4]   2> 81 T25 oaz.Environment.logEnv Server environment:os.version=3.2.0-39-generic
[junit4:junit4]   2> 82 T25 oaz.Environment.logEnv Server environment:user.name=jenkins
[junit4:junit4]   2> 82 T25 oaz.Environment.logEnv Server environment:user.home=/var/lib/jenkins
[junit4:junit4]   2> 82 T25 oaz.Environment.logEnv Server environment:user.dir=/mnt/ssd/jenkins/workspace/Lucene-Solr-trunk-Linux/solr/build/solr-core/test/J0
[junit4:junit4]   2> 105 T25 oazs.ZooKeeperServer.setTickTime tickTime set to 1000
[junit4:junit4]   2> 106 T25 oazs.ZooKeeperServer.setMinSessionTimeout minSessionTimeout set to -1
[junit4:junit4]   2> 112 T25 oazs.ZooKeeperServer.setMaxSessionTimeout maxSessionTimeout set to -1
[junit4:junit4]   2> 134 T25 oazs.NIOServerCnxnFactory.configure binding to port 0.0.0.0/0.0.0.0:0
[junit4:junit4]   2> 178 T25 oazsp.FileTxnSnapLog.save Snapshotting: 0x0 to /mnt/ssd/jenkins/workspace/Lucene-Solr-trunk-Linux/solr/build/solr-core/test/J0/./org.apache.solr.cloud.UnloadDistributedZkTest-1363741687131/zookeeper/server1/data/version-2/snapshot.0
[junit4:junit4]   2> 222 T24 oasc.ZkTestServer.run start zk server on port:38466
[junit4:junit4]   2> 255 T24 oaz.Environment.logEnv Client environment:zookeeper.version=3.4.5-1392090, built on 09/30/2012 17:52 GMT
[junit4:junit4]   2> 256 T24 oaz.Environment.logEnv Client environment:host.name=serv1
[junit4:junit4]   2> 257 T24 oaz.Environment.logEnv Client environment:java.version=1.8.0-ea
[junit4:junit4]   2> 258 T24 oaz.Environment.logEnv Client environment:java.vendor=Oracle Corporation
[junit4:junit4]   2> 258 T24 oaz.Environment.logEnv Client environment:java.home=/var/lib/jenkins/tools/java/64bit/jdk1.8.0-ea-b79/jre
[junit4:junit4]   2> 259 T24 oaz.Environment.logEnv Client environment:java.class.path=/mnt/ssd/jenkins/workspace/Lucene-Solr-trunk-Linux/solr/build/solr-core/classes/test:/mnt/ssd/jenkins/workspace/Lucene-Solr-trunk-Linux/solr/build/solr-test-framework/classes/java:/mnt/ssd/jenkins/workspace/Lucene-Solr-trunk-Linux/solr/build/solr-core/test-files:/mnt/ssd/jenkins/workspace/Lucene-Solr-trunk-Linux/lucene/build/test-framework/classes/java:/mnt/ssd/jenkins/workspace/Lucene-Solr-trunk-Linux/lucene/build/codecs/classes/java:/mnt/ssd/jenkins/workspace/Lucene-Solr-trunk-Linux/solr/build/solr-solrj/classes/java:/mnt/ssd/jenkins/workspace/Lucene-Solr-trunk-Linux/solr/build/solr-core/classes/java:/mnt/ssd/jenkins/workspace/Lucene-Solr-trunk-Linux/lucene/build/analysis/common/lucene-analyzers-common-5.0-SNAPSHOT.jar:/mnt/ssd/jenkins/workspace/Lucene-Solr-trunk-Linux/lucene/build/analysis/kuromoji/lucene-analyzers-kuromoji-5.0-SNAPSHOT.jar:/mnt/ssd/jenkins/workspace/Lucene-Solr-trunk-Linux/lucene/build/analysis/phonetic/lucene-analyzers-phonetic-5.0-SNAPSHOT.jar:/mnt/ssd/jenkins/workspace/Lucene-Solr-trunk-Linux/lucene/build/codecs/lucene-codecs-5.0-SNAPSHOT.jar:/mnt/ssd/jenkins/workspace/Lucene-Solr-trunk-Linux/lucene/build/highlighter/lucene-highlighter-5.0-SNAPSHOT.jar:/mnt/ssd/jenkins/workspace/Lucene-Solr-trunk-Linux/lucene/build/memory/lucene-memory-5.0-SNAPSHOT.jar:/mnt/ssd/jenkins/workspace/Lucene-Solr-trunk-Linux/lucene/build/misc/lucene-misc-5.0-SNAPSHOT.jar:/mnt/ssd/jenkins/workspace/Lucene-Solr-trunk-Linux/lucene/build/spatial/lucene-spatial-5.0-SNAPSHOT.jar:/mnt/ssd/jenkins/workspace/Lucene-Solr-trunk-Linux/lucene/build/suggest/lucene-suggest-5.0-SNAPSHOT.jar:/mnt/ssd/jenkins/workspace/Lucene-Solr-trunk-Linux/lucene/build/grouping/lucene-grouping-5.0-SNAPSHOT.jar:/mnt/ssd/jenkins/workspace/Lucene-Solr-trunk-Linux/lucene/build/queries/lucene-queries-5.0-SNAPSHOT.jar:/mnt/ssd/jenkins/workspace/Lucene-Solr-trunk-Linux/lucene/build/queryparser/lucene-queryparser-5.0-SNAPSHOT.jar:/mnt/ssd/jenkins/workspace/Lucene-Solr-trunk-Linux/solr/core/lib/cglib-nodep-2.2.jar:/mnt/ssd/jenkins/workspace/Lucene-Solr-trunk-Linux/solr/core/lib/commons-cli-1.2.jar:/mnt/ssd/jenkins/workspace/Lucene-Solr-trunk-Linux/solr/core/lib/commons-codec-1.7.jar:/mnt/ssd/jenkins/workspace/Lucene-Solr-trunk-Linux/solr/core/lib/commons-fileupload-1.2.1.jar:/mnt/ssd/jenkins/workspace/Lucene-Solr-trunk-Linux/solr/core/lib/commons-lang-2.6.jar:/mnt/ssd/jenkins/workspace/Lucene-Solr-trunk-Linux/solr/core/lib/easymock-3.0.jar:/mnt/ssd/jenkins/workspace/Lucene-Solr-trunk-Linux/solr/core/lib/guava-13.0.1.jar:/mnt/ssd/jenkins/workspace/Lucene-Solr-trunk-Linux/solr/core/lib/javax.servlet-api-3.0.1.jar:/mnt/ssd/jenkins/workspace/Lucene-Solr-trunk-Linux/solr/core/lib/objenesis-1.2.jar:/mnt/ssd/jenkins/workspace/Lucene-Solr-trunk-Linux/solr/core/lib/org.restlet-2.1.1.jar:/mnt/ssd/jenkins/workspace/Lucene-Solr-trunk-Linux/solr/core/lib/org.restlet.ext.servlet-2.1.1.jar:/mnt/ssd/jenkins/workspace/Lucene-Solr-trunk-Linux/solr/core/lib/spatial4j-0.3.jar:/mnt/ssd/jenkins/workspace/Lucene-Solr-trunk-Linux/solr/solrj/lib/commons-io-2.1.jar:/mnt/ssd/jenkins/workspace/Lucene-Solr-trunk-Linux/solr/solrj/lib/httpclient-4.2.3.jar:/mnt/ssd/jenkins/workspace/Lucene-Solr-trunk-Linux/solr/solrj/lib/httpcore-4.2.2.jar:/mnt/ssd/jenkins/workspace/Lucene-Solr-trunk-Linux/solr/solrj/lib/httpmime-4.2.3.jar:/mnt/ssd/jenkins/workspace/Lucene-Solr-trunk-Linux/solr/solrj/lib/jcl-over-slf4j-1.6.4.jar:/mnt/ssd/jenkins/workspace/Lucene-Solr-trunk-Linux/solr/solrj/lib/noggit-0.5.jar:/mnt/ssd/jenkins/workspace/Lucene-Solr-trunk-Linux/solr/solrj/lib/slf4j-api-1.6.4.jar:/mnt/ssd/jenkins/workspace/Lucene-Solr-trunk-Linux/solr/solrj/lib/slf4j-jdk14-1.6.4.jar:/mnt/ssd/jenkins/workspace/Lucene-Solr-trunk-Linux/solr/solrj/lib/wstx-asl-3.2.7.jar:/mnt/ssd/jenkins/workspace/Lucene-Solr-trunk-Linux/solr/solrj/lib/zookeeper-3.4.5.jar:/mnt/ssd/jenkins/workspace/Lucene-Solr-trunk-Linux/solr/example/lib/jetty-continuation-8.1.8.v20121106.jar:/mnt/ssd/jenkins/workspace/Lucene-Solr-trunk-Linux/solr/example/lib/jetty-deploy-8.1.8.v20121106.jar:/mnt/ssd/jenkins/workspace/Lucene-Solr-trunk-Linux/solr/example/lib/jetty-http-8.1.8.v20121106.jar:/mnt/ssd/jenkins/workspace/Lucene-Solr-trunk-Linux/solr/example/lib/jetty-io-8.1.8.v20121106.jar:/mnt/ssd/jenkins/workspace/Lucene-Solr-trunk-Linux/solr/example/lib/jetty-jmx-8.1.8.v20121106.jar:/mnt/ssd/jenkins/workspace/Lucene-Solr-trunk-Linux/solr/example/lib/jetty-security-8.1.8.v20121106.jar:/mnt/ssd/jenkins/workspace/Lucene-Solr-trunk-Linux/solr/example/lib/jetty-server-8.1.8.v20121106.jar:/mnt/ssd/jenkins/workspace/Lucene-Solr-trunk-Linux/solr/example/lib/jetty-servlet-8.1.8.v20121106.jar:/mnt/ssd/jenkins/workspace/Lucene-Solr-trunk-Linux/solr/example/lib/jetty-util-8.1.8.v20121106.jar:/mnt/ssd/jenkins/workspace/Lucene-Solr-trunk-Linux/solr/example/lib/jetty-webapp-8.1.8.v20121106.jar:/mnt/ssd/jenkins/workspace/Lucene-Solr-trunk-Linux/solr/example/lib/jetty-xml-8.1.8.v20121106.jar:/mnt/ssd/jenkins/workspace/Lucene-Solr-trunk-Linux/solr/example/lib/servlet-api-3.0.jar:/mnt/ssd/jenkins/workspace/Lucene-Solr-trunk-Linux/solr/example/example-DIH/solr/db/lib/derby-10.9.1.0.jar:/mnt/ssd/jenkins/workspace/Lucene-Solr-trunk-Linux/solr/example/example-DIH/solr/db/lib/hsqldb-1.8.0.10.jar:/mnt/ssd/jenkins/workspace/Lucene-Solr-trunk-Linux/lucene/build/core/classes/java:/mnt/ssd/jenkins/workspace/Lucene-Solr-trunk-Linux/lucene/test-framework/lib/junit-4.10.jar:/mnt/ssd/jenkins/workspace/Lucene-Solr-trunk-Linux/lucene/test-framework/lib/randomizedtesting-runner-2.0.8.jar:/var/lib/jenkins/tools/hudson.tasks.Ant_AntInstallation/ANT_1.8.2/lib/ant-launcher.jar:/var/lib/jenkins/.ant/lib/ivy-2.3.0.jar:/var/lib/jenkins/tools/hudson.tasks.Ant_AntInstallation/ANT_1.8.2/lib/ant-jai.jar:/var/lib/jenkins/tools/hudson.tasks.Ant_AntInstallation/ANT_1.8.2/lib/ant-swing.jar:/var/lib/jenkins/tools/hudson.tasks.Ant_AntInstallation/ANT_1.8.2/lib/ant-apache-oro.jar:/var/lib/jenkins/tools/hudson.tasks.Ant_AntInstallation/ANT_1.8.2/lib/ant-jmf.jar:/var/lib/jenkins/tools/hudson.tasks.Ant_AntInstallation/ANT_1.8.2/lib/ant-apache-xalan2.jar:/var/lib/jenkins/tools/hudson.tasks.Ant_AntInstallation/ANT_1.8.2/lib/ant-javamail.jar:/var/lib/jenkins/tools/hudson.tasks.Ant_AntInstallation/ANT_1.8.2/lib/ant-apache-resolver.jar:/var/lib/jenkins/tools/hudson.tasks.Ant_AntInstallation/ANT_1.8.2/lib/ant-testutil.jar:/var/lib/jenkins/tools/hudson.tasks.Ant_AntInstallation/ANT_1.8.2/lib/ant-commons-logging.jar:/var/lib/jenkins/tools/hudson.tasks.Ant_AntInstallation/ANT_1.8.2/lib/ant-apache-log4j.jar:/var/lib/jenkins/tools/hudson.tasks.Ant_AntInstallation/ANT_1.8.2/lib/ant-junit.jar:/var/lib/jenkins/tools/hudson.tasks.Ant_AntInstallation/ANT_1.8.2/lib/ant-jsch.jar:/var/lib/jenkins/tools/hudson.tasks.Ant_AntInstallation/ANT_1.8.2/lib/ant-commons-net.jar:/var/lib/jenkins/tools/hudson.tasks.Ant_AntInstallation/ANT_1.8.2/lib/ant-apache-bsf.jar:/var/lib/jenkins/tools/hudson.tasks.Ant_AntInstallation/ANT_1.8.2/lib/ant-jdepend.jar:/var/lib/jenkins/tools/hudson.tasks.Ant_AntInstallation/ANT_1.8.2/lib/ant-netrexx.jar:/var/lib/jenkins/tools/hudson.tasks.Ant_AntInstallation/ANT_1.8.2/lib/ant-apache-regexp.jar:/var/lib/jenkins/tools/hudson.tasks.Ant_AntInstallation/ANT_1.8.2/lib/ant-junit4.jar:/var/lib/jenkins/tools/hudson.tasks.Ant_AntInstallation/ANT_1.8.2/lib/ant.jar:/var/lib/jenkins/tools/hudson.tasks.Ant_AntInstallation/ANT_1.8.2/lib/ant-apache-bcel.jar:/var/lib/jenkins/tools/hudson.tasks.Ant_AntInstallation/ANT_1.8.2/lib/ant-antlr.jar:/var/lib/jenkins/tools/java/64bit/jdk1.8.0-ea-b79/lib/tools.jar:/var/lib/jenkins/.ivy2/cache/com.carrotsearch.randomizedtesting/junit4-ant/jars/junit4-ant-2.0.8.jar
[junit4:junit4]   2> 261 T24 oaz.Environment.logEnv Client environment:java.library.path=/usr/java/packages/lib/amd64:/usr/lib64:/lib64:/lib:/usr/lib
[junit4:junit4]   2> 262 T24 oaz.Environment.logEnv Client environment:java.io.tmpdir=.
[junit4:junit4]   2> 262 T24 oaz.Environment.logEnv Client environment:java.compiler=<NA>
[junit4:junit4]   2> 263 T24 oaz.Environment.logEnv Client environment:os.name=Linux
[junit4:junit4]   2> 263 T24 oaz.Environment.logEnv Client environment:os.arch=amd64
[junit4:junit4]   2> 264 T24 oaz.Environment.logEnv Client environment:os.version=3.2.0-39-generic
[junit4:junit4]   2> 264 T24 oaz.Environment.logEnv Client environment:user.name=jenkins
[junit4:junit4]   2> 264 T24 oaz.Environment.logEnv Client environment:user.home=/var/lib/jenkins
[junit4:junit4]   2> 265 T24 oaz.Environment.logEnv Client environment:user.dir=/mnt/ssd/jenkins/workspace/Lucene-Solr-trunk-Linux/solr/build/solr-core/test/J0
[junit4:junit4]   2> 267 T24 oaz.ZooKeeper.<init> Initiating client connection, connectString=127.0.0.1:38466 sessionTimeout=10000 watcher=org.apache.solr.common.cloud.ConnectionManager@2287c98a
[junit4:junit4]   2> 302 T24 oascc.ConnectionManager.waitForConnected Waiting for client to connect to ZooKeeper
[junit4:junit4]   2> 306 T30 oaz.ClientCnxn$SendThread.logStartConnect Opening socket connection to server localhost.localdomain/127.0.0.1:38466. Will not attempt to authenticate using SASL (access denied ("javax.security.auth.AuthPermission" "getLoginConfiguration"))
[junit4:junit4]   2> 308 T30 oaz.ClientCnxn$SendThread.primeConnection Socket connection established to localhost.localdomain/127.0.0.1:38466, initiating session
[junit4:junit4]   2> 915 T26 oazs.NIOServerCnxnFactory.run Accepted socket connection from /127.0.0.1:33480
[junit4:junit4]   2> 925 T26 oazs.ZooKeeperServer.processConnectRequest Client attempting to establish new session at /127.0.0.1:33480
[junit4:junit4]   2> 931 T28 oazsp.FileTxnLog.append Creating new log file: log.1
[junit4:junit4]   2> 1014 T28 oazs.ZooKeeperServer.finishSessionInit Established session 0x13d8556be120000 with negotiated timeout 10000 for client /127.0.0.1:33480
[junit4:junit4]   2> 1014 T30 oaz.ClientCnxn$SendThread.onConnected Session establishment complete on server localhost.localdomain/127.0.0.1:38466, sessionid = 0x13d8556be120000, negotiated timeout = 10000
[junit4:junit4]   2> 1018 T31 oascc.ConnectionManager.process Watcher org.apache.solr.common.cloud.ConnectionManager@2287c98a name:ZooKeeperConnection Watcher:127.0.0.1:38466 got event WatchedEvent state:SyncConnected type:None path:null path:null type:None
[junit4:junit4]   2> 1019 T24 oascc.ConnectionManager.waitForConnected Client is connected to ZooKeeper
[junit4:junit4]   2> 1021 T24 oascc.SolrZkClient.makePath makePath: /solr
[junit4:junit4]   2> 1067 T29 oazs.PrepRequestProcessor.pRequest2Txn Processed session termination for sessionid: 0x13d8556be120000
[junit4:junit4]   2> 1073 T26 oazs.NIOServerCnxn.closeSock Closed socket connection for client /127.0.0.1:33480 which had sessionid 0x13d8556be120000
[junit4:junit4]   2> 1073 T24 oaz.ZooKeeper.close Session: 0x13d8556be120000 closed
[junit4:junit4]   2> 1073 T31 oaz.ClientCnxn$EventThread.run EventThread shut down
[junit4:junit4]   2> 1074 T24 oaz.ZooKeeper.<init> Initiating client connection, connectString=127.0.0.1:38466/solr sessionTimeout=10000 watcher=org.apache.solr.common.cloud.ConnectionManager@9dd3a52
[junit4:junit4]   2> 1078 T32 oaz.ClientCnxn$SendThread.logStartConnect Opening socket connection to server localhost.localdomain/127.0.0.1:38466. Will not attempt to authenticate using SASL (access denied ("javax.security.auth.AuthPermission" "getLoginConfiguration"))
[junit4:junit4]   2> 1079 T32 oaz.ClientCnxn$SendThread.primeConnection Socket connection established to localhost.localdomain/127.0.0.1:38466, initiating session
[junit4:junit4]   2> 1079 T26 oazs.NIOServerCnxnFactory.run Accepted socket connection from /127.0.0.1:33481
[junit4:junit4]   2> 1079 T24 oascc.ConnectionManager.waitForConnected Waiting for client to connect to ZooKeeper
[junit4:junit4]   2> 1080 T26 oazs.ZooKeeperServer.processConnectRequest Client attempting to establish new session at /127.0.0.1:33481
[junit4:junit4]   2> 1081 T28 oazs.ZooKeeperServer.finishSessionInit Established session 0x13d8556be120001 with negotiated timeout 10000 for client /127.0.0.1:33481
[junit4:junit4]   2> 1082 T32 oaz.ClientCnxn$SendThread.onConnected Session establishment complete on server localhost.localdomain/127.0.0.1:38466, sessionid = 0x13d8556be120001, negotiated timeout = 10000
[junit4:junit4]   2> 1083 T33 oascc.ConnectionManager.process Watcher org.apache.solr.common.cloud.ConnectionManager@9dd3a52 name:ZooKeeperConnection Watcher:127.0.0.1:38466/solr got event WatchedEvent state:SyncConnected type:None path:null path:null type:None
[junit4:junit4]   2> 1084 T24 oascc.ConnectionManager.waitForConnected Client is connected to ZooKeeper
[junit4:junit4]   2> 1092 T24 oascc.SolrZkClient.makePath makePath: /collections/collection1
[junit4:junit4]   2> 1107 T24 oascc.SolrZkClient.makePath makePath: /collections/collection1/shards
[junit4:junit4]   2> 1119 T24 oascc.SolrZkClient.makePath makePath: /collections/control_collection
[junit4:junit4]   2> 1124 T24 oascc.SolrZkClient.makePath makePath: /collections/control_collection/shards
[junit4:junit4]   2> 1134 T24 oasc.AbstractZkTestCase.putConfig put /mnt/ssd/jenkins/workspace/Lucene-Solr-trunk-Linux/solr/build/solr-core/test-files/solr/collection1/conf/solrconfig-tlog.xml to /configs/conf1/solrconfig.xml
[junit4:junit4]   2> 1144 T24 oascc.SolrZkClient.makePath makePath: /configs/conf1/solrconfig.xml
[junit4:junit4]   2> 1150 T24 oasc.AbstractZkTestCase.putConfig put /mnt/ssd/jenkins/workspace/Lucene-Solr-trunk-Linux/solr/build/solr-core/test-files/solr/collection1/conf/schema.xml to /configs/conf1/schema.xml
[junit4:junit4]   2> 1154 T24 oascc.SolrZkClient.makePath makePath: /configs/conf1/schema.xml
[junit4:junit4]   2> 1158 T24 oasc.AbstractZkTestCase.putConfig put /mnt/ssd/jenkins/workspace/Lucene-Solr-trunk-Linux/solr/build/solr-core/test-files/solr/collection1/conf/stopwords.txt to /configs/conf1/stopwords.txt
[junit4:junit4]   2> 1159 T24 oascc.SolrZkClient.makePath makePath: /configs/conf1/stopwords.txt
[junit4:junit4]   2> 1163 T24 oasc.AbstractZkTestCase.putConfig put /mnt/ssd/jenkins/workspace/Lucene-Solr-trunk-Linux/solr/build/solr-core/test-files/solr/collection1/conf/protwords.txt to /configs/conf1/protwords.txt
[junit4:junit4]   2> 1164 T24 oascc.SolrZkClient.makePath makePath: /configs/conf1/protwords.txt
[junit4:junit4]   2> 1167 T24 oasc.AbstractZkTestCase.putConfig put /mnt/ssd/jenkins/workspace/Lucene-Solr-trunk-Linux/solr/build/solr-core/test-files/solr/collection1/conf/currency.xml to /configs/conf1/currency.xml
[junit4:junit4]   2> 1168 T24 oascc.SolrZkClient.makePath makePath: /configs/conf1/currency.xml
[junit4:junit4]   2> 1172 T24 oasc.AbstractZkTestCase.putConfig put /mnt/ssd/jenkins/workspace/Lucene-Solr-trunk-Linux/solr/build/solr-core/test-files/solr/collection1/conf/open-exchange-rates.json to /configs/conf1/open-exchange-rates.json
[junit4:junit4]   2> 1172 T24 oascc.SolrZkClient.makePath makePath: /configs/conf1/open-exchange-rates.json
[junit4:junit4]   2> 1177 T24 oasc.AbstractZkTestCase.putConfig put /mnt/ssd/jenkins/workspace/Lucene-Solr-trunk-Linux/solr/build/solr-core/test-files/solr/collection1/conf/mapping-ISOLatin1Accent.txt to /configs/conf1/mapping-ISOLatin1Accent.txt
[junit4:junit4]   2> 1178 T24 oascc.SolrZkClient.makePath makePath: /configs/conf1/mapping-ISOLatin1Accent.txt
[junit4:junit4]   2> 1182 T24 oasc.AbstractZkTestCase.putConfig put /mnt/ssd/jenkins/workspace/Lucene-Solr-trunk-Linux/solr/build/solr-core/test-files/solr/collection1/conf/old_synonyms.txt to /configs/conf1/old_synonyms.txt
[junit4:junit4]   2> 1183 T24 oascc.SolrZkClient.makePath makePath: /configs/conf1/old_synonyms.txt
[junit4:junit4]   2> 1188 T24 oasc.AbstractZkTestCase.putConfig put /mnt/ssd/jenkins/workspace/Lucene-Solr-trunk-Linux/solr/build/solr-core/test-files/solr/collection1/conf/synonyms.txt to /configs/conf1/synonyms.txt
[junit4:junit4]   2> 1189 T24 oascc.SolrZkClient.makePath makePath: /configs/conf1/synonyms.txt
[junit4:junit4]   2> 1203 T29 oazs.PrepRequestProcessor.pRequest2Txn Processed session termination for sessionid: 0x13d8556be120001
[junit4:junit4]   2> 1204 T33 oaz.ClientCnxn$EventThread.run EventThread shut down
[junit4:junit4]   2> 1204 T24 oaz.ZooKeeper.close Session: 0x13d8556be120001 closed
[junit4:junit4]   2> 1204 T26 oazs.NIOServerCnxn.closeSock Closed socket connection for client /127.0.0.1:33481 which had sessionid 0x13d8556be120001
[junit4:junit4]   2> 1540 T24 oejs.Server.doStart jetty-8.1.8.v20121106
[junit4:junit4]   2> 1699 T24 oejs.AbstractConnector.doStart Started SelectChannelConnector@127.0.0.1:43909
[junit4:junit4]   2> 1742 T24 oass.SolrDispatchFilter.init SolrDispatchFilter.init()
[junit4:junit4]   2> 1743 T24 oasc.SolrResourceLoader.locateSolrHome JNDI not configured for solr (NoInitialContextEx)
[junit4:junit4]   2> 1744 T24 oasc.SolrResourceLoader.locateSolrHome using system property solr.solr.home: /mnt/ssd/jenkins/workspace/Lucene-Solr-trunk-Linux/solr/build/solr-core/test/J0/./org.apache.solr.cloud.UnloadDistributedZkTest-controljetty-1363741688328
[junit4:junit4]   2> 1745 T24 oasc.CoreContainer$Initializer.initialize looking for solr config file: /mnt/ssd/jenkins/workspace/Lucene-Solr-trunk-Linux/solr/build/solr-core/test/J0/./org.apache.solr.cloud.UnloadDistributedZkTest-controljetty-1363741688328/solr.xml
[junit4:junit4]   2> 1746 T24 oasc.CoreContainer.<init> New CoreContainer 2040086863
[junit4:junit4]   2> 1747 T24 oasc.CoreContainer.load Loading CoreContainer using Solr Home: '/mnt/ssd/jenkins/workspace/Lucene-Solr-trunk-Linux/solr/build/solr-core/test/J0/./org.apache.solr.cloud.UnloadDistributedZkTest-controljetty-1363741688328/'
[junit4:junit4]   2> 1747 T24 oasc.SolrResourceLoader.<init> new SolrResourceLoader for directory: '/mnt/ssd/jenkins/workspace/Lucene-Solr-trunk-Linux/solr/build/solr-core/test/J0/./org.apache.solr.cloud.UnloadDistributedZkTest-controljetty-1363741688328/'
[junit4:junit4]   2> 1849 T24 oashc.HttpShardHandlerFactory.getParameter Setting socketTimeout to: 120000
[junit4:junit4]   2> 1850 T24 oashc.HttpShardHandlerFactory.getParameter Setting urlScheme to: http://
[junit4:junit4]   2> 1851 T24 oashc.HttpShardHandlerFactory.getParameter Setting connTimeout to: 15000
[junit4:junit4]   2> 1852 T24 oashc.HttpShardHandlerFactory.getParameter Setting maxConnectionsPerHost to: 20
[junit4:junit4]   2> 1853 T24 oashc.HttpShardHandlerFactory.getParameter Setting corePoolSize to: 0
[junit4:junit4]   2> 1854 T24 oashc.HttpShardHandlerFactory.getParameter Setting maximumPoolSize to: 2147483647
[junit4:junit4]   2> 1855 T24 oashc.HttpShardHandlerFactory.getParameter Setting maxThreadIdleTime to: 5
[junit4:junit4]   2> 1858 T24 oashc.HttpShardHandlerFactory.getParameter Setting sizeOfQueue to: -1
[junit4:junit4]   2> 1859 T24 oashc.HttpShardHandlerFactory.getParameter Setting fairnessPolicy to: false
[junit4:junit4]   2> 1973 T24 oascsi.HttpClientUtil.createClient Creating new http client, config:maxConnectionsPerHost=20&maxConnections=10000&socketTimeout=120000&connTimeout=15000&retry=false
[junit4:junit4]   2> 2385 T24 oasc.CoreContainer.load Registering Log Listener
[junit4:junit4]   2> 2410 T24 oasc.CoreContainer.initZooKeeper Zookeeper client=127.0.0.1:38466/solr
[junit4:junit4]   2> 2422 T24 oasc.ZkController.checkChrootPath zkHost includes chroot
[junit4:junit4]   2> 2423 T24 oaz.ZooKeeper.<init> Initiating client connection, connectString=127.0.0.1:38466 sessionTimeout=60000 watcher=org.apache.solr.common.cloud.ConnectionManager@71687fbf
[junit4:junit4]   2> 2425 T24 oascc.ConnectionManager.waitForConnected Waiting for client to connect to ZooKeeper
[junit4:junit4]   2> 2426 T44 oaz.ClientCnxn$SendThread.logStartConnect Opening socket connection to server localhost.localdomain/127.0.0.1:38466. Will not attempt to authenticate using SASL (access denied ("javax.security.auth.AuthPermission" "getLoginConfiguration"))
[junit4:junit4]   2> 2430 T44 oaz.ClientCnxn$SendThread.primeConnection Socket connection established to localhost.localdomain/127.0.0.1:38466, initiating session
[junit4:junit4]   2> 2431 T26 oazs.NIOServerCnxnFactory.run Accepted socket connection from /127.0.0.1:33482
[junit4:junit4]   2> 2432 T26 oazs.ZooKeeperServer.processConnectRequest Client attempting to establish new session at /127.0.0.1:33482
[junit4:junit4]   2> 2435 T28 oazs.ZooKeeperServer.finishSessionInit Established session 0x13d8556be120002 with negotiated timeout 20000 for client /127.0.0.1:33482
[junit4:junit4]   2> 2435 T44 oaz.ClientCnxn$SendThread.onConnected Session establishment complete on server localhost.localdomain/127.0.0.1:38466, sessionid = 0x13d8556be120002, negotiated timeout = 20000
[junit4:junit4]   2> 2436 T45 oascc.ConnectionManager.process Watcher org.apache.solr.common.cloud.ConnectionManager@71687fbf name:ZooKeeperConnection Watcher:127.0.0.1:38466 got event WatchedEvent state:SyncConnected type:None path:null path:null type:None
[junit4:junit4]   2> 2436 T24 oascc.ConnectionManager.waitForConnected Client is connected to ZooKeeper
[junit4:junit4]   2> 2438 T29 oazs.PrepRequestProcessor.pRequest2Txn Processed session termination for sessionid: 0x13d8556be120002
[junit4:junit4]   2> 2439 T45 oaz.ClientCnxn$EventThread.run EventThread shut down
[junit4:junit4]   2> 2439 T24 oaz.ZooKeeper.close Session: 0x13d8556be120002 closed
[junit4:junit4]   2> 2439 T26 oazs.NIOServerCnxn.closeSock Closed socket connection for client /127.0.0.1:33482 which had sessionid 0x13d8556be120002
[junit4:junit4]   2> 2441 T24 oascsi.HttpClientUtil.createClient Creating new http client, config:maxConnections=500&maxConnectionsPerHost=16&socketTimeout=120000&connTimeout=15000
[junit4:junit4]   2> 2450 T24 oaz.ZooKeeper.<init> Initiating client connection, connectString=127.0.0.1:38466/solr sessionTimeout=30000 watcher=org.apache.solr.common.cloud.ConnectionManager@17e003fe
[junit4:junit4]   2> 2457 T24 oascc.ConnectionManager.waitForConnected Waiting for client to connect to ZooKeeper
[junit4:junit4]   2> 2460 T46 oaz.ClientCnxn$SendThread.logStartConnect Opening socket connection to server localhost.localdomain/127.0.0.1:38466. Will not attempt to authenticate using SASL (access denied ("javax.security.auth.AuthPermission" "getLoginConfiguration"))
[junit4:junit4]   2> 2461 T26 oazs.NIOServerCnxnFactory.run Accepted socket connection from /127.0.0.1:33483
[junit4:junit4]   2> 2461 T46 oaz.ClientCnxn$SendThread.primeConnection Socket connection established to localhost.localdomain/127.0.0.1:38466, initiating session
[junit4:junit4]   2> 2469 T26 oazs.ZooKeeperServer.processConnectRequest Client attempting to establish new session at /127.0.0.1:33483
[junit4:junit4]   2> 2471 T28 oazs.ZooKeeperServer.finishSessionInit Established session 0x13d8556be120003 with negotiated timeout 20000 for client /127.0.0.1:33483
[junit4:junit4]   2> 2472 T46 oaz.ClientCnxn$SendThread.onConnected Session establishment complete on server localhost.localdomain/127.0.0.1:38466, sessionid = 0x13d8556be120003, negotiated timeout = 20000
[junit4:junit4]   2> 2473 T47 oascc.ConnectionManager.process Watcher org.apache.solr.common.cloud.ConnectionManager@17e003fe name:ZooKeeperConnection Watcher:127.0.0.1:38466/solr got event WatchedEvent state:SyncConnected type:None path:null path:null type:None
[junit4:junit4]   2> 2473 T24 oascc.ConnectionManager.waitForConnected Client is connected to ZooKeeper
[junit4:junit4]   2> 2485 T24 oascc.SolrZkClient.makePath makePath: /overseer/queue
[junit4:junit4]   2> 2499 T29 oazs.PrepRequestProcessor.pRequest Got user-level KeeperException when processing sessionid:0x13d8556be120003 type:create cxid:0x7 zxid:0x1b txntype:-1 reqpath:n/a Error Path:/solr/overseer Error:KeeperErrorCode = NodeExists for /solr/overseer
[junit4:junit4]   2> 2505 T24 oascc.SolrZkClient.makePath makePath: /overseer/collection-queue-work
[junit4:junit4]   2> 2518 T24 oascc.SolrZkClient.makePath makePath: /live_nodes
[junit4:junit4]   2> 2528 T24 oasc.ZkController.createEphemeralLiveNode Register node as live in ZooKeeper:/live_nodes/127.0.0.1:43909_
[junit4:junit4]   2> 2532 T29 oazs.PrepRequestProcessor.pRequest Got user-level KeeperException when processing sessionid:0x13d8556be120003 type:delete cxid:0x12 zxid:0x1e txntype:-1 reqpath:n/a Error Path:/solr/live_nodes/127.0.0.1:43909_ Error:KeeperErrorCode = NoNode for /solr/live_nodes/127.0.0.1:43909_
[junit4:junit4]   2> 2533 T24 oascc.SolrZkClient.makePath makePath: /live_nodes/127.0.0.1:43909_
[junit4:junit4]   2> 2544 T24 oascc.SolrZkClient.makePath makePath: /overseer_elect/election
[junit4:junit4]   2> 2567 T29 oazs.PrepRequestProcessor.pRequest Got user-level KeeperException when processing sessionid:0x13d8556be120003 type:delete cxid:0x20 zxid:0x23 txntype:-1 reqpath:n/a Error Path:/solr/overseer_elect/leader Error:KeeperErrorCode = NoNode for /solr/overseer_elect/leader
[junit4:junit4]   2> 2569 T24 oascc.SolrZkClient.makePath makePath: /overseer_elect/leader
[junit4:junit4]   2> 2576 T24 oasc.Overseer.start Overseer (id=89374175219810307-127.0.0.1:43909_-n_0000000000) starting
[junit4:junit4]   2> 2578 T29 oazs.PrepRequestProcessor.pRequest Got user-level KeeperException when processing sessionid:0x13d8556be120003 type:create cxid:0x25 zxid:0x25 txntype:-1 reqpath:n/a Error Path:/solr/overseer Error:KeeperErrorCode = NodeExists for /solr/overseer
[junit4:junit4]   2> 2595 T29 oazs.PrepRequestProcessor.pRequest Got user-level KeeperException when processing sessionid:0x13d8556be120003 type:create cxid:0x26 zxid:0x26 txntype:-1 reqpath:n/a Error Path:/solr/overseer Error:KeeperErrorCode = NodeExists for /solr/overseer
[junit4:junit4]   2> 2597 T29 oazs.PrepRequestProcessor.pRequest Got user-level KeeperException when processing sessionid:0x13d8556be120003 type:create cxid:0x28 zxid:0x27 txntype:-1 reqpath:n/a Error Path:/solr/overseer Error:KeeperErrorCode = NodeExists for /solr/overseer
[junit4:junit4]   2> 2601 T24 oascc.SolrZkClient.makePath makePath: /overseer/queue-work
[junit4:junit4]   2> 2622 T29 oazs.PrepRequestProcessor.pRequest Got user-level KeeperException when processing sessionid:0x13d8556be120003 type:create cxid:0x2e zxid:0x29 txntype:-1 reqpath:n/a Error Path:/solr/overseer Error:KeeperErrorCode = NodeExists for /solr/overseer
[junit4:junit4]   2> 2625 T49 oasc.OverseerCollectionProcessor.run Process current queue of collection creations
[junit4:junit4]   2> 2625 T24 oascc.SolrZkClient.makePath makePath: /clusterstate.json
[junit4:junit4]   2> 2634 T24 oascc.SolrZkClient.makePath makePath: /aliases.json
[junit4:junit4]   2> 2641 T24 oascc.ZkStateReader.createClusterStateWatchersAndUpdate Updating cluster state from ZooKeeper... 
[junit4:junit4]   2> 2657 T48 oasc.Overseer$ClusterStateUpdater.run Starting to work on the main queue
[junit4:junit4]   2> 2673 T24 oass.SolrDispatchFilter.init user.dir=/mnt/ssd/jenkins/workspace/Lucene-Solr-trunk-Linux/solr/build/solr-core/test/J0
[junit4:junit4]   2> 2674 T24 oass.SolrDispatchFilter.init SolrDispatchFilter.init() done
[junit4:junit4]   2> 2693 T24 oascsi.HttpClientUtil.createClient Creating new http client, config:maxConnections=128&maxConnectionsPerHost=32&followRedirects=false
[junit4:junit4]   2> 2705 T24 oascsi.HttpClientUtil.createClient Creating new http client, config:
[junit4:junit4]   2> 2707 T24 oaz.ZooKeeper.<init> Initiating client connection, connectString=127.0.0.1:38466/solr sessionTimeout=10000 watcher=org.apache.solr.common.cloud.ConnectionManager@34da4637
[junit4:junit4]   2> 2708 T24 oascc.ConnectionManager.waitForConnected Waiting for client to connect to ZooKeeper
[junit4:junit4]   2> 2710 T51 oaz.ClientCnxn$SendThread.logStartConnect Opening socket connection to server localhost.localdomain/127.0.0.1:38466. Will not attempt to authenticate using SASL (access denied ("javax.security.auth.AuthPermission" "getLoginConfiguration"))
[junit4:junit4]   2> 2710 T51 oaz.ClientCnxn$SendThread.primeConnection Socket connection established to localhost.localdomain/127.0.0.1:38466, initiating session
[junit4:junit4]   2> 2711 T26 oazs.NIOServerCnxnFactory.run Accepted socket connection from /127.0.0.1:33484
[junit4:junit4]   2> 2712 T26 oazs.ZooKeeperServer.processConnectRequest Client attempting to establish new session at /127.0.0.1:33484
[junit4:junit4]   2> 2714 T28 oazs.ZooKeeperServer.finishSessionInit Established session 0x13d8556be120004 with negotiated timeout 10000 for client /127.0.0.1:33484
[junit4:junit4]   2> 2715 T51 oaz.ClientCnxn$SendThread.onConnected Session establishment complete on server localhost.localdomain/127.0.0.1:38466, sessionid = 0x13d8556be120004, negotiated timeout = 10000
[junit4:junit4]   2> 2716 T52 oascc.ConnectionManager.process Watcher org.apache.solr.common.cloud.ConnectionManager@34da4637 name:ZooKeeperConnection Watcher:127.0.0.1:38466/solr got event WatchedEvent state:SyncConnected type:None path:null path:null type:None
[junit4:junit4]   2> 2716 T24 oascc.ConnectionManager.waitForConnected Client is connected to ZooKeeper
[junit4:junit4]   2> 2719 T24 oascc.ZkStateReader.createClusterStateWatchersAndUpdate Updating cluster state from ZooKeeper... 
[junit4:junit4]   2> 2724 T24 oasc.ChaosMonkey.monkeyLog monkey: init - expire sessions:true cause connection loss:true
[junit4:junit4]   2> 2839 T24 oejs.Server.doStart jetty-8.1.8.v20121106
[junit4:junit4]   2> 2843 T24 oejs.AbstractConnector.doStart Started SelectChannelConnector@127.0.0.1:34870
[junit4:junit4]   2> 2845 T24 oass.SolrDispatchFilter.init SolrDispatchFilter.init()
[junit4:junit4]   2> 2845 T24 oasc.SolrResourceLoader.locateSolrHome JNDI not configured for solr (NoInitialContextEx)
[junit4:junit4]   2> 2846 T24 oasc.SolrResourceLoader.locateSolrHome using system property solr.solr.home: /mnt/ssd/jenkins/workspace/Lucene-Solr-trunk-Linux/solr/build/solr-core/test/J0/./org.apache.solr.cloud.UnloadDistributedZkTest-jetty1-1363741689843
[junit4:junit4]   2> 2847 T24 oasc.CoreContainer$Initializer.initialize looking for solr config file: /mnt/ssd/jenkins/workspace/Lucene-Solr-trunk-Linux/solr/build/solr-core/test/J0/./org.apache.solr.cloud.UnloadDistributedZkTest-jetty1-1363741689843/solr.xml
[junit4:junit4]   2> 2847 T24 oasc.CoreContainer.<init> New CoreContainer 226208651
[junit4:junit4]   2> 2848 T24 oasc.CoreContainer.load Loading CoreContainer using Solr Home: '/mnt/ssd/jenkins/workspace/Lucene-Solr-trunk-Linux/solr/build/solr-core/test/J0/./org.apache.solr.cloud.UnloadDistributedZkTest-jetty1-1363741689843/'
[junit4:junit4]   2> 2848 T24 oasc.SolrResourceLoader.<init> new SolrResourceLoader for directory: '/mnt/ssd/jenkins/workspace/Lucene-Solr-trunk-Linux/solr/build/solr-core/test/J0/./org.apache.solr.cloud.UnloadDistributedZkTest-jetty1-1363741689843/'
[junit4:junit4]   2> 2893 T24 oashc.HttpShardHandlerFactory.getParameter Setting socketTimeout to: 120000
[junit4:junit4]   2> 2894 T24 oashc.HttpShardHandlerFactory.getParameter Setting urlScheme to: http://
[junit4:junit4]   2> 2894 T24 oashc.HttpShardHandlerFactory.getParameter Setting connTimeout to: 15000
[junit4:junit4]   2> 2895 T24 oashc.HttpShardHandlerFactory.getParameter Setting maxConnectionsPerHost to: 20
[junit4:junit4]   2> 2896 T24 oashc.HttpShardHandlerFactory.getParameter Setting corePoolSize to: 0
[junit4:junit4]   2> 2896 T24 oashc.HttpShardHandlerFactory.getParameter Setting maximumPoolSize to: 2147483647
[junit4:junit4]   2> 2897 T24 oashc.HttpShardHandlerFactory.getParameter Setting maxThreadIdleTime to: 5
[junit4:junit4]   2> 2897 T24 oashc.HttpShardHandlerFactory.getParameter Setting sizeOfQueue to: -1
[junit4:junit4]   2> 2898 T24 oashc.HttpShardHandlerFactory.getParameter Setting fairnessPolicy to: false
[junit4:junit4]   2> 2899 T24 oascsi.HttpClientUtil.createClient Creating new http client, config:maxConnectionsPerHost=20&maxConnections=10000&socketTimeout=120000&connTimeout=15000&retry=false
[junit4:junit4]   2> 2913 T24 oasc.CoreContainer.load Registering Log Listener
[junit4:junit4]   2> 2940 T24 oasc.CoreContainer.initZooKeeper Zookeeper client=127.0.0.1:38466/solr
[junit4:junit4]   2> 2941 T24 oasc.ZkController.checkChrootPath zkHost includes chroot
[junit4:junit4]   2> 2942 T24 oaz.ZooKeeper.<init> Initiating client connection, connectString=127.0.0.1:38466 sessionTimeout=60000 watcher=org.apache.solr.common.cloud.ConnectionManager@54185b90
[junit4:junit4]   2> 2943 T24 oascc.ConnectionManager.waitForConnected Waiting for client to connect to ZooKeeper
[junit4:junit4]   2> 2946 T62 oaz.ClientCnxn$SendThread.logStartConnect Opening socket connection to server localhost.localdomain/127.0.0.1:38466. Will not attempt to authenticate using SASL (access denied ("javax.security.auth.AuthPermission" "getLoginConfiguration"))
[junit4:junit4]   2> 2947 T62 oaz.ClientCnxn$SendThread.primeConnection Socket connection established to localhost.localdomain/127.0.0.1:38466, initiating session
[junit4:junit4]   2> 2947 T26 oazs.NIOServerCnxnFactory.run Accepted socket connection from /127.0.0.1:33485
[junit4:junit4]   2> 2948 T26 oazs.ZooKeeperServer.processConnectRequest Client attempting to establish new session at /127.0.0.1:33485
[junit4:junit4]   2> 2950 T28 oazs.ZooKeeperServer.finishSessionInit Established session 0x13d8556be120005 with negotiated timeout 20000 for client /127.0.0.1:33485
[junit4:junit4]   2> 2950 T62 oaz.ClientCnxn$SendThread.onConnected Session establishment complete on server localhost.localdomain/127.0.0.1:38466, sessionid = 0x13d8556be120005, negotiated timeout = 20000
[junit4:junit4]   2> 2951 T63 oascc.ConnectionManager.process Watcher org.apache.solr.common.cloud.ConnectionManager@54185b90 name:ZooKeeperConnection Watcher:127.0.0.1:38466 got event WatchedEvent state:SyncConnected type:None path:null path:null type:None
[junit4:junit4]   2> 2951 T24 oascc.ConnectionManager.waitForConnected Client is connected to ZooKeeper
[junit4:junit4]   2> 2956 T29 oazs.PrepRequestProcessor.pRequest2Txn Processed session termination for sessionid: 0x13d8556be120005
[junit4:junit4]   2> 2958 T24 oaz.ZooKeeper.close Session: 0x13d8556be120005 closed
[junit4:junit4]   2> 2959 T24 oascsi.HttpClientUtil.createClient Creating new http client, config:maxConnections=500&maxConnectionsPerHost=16&socketTimeout=120000&connTimeout=15000
[junit4:junit4]   2> 2960 T26 oazs.NIOServerCnxn.closeSock Closed socket connection for client /127.0.0.1:33485 which had sessionid 0x13d8556be120005
[junit4:junit4]   2> 2961 T63 oaz.ClientCnxn$EventThread.run EventThread shut down
[junit4:junit4]   2> 2965 T24 oaz.ZooKeeper.<init> Initiating client connection, connectString=127.0.0.1:38466/solr sessionTimeout=30000 watcher=org.apache.solr.common.cloud.ConnectionManager@169fc74a
[junit4:junit4]   2> 2967 T24 oascc.ConnectionManager.waitForConnected Waiting for client to connect to ZooKeeper
[junit4:junit4]   2> 2967 T64 oaz.ClientCnxn$SendThread.logStartConnect Opening socket connection to server localhost.localdomain/127.0.0.1:38466. Will not attempt to authenticate using SASL (access denied ("javax.security.auth.AuthPermission" "getLoginConfiguration"))
[junit4:junit4]   2> 2968 T64 oaz.ClientCnxn$SendThread.primeConnection Socket connection established to localhost.localdomain/127.0.0.1:38466, initiating session
[junit4:junit4]   2> 2968 T26 oazs.NIOServerCnxnFactory.run Accepted socket connection from /127.0.0.1:33486
[junit4:junit4]   2> 2969 T26 oazs.ZooKeeperServer.processConnectRequest Client attempting to establish new session at /127.0.0.1:33486
[junit4:junit4]   2> 2970 T28 oazs.ZooKeeperServer.finishSessionInit Established session 0x13d8556be120006 with negotiated timeout 20000 for client /127.0.0.1:33486
[junit4:junit4]   2> 2970 T64 oaz.ClientCnxn$SendThread.onConnected Session establishment complete on server localhost.localdomain/127.0.0.1:38466, sessionid = 0x13d8556be120006, negotiated timeout = 20000
[junit4:junit4]   2> 2971 T65 oascc.ConnectionManager.process Watcher org.apache.solr.common.cloud.ConnectionManager@169fc74a name:ZooKeeperConnection Watcher:127.0.0.1:38466/solr got event WatchedEvent state:SyncConnected type:None path:null path:null type:None
[junit4:junit4]   2> 2971 T24 oascc.ConnectionManager.waitForConnected Client is connected to ZooKeeper
[junit4:junit4]   2> 2974 T29 oazs.PrepRequestProcessor.pRequest Got user-level KeeperException when processing sessionid:0x13d8556be120006 type:create cxid:0x1 zxid:0x30 txntype:-1 reqpath:n/a Error Path:/solr/overseer Error:KeeperErrorCode = NodeExists for /solr/overseer
[junit4:junit4]   2> 2977 T29 oazs.PrepRequestProcessor.pRequest Got user-level KeeperException when processing sessionid:0x13d8556be120006 type:create cxid:0x3 zxid:0x31 txntype:-1 reqpath:n/a Error Path:/solr/overseer Error:KeeperErrorCode = NodeExists for /solr/overseer
[junit4:junit4]   2> 2981 T24 oascc.ZkStateReader.createClusterStateWatchersAndUpdate Updating cluster state from ZooKeeper... 
[junit4:junit4]   2> 3990 T24 oasc.ZkController.createEphemeralLiveNode Register node as live in ZooKeeper:/live_nodes/127.0.0.1:34870_
[junit4:junit4]   2> 3991 T29 oazs.PrepRequestProcessor.pRequest Got user-level KeeperException when processing sessionid:0x13d8556be120006 type:delete cxid:0xd zxid:0x32 txntype:-1 reqpath:n/a Error Path:/solr/live_nodes/127.0.0.1:34870_ Error:KeeperErrorCode = NoNode for /solr/live_nodes/127.0.0.1:34870_
[junit4:junit4]   2> 3993 T24 oascc.SolrZkClient.makePath makePath: /live_nodes/127.0.0.1:34870_
[junit4:junit4]   2> 4000 T47 oascc.ZkStateReader$3.process Updating live nodes... (2)
[junit4:junit4]   2> 4000 T52 oascc.ZkStateReader$3.process Updating live nodes... (2)
[junit4:junit4]   2> 4000 T65 oascc.ZkStateReader$3.process Updating live nodes... (2)
[junit4:junit4]   2> 4014 T24 oass.SolrDispatchFilter.init user.dir=/mnt/ssd/jenkins/workspace/Lucene-Solr-trunk-Linux/solr/build/solr-core/test/J0
[junit4:junit4]   2> 4015 T24 oass.SolrDispatchFilter.init SolrDispatchFilter.init() done
[junit4:junit4]   2> 4015 T24 oascsi.HttpClientUtil.createClient Creating new http client, config:maxConnections=128&maxConnectionsPerHost=32&followRedirects=false
[junit4:junit4]   2> 4120 T24 oejs.Server.doStart jetty-8.1.8.v20121106
[junit4:junit4]   2> 4123 T24 oejs.AbstractConnector.doStart Started SelectChannelConnector@127.0.0.1:39492
[junit4:junit4]   2> 4124 T24 oass.SolrDispatchFilter.init SolrDispatchFilter.init()
[junit4:junit4]   2> 4125 T24 oasc.SolrResourceLoader.locateSolrHome JNDI not configured for solr (NoInitialContextEx)
[junit4:junit4]   2> 4126 T24 oasc.SolrResourceLoader.locateSolrHome using system property solr.solr.home: /mnt/ssd/jenkins/workspace/Lucene-Solr-trunk-Linux/solr/build/solr-core/test/J0/./org.apache.solr.cloud.UnloadDistributedZkTest-jetty2-1363741691138
[junit4:junit4]   2> 4127 T24 oasc.CoreContainer$Initializer.initialize looking for solr config file: /mnt/ssd/jenkins/workspace/Lucene-Solr-trunk-Linux/solr/build/solr-core/test/J0/./org.apache.solr.cloud.UnloadDistributedZkTest-jetty2-1363741691138/solr.xml
[junit4:junit4]   2> 4127 T24 oasc.CoreContainer.<init> New CoreContainer 1224114132
[junit4:junit4]   2> 4128 T24 oasc.CoreContainer.load Loading CoreContainer using Solr Home: '/mnt/ssd/jenkins/workspace/Lucene-Solr-trunk-Linux/solr/build/solr-core/test/J0/./org.apache.solr.cloud.UnloadDistributedZkTest-jetty2-1363741691138/'
[junit4:junit4]   2> 4129 T24 oasc.SolrResourceLoader.<init> new SolrResourceLoader for directory: '/mnt/ssd/jenkins/workspace/Lucene-Solr-trunk-Linux/solr/build/solr-core/test/J0/./org.apache.solr.cloud.UnloadDistributedZkTest-jetty2-1363741691138/'
[junit4:junit4]   2> 4157 T24 oashc.HttpShardHandlerFactory.getParameter Setting socketTimeout to: 120000
[junit4:junit4]   2> 4157 T24 oashc.HttpShardHandlerFactory.getParameter Setting urlScheme to: http://
[junit4:junit4]   2> 4158 T24 oashc.HttpShardHandlerFactory.getParameter Setting connTimeout to: 15000
[junit4:junit4]   2> 4158 T24 oashc.HttpShardHandlerFactory.getParameter Setting maxConnectionsPerHost to: 20
[junit4:junit4]   2> 4159 T24 oashc.HttpShardHandlerFactory.getParameter Setting corePoolSize to: 0
[junit4:junit4]   2> 4159 T24 oashc.HttpShardHandlerFactory.getParameter Setting maximumPoolSize to: 2147483647
[junit4:junit4]   2> 4160 T24 oashc.HttpShardHandlerFactory.getParameter Setting maxThreadIdleTime to: 5
[junit4:junit4]   2> 4160 T24 oashc.HttpShardHandlerFactory.getParameter Setting sizeOfQueue to: -1
[junit4:junit4]   2> 4161 T24 oashc.HttpShardHandlerFactory.getParameter Setting fairnessPolicy to: false
[junit4:junit4]   2> 4161 T24 oascsi.HttpClientUtil.createClient Creating new http client, config:maxConnectionsPerHost=20&maxConnections=10000&socketTimeout=120000&connTimeout=15000&retry=false
[junit4:junit4]   2> 4175 T24 oasc.CoreContainer.load Registering Log Listener
[junit4:junit4]   2> 4197 T24 oasc.CoreContainer.initZooKeeper Zookeeper client=127.0.0.1:38466/solr
[junit4:junit4]   2> 4198 T24 oasc.ZkController.checkChrootPath zkHost includes chroot
[junit4:junit4]   2> 4199 T24 oaz.ZooKeeper.<init> Initiating client connection, connectString=127.0.0.1:38466 sessionTimeout=60000 watcher=org.apache.solr.common.cloud.ConnectionManager@2651426e
[junit4:junit4]   2> 4200 T24 oascc.ConnectionManager.waitForConnected Waiting for client to connect to ZooKeeper
[junit4:junit4]   2> 4200 T76 oaz.ClientCnxn$SendThread.logStartConnect Opening socket connection to server localhost.localdomain/127.0.0.1:38466. Will not attempt to authenticate using SASL (access denied ("javax.security.auth.AuthPermission" "getLoginConfiguration"))
[junit4:junit4]   2> 4201 T76 oaz.ClientCnxn$SendThread.primeConnection Socket connection established to localhost.localdomain/127.0.0.1:38466, initiating session
[junit4:junit4]   2> 4201 T26 oazs.NIOServerCnxnFactory.run Accepted socket connection from /127.0.0.1:33487
[junit4:junit4]   2> 4202 T26 oazs.ZooKeeperServer.processConnectRequest Client attempting to establish new session at /127.0.0.1:33487
[junit4:junit4]   2> 4204 T28 oazs.ZooKeeperServer.finishSessionInit Established session 0x13d8556be120007 with negotiated timeout 20000 for client /127.0.0.1:33487
[junit4:junit4]   2> 4204 T76 oaz.ClientCnxn$SendThread.onConnected Session establishment complete on server localhost.localdomain/127.0.0.1:38466, sessionid = 0x13d8556be120007, negotiated timeout = 20000
[junit4:junit4]   2> 4206 T77 oascc.ConnectionManager.process Watcher org.apache.solr.common.cloud.ConnectionManager@2651426e name:ZooKeeperConnection Watcher:127.0.0.1:38466 got event WatchedEvent state:SyncConnected type:None path:null path:null type:None
[junit4:junit4]   2> 4207 T24 oascc.ConnectionManager.waitForConnected Client is connected to ZooKeeper
[junit4:junit4]   2> 4210 T29 oazs.PrepRequestProcessor.pRequest2Txn Processed session termination for sessionid: 0x13d8556be120007
[junit4:junit4]   2> 4211 T26 oazs.NIOServerCnxn.closeSock Closed socket connection for client /127.0.0.1:33487 which had sessionid 0x13d8556be120007
[junit4:junit4]   2> 4217 T77 oaz.ClientCnxn$EventThread.run EventThread shut down
[junit4:junit4]   2> 4217 T24 oaz.ZooKeeper.close Session: 0x13d8556be120007 closed
[junit4:junit4]   2> 4219 T24 oascsi.HttpClientUtil.createClient Creating new http client, config:maxConnections=500&maxConnectionsPerHost=16&socketTimeout=120000&connTimeout=15000
[junit4:junit4]   2> 4226 T24 oaz.ZooKeeper.<init> Initiating client connection, connectString=127.0.0.1:38466/solr sessionTimeout=30000 watcher=org.apache.solr.common.cloud.ConnectionManager@678d1051
[junit4:junit4]   2> 4227 T24 oascc.ConnectionManager.waitForConnected Waiting for client to connect to ZooKeeper
[junit4:junit4]   2> 4227 T78 oaz.ClientCnxn$SendThread.logStartConnect Opening socket connection to server localhost.localdomain/127.0.0.1:38466. Will not attempt to authenticate using SASL (access denied ("javax.security.auth.AuthPermission" "getLoginConfiguration"))
[junit4:junit4]   2> 4229 T26 oazs.NIOServerCnxnFactory.run Accepted socket connection from /127.0.0.1:33488
[junit4:junit4]   2> 4229 T78 oaz.ClientCnxn$SendThread.primeConnection Socket connection established to localhost.localdomain/127.0.0.1:38466, initiating session
[junit4:junit4]   2> 4230 T26 oazs.ZooKeeperServer.processConnectRequest Client attempting to establish new session at /127.0.0.1:33488
[junit4:junit4]   2> 4231 T28 oazs.ZooKeeperServer.finishSessionInit Established session 0x13d8556be120008 with negotiated timeout 20000 for client /127.0.0.1:33488
[junit4:junit4]   2> 4232 T78 oaz.ClientCnxn$SendThread.onConnected Session establishment complete on server localhost.localdomain/127.0.0.1:38466, sessionid = 0x13d8556be120008, negotiated timeout = 20000
[junit4:junit4]   2> 4233 T79 oascc.ConnectionManager.process Watcher org.apache.solr.common.cloud.ConnectionManager@678d1051 name:ZooKeeperConnection Watcher:127.0.0.1:38466/solr got event WatchedEvent state:SyncConnected type:None path:null path:null type:None
[junit4:junit4]   2> 4234 T24 oascc.ConnectionManager.waitForConnected Client is connected to ZooKeeper
[junit4:junit4]   2> 4236 T29 oazs.PrepRequestProcessor.pRequest Got user-level KeeperException when processing sessionid:0x13d8556be120008 type:create cxid:0x1 zxid:0x38 txntype:-1 reqpath:n/a Error Path:/solr/overseer Error:KeeperErrorCode = NodeExists for /solr/overseer
[junit4:junit4]   2> 4238 T29 oazs.PrepRequestProcessor.pRequest Got user-level KeeperException when processing sessionid:0x13d8556be120008 type:create cxid:0x3 zxid:0x39 txntype:-1 reqpath:n/a Error Path:/solr/overseer Error:KeeperErrorCode = NodeExists for /solr/overseer
[junit4:junit4]   2> 4246 T24 oascc.ZkStateReader.createClusterStateWatchersAndUpdate Updating cluster state from ZooKeeper... 
[junit4:junit4]   2> 5250 T24 oasc.ZkController.createEphemeralLiveNode Register node as live in ZooKeeper:/live_nodes/127.0.0.1:39492_
[junit4:junit4]   2> 5252 T29 oazs.PrepRequestProcessor.pRequest Got user-level KeeperException when processing sessionid:0x13d8556be120008 type:delete cxid:0xd zxid:0x3a txntype:-1 reqpath:n/a Error Path:/solr/live_nodes/127.0.0.1:39492_ Error:KeeperErrorCode = NoNode for /solr/live_nodes/127.0.0.1:39492_
[junit4:junit4]   2> 5253 T24 oascc.SolrZkClient.makePath makePath: /live_nodes/127.0.0.1:39492_
[junit4:junit4]   2> 5269 T47 oascc.ZkStateReader$3.process Updating live nodes... (3)
[junit4:junit4]   2> 5270 T79 oascc.ZkStateReader$3.process Updating live nodes... (3)
[junit4:junit4]   2> 5270 T52 oascc.ZkStateReader$3.process Updating live nodes... (3)
[junit4:junit4]   2> 5270 T65 oascc.ZkStateReader$3.process Updating live nodes... (3)
[junit4:junit4]   2> 5280 T24 oass.SolrDispatchFilter.init user.dir=/mnt/ssd/jenkins/workspace/Lucene-Solr-trunk-Linux/solr/build/solr-core/test/J0
[junit4:junit4]   2> 5281 T24 oass.SolrDispatchFilter.init SolrDispatchFilter.init() done
[junit4:junit4]   2> 5282 T24 oascsi.HttpClientUtil.createClient Creating new http client, config:maxConnections=128&maxConnectionsPerHost=32&followRedirects=false
[junit4:junit4]   2> 5379 T24 oejs.Server.doStart jetty-8.1.8.v20121106
[junit4:junit4]   2> 5382 T24 oejs.AbstractConnector.doStart Started SelectChannelConnector@127.0.0.1:51521
[junit4:junit4]   2> 5384 T24 oass.SolrDispatchFilter.init SolrDispatchFilter.init()
[junit4:junit4]   2> 5385 T24 oasc.SolrResourceLoader.locateSolrHome JNDI not configured for solr (NoInitialContextEx)
[junit4:junit4]   2> 5385 T24 oasc.SolrResourceLoader.locateSolrHome using system property solr.solr.home: /mnt/ssd/jenkins/workspace/Lucene-Solr-trunk-Linux/solr/build/solr-core/test/J0/./org.apache.solr.cloud.UnloadDistributedZkTest-jetty3-1363741692404
[junit4:junit4]   2> 5386 T24 oasc.CoreContainer$Initializer.initialize looking for solr config file: /mnt/ssd/jenkins/workspace/Lucene-Solr-trunk-Linux/solr/build/solr-core/test/J0/./org.apache.solr.cloud.UnloadDistributedZkTest-jetty3-1363741692404/solr.xml
[junit4:junit4]   2> 5386 T24 oasc.CoreContainer.<init> New CoreContainer 969290771
[junit4:junit4]   2> 5387 T24 oasc.CoreContainer.load Loading CoreContainer using Solr Home: '/mnt/ssd/jenkins/workspace/Lucene-Solr-trunk-Linux/solr/build/solr-core/test/J0/./org.apache.solr.cloud.UnloadDistributedZkTest-jetty3-1363741692404/'
[junit4:junit4]   2> 5387 T24 oasc.SolrResourceLoader.<init> new SolrResourceLoader for directory: '/mnt/ssd/jenkins/workspace/Lucene-Solr-trunk-Linux/solr/build/solr-core/test/J0/./org.apache.solr.cloud.UnloadDistributedZkTest-jetty3-1363741692404/'
[junit4:junit4]   2> 5435 T24 oashc.HttpShardHandlerFactory.getParameter Setting socketTimeout to: 120000
[junit4:junit4]   2> 5436 T24 oashc.HttpShardHandlerFactory.getParameter Setting urlScheme to: http://
[junit4:junit4]   2> 5436 T24 oashc.HttpShardHandlerFactory.getParameter Setting connTimeout to: 15000
[junit4:junit4]   2> 5437 T24 oashc.HttpShardHandlerFactory.getParameter Setting maxConnectionsPerHost to: 20
[junit4:junit4]   2> 5438 T24 oashc.HttpShardHandlerFactory.getParameter Setting corePoolSize to: 0
[junit4:junit4]   2> 5438 T24 oashc.HttpShardHandlerFactory.getParameter Setting maximumPoolSize to: 2147483647
[junit4:junit4]   2> 5439 T24 oashc.HttpShardHandlerFactory.getParameter Setting maxThreadIdleTime to: 5
[junit4:junit4]   2> 5440 T24 oashc.HttpShardHandlerFactory.getParameter Setting sizeOfQueue to: -1
[junit4:junit4]   2> 5440 T24 oashc.HttpShardHandlerFactory.getParameter Setting fairnessPolicy to: false
[junit4:junit4]   2> 5441 T24 oascsi.HttpClientUtil.createClient Creating new http client, config:maxConnectionsPerHost=20&maxConnections=10000&socketTimeout=120000&connTimeout=15000&retry=false
[junit4:junit4]   2> 5455 T24 oasc.CoreContainer.load Registering Log Listener
[junit4:junit4]   2> 5484 T24 oasc.CoreContainer.initZooKeeper Zookeeper client=127.0.0.1:38466/solr
[junit4:junit4]   2> 5485 T24 oasc.ZkController.checkChrootPath zkHost includes chroot
[junit4:junit4]   2> 5486 T24 oaz.ZooKeeper.<init> Initiating client connection, connectString=127.0.0.1:38466 sessionTimeout=60000 watcher=org.apache.solr.common.cloud.ConnectionManager@3ca3920
[junit4:junit4]   2> 5487 T24 oascc.ConnectionManager.waitForConnected Waiting for client to connect to ZooKeeper
[junit4:junit4]   2> 5487 T90 oaz.ClientCnxn$SendThread.logStartConnect Opening socket connection to server localhost.localdomain/127.0.0.1:38466. Will not attempt to authenticate using SASL (access denied ("javax.security.auth.AuthPermission" "getLoginConfiguration"))
[junit4:junit4]   2> 5488 T90 oaz.ClientCnxn$SendThread.primeConnection Socket connection established to localhost.localdomain/127.0.0.1:38466, initiating session
[junit4:junit4]   2> 5488 T26 oazs.NIOServerCnxnFactory.run Accepted socket connection from /127.0.0.1:33489
[junit4:junit4]   2> 5489 T26 oazs.ZooKeeperServer.processConnectRequest Client attempting to establish new session at /127.0.0.1:33489
[junit4:junit4]   2> 5490 T28 oazs.ZooKeeperServer.finishSessionInit Established session 0x13d8556be120009 with negotiated timeout 20000 for client /127.0.0.1:33489
[junit4:junit4]   2> 5490 T90 oaz.ClientCnxn$SendThread.onConnected Session establishment complete on server localhost.localdomain/127.0.0.1:38466, sessionid = 0x13d8556be120009, negotiated timeout = 20000
[junit4:junit4]   2> 5491 T91 oascc.ConnectionManager.process Watcher org.apache.solr.common.cloud.ConnectionManager@3ca3920 name:ZooKeeperConnection Watcher:127.0.0.1:38466 got event WatchedEvent state:SyncConnected type:None path:null path:null type:None
[junit4:junit4]   2> 5491 T24 oascc.ConnectionManager.waitForConnected Client is connected to ZooKeeper
[junit4:junit4]   2> 5493 T29 oazs.PrepRequestProcessor.pRequest2Txn Processed session termination for sessionid: 0x13d8556be120009
[junit4:junit4]   2> 5493 T91 oaz.ClientCnxn$EventThread.run EventThread shut down
[junit4:junit4]   2> 5494 T26 oazs.NIOServerCnxn.closeSock Closed socket connection for client /127.0.0.1:33489 which had sessionid 0x13d8556be120009
[junit4:junit4]   2> 5493 T24 oaz.ZooKeeper.close Session: 0x13d8556be120009 closed
[junit4:junit4]   2> 5494 T24 oascsi.HttpClientUtil.createClient Creating new http client, config:maxConnections=500&maxConnectionsPerHost=16&socketTimeout=120000&connTimeout=15000
[junit4:junit4]   2> 5499 T24 oaz.ZooKeeper.<init> Initiating client connection, connectString=127.0.0.1:38466/solr sessionTimeout=30000 watcher=org.apache.solr.common.cloud.ConnectionManager@7bfd7c41
[junit4:junit4]   2> 5500 T24 oascc.ConnectionManager.waitForConnected Waiting for client to connect to ZooKeeper
[junit4:junit4]   2> 5500 T92 oaz.ClientCnxn$SendThread.logStartConnect Opening socket connection to server localhost.localdomain/127.0.0.1:38466. Will not attempt to authenticate using SASL (access denied ("javax.security.auth.AuthPermission" "getLoginConfiguration"))
[junit4:junit4]   2> 5501 T92 oaz.ClientCnxn$SendThread.primeConnection Socket connection established to localhost.localdomain/127.0.0.1:38466, initiating session
[junit4:junit4]   2> 5501 T26 oazs.NIOServerCnxnFactory.run Accepted socket connection from /127.0.0.1:33490
[junit4:junit4]   2> 5501 T26 oazs.ZooKeeperServer.processConnectRequest Client attempting to establish new session at /127.0.0.1:33490
[junit4:junit4]   2> 5503 T28 oazs.ZooKeeperServer.finishSessionInit Established session 0x13d8556be12000a with negotiated timeout 20000 for client /127.0.0.1:33490
[junit4:junit4]   2> 5503 T92 oaz.ClientCnxn$SendThread.onConnected Session establishment complete on server localhost.localdomain/127.0.0.1:38466, sessionid = 0x13d8556be12000a, negotiated timeout = 20000
[junit4:junit4]   2> 5504 T93 oascc.ConnectionManager.process Watcher org.apache.solr.common.cloud.ConnectionManager@7bfd7c41 name:ZooKeeperConnection Watcher:127.0.0.1:38466/solr got event WatchedEvent state:SyncConnected type:None path:null path:null type:None
[junit4:junit4]   2> 5504 T24 oascc.ConnectionManager.waitForConnected Client is connected to ZooKeeper
[junit4:junit4]   2> 5509 T29 oazs.PrepRequestProcessor.pRequest Got user-level KeeperException when processing sessionid:0x13d8556be12000a type:create cxid:0x1 zxid:0x40 txntype:-1 reqpath:n/a Error Path:/solr/overseer Error:KeeperErrorCode = NodeExists for /solr/overseer
[junit4:junit4]   2> 5527 T29 oazs.PrepRequestProcessor.pRequest Got user-level KeeperException when processing sessionid:0x13d8556be12000a type:create cxid:0x3 zxid:0x41 txntype:-1 reqpath:n/a Error Path:/solr/overseer Error:KeeperErrorCode = NodeExists for /solr/overseer
[junit4:junit4]   2> 5532 T24 oascc.ZkStateReader.createClusterStateWatchersAndUpdate Updating cluster state from ZooKeeper... 
[junit4:junit4]   2> 6538 T24 oasc.ZkController.createEphemeralLiveNode Register node as live in ZooKeeper:/live_nodes/127.0.0.1:51521_
[junit4:junit4]   2> 6539 T29 oazs.PrepRequestProcessor.pRequest Got user-level KeeperException when processing sessionid:0x13d8556be12000a type:delete cxid:0xd zxid:0x42 txntype:-1 reqpath:n/a Error Path:/solr/live_nodes/127.0.0.1:51521_ Error:KeeperErrorCode = NoNode for /solr/live_nodes/127.0.0.1:51521_
[junit4:junit4]   2> 6540 T24 oascc.SolrZkClient.makePath makePath: /live_nodes/127.0.0.1:51521_
[junit4:junit4]   2> 6546 T52 oascc.ZkStateReader$3.process Updating live nodes... (4)
[junit4:junit4]   2> 6547 T65 oascc.ZkStateReader$3.process Updating live nodes... (4)
[junit4:junit4]   2> 6547 T79 oascc.ZkStateReader$3.process Updating live nodes... (4)
[junit4:junit4]   2> 6547 T93 oascc.ZkStateReader$3.process Updating live nodes... (4)
[junit4:junit4]   2> 6548 T47 oascc.ZkStateReader$3.process Updating live nodes... (4)
[junit4:junit4]   2> 6560 T24 oass.SolrDispatchFilter.init user.dir=/mnt/ssd/jenkins/workspace/Lucene-Solr-trunk-Linux/solr/build/solr-core/test/J0
[junit4:junit4]   2> 6561 T24 oass.SolrDispatchFilter.init SolrDispatchFilter.init() done
[junit4:junit4]   2> 6562 T24 oascsi.HttpClientUtil.createClient Creating new http client, config:maxConnections=128&maxConnectionsPerHost=32&followRedirects=false
[junit4:junit4]   2> 6656 T24 oejs.Server.doStart jetty-8.1.8.v20121106
[junit4:junit4]   2> 6659 T24 oejs.AbstractConnector.doStart Started SelectChannelConnector@127.0.0.1:48250
[junit4:junit4]   2> 6660 T24 oass.SolrDispatchFilter.init SolrDispatchFilter.init()
[junit4:junit4]   2> 6661 T24 oasc.SolrResourceLoader.locateSolrHome JNDI not configured for solr (NoInitialContextEx)
[junit4:junit4]   2> 6661 T24 oasc.SolrResourceLoader.locateSolrHome using system property solr.solr.home: /mnt/ssd/jenkins/workspace/Lucene-Solr-trunk-Linux/solr/build/solr-core/test/J0/./org.apache.solr.cloud.UnloadDistributedZkTest-jetty4-1363741693684
[junit4:junit4]   2> 6662 T24 oasc.CoreContainer$Initializer.initialize looking for solr config file: /mnt/ssd/jenkins/workspace/Lucene-Solr-trunk-Linux/solr/build/solr-core/test/J0/./org.apache.solr.cloud.UnloadDistributedZkTest-jetty4-1363741693684/solr.xml
[junit4:junit4]   2> 6662 T24 oasc.CoreContainer.<init> New CoreContainer 768997703
[junit4:junit4]   2> 6663 T24 oasc.CoreContainer.load Loading CoreContainer using Solr Home: '/mnt/ssd/jenkins/workspace/Lucene-Solr-trunk-Linux/solr/build/solr-core/test/J0/./org.apache.solr.cloud.UnloadDistributedZkTest-jetty4-1363741693684/'
[junit4:junit4]   2> 6663 T24 oasc.SolrResourceLoader.<init> new SolrResourceLoader for directory: '/mnt/ssd/jenkins/workspace/Lucene-Solr-trunk-Linux/solr/build/solr-core/test/J0/./org.apache.solr.cloud.UnloadDistributedZkTest-jetty4-1363741693684/'
[junit4:junit4]   2> 6691 T24 oashc.HttpShardHandlerFactory.getParameter Setting socketTimeout to: 120000
[junit4:junit4]   2> 6691 T24 oashc.HttpShardHandlerFactory.getParameter Setting urlScheme to: http://
[junit4:junit4]   2> 6692 T24 oashc.HttpShardHandlerFactory.getParameter Setting connTimeout to: 15000
[junit4:junit4]   2> 6692 T24 oashc.HttpShardHandlerFactory.getParameter Setting maxConnectionsPerHost to: 20
[junit4:junit4]   2> 6693 T24 oashc.HttpShardHandlerFactory.getParameter Setting corePoolSize to: 0
[junit4:junit4]   2> 6693 T24 oashc.HttpShardHandlerFactory.getParameter Setting maximumPoolSize to: 2147483647
[junit4:junit4]   2> 6693 T24 oashc.HttpShardHandlerFactory.getParameter Setting maxThreadIdleTime to: 5
[junit4:junit4]   2> 6694 T24 oashc.HttpShardHandlerFactory.getParameter Setting sizeOfQueue to: -1
[junit4:junit4]   2> 6694 T24 oashc.HttpShardHandlerFactory.getParameter Setting fairnessPolicy to: false
[junit4:junit4]   2> 6695 T24 oascsi.HttpClientUtil.createClient Creating new http client, config:maxConnectionsPerHost=20&maxConnections=10000&socketTimeout=120000&connTimeout=15000&retry=false
[junit4:junit4]   2> 6706 T24 oasc.CoreContainer.load Registering Log Listener
[junit4:junit4]   2> 6736 T24 oasc.CoreContainer.initZooKeeper Zookeeper client=127.0.0.1:38466/solr
[junit4:junit4]   2> 6737 T24 oasc.ZkController.checkChrootPath zkHost includes chroot
[junit4:junit4]   2> 6738 T24 oaz.ZooKeeper.<init> Initiating client connection, connectString=127.0.0.1:38466 sessionTimeout=60000 watcher=org.apache.solr.common.cloud.ConnectionManager@183f62e6
[junit4:junit4]   2> 6739 T104 oaz.ClientCnxn$SendThread.logStartConnect Opening socket connection to server localhost.localdomain/127.0.0.1:38466. Will not attempt to authenticate using SASL (access denied ("javax.security.auth.AuthPermission" "getLoginConfiguration"))
[junit4:junit4]   2> 6740 T24 oascc.ConnectionManager.waitForConnected Waiting for client to connect to ZooKeeper
[junit4:junit4]   2> 6741 T104 oaz.ClientCnxn$SendThread.primeConnection Socket connection established to localhost.localdomain/127.0.0.1:38466, initiating session
[junit4:junit4]   2> 6741 T26 oazs.NIOServerCnxnFactory.run Accepted socket connection from /127.0.0.1:33492
[junit4:junit4]   2> 6742 T26 oazs.ZooKeeperServer.processConnectRequest Client attempting to establish new session at /127.0.0.1:33492
[junit4:junit4]   2> 6743 T28 oazs.ZooKeeperServer.finishSessionInit Established session 0x13d8556be12000b with negotiated timeout 20000 for client /127.0.0.1:33492
[junit4:junit4]   2> 6743 T104 oaz.ClientCnxn$SendThread.onConnected Session establishment complete on server localhost.localdomain/127.0.0.1:38466, sessionid = 0x13d8556be12000b, negotiated timeout = 20000
[junit4:junit4]   2> 6744 T105 oascc.ConnectionManager.process Watcher org.apache.solr.common.cloud.ConnectionManager@183f62e6 name:ZooKeeperConnection Watcher:127.0.0.1:38466 got event WatchedEvent state:SyncConnected type:None path:null path:null type:None
[junit4:junit4]   2> 6745 T24 oascc.ConnectionManager.waitForConnected Client is connected to ZooKeeper
[junit4:junit4]   2> 6751 T29 oazs.PrepRequestProcessor.pRequest2Txn Processed session termination for sessionid: 0x13d8556be12000b
[junit4:junit4]   2> 6752 T26 oazs.NIOServerCnxn.closeSock Closed socket connection for client /127.0.0.1:33492 which had sessionid 0x13d8556be12000b
[junit4:junit4]   2> 6753 T24 oaz.ZooKeeper.close Session: 0x13d8556be12000b closed
[junit4:junit4]   2> 6753 T105 oaz.ClientCnxn$EventThread.run EventThread shut down
[junit4:junit4]   2> 6757 T24 oascsi.HttpClientUtil.createClient Creating new http client, config:maxConnections=500&maxConnectionsPerHost=16&socketTimeout=120000&connTimeout=15000
[junit4:junit4]   2> 6762 T24 oaz.ZooKeeper.<init> Initiating client connection, connectString=127.0.0.1:38466/solr sessionTimeout=30000 watcher=org.apache.solr.common.cloud.ConnectionManager@748467f6
[junit4:junit4]   2> 6763 T24 oascc.ConnectionManager.waitForConnected Waiting for client to connect to ZooKeeper
[junit4:junit4]   2> 6766 T106 oaz.ClientCnxn$SendThread.logStartConnect Opening socket connection to server localhost.localdomain/127.0.0.1:38466. Will not attempt to authenticate using SASL (access denied ("javax.security.auth.AuthPermission" "getLoginConfiguration"))
[junit4:junit4]   2> 6766 T106 oaz.ClientCnxn$SendThread.primeConnection Socket connection established to localhost.localdomain/127.0.0.1:38466, initiating session
[junit4:junit4]   2> 6767 T26 oazs.NIOServerCnxnFactory.run Accepted socket connection from /127.0.0.1:33493
[junit4:junit4]   2> 6767 T26 oazs.ZooKeeperServer.processConnectRequest Client attempting to establish new session at /127.0.0.1:33493
[junit4:junit4]   2> 6768 T28 oazs.ZooKeeperServer.finishSessionInit Established session 0x13d8556be12000c with negotiated timeout 20000 for client /127.0.0.1:33493
[junit4:junit4]   2> 6768 T106 oaz.ClientCnxn$SendThread.onConnected Session establishment complete on server localhost.localdomain/127.0.0.1:38466, sessionid = 0x13d8556be12000c, negotiated timeout = 20000
[junit4:junit4]   2> 6769 T107 oascc.ConnectionManager.process Watcher org.apache.solr.common.cloud.ConnectionManager@748467f6 name:ZooKeeperConnection Watcher:127.0.0.1:38466/solr got event WatchedEvent state:SyncConnected type:None path:null path:null type:None
[junit4:junit4]   2> 6769 T24 oascc.ConnectionManager.waitForConnected Client is connected to ZooKeeper
[junit4:junit4]   2> 6771 T29 oazs.PrepRequestProcessor.pRequest Got user-level KeeperException when processing sessionid:0x13d8556be12000c type:create cxid:0x1 zxid:0x48 txntype:-1 reqpath:n/a Error Path:/solr/overseer Error:KeeperErrorCode = NodeExists for /solr/overseer
[junit4:junit4]   2> 6772 T29 oazs.PrepRequestProcessor.pRequest Got user-level KeeperException when processing sessionid:0x13d8556be12000c type:create cxid:0x3 zxid:0x49 txntype:-1 reqpath:n/a Error Path:/solr/overseer Error:KeeperErrorCode = NodeExists for /solr/overseer
[junit4:junit4]   2> 6776 T24 oascc.ZkStateReader.createClusterStateWatchersAndUpdate Updating cluster state from ZooKeeper... 
[junit4:junit4]   2> 7783 T24 oasc.ZkController.createEphemeralLiveNode Register node as live in ZooKeeper:/live_nodes/127.0.0.1:48250_
[junit4:junit4]   2> 7784 T29 oazs.PrepRequestProcessor.pRequest Got user-level KeeperException when processing sessionid:0x13d8556be12000c type:delete cxid:0xd zxid:0x4a txntype:-1 reqpath:n/a Error Path:/solr/live_nodes/127.0.0.1:48250_ Error:KeeperErrorCode = NoNode for /solr/live_nodes/127.0.0.1:48250_
[junit4:junit4]   2> 7785 T24 oascc.SolrZkClient.makePath makePath: /live_nodes/127.0.0.1:48250_
[junit4:junit4]   2> 7794 T65 oascc.ZkStateReader$3.process Updating live nodes... (5)
[junit4:junit4]   2> 7795 T93 oascc.ZkStateReader$3.process Updating live nodes... (5)
[junit4:junit4]   2> 7796 T107 oascc.ZkStateReader$3.process Updating live nodes... (5)
[junit4:junit4]   2> 7794 T52 oascc.ZkStateReader$3.process Updating live nodes... (5)
[junit4:junit4]   2> 7796 T47 oascc.ZkStateReader$3.process Updating live nodes... (5)
[junit4:junit4]   2> 7795 T79 oascc.ZkStateReader$3.process Updating live nodes... (5)
[junit4:junit4]   2> 7804 T24 oass.SolrDispatchFilter.init user.dir=/mnt/ssd/jenkins/workspace/Lucene-Solr-trunk-Linux/solr/build/solr-core/test/J0
[junit4:junit4]   2> 7805 T24 oass.SolrDispatchFilter.init SolrDispatchFilter.init() done
[junit4:junit4]   2> 7805 T24 oascsi.HttpClientUtil.createClient Creating new http client, config:maxConnections=128&maxConnectionsPerHost=32&followRedirects=false
[junit4:junit4]   2> 7810 T24 oascsi.HttpClientUtil.createClient Creating new http client, config:maxConnections=128&maxConnectionsPerHost=32&followRedirects=false
[junit4:junit4]   2> 8127 T61 oasc.CoreContainer.create Creating SolrCore 'unloadcollection1' using instanceDir: /mnt/ssd/jenkins/workspace/Lucene-Solr-trunk-Linux/solr/build/solr-core/test/J0/./org.apache.solr.cloud.UnloadDistributedZkTest-jetty1-1363741689843/unloadcollection1
[junit4:junit4]   2> 8128 T61 oasc.ZkController.createCollectionZkNode Check for collection zkNode:unloadcollection
[junit4:junit4]   2> 8141 T61 oasc.ZkController.createCollectionZkNode Creating collection in ZooKeeper:unloadcollection
[junit4:junit4]   2> 8142 T61 oasc.ZkController.getConfName Looking for collection configName
[junit4:junit4]   2> 8146 T61 oasc.ZkController.getConfName Only one config set found in zk - using it:conf1
[junit4:junit4]   2> 8153 T61 oascc.SolrZkClient.makePath makePath: /collections/unloadcollection
[junit4:junit4]   2> 8159 T61 oasc.ZkController.readConfigName Load collection config from:/collections/unloadcollection
[junit4:junit4]   2> 8172 T61 oasc.SolrResourceLoader.<init> new SolrResourceLoader for directory: '/mnt/ssd/jenkins/workspace/Lucene-Solr-trunk-Linux/solr/build/solr-core/test/J0/./org.apache.solr.cloud.UnloadDistributedZkTest-jetty1-1363741689843/unloadcollection1/'
[junit4:junit4]   2> 8285 T61 oasc.SolrConfig.<init> Using Lucene MatchVersion: LUCENE_50
[junit4:junit4]   2> 8369 T61 oasc.SolrConfig.<init> Loaded SolrConfig: solrconfig.xml
[junit4:junit4]   2> 8371 T61 oass.IndexSchema.readSchema Reading Solr Schema
[junit4:junit4]   2> 8418 T61 oass.IndexSchema.readSchema Schema name=test
[junit4:junit4]   2> 9105 T61 oass.OpenExchangeRatesOrgProvider.init Initialized with rates=open-exchange-rates.json, refreshInterval=1440.
[junit4:junit4]   2> 9142 T61 oass.IndexSchema.readSchema default search field in schema is text
[junit4:junit4]   2> 9145 T61 oass.IndexSchema.readSchema unique key field: id
[junit4:junit4]   2> 9228 T61 oass.FileExchangeRateProvider.reload Reloading exchange rates from file currency.xml
[junit4:junit4]   2> 9239 T61 oass.FileExchangeRateProvider.reload Reloading exchange rates from file currency.xml
[junit4:junit4]   2> 9245 T61 oass.OpenExchangeRatesOrgProvider.reload Reloading exchange rates from open-exchange-rates.json
[junit4:junit4]   2> 9250 T61 oass.OpenExchangeRatesOrgProvider$OpenExchangeRates.<init> WARNING Unknown key IMPORTANT NOTE
[junit4:junit4]   2> 9250 T61 oass.OpenExchangeRatesOrgProvider$OpenExchangeRates.<init> WARNING Expected key, got STRING
[junit4:junit4]   2> 9251 T61 oass.OpenExchangeRatesOrgProvider.reload Reloading exchange rates from open-exchange-rates.json
[junit4:junit4]   2> 9254 T61 oass.OpenExchangeRatesOrgProvider$OpenExchangeRates.<init> WARNING Unknown key IMPORTANT NOTE
[junit4:junit4]   2> 9256 T61 oass.OpenExchangeRatesOrgProvider$OpenExchangeRates.<init> WARNING Expected key, got STRING
[junit4:junit4]   2> 9257 T61 oasc.SolrCore.initDirectoryFactory org.apache.solr.core.MockDirectoryFactory
[junit4:junit4]   2> 9257 T61 oasc.SolrCore.<init> [unloadcollection1] Opening new SolrCore at /mnt/ssd/jenkins/workspace/Lucene-Solr-trunk-Linux/solr/build/solr-core/test/J0/./org.apache.solr.cloud.UnloadDistributedZkTest-jetty1-1363741689843/unloadcollection1/, dataDir=/mnt/ssd/jenkins/workspace/Lucene-Solr-trunk-Linux/solr/build/solr-core/test/J0/./solrtest-UnloadDistributedZkTest-1363741687132/1363741694936unloadcollection1_1n/
[junit4:junit4]   2> 9261 T61 oasc.JmxMonitoredMap.<init> JMX monitoring is enabled. Adding Solr mbeans to JMX Server: com.sun.jmx.mbeanserver.JmxMBeanServer@34c5b17c
[junit4:junit4]   2> 9262 T61 oasc.SolrCore.initDirectoryFactory org.apache.solr.core.MockDirectoryFactory
[junit4:junit4]   2> 9264 T61 oasc.CachingDirectoryFactory.get return new directory for /mnt/ssd/jenkins/workspace/Lucene-Solr-trunk-Linux/solr/build/solr-core/test/J0/./solrtest-UnloadDistributedZkTest-1363741687132/1363741694936unloadcollection1_1n forceNew: false
[junit4:junit4]   2> 9265 T61 oasc.SolrCore.getNewIndexDir New index directory detected: old=null new=/mnt/ssd/jenkins/workspace/Lucene-Solr-trunk-Linux/solr/build/solr-core/test/J0/./solrtest-UnloadDistributedZkTest-1363741687132/1363741694936unloadcollection1_1n/index/
[junit4:junit4]   2> 9266 T61 oasc.SolrCore.initIndex WARNING [unloadcollection1] Solr index directory '/mnt/ssd/jenkins/workspace/Lucene-Solr-trunk-Linux/solr/build/solr-core/test/J0/./solrtest-UnloadDistributedZkTest-1363741687132/1363741694936unloadcollection1_1n/index' doesn't exist. Creating new index...
[junit4:junit4]   2> 9267 T61 oasc.CachingDirectoryFactory.get return new directory for /mnt/ssd/jenkins/workspace/Lucene-Solr-trunk-Linux/solr/build/solr-core/test/J0/./solrtest-UnloadDistributedZkTest-1363741687132/1363741694936unloadcollection1_1n/index forceNew: false
[junit4:junit4]   2> 9269 T61 oasc.SolrDeletionPolicy.onCommit SolrDeletionPolicy.onCommit: commits:num=1
[junit4:junit4]   2> 		commit{dir=MockDirWrapper(org.apache.lucene.store.RAMDirectory@3b77cb58 lockFactory=org.apache.lucene.store.NativeFSLockFactory@5867454c),segFN=segments_1,generation=1,filenames=[segments_1]
[junit4:junit4]   2> 9270 T61 oasc.SolrDeletionPolicy.updateCommits newest commit = 1[segments_1]
[junit4:junit4]   2> 9289 T61 oasup.UpdateRequestProcessorChain.init inserting DistributedUpdateProcessorFactory into updateRequestProcessorChain "dedupe"
[junit4:junit4]   2> 9290 T61 oasup.UpdateRequestProcessorChain.init inserting DistributedUpdateProcessorFactory into updateRequestProcessorChain "stored_sig"
[junit4:junit4]   2> 9292 T61 oasup.UpdateRequestProcessorChain.init inserting DistributedUpdateProcessorFactory into updateRequestProcessorChain "distrib-dup-test-chain-implicit"
[junit4:junit4]   2> 9294 T61 oasc.RequestHandlers.initHandlersFromConfig created standard: solr.StandardRequestHandler
[junit4:junit4]   2> 9299 T61 oasc.RequestHandlers.initHandlersFromConfig created /get: solr.RealTimeGetHandler
[junit4:junit4]   2> 9299 T61 oasc.RequestHandlers.initHandlersFromConfig adding lazy requestHandler: solr.ReplicationHandler
[junit4:junit4]   2> 9300 T61 oasc.RequestHandlers.initHandlersFromConfig created /replication: solr.ReplicationHandler
[junit4:junit4]   2> 9302 T61 oasc.RequestHandlers.initHandlersFromConfig created /update: solr.UpdateRequestHandler
[junit4:junit4]   2> 9303 T61 oasc.RequestHandlers.initHandlersFromConfig created /admin/: org.apache.solr.handler.admin.AdminHandlers
[junit4:junit4]   2> 9311 T61 oashl.XMLLoader.init xsltCacheLifetimeSeconds=60
[junit4:junit4]   2> 9316 T61 oass.SolrIndexSearcher.<init> Opening Searcher@356f6731 main
[junit4:junit4]   2> 9321 T61 oasu.UpdateHandler.clearLog Clearing tlog files, tlogDir=/mnt/ssd/jenkins/workspace/Lucene-Solr-trunk-Linux/solr/build/solr-core/test/J0/./solrtest-UnloadDistributedZkTest-1363741687132/1363741694936unloadcollection1_1n/tlog
[junit4:junit4]   2> 9330 T61 oasu.CommitTracker.<init> Hard AutoCommit: disabled
[junit4:junit4]   2> 9331 T61 oasu.CommitTracker.<init> Soft AutoCommit: disabled
[junit4:junit4]   2> 9342 T61 oasc.ZkController.publish publishing core=unloadcollection1 state=down
[junit4:junit4]   2> 9345 T109 oasc.SolrCore.registerSearcher [unloadcollection1] Registered new searcher Searcher@356f6731 main{StandardDirectoryReader(segments_1:1)}
[junit4:junit4]   2> 10178 T48 oascc.ZkStateReader.updateClusterState Updating cloud state from ZooKeeper... 
[junit4:junit4]   2> 10180 T48 oasc.Overseer$ClusterStateUpdater.updateState Update state numShards=1 message={
[junit4:junit4]   2> 	  "shard":null,
[junit4:junit4]   2> 	  "node_name":"127.0.0.1:34870_",
[junit4:junit4]   2> 	  "core_node_name":null,
[junit4:junit4]   2> 	  "collection":"unloadcollection",
[junit4:junit4]   2> 	  "base_url":"http://127.0.0.1:34870",
[junit4:junit4]   2> 	  "core":"unloadcollection1",
[junit4:junit4]   2> 	  "operation":"state",
[junit4:junit4]   2> 	  "state":"down",
[junit4:junit4]   2> 	  "numShards":"1",
[junit4:junit4]   2> 	  "roles":null}
[junit4:junit4]   2> 10180 T48 oasc.Overseer$ClusterStateUpdater.createCollection Create collection unloadcollection with numShards 1
[junit4:junit4]   2> 10191 T48 oasc.Overseer$ClusterStateUpdater.updateState Assigning new node to shard shard=shard1
[junit4:junit4]   2> 10209 T107 oascc.ZkStateReader$2.process A cluster state change: WatchedEvent state:SyncConnected type:NodeDataChanged path:/clusterstate.json, has occurred - updating... (live nodes size: 5)
[junit4:junit4]   2> 10209 T47 oascc.ZkStateReader$2.process A cluster state change: WatchedEvent state:SyncConnected type:NodeDataChanged path:/clusterstate.json, has occurred - updating... (live nodes size: 5)
[junit4:junit4]   2> 10209 T52 oascc.ZkStateReader$2.process A cluster state change: WatchedEvent state:SyncConnected type:NodeDataChanged path:/clusterstate.json, has occurred - updating... (live nodes size: 5)
[junit4:junit4]   2> 10210 T65 oascc.ZkStateReader$2.process A cluster state change: WatchedEvent state:SyncConnected type:NodeDataChanged path:/clusterstate.json, has occurred - updating... (live nodes size: 5)
[junit4:junit4]   2> 10210 T93 oascc.ZkStateReader$2.process A cluster state change: WatchedEvent state:SyncConnected type:NodeDataChanged path:/clusterstate.json, has occurred - updating... (live nodes size: 5)
[junit4:junit4]   2> 10209 T79 oascc.ZkStateReader$2.process A cluster state change: WatchedEvent state:SyncConnected type:NodeDataChanged path:/clusterstate.json, has occurred - updating... (live nodes size: 5)
[junit4:junit4]   2> 10350 T61 oasc.CoreContainer.registerCore registering core: unloadcollection1
[junit4:junit4]   2> 10350 T61 oasc.ZkController.register Register replica - core:unloadcollection1 address:http://127.0.0.1:34870 collection:unloadcollection shard:shard1
[junit4:junit4]   2> 10357 T61 oascsi.HttpClientUtil.createClient Creating new http client, config:maxConnections=10000&maxConnectionsPerHost=20&connTimeout=30000&socketTimeout=30000&retry=false
[junit4:junit4]   2> 10366 T61 oascc.SolrZkClient.makePath makePath: /collections/unloadcollection/leader_elect/shard1/election
[junit4:junit4]   2> 10384 T29 oazs.PrepRequestProcessor.pRequest Got user-level KeeperException when processing sessionid:0x13d8556be120006 type:delete cxid:0x51 zxid:0x57 txntype:-1 reqpath:n/a Error Path:/solr/collections/unloadcollection/leaders Error:KeeperErrorCode = NoNode for /solr/collections/unloadcollection/leaders
[junit4:junit4]   2> 10385 T61 oasc.ShardLeaderElectionContext.runLeaderProcess Running the leader process.
[junit4:junit4]   2> 10386 T29 oazs.PrepRequestProcessor.pRequest Got user-level KeeperException when processing sessionid:0x13d8556be120006 type:create cxid:0x52 zxid:0x58 txntype:-1 reqpath:n/a Error Path:/solr/overseer Error:KeeperErrorCode = NodeExists for /solr/overseer
[junit4:junit4]   2> 10389 T61 oasc.ShardLeaderElectionContext.waitForReplicasToComeUp Enough replicas found to continue.
[junit4:junit4]   2> 10389 T61 oasc.ShardLeaderElectionContext.runLeaderProcess I may be the new leader - try and sync
[junit4:junit4]   2> 10390 T61 oasc.SyncStrategy.sync Sync replicas to http://127.0.0.1:34870/unloadcollection1/
[junit4:junit4]   2> 10393 T61 oasc.SyncStrategy.syncReplicas Sync Success - now sync replicas to me
[junit4:junit4]   2> 10394 T61 oasc.SyncStrategy.syncToMe http://127.0.0.1:34870/unloadcollection1/ has no replicas
[junit4:junit4]   2> 10395 T61 oasc.ShardLeaderElectionContext.runLeaderProcess I am the new leader: http://127.0.0.1:34870/unloadcollection1/
[junit4:junit4]   2> 10395 T61 oascc.SolrZkClient.makePath makePath: /collections/unloadcollection/leaders/shard1
[junit4:junit4]   2> 10411 T29 oazs.PrepRequestProcessor.pRequest Got user-level KeeperException when processing sessionid:0x13d8556be120006 type:create cxid:0x5d zxid:0x5c txntype:-1 reqpath:n/a Error Path:/solr/overseer Error:KeeperErrorCode = NodeExists for /solr/overseer
[junit4:junit4]   2> 11718 T48 oascc.ZkStateReader.updateClusterState Updating cloud state from ZooKeeper... 
[junit4:junit4]   2> 11727 T107 oascc.ZkStateReader$2.process A cluster state change: WatchedEvent state:SyncConnected type:NodeDataChanged path:/clusterstate.json, has occurred - updating... (live nodes size: 5)
[junit4:junit4]   2> 11727 T93 oascc.ZkStateReader$2.process A cluster state change: WatchedEvent state:SyncConnected type:NodeDataChanged path:/clusterstate.json, has occurred - updating... (live nodes size: 5)
[junit4:junit4]   2> 11728 T65 oascc.ZkStateReader$2.process A cluster state change: WatchedEvent state:SyncConnected type:NodeDataChanged path:/clusterstate.json, has occurred - updating... (live nodes size: 5)
[junit4:junit4]   2> 11728 T47 oascc.ZkStateReader$2.process A cluster state change: WatchedEvent state:SyncConnected type:NodeDataChanged path:/clusterstate.json, has occurred - updating... (live nodes size: 5)
[junit4:junit4]   2> 11727 T52 oascc.ZkStateReader$2.process A cluster state change: WatchedEvent state:SyncConnected type:NodeDataChanged path:/clusterstate.json, has occurred - updating... (live nodes size: 5)
[junit4:junit4]   2> 11727 T79 oascc.ZkStateReader$2.process A cluster state change: WatchedEvent state:SyncConnected type:NodeDataChanged path:/clusterstate.json, has occurred - updating... (live nodes size: 5)
[junit4:junit4]   2> 11768 T61 oasc.ZkController.register We are http://127.0.0.1:34870/unloadcollection1/ and leader is http://127.0.0.1:34870/unloadcollection1/
[junit4:junit4]   2> 11770 T61 oasc.ZkController.register No LogReplay needed for core=unloadcollection1 baseURL=http://127.0.0.1:34870
[junit4:junit4]   2> 11770 T61 oasc.ZkController.checkRecovery I am the leader, no recovery necessary
[junit4:junit4]   2> 11770 T61 oasc.ZkController.publish publishing core=unloadcollection1 state=active
[junit4:junit4]   2> 11798 T61 oascc.ZkStateReader.updateClusterState Updating cloud state from ZooKeeper... 
[junit4:junit4]   2> 11799 T61 oasc.CoreContainer.persistFile Persisting cores config to /mnt/ssd/jenkins/workspace/Lucene-Solr-trunk-Linux/solr/build/solr-core/test/J0/./org.apache.solr.cloud.UnloadDistributedZkTest-jetty1-1363741689843/solr.xml
[junit4:junit4]   2> 11807 T61 oasc.SolrXMLSerializer.persistFile Persisting cores config to /mnt/ssd/jenkins/workspace/Lucene-Solr-trunk-Linux/solr/build/solr-core/test/J0/./org.apache.solr.cloud.UnloadDistributedZkTest-jetty1-1363741689843/solr.xml
[junit4:junit4]   2> 11809 T61 oass.SolrDispatchFilter.handleAdminRequest /admin/cores {collection=unloadcollection&dataDir=/mnt/ssd/jenkins/workspace/Lucene-Solr-trunk-Linux/solr/build/solr-core/test/J0/./solrtest-UnloadDistributedZkTest-1363741687132/1363741694936unloadcollection1_1n&name=unloadcollection1&wt=javabin&action=CREATE&numShards=1&version=2} status=0 QTime=3685 
[junit4:junit4]   2> 11843 T24 oascsi.HttpClientUtil.createClient Creating new http client, config:
[junit4:junit4]   2> 11845 T24 oaz.ZooKeeper.<init> Initiating client connection, connectString=127.0.0.1:38466/solr sessionTimeout=10000 watcher=org.apache.solr.common.cloud.ConnectionManager@66111461
[junit4:junit4]   2> 11846 T24 oascc.ConnectionManager.waitForConnected Waiting for client to connect to ZooKeeper
[junit4:junit4]   2> 11846 T110 oaz.ClientCnxn$SendThread.logStartConnect Opening socket connection to server localhost.localdomain/127.0.0.1:38466. Will not attempt to authenticate using SASL (access denied ("javax.security.auth.AuthPermission" "getLoginConfiguration"))
[junit4:junit4]   2> 11847 T110 oaz.ClientCnxn$SendThread.primeConnection Socket connection established to localhost.localdomain/127.0.0.1:38466, initiating session
[junit4:junit4]   2> 11847 T26 oazs.NIOServerCnxnFactory.run Accepted socket connection from /127.0.0.1:33496
[junit4:junit4]   2> 11847 T26 oazs.ZooKeeperServer.processConnectRequest Client attempting to establish new session at /127.0.0.1:33496
[junit4:junit4]   2> 11849 T28 oazs.ZooKeeperServer.finishSessionInit Established session 0x13d8556be12000d with negotiated timeout 10000 for client /127.0.0.1:33496
[junit4:junit4]   2> 11849 T110 oaz.ClientCnxn$SendThread.onConnected Session establishment complete on server localhost.localdomain/127.0.0.1:38466, sessionid = 0x13d8556be12000d, negotiated timeout = 10000
[junit4:junit4]   2> 11850 T111 oascc.ConnectionManager.process Watcher org.apache.solr.common.cloud.ConnectionManager@66111461 name:ZooKeeperConnection Watcher:127.0.0.1:38466/solr got event WatchedEvent state:SyncConnected type:None path:null path:null type:None
[junit4:junit4]   2> 11850 T24 oascc.ConnectionManager.waitForConnected Client is connected to ZooKeeper
[junit4:junit4]   2> 11852 T24 oascc.ZkStateReader.createClusterStateWatchersAndUpdate Updating cluster state from ZooKeeper... 
[junit4:junit4]   2> 11855 T24 oascc.ZkStateReader.updateClusterState Updating cloud state from ZooKeeper... 
[junit4:junit4]   2> 11856 T24 oascsi.HttpClientUtil.createClient Creating new http client, config:maxConnections=128&maxConnectionsPerHost=32&followRedirects=false
[junit4:junit4]   2> 11864 T72 oasc.CoreContainer.create Creating SolrCore 'unloadcollection2' using instanceDir: /mnt/ssd/jenkins/workspace/Lucene-Solr-trunk-Linux/solr/build/solr-core/test/J0/./org.apache.solr.cloud.UnloadDistributedZkTest-jetty2-1363741691138/unloadcollection2
[junit4:junit4]   2> 11865 T72 oasc.ZkController.createCollectionZkNode Check for collection zkNode:unloadcollection
[junit4:junit4]   2> 11866 T72 oasc.ZkController.createCollectionZkNode Collection zkNode exists
[junit4:junit4]   2> 11866 T72 oasc.ZkController.readConfigName Load collection config from:/collections/unloadcollection
[junit4:junit4]   2> 11869 T72 oasc.SolrResourceLoader.<init> new SolrResourceLoader for directory: '/mnt/ssd/jenkins/workspace/Lucene-Solr-trunk-Linux/solr/build/solr-core/test/J0/./org.apache.solr.cloud.UnloadDistributedZkTest-jetty2-1363741691138/unloadcollection2/'
[junit4:junit4]   2> 11910 T72 oasc.SolrConfig.<init> Using Lucene MatchVersion: LUCENE_50
[junit4:junit4]   2> 11956 T72 oasc.SolrConfig.<init> Loaded SolrConfig: solrconfig.xml
[junit4:junit4]   2> 11958 T72 oass.IndexSchema.readSchema Reading Solr Schema
[junit4:junit4]   2> 11974 T72 oass.IndexSchema.readSchema Schema name=test
[junit4:junit4]   2> 12380 T72 oass.OpenExchangeRatesOrgProvider.init Initialized with rates=open-exchange-rates.json, refreshInterval=1440.
[junit4:junit4]   2> 12391 T72 oass.IndexSchema.readSchema default search field in schema is text
[junit4:junit4]   2> 12393 T72 oass.IndexSchema.readSchema unique key field: id
[junit4:junit4]   2> 12422 T72 oass.FileExchangeRateProvider.reload Reloading exchange rates from file currency.xml
[junit4:junit4]   2> 12427 T72 oass.FileExchangeRateProvider.reload Reloading exchange rates from file currency.xml
[junit4:junit4]   2> 12431 T72 oass.OpenExchangeRatesOrgProvider.reload Reloading exchange rates from open-exchange-rates.json
[junit4:junit4]   2> 12433 T72 oass.OpenExchangeRatesOrgProvider$OpenExchangeRates.<init> WARNING Unknown key IMPORTANT NOTE
[junit4:junit4]   2> 12434 T72 oass.OpenExchangeRatesOrgProvider$OpenExchangeRates.<init> WARNING Expected key, got STRING
[junit4:junit4]   2> 12435 T72 oass.OpenExchangeRatesOrgProvider.reload Reloading exchange rates from open-exchange-rates.json
[junit4:junit4]   2> 12436 T72 oass.OpenExchangeRatesOrgProvider$OpenExchangeRates.<init> WARNING Unknown key IMPORTANT NOTE
[junit4:junit4]   2> 12436 T72 oass.OpenExchangeRatesOrgProvider$OpenExchangeRates.<init> WARNING Expected key, got STRING
[junit4:junit4]   2> 12437 T72 oasc.SolrCore.initDirectoryFactory org.apache.solr.core.MockDirectoryFactory
[junit4:junit4]   2> 12437 T72 oasc.SolrCore.<init> [unloadcollection2] Opening new SolrCore at /mnt/ssd/jenkins/workspace/Lucene-Solr-trunk-Linux/solr/build/solr-core/test/J0/./org.apache.solr.cloud.UnloadDistributedZkTest-jetty2-1363741691138/unloadcollection2/, dataDir=/mnt/ssd/jenkins/workspace/Lucene-Solr-trunk-Linux/solr/build/solr-core/test/J0/./solrtest-UnloadDistributedZkTest-1363741687132/1363741698979unloadcollection1_2n/
[junit4:junit4]   2> 12438 T72 oasc.JmxMonitoredMap.<init> JMX monitoring is enabled. Adding Solr mbeans to JMX Server: com.sun.jmx.mbeanserver.JmxMBeanServer@34c5b17c
[junit4:junit4]   2> 12440 T72 oasc.SolrCore.initDirectoryFactory org.apache.solr.core.MockDirectoryFactory
[junit4:junit4]   2> 12440 T72 oasc.CachingDirectoryFactory.get return new directory for /mnt/ssd/jenkins/workspace/Lucene-Solr-trunk-Linux/solr/build/solr-core/test/J0/./solrtest-UnloadDistributedZkTest-1363741687132/1363741698979unloadcollection1_2n forceNew: false
[junit4:junit4]   2> 12441 T72 oasc.SolrCore.getNewIndexDir New index directory detected: old=null new=/mnt/ssd/jenkins/workspace/Lucene-Solr-trunk-Linux/solr/build/solr-core/test/J0/./solrtest-UnloadDistributedZkTest-1363741687132/1363741698979unloadcollection1_2n/index/
[junit4:junit4]   2> 12441 T72 oasc.SolrCore.initIndex WARNING [unloadcollection2] Solr index directory '/mnt/ssd/jenkins/workspace/Lucene-Solr-trunk-Linux/solr/build/solr-core/test/J0/./solrtest-UnloadDistributedZkTest-1363741687132/1363741698979unloadcollection1_2n/index' doesn't exist. Creating new index...
[junit4:junit4]   2> 12442 T72 oasc.CachingDirectoryFactory.get return new directory for /mnt/ssd/jenkins/workspace/Lucene-Solr-trunk-Linux/solr/build/solr-core/test/J0/./solrtest-UnloadDistributedZkTest-1363741687132/1363741698979unloadcollection1_2n/index forceNew: false
[junit4:junit4]   2> 12444 T72 oasc.SolrDeletionPolicy.onCommit SolrDeletionPolicy.onCommit: commits:num=1
[junit4:junit4]   2> 		commit{dir=MockDirWrapper(org.apache.lucene.store.RAMDirectory@192bf990 lockFactory=org.apache.lucene.store.NativeFSLockFactory@18b7b345),segFN=segments_1,generation=1,filenames=[segments_1]
[junit4:junit4]   2> 12444 T72 oasc.SolrDeletionPolicy.updateCommits newest commit = 1[segments_1]
[junit4:junit4]   2> 12447 T72 oasup.UpdateRequestProcessorChain.init inserting DistributedUpdateProcessorFactory into updateRequestProcessorChain "dedupe"
[junit4:junit4]   2> 12448 T72 oasup.UpdateRequestProcessorChain.init inserting DistributedUpdateProcessorFactory into updateRequestProcessorChain "stored_sig"
[junit4:junit4]   2> 12449 T72 oasup.UpdateRequestProcessorChain.init inserting DistributedUpdateProcessorFactory into updateRequestProcessorChain "distrib-dup-test-chain-implicit"
[junit4:junit4]   2> 12450 T72 oasc.RequestHandlers.initHandlersFromConfig created standard: solr.StandardRequestHandler
[junit4:junit4]   2> 12451 T72 oasc.RequestHandlers.initHandlersFromConfig created /get: solr.RealTimeGetHandler
[junit4:junit4]   2> 12451 T72 oasc.RequestHandlers.initHandlersFromConfig adding lazy requestHandler: solr.ReplicationHandler
[junit4:junit4]   2> 12452 T72 oasc.RequestHandlers.initHandlersFromConfig created /replication: solr.ReplicationHandler
[junit4:junit4]   2> 12453 T72 oasc.RequestHandlers.initHandlersFromConfig created /update: solr.UpdateRequestHandler
[junit4:junit4]   2> 12453 T72 oasc.RequestHandlers.initHandlersFromConfig created /admin/: org.apache.solr.handler.admin.AdminHandlers
[junit4:junit4]   2> 12457 T72 oashl.XMLLoader.init xsltCacheLifetimeSeconds=60
[junit4:junit4]   2> 12460 T72 oass.SolrIndexSearcher.<init> Opening Searcher@32592603 main
[junit4:junit4]   2> 12461 T72 oasu.UpdateHandler.clearLog Clearing tlog files, tlogDir=/mnt/ssd/jenkins/workspace/Lucene-Solr-trunk-Linux/solr/build/solr-core/test/J0/./solrtest-UnloadDistributedZkTest-1363741687132/1363741698979unloadcollection1_2n/tlog
[junit4:junit4]   2> 12461 T72 oasu.CommitTracker.<init> Hard AutoCommit: disabled
[junit4:junit4]   2> 12462 T72 oasu.CommitTracker.<init> Soft AutoCommit: disabled
[junit4:junit4]   2> 12467 T112 oasc.SolrCore.registerSearcher [unloadcollection2] Registered new searcher Searcher@32592603 main{StandardDirectoryReader(segments_1:1)}
[junit4:junit4]   2> 12470 T72 oasc.ZkController.publish publishing core=unloadcollection2 state=down
[junit4:junit4]   2> 12471 T72 oasc.ZkController.publish numShards not found on descriptor - reading it from system property
[junit4:junit4]   2> 13238 T48 oascc.ZkStateReader.updateClusterState Updating cloud state from ZooKeeper... 
[junit4:junit4]   2> 13239 T48 oasc.Overseer$ClusterStateUpdater.updateState Update state numShards=1 message={
[junit4:junit4]   2> 	  "shard":"shard1",
[junit4:junit4]   2> 	  "node_name":"127.0.0.1:34870_",
[junit4:junit4]   2> 	  "core_node_name":"127.0.0.1:34870__unloadcollection1",
[junit4:junit4]   2> 	  "collection":"unloadcollection",
[junit4:junit4]   2> 	  "base_url":"http://127.0.0.1:34870",
[junit4:junit4]   2> 	  "core":"unloadcollection1",
[junit4:junit4]   2> 	  "operation":"state",
[junit4:junit4]   2> 	  "state":"active",
[junit4:junit4]   2> 	  "numShards":"1",
[junit4:junit4]   2> 	  "roles":null}
[junit4:junit4]   2> 13244 T48 oasc.Overseer$ClusterStateUpdater.updateState Update state numShards=2 message={
[junit4:junit4]   2> 	  "shard":null,
[junit4:junit4]   2> 	  "node_name":"127.0.0.1:39492_",
[junit4:junit4]   2> 	  "core_node_name":null,
[junit4:junit4]   2> 	  "collection":"unloadcollection",
[junit4:junit4]   2> 	  "base_url":"http://127.0.0.1:39492",
[junit4:junit4]   2> 	  "core":"unloadcollection2",
[junit4:junit4]   2> 	  "operation":"state",
[junit4:junit4]   2> 	  "state":"down",
[junit4:junit4]   2> 	  "numShards":"2",
[junit4:junit4]   2> 	  "roles":null}
[junit4:junit4]   2> 13244 T48 oasc.Overseer$ClusterStateUpdater.updateState Collection already exists with numShards=1
[junit4:junit4]   2> 13245 T48 oasc.Overseer$ClusterStateUpdater.updateState Assigning new node to shard shard=shard1
[junit4:junit4]   2> 13250 T47 oascc.ZkStateReader$2.process A cluster state change: WatchedEvent state:SyncConnected type:NodeDataChanged path:/clusterstate.json, has occurred - updating... (live nodes size: 5)
[junit4:junit4]   2> 13250 T52 oascc.ZkStateReader$2.process A cluster state change: WatchedEvent state:SyncConnected type:NodeDataChanged path:/clusterstate.json, has occurred - updating... (live nodes size: 5)
[junit4:junit4]   2> 13250 T93 oascc.ZkStateReader$2.process A cluster state change: WatchedEvent state:SyncConnected type:NodeDataChanged path:/clusterstate.json, has occurred - updating... (live nodes size: 5)
[junit4:junit4]   2> 13250 T107 oascc.ZkStateReader$2.process A cluster state change: WatchedEvent state:SyncConnected type:NodeDataChanged path:/clusterstate.json, has occurred - updating... (live nodes size: 5)
[junit4:junit4]   2> 13250 T79 oascc.ZkStateReader$2.process A cluster state change: WatchedEvent state:SyncConnected type:NodeDataChanged path:/clusterstate.json, has occurred - updating... (live nodes size: 5)
[junit4:junit4]   2> 13250 T111 oascc.ZkStateReader$2.process A cluster state change: WatchedEvent state:SyncConnected type:NodeDataChanged path:/clusterstate.json, has occurred - updating... (live nodes size: 5)
[junit4:junit4]   2> 13250 T65 oascc.ZkStateReader$2.process A cluster state change: WatchedEvent state:SyncConnected type:NodeDataChanged path:/clusterstate.json, has occurred - updating... (live nodes size: 5)
[junit4:junit4]   2> 13473 T72 oasc.CoreContainer.registerCore registering core: unloadcollection2
[junit4:junit4]   2> 13473 T72 oasc.ZkController.register Register replica - core:unloadcollection2 address:http://127.0.0.1:39492 collection:unloadcollection shard:shard1
[junit4:junit4]   2> 13477 T72 oasc.ZkController.register We are http://127.0.0.1:39492/unloadcollection2/ and leader is http://127.0.0.1:34870/unloadcollection1/
[junit4:junit4]   2> 13478 T72 oasc.ZkController.register No LogReplay needed for core=unloadcollection2 baseURL=http://127.0.0.1:39492
[junit4:junit4]   2> 13478 T72 oasc.ZkController.checkRecovery Core needs to recover:unloadcollection2
[junit4:junit4]   2> 13478 T72 oasu.DefaultSolrCoreState.doRecovery Running recovery - first canceling any ongoing recovery
[junit4:junit4]   2> ASYNC  NEW_CORE C2 name=unloadcollection2 org.apache.solr.core.SolrCore@69183efa url=http://127.0.0.1:39492/unloadcollection2 node=127.0.0.1:39492_ C2_STATE=coll:unloadcollection core:unloadcollection2 props:{node_name=127.0.0.1:39492_, collection=unloadcollection, base_url=http://127.0.0.1:39492, core=unloadcollection2, state=down}
[junit4:junit4]   2> 13481 T113 C2 P39492 oasc.RecoveryStrategy.run Starting recovery process.  core=unloadcollection2 recoveringAfterStartup=true
[junit4:junit4]   2> 13482 T113 C2 P39492 oasc.RecoveryStrategy.doRecovery ###### startupVersions=[]
[junit4:junit4]   2> 13482 T72 oascc.ZkStateReader.updateClusterState Updating cloud state from ZooKeeper... 
[junit4:junit4]   2> 13482 T113 C2 P39492 oasc.ZkController.publish publishing core=unloadcollection2 state=recovering
[junit4:junit4]   2> 13483 T113 C2 P39492 oasc.ZkController.publish numShards not found on descriptor - reading it from system property
[junit4:junit4]   2> 13483 T72 oasc.CoreContainer.persistFile Persisting cores config to /mnt/ssd/jenkins/workspace/Lucene-Solr-trunk-Linux/solr/build/solr-core/test/J0/./org.apache.solr.cloud.UnloadDistributedZkTest-jetty2-1363741691138/solr.xml
[junit4:junit4]   2> 13484 T113 C2 P39492 oascsi.HttpClientUtil.createClient Creating new http client, config:maxConnections=128&maxConnectionsPerHost=32&followRedirects=false
[junit4:junit4]   2> 13489 T72 oasc.SolrXMLSerializer.persistFile Persisting cores config to /mnt/ssd/jenkins/workspace/Lucene-Solr-trunk-Linux/solr/build/solr-core/test/J0/./org.apache.solr.cloud.UnloadDistributedZkTest-jetty2-1363741691138/solr.xml
[junit4:junit4]   2> 13491 T72 oass.SolrDispatchFilter.handleAdminRequest /admin/cores {collection=unloadcollection&dataDir=/mnt/ssd/jenkins/workspace/Lucene-Solr-trunk-Linux/solr/build/solr-core/test/J0/./solrtest-UnloadDistributedZkTest-1363741687132/1363741698979unloadcollection1_2n&name=unloadcollection2&wt=javabin&action=CREATE&version=2} status=0 QTime=1627 
[junit4:junit4]   2> 13492 T24 oascc.ZkStateReader.updateClusterState Updating cloud state from ZooKeeper... 
[junit4:junit4]   2> 13493 T24 oasc.AbstractDistribZkTestBase.waitForRecoveriesToFinish Wait for recoveries to finish - collection: unloadcollection failOnTimeout:true timeout (sec):230
[junit4:junit4]   2> 13494 T24 oascc.ZkStateReader.updateClusterState Updating cloud state from ZooKeeper... 
[junit4:junit4]   2> 14497 T24 oascc.ZkStateReader.updateClusterState Updating cloud state from ZooKeeper... 
[junit4:junit4]   2> 14761 T48 oascc.ZkStateReader.updateClusterState Updating cloud state from ZooKeeper... 
[junit4:junit4]   2> 14762 T48 oasc.Overseer$ClusterStateUpdater.updateState Update state numShards=2 message={
[junit4:junit4]   2> 	  "shard":"shard1",
[junit4:junit4]   2> 	  "node_name":"127.0.0.1:39492_",
[junit4:junit4]   2> 	  "core_node_name":"127.0.0.1:39492__unloadcollection2",
[junit4:junit4]   2> 	  "collection":"unloadcollection",
[junit4:junit4]   2> 	  "base_url":"http://127.0.0.1:39492",
[junit4:junit4]   2> 	  "core":"unloadcollection2",
[junit4:junit4]   2> 	  "operation":"state",
[junit4:junit4]   2> 	  "state":"recovering",
[junit4:junit4]   2> 	  "numShards":"2",
[junit4:junit4]   2> 	  "roles":null}
[junit4:junit4]   2> 14787 T111 oascc.ZkStateReader$2.process A cluster state change: WatchedEvent state:SyncConnected type:NodeDataChanged path:/clusterstate.json, has occurred - updating... (live nodes size: 5)
[junit4:junit4]   2> 14787 T52 oascc.ZkStateReader$2.process A cluster state change: WatchedEvent state:SyncConnected type:NodeDataChanged path:/clusterstate.json, has occurred - updating... (live nodes size: 5)
[junit4:junit4]   2> 14787 T107 oascc.ZkStateReader$2.process A cluster state change: WatchedEvent state:SyncConnected type:NodeDataChanged path:/clusterstate.json, has occurred - updating... (live nodes size: 5)
[junit4:junit4]   2> 14787 T65 oascc.ZkStateReader$2.process A cluster state change: WatchedEvent state:SyncConnected type:NodeDataChanged path:/clusterstate.json, has occurred - updating... (live nodes size: 5)
[junit4:junit4]   2> 14787 T47 oascc.ZkStateReader$2.process A cluster state change: WatchedEvent state:SyncConnected type:NodeDataChanged path:/clusterstate.json, has occurred - updating... (live nodes size: 5)
[junit4:junit4]   2> 14788 T79 oascc.ZkStateReader$2.process A cluster state change: WatchedEvent state:SyncConnected type:NodeDataChanged path:/clusterstate.json, has occurred - updating... (live nodes size: 5)
[junit4:junit4]   2> 14787 T93 oascc.ZkStateReader$2.process A cluster state change: WatchedEvent state:SyncConnected type:NodeDataChanged path:/clusterstate.json, has occurred - updating... (live nodes size: 5)
[junit4:junit4]   2> 15492 T59 oass.SolrDispatchFilter.handleAdminRequest /admin/cores {onlyIfLeader=true&coreNodeName=127.0.0.1:39492__unloadcollection2&nodeName=127.0.0.1:39492_&core=unloadcollection1&checkLive=true&wt=javabin&state=recovering&action=PREPRECOVERY&version=2} status=0 QTime=2001 
[junit4:junit4]   2> 15499 T24 oascc.ZkStateReader.updateClusterState Updating cloud state from ZooKeeper... 
[junit4:junit4]   2> 16501 T24 oascc.ZkStateReader.updateClusterState Updating cloud state from ZooKeeper... 
[junit4:junit4]   2>  C2_STATE=coll:unloadcollection core:unloadcollection2 props:{shard=shard1, node_name=127.0.0.1:39492_, collection=unloadcollection, base_url=http://127.0.0.1:39492, core=unloadcollection2, state=recovering}
[junit4:junit4]   2> 17493 T113 C2 P39492 oasc.RecoveryStrategy.doRecovery Attempting to PeerSync from http://127.0.0.1:34870/unloadcollection1/ core=unloadcollection2 - recoveringAfterStartup=true
[junit4:junit4]   2> 17498 T113 C2 P39492 oascsi.HttpClientUtil.createClient Creating new http client, config:maxConnectionsPerHost=20&maxConnections=10000&connTimeout=30000&socketTimeout=30000&retry=false
[junit4:junit4]   2> 17504 T24 oascc.ZkStateReader.updateClusterState Updating cloud state from ZooKeeper... 
[junit4:junit4]   2> 17506 T113 C2 P39492 oasu.PeerSync.sync PeerSync: core=unloadcollection2 url=http://127.0.0.1:39492 START replicas=[http://127.0.0.1:34870/unloadcollection1/] nUpdates=100
[junit4:junit4]   2> 17510 T113 C2 P39492 oasu.PeerSync.sync WARNING no frame of reference to tell of we've missed updates
[junit4:junit4]   2> 17511 T113 C2 P39492 oasc.RecoveryStrategy.doRecovery PeerSync Recovery was not successful - trying replication. core=unloadcollection2
[junit4:junit4]   2> 17511 T113 C2 P39492 oasc.RecoveryStrategy.doRecovery Starting Replication Recovery. core=unloadcollection2
[junit4:junit4]   2> 17511 T113 C2 P39492 oasc.RecoveryStrategy.doRecovery Begin buffering updates. core=unloadcollection2
[junit4:junit4]   2> 17512 T113 C2 P39492 oasu.UpdateLog.bufferUpdates Starting to buffer updates. FSUpdateLog{state=ACTIVE, tlog=null}
[junit4:junit4]   2> 17512 T113 C2 P39492 oasc.RecoveryStrategy.replicate Attempting to replicate from http://127.0.0.1:34870/unloadcollection1/. core=unloadcollection2
[junit4:junit4]   2> 17512 T113 C2 P39492 oascsi.HttpClientUtil.createClient Creating new http client, config:maxConnections=128&maxConnectionsPerHost=32&followRedirects=false
[junit4:junit4]   2> ASYNC  NEW_CORE C3 name=unloadcollection1 org.apache.solr.core.SolrCore@3c1fb854 url=http://127.0.0.1:34870/unloadcollection1 node=127.0.0.1:34870_ C3_STATE=coll:unloadcollection core:unloadcollection1 props:{shard=shard1, node_name=127.0.0.1:34870_, collection=unloadcollection, base_url=http://127.0.0.1:34870, core=unloadcollection1, state=active, leader=true}
[junit4:junit4]   2> 17527 T57 C3 P34870 REQ /get {qt=/get&distrib=false&getVersions=100&wt=javabin&version=2} status=0 QTime=1 
[junit4:junit4]   2> 17532 T59 C3 P34870 oasu.DirectUpdateHandler2.commit start commit{,optimize=false,openSearcher=false,waitSearcher=true,expungeDeletes=false,softCommit=false,prepareCommit=false}
[junit4:junit4]   2> 17534 T59 C3 P34870 oasc.SolrDeletionPolicy.onInit SolrDeletionPolicy.onInit: commits:num=1
[junit4:junit4]   2> 		commit{dir=MockDirWrapper(org.apache.lucene.store.RAMDirectory@3b77cb58 lockFactory=org.apache.lucene.store.NativeFSLockFactory@5867454c),segFN=segments_1,generation=1,filenames=[segments_1]
[junit4:junit4]   2> 17534 T59 C3 P34870 oasc.SolrDeletionPolicy.updateCommits newest commit = 1[segments_1]
[junit4:junit4]   2> 17535 T59 C3 P34870 oasc.SolrDeletionPolicy.onCommit SolrDeletionPolicy.onCommit: commits:num=2
[junit4:junit4]   2> 		commit{dir=MockDirWrapper(org.apache.lucene.store.RAMDirectory@3b77cb58 lockFactory=org.apache.lucene.store.NativeFSLockFactory@5867454c),segFN=segments_1,generation=1,filenames=[segments_1]
[junit4:junit4]   2> 		commit{dir=MockDirWrapper(org.apache.lucene.store.RAMDirectory@3b77cb58 lockFactory=org.apache.lucene.store.NativeFSLockFactory@5867454c),segFN=segments_2,generation=2,filenames=[segments_2]
[junit4:junit4]   2> 17535 T59 C3 P34870 oasc.SolrDeletionPolicy.updateCommits newest commit = 2[segments_2]
[junit4:junit4]   2> 17536 T59 C3 P34870 oass.SolrIndexSearcher.<init> Opening Searcher@5fc0ee04 realtime
[junit4:junit4]   2> 17536 T59 C3 P34870 oasu.DirectUpdateHandler2.commit end_commit_flush
[junit4:junit4]   2> 17537 T59 C3 P34870 /update {softCommit=false&waitSearcher=true&openSearcher=false&commit=true&wt=javabin&commit_end_point=true&version=2} {commit=} 0 11
[junit4:junit4]   2> 17556 T113 C2 P39492 oash.ReplicationHandler.inform Commits will be reserved for  10000
[junit4:junit4]   2> 17557 T113 C2 P39492 oascsi.HttpClientUtil.createClient Creating new http client, config:connTimeout=5000&socketTimeout=20000&allowCompression=false&maxConnections=10000&maxConnectionsPerHost=10000
[junit4:junit4]   2> 17563 T113 C2 P39492 oash.SnapPuller.<init>  No value set for 'pollInterval'. Timer Task not started.
[junit4:junit4]   2> 17576 T60 C3 P34870 oash.ReplicationHandler.inform Commits will be reserved for  10000
[junit4:junit4]   2> 17576 T60 C3 P34870 REQ /replication {qt=/replication&command=indexversion&wt=javabin&version=2} status=0 QTime=11 
[junit4:junit4]   2> 17578 T113 C2 P39492 oash.SnapPuller.fetchLatestIndex Master's generation: 2
[junit4:junit4]   2> 17578 T113 C2 P39492 oash.SnapPuller.fetchLatestIndex Slave's generation: 1
[junit4:junit4]   2> 17578 T113 C2 P39492 oash.SnapPuller.fetchLatestIndex Starting replication process
[junit4:junit4]   2> 17582 T57 C3 P34870 REQ /replication {qt=/replication&command=filelist&wt=javabin&generation=2&version=2} status=0 QTime=1 
[junit4:junit4]   2> 17583 T113 C2 P39492 oash.SnapPuller.fetchLatestIndex Number of files in latest index in master: 1
[junit4:junit4]   2> 17585 T113 C2 P39492 oasc.CachingDirectoryFactory.get return new directory for /mnt/ssd/jenkins/workspace/Lucene-Solr-trunk-Linux/solr/build/solr-core/test/J0/./solrtest-UnloadDistributedZkTest-1363741687132/1363741698979unloadcollection1_2n/index.20130320140824701 forceNew: false
[junit4:junit4]   2> 17585 T113 C2 P39492 oash.SnapPuller.fetchLatestIndex Starting download to MockDirWrapper(RateLimitedDirectoryWrapper(org.apache.lucene.store.RAMDirectory@f5b1aed lockFactory=org.apache.lucene.store.NativeFSLockFactory@311c3faa)) fullCopy=false
[junit4:junit4]   2> 17593 T59 C3 P34870 REQ /replication {qt=/replication&command=filecontent&checksum=true&file=segments_2&wt=filestream&generation=2} status=0 QTime=2 
[junit4:junit4]   2> 17597 T113 C2 P39492 oash.SnapPuller.fetchLatestIndex Total time taken for download : 0 secs
[junit4:junit4]   2> 17607 T113 C2 P39492 oasu.DefaultSolrCoreState.newIndexWriter Creating new IndexWriter...
[junit4:junit4]   2> 17607 T113 C2 P39492 oasu.DefaultSolrCoreState.newIndexWriter Waiting until IndexWriter is unused... core=unloadcollection2
[junit4:junit4]   2> 17610 T113 C2 P39492 oasc.SolrDeletionPolicy.onInit SolrDeletionPolicy.onInit: commits:num=2
[junit4:junit4]   2> 		commit{dir=MockDirWrapper(org.apache.lucene.store.RAMDirectory@192bf990 lockFactory=org.apache.lucene.store.NativeFSLockFactory@18b7b345),segFN=segments_1,generation=1,filenames=[segments_1]
[junit4:junit4]   2> 		commit{dir=MockDirWrapper(org.apache.lucene.store.RAMDirectory@192bf990 lockFactory=org.apache.lucene.store.NativeFSLockFactory@18b7b345),segFN=segments_2,generation=2,filenames=[segments_2]
[junit4:junit4]   2> 17610 T113 C2 P39492 oasc.SolrDeletionPolicy.updateCommits newest commit = 2[segments_2]
[junit4:junit4]   2> 17611 T113 C2 P39492 oasu.DefaultSolrCoreState.newIndexWriter New IndexWriter is ready to be used.
[junit4:junit4]   2> 17611 T113 C2 P39492 oass.SolrIndexSearcher.<init> Opening Searcher@78b88557 main
[junit4:junit4]   2> 17613 T112 oasc.SolrCore.registerSearcher [unloadcollection2] Registered new searcher Searcher@78b88557 main{StandardDirectoryReader(segments_2:1:nrt)}
[junit4:junit4]   2> 17614 T113 C2 P39492 oasc.RecoveryStrategy.replay No replay needed. core=unloadcollection2
[junit4:junit4]   2> 17614 T113 C2 P39492 oasc.RecoveryStrategy.doRecovery Replication Recovery was successful - registering as Active. core=unloadcollection2
[junit4:junit4]   2> 17614 T113 C2 P39492 oasc.ZkController.publish publishing core=unloadcollection2 state=active
[junit4:junit4]   2> 17615 T113 C2 P39492 oasc.ZkController.publish numShards not found on descriptor - reading it from system property
[junit4:junit4]   2> 17625 T113 C2 P39492 oasc.RecoveryStrategy.doRecovery Finished recovery process. core=unloadcollection2
[junit4:junit4]   2> 17798 T48 oascc.ZkStateReader.updateClusterState Updating cloud state from ZooKeeper... 
[junit4:junit4]   2> 17799 T48 oasc.Overseer$ClusterStateUpdater.updateState Update state numShards=2 message={
[junit4:junit4]   2> 	  "shard":"shard1",
[junit4:junit4]   2> 	  "node_name":"127.0.0.1:39492_",
[junit4:junit4]   2> 	  "core_node_name":"127.0.0.1:39492__unloadcollection2",
[junit4:junit4]   2> 	  "collection":"unloadcollection",
[junit4:junit4]   2> 	  "base_url":"http://127.0.0.1:39492",
[junit4:junit4]   2> 	  "core":"unloadcollection2",
[junit4:junit4]   2> 	  "operation":"state",
[junit4:junit4]   2> 	  "state":"active",
[junit4:junit4]   2> 	  "numShards":"2",
[junit4:junit4]   2> 	  "roles":null}
[junit4:junit4]   2> 17806 T79 oascc.ZkStateReader$2.process A cluster state change: WatchedEvent state:SyncConnected type:NodeDataChanged path:/clusterstate.json, has occurred - updating... (live nodes size: 5)
[junit4:junit4]   2> 17806 T111 oascc.ZkStateReader$2.process A cluster state change: WatchedEvent state:SyncConnected type:NodeDataChanged path:/clusterstate.json, has occurred - updating... (live nodes size: 5)
[junit4:junit4]   2> 17806 T65 oascc.ZkStateReader$2.process A cluster state change: WatchedEvent state:SyncConnected type:NodeDataChanged path:/clusterstate.json, has occurred - updating... (live nodes size: 5)
[junit4:junit4]   2> 17806 T107 oascc.ZkStateReader$2.process A cluster state change: WatchedEvent state:SyncConnected type:NodeDataChanged path:/clusterstate.json, has occurred - updating... (live nodes size: 5)
[junit4:junit4]   2> 17806 T52 oascc.ZkStateReader$2.process A cluster state change: WatchedEvent state:SyncConnected type:NodeDataChanged path:/clusterstate.json, has occurred - updating... (live nodes size: 5)
[junit4:junit4]   2> 17806 T47 oascc.ZkStateReader$2.process A cluster state change: WatchedEvent state:SyncConnected type:NodeDataChanged path:/clusterstate.json, has occurred - updating... (live nodes size: 5)
[junit4:junit4]   2> 17806 T93 oascc.ZkStateReader$2.process A cluster state change: WatchedEvent state:SyncConnected type:NodeDataChanged path:/clusterstate.json, has occurred - updating... (live nodes size: 5)
[junit4:junit4]   2> 18506 T24 oascc.ZkStateReader.updateClusterState Updating cloud state from ZooKeeper... 
[junit4:junit4]   2> 18508 T24 oasc.AbstractDistribZkTestBase.waitForRecoveriesToFinish Recoveries finished - collection: unloadcollection
[junit4:junit4]   2> 18508 T24 oascsi.HttpClientUtil.createClient Creating new http client, config:maxConnections=128&maxConnectionsPerHost=32&followRedirects=false
[junit4:junit4]   2>  C2_STATE=coll:unloadcollection core:unloadcollection2 props:{shard=shard1, node_name=127.0.0.1:39492_, collection=unloadcollection, base_url=http://127.0.0.1:39492, core=unloadcollection2, state=active}
[junit4:junit4]   2> 18564 T73 C2 P39492 /update {update.distrib=FROMLEADER&wt=javabin&distrib.from=http://127.0.0.1:34870/unloadcollection1/&version=2} {add=[6 (1429986822746800128)]} 0 5
[junit4:junit4]   2> 18566 T61 C3 P34870 /update {wt=javabin&version=2} {add=[6 (1429986822746800128)]} 0 40
[junit4:junit4]   2> 18580 T74 C2 P39492 /update {update.distrib=FROMLEADER&wt=javabin&distrib.from=http://127.0.0.1:34870/unloadcollection1/&version=2} {add=[7 (1429986822783500288)]} 0 3
[junit4:junit4]   2> 18581 T60 C3 P34870 /update {wt=javabin&version=2} {add=[7 (1429986822783500288)]} 0 12
[junit4:junit4]   2> 18592 T75 C2 P39492 /update {update.distrib=FROMLEADER&wt=javabin&distrib.from=http://127.0.0.1:34870/unloadcollection1/&version=2} {add=[8 (1429986822799228928)]} 0 2
[junit4:junit4]   2> 18593 T57 C3 P34870 /update {wt=javabin&version=2} {add=[8 (1429986822799228928)]} 0 9
[junit4:junit4]   2> 18597 T59 C3 P34870 oasu.DirectUpdateHandler2.commit start commit{,optimize=false,openSearcher=true,waitSearcher=true,expungeDeletes=false,softCommit=false,prepareCommit=false}
[junit4:junit4]   2> 18607 T59 C3 P34870 oasc.SolrDeletionPolicy.onCommit SolrDeletionPolicy.onCommit: commits:num=2
[junit4:junit4]   2> 		commit{dir=MockDirWrapper(org.apache.lucene.store.RAMDirectory@3b77cb58 lockFactory=org.apache.lucene.store.NativeFSLockFactory@5867454c),segFN=segments_2,generation=2,filenames=[segments_2]
[junit4:junit4]   2> 		commit{dir=MockDirWrapper(org.apache.lucene.store.RAMDirectory@3b77cb58 lockFactory=org.apache.lucene.store.NativeFSLockFactory@5867454c),segFN=segments_3,generation=3,filenames=[_0.tip, _0.dvd, _0.fdt, segments_3, _0.si, _0.nvm, _0.fdx, _0.nvd, _0.pos, _0.tim, _0.dvm, _0.doc, _0.fnm]
[junit4:junit4]   2> 18607 T59 C3 P34870 oasc.SolrDeletionPolicy.updateCommits newest commit = 3[_0.tip, _0.dvd, _0.fdt, segments_3, _0.si, _0.nvm, _0.fdx, _0.nvd, _0.pos, _0.tim, _0.dvm, _0.doc, _0.fnm]
[junit4:junit4]   2> 18609 T59 C3 P34870 oass.SolrIndexSearcher.<init> Opening Searcher@1e61860f main
[junit4:junit4]   2> 18610 T59 C3 P34870 oasu.DirectUpdateHandler2.commit end_commit_flush
[junit4:junit4]   2> 18611 T109 oasc.SolrCore.registerSearcher [unloadcollection1] Registered new searcher Searcher@1e61860f main{StandardDirectoryReader(segments_3:3:nrt _0(5.0):C3)}
[junit4:junit4]   2> 18612 T59 C3 P34870 oasu.SolrCmdDistributor.distribCommit Distrib commit to:[StdNode: http://127.0.0.1:39492/unloadcollection2/] params:commit_end_point=true&commit=true&softCommit=false&waitSearcher=true&expungeDeletes=false
[junit4:junit4]   2> 18615 T72 C2 P39492 oasu.DirectUpdateHandler2.commit start commit{,optimize=false,openSearcher=true,waitSearcher=true,expungeDeletes=false,softCommit=false,prepareCommit=false}
[junit4:junit4]   2> 18623 T72 C2 P39492 oasc.SolrDeletionPolicy.onCommit SolrDeletionPolicy.onCommit: commits:num=2
[junit4:junit4]   2> 		commit{dir=MockDirWrapper(org.apache.lucene.store.RAMDirectory@192bf990 lockFactory=org.apache.lucene.store.NativeFSLockFactory@18b7b345),segFN=segments_2,generation=2,filenames=[segments_2]
[junit4:junit4]   2> 		commit{dir=MockDirWrapper(org.apache.lucene.store.RAMDirectory@192bf990 lockFactory=org.apache.lucene.store.NativeFSLockFactory@18b7b345),segFN=segments_3,generation=3,filenames=[_0.tip, _0.dvd, _0.fdt, segments_3, _0.si, _0.nvm, _0.fdx, _0.nvd, _0.pos, _0.tim, _0.dvm, _0.doc, _0.fnm]
[junit4:junit4]   2> 18624 T72 C2 P39492 oasc.SolrDeletionPolicy.updateCommits newest commit = 3[_0.tip, _0.dvd, _0.fdt, segments_3, _0.si, _0.nvm, _0.fdx, _0.nvd, _0.pos, _0.tim, _0.dvm, _0.doc, _0.fnm]
[junit4:junit4]   2> 18626 T72 C2 P39492 oass.SolrIndexSearcher.<init> Opening Searcher@28705abc main
[junit4:junit4]   2> 18626 T72 C2 P39492 oasu.DirectUpdateHandler2.commit end_commit_flush
[junit4:junit4]   2> 18627 T112 oasc.SolrCore.registerSearcher [unloadcollection2] Registered new searcher Searcher@28705abc main{StandardDirectoryReader(segments_3:3:nrt _0(5.0):C3)}
[junit4:junit4]   2> 18628 T72 C2 P39492 /update {softCommit=false&waitSearcher=true&expungeDeletes=false&commit=true&wt=javabin&commit_end_point=true&version=2} {commit=} 0 13
[junit4:junit4]   2> 18629 T59 C3 P34870 /update {softCommit=false&waitSearcher=true&commit=true&wt=javabin&version=2} {commit=} 0 33
[junit4:junit4]   2> 18630 T24 oascsi.HttpClientUtil.createClient Creating new http client, config:maxConnections=128&maxConnectionsPerHost=32&followRedirects=false
[junit4:junit4]   2> 18639 T86 oasc.CoreContainer.create Creating SolrCore 'unloadcollection3' using instanceDir: /mnt/ssd/jenkins/workspace/Lucene-Solr-trunk-Linux/solr/build/solr-core/test/J0/./org.apache.solr.cloud.UnloadDistributedZkTest-jetty3-1363741692404/unloadcollection3
[junit4:junit4]   2> 18640 T86 oasc.ZkController.createCollectionZkNode Check for collection zkNode:unloadcollection
[junit4:junit4]   2> 18641 T86 oasc.ZkController.createCollectionZkNode Collection zkNode exists
[junit4:junit4]   2> 18641 T86 oasc.ZkController.readConfigName Load collection config from:/collections/unloadcollection
[junit4:junit4]   2> 18643 T86 oasc.SolrResourceLoader.<init> new SolrResourceLoader for directory: '/mnt/ssd/jenkins/workspace/Lucene-Solr-trunk-Linux/solr/build/solr-core/test/J0/./org.apache.solr.cloud.UnloadDistributedZkTest-jetty3-1363741692404/unloadcollection3/'
[junit4:junit4]   2> 18674 T86 oasc.SolrConfig.<init> Using Lucene MatchVersion: LUCENE_50
[junit4:junit4]   2> 18720 T86 oasc.SolrConfig.<init> Loaded SolrConfig: solrconfig.xml
[junit4:junit4]   2> 18721 T86 oass.IndexSchema.readSchema Reading Solr Schema
[junit4:junit4]   2> 18741 T86 oass.IndexSchema.readSchema Schema name=test
[junit4:junit4]   2> 19162 T86 oass.OpenExchangeRatesOrgProvider.init Initialized with rates=open-exchange-rates.json, refreshInterval=1440.
[junit4:junit4]   2> 19173 T86 oass.IndexSchema.readSchema default search field in schema is text
[junit4:junit4]   2> 19176 T86 oass.IndexSchema.readSchema unique key field: id
[junit4:junit4]   2> 19205 T86 oass.FileExchangeRateProvider.reload Reloading exchange rates from file currency.xml
[junit4:junit4]   2> 19210 T86 oass.FileExchangeRateProvider.reload Reloading exchange rates from file currency.xml
[junit4:junit4]   2> 19216 T86 oass.OpenExchangeRatesOrgProvider.reload Reloading exchange rates from open-exchange-rates.json
[junit4:junit4]   2> 19217 T86 oass.OpenExchangeRatesOrgProvider$OpenExchangeRates.<init> WARNING Unknown key IMPORTANT NOTE
[junit4:junit4]   2> 19218 T86 oass.OpenExchangeRatesOrgProvider$OpenExchangeRates.<init> WARNING Expected key, got STRING
[junit4:junit4]   2> 19218 T86 oass.OpenExchangeRatesOrgProvider.reload Reloading exchange rates from open-exchange-rates.json
[junit4:junit4]   2> 19220 T86 oass.OpenExchangeRatesOrgProvider$OpenExchangeRates.<init> WARNING Unknown key IMPORTANT NOTE
[junit4:junit4]   2> 19221 T86 oass.OpenExchangeRatesOrgProvider$OpenExchangeRates.<init> WARNING Expected key, got STRING
[junit4:junit4]   2> 19221 T86 oasc.SolrCore.initDirectoryFactory org.apache.solr.core.MockDirectoryFactory
[junit4:junit4]   2> 19222 T86 oasc.SolrCore.<init> [unloadcollection3] Opening new SolrCore at /mnt/ssd/jenkins/workspace/Lucene-Solr-trunk-Linux/solr/build/solr-core/test/J0/./org.apache.solr.cloud.UnloadDistributedZkTest-jetty3-1363741692404/unloadcollection3/, dataDir=/mnt/ssd/jenkins/workspace/Lucene-Solr-trunk-Linux/solr/build/solr-core/test/J0/./solrtest-UnloadDistributedZkTest-1363741687132/1363741705752unloadcollection_3n/
[junit4:junit4]   2> 19222 T86 oasc.JmxMonitoredMap.<init> JMX monitoring is enabled. Adding Solr mbeans to JMX Server: com.sun.jmx.mbeanserver.JmxMBeanServer@34c5b17c
[junit4:junit4]   2> 19223 T86 oasc.SolrCore.initDirectoryFactory org.apache.solr.core.MockDirectoryFactory
[junit4:junit4]   2> 19224 T86 oasc.CachingDirectoryFactory.get return new directory for /mnt/ssd/jenkins/workspace/Lucene-Solr-trunk-Linux/solr/build/solr-core/test/J0/./solrtest-UnloadDistributedZkTest-1363741687132/1363741705752unloadcollection_3n forceNew: false
[junit4:junit4]   2> 19225 T86 oasc.SolrCore.getNewIndexDir New index directory detected: old=null new=/mnt/ssd/jenkins/workspace/Lucene-Solr-trunk-Linux/solr/build/solr-core/test/J0/./solrtest-UnloadDistributedZkTest-1363741687132/1363741705752unloadcollection_3n/index/
[junit4:junit4]   2> 19225 T86 oasc.SolrCore.initIndex WARNING [unloadcollection3] Solr index directory '/mnt/ssd/jenkins/workspace/Lucene-Solr-trunk-Linux/solr/build/solr-core/test/J0/./solrtest-UnloadDistributedZkTest-1363741687132/1363741705752unloadcollection_3n/index' doesn't exist. Creating new index...
[junit4:junit4]   2> 19226 T86 oasc.CachingDirectoryFactory.get return new directory for /mnt/ssd/jenkins/workspace/Lucene-Solr-trunk-Linux/solr/build/solr-core/test/J0/./solrtest-UnloadDistributedZkTest-1363741687132/1363741705752unloadcollection_3n/index forceNew: false
[junit4:junit4]   2> 19229 T86 oasc.SolrDeletionPolicy.onCommit SolrDeletionPolicy.onCommit: commits:num=1
[junit4:junit4]   2> 		commit{dir=MockDirWrapper(org.apache.lucene.store.RAMDirectory@51808d9b lockFactory=org.apache.lucene.store.NativeFSLockFactory@14819576),segFN=segments_1,generation=1,filenames=[segments_1]
[junit4:junit4]   2> 19229 T86 oasc.SolrDeletionPolicy.updateCommits newest commit = 1[segments_1]
[junit4:junit4]   2> 19232 T86 oasup.UpdateRequestProcessorChain.init inserting DistributedUpdateProcessorFactory into updateRequestProcessorChain "dedupe"
[junit4:junit4]   2> 19232 T86 oasup.UpdateRequestProcessorChain.init inserting DistributedUpdateProcessorFactory into updateRequestProcessorChain "stored_sig"
[junit4:junit4]   2> 19233 T86 oasup.UpdateRequestProcessorChain.init inserting DistributedUpdateProcessorFactory into updateRequestProcessorChain "distrib-dup-test-chain-implicit"
[junit4:junit4]   2> 19233 T86 oasc.RequestHandlers.initHandlersFromConfig created standard: solr.StandardRequestHandler
[junit4:junit4]   2> 19234 T86 oasc.RequestHandlers.initHandlersFromConfig created /get: solr.RealTimeGetHandler
[junit4:junit4]   2> 19234 T86 oasc.RequestHandlers.initHandlersFromConfig adding lazy requestHandler: solr.ReplicationHandler
[junit4:junit4]   2> 19235 T86 oasc.RequestHandlers.initHandlersFromConfig created /replication: solr.ReplicationHandler
[junit4:junit4]   2> 19235 T86 oasc.RequestHandlers.initHandlersFromConfig created /update: solr.UpdateRequestHandler
[junit4:junit4]   2> 19236 T86 oasc.RequestHandlers.initHandlersFromConfig created /admin/: org.apache.solr.handler.admin.AdminHandlers
[junit4:junit4]   2> 19239 T86 oashl.XMLLoader.init xsltCacheLifetimeSeconds=60
[junit4:junit4]   2> 19241 T86 oass.SolrIndexSearcher.<init> Opening Searcher@1ee07d93 main
[junit4:junit4]   2> 19242 T86 oasu.UpdateHandler.clearLog Clearing tlog files, tlogDir=/mnt/ssd/jenkins/workspace/Lucene-Solr-trunk-Linux/solr/build/solr-core/test/J0/./solrtest-UnloadDistributedZkTest-1363741687132/1363741705752unloadcollection_3n/tlog
[junit4:junit4]   2> 19243 T86 oasu.CommitTracker.<init> Hard AutoCommit: disabled
[junit4:junit4]   2> 19243 T86 oasu.CommitTracker.<init> Soft AutoCommit: disabled
[junit4:junit4]   2> 19247 T117 oasc.SolrCore.registerSearcher [unloadcollection3] Registered new searcher Searcher@1ee07d93 main{StandardDirectoryReader(segments_1:1)}
[junit4:junit4]   2> 19250 T86 oasc.ZkController.publish publishing core=unloadcollection3 state=down
[junit4:junit4]   2> 19250 T86 oasc.ZkController.publish numShards not found on descriptor - reading it from system property
[junit4:junit4]   2> 19312 T48 oascc.ZkStateReader.updateClusterState Updating cloud state from ZooKeeper... 
[junit4:junit4]   2> 19314 T48 oasc.Overseer$ClusterStateUpdater.updateState Update state numShards=2 message={
[junit4:junit4]   2> 	  "shard":null,
[junit4:junit4]   2> 	  "node_name":"127.0.0.1:51521_",
[junit4:junit4]   2> 	  "core_node_name":null,
[junit4:junit4]   2> 	  "collection":"unloadcollection",
[junit4:junit4]   2> 	  "base_url":"http://127.0.0.1:51521",
[junit4:junit4]   2> 	  "core":"unloadcollection3",
[junit4:junit4]   2> 	  "operation":"state",
[junit4:junit4]   2> 	  "state":"down",
[junit4:junit4]   2> 	  "numShards":"2",
[junit4:junit4]   2> 	  "roles":null}
[junit4:junit4]   2> 19314 T48 oasc.Overseer$ClusterStateUpdater.updateState Collection already exists with numShards=1
[junit4:junit4]   2> 19314 T48 oasc.Overseer$ClusterStateUpdater.updateState Assigning new node to shard shard=shard1
[junit4:junit4]   2> 19321 T47 oascc.ZkStateReader$2.process A cluster state change: WatchedEvent state:SyncConnected type:NodeDataChanged path:/clusterstate.json, has occurred - updating... (live nodes size: 5)
[junit4:junit4]   2> 19321 T79 oascc.ZkStateReader$2.process A cluster state change: WatchedEvent state:SyncConnected type:NodeDataChanged path:/clusterstate.json, has occurred - updating... (live nodes size: 5)
[junit4:junit4]   2> 19321 T111 oascc.ZkStateReader$2.process A cluster state change: WatchedEvent state:SyncConnected type:NodeDataChanged path:/clusterstate.json, has occurred - updating... (live nodes size: 5)
[junit4:junit4]   2> 19321 T107 oascc.ZkStateReader$2.process A cluster state change: WatchedEvent state:SyncConnected type:NodeDataChanged path:/clusterstate.json, has occurred - updating... (live nodes size: 5)
[junit4:junit4]   2> 19322 T93 oascc.ZkStateReader$2.process A cluster state change: WatchedEvent state:SyncConnected type:NodeDataChanged path:/clusterstate.json, has occurred - updating... (live nodes size: 5)
[junit4:junit4]   2> 19321 T52 oascc.ZkStateReader$2.process A cluster state change: WatchedEvent state:SyncConnected type:NodeDataChanged path:/clusterstate.json, has occurred - updating... (live nodes size: 5)
[junit4:junit4]   2> 19321 T65 oascc.ZkStateReader$2.process A cluster state change: WatchedEvent state:SyncConnected type:NodeDataChanged path:/clusterstate.json, has occurred - updating... (live nodes size: 5)
[junit4:junit4]   2> 20252 T86 oasc.CoreContainer.registerCore registering core: unloadcollection3
[junit4:junit4]   2> 20253 T86 oasc.ZkController.register Register replica - core:unloadcollection3 address:http://127.0.0.1:51521 collection:unloadcollection shard:shard1
[junit4:junit4]   2> 20257 T86 oasc.ZkController.register We are http://127.0.0.1:51521/unloadcollection3/ and leader is http://127.0.0.1:34870/unloadcollection1/
[junit4:junit4]   2> 20258 T86 oasc.ZkController.register No LogReplay needed for core=unloadcollection3 baseURL=http://127.0.0.1:51521
[junit4:junit4]   2> 20258 T86 oasc.ZkController.checkRecovery Core needs to recover:unloadcollection3
[junit4:junit4]   2> 20258 T86 oasu.DefaultSolrCoreState.doRecovery Running recovery - first canceling any ongoing recovery
[junit4:junit4]   2> ASYNC  NEW_CORE C4 name=unloadcollection3 org.apache.solr.core.SolrCore@5a9c42e6 url=http://127.0.0.1:51521/unloadcollection3 node=127.0.0.1:51521_ C4_STATE=coll:unloadcollection core:unloadcollection3 props:{node_name=127.0.0.1:51521_, collection=unloadcollection, base_url=http://127.0.0.1:51521, core=unloadcollection3, state=down}
[junit4:junit4]   2> 20259 T118 C4 P51521 oasc.RecoveryStrategy.run Starting recovery process.  core=unloadcollection3 recoveringAfterStartup=true
[junit4:junit4]   2> 20260 T118 C4 P51521 oasc.RecoveryStrategy.doRecovery ###### startupVersions=[]
[junit4:junit4]   2> 20260 T86 oascc.ZkStateReader.updateClusterState Updating cloud state from ZooKeeper... 
[junit4:junit4]   2> 20260 T118 C4 P51521 oasc.ZkController.publish publishing core=unloadcollection3 state=recovering
[junit4:junit4]   2> 20260 T118 C4 P51521 oasc.ZkController.publish numShards not found on descriptor - reading it from system property
[junit4:junit4]   2> 20261 T86 oasc.CoreContainer.persistFile Persisting cores config to /mnt/ssd/jenkins/workspace/Lucene-Solr-trunk-Linux/solr/build/solr-core/test/J0/./org.apache.solr.cloud.UnloadDistributedZkTest-jetty3-1363741692404/solr.xml
[junit4:junit4]   2> 20262 T118 C4 P51521 oascsi.HttpClientUtil.createClient Creating new http client, config:maxConnections=128&maxConnectionsPerHost=32&followRedirects=false
[junit4:junit4]   2> 20267 T86 oasc.SolrXMLSerializer.persistFile Persisting cores config to /mnt/ssd/jenkins/workspace/Lucene-Solr-trunk-Linux/solr/build/solr-core/test/J0/./org.apache.solr.cloud.UnloadDistributedZkTest-jetty3-1363741692404/solr.xml
[junit4:junit4]   2> 20268 T86 oass.SolrDispatchFilter.handleAdminRequest /admin/cores {collection=unloadcollection&dataDir=/mnt/ssd/jenkins/workspace/Lucene-Solr-trunk-Linux/solr/build/solr-core/test/J0/./solrtest-UnloadDistributedZkTest-1363741687132/1363741705752unloadcollection_3n&name=unloadcollection3&wt=javabin&action=CREATE&version=2} status=0 QTime=1629 
[junit4:junit4]   2> 20269 T24 oasc.AbstractDistribZkTestBase.waitForRecoveriesToFinish Wait for recoveries to finish - collection: unloadcollection failOnTimeout:true timeout (sec):230
[junit4:junit4]   2> 20270 T24 oascc.ZkStateReader.updateClusterState Updating cloud state from ZooKeeper... 
[junit4:junit4]   2> 20828 T48 oascc.ZkStateReader.updateClusterState Updating cloud state from ZooKeeper... 
[junit4:junit4]   2> 20830 T48 oasc.Overseer$ClusterStateUpdater.updateState Update state numShards=2 message={
[junit4:junit4]   2> 	  "shard":"shard1",
[junit4:junit4]   2> 	  "node_name":"127.0.0.1:51521_",
[junit4:junit4]   2> 	  "core_node_name":"127.0.0.1:51521__unloadcollection3",
[junit4:junit4]   2> 	  "collection":"unloadcollection",
[junit4:junit4]   2> 	  "base_url":"http://127.0.0.1:51521",
[junit4:junit4]   2> 	  "core":"unloadcollection3",
[junit4:junit4]   2> 	  "operation":"state",
[junit4:junit4]   2> 	  "state":"recovering",
[junit4:junit4]   2> 	  "numShards":"2",
[junit4:junit4]   2> 	  "roles":null}
[junit4:junit4]   2> 20837 T65 oascc.ZkStateReader$2.process A cluster state change: WatchedEvent state:SyncConnected type:NodeDataChanged path:/clusterstate.json, has occurred - updating... (live nodes size: 5)
[junit4:junit4]   2> 20838 T79 oascc.ZkStateReader$2.process A cluster state change: WatchedEvent state:SyncConnected type:NodeDataChanged path:/clusterstate.json, has occurred - updating... (live nodes size: 5)
[junit4:junit4]   2> 20838 T111 oascc.ZkStateReader$2.process A cluster state change: WatchedEvent state:SyncConnected type:NodeDataChanged path:/clusterstate.json, has occurred - updating... (live nodes size: 5)
[junit4:junit4]   2> 20838 T107 oascc.ZkStateReader$2.process A cluster state change: WatchedEvent state:SyncConnected type:NodeDataChanged path:/clusterstate.json, has occurred - updating... (live nodes size: 5)
[junit4:junit4]   2> 20837 T93 oascc.ZkStateReader$2.process A cluster state change: WatchedEvent state:SyncConnected type:NodeDataChanged path:/clusterstate.json, has occurred - updating... (live nodes size: 5)
[junit4:junit4]   2> 20838 T52 oascc.ZkStateReader$2.process A cluster state change: WatchedEvent state:SyncConnected type:NodeDataChanged path:/clusterstate.json, has occurred - updating... (live nodes size: 5)
[junit4:junit4]   2> 20838 T47 oascc.ZkStateReader$2.process A cluster state change: WatchedEvent state:SyncConnected type:NodeDataChanged path:/clusterstate.json, has occurred - updating... (live nodes size: 5)
[junit4:junit4]   2> 21269 T59 oass.SolrDispatchFilter.handleAdminRequest /admin/cores {onlyIfLeader=true&coreNodeName=127.0.0.1:51521__unloadcollection3&nodeName=127.0.0.1:51521_&core=unloadcollection1&checkLive=true&wt=javabin&state=recovering&action=PREPRECOVERY&version=2} status=0 QTime=1000 
[junit4:junit4]   2> 21272 T24 oascc.ZkStateReader.updateClusterState Updating cloud state from ZooKeeper... 
[junit4:junit4]   2> 22275 T24 oascc.ZkStateReader.updateClusterState Updating cloud state from ZooKeeper... 
[junit4:junit4]   2>  C4_STATE=coll:unloadcollection core:unloadcollection3 props:{shard=shard1, node_name=127.0.0.1:51521_, collection=unloadcollection, base_url=http://127.0.0.1:51521, core=unloadcollection3, state=recovering}
[junit4:junit4]   2> 23270 T118 C4 P51521 oasc.RecoveryStrategy.doRecovery Attempting to PeerSync from http://127.0.0.1:34870/unloadcollection1/ core=unloadcollection3 - recoveringAfterStartup=true
[junit4:junit4]   2> 23271 T118 C4 P51521 oasu.PeerSync.sync PeerSync: core=unloadcollection3 url=http://127.0.0.1:51521 START replicas=[http://127.0.0.1:34870/unloadcollection1/] nUpdates=100
[junit4:junit4]   2> 23271 T118 C4 P51521 oasu.PeerSync.sync WARNING no frame of reference to tell of we've missed updates
[junit4:junit4]   2> 23272 T118 C4 P51521 oasc.RecoveryStrategy.doRecovery PeerSync Recovery was not successful - trying replication. core=unloadcollection3
[junit4:junit4]   2> 23272 T118 C4 P51521 oasc.RecoveryStrategy.doRecovery Starting Replication Recovery. core=unloadcollection3
[junit4:junit4]   2> 23272 T118 C4 P51521 oasc.RecoveryStrategy.doRecovery Begin buffering updates. core=unloadcollection3
[junit4:junit4]   2> 23273 T118 C4 P51521 oasu.UpdateLog.bufferUpdates Starting to buffer updates. FSUpdateLog{state=ACTIVE, tlog=null}
[junit4:junit4]   2> 23273 T118 C4 P51521 oasc.RecoveryStrategy.replicate Attempting to replicate from http://127.0.0.1:34870/unloadcollection1/. core=unloadcollection3
[junit4:junit4]   2> 23273 T118 C4 P51521 oascsi.HttpClientUtil.createClient Creating new http client, config:maxConnections=128&maxConnectionsPerHost=32&followRedirects=false
[junit4:junit4]   2> 23278 T24 oascc.ZkStateReader.updateClusterState Updating cloud state from ZooKeeper... 
[junit4:junit4]   2> 23284 T59 C3 P34870 REQ /get {qt=/get&distrib=false&getVersions=100&wt=javabin&version=2} status=0 QTime=9 
[junit4:junit4]   2> 23284 T60 C3 P34870 oasu.DirectUpdateHandler2.commit start commit{,optimize=false,openSearcher=false,waitSearcher=true,expungeDeletes=false,softCommit=false,prepareCommit=false}
[junit4:junit4]   2> 23285 T60 C3 P34870 oasc.SolrDeletionPolicy.onCommit SolrDeletionPolicy.onCommit: commits:num=3
[junit4:junit4]   2> 		commit{dir=MockDirWrapper(org.apache.lucene.store.RAMDirectory@3b77cb58 lockFactory=org.apache.lucene.store.NativeFSLockFactory@5867454c),segFN=segments_2,generation=2,filenames=[segments_2]
[junit4:junit4]   2> 		commit{dir=MockDirWrapper(org.apache.lucene.store.RAMDirectory@3b77cb58 lockFactory=org.apache.lucene.store.NativeFSLockFactory@5867454c),segFN=segments_3,generation=3,filenames=[_0.tip, _0.dvd, _0.fdt, segments_3, _0.si, _0.nvm, _0.fdx, _0.nvd, _0.pos, _0.tim, _0.dvm, _0.doc, _0.fnm]
[junit4:junit4]   2> 		commit{dir=MockDirWrapper(org.apache.lucene.store.RAMDirectory@3b77cb58 lockFactory=org.apache.lucene.store.NativeFSLockFactory@5867454c),segFN=segments_4,generation=4,filenames=[_0.tip, _0.dvd, _0.fdt, segments_4, _0.si, _0.nvm, _0.fdx, _0.nvd, _0.pos, _0.tim, _0.dvm, _0.doc, _0.fnm]
[junit4:junit4]   2> 23286 T60 C3 P34870 oasc.SolrDeletionPolicy.updateCommits newest commit = 4[_0.tip, _0.dvd, _0.fdt, segments_4, _0.si, _0.nvm, _0.fdx, _0.nvd, _0.pos, _0.tim, _0.dvm, _0.doc, _0.fnm]
[junit4:junit4]   2> 23286 T60 C3 P34870 oasu.DirectUpdateHandler2.commit end_commit_flush
[junit4:junit4]   2> 23287 T60 C3 P34870 /update {softCommit=false&waitSearcher=true&openSearcher=false&commit=true&wt=javabin&commit_end_point=true&version=2} {commit=} 0 3
[junit4:junit4]   2> 23288 T118 C4 P51521 oash.ReplicationHandler.inform Commits will be reserved for  10000
[junit4:junit4]   2> 23288 T118 C4 P51521 oash.SnapPuller.<init>  No value set for 'pollInterval'. Timer Task not started.
[junit4:junit4]   2> 23292 T61 C3 P34870 REQ /replication {qt=/replication&command=indexversion&wt=javabin&version=2} status=0 QTime=1 
[junit4:junit4]   2> 23293 T118 C4 P51521 oash.SnapPuller.fetchLatestIndex Master's generation: 4
[junit4:junit4]   2> 23294 T118 C4 P51521 oash.SnapPuller.fetchLatestIndex Slave's generation: 1
[junit4:junit4]   2> 23294 T118 C4 P51521 oash.SnapPuller.fetchLatestIndex Starting replication process
[junit4:junit4]   2> 23300 T60 C3 P34870 REQ /replication {qt=/replication&command=filelist&wt=javabin&generation=4&version=2} status=0 QTime=3 
[junit4:junit4]   2> 23302 T118 C4 P51521 oash.SnapPuller.fetchLatestIndex Number of files in latest index in master: 13
[junit4:junit4]   2> 23304 T118 C4 P51521 oasc.CachingDirectoryFactory.get return new directory for /mnt/ssd/jenkins/workspace/Lucene-Solr-trunk-Linux/solr/build/solr-core/test/J0/./solrtest-UnloadDistributedZkTest-1363741687132/1363741705752unloadcollection_3n/index.20130320140830420 forceNew: false
[junit4:junit4]   2> 23304 T118 C4 P51521 oash.SnapPuller.fetchLatestIndex Starting download to MockDirWrapper(RateLimitedDirectoryWrapper(org.apache.lucene.store.RAMDirectory@5cdfc5c0 lockFactory=org.apache.lucene.store.NativeFSLockFactory@23c3649)) fullCopy=false
[junit4:junit4]   2> 23308 T57 C3 P34870 REQ /replication {qt=/replication&command=filecontent&checksum=true&file=_0.tip&wt=filestream&generation=4} status=0 QTime=0 
[junit4:junit4]   2> 23312 T59 C3 P34870 REQ /replication {qt=/replication&command=filecontent&checksum=true&file=_0.fdt&wt=filestream&generation=4} status=0 QTime=0 
[junit4:junit4]   2> 23316 T61 C3 P34870 REQ /replication {qt=/replication&command=filecontent&checksum=true&file=_0.dvd&wt=filestream&generation=4} status=0 QTime=0 
[junit4:junit4]   2> 23320 T60 C3 P34870 REQ /replication {qt=/replication&command=filecontent&checksum=true&file=_0.si&wt=filestream&generation=4} status=0 QTime=0 
[junit4:junit4]   2> 23324 T57 C3 P34870 REQ /replication {qt=/replication&command=filecontent&checksum=true&file=segments_4&wt=filestream&generation=4} status=0 QTime=0 
[junit4:junit4]   2> 23337 T59 C3 P34870 REQ /replication {qt=/replication&command=filecontent&checksum=true&file=_0.nvm&wt=filestream&generation=4} status=0 QTime=1 
[junit4:junit4]   2> 23341 T61 C3 P34870 REQ /replication {qt=/replication&command=filecontent&checksum=true&file=_0.fdx&wt=filestream&generation=4} status=0 QTime=0 
[junit4:junit4]   2> 23345 T60 C3 P34870 REQ /replication {qt=/replication&command=filecontent&checksum=true&file=_0.nvd&wt=filestream&generation=4} status=0 QTime=0 
[junit4:junit4]   2> 23349 T57 C3 P34870 REQ /replication {qt=/replication&command=filecontent&checksum=true&file=_0.pos&wt=filestream&generation=4} status=0 QTime=0 
[junit4:junit4]   2> 23353 T59 C3 P34870 REQ /replication {qt=/replication&command=filecontent&checksum=true&file=_0.tim&wt=filestream&generation=4} status=0 QTime=0 
[junit4:junit4]   2> 23357 T61 C3 P34870 REQ /replication {qt=/replication&command=filecontent&checksum=true&file=_0.dvm&wt=filestream&generation=4} status=0 QTime=0 
[junit4:junit4]   2> 23362 T60 C3 P34870 REQ /replication {qt=/replication&command=filecontent&checksum=true&file=_0.doc&wt=filestream&generation=4} status=0 QTime=0 
[junit4:junit4]   2> 23367 T57 C3 P34870 REQ /replication {qt=/replication&command=filecontent&checksum=true&file=_0.fnm&wt=filestream&generation=4} status=0 QTime=1 
[junit4:junit4]   2> 23368 T118 C4 P51521 oash.SnapPuller.fetchLatestIndex Total time taken for download : 0 secs
[junit4:junit4]   2> 23370 T118 C4 P51521 oasu.DefaultSolrCoreState.newIndexWriter Creating new IndexWriter...
[junit4:junit4]   2> 23370 T118 C4 P51521 oasu.DefaultSolrCoreState.newIndexWriter Waiting until IndexWriter is unused... core=unloadcollection3
[junit4:junit4]   2> 23373 T118 C4 P51521 oasc.SolrDeletionPolicy.onInit SolrDeletionPolicy.onInit: commits:num=2
[junit4:junit4]   2> 		commit{dir=MockDirWrapper(org.apache.lucene.store.RAMDirectory@51808d9b lockFactory=org.apache.lucene.store.NativeFSLockFactory@14819576),segFN=segments_1,generation=1,filenames=[segments_1]
[junit4:junit4]   2> 		commit{dir=MockDirWrapper(org.apache.lucene.store.RAMDirectory@51808d9b lockFactory=org.apache.lucene.store.NativeFSLockFactory@14819576),segFN=segments_4,generation=4,filenames=[_0.tip, _0.fdt, _0.dvd, segments_4, _0.si, _0.nvm, _0.fdx, _0.nvd, _0.pos, _0.tim, _0.dvm, _0.doc, _0.fnm]
[junit4:junit4]   2> 23373 T118 C4 P51521 oasc.SolrDeletionPolicy.updateCommits newest commit = 4[_0.tip, _0.fdt, _0.dvd, segments_4, _0.si, _0.nvm, _0.fdx, _0.nvd, _0.pos, _0.tim, _0.dvm, _0.doc, _0.fnm]
[junit4:junit4]   2> 23374 T118 C4 P51521 oasu.DefaultSolrCoreState.newIndexWriter New IndexWriter is ready to be used.
[junit4:junit4]   2> 23375 T118 C4 P51521 oass.SolrIndexSearcher.<init> Opening Searcher@71270a2 main
[junit4:junit4]   2> 23377 T117 oasc.SolrCore.registerSearcher [unloadcollection3] Registered new searcher Searcher@71270a2 main{StandardDirectoryReader(segments_4:3:nrt _0(5.0):C3)}
[junit4:junit4]   2> 23378 T118 C4 P51521 oasc.RecoveryStrategy.replay No replay needed. core=unloadcollection3
[junit4:junit4]   2> 23378 T118 C4 P51521 oasc.RecoveryStrategy.doRecovery Replication Recovery was successful - registering as Active. core=unloadcollection3
[junit4:junit4]   2> 23378 T118 C4 P51521 oasc.ZkController.publish publishing core=unloadcollection3 state=active
[junit4:junit4]   2> 23378 T118 C4 P51521 oasc.ZkController.publish numShards not found on descriptor - reading it from system property
[junit4:junit4]   2> 23380 T118 C4 P51521 oasc.RecoveryStrategy.doRecovery Finished recovery process. core=unloadcollection3
[junit4:junit4]   2> 23850 T48 oascc.ZkStateReader.updateClusterState Updating cloud state from ZooKeeper... 
[junit4:junit4]   2> 23852 T48 oasc.Overseer$ClusterStateUpdater.updateState Update state numShards=2 message={
[junit4:junit4]   2> 	  "shard":"shard1",
[junit4:junit4]   2> 	  "node_name":"127.0.0.1:51521_",
[junit4:junit4]   2> 	  "core_node_name":"127.0.0.1:51521__unloadcollection3",
[junit4:junit4]   2> 	  "collection":"unloadcollection",
[junit4:junit4]   2> 	  "base_url":"http://127.0.0.1:51521",
[junit4:junit4]   2> 	  "core":"unloadcollection3",
[junit4:junit4]   2> 	  "operation":"state",
[junit4:junit4]   2> 	  "state":"active",
[junit4:junit4]   2> 	  "numShards":"2",
[junit4:junit4]   2> 	  "roles":null}
[junit4:junit4]   2> 23867 T79 oascc.ZkStateReader$2.process A cluster state change: WatchedEvent state:SyncConnected type:NodeDataChanged path:/clusterstate.json, has occurred - updating... (live nodes size: 5)
[junit4:junit4]   2> 23867 T52 oascc.ZkStateReader$2.process A cluster state change: WatchedEvent state:SyncConnected type:NodeDataChanged path:/clusterstate.json, has occurred - updating... (live nodes size: 5)
[junit4:junit4]   2> 23867 T107 oascc.ZkStateReader$2.process A cluster state change: WatchedEvent state:SyncConnected type:NodeDataChanged path:/clusterstate.json, has occurred - updating... (live nodes size: 5)
[junit4:junit4]   2> 23867 T65 oascc.ZkStateReader$2.process A cluster state change: WatchedEvent state:SyncConnected type:NodeDataChanged path:/clusterstate.json, has occurred - updating... (live nodes size: 5)
[junit4:junit4]   2> 23867 T47 oascc.ZkStateReader$2.process A cluster state change: WatchedEvent state:SyncConnected type:NodeDataChanged path:/clusterstate.json, has occurred - updating... (live nodes size: 5)
[junit4:junit4]   2> 23867 T93 oascc.ZkStateReader$2.process A cluster state change: WatchedEvent state:SyncConnected type:NodeDataChanged path:/clusterstate.json, has occurred - updating... (live nodes size: 5)
[junit4:junit4]   2> 23867 T111 oascc.ZkStateReader$2.process A cluster state change: WatchedEvent state:SyncConnected type:NodeDataChanged path:/clusterstate.json, has occurred - updating... (live nodes size: 5)
[junit4:junit4]   2> 24282 T24 oascc.ZkStateReader.updateClusterState Updating cloud state from ZooKeeper... 
[junit4:junit4]   2> 24284 T24 oasc.AbstractDistribZkTestBase.waitForRecoveriesToFinish Recoveries finished - collection: unloadcollection
[junit4:junit4]   2> 24285 T24 oascsi.HttpClientUtil.createClient Creating new http client, config:maxConnections=128&maxConnectionsPerHost=32&followRedirects=false
[junit4:junit4]   2> 24311 T75 C2 P39492 /update {update.distrib=FROMLEADER&wt=javabin&distrib.from=http://127.0.0.1:34870/unloadcollection1/&version=2} {add=[20 (1429986828792889344)]} 0 4
[junit4:junit4]   2>  C4_STATE=coll:unloadcollection core:unloadcollection3 props:{shard=shard1, node_name=127.0.0.1:51521_, collection=unloadcollection, base_url=http://127.0.0.1:51521, core=unloadcollection3, state=active}
[junit4:junit4]   2> 24311 T86 C4 P51521 /update {update.distrib=FROMLEADER&wt=javabin&distrib.from=http://127.0.0.1:34870/unloadcollection1/&version=2} {add=[20 (1429986828792889344)]} 0 4
[junit4:junit4]   2> 24312 T59 C3 P34870 /update {update.distrib=TOLEADER&wt=javabin&distrib.from=http://127.0.0.1:51521/unloadcollection3/&version=2} {add=[20 (1429986828792889344)]} 0 12
[junit4:junit4]   2> 24313 T89 C4 P51521 /update {wt=javabin&version=2} {add=[20]} 0 18
[junit4:junit4]   2> 24330 T74 C2 P39492 /update {update.distrib=FROMLEADER&wt=javabin&distrib.from=http://127.0.0.1:34870/unloadcollection1/&version=2} {add=[21 (1429986828813860864)]} 0 4
[junit4:junit4]   2> 24331 T88 C4 P51521 /update {update.distrib=FROMLEADER&wt=javabin&distrib.from=http://127.0.0.1:34870/unloadcollection1/&version=2} {add=[21 (1429986828813860864)]} 0 5
[junit4:junit4]   2> 24332 T61 C3 P34870 /update {update.distrib=TOLEADER&wt=javabin&distrib.from=http://127.0.0.1:51521/unloadcollection3/&version=2} {add=[21 (1429986828813860864)]} 0 12
[junit4:junit4]   2> 24332 T87 C4 P51521 /update {wt=javabin&version=2} {add=[21]} 0 15
[junit4:junit4]   2> 24349 T72 C2 P39492 /update {update.distrib=FROMLEADER&wt=javabin&distrib.from=http://127.0.0.1:34870/unloadcollection1/&version=2} {add=[22 (1429986828833783808)]} 0 4
[junit4:junit4]   2> 24349 T89 C4 P51521 /update {update.distrib=FROMLEADER&wt=javabin&distrib.from=http://127.0.0.1:34870/unloadcollection1/&version=2} {add=[22 (1429986828833783808)]} 0 4
[junit4:junit4]   2> 24350 T60 C3 P34870 /update {update.distrib=TOLEADER&wt=javabin&distrib.from=http://127.0.0.1:51521/unloadcollection3/&version=2} {add=[22 (1429986828833783808)]} 0 11
[junit4:junit4]   2> 24351 T86 C4 P51521 /update {wt=javabin&version=2} {add=[22]} 0 15
[junit4:junit4]   2> 24364 T73 C2 P39492 /update {update.distrib=FROMLEADER&wt=javabin&distrib.from=http://127.0.0.1:34870/unloadcollection1/&version=2} {add=[23 (1429986828852658176)]} 0 2
[junit4:junit4]   2> 24365 T87 C4 P51521 /update {update.distrib=FROMLEADER&wt=javabin&distrib.from=http://127.0.0.1:34870/unloadcollection1/&version=2} {add=[23 (1429986828852658176)]} 0 3
[junit4:junit4]   2> 24366 T57 C3 P34870 /update {update.distrib=TOLEADER&wt=javabin&distrib.from=http://127.0.0.1:51521/unloadcollection3/&version=2} {add=[23 (1429986828852658176)]} 0 9
[junit4:junit4]   2> 24367 T88 C4 P51521 /update {wt=javabin&version=2} {add=[23]} 0 12
[junit4:junit4]   2> 24380 T75 C2 P39492 /update {update.distrib=FROMLEADER&wt=javabin&distrib.from=http://127.0.0.1:34870/unloadcollection1/&version=2} {add=[24 (1429986828868386816)]} 0 3
[junit4:junit4]   2> 24380 T86 C4 P51521 /update {update.distrib=FROMLEADER&wt=javabin&distrib.from=http://127.0.0.1:34870/unloadcollection1/&version=2} {add=[24 (1429986828868386816)]} 0 3
[junit4:junit4]   2> 24381 T59 C3 P34870 /update {update.distrib=TOLEADER&wt=javabin&distrib.from=http://127.0.0.1:51521/unloadcollection3/&version=2} {add=[24 (1429986828868386816)]} 0 8
[junit4:junit4]   2> 24382 T89 C4 P51521 /update {wt=javabin&version=2} {add=[24]} 0 12
[junit4:junit4]   2> 24396 T88 C4 P51521 /update {update.distrib=FROMLEADER&wt=javabin&distrib.from=http://127.0.0.1:34870/unloadcollection1/&version=2} {add=[25 (1429986828884115456)]} 0 3
[junit4:junit4]   2> 24396 T74 C2 P39492 /update {update.distrib=FROMLEADER&wt=javabin&distrib.from=http://127.0.0.1:34870/unloadcollection1/&version=2} {add=[25 (1429986828884115456)]} 0 2
[junit4:junit4]   2> 24397 T61 C3 P34870 /update {update.distrib=TOLEADER&wt=javabin&distrib.from=http://127.0.0.1:51521/unloadcollection3/&version=2} {add=[25 (1429986828884115456)]} 0 9
[junit4:junit4]   2> 24398 T87 C4 P51521 /update {wt=javabin&version=2} {add=[25]} 0 13
[junit4:junit4]   2> 24411 T72 C2 P39492 /update {update.distrib=FROMLEADER&wt=javabin&distrib.from=http://127.0.0.1:34870/unloadcollection1/&version=2} {add=[26 (1429986828901941248)]} 0 2
[junit4:junit4]   2> 24412 T89 C4 P51521 /update {update.distrib=FROMLEADER&wt=javabin&distrib.from=http://127.0.0.1:34870/unloadcollection1/&version=2} {add=[26 (1429986828901941248)]} 0 3
[junit4:junit4]   2> 24413 T60 C3 P34870 /update {update.distrib=TOLEADER&wt=javabin&distrib.from=http://127.0.0.1:51521/unloadcollection3/&version=2} {add=[26 (1429986828901941248)]} 0 9
[junit4:junit4]   2> 24414 T86 C4 P51521 /update {wt=javabin&version=2} {add=[26]} 0 13
[junit4:junit4]   2> 24428 T73 C2 P39492 /update {update.distrib=FROMLEADER&wt=javabin&distrib.from=http://127.0.0.1:34870/unloadcollection1/&version=2} {add=[27 (1429986828918718464)]} 0 2
[junit4:junit4]   2> 24429 T87 C4 P51521 /update {update.distrib=FROMLEADER&wt=javabin&distrib.from=http://127.0.0.1:34870/unloadcollection1/&version=2} {add=[27 (1429986828918718464)]} 0 3
[junit4:junit4]   2> 24430 T57 C3 P34870 /update {update.distrib=TOLEADER&wt=javabin&distrib.from=http://127.0.0.1:51521/unloadcollection3/&version=2} {add=[27 (1429986828918718464)]} 0 10
[junit4:junit4]   2> 24431 T88 C4 P51521 /update {wt=javabin&version=2} {add=[27]} 0 14
[junit4:junit4]   2> 24445 T75 C2 P39492 /update {update.distrib=FROMLEADER&wt=javabin&distrib.from=http://127.0.0.1:34870/unloadcollection1/&version=2} {add=[28 (1429986828935495680)]} 0 2
[junit4:junit4]   2> 24445 T86 C4 P51521 /update {update.distrib=FROMLEADER&wt=javabin&distrib.from=http://127.0.0.1:34870/unloadcollection1/&version=2} {add=[28 (1429986828935495680)]} 0 2
[junit4:junit4]   2> 24446 T59 C3 P34870 /update {update.distrib=TOLEADER&wt=javabin&distrib.from=http://127.0.0.1:51521/unloadcollection3/&version=2} {add=[28 (1429986828935495680)]} 0 9
[junit4:junit4]   2> 24447 T89 C4 P51521 /update {wt=javabin&version=2} {add=[28]} 0 13
[junit4:junit4]   2> 24462 T74 C2 P39492 /update {update.distrib=FROMLEADER&wt=javabin&distrib.from=http://127.0.0.1:34870/unloadcollection1/&version=2} {add=[29 (1429986828953321472)]} 0 3
[junit4:junit4]   2> 24462 T88 C4 P51521 /update {update.distrib=FROMLEADER&wt=javabin&distrib.from=http://127.0.0.1:34870/unloadcollection1/&version=2} {add=[29 (1429986828953321472)]} 0 3
[junit4:junit4]   2> 24463 T61 C3 P34870 /update {update.distrib=TOLEADER&wt=javabin&distrib.from=http://127.0.0.1:51521/unloadcollection3/&version=2} {add=[29 (1429986828953321472)]} 0 9
[junit4:junit4]   2> 24464 T87 C4 P51521 /update {wt=javabin&version=2} {add=[29]} 0 13
[junit4:junit4]   2> 24477 T72 C2 P39492 /update {update.distrib=FROMLEADER&wt=javabin&distrib.from=http://127.0.0.1:34870/unloadcollection1/&version=2} {add=[30 (1429986828970098688)]} 0 2
[junit4:junit4]   2> 24477 T89 C4 P51521 /update {update.distrib=FROMLEADER&wt=javabin&distrib.from=http://127.0.0.1:34870/unloadcollection1/&version=2} {add=[30 (1429986828970098688)]} 0 2
[junit4:junit4]   2> 24478 T60 C3 P34870 /update {update.distrib=TOLEADER&wt=javabin&distrib.from=http://127.0.0.1:51521/unloadcollection3/&version=2} {add=[30 (1429986828970098688)]} 0 8
[junit4:junit4]   2> 24479 T86 C4 P51521 /update {wt=javabin&version=2} {add=[30]} 0 12
[junit4:junit4]   2> 24493 T73 C2 P39492 /update {update.distrib=FROMLEADER&wt=javabin&distrib.from=http://127.0.0.1:34870/unloadcollection1/&version=2} {add=[31 (1429986828986875904)]} 0 2
[junit4:junit4]   2> 24494 T87 C4 P51521 /update {update.distrib=FROMLEADER&wt=javabin&distrib.from=http://127.0.0.1:34870/unloadcollection1/&version=2} {add=[31 (1429986828986875904)]} 0 3
[junit4:junit4]   2> 24495 T57 C3 P34870 /update {update.distrib=TOLEADER&wt=javabin&distrib.from=http://127.0.0.1:51521/unloadcollection3/&version=2} {add=[31 (1429986828986875904)]} 0 9
[junit4:junit4]   2> 24496 T88 C4 P51521 /update {wt=javabin&version=2} {add=[31]} 0 13
[junit4:junit4]   2> 24512 T86 C4 P51521 /update {update.distrib=FROMLEADER&wt=javabin&distrib.from=http://127.0.0.1:34870/unloadcollection1/&version=2} {add=[32 (1429986829004701696)]} 0 3
[junit4:junit4]   2> 24513 T75 C2 P39492 /update {update.distrib=FROMLEADER&wt=javabin&distrib.from=http://127.0.0.1:34870/unloadcollection1/&version=2} {add=[32 (1429986829004701696)]} 0 4
[junit4:junit4]   2> 24514 T61 C3 P34870 /update {update.distrib=TOLEADER&wt=javabin&distrib.from=http://127.0.0.1:51521/unloadcollection3/&version=2} {add=[32 (1429986829004701696)]} 0 11
[junit4:junit4]   2> 24515 T89 C4 P51521 /update {wt=javabin&version=2} {add=[32]} 0 15
[junit4:junit4]   2> 24530 T74 C2 P39492 /update {update.distrib=FROMLEADER&wt=javabin&distrib.from=http://127.0.0.1:34870/unloadcollection1/&version=2} {add=[33 (1429986829024624640)]} 0 2
[junit4:junit4]   2> 24531 T88 C4 P51521 /update {update.distrib=FROMLEADER&wt=javabin&distrib.from=http://127.0.0.1:34870/unloadcollection1/&version=2} {add=[33 (1429986829024624640)]} 0 3
[junit4:junit4]   2> 24532 T60 C3 P34870 /update {update.distrib=TOLEADER&wt=javabin&distrib.from=http://127.0.0.1:51521/unloadcollection3/&version=2} {add=[33 (1429986829024624640)]} 0 10
[junit4:junit4]   2> 24533 T87 C4 P51521 /update {wt=javabin&version=2} {add=[33]} 0 15
[junit4:junit4]   2> 24549 T89 C4 P51521 /update {update.distrib=FROMLEADER&wt=javabin&distrib.from=http://127.0.0.1:34870/unloadcollection1/&version=2} {add=[34 (1429986829044547584)]} 0 2
[junit4:junit4]   2> 24549 T72 C2 P39492 /update {update.distrib=FROMLEADER&wt=javabin&distrib.from=http://127.0.0.1:34870/unloadcollection1/&version=2} {add=[34 (1429986829044547584)]} 0 2
[junit4:junit4]   2> 24550 T59 C3 P34870 /update {update.distrib=TOLEADER&wt=javabin&distrib.from=http://127.0.0.1:51521/unloadcollection3/&version=2} {add=[34 (1429986829044547584)]} 0 9
[junit4:junit4]   2> 24551 T86 C4 P51521 /update {wt=javabin&version=2} {add=[34]} 0 14
[junit4:junit4]   2> 24564 T87 C4 P51521 /update {update.distrib=FROMLEADER&wt=javabin&distrib.from=http://127.0.0.1:34870/unloadcollection1/&version=2} {add=[35 (1429986829061324800)]} 0 2
[junit4:junit4]   2> 24564 T73 C2 P39492 /update {update.distrib=FROMLEADER&wt=javabin&distrib.from=http://127.0.0.1:34870/unloadcollection1/&version=2} {add=[35 (1429986829061324800)]} 0 2
[junit4:junit4]   2> 24566 T57 C3 P34870 /update {update.distrib=TOLEADER&wt=javabin&distrib.from=http://127.0.0.1:51521/unloadcollection3/&version=2} {add=[35 (1429986829061324800)]} 0 9
[junit4:junit4]   2> 24567 T88 C4 P51521 /update {wt=javabin&version=2} {add=[35]} 0 13
[junit4:junit4]   2> 24579 T86 C4 P51521 /update {update.distrib=FROMLEADER&wt=javabin&distrib.from=http://127.0.0.1:34870/unloadcollection1/&version=2} {add=[36 (1429986829078102016)]} 0 2
[junit4:junit4]   2> 24580 T75 C2 P39492 /update {update.distrib=FROMLEADER&wt=javabin&distrib.from=http://127.0.0.1:34870/unloadcollection1/&version=2} {add=[36 (1429986829078102016)]} 0 3
[junit4:junit4]   2> 24581 T61 C3 P34870 /update {update.distrib=TOLEADER&wt=javabin&distrib.from=http://127.0.0.1:51521/unloadcollection3/&version=2} {add=[36 (1429986829078102016)]} 0 9
[junit4:junit4]   2> 24582 T89 C4 P51521 /update {wt=javabin&version=2} {add=[36]} 0 12
[junit4:junit4]   2> 24596 T74 C2 P39492 /update {update.distrib=FROMLEADER&wt=javabin&distrib.from=http://127.0.0.1:34870/unloadcollection1/&version=2} {add=[37 (1429986829093830656)]} 0 3
[junit4:junit4]   2> 24596 T88 C4 P51521 /update {update.distrib=FROMLEADER&wt=javabin&distrib.from=http://127.0.0.1:34870/unloadcollection1/&version=2} {add=[37 (1429986829093830656)]} 0 3
[junit4:junit4]   2> 24597 T59 C3 P34870 /update {update.distrib=TOLEADER&wt=javabin&distrib.from=http://127.0.0.1:51521/unloadcollection3/&version=2} {add=[37 (1429986829093830656)]} 0 9
[junit4:junit4]   2> 24598 T87 C4 P51521 /update {wt=javabin&version=2} {add=[37]} 0 14
[junit4:junit4]   2> 24611 T72 C2 P39492 /update {update.distrib=FROMLEADER&wt=javabin&distrib.from=http://127.0.0.1:34870/unloadcollection1/&version=2} {add=[38 (1429986829110607872)]} 0 2
[junit4:junit4]   2> 24611 T89 C4 P51521 /update {update.distrib=FROMLEADER&wt=javabin&distrib.from=http://127.0.0.1:34870/unloadcollection1/&version=2} {add=[38 (1429986829110607872)]} 0 2
[junit4:junit4]   2> 24612 T57 C3 P34870 /update {update.distrib=TOLEADER&wt=javabin&distrib.from=http://127.0.0.1:51521/unloadcollection3/&version=2} {add=[38 (1429986829110607872)]} 0 8
[junit4:junit4]   2> 24613 T86 C4 P51521 /update {wt=javabin&version=2} {add=[38]} 0 12
[junit4:junit4]   2> 24627 T73 C2 P39492 /update {update.distrib=FROMLEADER&wt=javabin&distrib.from=http://127.0.0.1:34870/unloadcollection1/&version=2} {add=[39 (1429986829126336512)]} 0 3
[junit4:junit4]   2> 24627 T89 C4 P51521 /update {update.distrib=FROMLEADER&wt=javabin&distrib.from=http://127.0.0.1:34870/unloadcollection1/&version=2} {add=[39 (1429986829126336512)]} 0 3
[junit4:junit4]   2> 24628 T60 C3 P34870 /update {update.distrib=TOLEADER&wt=javabin&distrib.from=http://127.0.0.1:51521/unloadcollection3/&version=2} {add=[39 (1429986829126336512)]} 0 9
[junit4:junit4]   2> 24629 T87 C4 P51521 /update {wt=javabin&version=2} {add=[39]} 0 13
[junit4:junit4]   2> 24642 T88 C4 P51521 /update {update.distrib=FROMLEADER&wt=javabin&distrib.from=http://127.0.0.1:34870/unloadcollection1/&version=2} {add=[40 (1429986829143113728)]} 0 3
[junit4:junit4]   2> 24642 T75 C2 P39492 /update {update.distrib=FROMLEADER&wt=javabin&distrib.from=http://127.0.0.1:34870/unloadcollection1/&version=2} {add=[40 (1429986829143113728)]} 0 2
[junit4:junit4]   2> 24643 T61 C3 P34870 /update {update.distrib=TOLEADER&wt=javabin&distrib.from=http://127.0.0.1:51521/unloadcollection3/&version=2} {add=[40 (1429986829143113728)]} 0 8
[junit4:junit4]   2> 24644 T86 C4 P51521 /update {wt=javabin&version=2} {add=[40]} 0 12
[junit4:junit4]   2> 24657 T87 C4 P51521 /update {update.distrib=FROMLEADER&wt=javabin&distrib.from=http://127.0.0.1:34870/unloadcollection1/&version=2} {add=[41 (1429986829158842368)]} 0 3
[junit4:junit4]   2> 24657 T74 C2 P39492 /update {update.distrib=FROMLEADER&wt=javabin&distrib.from=http://127.0.0.1:34870/unloadcollection1/&version=2} {add=[41 (1429986829158842368)]} 0 2
[junit4:junit4]   2> 24658 T59 C3 P34870 /update {update.distrib=TOLEADER&wt=javabin&distrib.from=http://127.0.0.1:51521/unloadcollection3/&version=2} {add=[41 (1429986829158842368)]} 0 8
[junit4:junit4]   2> 24659 T89 C4 P51521 /update {wt=javabin&version=2} {add=[41]} 0 12
[junit4:junit4]   2> 24673 T86 C4 P51521 /update {update.distrib=FROMLEADER&wt=javabin&distrib.from=http://127.0.0.1:34870/unloadcollection1/&version=2} {add=[42 (1429986829174571008)]} 0 2
[junit4:junit4]   2> 24673 T72 C2 P39492 /update {update.distrib=FROMLEADER&wt=javabin&distrib.from=http://127.0.0.1:34870/unloadcollection1/&version=2} {add=[42 (1429986829174571008)]} 0 2
[junit4:junit4]   2> 24675 T57 C3 P34870 /update {update.distrib=TOLEADER&wt=javabin&distrib.from=http://127.0.0.1:51521/unloadcollection3/&version=2} {add=[42 (1429986829174571008)]} 0 10
[junit4:junit4]   2> 24691 T88 C4 P51521 /update {wt=javabin&version=2} {add=[42]} 0 29
[junit4:junit4]   2> 24708 T73 C2 P39492 /update {update.distrib=FROMLEADER&wt=javabin&distrib.from=http://127.0.0.1:34870/unloadcollection1/&version=2} {add=[43 (1429986829210222592)]} 0 3
[junit4:junit4]   2> 24708 T86 C4 P51521 /update {update.distrib=FROMLEADER&wt=javabin&distrib.from=http://127.0.0.1:34870/unloadcollection1/&version=2} {add=[43 (1429986829210222592)]} 0 3
[junit4:junit4]   2> 24709 T60 C3 P34870 /update {update.distrib=TOLEADER&wt=javabin&distrib.from=http://127.0.0.1:51521/unloadcollection3/&version=2} {add=[43 (1429986829210222592)]} 0 10
[junit4:junit4]   2> 24710 T89 C4 P51521 /update {wt=javabin&version=2} {add=[43]} 0 15
[junit4:junit4]   2> 24726 T72 C2 P39492 /update {update.distrib=FROMLEADER&wt=javabin&distrib.from=http://127.0.0.1:34870/unloadcollection1/&version=2} {add=[44 (1429986829230145536)]} 0 3
[junit4:junit4]   2> 24726 T88 C4 P51521 /update {update.distrib=FROMLEADER&wt=javabin&distrib.from=http://127.0.0.1:34870/unloadcollection1/&version=2} {add=[44 (1429986829230145536)]} 0 3
[junit4:junit4]   2> 24727 T61 C3 P34870 /update {update.distrib=TOLEADER&wt=javabin&distrib.from=http://127.0.0.1:51521/unloadcollection3/&version=2} {add=[44 (1429986829230145536)]} 0 10
[junit4:junit4]   2> 24728 T87 C4 P51521 /update {wt=javabin&version=2} {add=[44]} 0 14
[junit4:junit4]   2> 24743 T73 C2 P39492 /update {update.distrib=FROMLEADER&wt=javabin&distrib.from=http://127.0.0.1:34870/unloadcollection1/&version=2} {add=[45 (1429986829247971328)]} 0 3
[junit4:junit4]   2> 24744 T89 C4 P51521 /update {update.distrib=FROMLEADER&wt=javabin&distrib.from=http://127.0.0.1:34870/unloadcollection1/&version=2} {add=[45 (1429986829247971328)]} 0 3
[junit4:junit4]   2> 24745 T59 C3 P34870 /update {update.distrib=TOLEADER&wt=javabin&distrib.from=http://127.0.0.1:51521/unloadcollection3/&version=2} {add=[45 (1429986829247971328)]} 0 11
[junit4:junit4]   2> 24746 T86 C4 P51521 /update {wt=javabin&version=2} {add=[45]} 0 15
[junit4:junit4]   2> 24760 T75 C2 P39492 /update {update.distrib=FROMLEADER&wt=javabin&distrib.from=http://127.0.0.1:34870/unloadcollection1/&version=2} {add=[46 (1429986829266845696)]} 0 2
[junit4:junit4]   2> 24760 T87 C4 P51521 /update {update.distrib=FROMLEADER&wt=javabin&distrib.from=http://127.0.0.1:34870/unloadcollection1/&version=2} {add=[46 (1429986829266845696)]} 0 2
[junit4:junit4]   2> 24761 T57 C3 P34870 /update {update.distrib=TOLEADER&wt=javabin&distrib.from=http://127.0.0.1:51521/unloadcollection3/&version=2} {add=[46 (1429986829266845696)]} 0 9
[junit4:junit4]   2> 24762 T88 C4 P51521 /update {wt=javabin&version=2} {add=[46]} 0 12
[junit4:junit4]   2> 24774 T86 C4 P51521 /update {update.distrib=FROMLEADER&wt=javabin&distrib.from=http://127.0.0.1:34870/unloadcollection1/&version=2} {add=[47 (1429986829282574336)]} 0 2
[junit4:junit4]   2> 24774 T74 C2 P39492 /update {update.distrib=FROMLEADER&wt=javabin&distrib.from=http://127.0.0.1:34870/unloadcollection1/&version=2} {add=[47 (1429986829282574336)]} 0 2
[junit4:junit4]   2> 24775 T60 C3 P34870 /update {update.distrib=TOLEADER&wt=javabin&distrib.from=http://127.0.0.1:51521/unloadcollection3/&version=2} {add=[47 (1429986829282574336)]} 0 7
[junit4:junit4]   2> 24776 T89 C4 P51521 /update {wt=javabin&version=2} {add=[47]} 0 11
[junit4:junit4]   2> 24788 T88 C4 P51521 /update {update.distrib=FROMLEADER&wt=javabin&distrib.from=http://127.0.0.1:34870/unloadcollection1/&version=2} {add=[48 (1429986829297254400)]} 0 2
[junit4:junit4]   2> 24788 T72 C2 P39492 /update {update.distrib=FROMLEADER&wt=javabin&distrib.from=http://127.0.0.1:34870/unloadcollection1/&version=2} {add=[48 (1429986829297254400)]} 0 2
[junit4:junit4]   2> 24789 T61 C3 P34870 /update {update.distrib=TOLEADER&wt=javabin&distrib.from=http://127.0.0.1:51521/unloadcollection3/&version=2} {add=[48 (1429986829297254400)]} 0 8
[junit4:junit4]   2> 24790 T87 C4 P51521 /update {wt=javabin&version=2} {add=[48]} 0 11
[junit4:junit4]   2> 24801 T73 C2 P39492 /update {update.distrib=FROMLEADER&wt=javabin&distrib.from=http://127.0.0.1:34870/unloadcollection1/&version=2} {add=[49 (1429986829311934464)]} 0 2
[junit4:junit4]   2> 24801 T89 C4 P51521 /update {update.distrib=FROMLEADER&wt=javabin&distrib.from=http://127.0.0.1:34870/unloadcollection1/&version=2} {add=[49 (1429986829311934464)]} 0 2
[junit4:junit4]   2> 24802 T59 C3 P34870 /update {update.distrib=TOLEADER&wt=javabin&distrib.from=http://127.0.0.1:51521/unloadcollection3/&version=2} {add=[49 (1429986829311934464)]} 0 7
[junit4:junit4]   2> 24803 T86 C4 P51521 /update {wt=javabin&version=2} {add=[49]} 0 10
[junit4:junit4]   2> 24815 T87 C4 P51521 /update {update.distrib=FROMLEADER&wt=javabin&distrib.from=http://127.0.0.1:34870/unloadcollection1/&version=2} {add=[50 (1429986829325565952)]} 0 2
[junit4:junit4]   2> 24816 T75 C2 P39492 /update {update.distrib=FROMLEADER&wt=javabin&distrib.from=http://127.0.0.1:34870/unloadcollection1/&version=2} {add=[50 (1429986829325565952)]} 0 3
[junit4:junit4]   2> 24817 T57 C3 P34870 /update {update.distrib=TOLEADER&wt=javabin&distrib.from=http://127.0.0.1:51521/unloadcollection3/&version=2} {add=[50 (1429986829325565952)]} 0 8
[junit4:junit4]   2> 24817 T88 C4 P51521 /update {wt=javabin&version=2} {add=[50]} 0 12
[junit4:junit4]   2> 24828 T86 C4 P51521 /update {update.distrib=FROMLEADER&wt=javabin&distrib.from=http://127.0.0.1:34870/unloadcollection1/&version=2} {add=[51 (1429986829340246016)]} 0 2
[junit4:junit4]   2> 24828 T74 C2 P39492 /update {update.distrib=FROMLEADER&wt=javabin&distrib.from=http://127.0.0.1:34870/unloadcollection1/&version=2} {add=[51 (1429986829340246016)]} 0 2
[junit4:junit4]   2> 24829 T60 C3 P34870 /update {update.distrib=TOLEADER&wt=javabin&distrib.from=http://127.0.0.1:51521/unloadcollection3/&version=2} {add=[51 (1429986829340246016)]} 0 7
[junit4:junit4]   2> 24830 T89 C4 P51521 /update {wt=javabin&version=2} {add=[51]} 0 10
[junit4:junit4]   2> 24842 T88 C4 P51521 /update {update.distrib=FROMLEADER&wt=javabin&distrib.from=http://127.0.0.1:34870/unloadcollection1/&version=2} {add=[52 (1429986829353877504)]} 0 2
[junit4:junit4]   2> 24842 T72 C2 P39492 /update {update.distrib=FROMLEADER&wt=javabin&distrib.from=http://127.0.0.1:34870/unloadcollection1/&version=2} {add=[52 (1429986829353877504)]} 0 2
[junit4:junit4]   2> 24843 T61 C3 P34870 /update {update.distrib=TOLEADER&wt=javabin&distrib.from=http://127.0.0.1:51521/unloadcollection3/&version=2} {add=[52 (1429986829353877504)]} 0 8
[junit4:junit4]   2> 24844 T87 C4 P51521 /update {wt=javabin&version=2} {add=[52]} 0 11
[junit4:junit4]   2> 24855 T73 C2 P39492 /update {update.distrib=FROMLEADER&wt=javabin&distrib.from=http://127.0.0.1:34870/unloadcollection1/&version=2} {add=[53 (1429986829368557568)]} 0 2
[junit4:junit4]   2> 24855 T89 C4 P51521 /update {update.distrib=FROMLEADER&wt=javabin&distrib.from=http://127.0.0.1:34870/unloadcollection1/&version=2} {add=[53 (1429986829368557568)]} 0 2
[junit4:junit4]   2> 24856 T59 C3 P34870 /update {update.distrib=TOLEADER&wt=javabin&distrib.from=http://127.0.0.1:51521/unloadcollection3/&version=2} {add=[53 (1429986829368557568)]} 0 7
[junit4:junit4]   2> 24857 T86 C4 P51521 /update {wt=javabin&version=2} {add=[53]} 0 10
[junit4:junit4]   2> 24868 T75 C2 P39492 /update {update.distrib=FROMLEADER&wt=javabin&distrib.from=http://127.0.0.1:34870/unloadcollection1/&version=2} {add=[54 (1429986829381140480)]} 0 2
[junit4:junit4]   2> 24868 T87 C4 P51521 /update {update.distrib=FROMLEADER&wt=javabin&distrib.from=http://127.0.0.1:34870/unloadcollection1/&version=2} {add=[54 (1429986829381140480)]} 0 2
[junit4:junit4]   2> 24870 T57 C3 P34870 /update {update.distrib=TOLEADER&wt=javabin&distrib.from=http://127.0.0.1:51521/unloadcollection3/&version=2} {add=[54 (1429986829381140480)]} 0 8
[junit4:junit4]   2> 24871 T88 C4 P51521 /update {wt=javabin&version=2} {add=[54]} 0 11
[junit4:junit4]   2> 24883 T86 C4 P51521 /update {update.distrib=FROMLEADER&wt=javabin&distrib.from=http://127.0.0.1:34870/unloadcollection1/&version=2} {add=[55 (1429986829396869120)]} 0 2
[junit4:junit4]   2> 24884 T74 C2 P39492 /update {update.distrib=FROMLEADER&wt=javabin&distrib.from=http://127.0.0.1:34870/unloadcollection1/&version=2} {add=[55 (1429986829396869120)]} 0 2
[junit4:junit4]   2> 24885 T60 C3 P34870 /update {update.distrib=TOLEADER&wt=javabin&distrib.from=http://127.0.0.1:51521/unloadcollection3/&version=2} {add=[55 (1429986829396869120)]} 0 8
[junit4:junit4]   2> 24886 T89 C4 P51521 /update {wt=javabin&version=2} {add=[55]} 0 12
[junit4:junit4]   2> 24899 T72 C2 P39492 /update {update.distrib=FROMLEADER&wt=javabin&distrib.from=http://127.0.0.1:34870/unloadcollection1/&version=2} {add=[56 (1429986829412597760)]} 0 2
[junit4:junit4]   2> 24899 T88 C4 P51521 /update {update.distrib=FROMLEADER&wt=javabin&distrib.from=http://127.0.0.1:34870/unloadcollection1/&version=2} {add=[56 (1429986829412597760)]} 0 2
[junit4:junit4]   2> 24900 T61 C3 P34870 /update {update.distrib=TOLEADER&wt=javabin&distrib.from=http://127.0.0.1:51521/unloadcollection3/&version=2} {add=[56 (1429986829412597760)]} 0 8
[junit4:junit4]   2> 24901 T87 C4 P51521 /update {wt=javabin&version=2} {add=[56]} 0 12
[junit4:junit4]   2> 24914 T89 C4 P51521 /update {update.distrib=FROMLEADER&wt=javabin&distrib.from=http://127.0.0.1:34870/unloadcollection1/&version=2} {add=[57 (1429986829428326400)]} 0 3
[junit4:junit4]   2> 24914 T73 C2 P39492 /update {update.distrib=FROMLEADER&wt=javabin&distrib.from=http://127.0.0.1:34870/unloadcollection1/&version=2} {add=[57 (1429986829428326400)]} 0 3
[junit4:junit4]   2> 24915 T59 C3 P34870 /update {update.distrib=TOLEADER&wt=javabin&distrib.from=http://127.0.0.1:51521/unloadcollection3/&version=2} {add=[57 (1429986829428326400)]} 0 8
[junit4:junit4]   2> 24916 T86 C4 P51521 /update {wt=javabin&version=2} {add=[57]} 0 12
[junit4:junit4]   2> 24928 T87 C4 P51521 /update {update.distrib=FROMLEADER&wt=javabin&distrib.from=http://127.0.0.1:34870/unloadcollection1/&version=2} {add=[58 (1429986829444055040)]} 0 3
[junit4:junit4]   2> 24928 T75 C2 P39492 /update {update.distrib=FROMLEADER&wt=javabin&distrib.from=http://127.0.0.1:34870/unloadcollection1/&version=2} {add=[58 (1429986829444055040)]} 0 3
[junit4:junit4]   2> 24929 T57 C3 P34870 /update {update.distrib=TOLEADER&wt=javabin&distrib.from=http://127.0.0.1:51521/unloadcollection3/&version=2} {add=[58 (1429986829444055040)]} 0 8
[junit4:junit4]   2> 24930 T88 C4 P51521 /update {wt=javabin&version=2} {add=[58]} 0 11
[junit4:junit4]   2> 24943 T86 C4 P51521 /update {update.distrib=FROMLEADER&wt=javabin&distrib.from=http://127.0.0.1:34870/unloadcollection1/&version=2} {add=[59 (1429986829459783680)]} 0 2
[junit4:junit4]   2> 24944 T74 C2 P39492 /update {update.distrib=FROMLEADER&wt=javabin&distrib.from=http://127.0.0.1:34870/unloadcollection1/&version=2} {add=[59 (1429986829459783680)]} 0 3
[junit4:junit4]   2> 24945 T60 C3 P34870 /update {update.distrib=TOLEADER&wt=javabin&distrib.from=http://127.0.0.1:51521/unloadcollection3/&version=2} {add=[59 (1429986829459783680)]} 0 9
[junit4:junit4]   2> 24945 T89 C4 P51521 /update {wt=javabin&version=2} {add=[59]} 0 12
[junit4:junit4]   2> 24958 T72 C2 P39492 /update {update.distrib=FROMLEADER&wt=javabin&distrib.from=http://127.0.0.1:34870/unloadcollection1/&version=2} {add=[60 (1429986829475512320)]} 0 2
[junit4:junit4]   2> 24958 T88 C4 P51521 /update {update.distrib=FROMLEADER&wt=javabin&distrib.from=http://127.0.0.1:34870/unloadcollection1/&version=2} {add=[60 (1429986829475512320)]} 0 2
[junit4:junit4]   2> 24959 T61 C3 P34870 /update {update.distrib=TOLEADER&wt=javabin&distrib.from=http://127.0.0.1:51521/unloadcollection3/&version=2} {add=[60 (1429986829475512320)]} 0 8
[junit4:junit4]   2> 24960 T87 C4 P51521 /update {wt=javabin&version=2} {add=[60]} 0 12
[junit4:junit4]   2> 24974 T89 C4 P51521 /update {update.distrib=FROMLEADER&wt=javabin&distrib.from=http://127.0.0.1:34870/unloadcollection1/&version=2} {add=[61 (1429986829490192384)]} 0 3


[...truncated too long message...]


[junit4:junit4]   1>     DATA: ...supressed...
[junit4:junit4]   1>     /solr/configs/conf1/protwords.txt (0)
[junit4:junit4]   1>     DATA: ...supressed...
[junit4:junit4]   1>     /solr/configs/conf1/schema.xml (0)
[junit4:junit4]   1>     DATA: ...supressed...
[junit4:junit4]   1> 
[junit4:junit4]   2> NOTE: reproduce with: ant test  -Dtestcase=BasicDistributedZk2Test -Dtests.method=testDistribSearch -Dtests.seed=3F8AF6FDA3FB4BCB -Dtests.multiplier=3 -Dtests.slow=true -Dtests.locale=de_LU -Dtests.timezone=America/Nassau -Dtests.file.encoding=US-ASCII
[junit4:junit4] ERROR   32.9s J0 | BasicDistributedZk2Test.testDistribSearch <<<
[junit4:junit4]    > Throwable #1: org.apache.solr.common.SolrException: Server at http://127.0.0.1:37870/dlifn/oc/onenodecollectioncore returned non ok status:404, message:Can not find: /dlifn/oc/onenodecollectioncore/update
[junit4:junit4]    > 	at __randomizedtesting.SeedInfo.seed([3F8AF6FDA3FB4BCB:BE6C78E5D4A42BF7]:0)
[junit4:junit4]    > 	at org.apache.solr.client.solrj.impl.HttpSolrServer.request(HttpSolrServer.java:375)
[junit4:junit4]    > 	at org.apache.solr.client.solrj.impl.HttpSolrServer.request(HttpSolrServer.java:181)
[junit4:junit4]    > 	at org.apache.solr.client.solrj.request.AbstractUpdateRequest.process(AbstractUpdateRequest.java:117)
[junit4:junit4]    > 	at org.apache.solr.client.solrj.SolrServer.add(SolrServer.java:116)
[junit4:junit4]    > 	at org.apache.solr.client.solrj.SolrServer.add(SolrServer.java:102)
[junit4:junit4]    > 	at org.apache.solr.cloud.BasicDistributedZk2Test.testNodeWithoutCollectionForwarding(BasicDistributedZk2Test.java:196)
[junit4:junit4]    > 	at org.apache.solr.cloud.BasicDistributedZk2Test.doTest(BasicDistributedZk2Test.java:89)
[junit4:junit4]    > 	at org.apache.solr.BaseDistributedSearchTestCase.testDistribSearch(BaseDistributedSearchTestCase.java:806)
[junit4:junit4]    > 	at sun.reflect.NativeMethodAccessorImpl.invoke0(Native Method)
[junit4:junit4]    > 	at sun.reflect.NativeMethodAccessorImpl.invoke(NativeMethodAccessorImpl.java:57)
[junit4:junit4]    > 	at sun.reflect.DelegatingMethodAccessorImpl.invoke(DelegatingMethodAccessorImpl.java:43)
[junit4:junit4]    > 	at java.lang.reflect.Method.invoke(Method.java:487)
[junit4:junit4]    > 	at com.carrotsearch.randomizedtesting.RandomizedRunner.invoke(RandomizedRunner.java:1559)
[junit4:junit4]    > 	at com.carrotsearch.randomizedtesting.RandomizedRunner.access$600(RandomizedRunner.java:79)
[junit4:junit4]    > 	at com.carrotsearch.randomizedtesting.RandomizedRunner$6.evaluate(RandomizedRunner.java:737)
[junit4:junit4]    > 	at com.carrotsearch.randomizedtesting.RandomizedRunner$7.evaluate(RandomizedRunner.java:773)
[junit4:junit4]    > 	at com.carrotsearch.randomizedtesting.RandomizedRunner$8.evaluate(RandomizedRunner.java:787)
[junit4:junit4]    > 	at com.carrotsearch.randomizedtesting.rules.SystemPropertiesRestoreRule$1.evaluate(SystemPropertiesRestoreRule.java:53)
[junit4:junit4]    > 	at org.apache.lucene.util.TestRuleSetupTeardownChained$1.evaluate(TestRuleSetupTeardownChained.java:50)
[junit4:junit4]    > 	at org.apache.lucene.util.TestRuleFieldCacheSanity$1.evaluate(TestRuleFieldCacheSanity.java:51)
[junit4:junit4]    > 	at org.apache.lucene.util.AbstractBeforeAfterRule$1.evaluate(AbstractBeforeAfterRule.java:46)
[junit4:junit4]    > 	at com.carrotsearch.randomizedtesting.rules.SystemPropertiesInvariantRule$1.evaluate(SystemPropertiesInvariantRule.java:55)
[junit4:junit4]    > 	at org.apache.lucene.util.TestRuleThreadAndTestName$1.evaluate(TestRuleThreadAndTestName.java:49)
[junit4:junit4]    > 	at org.apache.lucene.util.TestRuleIgnoreAfterMaxFailures$1.evaluate(TestRuleIgnoreAfterMaxFailures.java:70)
[junit4:junit4]    > 	at org.apache.lucene.util.TestRuleMarkFailure$1.evaluate(TestRuleMarkFailure.java:48)
[junit4:junit4]    > 	at com.carrotsearch.randomizedtesting.rules.StatementAdapter.evaluate(StatementAdapter.java:36)
[junit4:junit4]    > 	at com.carrotsearch.randomizedtesting.ThreadLeakControl$StatementRunner.run(ThreadLeakControl.java:358)
[junit4:junit4]    > 	at com.carrotsearch.randomizedtesting.ThreadLeakControl.forkTimeoutingTask(ThreadLeakControl.java:782)
[junit4:junit4]    > 	at com.carrotsearch.randomizedtesting.ThreadLeakControl$3.evaluate(ThreadLeakControl.java:442)
[junit4:junit4]    > 	at com.carrotsearch.randomizedtesting.RandomizedRunner.runSingleTest(RandomizedRunner.java:746)
[junit4:junit4]    > 	at com.carrotsearch.randomizedtesting.RandomizedRunner$3.evaluate(RandomizedRunner.java:648)
[junit4:junit4]    > 	at com.carrotsearch.randomizedtesting.RandomizedRunner$4.evaluate(RandomizedRunner.java:682)
[junit4:junit4]    > 	at com.carrotsearch.randomizedtesting.RandomizedRunner$5.evaluate(RandomizedRunner.java:693)
[junit4:junit4]    > 	at com.carrotsearch.randomizedtesting.rules.StatementAdapter.evaluate(StatementAdapter.java:36)
[junit4:junit4]    > 	at com.carrotsearch.randomizedtesting.rules.SystemPropertiesRestoreRule$1.evaluate(SystemPropertiesRestoreRule.java:53)
[junit4:junit4]    > 	at org.apache.lucene.util.AbstractBeforeAfterRule$1.evaluate(AbstractBeforeAfterRule.java:46)
[junit4:junit4]    > 	at org.apache.lucene.util.TestRuleStoreClassName$1.evaluate(TestRuleStoreClassName.java:42)
[junit4:junit4]    > 	at com.carrotsearch.randomizedtesting.rules.SystemPropertiesInvariantRule$1.evaluate(SystemPropertiesInvariantRule.java:55)
[junit4:junit4]    > 	at com.carrotsearch.randomizedtesting.rules.NoShadowingOrOverridesOnMethodsRule$1.evaluate(NoShadowingOrOverridesOnMethodsRule.java:39)
[junit4:junit4]    > 	at com.carrotsearch.randomizedtesting.rules.NoShadowingOrOverridesOnMethodsRule$1.evaluate(NoShadowingOrOverridesOnMethodsRule.java:39)
[junit4:junit4]    > 	at com.carrotsearch.randomizedtesting.rules.StatementAdapter.evaluate(StatementAdapter.java:36)
[junit4:junit4]    > 	at org.apache.lucene.util.TestRuleAssertionsRequired$1.evaluate(TestRuleAssertionsRequired.java:43)
[junit4:junit4]    > 	at org.apache.lucene.util.TestRuleMarkFailure$1.evaluate(TestRuleMarkFailure.java:48)
[junit4:junit4]    > 	at org.apache.lucene.util.TestRuleIgnoreAfterMaxFailures$1.evaluate(TestRuleIgnoreAfterMaxFailures.java:70)
[junit4:junit4]    > 	at org.apache.lucene.util.TestRuleIgnoreTestSuites$1.evaluate(TestRuleIgnoreTestSuites.java:55)
[junit4:junit4]    > 	at com.carrotsearch.randomizedtesting.rules.StatementAdapter.evaluate(StatementAdapter.java:36)
[junit4:junit4]    > 	at com.carrotsearch.randomizedtesting.ThreadLeakControl$StatementRunner.run(ThreadLeakControl.java:358)
[junit4:junit4]    > 	at java.lang.Thread.run(Thread.java:722)
[junit4:junit4]   2> 32877 T1836 oas.SolrTestCaseJ4.deleteCore ###deleteCore
[junit4:junit4]   2> 32881 T1835 ccr.ThreadLeakControl.checkThreadLeaks WARNING Will linger awaiting termination of 2 leaked thread(s).
[junit4:junit4]   2> 33769 T1839 oazs.SessionTrackerImpl.run SessionTrackerImpl exited loop!
[junit4:junit4]   2> NOTE: test params are: codec=Lucene42: {}, docValues:{}, sim=DefaultSimilarity, locale=de_LU, timezone=America/Nassau
[junit4:junit4]   2> NOTE: Linux 3.2.0-39-generic amd64/Oracle Corporation 1.8.0-ea (64-bit)/cpus=8,threads=2,free=64038976,total=157536256
[junit4:junit4]   2> NOTE: All tests run in this JVM: [TestLFUCache, SpatialFilterTest, RegexBoostProcessorTest, TestExtendedDismaxParser, PrimUtilsTest, UnloadDistributedZkTest, TestPseudoReturnFields, ScriptEngineTest, TestPerFieldSimilarity, OverseerTest, SuggesterFSTTest, AnalysisAfterCoreReloadTest, ClusterStateUpdateTest, TestQueryUtils, TermVectorComponentTest, ExternalFileFieldSortTest, SOLR749Test, SpellingQueryConverterTest, TestDocumentBuilder, TestSort, LeaderElectionTest, ReturnFieldsTest, FileBasedSpellCheckerTest, CircularListTest, SliceStateTest, SearchHandlerTest, DirectUpdateHandlerOptimizeTest, AliasIntegrationTest, MinimalSchemaTest, CacheHeaderTest, TestSolrIndexConfig, BinaryUpdateRequestHandlerTest, DocValuesTest, MBeansHandlerTest, BadComponentTest, OverseerCollectionProcessorTest, TestFuzzyAnalyzedSuggestions, LegacyHTMLStripCharFilterTest, CoreAdminHandlerTest, TestSolrDeletionPolicy1, LoggingHandlerTest, ResourceLoaderTest, TestStressRecovery, TestRemoteStreaming, UUIDFieldTest, QueryElevationComponentTest, SchemaVersionSpecificBehaviorTest, DateFieldTest, ZkControllerTest, TestQuerySenderListener, ZkCLITest, TestSurroundQueryParser, TestWriterPerf, BasicDistributedZkTest, TestLMDirichletSimilarityFactory, RAMDirectoryFactoryTest, DirectSolrConnectionTest, SolrCoreTest, JsonLoaderTest, PrimitiveFieldTypeTest, TestSearchPerf, SoftAutoCommitTest, TestConfig, SynonymTokenizerTest, TestDocSet, QueryEqualityTest, BasicDistributedZk2Test]
[junit4:junit4] Completed on J0 in 33.90s, 1 test, 1 error <<< FAILURES!

[...truncated 415 lines...]
BUILD FAILED
/mnt/ssd/jenkins/workspace/Lucene-Solr-trunk-Linux/build.xml:375: The following error occurred while executing this line:
/mnt/ssd/jenkins/workspace/Lucene-Solr-trunk-Linux/build.xml:355: The following error occurred while executing this line:
/mnt/ssd/jenkins/workspace/Lucene-Solr-trunk-Linux/build.xml:39: The following error occurred while executing this line:
/mnt/ssd/jenkins/workspace/Lucene-Solr-trunk-Linux/solr/build.xml:183: The following error occurred while executing this line:
/mnt/ssd/jenkins/workspace/Lucene-Solr-trunk-Linux/solr/common-build.xml:449: The following error occurred while executing this line:
/mnt/ssd/jenkins/workspace/Lucene-Solr-trunk-Linux/lucene/common-build.xml:1210: The following error occurred while executing this line:
/mnt/ssd/jenkins/workspace/Lucene-Solr-trunk-Linux/lucene/common-build.xml:874: There were test failures: 272 suites, 1144 tests, 1 error, 1 failure, 13 ignored (7 assumptions)

Total time: 38 minutes 12 seconds
Build step 'Invoke Ant' marked build as failure
Archiving artifacts
Recording test results
Description set: Java: 64bit/jdk1.8.0-ea-b79 -XX:+UseSerialGC
Email was triggered for: Failure
Sending email for trigger: Failure



Mime
View raw message