lucene-dev mailing list archives

Site index · List index
Message view « Date » · « Thread »
Top « Date » · « Thread »
From Policeman Jenkins Server <jenk...@thetaphi.de>
Subject [JENKINS] Lucene-Solr-trunk-Linux (32bit/ibm-j9-jdk7) - Build # 4593 - Failure!
Date Wed, 06 Mar 2013 11:00:07 GMT
Build: http://jenkins.thetaphi.de/job/Lucene-Solr-trunk-Linux/4593/
Java: 32bit/ibm-j9-jdk7 

3 tests failed.
REGRESSION:  org.apache.solr.cloud.BasicDistributedZk2Test.testDistribSearch

Error Message:
Server at http://127.0.0.1:37799/zeo/kk/onenodecollectioncore returned non ok status:404, message:Can not find: /zeo/kk/onenodecollectioncore/update

Stack Trace:
org.apache.solr.common.SolrException: Server at http://127.0.0.1:37799/zeo/kk/onenodecollectioncore returned non ok status:404, message:Can not find: /zeo/kk/onenodecollectioncore/update
	at __randomizedtesting.SeedInfo.seed([61D5E16461379449:E0336F7C1668F475]:0)
	at org.apache.solr.client.solrj.impl.HttpSolrServer.request(HttpSolrServer.java:373)
	at org.apache.solr.client.solrj.impl.HttpSolrServer.request(HttpSolrServer.java:181)
	at org.apache.solr.client.solrj.request.AbstractUpdateRequest.process(AbstractUpdateRequest.java:117)
	at org.apache.solr.client.solrj.SolrServer.add(SolrServer.java:116)
	at org.apache.solr.client.solrj.SolrServer.add(SolrServer.java:102)
	at org.apache.solr.cloud.BasicDistributedZk2Test.testNodeWithoutCollectionForwarding(BasicDistributedZk2Test.java:200)
	at org.apache.solr.cloud.BasicDistributedZk2Test.doTest(BasicDistributedZk2Test.java:89)
	at org.apache.solr.BaseDistributedSearchTestCase.testDistribSearch(BaseDistributedSearchTestCase.java:806)
	at sun.reflect.NativeMethodAccessorImpl.invoke0(Native Method)
	at sun.reflect.NativeMethodAccessorImpl.invoke(NativeMethodAccessorImpl.java:88)
	at sun.reflect.DelegatingMethodAccessorImpl.invoke(DelegatingMethodAccessorImpl.java:55)
	at java.lang.reflect.Method.invoke(Method.java:613)
	at com.carrotsearch.randomizedtesting.RandomizedRunner.invoke(RandomizedRunner.java:1559)
	at com.carrotsearch.randomizedtesting.RandomizedRunner.access$600(RandomizedRunner.java:79)
	at com.carrotsearch.randomizedtesting.RandomizedRunner$6.evaluate(RandomizedRunner.java:737)
	at com.carrotsearch.randomizedtesting.RandomizedRunner$7.evaluate(RandomizedRunner.java:773)
	at com.carrotsearch.randomizedtesting.RandomizedRunner$8.evaluate(RandomizedRunner.java:787)
	at com.carrotsearch.randomizedtesting.rules.SystemPropertiesRestoreRule$1.evaluate(SystemPropertiesRestoreRule.java:53)
	at org.apache.lucene.util.TestRuleSetupTeardownChained$1.evaluate(TestRuleSetupTeardownChained.java:50)
	at org.apache.lucene.util.TestRuleFieldCacheSanity$1.evaluate(TestRuleFieldCacheSanity.java:51)
	at org.apache.lucene.util.AbstractBeforeAfterRule$1.evaluate(AbstractBeforeAfterRule.java:46)
	at com.carrotsearch.randomizedtesting.rules.SystemPropertiesInvariantRule$1.evaluate(SystemPropertiesInvariantRule.java:55)
	at org.apache.lucene.util.TestRuleThreadAndTestName$1.evaluate(TestRuleThreadAndTestName.java:49)
	at org.apache.lucene.util.TestRuleIgnoreAfterMaxFailures$1.evaluate(TestRuleIgnoreAfterMaxFailures.java:70)
	at org.apache.lucene.util.TestRuleMarkFailure$1.evaluate(TestRuleMarkFailure.java:48)
	at com.carrotsearch.randomizedtesting.rules.StatementAdapter.evaluate(StatementAdapter.java:36)
	at com.carrotsearch.randomizedtesting.ThreadLeakControl$StatementRunner.run(ThreadLeakControl.java:358)
	at com.carrotsearch.randomizedtesting.ThreadLeakControl.forkTimeoutingTask(ThreadLeakControl.java:782)
	at com.carrotsearch.randomizedtesting.ThreadLeakControl$3.evaluate(ThreadLeakControl.java:442)
	at com.carrotsearch.randomizedtesting.RandomizedRunner.runSingleTest(RandomizedRunner.java:746)
	at com.carrotsearch.randomizedtesting.RandomizedRunner$3.evaluate(RandomizedRunner.java:648)
	at com.carrotsearch.randomizedtesting.RandomizedRunner$4.evaluate(RandomizedRunner.java:682)
	at com.carrotsearch.randomizedtesting.RandomizedRunner$5.evaluate(RandomizedRunner.java:693)
	at com.carrotsearch.randomizedtesting.rules.StatementAdapter.evaluate(StatementAdapter.java:36)
	at com.carrotsearch.randomizedtesting.rules.SystemPropertiesRestoreRule$1.evaluate(SystemPropertiesRestoreRule.java:53)
	at org.apache.lucene.util.AbstractBeforeAfterRule$1.evaluate(AbstractBeforeAfterRule.java:46)
	at org.apache.lucene.util.TestRuleStoreClassName$1.evaluate(TestRuleStoreClassName.java:42)
	at com.carrotsearch.randomizedtesting.rules.SystemPropertiesInvariantRule$1.evaluate(SystemPropertiesInvariantRule.java:55)
	at com.carrotsearch.randomizedtesting.rules.NoShadowingOrOverridesOnMethodsRule$1.evaluate(NoShadowingOrOverridesOnMethodsRule.java:39)
	at com.carrotsearch.randomizedtesting.rules.NoShadowingOrOverridesOnMethodsRule$1.evaluate(NoShadowingOrOverridesOnMethodsRule.java:39)
	at com.carrotsearch.randomizedtesting.rules.StatementAdapter.evaluate(StatementAdapter.java:36)
	at org.apache.lucene.util.TestRuleAssertionsRequired$1.evaluate(TestRuleAssertionsRequired.java:43)
	at org.apache.lucene.util.TestRuleMarkFailure$1.evaluate(TestRuleMarkFailure.java:48)
	at org.apache.lucene.util.TestRuleIgnoreAfterMaxFailures$1.evaluate(TestRuleIgnoreAfterMaxFailures.java:70)
	at org.apache.lucene.util.TestRuleIgnoreTestSuites$1.evaluate(TestRuleIgnoreTestSuites.java:55)
	at com.carrotsearch.randomizedtesting.rules.StatementAdapter.evaluate(StatementAdapter.java:36)
	at com.carrotsearch.randomizedtesting.ThreadLeakControl$StatementRunner.run(ThreadLeakControl.java:358)
	at java.lang.Thread.run(Thread.java:780)


REGRESSION:  org.apache.solr.rest.TestFieldCollectionResource.testJsonGetAllFields

Error Message:
mismatch: 'custstopfilt'!='lowerfilt' @ fields/[0]/name

Stack Trace:
java.lang.RuntimeException: mismatch: 'custstopfilt'!='lowerfilt' @ fields/[0]/name
	at __randomizedtesting.SeedInfo.seed([61D5E16461379449:E8D593E8C184D86F]:0)
	at org.apache.solr.util.RestTestBase.assertJQ(RestTestBase.java:242)
	at org.apache.solr.util.RestTestBase.assertJQ(RestTestBase.java:186)
	at org.apache.solr.rest.TestFieldCollectionResource.testJsonGetAllFields(TestFieldCollectionResource.java:50)
	at sun.reflect.NativeMethodAccessorImpl.invoke0(Native Method)
	at sun.reflect.NativeMethodAccessorImpl.invoke(NativeMethodAccessorImpl.java:88)
	at sun.reflect.DelegatingMethodAccessorImpl.invoke(DelegatingMethodAccessorImpl.java:55)
	at java.lang.reflect.Method.invoke(Method.java:613)
	at com.carrotsearch.randomizedtesting.RandomizedRunner.invoke(RandomizedRunner.java:1559)
	at com.carrotsearch.randomizedtesting.RandomizedRunner.access$600(RandomizedRunner.java:79)
	at com.carrotsearch.randomizedtesting.RandomizedRunner$6.evaluate(RandomizedRunner.java:737)
	at com.carrotsearch.randomizedtesting.RandomizedRunner$7.evaluate(RandomizedRunner.java:773)
	at com.carrotsearch.randomizedtesting.RandomizedRunner$8.evaluate(RandomizedRunner.java:787)
	at com.carrotsearch.randomizedtesting.rules.SystemPropertiesRestoreRule$1.evaluate(SystemPropertiesRestoreRule.java:53)
	at org.apache.lucene.util.TestRuleSetupTeardownChained$1.evaluate(TestRuleSetupTeardownChained.java:50)
	at org.apache.lucene.util.TestRuleFieldCacheSanity$1.evaluate(TestRuleFieldCacheSanity.java:51)
	at org.apache.lucene.util.AbstractBeforeAfterRule$1.evaluate(AbstractBeforeAfterRule.java:46)
	at com.carrotsearch.randomizedtesting.rules.SystemPropertiesInvariantRule$1.evaluate(SystemPropertiesInvariantRule.java:55)
	at org.apache.lucene.util.TestRuleThreadAndTestName$1.evaluate(TestRuleThreadAndTestName.java:49)
	at org.apache.lucene.util.TestRuleIgnoreAfterMaxFailures$1.evaluate(TestRuleIgnoreAfterMaxFailures.java:70)
	at org.apache.lucene.util.TestRuleMarkFailure$1.evaluate(TestRuleMarkFailure.java:48)
	at com.carrotsearch.randomizedtesting.rules.StatementAdapter.evaluate(StatementAdapter.java:36)
	at com.carrotsearch.randomizedtesting.ThreadLeakControl$StatementRunner.run(ThreadLeakControl.java:358)
	at com.carrotsearch.randomizedtesting.ThreadLeakControl.forkTimeoutingTask(ThreadLeakControl.java:782)
	at com.carrotsearch.randomizedtesting.ThreadLeakControl$3.evaluate(ThreadLeakControl.java:442)
	at com.carrotsearch.randomizedtesting.RandomizedRunner.runSingleTest(RandomizedRunner.java:746)
	at com.carrotsearch.randomizedtesting.RandomizedRunner$3.evaluate(RandomizedRunner.java:648)
	at com.carrotsearch.randomizedtesting.RandomizedRunner$4.evaluate(RandomizedRunner.java:682)
	at com.carrotsearch.randomizedtesting.RandomizedRunner$5.evaluate(RandomizedRunner.java:693)
	at com.carrotsearch.randomizedtesting.rules.StatementAdapter.evaluate(StatementAdapter.java:36)
	at com.carrotsearch.randomizedtesting.rules.SystemPropertiesRestoreRule$1.evaluate(SystemPropertiesRestoreRule.java:53)
	at org.apache.lucene.util.AbstractBeforeAfterRule$1.evaluate(AbstractBeforeAfterRule.java:46)
	at org.apache.lucene.util.TestRuleStoreClassName$1.evaluate(TestRuleStoreClassName.java:42)
	at com.carrotsearch.randomizedtesting.rules.SystemPropertiesInvariantRule$1.evaluate(SystemPropertiesInvariantRule.java:55)
	at com.carrotsearch.randomizedtesting.rules.NoShadowingOrOverridesOnMethodsRule$1.evaluate(NoShadowingOrOverridesOnMethodsRule.java:39)
	at com.carrotsearch.randomizedtesting.rules.NoShadowingOrOverridesOnMethodsRule$1.evaluate(NoShadowingOrOverridesOnMethodsRule.java:39)
	at com.carrotsearch.randomizedtesting.rules.StatementAdapter.evaluate(StatementAdapter.java:36)
	at org.apache.lucene.util.TestRuleAssertionsRequired$1.evaluate(TestRuleAssertionsRequired.java:43)
	at org.apache.lucene.util.TestRuleMarkFailure$1.evaluate(TestRuleMarkFailure.java:48)
	at org.apache.lucene.util.TestRuleIgnoreAfterMaxFailures$1.evaluate(TestRuleIgnoreAfterMaxFailures.java:70)
	at org.apache.lucene.util.TestRuleIgnoreTestSuites$1.evaluate(TestRuleIgnoreTestSuites.java:55)
	at com.carrotsearch.randomizedtesting.rules.StatementAdapter.evaluate(StatementAdapter.java:36)
	at com.carrotsearch.randomizedtesting.ThreadLeakControl$StatementRunner.run(ThreadLeakControl.java:358)
	at java.lang.Thread.run(Thread.java:780)


REGRESSION:  org.apache.solr.rest.TestFieldCollectionResource.testGetAllFields

Error Message:
Exception during query

Stack Trace:
java.lang.RuntimeException: Exception during query
	at __randomizedtesting.SeedInfo.seed([61D5E16461379449:8D7BABA09BC46DD1]:0)
	at org.apache.solr.util.RestTestBase.assertQ(RestTestBase.java:143)
	at org.apache.solr.rest.TestFieldCollectionResource.testGetAllFields(TestFieldCollectionResource.java:26)
	at sun.reflect.NativeMethodAccessorImpl.invoke0(Native Method)
	at sun.reflect.NativeMethodAccessorImpl.invoke(NativeMethodAccessorImpl.java:88)
	at sun.reflect.DelegatingMethodAccessorImpl.invoke(DelegatingMethodAccessorImpl.java:55)
	at java.lang.reflect.Method.invoke(Method.java:613)
	at com.carrotsearch.randomizedtesting.RandomizedRunner.invoke(RandomizedRunner.java:1559)
	at com.carrotsearch.randomizedtesting.RandomizedRunner.access$600(RandomizedRunner.java:79)
	at com.carrotsearch.randomizedtesting.RandomizedRunner$6.evaluate(RandomizedRunner.java:737)
	at com.carrotsearch.randomizedtesting.RandomizedRunner$7.evaluate(RandomizedRunner.java:773)
	at com.carrotsearch.randomizedtesting.RandomizedRunner$8.evaluate(RandomizedRunner.java:787)
	at com.carrotsearch.randomizedtesting.rules.SystemPropertiesRestoreRule$1.evaluate(SystemPropertiesRestoreRule.java:53)
	at org.apache.lucene.util.TestRuleSetupTeardownChained$1.evaluate(TestRuleSetupTeardownChained.java:50)
	at org.apache.lucene.util.TestRuleFieldCacheSanity$1.evaluate(TestRuleFieldCacheSanity.java:51)
	at org.apache.lucene.util.AbstractBeforeAfterRule$1.evaluate(AbstractBeforeAfterRule.java:46)
	at com.carrotsearch.randomizedtesting.rules.SystemPropertiesInvariantRule$1.evaluate(SystemPropertiesInvariantRule.java:55)
	at org.apache.lucene.util.TestRuleThreadAndTestName$1.evaluate(TestRuleThreadAndTestName.java:49)
	at org.apache.lucene.util.TestRuleIgnoreAfterMaxFailures$1.evaluate(TestRuleIgnoreAfterMaxFailures.java:70)
	at org.apache.lucene.util.TestRuleMarkFailure$1.evaluate(TestRuleMarkFailure.java:48)
	at com.carrotsearch.randomizedtesting.rules.StatementAdapter.evaluate(StatementAdapter.java:36)
	at com.carrotsearch.randomizedtesting.ThreadLeakControl$StatementRunner.run(ThreadLeakControl.java:358)
	at com.carrotsearch.randomizedtesting.ThreadLeakControl.forkTimeoutingTask(ThreadLeakControl.java:782)
	at com.carrotsearch.randomizedtesting.ThreadLeakControl$3.evaluate(ThreadLeakControl.java:442)
	at com.carrotsearch.randomizedtesting.RandomizedRunner.runSingleTest(RandomizedRunner.java:746)
	at com.carrotsearch.randomizedtesting.RandomizedRunner$3.evaluate(RandomizedRunner.java:648)
	at com.carrotsearch.randomizedtesting.RandomizedRunner$4.evaluate(RandomizedRunner.java:682)
	at com.carrotsearch.randomizedtesting.RandomizedRunner$5.evaluate(RandomizedRunner.java:693)
	at com.carrotsearch.randomizedtesting.rules.StatementAdapter.evaluate(StatementAdapter.java:36)
	at com.carrotsearch.randomizedtesting.rules.SystemPropertiesRestoreRule$1.evaluate(SystemPropertiesRestoreRule.java:53)
	at org.apache.lucene.util.AbstractBeforeAfterRule$1.evaluate(AbstractBeforeAfterRule.java:46)
	at org.apache.lucene.util.TestRuleStoreClassName$1.evaluate(TestRuleStoreClassName.java:42)
	at com.carrotsearch.randomizedtesting.rules.SystemPropertiesInvariantRule$1.evaluate(SystemPropertiesInvariantRule.java:55)
	at com.carrotsearch.randomizedtesting.rules.NoShadowingOrOverridesOnMethodsRule$1.evaluate(NoShadowingOrOverridesOnMethodsRule.java:39)
	at com.carrotsearch.randomizedtesting.rules.NoShadowingOrOverridesOnMethodsRule$1.evaluate(NoShadowingOrOverridesOnMethodsRule.java:39)
	at com.carrotsearch.randomizedtesting.rules.StatementAdapter.evaluate(StatementAdapter.java:36)
	at org.apache.lucene.util.TestRuleAssertionsRequired$1.evaluate(TestRuleAssertionsRequired.java:43)
	at org.apache.lucene.util.TestRuleMarkFailure$1.evaluate(TestRuleMarkFailure.java:48)
	at org.apache.lucene.util.TestRuleIgnoreAfterMaxFailures$1.evaluate(TestRuleIgnoreAfterMaxFailures.java:70)
	at org.apache.lucene.util.TestRuleIgnoreTestSuites$1.evaluate(TestRuleIgnoreTestSuites.java:55)
	at com.carrotsearch.randomizedtesting.rules.StatementAdapter.evaluate(StatementAdapter.java:36)
	at com.carrotsearch.randomizedtesting.ThreadLeakControl$StatementRunner.run(ThreadLeakControl.java:358)
	at java.lang.Thread.run(Thread.java:780)
Caused by: java.lang.RuntimeException: REQUEST FAILED: xpath=(/response/arr[@name='fields']/lst/str[@name='name'])[1] = 'custstopfilt'
	xml response was: <?xml version="1.0" encoding="UTF-8"?>
<response>

<lst name="responseHeader">
  <int name="status">0</int>
  <int name="QTime">1</int>
</lst>
<arr name="fields">
  <lst>
    <str name="name">lowerfilt</str>
    <str name="type">lowerfilt</str>
    <bool name="indexed">true</bool>
    <bool name="stored">true</bool>
  </lst>
  <lst>
    <str name="name">text_np</str>
    <str name="type">text_np</str>
    <bool name="indexed">true</bool>
    <bool name="stored">false</bool>
  </lst>
  <lst>
    <str name="name">timestamp</str>
    <str name="type">date</str>
    <bool name="indexed">true</bool>
    <bool name="stored">true</bool>
  </lst>
  <lst>
    <str name="name">id</str>
    <str name="type">string</str>
    <bool name="indexed">true</bool>
    <bool name="stored">true</bool>
    <bool name="multiValued">false</bool>
    <bool name="required">true</bool>
    <bool name="uniqueKey">true</bool>
  </lst>
  <lst>
    <str name="name">signatureField</str>
    <str name="type">string</str>
    <bool name="indexed">true</bool>
    <bool name="stored">false</bool>
  </lst>
  <lst>
    <str name="name">sindsto</str>
    <str name="type">string</str>
    <bool name="indexed">true</bool>
    <bool name="stored">true</bool>
  </lst>
  <lst>
    <str name="name">isto</str>
    <str name="type">int</str>
    <bool name="indexed">false</bool>
    <bool name="stored">true</bool>
  </lst>
  <lst>
    <str name="name">subject</str>
    <str name="type">text</str>
    <bool name="indexed">true</bool>
    <bool name="stored">true</bool>
  </lst>
  <lst>
    <str name="name">text</str>
    <str name="type">text</str>
    <bool name="indexed">true</bool>
    <bool name="stored">false</bool>
    <bool name="multiValued">true</bool>
  </lst>
  <lst>
    <str name="name">HTMLwhitetok</str>
    <str name="type">HTMLwhitetok</str>
    <bool name="indexed">true</bool>
    <bool name="stored">true</bool>
  </lst>
  <lst>
    <str name="name">wdf_nocase</str>
    <str name="type">wdf_nocase</str>
    <bool name="indexed">true</bool>
    <bool name="stored">true</bool>
  </lst>
  <lst>
    <str name="name">bind</str>
    <str name="type">boolean</str>
    <bool name="indexed">true</bool>
    <bool name="stored">false</bool>
  </lst>
  <lst>
    <str name="name">title_lettertok</str>
    <str name="type">lettertok</str>
    <bool name="indexed">true</bool>
    <bool name="stored">false</bool>
  </lst>
  <lst>
    <str name="name">test_offtv</str>
    <str name="type">text</str>
    <bool name="termOffsets">true</bool>
    <bool name="termVectors">true</bool>
  </lst>
  <lst>
    <str name="name">subword</str>
    <str name="type">subword</str>
    <bool name="indexed">true</bool>
    <bool name="stored">true</bool>
  </lst>
  <lst>
    <str name="name">title</str>
    <str name="type">nametext</str>
    <bool name="indexed">true</bool>
    <bool name="stored">true</bool>
  </lst>
  <lst>
    <str name="name">shouldbestored</str>
    <str name="type">unstored</str>
    <bool name="stored">true</bool>
  </lst>
  <lst>
    <str name="name">point_hash</str>
    <str name="type">geohash</str>
    <bool name="indexed">true</bool>
    <bool name="stored">true</bool>
    <bool name="multiValued">false</bool>
  </lst>
  <lst>
    <str name="name">custengporterfilt</str>
    <str name="type">custengporterfilt</str>
    <bool name="indexed">true</bool>
    <bool name="stored">true</bool>
  </lst>
  <lst>
    <str name="name">lettertok</str>
    <str name="type">lettertok</str>
    <bool name="indexed">true</bool>
    <bool name="stored">true</bool>
  </lst>
  <lst>
    <str name="name">test_posofftv</str>
    <str name="type">text</str>
    <bool name="termOffsets">true</bool>
    <bool name="termVectors">true</bool>
    <bool name="termPositions">true</bool>
  </lst>
  <lst>
    <str name="name">lengthfilt</str>
    <str name="type">lengthfilt</str>
    <bool name="indexed">true</bool>
    <bool name="stored">true</bool>
  </lst>
  <lst>
    <str name="name">standardtok</str>
    <str name="type">standardtok</str>
    <bool name="indexed">true</bool>
    <bool name="stored">true</bool>
  </lst>
  <lst>
    <str name="name">weight</str>
    <str name="type">float</str>
    <bool name="indexed">true</bool>
    <bool name="stored">true</bool>
  </lst>
  <lst>
    <str name="name">porterfilt</str>
    <str name="type">porterfilt</str>
    <bool name="indexed">true</bool>
    <bool name="stored">true</bool>
  </lst>
  <lst>
    <str name="name">title_stemmed</str>
    <str name="type">text</str>
    <bool name="indexed">true</bool>
    <bool name="stored">false</bool>
  </lst>
  <lst>
    <str name="name">standardtokfilt</str>
    <str name="type">standardtokfilt</str>
    <bool name="indexed">true</bool>
    <bool name="stored">true</bool>
  </lst>
  <lst>
    <str name="name">uniq</str>
    <str name="type">string</str>
    <bool name="indexed">true</bool>
    <bool name="stored">true</bool>
    <bool name="multiValued">true</bool>
  </lst>
  <lst>
    <str name="name">test_basictv</str>
    <str name="type">text</str>
    <bool name="termVectors">true</bool>
  </lst>
  <lst>
    <str name="name">whitetok</str>
    <str name="type">whitetok</str>
    <bool name="indexed">true</bool>
    <bool name="stored">true</bool>
  </lst>
  <lst>
    <str name="name">nullfirst</str>
    <str name="type">string</str>
    <bool name="indexed">true</bool>
    <bool name="stored">true</bool>
    <bool name="sortMissingFirst">true</bool>
  </lst>
  <lst>
    <str name="name">textgap</str>
    <str name="type">textgap</str>
    <bool name="indexed">true</bool>
    <bool name="stored">true</bool>
  </lst>
  <lst>
    <str name="name">name</str>
    <str name="type">nametext</str>
    <bool name="indexed">true</bool>
    <bool name="stored">true</bool>
  </lst>
  <lst>
    <str name="name">bsto</str>
    <str name="type">boolean</str>
    <bool name="indexed">false</bool>
    <bool name="stored">true</bool>
  </lst>
  <lst>
    <str name="name">sind</str>
    <str name="type">string</str>
    <bool name="indexed">true</bool>
    <bool name="stored">false</bool>
  </lst>
  <lst>
    <str name="name">stopfilt</str>
    <str name="type">stopfilt</str>
    <bool name="indexed">true</bool>
    <bool name="stored">true</bool>
  </lst>
  <lst>
    <str name="name">test_notv</str>
    <str name="type">text</str>
    <bool name="termVectors">false</bool>
  </lst>
  <lst>
    <str name="name">point</str>
    <str name="type">xy</str>
    <bool name="indexed">true</bool>
    <bool name="stored">true</bool>
    <bool name="multiValued">false</bool>
  </lst>
  <lst>
    <str name="name">wdf_preserve</str>
    <str name="type">wdf_preserve</str>
    <bool name="indexed">true</bool>
    <bool name="stored">true</bool>
  </lst>
  <lst>
    <str name="name">teststop</str>
    <str name="type">teststop</str>
    <bool name="indexed">true</bool>
    <bool name="stored">true</bool>
  </lst>
  <lst>
    <str name="name">numericsubword</str>
    <str name="type">numericsubword</str>
    <bool name="indexed">true</bool>
    <bool name="stored">true</bool>
  </lst>
  <lst>
    <str name="name">patternreplacefilt</str>
    <str name="type">patternreplacefilt</str>
    <bool name="indexed">true</bool>
    <bool name="stored">true</bool>
  </lst>
  <lst>
    <str name="name">lowertok</str>
    <str name="type">lowertok</str>
    <bool name="indexed">true</bool>
    <bool name="stored">true</bool>
  </lst>
  <lst>
    <str name="name">shouldbeunstored</str>
    <str name="type">unstored</str>
  </lst>
  <lst>
    <str name="name">sku1</str>
    <str name="type">skutype1</str>
    <bool name="indexed">true</bool>
    <bool name="stored">true</bool>
  </lst>
  <lst>
    <str name="name">pointD</str>
    <str name="type">xyd</str>
    <bool name="indexed">true</bool>
    <bool name="stored">true</bool>
    <bool name="multiValued">false</bool>
  </lst>
  <lst>
    <str name="name">sku2</str>
    <str name="type">skutype2</str>
    <bool name="indexed">true</bool>
    <bool name="stored">true</bool>
  </lst>
  <lst>
    <str name="name">uuid</str>
    <str name="type">uuid</str>
    <bool name="stored">true</bool>
  </lst>
  <lst>
    <str name="name">shouldbeunindexed</str>
    <str name="type">unstored</str>
    <bool name="indexed">false</bool>
    <bool name="stored">true</bool>
  </lst>
  <lst>
    <str name="name">nouniq</str>
    <str name="type">string</str>
    <bool name="indexed">true</bool>
    <bool name="stored">true</bool>
    <bool name="multiValued">true</bool>
  </lst>
  <lst>
    <str name="name">test_hlt</str>
    <str name="type">highlittext</str>
    <bool name="compressed">true</bool>
    <bool name="indexed">true</bool>
  </lst>
  <lst>
    <str name="name">keywordtok</str>
    <str name="type">keywordtok</str>
    <bool name="indexed">true</bool>
    <bool name="stored">true</bool>
  </lst>
  <lst>
    <str name="name">standardfilt</str>
    <str name="type">standardfilt</str>
    <bool name="indexed">true</bool>
    <bool name="stored">true</bool>
  </lst>
  <lst>
    <str name="name">syn</str>
    <str name="type">syn</str>
    <bool name="indexed">true</bool>
    <bool name="stored">true</bool>
  </lst>
  <lst>
    <str name="name">bindsto</str>
    <str name="type">boolean</str>
    <bool name="indexed">true</bool>
    <bool name="stored">true</bool>
  </lst>
  <lst>
    <str name="name">uniq2</str>
    <str name="type">string</str>
    <bool name="indexed">true</bool>
    <bool name="stored">true</bool>
    <bool name="multiValued">true</bool>
  </lst>
  <lst>
    <str name="name">uniq3</str>
    <str name="type">string</str>
    <bool name="indexed">true</bool>
    <bool name="stored">true</bool>
  </lst>
  <lst>
    <str name="name">iind</str>
    <str name="type">int</str>
    <bool name="indexed">true</bool>
    <bool name="stored">false</bool>
  </lst>
  <lst>
    <str name="name">engporterfilt</str>
    <str name="type">engporterfilt</str>
    <bool name="indexed">true</bool>
    <bool name="stored">true</bool>
  </lst>
  <lst>
    <str name="name">numberpartfail</str>
    <str name="type">failtype1</str>
    <bool name="indexed">true</bool>
    <bool name="stored">true</bool>
  </lst>
  <lst>
    <str name="name">ssto</str>
    <str name="type">string</str>
    <bool name="indexed">false</bool>
    <bool name="stored">true</bool>
  </lst>
  <lst>
    <str name="name">protectedsubword</str>
    <str name="type">protectedsubword</str>
    <bool name="indexed">true</bool>
    <bool name="stored">true</bool>
  </lst>
  <lst>
    <str name="name">dedup</str>
    <str name="type">dedup</str>
    <bool name="indexed">true</bool>
    <bool name="stored">true</bool>
  </lst>
  <lst>
    <str name="name">custstopfilt</str>
    <str name="type">custstopfilt</str>
    <bool name="indexed">true</bool>
    <bool name="stored">true</bool>
  </lst>
  <lst>
    <str name="name">store</str>
    <str name="type">location</str>
    <bool name="indexed">true</bool>
    <bool name="stored">true</bool>
  </lst>
  <lst>
    <str name="name">_version_</str>
    <str name="type">long</str>
    <bool name="indexed">true</bool>
    <bool name="stored">true</bool>
  </lst>
  <lst>
    <str name="name">HTMLstandardtok</str>
    <str name="type">HTMLstandardtok</str>
    <bool name="indexed">true</bool>
    <bool name="stored">true</bool>
  </lst>
  <lst>
    <str name="name">test_postv</str>
    <str name="type">text</str>
    <bool name="termVectors">true</bool>
    <bool name="termPositions">true</bool>
  </lst>
  <lst>
    <str name="name">test_hlt_off</str>
    <str name="type">highlittext</str>
    <bool name="compressed">false</bool>
    <bool name="indexed">true</bool>
  </lst>
  <lst>
    <str name="name">copyfield_source</str>
    <str name="type">string</str>
    <bool name="indexed">true</bool>
    <bool name="stored">true</bool>
    <bool name="multiValued">true</bool>
  </lst>
  <lst>
    <str name="name">bday</str>
    <str name="type">date</str>
    <bool name="indexed">true</bool>
    <bool name="stored">true</bool>
  </lst>
</arr>
</response>

	request was:/schema/fields?indent=on&wt=xml
	at org.apache.solr.util.RestTestBase.assertQ(RestTestBase.java:136)
	... 41 more




Build Log:
[...truncated 9032 lines...]
[junit4:junit4] Suite: org.apache.solr.rest.TestFieldCollectionResource
[junit4:junit4]   2> 0 T530 oas.SolrJettyTestBase.beforeSolrJettyTestBase Randomized ssl (true) and clientAuth (true)
[junit4:junit4]   2> 0 T530 oas.SolrTestCaseJ4.initCore ####initCore
[junit4:junit4]   2> Creating dataDir: /mnt/ssd/jenkins/workspace/Lucene-Solr-trunk-Linux/solr/build/solr-core/test/J0/./solrtest-TestFieldCollectionResource-1362566820503
[junit4:junit4]   2> 1 T530 oas.SolrTestCaseJ4.initCore ####initCore end
[junit4:junit4]   2> 2 T530 oejs.Server.doStart jetty-8.1.8.v20121106
[junit4:junit4]   2> 5 T530 oejus.SslContextFactory.doStart Enabled Protocols [TLSv1] of [SSLv3, TLSv1, TLSv1.1, TLSv1.2]
[junit4:junit4]   2> 10 T530 oejs.AbstractConnector.doStart Started SslSelectChannelConnector@127.0.0.1:46179
[junit4:junit4]   2> 11 T530 oass.SolrDispatchFilter.init SolrDispatchFilter.init()
[junit4:junit4]   2> 11 T530 oasc.SolrResourceLoader.locateSolrHome JNDI not configured for solr (NoInitialContextEx)
[junit4:junit4]   2> 12 T530 oasc.SolrResourceLoader.locateSolrHome using system property solr.solr.home: /mnt/ssd/jenkins/workspace/Lucene-Solr-trunk-Linux/solr/build/solr-core/test-files/solr
[junit4:junit4]   2> 12 T530 oasc.CoreContainer$Initializer.initialize looking for solr config file: /mnt/ssd/jenkins/workspace/Lucene-Solr-trunk-Linux/solr/build/solr-core/test-files/solr/solr.xml
[junit4:junit4]   2> 13 T530 oasc.CoreContainer.<init> New CoreContainer 1004246510
[junit4:junit4]   2> 13 T530 oasc.CoreContainer.load Loading CoreContainer using Solr Home: '/mnt/ssd/jenkins/workspace/Lucene-Solr-trunk-Linux/solr/build/solr-core/test-files/solr/'
[junit4:junit4]   2> 13 T530 oasc.SolrResourceLoader.<init> new SolrResourceLoader for directory: '/mnt/ssd/jenkins/workspace/Lucene-Solr-trunk-Linux/solr/build/solr-core/test-files/solr/'
[junit4:junit4]   2> 29 T530 oashc.HttpShardHandlerFactory.getParameter Setting socketTimeout to: 120000
[junit4:junit4]   2> 29 T530 oashc.HttpShardHandlerFactory.getParameter Setting urlScheme to: http://
[junit4:junit4]   2> 30 T530 oashc.HttpShardHandlerFactory.getParameter Setting connTimeout to: 15000
[junit4:junit4]   2> 30 T530 oashc.HttpShardHandlerFactory.getParameter Setting maxConnectionsPerHost to: 20
[junit4:junit4]   2> 31 T530 oashc.HttpShardHandlerFactory.getParameter Setting corePoolSize to: 0
[junit4:junit4]   2> 31 T530 oashc.HttpShardHandlerFactory.getParameter Setting maximumPoolSize to: 2147483647
[junit4:junit4]   2> 31 T530 oashc.HttpShardHandlerFactory.getParameter Setting maxThreadIdleTime to: 5
[junit4:junit4]   2> 32 T530 oashc.HttpShardHandlerFactory.getParameter Setting sizeOfQueue to: -1
[junit4:junit4]   2> 32 T530 oashc.HttpShardHandlerFactory.getParameter Setting fairnessPolicy to: false
[junit4:junit4]   2> 33 T530 oascsi.HttpClientUtil.createClient Creating new http client, config:maxConnectionsPerHost=20&maxConnections=10000&socketTimeout=120000&connTimeout=15000&retry=false
[junit4:junit4]   2> 38 T530 oasc.CoreContainer.load Registering Log Listener
[junit4:junit4]   2> 50 T540 oasc.CoreContainer.create Creating SolrCore 'collection1' using instanceDir: /mnt/ssd/jenkins/workspace/Lucene-Solr-trunk-Linux/solr/build/solr-core/test-files/solr/collection1
[junit4:junit4]   2> 51 T540 oasc.SolrResourceLoader.<init> new SolrResourceLoader for directory: '/mnt/ssd/jenkins/workspace/Lucene-Solr-trunk-Linux/solr/build/solr-core/test-files/solr/collection1/'
[junit4:junit4]   2> 51 T540 oasc.SolrResourceLoader.replaceClassLoader Adding 'file:/mnt/ssd/jenkins/workspace/Lucene-Solr-trunk-Linux/solr/build/solr-core/test-files/solr/collection1/lib/README' to classloader
[junit4:junit4]   2> 52 T540 oasc.SolrResourceLoader.replaceClassLoader Adding 'file:/mnt/ssd/jenkins/workspace/Lucene-Solr-trunk-Linux/solr/build/solr-core/test-files/solr/collection1/lib/classes/' to classloader
[junit4:junit4]   2> 80 T540 oasc.SolrConfig.<init> Using Lucene MatchVersion: LUCENE_50
[junit4:junit4]   2> 117 T540 oasc.SolrConfig.<init> Loaded SolrConfig: solrconfig.xml
[junit4:junit4]   2> 118 T540 oass.IndexSchema.readSchema Reading Solr Schema
[junit4:junit4]   2> 123 T540 oass.IndexSchema.readSchema Schema name=test-rest
[junit4:junit4]   2> 413 T540 oass.IndexSchema.readSchema default search field in schema is text
[junit4:junit4]   2> 415 T540 oass.IndexSchema.readSchema unique key field: id
[junit4:junit4]   2> 417 T540 oass.IndexSchema.readSchema WARNING Field title is not multivalued and destination for multiple copyFields (3)
[junit4:junit4]   2> 423 T540 oasc.SolrCore.<init> [collection1] Opening new SolrCore at /mnt/ssd/jenkins/workspace/Lucene-Solr-trunk-Linux/solr/build/solr-core/test-files/solr/collection1/, dataDir=/mnt/ssd/jenkins/workspace/Lucene-Solr-trunk-Linux/solr/build/solr-core/test/J0/solrtest-TestFieldCollectionResource-1362566820503/
[junit4:junit4]   2> 423 T540 oasc.JmxMonitoredMap.<init> JMX monitoring is enabled. Adding Solr mbeans to JMX Server: com.sun.jmx.mbeanserver.JmxMBeanServer@73894772
[junit4:junit4]   2> 423 T540 oasc.SolrCore.initDirectoryFactory org.apache.solr.core.MockDirectoryFactory
[junit4:junit4]   2> 424 T540 oasc.CachingDirectoryFactory.get return new directory for /mnt/ssd/jenkins/workspace/Lucene-Solr-trunk-Linux/solr/build/solr-core/test/J0/solrtest-TestFieldCollectionResource-1362566820503 forceNew:false
[junit4:junit4]   2> 424 T540 oasc.CachingDirectoryFactory.close Releasing directory:/mnt/ssd/jenkins/workspace/Lucene-Solr-trunk-Linux/solr/build/solr-core/test/J0/solrtest-TestFieldCollectionResource-1362566820503
[junit4:junit4]   2> 425 T540 oasc.SolrCore.getNewIndexDir New index directory detected: old=null new=/mnt/ssd/jenkins/workspace/Lucene-Solr-trunk-Linux/solr/build/solr-core/test/J0/solrtest-TestFieldCollectionResource-1362566820503/index/
[junit4:junit4]   2> 425 T540 oasc.SolrCore.initIndex WARNING [collection1] Solr index directory '/mnt/ssd/jenkins/workspace/Lucene-Solr-trunk-Linux/solr/build/solr-core/test/J0/solrtest-TestFieldCollectionResource-1362566820503/index' doesn't exist. Creating new index...
[junit4:junit4]   2> 425 T540 oasc.CachingDirectoryFactory.get return new directory for /mnt/ssd/jenkins/workspace/Lucene-Solr-trunk-Linux/solr/build/solr-core/test/J0/solrtest-TestFieldCollectionResource-1362566820503/index forceNew:false
[junit4:junit4]   2> 427 T540 oasc.SolrDeletionPolicy.onCommit SolrDeletionPolicy.onCommit: commits:num=1
[junit4:junit4]   2> 		commit{dir=RateLimitedDirectoryWrapper(MockDirWrapper(org.apache.lucene.store.RAMDirectory@21d4b942 lockFactory=org.apache.lucene.store.NativeFSLockFactory@151d3a88)),segFN=segments_1,generation=1,filenames=[segments_1]
[junit4:junit4]   2> 427 T540 oasc.SolrDeletionPolicy.updateCommits newest commit = 1[segments_1]
[junit4:junit4]   2> 427 T540 oasc.CachingDirectoryFactory.close Releasing directory:/mnt/ssd/jenkins/workspace/Lucene-Solr-trunk-Linux/solr/build/solr-core/test/J0/solrtest-TestFieldCollectionResource-1362566820503/index
[junit4:junit4]   2> 428 T540 oasc.SolrCore.initWriters created xml: solr.XMLResponseWriter
[junit4:junit4]   2> 429 T540 oasup.UpdateRequestProcessorChain.init inserting DistributedUpdateProcessorFactory into updateRequestProcessorChain "dedupe"
[junit4:junit4]   2> 430 T540 oasup.UpdateRequestProcessorChain.init inserting DistributedUpdateProcessorFactory into updateRequestProcessorChain "dedupe-allfields"
[junit4:junit4]   2> 430 T540 oasup.UpdateRequestProcessorChain.init inserting DistributedUpdateProcessorFactory into updateRequestProcessorChain "stored_sig"
[junit4:junit4]   2> 430 T540 oasup.UpdateRequestProcessorChain.init inserting DistributedUpdateProcessorFactory into updateRequestProcessorChain "uniq-fields"
[junit4:junit4]   2> 431 T540 oasup.UpdateRequestProcessorChain.init inserting DistributedUpdateProcessorFactory into updateRequestProcessorChain "distrib-dup-test-chain-implicit"
[junit4:junit4]   2> 431 T540 oasc.RequestHandlers.initHandlersFromConfig adding lazy requestHandler: solr.ReplicationHandler
[junit4:junit4]   2> 431 T540 oasc.RequestHandlers.initHandlersFromConfig created /replication: solr.ReplicationHandler
[junit4:junit4]   2> 432 T540 oasc.RequestHandlers.initHandlersFromConfig created standard: solr.StandardRequestHandler
[junit4:junit4]   2> 432 T540 oasc.RequestHandlers.initHandlersFromConfig created /get: solr.RealTimeGetHandler
[junit4:junit4]   2> 433 T540 oasc.RequestHandlers.initHandlersFromConfig created dismax: solr.SearchHandler
[junit4:junit4]   2> 433 T540 oasc.RequestHandlers.initHandlersFromConfig created mock: org.apache.solr.core.MockQuerySenderListenerReqHandler
[junit4:junit4]   2> 434 T540 oasc.RequestHandlers.initHandlersFromConfig created /admin/: org.apache.solr.handler.admin.AdminHandlers
[junit4:junit4]   2> 434 T540 oasc.RequestHandlers.initHandlersFromConfig created defaults: solr.StandardRequestHandler
[junit4:junit4]   2> 434 T540 oasc.RequestHandlers.initHandlersFromConfig adding lazy requestHandler: solr.StandardRequestHandler
[junit4:junit4]   2> 435 T540 oasc.RequestHandlers.initHandlersFromConfig created lazy: solr.StandardRequestHandler
[junit4:junit4]   2> 435 T540 oasc.RequestHandlers.initHandlersFromConfig created /update: solr.UpdateRequestHandler
[junit4:junit4]   2> 435 T540 oasc.RequestHandlers.initHandlersFromConfig created /terms: org.apache.solr.handler.component.SearchHandler
[junit4:junit4]   2> 436 T540 oasc.RequestHandlers.initHandlersFromConfig created spellCheckCompRH: org.apache.solr.handler.component.SearchHandler
[junit4:junit4]   2> 436 T540 oasc.RequestHandlers.initHandlersFromConfig created spellCheckCompRH_Direct: org.apache.solr.handler.component.SearchHandler
[junit4:junit4]   2> 437 T540 oasc.RequestHandlers.initHandlersFromConfig created spellCheckWithWordbreak: org.apache.solr.handler.component.SearchHandler
[junit4:junit4]   2> 437 T540 oasc.RequestHandlers.initHandlersFromConfig created spellCheckWithWordbreak_Direct: org.apache.solr.handler.component.SearchHandler
[junit4:junit4]   2> 438 T540 oasc.RequestHandlers.initHandlersFromConfig created spellCheckCompRH1: org.apache.solr.handler.component.SearchHandler
[junit4:junit4]   2> 438 T540 oasc.RequestHandlers.initHandlersFromConfig created mltrh: org.apache.solr.handler.component.SearchHandler
[junit4:junit4]   2> 439 T540 oasc.RequestHandlers.initHandlersFromConfig created tvrh: org.apache.solr.handler.component.SearchHandler
[junit4:junit4]   2> 439 T540 oasc.RequestHandlers.initHandlersFromConfig created /mlt: solr.MoreLikeThisHandler
[junit4:junit4]   2> 440 T540 oasc.RequestHandlers.initHandlersFromConfig created /debug/dump: solr.DumpRequestHandler
[junit4:junit4]   2> 441 T540 oashl.XMLLoader.init xsltCacheLifetimeSeconds=60
[junit4:junit4]   2> 442 T540 oasc.SolrCore.initDeprecatedSupport WARNING solrconfig.xml uses deprecated <admin/gettableFiles>, Please update your config to use the ShowFileRequestHandler.
[junit4:junit4]   2> 443 T540 oasc.SolrCore.initDeprecatedSupport WARNING adding ShowFileRequestHandler with hidden files: [BAD-SCHEMA-NOT-INDEXED-BUT-TF.XML, SCHEMA-REQUIRED-FIELDS.XML, SOLRCONFIG-MASTER1-KEEPONEBACKUP.XML, SOLRCONFIG-PROPINJECT.XML, BAD-SCHEMA-NONTEXT-ANALYZER.XML, SCHEMA-BEHAVIOR.XML, SOLRCONFIG-PROPINJECT-INDEXDEFAULT.XML, STOP-2.TXT, SCHEMA11.XML, BAD-SCHEMA-UNIQUEKEY-USES-DEFAULT.XML, SCHEMA15.XML, SOLRCONFIG-NATIVELOCK.XML, SCHEMA-SIM.XML, CONDITIONAL.UPDATEPROCESSOR.JS, SCHEMA-DOCVALUES.XML, BAD-SOLRCONFIG-MISSING-SCRIPTFILE.XML, SOLRCONFIG-SCRIPT-UPDATEPROCESSOR.XML, SOLRCONFIG-REPEATER.XML, BAD-SCHEMA-DOCVALUES-NOT-REQUIRED-NO-DEFAULT.XML, SOLRCONFIG-SPELLCHECKER.XML, SOLRCONFIG-NOCACHE.XML, SCHEMA-CHARFILTERS.XML, SOLRCONFIG-SOLCOREPROPERTIES.XML, SCHEMA-EFF.XML, SOLRCONFIG_CODEC.XML, BAD-SCHEMA-EXTERNAL-FILEFIELD.XML, HYPHENATION.DTD, TRIVIAL.UPDATEPROCESSOR1.JS, SOLRCONFIG-MERGEPOLICY.XML, SOLRCONFIG-PHRASESUGGEST.XML, SOLRCONFIG-SLAVE1.XML, SOLRCONFIG-BASIC.XML, SCHEMA-LMJELINEKMERCER.XML, BAD-MP-SOLRCONFIG.XML, JASUGGEST.TXT, BAD-SCHEMA-DUP-FIELD.XML, BAD-SCHEMA-UNIQUEKEY-MULTIVALUED.XML, SOLRCONFIG-MASTER.XML, SOLRCONFIG-HIGHLIGHT.XML, SCHEMA-TFIDF.XML, SCHEMA-REPLICATION1.XML, SYNONYMS.TXT, SOLRCONFIG-ELEVATE.XML, STOPWITHBOM.TXT, SOLRCONFIG-QUERYSENDER.XML, SOLRCONFIG-COMPONENTS-NAME.XML, SOLRCONFIG-SNIPPET-PROCESSOR.XML, WDFTYPES.TXT, BAD-SCHEMA-CURRENCY-FT-OER-NORATES.XML, SOLRCONFIG-DELPOLICY1.XML, BAD_SOLRCONFIG.XML, BAD-SCHEMA-UNSUPPORTED-DOCVALUES.XML, HUNSPELL-TEST.DIC, SCHEMA-NUMERIC.XML, SCHEMA-LUCENEMATCHVERSION.XML, KEEP-2.TXT, SCHEMA-STOP-KEEP.XML, SCHEMA-IB.XML, STOP-SNOWBALL.TXT, SCHEMA-DOCVALUESMULTI.XML, SOLRCONFIG-INDEXCONFIG.XML, SOLRCONFIG-SLAVE.XML, BAD-SCHEMA-NOT-INDEXED-BUT-NORMS.XML, STOPWORDSWRONGENCODING.TXT, THROW.ERROR.ON.ADD.UPDATEPROCESSOR.JS, STOPTYPES-1.TXT, SOLRCONFIG-SPELLCHECKCOMPONENT.XML, REGEX-BOOST-PROCESSOR-TEST.TXT, SOLRCONFIG-MINIMAL.XML, SCHEMA-DOCVALUESFACETING.XML, SOLRCONFIG-TLOG.XML, COMPOUNDDICTIONARY.TXT, SOLRCONFIG-POSTINGSHIGHLIGHT.XML, DA_COMPOUNDDICTIONARY.TXT, SOLRCONFIG-TERMINDEX.XML, BAD-SOLRCONFIG-INVALID-SCRIPTFILE.XML, SCHEMASURROUND.XML, OPEN-EXCHANGE-RATES.JSON, BAD-SCHEMA-DUP-FIELDTYPE.XML, PHRASESUGGEST.TXT, BAD-SCHEMA-CURRENCY-FT-MULTIVALUED.XML, SOLRCONFIG-MASTER2.XML, OLD_SYNONYMS.TXT, BAD-SCHEMA-UNIQUEKEY-IS-COPYFIELD-DEST.XML, SCHEMA-NOT-REQUIRED-UNIQUE-KEY.XML, BAD-SCHEMA-CODEC-GLOBAL-VS-FT-MISMATCH.XML, SCHEMA-LMDIRICHLET.XML, BAD-SCHEMA-NOT-INDEXED-BUT-POS.XML, SCHEMA-REVERSED.XML, BAD-SCHEMA-CURRENCY-MULTIVALUED.XML, SCHEMA-FOLDING.XML, SOLRCONFIG-CACHING.XML, MAPPING-ISOLATIN1ACCENT.TXT, ADDFIELDS.UPDATEPROCESSOR.JS, BAD-CURRENCY.XML, SCHEMA-BM25.XML, SOLRCONFIG-ENABLEPLUGIN.XML, STOP-1.TXT, BAD-SCHEMA-SWEETSPOT-BOTH-TF.XML, SCHEMA-REST.XML, MISSING.FUNCTIONS.UPDATEPROCESSOR.JS, SCHEMA12.XML, SOLRCONFIG-TRANSFORMERS.XML, SCHEMA-COPYFIELD-TEST.XML, BAD-SCHEMA-DUP-DYNAMICFIELD.XML, BAD-SCHEMA-SWEETSPOT-PARTIAL-BASELINE.XML, CURRENCY.XML, FUZZYSUGGEST.TXT, DA_UTF8.XML, SCHEMA-POSTINGSHIGHLIGHT.XML, MISSLEADING.EXTENSION.UPDATEPROCESSOR.JS.TXT, SOLRCONFIG-SOLR-749.XML, STOPWORDS.TXT, HUNSPELL-TEST.AFF, SOLRCONFIG_PERF.XML, SCHEMA-SWEETSPOT.XML, SOLRCONFIG-SIMPLELOCK.XML, SCHEMA-TINY.XML, BAD-SCHEMA-SWEETSPOT-PARTIAL-NORMS.XML, FRENCHARTICLES.TXT, SOLRCONFIG-LAZYWRITER.XML, SOLRCONFIG-RESPONSE-LOG-COMPONENT.XML, SCHEMA-REPLICATION2.XML, SCHEMA-SNIPPET-TYPE.XML, SCHEMA-SPATIAL.XML, BAD-SCHEMA-SWEETSPOT-PARTIAL-HYPERBOLIC.XML, SCHEMA-SPELLCHECKER.XML, SOLRCONFIG-XINCLUDE.XML, XSLT, SOLRCONFIG-DELPOLICY2.XML, KEEP-1.TXT, TRIVIAL.UPDATEPROCESSOR0.JS, BAD-SCHEMA-CURRENCY-DYNAMIC-MULTIVALUED.XML, SCHEMA-TRIE.XML, SCHEMA-BINARYFIELD.XML, BAD-SCHEMA-OMIT-TF-BUT-NOT-POS.XML, BAD-SCHEMA-CURRENCY-FT-BOGUS-CODE-IN-XML.XML, SCHEMA-MINIMAL.XML, STOPTYPES-2.TXT, SCHEMA_CODEC.XML, STEMDICT.TXT, SCHEMA-SYNONYM-TOKENIZER.XML, ELEVATE.XML, SCHEMA-COLLATE.XML, PROTWORDS.TXT, SCHEMA-XINCLUDE.XML, SCHEMA-SNIPPET-FIELD.XML, SOLRCONFIG-REQHANDLER.INCL, SCHEMA-PHRASESUGGEST.XML, SCHEMA-DFR.XML, BAD-SCHEMA-ANALYZER-CLASS-AND-NESTED.XML, SOLRCONFIG-MASTER1.XML, SOLRCONFIG-FUNCTIONQUERY.XML, SOLRCONFIG-MASTER3.XML, SOLRCONFIG-UPDATE-PROCESSOR-CHAINS.XML, SOLRCONFIG-ALTDIRECTORY.XML, BAD-SCHEMA-SIM-GLOBAL-VS-FT-MISMATCH.XML, SOLRCONFIG-QUERYSENDER-NOQUERY.XML, BAD-SOLRCONFIG-BOGUS-SCRIPTENGINE-NAME.XML, BAD-SCHEMA-CURRENCY-FT-BOGUS-DEFAULT-CODE.XML]
[junit4:junit4]   2> 445 T540 oasc.CachingDirectoryFactory.close Releasing directory:/mnt/ssd/jenkins/workspace/Lucene-Solr-trunk-Linux/solr/build/solr-core/test/J0/solrtest-TestFieldCollectionResource-1362566820503
[junit4:junit4]   2> 445 T540 oass.SolrIndexSearcher.<init> Opening Searcher@611d1ed3 main
[junit4:junit4]   2> 446 T540 oasu.CommitTracker.<init> Hard AutoCommit: disabled
[junit4:junit4]   2> 446 T540 oasu.CommitTracker.<init> Soft AutoCommit: disabled
[junit4:junit4]   2> 446 T540 oashc.SpellCheckComponent.inform Initializing spell checkers
[junit4:junit4]   2> 498 T540 oass.DirectSolrSpellChecker.init init: {name=direct,classname=DirectSolrSpellChecker,field=lowerfilt,minQueryLength=3}
[junit4:junit4]   2> 516 T540 oasc.CachingDirectoryFactory.close Releasing directory:/mnt/ssd/jenkins/workspace/Lucene-Solr-trunk-Linux/solr/build/solr-core/test/J0/solrtest-TestFieldCollectionResource-1362566820503
[junit4:junit4]   2> 518 T541 oasc.SolrCore.registerSearcher [collection1] Registered new searcher Searcher@611d1ed3 main{StandardDirectoryReader(segments_1:1)}
[junit4:junit4]   2> 524 T540 oasc.CoreContainer.registerCore registering core: collection1
[junit4:junit4]   2> 524 T530 oass.SolrDispatchFilter.init user.dir=/mnt/ssd/jenkins/workspace/Lucene-Solr-trunk-Linux/solr/build/solr-core/test/J0
[junit4:junit4]   2> 525 T530 oass.SolrDispatchFilter.init SolrDispatchFilter.init() done
[junit4:junit4]   2> 525 T530 oas.SolrJettyTestBase.createJetty Jetty Assigned Port#46179
[junit4:junit4]   2> 529 T530 oas.SolrTestCaseJ4.setUp ###Starting testJsonGetAllFields
[junit4:junit4]   2> ASYNC  NEW_CORE C22 name=collection1 org.apache.solr.core.SolrCore@40c48cbc
[junit4:junit4]   2> 935 T537 C22 oejsh.ContextHandler$Context.log SchemaRestApi: [Restlet] Attaching application: org.apache.solr.rest.SchemaRestApi@30f2a94b to URI: /solr/schema
[junit4:junit4]   2> 938 T537 C22 oasr.SchemaRestApi.createInboundRoot createInboundRoot started
[junit4:junit4]   2> 940 T537 C22 oasr.SchemaRestApi.createInboundRoot createInboundRoot complete
[junit4:junit4]   2> 942 T537 C22 oasr.BaseSchemaResource.handlePostExecution [collection1] webapp=/solr path=/schema/fields params={indent=on&wt=json} status=0 QTime=10 
[junit4:junit4]   2> 943 T537 C22 orel.LogFilter.afterHandle 2013-03-06	05:47:01	127.0.0.1	-	127.0.0.1	46179	GET	/solr/schema/fields	indent=on&wt=json	200	-	0	7	https://127.0.0.1:46179	Java/1.7.0	-
[junit4:junit4]   2> 974 T530 oasu.RestTestBase.assertJQ SEVERE query failed JSON validation. error=mismatch: 'custstopfilt'!='lowerfilt' @ fields/[0]/name
[junit4:junit4]   2> 	 expected =/fields/[0]/name=="custstopfilt"
[junit4:junit4]   2> 	 response = {
[junit4:junit4]   2> 	  "responseHeader":{
[junit4:junit4]   2> 	    "status":0,
[junit4:junit4]   2> 	    "QTime":10},
[junit4:junit4]   2> 	  "fields":[{
[junit4:junit4]   2> 	      "name":"lowerfilt",
[junit4:junit4]   2> 	      "type":"lowerfilt",
[junit4:junit4]   2> 	      "indexed":true,
[junit4:junit4]   2> 	      "stored":true},
[junit4:junit4]   2> 	    {
[junit4:junit4]   2> 	      "name":"text_np",
[junit4:junit4]   2> 	      "type":"text_np",
[junit4:junit4]   2> 	      "indexed":true,
[junit4:junit4]   2> 	      "stored":false},
[junit4:junit4]   2> 	    {
[junit4:junit4]   2> 	      "name":"timestamp",
[junit4:junit4]   2> 	      "type":"date",
[junit4:junit4]   2> 	      "indexed":true,
[junit4:junit4]   2> 	      "stored":true},
[junit4:junit4]   2> 	    {
[junit4:junit4]   2> 	      "name":"id",
[junit4:junit4]   2> 	      "type":"string",
[junit4:junit4]   2> 	      "indexed":true,
[junit4:junit4]   2> 	      "stored":true,
[junit4:junit4]   2> 	      "multiValued":false,
[junit4:junit4]   2> 	      "required":true,
[junit4:junit4]   2> 	      "uniqueKey":true},
[junit4:junit4]   2> 	    {
[junit4:junit4]   2> 	      "name":"signatureField",
[junit4:junit4]   2> 	      "type":"string",
[junit4:junit4]   2> 	      "indexed":true,
[junit4:junit4]   2> 	      "stored":false},
[junit4:junit4]   2> 	    {
[junit4:junit4]   2> 	      "name":"sindsto",
[junit4:junit4]   2> 	      "type":"string",
[junit4:junit4]   2> 	      "indexed":true,
[junit4:junit4]   2> 	      "stored":true},
[junit4:junit4]   2> 	    {
[junit4:junit4]   2> 	      "name":"isto",
[junit4:junit4]   2> 	      "type":"int",
[junit4:junit4]   2> 	      "indexed":false,
[junit4:junit4]   2> 	      "stored":true},
[junit4:junit4]   2> 	    {
[junit4:junit4]   2> 	      "name":"subject",
[junit4:junit4]   2> 	      "type":"text",
[junit4:junit4]   2> 	      "indexed":true,
[junit4:junit4]   2> 	      "stored":true},
[junit4:junit4]   2> 	    {
[junit4:junit4]   2> 	      "name":"text",
[junit4:junit4]   2> 	      "type":"text",
[junit4:junit4]   2> 	      "indexed":true,
[junit4:junit4]   2> 	      "stored":false,
[junit4:junit4]   2> 	      "multiValued":true},
[junit4:junit4]   2> 	    {
[junit4:junit4]   2> 	      "name":"HTMLwhitetok",
[junit4:junit4]   2> 	      "type":"HTMLwhitetok",
[junit4:junit4]   2> 	      "indexed":true,
[junit4:junit4]   2> 	      "stored":true},
[junit4:junit4]   2> 	    {
[junit4:junit4]   2> 	      "name":"wdf_nocase",
[junit4:junit4]   2> 	      "type":"wdf_nocase",
[junit4:junit4]   2> 	      "indexed":true,
[junit4:junit4]   2> 	      "stored":true},
[junit4:junit4]   2> 	    {
[junit4:junit4]   2> 	      "name":"bind",
[junit4:junit4]   2> 	      "type":"boolean",
[junit4:junit4]   2> 	      "indexed":true,
[junit4:junit4]   2> 	      "stored":false},
[junit4:junit4]   2> 	    {
[junit4:junit4]   2> 	      "name":"title_lettertok",
[junit4:junit4]   2> 	      "type":"lettertok",
[junit4:junit4]   2> 	      "indexed":true,
[junit4:junit4]   2> 	      "stored":false},
[junit4:junit4]   2> 	    {
[junit4:junit4]   2> 	      "name":"test_offtv",
[junit4:junit4]   2> 	      "type":"text",
[junit4:junit4]   2> 	      "termOffsets":true,
[junit4:junit4]   2> 	      "termVectors":true},
[junit4:junit4]   2> 	    {
[junit4:junit4]   2> 	      "name":"subword",
[junit4:junit4]   2> 	      "type":"subword",
[junit4:junit4]   2> 	      "indexed":true,
[junit4:junit4]   2> 	      "stored":true},
[junit4:junit4]   2> 	    {
[junit4:junit4]   2> 	      "name":"title",
[junit4:junit4]   2> 	      "type":"nametext",
[junit4:junit4]   2> 	      "indexed":true,
[junit4:junit4]   2> 	      "stored":true},
[junit4:junit4]   2> 	    {
[junit4:junit4]   2> 	      "name":"shouldbestored",
[junit4:junit4]   2> 	      "type":"unstored",
[junit4:junit4]   2> 	      "stored":true},
[junit4:junit4]   2> 	    {
[junit4:junit4]   2> 	      "name":"point_hash",
[junit4:junit4]   2> 	      "type":"geohash",
[junit4:junit4]   2> 	      "indexed":true,
[junit4:junit4]   2> 	      "stored":true,
[junit4:junit4]   2> 	      "multiValued":false},
[junit4:junit4]   2> 	    {
[junit4:junit4]   2> 	      "name":"custengporterfilt",
[junit4:junit4]   2> 	      "type":"custengporterfilt",
[junit4:junit4]   2> 	      "indexed":true,
[junit4:junit4]   2> 	      "stored":true},
[junit4:junit4]   2> 	    {
[junit4:junit4]   2> 	      "name":"lettertok",
[junit4:junit4]   2> 	      "type":"lettertok",
[junit4:junit4]   2> 	      "indexed":true,
[junit4:junit4]   2> 	      "stored":true},
[junit4:junit4]   2> 	    {
[junit4:junit4]   2> 	      "name":"test_posofftv",
[junit4:junit4]   2> 	      "type":"text",
[junit4:junit4]   2> 	      "termOffsets":true,
[junit4:junit4]   2> 	      "termVectors":true,
[junit4:junit4]   2> 	      "termPositions":true},
[junit4:junit4]   2> 	    {
[junit4:junit4]   2> 	      "name":"lengthfilt",
[junit4:junit4]   2> 	      "type":"lengthfilt",
[junit4:junit4]   2> 	      "indexed":true,
[junit4:junit4]   2> 	      "stored":true},
[junit4:junit4]   2> 	    {
[junit4:junit4]   2> 	      "name":"standardtok",
[junit4:junit4]   2> 	      "type":"standardtok",
[junit4:junit4]   2> 	      "indexed":true,
[junit4:junit4]   2> 	      "stored":true},
[junit4:junit4]   2> 	    {
[junit4:junit4]   2> 	      "name":"weight",
[junit4:junit4]   2> 	      "type":"float",
[junit4:junit4]   2> 	      "indexed":true,
[junit4:junit4]   2> 	      "stored":true},
[junit4:junit4]   2> 	    {
[junit4:junit4]   2> 	      "name":"porterfilt",
[junit4:junit4]   2> 	      "type":"porterfilt",
[junit4:junit4]   2> 	      "indexed":true,
[junit4:junit4]   2> 	      "stored":true},
[junit4:junit4]   2> 	    {
[junit4:junit4]   2> 	      "name":"title_stemmed",
[junit4:junit4]   2> 	      "type":"text",
[junit4:junit4]   2> 	      "indexed":true,
[junit4:junit4]   2> 	      "stored":false},
[junit4:junit4]   2> 	    {
[junit4:junit4]   2> 	      "name":"standardtokfilt",
[junit4:junit4]   2> 	      "type":"standardtokfilt",
[junit4:junit4]   2> 	      "indexed":true,
[junit4:junit4]   2> 	      "stored":true},
[junit4:junit4]   2> 	    {
[junit4:junit4]   2> 	      "name":"uniq",
[junit4:junit4]   2> 	      "type":"string",
[junit4:junit4]   2> 	      "indexed":true,
[junit4:junit4]   2> 	      "stored":true,
[junit4:junit4]   2> 	      "multiValued":true},
[junit4:junit4]   2> 	    {
[junit4:junit4]   2> 	      "name":"test_basictv",
[junit4:junit4]   2> 	      "type":"text",
[junit4:junit4]   2> 	      "termVectors":true},
[junit4:junit4]   2> 	    {
[junit4:junit4]   2> 	      "name":"whitetok",
[junit4:junit4]   2> 	      "type":"whitetok",
[junit4:junit4]   2> 	      "indexed":true,
[junit4:junit4]   2> 	      "stored":true},
[junit4:junit4]   2> 	    {
[junit4:junit4]   2> 	      "name":"nullfirst",
[junit4:junit4]   2> 	      "type":"string",
[junit4:junit4]   2> 	      "indexed":true,
[junit4:junit4]   2> 	      "stored":true,
[junit4:junit4]   2> 	      "sortMissingFirst":true},
[junit4:junit4]   2> 	    {
[junit4:junit4]   2> 	      "name":"textgap",
[junit4:junit4]   2> 	      "type":"textgap",
[junit4:junit4]   2> 	      "indexed":true,
[junit4:junit4]   2> 	      "stored":true},
[junit4:junit4]   2> 	    {
[junit4:junit4]   2> 	      "name":"name",
[junit4:junit4]   2> 	      "type":"nametext",
[junit4:junit4]   2> 	      "indexed":true,
[junit4:junit4]   2> 	      "stored":true},
[junit4:junit4]   2> 	    {
[junit4:junit4]   2> 	      "name":"bsto",
[junit4:junit4]   2> 	      "type":"boolean",
[junit4:junit4]   2> 	      "indexed":false,
[junit4:junit4]   2> 	      "stored":true},
[junit4:junit4]   2> 	    {
[junit4:junit4]   2> 	      "name":"sind",
[junit4:junit4]   2> 	      "type":"string",
[junit4:junit4]   2> 	      "indexed":true,
[junit4:junit4]   2> 	      "stored":false},
[junit4:junit4]   2> 	    {
[junit4:junit4]   2> 	      "name":"stopfilt",
[junit4:junit4]   2> 	      "type":"stopfilt",
[junit4:junit4]   2> 	      "indexed":true,
[junit4:junit4]   2> 	      "stored":true},
[junit4:junit4]   2> 	    {
[junit4:junit4]   2> 	      "name":"test_notv",
[junit4:junit4]   2> 	      "type":"text",
[junit4:junit4]   2> 	      "termVectors":false},
[junit4:junit4]   2> 	    {
[junit4:junit4]   2> 	      "name":"point",
[junit4:junit4]   2> 	      "type":"xy",
[junit4:junit4]   2> 	      "indexed":true,
[junit4:junit4]   2> 	      "stored":true,
[junit4:junit4]   2> 	      "multiValued":false},
[junit4:junit4]   2> 	    {
[junit4:junit4]   2> 	      "name":"wdf_preserve",
[junit4:junit4]   2> 	      "type":"wdf_preserve",
[junit4:junit4]   2> 	      "indexed":true,
[junit4:junit4]   2> 	      "stored":true},
[junit4:junit4]   2> 	    {
[junit4:junit4]   2> 	      "name":"teststop",
[junit4:junit4]   2> 	      "type":"teststop",
[junit4:junit4]   2> 	      "indexed":true,
[junit4:junit4]   2> 	      "stored":true},
[junit4:junit4]   2> 	    {
[junit4:junit4]   2> 	      "name":"numericsubword",
[junit4:junit4]   2> 	      "type":"numericsubword",
[junit4:junit4]   2> 	      "indexed":true,
[junit4:junit4]   2> 	      "stored":true},
[junit4:junit4]   2> 	    {
[junit4:junit4]   2> 	      "name":"patternreplacefilt",
[junit4:junit4]   2> 	      "type":"patternreplacefilt",
[junit4:junit4]   2> 	      "indexed":true,
[junit4:junit4]   2> 	      "stored":true},
[junit4:junit4]   2> 	    {
[junit4:junit4]   2> 	      "name":"lowertok",
[junit4:junit4]   2> 	      "type":"lowertok",
[junit4:junit4]   2> 	      "indexed":true,
[junit4:junit4]   2> 	      "stored":true},
[junit4:junit4]   2> 	    {
[junit4:junit4]   2> 	      "name":"shouldbeunstored",
[junit4:junit4]   2> 	      "type":"unstored"},
[junit4:junit4]   2> 	    {
[junit4:junit4]   2> 	      "name":"sku1",
[junit4:junit4]   2> 	      "type":"skutype1",
[junit4:junit4]   2> 	      "indexed":true,
[junit4:junit4]   2> 	      "stored":true},
[junit4:junit4]   2> 	    {
[junit4:junit4]   2> 	      "name":"pointD",
[junit4:junit4]   2> 	      "type":"xyd",
[junit4:junit4]   2> 	      "indexed":true,
[junit4:junit4]   2> 	      "stored":true,
[junit4:junit4]   2> 	      "multiValued":false},
[junit4:junit4]   2> 	    {
[junit4:junit4]   2> 	      "name":"sku2",
[junit4:junit4]   2> 	      "type":"skutype2",
[junit4:junit4]   2> 	      "indexed":true,
[junit4:junit4]   2> 	      "stored":true},
[junit4:junit4]   2> 	    {
[junit4:junit4]   2> 	      "name":"uuid",
[junit4:junit4]   2> 	      "type":"uuid",
[junit4:junit4]   2> 	      "stored":true},
[junit4:junit4]   2> 	    {
[junit4:junit4]   2> 	      "name":"shouldbeunindexed",
[junit4:junit4]   2> 	      "type":"unstored",
[junit4:junit4]   2> 	      "indexed":false,
[junit4:junit4]   2> 	      "stored":true},
[junit4:junit4]   2> 	    {
[junit4:junit4]   2> 	      "name":"nouniq",
[junit4:junit4]   2> 	      "type":"string",
[junit4:junit4]   2> 	      "indexed":true,
[junit4:junit4]   2> 	      "stored":true,
[junit4:junit4]   2> 	      "multiValued":true},
[junit4:junit4]   2> 	    {
[junit4:junit4]   2> 	      "name":"test_hlt",
[junit4:junit4]   2> 	      "type":"highlittext",
[junit4:junit4]   2> 	      "compressed":true,
[junit4:junit4]   2> 	      "indexed":true},
[junit4:junit4]   2> 	    {
[junit4:junit4]   2> 	      "name":"keywordtok",
[junit4:junit4]   2> 	      "type":"keywordtok",
[junit4:junit4]   2> 	      "indexed":true,
[junit4:junit4]   2> 	      "stored":true},
[junit4:junit4]   2> 	    {
[junit4:junit4]   2> 	      "name":"standardfilt",
[junit4:junit4]   2> 	      "type":"standardfilt",
[junit4:junit4]   2> 	      "indexed":true,
[junit4:junit4]   2> 	      "stored":true},
[junit4:junit4]   2> 	    {
[junit4:junit4]   2> 	      "name":"syn",
[junit4:junit4]   2> 	      "type":"syn",
[junit4:junit4]   2> 	      "indexed":true,
[junit4:junit4]   2> 	      "stored":true},
[junit4:junit4]   2> 	    {
[junit4:junit4]   2> 	      "name":"bindsto",
[junit4:junit4]   2> 	      "type":"boolean",
[junit4:junit4]   2> 	      "indexed":true,
[junit4:junit4]   2> 	      "stored":true},
[junit4:junit4]   2> 	    {
[junit4:junit4]   2> 	      "name":"uniq2",
[junit4:junit4]   2> 	      "type":"string",
[junit4:junit4]   2> 	      "indexed":true,
[junit4:junit4]   2> 	      "stored":true,
[junit4:junit4]   2> 	      "multiValued":true},
[junit4:junit4]   2> 	    {
[junit4:junit4]   2> 	      "name":"uniq3",
[junit4:junit4]   2> 	      "type":"string",
[junit4:junit4]   2> 	      "indexed":true,
[junit4:junit4]   2> 	      "stored":true},
[junit4:junit4]   2> 	    {
[junit4:junit4]   2> 	      "name":"iind",
[junit4:junit4]   2> 	      "type":"int",
[junit4:junit4]   2> 	      "indexed":true,
[junit4:junit4]   2> 	      "stored":false},
[junit4:junit4]   2> 	    {
[junit4:junit4]   2> 	      "name":"engporterfilt",
[junit4:junit4]   2> 	      "type":"engporterfilt",
[junit4:junit4]   2> 	      "indexed":true,
[junit4:junit4]   2> 	      "stored":true},
[junit4:junit4]   2> 	    {
[junit4:junit4]   2> 	      "name":"numberpartfail",
[junit4:junit4]   2> 	      "type":"failtype1",
[junit4:junit4]   2> 	      "indexed":true,
[junit4:junit4]   2> 	      "stored":true},
[junit4:junit4]   2> 	    {
[junit4:junit4]   2> 	      "name":"ssto",
[junit4:junit4]   2> 	      "type":"string",
[junit4:junit4]   2> 	      "indexed":false,
[junit4:junit4]   2> 	      "stored":true},
[junit4:junit4]   2> 	    {
[junit4:junit4]   2> 	      "name":"protectedsubword",
[junit4:junit4]   2> 	      "type":"protectedsubword",
[junit4:junit4]   2> 	      "indexed":true,
[junit4:junit4]   2> 	      "stored":true},
[junit4:junit4]   2> 	    {
[junit4:junit4]   2> 	      "name":"dedup",
[junit4:junit4]   2> 	      "type":"dedup",
[junit4:junit4]   2> 	      "indexed":true,
[junit4:junit4]   2> 	      "stored":true},
[junit4:junit4]   2> 	    {
[junit4:junit4]   2> 	      "name":"custstopfilt",
[junit4:junit4]   2> 	      "type":"custstopfilt",
[junit4:junit4]   2> 	      "indexed":true,
[junit4:junit4]   2> 	      "stored":true},
[junit4:junit4]   2> 	    {
[junit4:junit4]   2> 	      "name":"store",
[junit4:junit4]   2> 	      "type":"location",
[junit4:junit4]   2> 	      "indexed":true,
[junit4:junit4]   2> 	      "stored":true},
[junit4:junit4]   2> 	    {
[junit4:junit4]   2> 	      "name":"_version_",
[junit4:junit4]   2> 	      "type":"long",
[junit4:junit4]   2> 	      "indexed":true,
[junit4:junit4]   2> 	      "stored":true},
[junit4:junit4]   2> 	    {
[junit4:junit4]   2> 	      "name":"HTMLstandardtok",
[junit4:junit4]   2> 	      "type":"HTMLstandardtok",
[junit4:junit4]   2> 	      "indexed":true,
[junit4:junit4]   2> 	      "stored":true},
[junit4:junit4]   2> 	    {
[junit4:junit4]   2> 	      "name":"test_postv",
[junit4:junit4]   2> 	      "type":"text",
[junit4:junit4]   2> 	      "termVectors":true,
[junit4:junit4]   2> 	      "termPositions":true},
[junit4:junit4]   2> 	    {
[junit4:junit4]   2> 	      "name":"test_hlt_off",
[junit4:junit4]   2> 	      "type":"highlittext",
[junit4:junit4]   2> 	      "compressed":false,
[junit4:junit4]   2> 	      "indexed":true},
[junit4:junit4]   2> 	    {
[junit4:junit4]   2> 	      "name":"copyfield_source",
[junit4:junit4]   2> 	      "type":"string",
[junit4:junit4]   2> 	      "indexed":true,
[junit4:junit4]   2> 	      "stored":true,
[junit4:junit4]   2> 	      "multiValued":true},
[junit4:junit4]   2> 	    {
[junit4:junit4]   2> 	      "name":"bday",
[junit4:junit4]   2> 	      "type":"date",
[junit4:junit4]   2> 	      "indexed":true,
[junit4:junit4]   2> 	      "stored":true}]}
[junit4:junit4]   2> 	
[junit4:junit4]   2> 	 request = /schema/fields?indent=on&wt=json
[junit4:junit4]   2> 	
[junit4:junit4]   2> 975 T530 oas.SolrTestCaseJ4.tearDown ###Ending testJsonGetAllFields
[junit4:junit4]   2> NOTE: reproduce with: ant test  -Dtestcase=TestFieldCollectionResource -Dtests.method=testJsonGetAllFields -Dtests.seed=61D5E16461379449 -Dtests.multiplier=3 -Dtests.slow=true -Dtests.locale=en -Dtests.timezone=America/Guayaquil -Dtests.file.encoding=UTF-8
[junit4:junit4] ERROR   0.49s J0 | TestFieldCollectionResource.testJsonGetAllFields <<<
[junit4:junit4]    > Throwable #1: java.lang.RuntimeException: mismatch: 'custstopfilt'!='lowerfilt' @ fields/[0]/name
[junit4:junit4]    > 	at __randomizedtesting.SeedInfo.seed([61D5E16461379449:E8D593E8C184D86F]:0)
[junit4:junit4]    > 	at org.apache.solr.util.RestTestBase.assertJQ(RestTestBase.java:242)
[junit4:junit4]    > 	at org.apache.solr.util.RestTestBase.assertJQ(RestTestBase.java:186)
[junit4:junit4]    > 	at org.apache.solr.rest.TestFieldCollectionResource.testJsonGetAllFields(TestFieldCollectionResource.java:50)
[junit4:junit4]    > 	at sun.reflect.NativeMethodAccessorImpl.invoke0(Native Method)
[junit4:junit4]    > 	at sun.reflect.NativeMethodAccessorImpl.invoke(NativeMethodAccessorImpl.java:88)
[junit4:junit4]    > 	at sun.reflect.DelegatingMethodAccessorImpl.invoke(DelegatingMethodAccessorImpl.java:55)
[junit4:junit4]    > 	at java.lang.reflect.Method.invoke(Method.java:613)
[junit4:junit4]    > 	at com.carrotsearch.randomizedtesting.RandomizedRunner.invoke(RandomizedRunner.java:1559)
[junit4:junit4]    > 	at com.carrotsearch.randomizedtesting.RandomizedRunner.access$600(RandomizedRunner.java:79)
[junit4:junit4]    > 	at com.carrotsearch.randomizedtesting.RandomizedRunner$6.evaluate(RandomizedRunner.java:737)
[junit4:junit4]    > 	at com.carrotsearch.randomizedtesting.RandomizedRunner$7.evaluate(RandomizedRunner.java:773)
[junit4:junit4]    > 	at com.carrotsearch.randomizedtesting.RandomizedRunner$8.evaluate(RandomizedRunner.java:787)
[junit4:junit4]    > 	at com.carrotsearch.randomizedtesting.rules.SystemPropertiesRestoreRule$1.evaluate(SystemPropertiesRestoreRule.java:53)
[junit4:junit4]    > 	at org.apache.lucene.util.TestRuleSetupTeardownChained$1.evaluate(TestRuleSetupTeardownChained.java:50)
[junit4:junit4]    > 	at org.apache.lucene.util.TestRuleFieldCacheSanity$1.evaluate(TestRuleFieldCacheSanity.java:51)
[junit4:junit4]    > 	at org.apache.lucene.util.AbstractBeforeAfterRule$1.evaluate(AbstractBeforeAfterRule.java:46)
[junit4:junit4]    > 	at com.carrotsearch.randomizedtesting.rules.SystemPropertiesInvariantRule$1.evaluate(SystemPropertiesInvariantRule.java:55)
[junit4:junit4]    > 	at org.apache.lucene.util.TestRuleThreadAndTestName$1.evaluate(TestRuleThreadAndTestName.java:49)
[junit4:junit4]    > 	at org.apache.lucene.util.TestRuleIgnoreAfterMaxFailures$1.evaluate(TestRuleIgnoreAfterMaxFailures.java:70)
[junit4:junit4]    > 	at org.apache.lucene.util.TestRuleMarkFailure$1.evaluate(TestRuleMarkFailure.java:48)
[junit4:junit4]    > 	at com.carrotsearch.randomizedtesting.rules.StatementAdapter.evaluate(StatementAdapter.java:36)
[junit4:junit4]    > 	at com.carrotsearch.randomizedtesting.ThreadLeakControl$StatementRunner.run(ThreadLeakControl.java:358)
[junit4:junit4]    > 	at com.carrotsearch.randomizedtesting.ThreadLeakControl.forkTimeoutingTask(ThreadLeakControl.java:782)
[junit4:junit4]    > 	at com.carrotsearch.randomizedtesting.ThreadLeakControl$3.evaluate(ThreadLeakControl.java:442)
[junit4:junit4]    > 	at com.carrotsearch.randomizedtesting.RandomizedRunner.runSingleTest(RandomizedRunner.java:746)
[junit4:junit4]    > 	at com.carrotsearch.randomizedtesting.RandomizedRunner$3.evaluate(RandomizedRunner.java:648)
[junit4:junit4]    > 	at com.carrotsearch.randomizedtesting.RandomizedRunner$4.evaluate(RandomizedRunner.java:682)
[junit4:junit4]    > 	at com.carrotsearch.randomizedtesting.RandomizedRunner$5.evaluate(RandomizedRunner.java:693)
[junit4:junit4]    > 	at com.carrotsearch.randomizedtesting.rules.StatementAdapter.evaluate(StatementAdapter.java:36)
[junit4:junit4]    > 	at com.carrotsearch.randomizedtesting.rules.SystemPropertiesRestoreRule$1.evaluate(SystemPropertiesRestoreRule.java:53)
[junit4:junit4]    > 	at org.apache.lucene.util.AbstractBeforeAfterRule$1.evaluate(AbstractBeforeAfterRule.java:46)
[junit4:junit4]    > 	at org.apache.lucene.util.TestRuleStoreClassName$1.evaluate(TestRuleStoreClassName.java:42)
[junit4:junit4]    > 	at com.carrotsearch.randomizedtesting.rules.SystemPropertiesInvariantRule$1.evaluate(SystemPropertiesInvariantRule.java:55)
[junit4:junit4]    > 	at com.carrotsearch.randomizedtesting.rules.NoShadowingOrOverridesOnMethodsRule$1.evaluate(NoShadowingOrOverridesOnMethodsRule.java:39)
[junit4:junit4]    > 	at com.carrotsearch.randomizedtesting.rules.NoShadowingOrOverridesOnMethodsRule$1.evaluate(NoShadowingOrOverridesOnMethodsRule.java:39)
[junit4:junit4]    > 	at com.carrotsearch.randomizedtesting.rules.StatementAdapter.evaluate(StatementAdapter.java:36)
[junit4:junit4]    > 	at org.apache.lucene.util.TestRuleAssertionsRequired$1.evaluate(TestRuleAssertionsRequired.java:43)
[junit4:junit4]    > 	at org.apache.lucene.util.TestRuleMarkFailure$1.evaluate(TestRuleMarkFailure.java:48)
[junit4:junit4]    > 	at org.apache.lucene.util.TestRuleIgnoreAfterMaxFailures$1.evaluate(TestRuleIgnoreAfterMaxFailures.java:70)
[junit4:junit4]    > 	at org.apache.lucene.util.TestRuleIgnoreTestSuites$1.evaluate(TestRuleIgnoreTestSuites.java:55)
[junit4:junit4]    > 	at com.carrotsearch.randomizedtesting.rules.StatementAdapter.evaluate(StatementAdapter.java:36)
[junit4:junit4]    > 	at com.carrotsearch.randomizedtesting.ThreadLeakControl$StatementRunner.run(ThreadLeakControl.java:358)
[junit4:junit4]    > 	at java.lang.Thread.run(Thread.java:780)
[junit4:junit4]   2> 1022 T530 oas.SolrTestCaseJ4.setUp ###Starting testJsonGetTwoFields
[junit4:junit4]   2> 1025 T536 C22 oasr.BaseSchemaResource.handlePostExecution [collection1] webapp=/solr path=/schema/fields params={fl=id,_version_&indent=on&wt=json} status=0 QTime=1 
[junit4:junit4]   2> 1026 T536 C22 orel.LogFilter.afterHandle 2013-03-06	05:47:01	127.0.0.1	-	127.0.0.1	46179	GET	/solr/schema/fields	fl=id,_version_&indent=on&wt=json	200	-	0	1	https://127.0.0.1:46179	Java/1.7.0	-
[junit4:junit4]   2> 1029 T530 oas.SolrTestCaseJ4.tearDown ###Ending testJsonGetTwoFields
[junit4:junit4]   2> 1035 T530 oas.SolrTestCaseJ4.setUp ###Starting testNotFoundFields
[junit4:junit4]   2> 1038 T538 C22 oasr.BaseSchemaResource.handlePostExecution [collection1] webapp=/solr path=/schema/fields params={fl=not_in_there,this_one_either&indent=on&wt=xml} status=0 QTime=2 
[junit4:junit4]   2> 1038 T538 C22 orel.LogFilter.afterHandle 2013-03-06	05:47:01	127.0.0.1	-	127.0.0.1	46179	GET	/solr/schema/fields	indent=on&wt=xml&fl=not_in_there,this_one_either	200	-	0	1	https://127.0.0.1:46179	Java/1.7.0	-
[junit4:junit4]   2> 1044 T530 oas.SolrTestCaseJ4.tearDown ###Ending testNotFoundFields
[junit4:junit4]   2> 1049 T530 oas.SolrTestCaseJ4.setUp ###Starting testGetAllFields
[junit4:junit4]   2> 1052 T539 C22 oasr.BaseSchemaResource.handlePostExecution [collection1] webapp=/solr path=/schema/fields params={indent=on&wt=xml} status=0 QTime=1 
[junit4:junit4]   2> 1053 T539 C22 orel.LogFilter.afterHandle 2013-03-06	05:47:01	127.0.0.1	-	127.0.0.1	46179	GET	/solr/schema/fields	indent=on&wt=xml	200	-	0	2	https://127.0.0.1:46179	Java/1.7.0	-
[junit4:junit4]   2> 1388 T530 oasu.RestTestBase.assertQ SEVERE REQUEST FAILED: xpath=(/response/arr[@name='fields']/lst/str[@name='name'])[1] = 'custstopfilt'
[junit4:junit4]   2> 		xml response was: <?xml version="1.0" encoding="UTF-8"?>
[junit4:junit4]   2> 	<response>
[junit4:junit4]   2> 	
[junit4:junit4]   2> 	<lst name="responseHeader">
[junit4:junit4]   2> 	  <int name="status">0</int>
[junit4:junit4]   2> 	  <int name="QTime">1</int>
[junit4:junit4]   2> 	</lst>
[junit4:junit4]   2> 	<arr name="fields">
[junit4:junit4]   2> 	  <lst>
[junit4:junit4]   2> 	    <str name="name">lowerfilt</str>
[junit4:junit4]   2> 	    <str name="type">lowerfilt</str>
[junit4:junit4]   2> 	    <bool name="indexed">true</bool>
[junit4:junit4]   2> 	    <bool name="stored">true</bool>
[junit4:junit4]   2> 	  </lst>
[junit4:junit4]   2> 	  <lst>
[junit4:junit4]   2> 	    <str name="name">text_np</str>
[junit4:junit4]   2> 	    <str name="type">text_np</str>
[junit4:junit4]   2> 	    <bool name="indexed">true</bool>
[junit4:junit4]   2> 	    <bool name="stored">false</bool>
[junit4:junit4]   2> 	  </lst>
[junit4:junit4]   2> 	  <lst>
[junit4:junit4]   2> 	    <str name="name">timestamp</str>
[junit4:junit4]   2> 	    <str name="type">date</str>
[junit4:junit4]   2> 	    <bool name="indexed">true</bool>
[junit4:junit4]   2> 	    <bool name="stored">true</bool>
[junit4:junit4]   2> 	  </lst>
[junit4:junit4]   2> 	  <lst>
[junit4:junit4]   2> 	    <str name="name">id</str>
[junit4:junit4]   2> 	    <str name="type">string</str>
[junit4:junit4]   2> 	    <bool name="indexed">true</bool>
[junit4:junit4]   2> 	    <bool name="stored">true</bool>
[junit4:junit4]   2> 	    <bool name="multiValued">false</bool>
[junit4:junit4]   2> 	    <bool name="required">true</bool>
[junit4:junit4]   2> 	    <bool name="uniqueKey">true</bool>
[junit4:junit4]   2> 	  </lst>
[junit4:junit4]   2> 	  <lst>
[junit4:junit4]   2> 	    <str name="name">signatureField</str>
[junit4:junit4]   2> 	    <str name="type">string</str>
[junit4:junit4]   2> 	    <bool name="indexed">true</bool>
[junit4:junit4]   2> 	    <bool name="stored">false</bool>
[junit4:junit4]   2> 	  </lst>
[junit4:junit4]   2> 	  <lst>
[junit4:junit4]   2> 	    <str name="name">sindsto</str>
[junit4:junit4]   2> 	    <str name="type">string</str>
[junit4:junit4]   2> 	    <bool name="indexed">true</bool>
[junit4:junit4]   2> 	    <bool name="stored">true</bool>
[junit4:junit4]   2> 	  </lst>
[junit4:junit4]   2> 	  <lst>
[junit4:junit4]   2> 	    <str name="name">isto</str>
[junit4:junit4]   2> 	    <str name="type">int</str>
[junit4:junit4]   2> 	    <bool name="indexed">false</bool>
[junit4:junit4]   2> 	    <bool name="stored">true</bool>
[junit4:junit4]   2> 	  </lst>
[junit4:junit4]   2> 	  <lst>
[junit4:junit4]   2> 	    <str name="name">subject</str>
[junit4:junit4]   2> 	    <str name="type">text</str>
[junit4:junit4]   2> 	    <bool name="indexed">true</bool>
[junit4:junit4]   2> 	    <bool name="stored">true</bool>
[junit4:junit4]   2> 	  </lst>
[junit4:junit4]   2> 	  <lst>
[junit4:junit4]   2> 	    <str name="name">text</str>
[junit4:junit4]   2> 	    <str name="type">text</str>
[junit4:junit4]   2> 	    <bool name="indexed">true</bool>
[junit4:junit4]   2> 	    <bool name="stored">false</bool>
[junit4:junit4]   2> 	    <bool name="multiValued">true</bool>
[junit4:junit4]   2> 	  </lst>
[junit4:junit4]   2> 	  <lst>
[junit4:junit4]   2> 	    <str name="name">HTMLwhitetok</str>
[junit4:junit4]   2> 	    <str name="type">HTMLwhitetok</str>
[junit4:junit4]   2> 	    <bool name="indexed">true</bool>
[junit4:junit4]   2> 	    <bool name="stored">true</bool>
[junit4:junit4]   2> 	  </lst>
[junit4:junit4]   2> 	  <lst>
[junit4:junit4]   2> 	    <str name="name">wdf_nocase</str>
[junit4:junit4]   2> 	    <str name="type">wdf_nocase</str>
[junit4:junit4]   2> 	    <bool name="indexed">true</bool>
[junit4:junit4]   2> 	    <bool name="stored">true</bool>
[junit4:junit4]   2> 	  </lst>
[junit4:junit4]   2> 	  <lst>
[junit4:junit4]   2> 	    <str name="name">bind</str>
[junit4:junit4]   2> 	    <str name="type">boolean</str>
[junit4:junit4]   2> 	    <bool name="indexed">true</bool>
[junit4:junit4]   2> 	    <bool name="stored">false</bool>
[junit4:junit4]   2> 	  </lst>
[junit4:junit4]   2> 	  <lst>
[junit4:junit4]   2> 	    <str name="name">title_lettertok</str>
[junit4:junit4]   2> 	    <str name="type">lettertok</str>
[junit4:junit4]   2> 	    <bool name="indexed">true</bool>
[junit4:junit4]   2> 	    <bool name="stored">false</bool>
[junit4:junit4]   2> 	  </lst>
[junit4:junit4]   2> 	  <lst>
[junit4:junit4]   2> 	    <str name="name">test_offtv</str>
[junit4:junit4]   2> 	    <str name="type">text</str>
[junit4:junit4]   2> 	    <bool name="termOffsets">true</bool>
[junit4:junit4]   2> 	    <bool name="termVectors">true</bool>
[junit4:junit4]   2> 	  </lst>
[junit4:junit4]   2> 	  <lst>
[junit4:junit4]   2> 	    <str name="name">subword</str>
[junit4:junit4]   2> 	    <str name="type">subword</str>
[junit4:junit4]   2> 	    <bool name="indexed">true</bool>
[junit4:junit4]   2> 	    <bool name="stored">true</bool>
[junit4:junit4]   2> 	  </lst>
[junit4:junit4]   2> 	  <lst>
[junit4:junit4]   2> 	    <str name="name">title</str>
[junit4:junit4]   2> 	    <str name="type">nametext</str>
[junit4:junit4]   2> 	    <bool name="indexed">true</bool>
[junit4:junit4]   2> 	    <bool name="stored">true</bool>
[junit4:junit4]   2> 	  </lst>
[junit4:junit4]   2> 	  <lst>
[junit4:junit4]   2> 	    <str name="name">shouldbestored</str>
[junit4:junit4]   2> 	    <str name="type">unstored</str>
[junit4:junit4]   2> 	    <bool name="stored">true</bool>
[junit4:junit4]   2> 	  </lst>
[junit4:junit4]   2> 	  <lst>
[junit4:junit4]   2> 	    <str name="name">point_hash</str>
[junit4:junit4]   2> 	    <str name="type">geohash</str>
[junit4:junit4]   2> 	    <bool name="indexed">true</bool>
[junit4:junit4]   2> 	    <bool name="stored">true</bool>
[junit4:junit4]   2> 	    <bool name="multiValued">false</bool>
[junit4:junit4]   2> 	  </lst>
[junit4:junit4]   2> 	  <lst>
[junit4:junit4]   2> 	    <str name="name">custengporterfilt</str>
[junit4:junit4]   2> 	    <str name="type">custengporterfilt</str>
[junit4:junit4]   2> 	    <bool name="indexed">true</bool>
[junit4:junit4]   2> 	    <bool name="stored">true</bool>
[junit4:junit4]   2> 	  </lst>
[junit4:junit4]   2> 	  <lst>
[junit4:junit4]   2> 	    <str name="name">lettertok</str>
[junit4:junit4]   2> 	    <str name="type">lettertok</str>
[junit4:junit4]   2> 	    <bool name="indexed">true</bool>
[junit4:junit4]   2> 	    <bool name="stored">true</bool>
[junit4:junit4]   2> 	  </lst>
[junit4:junit4]   2> 	  <lst>
[junit4:junit4]   2> 	    <str name="name">test_posofftv</str>
[junit4:junit4]   2> 	    <str name="type">text</str>
[junit4:junit4]   2> 	    <bool name="termOffsets">true</bool>
[junit4:junit4]   2> 	    <bool name="termVectors">true</bool>
[junit4:junit4]   2> 	    <bool name="termPositions">true</bool>
[junit4:junit4]   2> 	  </lst>
[junit4:junit4]   2> 	  <lst>
[junit4:junit4]   2> 	    <str name="name">lengthfilt</str>
[junit4:junit4]   2> 	    <str name="type">lengthfilt</str>
[junit4:junit4]   2> 	    <bool name="indexed">true</bool>
[junit4:junit4]   2> 	    <bool name="stored">true</bool>
[junit4:junit4]   2> 	  </lst>
[junit4:junit4]   2> 	  <lst>
[junit4:junit4]   2> 	    <str name="name">standardtok</str>
[junit4:junit4]   2> 	    <str name="type">standardtok</str>
[junit4:junit4]   2> 	    <bool name="indexed">true</bool>
[junit4:junit4]   2> 	    <bool name="stored">true</bool>
[junit4:junit4]   2> 	  </lst>
[junit4:junit4]   2> 	  <lst>
[junit4:junit4]   2> 	    <str name="name">weight</str>
[junit4:junit4]   2> 	    <str name="type">float</str>
[junit4:junit4]   2> 	    <bool name="indexed">true</bool>
[junit4:junit4]   2> 	    <bool name="stored">true</bool>
[junit4:junit4]   2> 	  </lst>
[junit4:junit4]   2> 	  <lst>
[junit4:junit4]   2> 	    <str name="name">porterfilt</str>
[junit4:junit4]   2> 	    <str name="type">porterfilt</str>
[junit4:junit4]   2> 	    <bool name="indexed">true</bool>
[junit4:junit4]   2> 	    <bool name="stored">true</bool>
[junit4:junit4]   2> 	  </lst>
[junit4:junit4]   2> 	  <lst>
[junit4:junit4]   2> 	    <str name="name">title_stemmed</str>
[junit4:junit4]   2> 	    <str name="type">text</str>
[junit4:junit4]   2> 	    <bool name="indexed">true</bool>
[junit4:junit4]   2> 	    <bool name="stored">false</bool>
[junit4:junit4]   2> 	  </lst>
[junit4:junit4]   2> 	  <lst>
[junit4:junit4]   2> 	    <str name="name">standardtokfilt</str>
[junit4:junit4]   2> 	    <str name="type">standardtokfilt</str>
[junit4:junit4]   2> 	    <bool name="indexed">true</bool>
[junit4:junit4]   2> 	    <bool name="stored">true</bool>
[junit4:junit4]   2> 	  </lst>
[junit4:junit4]   2> 	  <lst>
[junit4:junit4]   2> 	    <str name="name">uniq</str>
[junit4:junit4]   2> 	    <str name="type">string</str>
[junit4:junit4]   2> 	    <bool name="indexed">true</bool>
[junit4:junit4]   2> 	    <bool name="stored">true</bool>
[junit4:junit4]   2> 	    <bool name="multiValued">true</bool>
[junit4:junit4]   2> 	  </lst>
[junit4:junit4]   2> 	  <lst>
[junit4:junit4]   2> 	    <str name="name">test_basictv</str>
[junit4:junit4]   2> 	    <str name="type">text</str>
[junit4:junit4]   2> 	    <bool name="termVectors">true</bool>
[junit4:junit4]   2> 	  </lst>
[junit4:junit4]   2> 	  <lst>
[junit4:junit4]   2> 	    <str name="name">whitetok</str>
[junit4:junit4]   2> 	    <str name="type">whitetok</str>
[junit4:junit4]   2> 	    <bool name="indexed">true</bool>
[junit4:junit4]   2> 	    <bool name="stored">true</bool>
[junit4:junit4]   2> 	  </lst>
[junit4:junit4]   2> 	  <lst>
[junit4:junit4]   2> 	    <str name="name">nullfirst</str>
[junit4:junit4]   2> 	    <str name="type">string</str>
[junit4:junit4]   2> 	    <bool name="indexed">true</bool>
[junit4:junit4]   2> 	    <bool name="stored">true</bool>
[junit4:junit4]   2> 	    <bool name="sortMissingFirst">true</bool>
[junit4:junit4]   2> 	  </lst>
[junit4:junit4]   2> 	  <lst>
[junit4:junit4]   2> 	    <str name="name">textgap</str>
[junit4:junit4]   2> 	    <str name="type">textgap</str>
[junit4:junit4]   2> 	    <bool name="indexed">true</bool>
[junit4:junit4]   2> 	    <bool name="stored">true</bool>
[junit4:junit4]   2> 	  </lst>
[junit4:junit4]   2> 	  <lst>
[junit4:junit4]   2> 	    <str name="name">name</str>
[junit4:junit4]   2> 	    <str name="type">nametext</str>
[junit4:junit4]   2> 	    <bool name="indexed">true</bool>
[junit4:junit4]   2> 	    <bool name="stored">true</bool>
[junit4:junit4]   2> 	  </lst>
[junit4:junit4]   2> 	  <lst>
[junit4:junit4]   2> 	    <str name="name">bsto</str>
[junit4:junit4]   2> 	    <str name="type">boolean</str>
[junit4:junit4]   2> 	    <bool name="indexed">false</bool>
[junit4:junit4]   2> 	    <bool name="stored">true</bool>
[junit4:junit4]   2> 	  </lst>
[junit4:junit4]   2> 	  <lst>
[junit4:junit4]   2> 	    <str name="name">sind</str>
[junit4:junit4]   2> 	    <str name="type">string</str>
[junit4:junit4]   2> 	    <bool name="indexed">true</bool>
[junit4:junit4]   2> 	    <bool name="stored">false</bool>
[junit4:junit4]   2> 	  </lst>
[junit4:junit4]   2> 	  <lst>
[junit4:junit4]   2> 	    <str name="name">stopfilt</str>
[junit4:junit4]   2> 	    <str name="type">stopfilt</str>
[junit4:junit4]   2> 	    <bool name="indexed">true</bool>
[junit4:junit4]   2> 	    <bool name="stored">true</bool>
[junit4:junit4]   2> 	  </lst>
[junit4:junit4]   2> 	  <lst>
[junit4:junit4]   2> 	    <str name="name">test_notv</str>
[junit4:junit4]   2> 	    <str name="type">text</str>
[junit4:junit4]   2> 	    <bool name="termVectors">false</bool>
[junit4:junit4]   2> 	  </lst>
[junit4:junit4]   2> 	  <lst>
[junit4:junit4]   2> 	    <str name="name">point</str>
[junit4:junit4]   2> 	    <str name="type">xy</str>
[junit4:junit4]   2> 	    <bool name="indexed">true</bool>
[junit4:junit4]   2> 	    <bool name="stored">true</bool>
[junit4:junit4]   2> 	    <bool name="multiValued">false</bool>
[junit4:junit4]   2> 	  </lst>
[junit4:junit4]   2> 	  <lst>
[junit4:junit4]   2> 	    <str name="name">wdf_preserve</str>
[junit4:junit4]   2> 	    <str name="type">wdf_preserve</str>
[junit4:junit4]   2> 	    <bool name="indexed">true</bool>
[junit4:junit4]   2> 	    <bool name="stored">true</bool>
[junit4:junit4]   2> 	  </lst>
[junit4:junit4]   2> 	  <lst>
[junit4:junit4]   2> 	    <str name="name">teststop</str>
[junit4:junit4]   2> 	    <str name="type">teststop</str>
[junit4:junit4]   2> 	    <bool name="indexed">true</bool>
[junit4:junit4]   2> 	    <bool name="stored">true</bool>
[junit4:junit4]   2> 	  </lst>
[junit4:junit4]   2> 	  <lst>
[junit4:junit4]   2> 	    <str name="name">numericsubword</str>
[junit4:junit4]   2> 	    <str name="type">numericsubword</str>
[junit4:junit4]   2> 	    <bool name="indexed">true</bool>
[junit4:junit4]   2> 	    <bool name="stored">true</bool>
[junit4:junit4]   2> 	  </lst>
[junit4:junit4]   2> 	  <lst>
[junit4:junit4]   2> 	    <str name="name">patternreplacefilt</str>
[junit4:junit4]   2> 	    <str name="type">patternreplacefilt</str>
[junit4:junit4]   2> 	    <bool name="indexed">true</bool>
[junit4:junit4]   2> 	    <bool name="stored">true</bool>
[junit4:junit4]   2> 	  </lst>
[junit4:junit4]   2> 	  <lst>
[junit4:junit4]   2> 	    <str name="name">lowertok</str>
[junit4:junit4]   2> 	    <str name="type">lowertok</str>
[junit4:junit4]   2> 	    <bool name="indexed">true</bool>
[junit4:junit4]   2> 	    <bool name="stored">true</bool>
[junit4:junit4]   2> 	  </lst>
[junit4:junit4]   2> 	  <lst>
[junit4:junit4]   2> 	    <str name="name">shouldbeunstored</str>
[junit4:junit4]   2> 	    <str name="type">unstored</str>
[junit4:junit4]   2> 	  </lst>
[junit4:junit4]   2> 	  <lst>
[junit4:junit4]   2> 	    <str name="name">sku1</str>
[junit4:junit4]   2> 	    <str name="type">skutype1</str>
[junit4:junit4]   2> 	    <bool name="indexed">true</bool>
[junit4:junit4]   2> 	    <bool name="stored">true</bool>
[junit4:junit4]   2> 	  </lst>
[junit4:junit4]   2> 	  <lst>
[junit4:junit4]   2> 	    <str name="name">pointD</str>
[junit4:junit4]   2> 	    <str name="type">xyd</str>
[junit4:junit4]   2> 	    <bool name="indexed">true</bool>
[junit4:junit4]   2> 	    <bool name="stored">true</bool>
[junit4:junit4]   2> 	    <bool name="multiValued">false</bool>
[junit4:junit4]   2> 	  </lst>
[junit4:junit4]   2> 	  <lst>
[junit4:junit4]   2> 	    <str name="name">sku2</str>
[junit4:junit4]   2> 	    <str name="type">skutype2</str>
[junit4:junit4]   2> 	    <bool name="indexed">true</bool>
[junit4:junit4]   2> 	    <bool name="stored">true</bool>
[junit4:junit4]   2> 	  </lst>
[junit4:junit4]   2> 	  <lst>
[junit4:junit4]   2> 	    <str name="name">uuid</str>
[junit4:junit4]   2> 	    <str name="type">uuid</str>
[junit4:junit4]   2> 	    <bool name="stored">true</bool>
[junit4:junit4]   2> 	  </lst>
[junit4:junit4]   2> 	  <lst>
[junit4:junit4]   2> 	    <str name="name">shouldbeunindexed</str>
[junit4:junit4]   2> 	    <str name="type">unstored</str>
[junit4:junit4]   2> 	    <bool name="indexed">false</bool>
[junit4:junit4]   2> 	    <bool name="stored">true</bool>
[junit4:junit4]   2> 	  </lst>
[junit4:junit4]   2> 	  <lst>
[junit4:junit4]   2> 	    <str name="name">nouniq</str>
[junit4:junit4]   2> 	    <str name="type">string</str>
[junit4:junit4]   2> 	    <bool name="indexed">true</bool>
[junit4:junit4]   2> 	    <bool name="stored">true</bool>
[junit4:junit4]   2> 	    <bool name="multiValued">true</bool>
[junit4:junit4]   2> 	  </lst>
[junit4:junit4]   2> 	  <lst>
[junit4:junit4]   2> 	    <str name="name">test_hlt</str>
[junit4:junit4]   2> 	    <str name="type">highlittext</str>
[junit4:junit4]   2> 	    <bool name="compressed">true</bool>
[junit4:junit4]   2> 	    <bool name="indexed">true</bool>
[junit4:junit4]   2> 	  </lst>
[junit4:junit4]   2> 	  <lst>
[junit4:junit4]   2> 	    <str name="name">keywordtok</str>
[junit4:junit4]   2> 	    <str name="type">keywordtok</str>
[junit4:junit4]   2> 	    <bool name="indexed">true</bool>
[junit4:junit4]   2> 	    <bool name="stored">true</bool>
[junit4:junit4]   2> 	  </lst>
[junit4:junit4]   2> 	  <lst>
[junit4:junit4]   2> 	    <str name="name">standardfilt</str>
[junit4:junit4]   2> 	    <str name="type">standardfilt</str>
[junit4:junit4]   2> 	    <bool name="indexed">true</bool>
[junit4:junit4]   2> 	    <bool name="stored">true</bool>
[junit4:junit4]   2> 	  </lst>
[junit4:junit4]   2> 	  <lst>
[junit4:junit4]   2> 	    <str name="name">syn</str>
[junit4:junit4]   2> 	    <str name="type">syn</str>
[junit4:junit4]   2> 	    <bool name="indexed">true</bool>
[junit4:junit4]   2> 	    <bool name="stored">true</bool>
[junit4:junit4]   2> 	  </lst>
[junit4:junit4]   2> 	  <lst>
[junit4:junit4]   2> 	    <str name="name">bindsto</str>
[junit4:junit4]   2> 	    <str name="type">boolean</str>
[junit4:junit4]   2> 	    <bool name="indexed">true</bool>
[junit4:junit4]   2> 	    <bool name="stored">true</bool>
[junit4:junit4]   2> 	  </lst>
[junit4:junit4]   2> 	  <lst>
[junit4:junit4]   2> 	    <str name="name">uniq2</str>
[junit4:junit4]   2> 	    <str name="type">string</str>
[junit4:junit4]   2> 	    <bool name="indexed">true</bool>
[junit4:junit4]   2> 	    <bool name="stored">true</bool>
[junit4:junit4]   2> 	    <bool name="multiValued">true</bool>
[junit4:junit4]   2> 	  </lst>
[junit4:junit4]   2> 	  <lst>
[junit4:junit4]   2> 	    <str name="name">uniq3</str>
[junit4:junit4]   2> 	    <str name="type">string</str>
[junit4:junit4]   2> 	    <bool name="indexed">true</bool>
[junit4:junit4]   2> 	    <bool name="stored">true</bool>
[junit4:junit4]   2> 	  </lst>
[junit4:junit4]   2> 	  <lst>
[junit4:junit4]   2> 	    <str name="name">iind</str>
[junit4:junit4]   2> 	    <str name="type">int</str>
[junit4:junit4]   2> 	    <bool name="indexed">true</bool>
[junit4:junit4]   2> 	    <bool name="stored">false</bool>
[junit4:junit4]   2> 	  </lst>
[junit4:junit4]   2> 	  <lst>
[junit4:junit4]   2> 	    <str name="name">engporterfilt</str>
[junit4:junit4]   2> 	    <str name="type">engporterfilt</str>
[junit4:junit4]   2> 	    <bool name="indexed">true</bool>
[junit4:junit4]   2> 	    <bool name="stored">true</bool>
[junit4:junit4]   2> 	  </lst>
[junit4:junit4]   2> 	  <lst>
[junit4:junit4]   2> 	    <str name="name">numberpartfail</str>
[junit4:junit4]   2> 	    <str name="type">failtype1</str>
[junit4:junit4]   2> 	    <bool name="indexed">true</bool>
[junit4:junit4]   2> 	    <bool name="stored">true</bool>
[junit4:junit4]   2> 	  </lst>
[junit4:junit4]   2> 	  <lst>
[junit4:junit4]   2> 	    <str name="name">ssto</str>
[junit4:junit4]   2> 	    <str name="type">string</str>
[junit4:junit4]   2> 	    <bool name="indexed">false</bool>
[junit4:junit4]   2> 	    <bool name="stored">true</bool>
[junit4:junit4]   2> 	  </lst>
[junit4:junit4]   2> 	  <lst>
[junit4:junit4]   2> 	    <str name="name">protectedsubword</str>
[junit4:junit4]   2> 	    <str name="type">protectedsubword</str>
[junit4:junit4]   2> 	    <bool name="indexed">true</bool>
[junit4:junit4]   2> 	    <bool name="stored">true</bool>
[junit4:junit4]   2> 	  </lst>
[junit4:junit4]   2> 	  <lst>
[junit4:junit4]   2> 	    <str name="name">dedup</str>
[junit4:junit4]   2> 	    <str name="type">dedup</str>
[junit4:junit4]   2> 	    <bool name="indexed">true</bool>
[junit4:junit4]   2> 	    <bool name="stored">true</bool>
[junit4:junit4]   2> 	  </lst>
[junit4:junit4]   2> 	  <lst>
[junit4:junit4]   2> 	    <str name="name">custstopfilt</str>
[junit4:junit4]   2> 	    <str name="type">custstopfilt</str>
[junit4:junit4]   2> 	    <bool name="indexed">true</bool>
[junit4:junit4]   2> 	    <bool name="stored">true</bool>
[junit4:junit4]   2> 	  </lst>
[junit4:junit4]   2> 	  <lst>
[junit4:junit4]   2> 	    <str name="name">store</str>
[junit4:junit4]   2> 	    <str name="type">location</str>
[junit4:junit4]   2> 	    <bool name="indexed">true</bool>
[junit4:junit4]   2> 	    <bool name="stored">true</bool>
[junit4:junit4]   2> 	  </lst>
[junit4:junit4]   2> 	  <lst>
[junit4:junit4]   2> 	    <str name="name">_version_</str>
[junit4:junit4]   2> 	    <str name="type">long</str>
[junit4:junit4]   2> 	    <bool name="indexed">true</bool>
[junit4:junit4]   2> 	    <bool name="stored">true</bool>
[junit4:junit4]   2> 	  </lst>
[junit4:junit4]   2> 	  <lst>
[junit4:junit4]   2> 	    <str name="name">HTMLstandardtok</str>
[junit4:junit4]   2> 	    <str name="type">HTMLstandardtok</str>
[junit4:junit4]   2> 	    <bool name="indexed">true</bool>
[junit4:junit4]   2> 	    <bool name="stored">true</bool>
[junit4:junit4]   2> 	  </lst>
[junit4:junit4]   2> 	  <lst>
[junit4:junit4]   2> 	    <str name="name">test_postv</str>
[junit4:junit4]   2> 	    <str name="type">text</str>
[junit4:junit4]   2> 	    <bool name="termVectors">true</bool>
[junit4:junit4]   2> 	    <bool name="termPositions">true</bool>
[junit4:junit4]   2> 	  </lst>
[junit4:junit4]   2> 	  <lst>
[junit4:junit4]   2> 	    <str name="name">test_hlt_off</str>
[junit4:junit4]   2> 	    <str name="type">highlittext</str>
[junit4:junit4]   2> 	    <bool name="compressed">false</bool>
[junit4:junit4]   2> 	    <bool name="indexed">true</bool>
[junit4:junit4]   2> 	  </lst>
[junit4:junit4]   2> 	  <lst>
[junit4:junit4]   2> 	    <str name="name">copyfield_source</str>
[junit4:junit4]   2> 	    <str name="type">string</str>
[junit4:junit4]   2> 	    <bool name="indexed">true</bool>
[junit4:junit4]   2> 	    <bool name="stored">true</bool>
[junit4:junit4]   2> 	    <bool name="multiValued">true</bool>
[junit4:junit4]   2> 	  </lst>
[junit4:junit4]   2> 	  <lst>
[junit4:junit4]   2> 	    <str name="name">bday</str>
[junit4:junit4]   2> 	    <str name="type">date</str>
[junit4:junit4]   2> 	    <bool name="indexed">true</bool>
[junit4:junit4]   2> 	    <bool name="stored">true</bool>
[junit4:junit4]   2> 	  </lst>
[junit4:junit4]   2> 	</arr>
[junit4:junit4]   2> 	</response>
[junit4:junit4]   2> 	
[junit4:junit4]   2> 		request was:/schema/fields?indent=on&wt=xml
[junit4:junit4]   2> 1390 T530 oasc.SolrException.log SEVERE REQUEST FAILED: /schema/fields?indent=on&wt=xml:java.lang.RuntimeException: REQUEST FAILED: xpath=(/response/arr[@name='fields']/lst/str[@name='name'])[1] = 'custstopfilt'
[junit4:junit4]   2> 		xml response was: <?xml version="1.0" encoding="UTF-8"?>
[junit4:junit4]   2> 	<response>
[junit4:junit4]   2> 	
[junit4:junit4]   2> 	<lst name="responseHeader">
[junit4:junit4]   2> 	  <int name="status">0</int>
[junit4:junit4]   2> 	  <int name="QTime">1</int>
[junit4:junit4]   2> 	</lst>
[junit4:junit4]   2> 	<arr name="fields">
[junit4:junit4]   2> 	  <lst>
[junit4:junit4]   2> 	    <str name="name">lowerfilt</str>
[junit4:junit4]   2> 	    <str name="type">lowerfilt</str>
[junit4:junit4]   2> 	    <bool name="indexed">true</bool>
[junit4:junit4]   2> 	    <bool name="stored">true</bool>
[junit4:junit4]   2> 	  </lst>
[junit4:junit4]   2> 	  <lst>
[junit4:junit4]   2> 	    <str name="name">text_np</str>
[junit4:junit4]   2> 	    <str name="type">text_np</str>
[junit4:junit4]   2> 	    <bool name="indexed">true</bool>
[junit4:junit4]   2> 	    <bool name="stored">false</bool>
[junit4:junit4]   2> 	  </lst>
[junit4:junit4]   2> 	  <lst>
[junit4:junit4]   2> 	    <str name="name">timestamp</str>
[junit4:junit4]   2> 	    <str name="type">date</str>
[junit4:junit4]   2> 	    <bool name="indexed">true</bool>
[junit4:junit4]   2> 	    <bool name="stored">true</bool>
[junit4:junit4]   2> 	  </lst>
[junit4:junit4]   2> 	  <lst>
[junit4:junit4]   2> 	    <str name="name">id</str>
[junit4:junit4]   2> 	    <str name="type">string</str>
[junit4:junit4]   2> 	    <bool name="indexed">true</bool>
[junit4:junit4]   2> 	    <bool name="stored">true</bool>
[junit4:junit4]   2> 	    <bool name="multiValued">false</bool>
[junit4:junit4]   2> 	    <bool name="required">true</bool>
[junit4:junit4]   2> 	    <bool name="uniqueKey">true</bool>
[junit4:junit4]   2> 	  </lst>
[junit4:junit4]   2> 	  <lst>
[junit4:junit4]   2> 	    <str name="name">signatureField</str>
[junit4:junit4]   2> 	    <str name="type">string</str>
[junit4:junit4]   2> 	    <bool name="indexed">true</bool>
[junit4:junit4]   2> 	    <bool name="stored">false</bool>
[junit4:junit4]   2> 	  </lst>
[junit4:junit4]   2> 	  <lst>
[junit4:junit4]   2> 	    <str name="name">sindsto</str>
[junit4:junit4]   2> 	    <str name="type">string</str>
[junit4:junit4]   2> 	    <bool name="indexed">true</bool>
[junit4:junit4]   2> 	    <bool name="stored">true</bool>
[junit4:junit4]   2> 	  </lst>
[junit4:junit4]   2> 	  <lst>
[junit4:junit4]   2> 	    <str name="name">isto</str>
[junit4:junit4]   2> 	    <str name="type">int</str>
[junit4:junit4]   2> 	    <bool name="indexed">false</bool>
[junit4:junit4]   2> 	    <bool name="stored">true</bool>
[junit4:junit4]   2> 	  </lst>
[junit4:junit4]   2> 	  <lst>
[junit4:junit4]   2> 	    <str name="name">subject</str>
[junit4:junit4]   2> 	    <str name="type">text</str>
[junit4:junit4]   2> 	    <bool name="indexed">true</bool>
[junit4:junit4]   2> 	    <bool name="stored">true</bool>
[junit4:junit4]   2> 	  </lst>
[junit4:junit4]   2> 	  <lst>
[junit4:junit4]   2> 	    <str name="name">text</str>
[junit4:junit4]   2> 	    <str name="type">text</str>
[junit4:junit4]   2> 	    <bool name="indexed">true</bool>
[junit4:junit4]   2> 	    <bool name="stored">false</bool>
[junit4:junit4]   2> 	    <bool name="multiValued">true</bool>
[junit4:junit4]   2> 	  </lst>
[junit4:junit4]   2> 	  <lst>
[junit4:junit4]   2> 	    <str name="name">HTMLwhitetok</str>
[junit4:junit4]   2> 	    <str name="type">HTMLwhitetok</str>
[junit4:junit4]   2> 	    <bool name="indexed">true</bool>
[junit4:junit4]   2> 	    <bool name="stored">true</bool>
[junit4:junit4]   2> 	  </lst>
[junit4:junit4]   2> 	  <lst>
[junit4:junit4]   2> 	    <str name="name">wdf_nocase</str>
[junit4:junit4]   2> 	    <str name="type">wdf_nocase</str>
[junit4:junit4]   2> 	    <bool name="indexed">true</bool>
[junit4:junit4]   2> 	    <bool name="stored">true</bool>
[junit4:junit4]   2> 	  </lst>
[junit4:junit4]   2> 	  <lst>
[junit4:junit4]   2> 	    <str name="name">bind</str>
[junit4:junit4]   2> 	    <str name="type">boolean</str>
[junit4:junit4]   2> 	    <bool name="indexed">true</bool>
[junit4:junit4]   2> 	    <bool name="stored">false</bool>
[junit4:junit4]   2> 	  </lst>
[junit4:junit4]   2> 	  <lst>
[junit4:junit4]   2> 	    <str name="name">title_lettertok</str>
[junit4:junit4]   2> 	    <str name="type">lettertok</str>
[junit4:junit4]   2> 	    <bool name="indexed">true</bool>
[junit4:junit4]   2> 	    <bool name="stored">false</bool>
[junit4:junit4]   2> 	  </lst>
[junit4:junit4]   2> 	  <lst>
[junit4:junit4]   2> 	    <str name="name">test_offtv</str>
[junit4:junit4]   2> 	    <str name="type">text</str>
[junit4:junit4]   2> 	    <bool name="termOffsets">true</bool>
[junit4:junit4]   2> 	    <bool name="termVectors">true</bool>
[junit4:junit4]   2> 	  </lst>
[junit4:junit4]   2> 	  <lst>
[junit4:junit4]   2> 	    <str name="name">subword</str>
[junit4:junit4]   2> 	    <str name="type">subword</str>
[junit4:junit4]   2> 	    <bool name="indexed">true</bool>
[junit4:junit4]   2> 	    <bool name="stored">true</bool>
[junit4:junit4]   2> 	  </lst>
[junit4:junit4]   2> 	  <lst>
[junit4:junit4]   2> 	    <str name="name">title</str>
[junit4:junit4]   2> 	    <str name="type">nametext</str>
[junit4:junit4]   2> 	    <bool name="indexed">true</bool>
[junit4:junit4]   2> 	    <bool name="stored">true</bool>
[junit4:junit4]   2> 	  </lst>
[junit4:junit4]   2> 	  <lst>
[junit4:junit4]   2> 	    <str name="name">shouldbestored</str>
[junit4:junit4]   2> 	    <str name="type">unstored</str>
[junit4:junit4]   2> 	    <bool name="stored">true</bool>
[junit4:junit4]   2> 	  </lst>
[junit4:junit4]   2> 	  <lst>
[junit4:junit4]   2> 	    <str name="name">point_hash</str>
[junit4:junit4]   2> 	    <str name="type">geohash</str>
[junit4:junit4]   2> 	    <bool name="indexed">true</bool>
[junit4:junit4]   2> 	    <bool name="stored">true</bool>
[junit4:junit4]   2> 	    <bool name="multiValued">false</bool>
[junit4:junit4]   2> 	  </lst>
[junit4:junit4]   2> 	  <lst>
[junit4:junit4]   2> 	    <str name="name">custengporterfilt</str>
[junit4:junit4]   2> 	    <str name="type">custengporterfilt</str>
[junit4:junit4]   2> 	    <bool name="indexed">true</bool>
[junit4:junit4]   2> 	    <bool name="stored">true</bool>
[junit4:junit4]   2> 	  </lst>
[junit4:junit4]   2> 	  <lst>
[junit4:junit4]   2> 	    <str name="name">lettertok</str>
[junit4:junit4]   2> 	    <str name="type">lettertok</str>
[junit4:junit4]   2> 	    <bool name="indexed">true</bool>
[junit4:junit4]   2> 	    <bool name="stored">true</bool>
[junit4:junit4]   2> 	  </lst>
[junit4:junit4]   2> 	  <lst>
[junit4:junit4]   2> 	    <str name="name">test_posofftv</str>
[junit4:junit4]   2> 	    <str name="type">text</str>
[junit4:junit4]   2> 	    <bool name="termOffsets">true</bool>
[junit4:junit4]   2> 	    <bool name="termVectors">true</bool>
[junit4:junit4]   2> 	    <bool name="termPositions">true</bool>
[junit4:junit4]   2> 	  </lst>
[junit4:junit4]   2> 	  <lst>
[junit4:junit4]   2> 	    <str name="name">lengthfilt</str>
[junit4:junit4]   2> 	    <str name="type">lengthfilt</str>
[junit4:junit4]   2> 	    <bool name="indexed">true</bool>
[junit4:junit4]   2> 	    <bool name="stored">true</bool>
[junit4:junit4]   2> 	  </lst>
[junit4:junit4]   2> 	  <lst>
[junit4:junit4]   2> 	    <str name="name">standardtok</str>
[junit4:junit4]   2> 	    <str name="type">standardtok</str>
[junit4:junit4]   2> 	    <bool name="indexed">true</bool>
[junit4:junit4]   2> 	    <bool name="stored">true</bool>
[junit4:junit4]   2> 	  </lst>
[junit4:junit4]   2> 	  <lst>
[junit4:junit4]   2> 	    <str name="name">weight</str>
[junit4:junit4]   2> 	    <str name="type">float</str>
[junit4:junit4]   2> 	    <bool name="indexed">true</bool>
[junit4:junit4]   2> 	    <bool name="stored">true</bool>
[junit4:junit4]   2> 	  </lst>
[junit4:junit4]   2> 	  <lst>
[junit4:junit4]   2> 	    <str name="name">porterfilt</str>
[junit4:junit4]   2> 	    <str name="type">porterfilt</str>
[junit4:junit4]   2> 	    <bool name="indexed">true</bool>
[junit4:junit4]   2> 	    <bool name="stored">true</bool>
[junit4:junit4]   2> 	  </lst>
[junit4:junit4]   2> 	  <lst>
[junit4:junit4]   2> 	    <str name="name">title_stemmed</str>
[junit4:junit4]   2> 	    <str name="type">text</str>
[junit4:junit4]   2> 	    <bool name="indexed">true</bool>
[junit4:junit4]   2> 	    <bool name="stored">false</bool>
[junit4:junit4]   2> 	  </lst>
[junit4:junit4]   2> 	  <lst>
[junit4:junit4]   2> 	    <str name="name">standardtokfilt</str>
[junit4:junit4]   2> 	    <str name="type">standardtokfilt</str>
[junit4:junit4]   2> 	    <bool name="indexed">true</bool>
[junit4:junit4]   2> 	    <bool name="stored">true</bool>
[junit4:junit4]   2> 	  </lst>
[junit4:junit4]   2> 	  <lst>
[junit4:junit4]   2> 	    <str name="name">uniq</str>
[junit4:junit4]   2> 	    <str name="type">string</str>
[junit4:junit4]   2> 	    <bool name="indexed">true</bool>
[junit4:junit4]   2> 	    <bool name="stored">true</bool>
[junit4:junit4]   2> 	    <bool name="multiValued">true</bool>
[junit4:junit4]   2> 	  </lst>
[junit4:junit4]   2> 	  <lst>
[junit4:junit4]   2> 	    <str name="name">test_basictv</str>
[junit4:junit4]   2> 	    <str name="type">text</str>
[junit4:junit4]   2> 	    <bool name="termVectors">true</bool>
[junit4:junit4]   2> 	  </lst>
[junit4:junit4]   2> 	  <lst>
[junit4:junit4]   2> 	    <str name="name">whitetok</str>
[junit4:junit4]   2> 	    <str name="type">whitetok</str>
[junit4:junit4]   2> 	    <bool name="indexed">true</bool>
[junit4:junit4]   2> 	    <bool name="stored">true</bool>
[junit4:junit4]   2> 	  </lst>
[junit4:junit4]   2> 	  <lst>
[junit4:junit4]   2> 	    <str name="name">nullfirst</str>
[junit4:junit4]   2> 	    <str name="type">string</str>
[junit4:junit4]   2> 	    <bool name="indexed">true</bool>
[junit4:junit4]   2> 	    <bool name="stored">true</bool>
[junit4:junit4]   2> 	    <bool name="sortMissingFirst">true</bool>
[junit4:junit4]   2> 	  </lst>
[junit4:junit4]   2> 	  <lst>
[junit4:junit4]   2> 	    <str name="name">textgap</str>
[junit4:junit4]   2> 	    <str name="type">textgap</str>
[junit4:junit4]   2> 	    <bool name="indexed">true</bool>
[junit4:junit4]   2> 	    <bool name="stored">true</bool>
[junit4:junit4]   2> 	  </lst>
[junit4:junit4]   2> 	  <lst>
[junit4:junit4]   2> 	    <str name="name">name</str>
[junit4:junit4]   2> 	    <str name="type">nametext</str>
[junit4:junit4]   2> 	    <bool name="indexed">true</bool>
[junit4:junit4]   2> 	    <bool name="stored">true</bool>
[junit4:junit4]   2> 	  </lst>
[junit4:junit4]   2> 	  <lst>
[junit4:junit4]   2> 	    <str name="name">bsto</str>
[junit4:junit4]   2> 	    <str name="type">boolean</str>
[junit4:junit4]   2> 	    <bool name="indexed">false</bool>
[junit4:junit4]   2> 	    <bool name="stored">true</bool>
[junit4:junit4]   2> 	  </lst>
[junit4:junit4]   2> 	  <lst>
[junit4:junit4]   2> 	    <str name="name">sind</str>
[junit4:junit4]   2> 	    <str name="type">string</str>
[junit4:junit4]   2> 	    <bool name="indexed">true</bool>
[junit4:junit4]   2> 	    <bool name="stored">false</bool>
[junit4:junit4]   2> 	  </lst>
[junit4:junit4]   2> 	  <lst>
[junit4:junit4]   2> 	    <str name="name">stopfilt</str>
[junit4:junit4]   2> 	    <str name="type">stopfilt</str>
[junit4:junit4]   2> 	    <bool name="indexed">true</bool>
[junit4:junit4]   2> 	    <bool name="stored">true</bool>
[junit4:junit4]   2> 	  </lst>
[junit4:junit4]   2> 	  <lst>
[junit4:junit4]   2> 	    <str name="name">test_notv</str>
[junit4:junit4]   2> 	    <str name="type">text</str>
[junit4:junit4]   2> 	    <bool name="termVectors">false</bool>
[junit4:junit4]   2> 	  </lst>
[junit4:junit4]   2> 	  <lst>
[junit4:junit4]   2> 	    <str name="name">point</str>
[junit4:junit4]   2> 	    <str name="type">xy</str>
[junit4:junit4]   2> 	    <bool name="indexed">true</bool>
[junit4:junit4]   2> 	    <bool name="stored">true</bool>
[junit4:junit4]   2> 	    <bool name="multiValued">false</bool>
[junit4:junit4]   2> 	  </lst>
[junit4:junit4]   2> 	  <lst>
[junit4:junit4]   2> 	    <str name="name">wdf_preserve</str>
[junit4:junit4]   2> 	    <str name="type">wdf_preserve</str>
[junit4:junit4]   2> 	    <bool name="indexed">true</bool>
[junit4:junit4]   2> 	    <bool name="stored">true</bool>
[junit4:junit4]   2> 	  </lst>
[junit4:junit4]   2> 	  <lst>
[junit4:junit4]   2> 	    <str name="name">teststop</str>
[junit4:junit4]   2> 	    <str name="type">teststop</str>
[junit4:junit4]   2> 	    <bool name="indexed">true</bool>
[junit4:junit4]   2> 	    <bool name="stored">true</bool>
[junit4:junit4]   2> 	  </lst>
[junit4:junit4]   2> 	  <lst>
[junit4:junit4]   2> 	    <str name="name">numericsubword</str>
[junit4:junit4]   2> 	    <str name="type">numericsubword</str>
[junit4:junit4]   2> 	    <bool name="indexed">true</bool>
[junit4:junit4]   2> 	    <bool name="stored">true</bool>
[junit4:junit4]   2> 	  </lst>
[junit4:junit4]   2> 	  <lst>
[junit4:junit4]   2> 	    <str name="name">patternreplacefilt</str>
[junit4:junit4]   2> 	    <str name="type">patternreplacefilt</str>
[junit4:junit4]   2> 	    <bool name="indexed">true</bool>
[junit4:junit4]   2> 	    <bool name="stored">true</bool>
[junit4:junit4]   2> 	  </lst>
[junit4:junit4]   2> 	  <lst>
[junit4:junit4]   2> 	    <str name="name">lowertok</str>
[junit4:junit4]   2> 	    <str name="type">lowertok</str>
[junit4:junit4]   2> 	    <bool name="indexed">true</bool>
[junit4:junit4]   2> 	    <bool name="stored">true</bool>
[junit4:junit4]   2> 	  </lst>
[junit4:junit4]   2> 	  <lst>
[junit4:junit4]   2> 	    <str name="name">shouldbeunstored</str>
[junit4:junit4]   2> 	    <str name="type">unstored</str>
[junit4:junit4]   2> 	  </lst>
[junit4:junit4]   2> 	  <lst>
[junit4:junit4]   2> 	    <str name="name">sku1</str>
[junit4:junit4]   2> 	    <str name="type">skutype1</str>
[junit4:junit4]   2> 	    <bool name="indexed">true</bool>
[junit4:junit4]   2> 	    <bool name="stored">true</bool>
[junit4:junit4]   2> 	  </lst>
[junit4:junit4]   2> 	  <lst>
[junit4:junit4]   2> 	    <str name="name">pointD</str>
[junit4:junit4]   2> 	    <str name="type">xyd</str>
[junit4:junit4]   2> 	    <bool name="indexed">true</bool>
[junit4:junit4]   2> 	    <bool name="stored">true</bool>
[junit4:junit4]   2> 	    <bool name="multiValued">false</bool>
[junit4:junit4]   2> 	  </lst>
[junit4:junit4]   2> 	  <lst>
[junit4:junit4]   2> 	    <str name="name">sku2</str>
[junit4:junit4]   2> 	    <str name="type">skutype2</str>
[junit4:junit4]   2> 	    <bool name="indexed">true</bool>
[junit4:junit4]   2> 	    <bool name="stored">true</bool>
[junit4:junit4]   2> 	  </lst>
[junit4:junit4]   2> 	  <lst>
[junit4:junit4]   2> 	    <str name="name">uuid</str>
[junit4:junit4]   2> 	    <str name="type">uuid</str>
[junit4:junit4]   2> 	    <bool name="stored">true</bool>
[junit4:junit4]   2> 	  </lst>
[junit4:junit4]   2> 	  <lst>
[junit4:junit4]   2> 	    <str name="name">shouldbeunindexed</str>
[junit4:junit4]   2> 	    <str name="type">unstored</str>
[junit4:junit4]   2> 	    <bool name="indexed">false</bool>
[junit4:junit4]   2> 	    <bool name="stored">true</bool>
[junit4:junit4]   2> 	  </lst>
[junit4:junit4]   2> 	  <lst>
[junit4:junit4]   2> 	    <str name="name">nouniq</str>
[junit4:junit4]   2> 	    <str name="type">string</str>
[junit4:junit4]   2> 	    <bool name="indexed">true</bool>
[junit4:junit4]   2> 	    <bool name="stored">true</bool>
[junit4:junit4]   2> 	    <bool name="multiValued">true</bool>
[junit4:junit4]   2> 	  </lst>
[junit4:junit4]   2> 	  <lst>
[junit4:junit4]   2> 	    <str name="name">test_hlt</str>
[junit4:junit4]   2> 	    <str name="type">highlittext</str>
[junit4:junit4]   2> 	    <bool name="compressed">true</bool>
[junit4:junit4]   2> 	    <bool name="indexed">true</bool>
[junit4:junit4]   2> 	  </lst>
[junit4:junit4]   2> 	  <lst>
[junit4:junit4]   2> 	    <str name="name">keywordtok</str>
[junit4:junit4]   2> 	    <str name="type">keywordtok</str>
[junit4:junit4]   2> 	    <bool name="indexed">true</bool>
[junit4:junit4]   2> 	    <bool name="stored">true</bool>
[junit4:junit4]   2> 	  </lst>
[junit4:junit4]   2> 	  <lst>
[junit4:junit4]   2> 	    <str name="name">standardfilt</str>
[junit4:junit4]   2> 	    <str name="type">standardfilt</str>
[junit4:junit4]   2> 	    <bool name="indexed">true</bool>
[junit4:junit4]   2> 	    <bool name="stored">true</bool>
[junit4:junit4]   2> 	  </lst>
[junit4:junit4]   2> 	  <lst>
[junit4:junit4]   2> 	    <str name="name">syn</str>
[junit4:junit4]   2> 	    <str name="type">syn</str>
[junit4:junit4]   2> 	    <bool name="indexed">true</bool>
[junit4:junit4]   2> 	    <bool name="stored">true</bool>
[junit4:junit4]   2> 	  </lst>
[junit4:junit4]   2> 	  <lst>
[junit4:junit4]   2> 	    <str name="name">bindsto</str>
[junit4:junit4]   2> 	    <str name="type">boolean</str>
[junit4:junit4]   2> 	    <bool name="indexed">true</bool>
[junit4:junit4]   2> 	    <bool name="stored">true</bool>
[junit4:junit4]   2> 	  </lst>
[junit4:junit4]   2> 	  <lst>
[junit4:junit4]   2> 	    <str name="name">uniq2</str>
[junit4:junit4]   2> 	    <str name="type">string</str>
[junit4:junit4]   2> 	    <bool name="indexed">true</bool>
[junit4:junit4]   2> 	    <bool name="stored">true</bool>
[junit4:junit4]   2> 	    <bool name="multiValued">true</bool>
[junit4:junit4]   2> 	  </lst>
[junit4:junit4]   2> 	  <lst>
[junit4:junit4]   2> 	    <str name="name">uniq3</str>
[junit4:junit4]   2> 	    <str name="type">string</str>
[junit4:junit4]   2> 	    <bool name="indexed">true</bool>
[junit4:junit4]   2> 	    <bool name="stored">true</bool>
[junit4:junit4]   2> 	  </lst>
[junit4:junit4]   2> 	  <lst>
[junit4:junit4]   2> 	    <str name="name">iind</str>
[junit4:junit4]   2> 	    <str name="type">int</str>
[junit4:junit4]   2> 	    <bool name="indexed">true</bool>
[junit4:junit4]   2> 	    <bool name="stored">false</bool>
[junit4:junit4]   2> 	  </lst>
[junit4:junit4]   2> 	  <lst>
[junit4:junit4]   2> 	    <str name="name">engporterfilt</str>
[junit4:junit4]   2> 	    <str name="type">engporterfilt</str>
[junit4:junit4]   2> 	    <bool name="indexed">true</bool>
[junit4:junit4]   2> 	    <bool name="stored">true</bool>
[junit4:junit4]   2> 	  </lst>
[junit4:junit4]   2> 	  <lst>
[junit4:junit4]   2> 	    <str name="name">numberpartfail</str>
[junit4:junit4]   2> 	    <str name="type">failtype1</str>
[junit4:junit4]   2> 	    <bool name="indexed">true</bool>
[junit4:junit4]   2> 	    <bool name="stored">true</bool>
[junit4:junit4]   2> 	  </lst>
[junit4:junit4]   2> 	  <lst>
[junit4:junit4]   2> 	    <str name="name">ssto</str>
[junit4:junit4]   2> 	    <str name="type">string</str>
[junit4:junit4]   2> 	    <bool name="indexed">false</bool>
[junit4:junit4]   2> 	    <bool name="stored">true</bool>
[junit4:junit4]   2> 	  </lst>
[junit4:junit4]   2> 	  <lst>
[junit4:junit4]   2> 	    <str name="name">protectedsubword</str>
[junit4:junit4]   2> 	    <str name="type">protectedsubword</str>
[junit4:junit4]   2> 	    <bool name="indexed">true</bool>
[junit4:junit4]   2> 	    <bool name="stored">true</bool>
[junit4:junit4]   2> 	  </lst>
[junit4:junit4]   2> 	  <lst>
[junit4:junit4]   2> 	    <str name="name">dedup</str>
[junit4:junit4]   2> 	    <str name="type">dedup</str>
[junit4:junit4]   2> 	    <bool name="indexed">true</bool>
[junit4:junit4]   2> 	    <bool name="stored">true</bool>
[junit4:junit4]   2> 	  </lst>
[junit4:junit4]   2> 	  <lst>
[junit4:junit4]   2> 	    <str name="name">custstopfilt</str>
[junit4:junit4]   2> 	    <str name="type">custstopfilt</str>
[junit4:junit4]   2> 	    <bool name="indexed">true</bool>
[junit4:junit4]   2> 	    <bool name="stored">true</bool>
[junit4:junit4]   2> 	  </lst>
[junit4:junit4]   2> 	  <lst>
[junit4:junit4]   2> 	    <str name="name">store</str>
[junit4:junit4]   2> 	    <str name="type">location</str>
[junit4:junit4]   2> 	    <bool name="indexed">true</bool>
[junit4:junit4]   2> 	    <bool name="stored">true</bool>
[junit4:junit4]   2> 	  </lst>
[junit4:junit4]   2> 	  <lst>
[junit4:junit4]   2> 	    <str name="name">_version_</str>
[junit4:junit4]   2> 	    <str name="type">long</str>
[junit4:junit4]   2> 	    <bool name="indexed">true</bool>
[junit4:junit4]   2> 	    <bool name="stored">true</bool>
[junit4:junit4]   2> 	  </lst>
[junit4:junit4]   2> 	  <lst>
[junit4:junit4]   2> 	    <str name="name">HTMLstandardtok</str>
[junit4:junit4]   2> 	    <str name="type">HTMLstandardtok</str>
[junit4:junit4]   2> 	    <bool name="indexed">true</bool>
[junit4:junit4]   2> 	    <bool name="stored">true</bool>
[junit4:junit4]   2> 	  </lst>
[junit4:junit4]   2> 	  <lst>
[junit4:junit4]   2> 	    <str name="name">test_postv</str>
[junit4:junit4]   2> 	    <str name="type">text</str>
[junit4:junit4]   2> 	    <bool name="termVectors">true</bool>
[junit4:junit4]   2> 	    <bool name="termPositions">true</bool>
[junit4:junit4]   2> 	  </lst>
[junit4:junit4]   2> 	  <lst>
[junit4:junit4]   2> 	    <str name="name">test_hlt_off</str>
[junit4:junit4]   2> 	    <str name="type">highlittext</str>
[junit4:junit4]   2> 	    <bool name="compressed">false</bool>
[junit4:junit4]   2> 	    <bool name="indexed">true</bool>
[junit4:junit4]   2> 	  </lst>
[junit4:junit4]   2> 	  <lst>
[junit4:junit4]   2> 	    <str name="name">copyfield_source</str>
[junit4:junit4]   2> 	    <str name="type">string</str>
[junit4:junit4]   2> 	    <bool name="indexed">true</bool>
[junit4:junit4]   2> 	    <bool name="stored">true</bool>
[junit4:junit4]   2> 	    <bool name="multiValued">true</bool>
[junit4:junit4]   2> 	  </lst>
[junit4:junit4]   2> 	  <lst>
[junit4:junit4]   2> 	    <str name="name">bday</str>
[junit4:junit4]   2> 	    <str name="type">date</str>
[junit4:junit4]   2> 	    <bool name="indexed">true</bool>
[junit4:junit4]   2> 	    <bool name="stored">true</bool>
[junit4:junit4]   2> 	  </lst>
[junit4:junit4]   2> 	</arr>
[junit4:junit4]   2> 	</response>
[junit4:junit4]   2> 	
[junit4:junit4]   2> 		request was:/schema/fields?indent=on&wt=xml
[junit4:junit4]   2> 		at org.apache.solr.util.RestTestBase.assertQ(RestTestBase.java:136)
[junit4:junit4]   2> 		at org.apache.solr.rest.TestFieldCollectionResource.testGetAllFields(TestFieldCollectionResource.java:26)
[junit4:junit4]   2> 		at sun.reflect.NativeMethodAccessorImpl.invoke0(Native Method)
[junit4:junit4]   2> 		at sun.reflect.NativeMethodAccessorImpl.invoke(NativeMethodAccessorImpl.java:88)
[junit4:junit4]   2> 		at sun.reflect.DelegatingMethodAccessorImpl.invoke(DelegatingMethodAccessorImpl.java:55)
[junit4:junit4]   2> 		at java.lang.reflect.Method.invoke(Method.java:613)
[junit4:junit4]   2> 		at com.carrotsearch.randomizedtesting.RandomizedRunner.invoke(RandomizedRunner.java:1559)
[junit4:junit4]   2> 		at com.carrotsearch.randomizedtesting.RandomizedRunner.access$600(RandomizedRunner.java:79)
[junit4:junit4]   2> 		at com.carrotsearch.randomizedtesting.RandomizedRunner$6.evaluate(RandomizedRunner.java:737)
[junit4:junit4]   2> 		at com.carrotsearch.randomizedtesting.RandomizedRunner$7.evaluate(RandomizedRunner.java:773)
[junit4:junit4]   2> 		at com.carrotsearch.randomizedtesting.RandomizedRunner$8.evaluate(RandomizedRunner.java:787)
[junit4:junit4]   2> 		at com.carrotsearch.randomizedtesting.rules.SystemPropertiesRestoreRule$1.evaluate(SystemPropertiesRestoreRule.java:53)
[junit4:junit4]   2> 		at org.apache.lucene.util.TestRuleSetupTeardownChained$1.evaluate(TestRuleSetupTeardownChained.java:50)
[junit4:junit4]   2> 		at org.apache.lucene.util.TestRuleFieldCacheSanity$1.evaluate(TestRuleFieldCacheSanity.java:51)
[junit4:junit4]   2> 		at org.apache.lucene.util.AbstractBeforeAfterRule$1.evaluate(AbstractBeforeAfterRule.java:46)
[junit4:junit4]   2> 		at com.carrotsearch.randomizedtesting.rules.SystemPropertiesInvariantRule$1.evaluate(SystemPropertiesInvariantRule.java:55)
[junit4:junit4]   2> 		at org.apache.lucene.util.TestRuleThreadAndTestName$1.evaluate(TestRuleThreadAndTestName.java:49)
[junit4:junit4]   2> 		at org.apache.lucene.util.TestRuleIgnoreAfterMaxFailures$1.evaluate(TestRuleIgnoreAfterMaxFailures.java:70)
[junit4:junit4]   2> 		at org.apache.lucene.util.TestRuleMarkFailure$1.evaluate(TestRuleMarkFailure.java:48)
[junit4:junit4]   2> 		at com.carrotsearch.randomizedtesting.rules.StatementAdapter.evaluate(StatementAdapter.java:36)
[junit4:junit4]   2> 		at com.carrotsearch.randomizedtesting.ThreadLeakControl$StatementRunner.run(ThreadLeakControl.java:358)
[junit4:junit4]   2> 		at com.carrotsearch.randomizedtesting.ThreadLeakControl.forkTimeoutingTask(ThreadLeakControl.java:782)
[junit4:junit4]   2> 		at com.carrotsearch.randomizedtesting.ThreadLeakControl$3.evaluate(ThreadLeakControl.java:442)
[junit4:junit4]   2> 		at com.carrotsearch.randomizedtesting.RandomizedRunner.runSingleTest(RandomizedRunner.java:746)
[junit4:junit4]   2> 		at com.carrotsearch.randomizedtesting.RandomizedRunner$3.evaluate(RandomizedRunner.java:648)
[junit4:junit4]   2> 		at com.carrotsearch.randomizedtesting.RandomizedRunner$4.evaluate(RandomizedRunner.java:682)
[junit4:junit4]   2> 		at com.carrotsearch.randomizedtesting.RandomizedRunner$5.evaluate(RandomizedRunner.java:693)
[junit4:junit4]   2> 		at com.carrotsearch.randomizedtesting.rules.StatementAdapter.evaluate(StatementAdapter.java:36)
[junit4:junit4]   2> 		at com.carrotsearch.randomizedtesting.rules.SystemPropertiesRestoreRule$1.evaluate(SystemPropertiesRestoreRule.java:53)
[junit4:junit4]   2> 		at org.apache.lucene.util.AbstractBeforeAfterRule$1.evaluate(AbstractBeforeAfterRule.java:46)
[junit4:junit4]   2> 		at org.apache.lucene.util.TestRuleStoreClassName$1.evaluate(TestRuleStoreClassName.java:42)
[junit4:junit4]   2> 		at com.carrotsearch.randomizedtesting.rules.SystemPropertiesInvariantRule$1.evaluate(SystemPropertiesInvariantRule.java:55)
[junit4:junit4]   2> 		at com.carrotsearch.randomizedtesting.rules.NoShadowingOrOverridesOnMethodsRule$1.evaluate(NoShadowingOrOverridesOnMethodsRule.java:39)
[junit4:junit4]   2> 		at com.carrotsearch.randomizedtesting.rules.NoShadowingOrOverridesOnMethodsRule$1.evaluate(NoShadowingOrOverridesOnMethodsRule.java:39)
[junit4:junit4]   2> 		at com.carrotsearch.randomizedtesting.rules.StatementAdapter.evaluate(StatementAdapter.java:36)
[junit4:junit4]   2> 		at org.apache.lucene.util.TestRuleAssertionsRequired$1.evaluate(TestRuleAssertionsRequired.java:43)
[junit4:junit4]   2> 		at org.apache.lucene.util.TestRuleMarkFailure$1.evaluate(TestRuleMarkFailure.java:48)
[junit4:junit4]   2> 		at org.apache.lucene.util.TestRuleIgnoreAfterMaxFailures$1.evaluate(TestRuleIgnoreAfterMaxFailures.java:70)
[junit4:junit4]   2> 		at org.apache.lucene.util.TestRuleIgnoreTestSuites$1.evaluate(TestRuleIgnoreTestSuites.java:55)
[junit4:junit4]   2> 		at com.carrotsearch.randomizedtesting.rules.StatementAdapter.evaluate(StatementAdapter.java:36)
[junit4:junit4]   2> 		at com.carrotsearch.randomizedtesting.ThreadLeakControl$StatementRunner.run(ThreadLeakControl.java:358)
[junit4:junit4]   2> 		at java.lang.Thread.run(Thread.java:780)
[junit4:junit4]   2> 	
[junit4:junit4]   2> 1392 T530 oas.SolrTestCaseJ4.tearDown ###Ending testGetAllFields
[junit4:junit4]   2> NOTE: reproduce with: ant test  -Dtestcase=TestFieldCollectionResource -Dtests.method=testGetAllFields -Dtests.seed=61D5E16461379449 -Dtests.multiplier=3 -Dtests.slow=true -Dtests.locale=en -Dtests.timezone=America/Guayaquil -Dtests.file.encoding=UTF-8
[junit4:junit4] ERROR   0.36s J0 | TestFieldCollectionResource.testGetAllFields <<<
[junit4:junit4]    > Throwable #1: java.lang.RuntimeException: Exception during query
[junit4:junit4]    > 	at __randomizedtesting.SeedInfo.seed([61D5E16461379449:8D7BABA09BC46DD1]:0)
[junit4:junit4]    > 	at org.apache.solr.util.RestTestBase.assertQ(RestTestBase.java:143)
[junit4:junit4]    > 	at org.apache.solr.rest.TestFieldCollectionResource.testGetAllFields(TestFieldCollectionResource.java:26)
[junit4:junit4]    > 	at sun.reflect.NativeMethodAccessorImpl.invoke0(Native Method)
[junit4:junit4]    > 	at sun.reflect.NativeMethodAccessorImpl.invoke(NativeMethodAccessorImpl.java:88)
[junit4:junit4]    > 	at sun.reflect.DelegatingMethodAccessorImpl.invoke(DelegatingMethodAccessorImpl.java:55)
[junit4:junit4]    > 	at java.lang.reflect.Method.invoke(Method.java:613)
[junit4:junit4]    > 	at com.carrotsearch.randomizedtesting.RandomizedRunner.invoke(RandomizedRunner.java:1559)
[junit4:junit4]    > 	at com.carrotsearch.randomizedtesting.RandomizedRunner.access$600(RandomizedRunner.java:79)
[junit4:junit4]    > 	at com.carrotsearch.randomizedtesting.RandomizedRunner$6.evaluate(RandomizedRunner.java:737)
[junit4:junit4]    > 	at com.carrotsearch.randomizedtesting.RandomizedRunner$7.evaluate(RandomizedRunner.java:773)
[junit4:junit4]    > 	at com.carrotsearch.randomizedtesting.RandomizedRunner$8.evaluate(RandomizedRunner.java:787)
[junit4:junit4]    > 	at com.carrotsearch.randomizedtesting.rules.SystemPropertiesRestoreRule$1.evaluate(SystemPropertiesRestoreRule.java:53)
[junit4:junit4]    > 	at org.apache.lucene.util.TestRuleSetupTeardownChained$1.evaluate(TestRuleSetupTeardownChained.java:50)
[junit4:junit4]    > 	at org.apache.lucene.util.TestRuleFieldCacheSanity$1.evaluate(TestRuleFieldCacheSanity.java:51)
[junit4:junit4]    > 	at org.apache.lucene.util.AbstractBeforeAfterRule$1.evaluate(AbstractBeforeAfterRule.java:46)
[junit4:junit4]    > 	at com.carrotsearch.randomizedtesting.rules.SystemPropertiesInvariantRule$1.evaluate(SystemPropertiesInvariantRule.java:55)
[junit4:junit4]    > 	at org.apache.lucene.util.TestRuleThreadAndTestName$1.evaluate(TestRuleThreadAndTestName.java:49)
[junit4:junit4]    > 	at org.apache.lucene.util.TestRuleIgnoreAfterMaxFailures$1.evaluate(TestRuleIgnoreAfterMaxFailures.java:70)
[junit4:junit4]    > 	at org.apache.lucene.util.TestRuleMarkFailure$1.evaluate(TestRuleMarkFailure.java:48)
[junit4:junit4]    > 	at com.carrotsearch.randomizedtesting.rules.StatementAdapter.evaluate(StatementAdapter.java:36)
[junit4:junit4]    > 	at com.carrotsearch.randomizedtesting.ThreadLeakControl$StatementRunner.run(ThreadLeakControl.java:358)
[junit4:junit4]    > 	at com.carrotsearch.randomizedtesting.ThreadLeakControl.forkTimeoutingTask(ThreadLeakControl.java:782)
[junit4:junit4]    > 	at com.carrotsearch.randomizedtesting.ThreadLeakControl$3.evaluate(ThreadLeakControl.java:442)
[junit4:junit4]    > 	at com.carrotsearch.randomizedtesting.RandomizedRunner.runSingleTest(RandomizedRunner.java:746)
[junit4:junit4]    > 	at com.carrotsearch.randomizedtesting.RandomizedRunner$3.evaluate(RandomizedRunner.java:648)
[junit4:junit4]    > 	at com.carrotsearch.randomizedtesting.RandomizedRunner$4.evaluate(RandomizedRunner.java:682)
[junit4:junit4]    > 	at com.carrotsearch.randomizedtesting.RandomizedRunner$5.evaluate(RandomizedRunner.java:693)
[junit4:junit4]    > 	at com.carrotsearch.randomizedtesting.rules.StatementAdapter.evaluate(StatementAdapter.java:36)
[junit4:junit4]    > 	at com.carrotsearch.randomizedtesting.rules.SystemPropertiesRestoreRule$1.evaluate(SystemPropertiesRestoreRule.java:53)
[junit4:junit4]    > 	at org.apache.lucene.util.AbstractBeforeAfterRule$1.evaluate(AbstractBeforeAfterRule.java:46)
[junit4:junit4]    > 	at org.apache.lucene.util.TestRuleStoreClassName$1.evaluate(TestRuleStoreClassName.java:42)
[junit4:junit4]    > 	at com.carrotsearch.randomizedtesting.rules.SystemPropertiesInvariantRule$1.evaluate(SystemPropertiesInvariantRule.java:55)
[junit4:junit4]    > 	at com.carrotsearch.randomizedtesting.rules.NoShadowingOrOverridesOnMethodsRule$1.evaluate(NoShadowingOrOverridesOnMethodsRule.java:39)
[junit4:junit4]    > 	at com.carrotsearch.randomizedtesting.rules.NoShadowingOrOverridesOnMethodsRule$1.evaluate(NoShadowingOrOverridesOnMethodsRule.java:39)
[junit4:junit4]    > 	at com.carrotsearch.randomizedtesting.rules.StatementAdapter.evaluate(StatementAdapter.java:36)
[junit4:junit4]    > 	at org.apache.lucene.util.TestRuleAssertionsRequired$1.evaluate(TestRuleAssertionsRequired.java:43)
[junit4:junit4]    > 	at org.apache.lucene.util.TestRuleMarkFailure$1.evaluate(TestRuleMarkFailure.java:48)
[junit4:junit4]    > 	at org.apache.lucene.util.TestRuleIgnoreAfterMaxFailures$1.evaluate(TestRuleIgnoreAfterMaxFailures.java:70)
[junit4:junit4]    > 	at org.apache.lucene.util.TestRuleIgnoreTestSuites$1.evaluate(TestRuleIgnoreTestSuites.java:55)
[junit4:junit4]    > 	at com.carrotsearch.randomizedtesting.rules.StatementAdapter.evaluate(StatementAdapter.java:36)
[junit4:junit4]    > 	at com.carrotsearch.randomizedtesting.ThreadLeakControl$StatementRunner.run(ThreadLeakControl.java:358)
[junit4:junit4]    > 	at java.lang.Thread.run(Thread.java:780)
[junit4:junit4]    > Caused by: java.lang.RuntimeException: REQUEST FAILED: xpath=(/response/arr[@name='fields']/lst/str[@name='name'])[1] = 'custstopfilt'
[junit4:junit4]    > 	xml response was: <?xml version="1.0" encoding="UTF-8"?>
[junit4:junit4]    > <response>
[junit4:junit4]    > 
[junit4:junit4]    > <lst name="responseHeader">
[junit4:junit4]    >   <int name="status">0</int>
[junit4:junit4]    >   <int name="QTime">1</int>
[junit4:junit4]    > </lst>
[junit4:junit4]    > <arr name="fields">
[junit4:junit4]    >   <lst>
[junit4:junit4]    >     <str name="name">lowerfilt</str>
[junit4:junit4]    >     <str name="type">lowerfilt</str>
[junit4:junit4]    >     <bool name="indexed">true</bool>
[junit4:junit4]    >     <bool name="stored">true</bool>
[junit4:junit4]    >   </lst>
[junit4:junit4]    >   <lst>
[junit4:junit4]    >     <str name="name">text_np</str>
[junit4:junit4]    >     <str name="type">text_np</str>
[junit4:junit4]    >     <bool name="indexed">true</bool>
[junit4:junit4]    >     <bool name="stored">false</bool>
[junit4:junit4]    >   </lst>
[junit4:junit4]    >   <lst>
[junit4:junit4]    >     <str name="name">timestamp</str>
[junit4:junit4]    >     <str name="type">date</str>
[junit4:junit4]    >     <bool name="indexed">true</bool>
[junit4:junit4]    >     <bool name="stored">true</bool>
[junit4:junit4]    >   </lst>
[junit4:junit4]    >   <lst>
[junit4:junit4]    >     <str name="name">id</str>
[junit4:junit4]    >     <str name="type">string</str>
[junit4:junit4]    >     <bool name="indexed">true</bool>
[junit4:junit4]    >     <bool name="stored">true</bool>
[junit4:junit4]    >     <bool name="multiValued">false</bool>
[junit4:junit4]    >     <bool name="required">true</bool>
[junit4:junit4]    >     <bool name="uniqueKey">true</bool>
[junit4:junit4]    >   </lst>
[junit4:junit4]    >   <lst>
[junit4:junit4]    >     <str name="name">signatureField</str>
[junit4:junit4]    >     <str name="type">string</str>
[junit4:junit4]    >     <bool name="indexed">true</bool>
[junit4:junit4]    >     <bool name="stored">false</bool>
[junit4:junit4]    >   </lst>
[junit4:junit4]    >   <lst>
[junit4:junit4]    >     <str name="name">sindsto</str>
[junit4:junit4]    >     <str name="type">string</str>
[junit4:junit4]    >     <bool name="indexed">true</bool>
[junit4:junit4]    >     <bool name="stored">true</bool>
[junit4:junit4]    >   </lst>
[junit4:junit4]    >   <lst>
[junit4:junit4]    >     <str name="name">isto</str>
[junit4:junit4]    >     <str name="type">int</str>
[junit4:junit4]    >     <bool name="indexed">false</bool>
[junit4:junit4]    >     <bool name="stored">true</bool>
[junit4:junit4]    >   </lst>
[junit4:junit4]    >   <lst>
[junit4:junit4]    >     <str name="name">subject</str>
[junit4:junit4]    >     <str name="type">text</str>
[junit4:junit4]    >     <bool name="indexed">true</bool>
[junit4:junit4]    >     <bool name="stored">true</bool>
[junit4:junit4]    >   </lst>
[junit4:junit4]    >   <lst>
[junit4:junit4]    >     <str name="name">text</str>
[junit4:junit4]    >     <str name="type">text</str>
[junit4:junit4]    >     <bool name="indexed">true</bool>
[junit4:junit4]    >     <bool name="stored">false</bool>
[junit4:junit4]    >     <bool name="multiValued">true</bool>
[junit4:junit4]    >   </lst>
[junit4:junit4]    >   <lst>
[junit4:junit4]    >     <str name="name">HTMLwhitetok</str>
[junit4:junit4]    >     <str name="type">HTMLwhitetok</str>
[junit4:junit4]    >     <bool name="indexed">true</bool>
[junit4:junit4]    >     <bool name="stored">true</bool>
[junit4:junit4]    >   </lst>
[junit4:junit4]    >   <lst>
[junit4:junit4]    >     <str name="name">wdf_nocase</str>
[junit4:junit4]    >     <str name="type">wdf_nocase</str>
[junit4:junit4]    >     <bool name="indexed">true</bool>
[junit4:junit4]    >     <bool name="stored">true</bool>
[junit4:junit4]    >   </lst>
[junit4:junit4]    >   <lst>
[junit4:junit4]    >     <str name="name">bind</str>
[junit4:junit4]    >     <str name="type">boolean</str>
[junit4:junit4]    >     <bool name="indexed">true</bool>
[junit4:junit4]    >     <bool name="stored">false</bool>
[junit4:junit4]    >   </lst>
[junit4:junit4]    >   <lst>
[junit4:junit4]    >     <str name="name">title_lettertok</str>
[junit4:junit4]    >     <str name="type">lettertok</str>
[junit4:junit4]    >     <bool name="indexed">true</bool>
[junit4:junit4]    >     <bool name="stored">false</bool>
[junit4:junit4]    >   </lst>
[junit4:junit4]    >   <lst>
[junit4:junit4]    >     <str name="name">test_offtv</str>
[junit4:junit4]    >     <str name="type">text</str>
[junit4:junit4]    >     <bool name="termOffsets">true</bool>
[junit4:junit4]    >     <bool name="termVectors">true</bool>
[junit4:junit4]    >   </lst>
[junit4:junit4]    >   <lst>
[junit4:junit4]    >     <str name="name">subword</str>
[junit4:junit4]    >     <str name="type">subword</str>
[junit4:junit4]    >     <bool name="indexed">true</bool>
[junit4:junit4]    >     <bool name="stored">true</bool>
[junit4:junit4]    >   </lst>
[junit4:junit4]    >   <lst>
[junit4:junit4]    >     <str name="name">title</str>
[junit4:junit4]    >     <str name="type">nametext</str>
[junit4:junit4]    >     <bool name="indexed">true</bool>
[junit4:junit4]    >     <bool name="stored">true</bool>
[junit4:junit4]    >   </lst>
[junit4:junit4]    >   <lst>
[junit4:junit4]    >     <str name="name">shouldbestored</str>
[junit4:junit4]    >     <str name="type">unstored</str>
[junit4:junit4]    >     <bool name="stored">true</bool>
[junit4:junit4]    >   </lst>
[junit4:junit4]    >   <lst>
[junit4:junit4]    >     <str name="name">point_hash</str>
[junit4:junit4]    >     <str name="type">geohash</str>
[junit4:junit4]    >     <bool name="indexed">true</bool>
[junit4:junit4]    >     <bool name="stored">true</bool>
[junit4:junit4]    >     <bool name="multiValued">false</bool>
[junit4:junit4]    >   </lst>
[junit4:junit4]    >   <lst>
[junit4:junit4]    >     <str name="name">custengporterfilt</str>
[junit4:junit4]    >     <str name="type">custengporterfilt</str>
[junit4:junit4]    >     <bool name="indexed">true</bool>
[junit4:junit4]    >     <bool name="stored">true</bool>
[junit4:junit4]    >   </lst>
[junit4:junit4]    >   <lst>
[junit4:junit4]    >     <str name="name">lettertok</str>
[junit4:junit4]    >     <str name="type">lettertok</str>
[junit4:junit4]    >     <bool name="indexed">true</bool>
[junit4:junit4]    >     <bool name="stored">true</bool>
[junit4:junit4]    >   </lst>
[junit4:junit4]    >   <lst>
[junit4:junit4]    >     <str name="name">test_posofftv</str>
[junit4:junit4]    >     <str name="type">text</str>
[junit4:junit4]    >     <bool name="termOffsets">true</bool>
[junit4:junit4]    >     <bool name="termVectors">true</bool>
[junit4:junit4]    >     <bool name="termPositions">true</bool>
[junit4:junit4]    >   </lst>
[junit4:junit4]    >   <lst>
[junit4:junit4]    >     <str name="name">lengthfilt</str>
[junit4:junit4]    >     <str name="type">lengthfilt</str>
[junit4:junit4]    >     <bool name="indexed">true</bool>
[junit4:junit4]    >     <bool name="stored">true</bool>
[junit4:junit4]    >   </lst>
[junit4:junit4]    >   <lst>
[junit4:junit4]    >     <str name="name">standardtok</str>
[junit4:junit4]    >     <str name="type">standardtok</str>
[junit4:junit4]    >     <bool name="indexed">true</bool>
[junit4:junit4]    >     <bool name="stored">true</bool>
[junit4:junit4]    >   </lst>
[junit4:junit4]    >   <lst>
[junit4:junit4]    >     <str name="name">weight</str>
[junit4:junit4]    >     <str name="type">float</str>
[junit4:junit4]    >     <bool name="indexed">true</bool>
[junit4:junit4]    >     <bool name="stored">true</bool>
[junit4:junit4]    >   </lst>
[junit4:junit4]    >   <lst>
[junit4:junit4]    >     <str name="name">porterfilt</str>
[junit4:junit4]    >     <str name="type">porterfilt</str>
[junit4:junit4]    >     <bool name="indexed">true</bool>
[junit4:junit4]    >     <bool name="stored">true</bool>
[junit4:junit4]    >   </lst>
[junit4:junit4]    >   <lst>
[junit4:junit4]    >     <str name="name">title_stemmed</str>
[junit4:junit4]    >     <str name="type">text</str>
[junit4:junit4]    >     <bool name="indexed">true</bool>
[junit4:junit4]    >     <bool name="stored">false</bool>
[junit4:junit4]    >   </lst>
[junit4:junit4]    >   <lst>
[junit4:junit4]    >     <str name="name">standardtokfilt</str>
[junit4:junit4]    >     <str name="type">standardtokfilt</str>
[junit4:junit4]    >     <bool name="indexed">true</bool>
[junit4:junit4]    >     <bool name="stored">true</bool>
[junit4:junit4]    >   </lst>
[junit4:junit4]    >   <lst>
[junit4:junit4]    >     <str name="name">uniq</str>
[junit4:junit4]    >     <str name="type">string</str>
[junit4:junit4]    >     <bool name="indexed">true</bool>
[junit4:junit4]    >     <bool name="stored">true</bool>
[junit4:junit4]    >     <bool name="multiValued">true</bool>
[junit4:junit4]    >   </lst>
[junit4:junit4]    >   <lst>
[junit4:junit4]    >     <str name="name">test_basictv</str>
[junit4:junit4]    >     <str name="type">text</str>
[junit4:junit4]    >     <bool name="termVectors">true</bool>
[junit4:junit4]    >   </lst>
[junit4:junit4]    >   <lst>
[junit4:junit4]    >     <str name="name">whitetok</str>
[junit4:junit4]    >     <str name="type">whitetok</str>
[junit4:junit4]    >     <bool name="indexed">true</bool>
[junit4:junit4]    >     <bool name="stored">true</bool>
[junit4:junit4]    >   </lst>
[junit4:junit4]    >   <lst>
[junit4:junit4]    >     <str name="name">nullfirst</str>
[junit4:junit4]    >     <str name="type">string</str>
[junit4:junit4]    >     <bool name="indexed">true</bool>
[junit4:junit4]    >     <bool name="stored">true</bool>
[junit4:junit4]    >     <bool name="sortMissingFirst">true</bool>
[junit4:junit4]    >   </lst>
[junit4:junit4]    >   <lst>
[junit4:junit4]    >     <str name="name">textgap</str>
[junit4:junit4]    >     <str name="type">textgap</str>
[junit4:junit4]    >     <bool name="indexed">true</bool>
[junit4:junit4]    >     <bool name="stored">true</bool>
[junit4:junit4]    >   </lst>
[junit4:junit4]    >   <lst>
[junit4:junit4]    >     <str name="name">name</str>
[junit4:junit4]    >     <str name="type">nametext</str>
[junit4:junit4]    >     <bool name="indexed">true</bool>
[junit4:junit4]    >     <bool name="stored">true</bool>
[junit4:junit4]    >   </lst>
[junit4:junit4]    >   <lst>
[junit4:junit4]    >     <str name="name">bsto</str>
[junit4:junit4]    >     <str name="type">boolean</str>
[junit4:junit4]    >     <bool name="indexed">false</bool>
[junit4:junit4]    >     <bool name="stored">true</bool>
[junit4:junit4]    >   </lst>
[junit4:junit4]    >   <lst>
[junit4:junit4]    >     <str name="name">sind</str>
[junit4:junit4]    >     <str name="type">string</str>
[junit4:junit4]    >     <bool name="indexed">true</bool>
[junit4:junit4]    >     <bool name="stored">false</bool>
[junit4:junit4]    >   </lst>
[junit4:junit4]    >   <lst>
[junit4:junit4]    >     <str name="name">stopfilt</str>
[junit4:junit4]    >     <str name="type">stopfilt</str>
[junit4:junit4]    >     <bool name="indexed">true</bool>
[junit4:junit4]    >     <bool name="stored">true</bool>
[junit4:junit4]    >   </lst>
[junit4:junit4]    >   <lst>
[junit4:junit4]    >     <str name="name">test_notv</str>
[junit4:junit4]    >     <str name="type">text</str>
[junit4:junit4]    >     <bool name="termVectors">false</bool>
[junit4:junit4]    >   </lst>
[junit4:junit4]    >   <lst>
[junit4:junit4]    >     <str name="name">point</str>
[junit4:junit4]    >     <str name="type">xy</str>
[junit4:junit4]    >     <bool name="indexed">true</bool>
[junit4:junit4]    >     <bool name="stored">true</bool>
[junit4:junit4]    >     <bool name="multiValued">false</bool>
[junit4:junit4]    >   </lst>
[junit4:junit4]    >   <lst>
[junit4:junit4]    >     <str name="name">wdf_preserve</str>
[junit4:junit4]    >     <str name="type">wdf_preserve</str>
[junit4:junit4]    >     <bool name="indexed">true</bool>
[junit4:junit4]    >     <bool name="stored">true</bool>
[junit4:junit4]    >   </lst>
[junit4:junit4]    >   <lst>
[junit4:junit4]    >     <str name="name">teststop</str>
[junit4:junit4]    >     <str name="type">teststop</str>
[junit4:junit4]    >     <bool name="indexed">true</bool>
[junit4:junit4]    >     <bool name="stored">true</bool>
[junit4:junit4]    >   </lst>
[junit4:junit4]    >   <lst>
[junit4:junit4]    >     <str name="name">numericsubword</str>
[junit4:junit4]    >     <str name="type">numericsubword</str>
[junit4:junit4]    >     <bool name="indexed">true</bool>
[junit4:junit4]    >     <bool name="stored">true</bool>
[junit4:junit4]    >   </lst>
[junit4:junit4]    >   <lst>
[junit4:junit4]    >     <str name="name">patternreplacefilt</str>
[junit4:junit4]    >     <str name="type">patternreplacefilt</str>
[junit4:junit4]    >     <bool name="indexed">true</bool>
[junit4:junit4]    >     <bool name="stored">true</bool>
[junit4:junit4]    >   </lst>
[junit4:junit4]    >   <lst>
[junit4:junit4]    >     <str name="name">lowertok</str>
[junit4:junit4]    >     <str name="type">lowertok</str>
[junit4:junit4]    >     <bool name="indexed">true</bool>
[junit4:junit4]    >     <bool name="stored">true</bool>
[junit4:junit4]    >   </lst>
[junit4:junit4]    >   <lst>
[junit4:junit4]    >     <str name="name">shouldbeunstored</str>
[junit4:junit4]    >     <str name="type">unstored</str>
[junit4:junit4]    >   </lst>
[junit4:junit4]    >   <lst>
[junit4:junit4]    >     <str name="name">sku1</str>
[junit4:junit4]    >     <str name="type">skutype1</str>
[junit4:junit4]    >     <bool name="indexed">true</bool>
[junit4:junit4]    >     <bool name="stored">true</bool>
[junit4:junit4]    >   </lst>
[junit4:junit4]    >   <lst>
[junit4:junit4]    >     <str name="name">pointD</str>
[junit4:junit4]    >     <str name="type">xyd</str>
[junit4:junit4]    >     <bool name="indexed">true</bool>
[junit4:junit4]    >     <bool name="stored">true</bool>
[junit4:junit4]    >     <bool name="multiValued">false</bool>
[junit4:junit4]    >   </lst>
[junit4:junit4]    >   <lst>
[junit4:junit4]    >     <str name="name">sku2</str>
[junit4:junit4]    >     <str name="type">skutype2</str>
[junit4:junit4]    >     <bool name="indexed">true</bool>
[junit4:junit4]    >     <bool name="stored">true</bool>
[junit4:junit4]    >   </lst>
[junit4:junit4]    >   <lst>
[junit4:junit4]    >     <str name="name">uuid</str>
[junit4:junit4]    >     <str name="type">uuid</str>
[junit4:junit4]    >     <bool name="stored">true</bool>
[junit4:junit4]    >   </lst>
[junit4:junit4]    >   <lst>
[junit4:junit4]    >     <str name="name">shouldbeunindexed</str>
[junit4:junit4]    >     <str name="type">unstored</str>
[junit4:junit4]    >     <bool name="indexed">false</bool>
[junit4:junit4]    >     <bool name="stored">true</bool>
[junit4:junit4]    >   </lst>
[junit4:junit4]    >   <lst>
[junit4:junit4]    >     <str name="name">nouniq</str>
[junit4:junit4]    >     <str name="type">string</str>
[junit4:junit4]    >     <bool name="indexed">true</bool>
[junit4:junit4]    >     <bool name="stored">true</bool>
[junit4:junit4]    >     <bool name="multiValued">true</bool>
[junit4:junit4]    >   </lst>
[junit4:junit4]    >   <lst>
[junit4:junit4]    >     <str name="name">test_hlt</str>
[junit4:junit4]    >     <str name="type">highlittext</str>
[junit4:junit4]    >     <bool name="compressed">true</bool>
[junit4:junit4]    >     <bool name="indexed">true</bool>
[junit4:junit4]    >   </lst>
[junit4:junit4]    >   <lst>
[junit4:junit4]    >     <str name="name">keywordtok</str>
[junit4:junit4]    >     <str name="type">keywordtok</str>
[junit4:junit4]    >     <bool name="indexed">true</bool>
[junit4:junit4]    >     <bool name="stored">true</bool>
[junit4:junit4]    >   </lst>
[junit4:junit4]    >   <lst>
[junit4:junit4]    >     <str name="name">standardfilt</str>
[junit4:junit4]    >     <str name="type">standardfilt</str>
[junit4:junit4]    >     <bool name="indexed">true</bool>
[junit4:junit4]    >     <bool name="stored">true</bool>
[junit4:junit4]    >   </lst>
[junit4:junit4]    >   <lst>
[junit4:junit4]    >     <str name="name">syn</str>
[junit4:junit4]    >     <str name="type">syn</str>
[junit4:junit4]    >     <bool name="indexed">true</bool>
[junit4:junit4]    >     <bool name="stored">true</bool>
[junit4:junit4]    >   </lst>
[junit4:junit4]    >   <lst>
[junit4:junit4]    >     <str name="name">bindsto</str>
[junit4:junit4]    >     <str name="type">boolean</str>
[junit4:junit4]    >     <bool name="indexed">true</bool>
[junit4:junit4]    >     <bool name="stored">true</bool>
[junit4:junit4]    >   </lst>
[junit4:junit4]    >   <lst>
[junit4:junit4]    >     <str name="name">uniq2</str>
[junit4:junit4]    >     <str name="type">string</str>
[junit4:junit4]    >     <bool name="indexed">true</bool>
[junit4:junit4]    >     <bool name="stored">true</bool>
[junit4:junit4]    >     <bool name="multiValued">true</bool>
[junit4:junit4]    >   </lst>
[junit4:junit4]    >   <lst>
[junit4:junit4]    >     <str name="name">uniq3</str>
[junit4:junit4]    >     <str name="type">string</str>
[junit4:junit4]    >     <bool name="indexed">true</bool>
[junit4:junit4]    >     <bool name="stored">true</bool>
[junit4:junit4]    >   </lst>
[junit4:junit4]    >   <lst>
[junit4:junit4]    >     <str name="name">iind</str>
[junit4:junit4]    >     <str name="type">int</str>
[junit4:junit4]    >     <bool name="indexed">true</bool>
[junit4:junit4]    >     <bool name="stored">false</bool>
[junit4:junit4]    >   </lst>
[junit4:junit4]    >   <lst>
[junit4:junit4]    >     <str name="name">engporterfilt</str>
[junit4:junit4]    >     <str name="type">engporterfilt</str>
[junit4:junit4]    >     <bool name="indexed">true</bool>
[junit4:junit4]    >     <bool name="stored">true</bool>
[junit4:junit4]    >   </lst>
[junit4:junit4]    >   <lst>
[junit4:junit4]    >     <str name="name">numberpartfail</str>
[junit4:junit4]    >     <str name="type">failtype1</str>
[junit4:junit4]    >     <bool name="indexed">true</bool>
[junit4:junit4]    >     <bool name="stored">true</bool>
[junit4:junit4]    >   </lst>
[junit4:junit4]    >   <lst>
[junit4:junit4]    >     <str name="name">ssto</str>
[junit4:junit4]    >     <str name="type">string</str>
[junit4:junit4]    >     <bool name="indexed">false</bool>
[junit4:junit4]    >     <bool name="stored">true</bool>
[junit4:junit4]    >   </lst>
[junit4:junit4]    >   <lst>
[junit4:junit4]    >     <str name="name">protectedsubword</str>
[junit4:junit4]    >     <str name="type">protectedsubword</str>
[junit4:junit4]    >     <bool name="indexed">true</bool>
[junit4:junit4]    >     <bool name="stored">true</bool>
[junit4:junit4]    >   </lst>
[junit4:junit4]    >   <lst>
[junit4:junit4]    >     <str name="name">dedup</str>
[junit4:junit4]    >     <str name="type">dedup</str>
[junit4:junit4]    >     <bool name="indexed">true</bool>
[junit4:junit4]    >     <bool name="stored">true</bool>
[junit4:junit4]    >   </lst>
[junit4:junit4]    >   <lst>
[junit4:junit4]    >     <str name="name">custstopfilt</str>
[junit4:junit4]    >     <str name="type">custstopfilt</str>
[junit4:junit4]    >     <bool name="indexed">true</bool>
[junit4:junit4]    >     <bool name="stored">true</bool>
[junit4:junit4]    >   </lst>
[junit4:junit4]    >   <lst>
[junit4:junit4]    >     <str name="name">store</str>
[junit4:junit4]    >     <str name="type">location</str>
[junit4:junit4]    >     <bool name="indexed">true</bool>
[junit4:junit4]    >     <bool name="stored">true</bool>
[junit4:junit4]    >   </lst>
[junit4:junit4]    >   <lst>
[junit4:junit4]    >     <str name="name">_version_</str>
[junit4:junit4]    >     <str name="type">long</str>
[junit4:junit4]    >     <bool name="indexed">true</bool>
[junit4:junit4]    >     <bool name="stored">true</bool>
[junit4:junit4]    >   </lst>
[junit4:junit4]    >   <lst>
[junit4:junit4]    >     <str name="name">HTMLstandardtok</str>
[junit4:junit4]    >     <str name="type">HTMLstandardtok</str>
[junit4:junit4]    >     <bool name="indexed">true</bool>
[junit4:junit4]    >     <bool name="stored">true</bool>
[junit4:junit4]    >   </lst>
[junit4:junit4]    >   <lst>
[junit4:junit4]    >     <str name="name">test_postv</str>
[junit4:junit4]    >     <str name="type">text</str>
[junit4:junit4]    >     <bool name="termVectors">true</bool>
[junit4:junit4]    >     <bool name="termPositions">true</bool>
[junit4:junit4]    >   </lst>
[junit4:junit4]    >   <lst>
[junit4:junit4]    >     <str name="name">test_hlt_off</str>
[junit4:junit4]    >     <str name="type">highlittext</str>
[junit4:junit4]    >     <bool name="compressed">false</bool>
[junit4:junit4]    >     <bool name="indexed">true</bool>
[junit4:junit4]    >   </lst>
[junit4:junit4]    >   <lst>
[junit4:junit4]    >     <str name="name">copyfield_source</str>
[junit4:junit4]    >     <str name="type">string</str>
[junit4:junit4]    >     <bool name="indexed">true</bool>
[junit4:junit4]    >     <bool name="stored">true</bool>
[junit4:junit4]    >     <bool name="multiValued">true</bool>
[junit4:junit4]    >   </lst>
[junit4:junit4]    >   <lst>
[junit4:junit4]    >     <str name="name">bday</str>
[junit4:junit4]    >     <str name="type">date</str>
[junit4:junit4]    >     <bool name="indexed">true</bool>
[junit4:junit4]    >     <bool name="stored">true</bool>
[junit4:junit4]    >   </lst>
[junit4:junit4]    > </arr>
[junit4:junit4]    > </response>
[junit4:junit4]    > 
[junit4:junit4]    > 	request was:/schema/fields?indent=on&wt=xml
[junit4:junit4]    > 	at org.apache.solr.util.RestTestBase.assertQ(RestTestBase.java:136)
[junit4:junit4]    > 	... 41 more
[junit4:junit4]   2> 1410 T530 oas.SolrTestCaseJ4.setUp ###Starting testGetTwoFields
[junit4:junit4]   2> 1413 T537 C22 oasr.BaseSchemaResource.handlePostExecution [collection1] webapp=/solr path=/schema/fields params={fl=id,_version_&indent=on&wt=xml} status=0 QTime=1 
[junit4:junit4]   2> 1414 T537 C22 orel.LogFilter.afterHandle 2013-03-06	05:47:01	127.0.0.1	-	127.0.0.1	46179	GET	/solr/schema/fields	indent=on&wt=xml&fl=id,_version_	200	-	0	2	https://127.0.0.1:46179	Java/1.7.0	-
[junit4:junit4]   2> 1419 T530 oas.SolrTestCaseJ4.tearDown ###Ending testGetTwoFields
[junit4:junit4]   2> 1479 T530 oasc.CoreContainer.shutdown Shutting down CoreContainer instance=1004246510
[junit4:junit4]   2> 1480 T530 oasc.SolrCore.close [collection1]  CLOSING SolrCore org.apache.solr.core.SolrCore@40c48cbc
[junit4:junit4]   2> 1493 T530 oasu.DirectUpdateHandler2.close closing DirectUpdateHandler2{commits=0,autocommits=0,soft autocommits=0,optimizes=0,rollbacks=0,expungeDeletes=0,docsPending=0,adds=0,deletesById=0,deletesByQuery=0,errors=0,cumulative_adds=0,cumulative_deletesById=0,cumulative_deletesByQuery=0,cumulative_errors=0}
[junit4:junit4]   2> 1494 T530 oasu.SolrCoreState.decrefSolrCoreState Closing SolrCoreState
[junit4:junit4]   2> 1494 T530 oasu.DefaultSolrCoreState.closeIndexWriter SolrCoreState ref count has reached 0 - closing IndexWriter
[junit4:junit4]   2> 1495 T530 oasu.DefaultSolrCoreState.closeIndexWriter closing IndexWriter with IndexWriterCloser
[junit4:junit4]   2> 1495 T530 oasc.SolrCore.closeSearcher [collection1] Closing main searcher on request.
[junit4:junit4]   2> 1496 T530 oasc.CachingDirectoryFactory.close Releasing directory:/mnt/ssd/jenkins/workspace/Lucene-Solr-trunk-Linux/solr/build/solr-core/test/J0/solrtest-TestFieldCollectionResource-1362566820503/index
[junit4:junit4]   2> 1496 T530 oasc.CachingDirectoryFactory.close Closing directory when closing factory:/mnt/ssd/jenkins/workspace/Lucene-Solr-trunk-Linux/solr/build/solr-core/test/J0/solrtest-TestFieldCollectionResource-1362566820503/index
[junit4:junit4]   2> 1497 T530 oasc.CachingDirectoryFactory.closeDirectory Closing directory:/mnt/ssd/jenkins/workspace/Lucene-Solr-trunk-Linux/solr/build/solr-core/test/J0/solrtest-TestFieldCollectionResource-1362566820503/index
[junit4:junit4]   2> 1497 T530 oasc.CachingDirectoryFactory.close Closing directory when closing factory:/mnt/ssd/jenkins/workspace/Lucene-Solr-trunk-Linux/solr/build/solr-core/test/J0/solrtest-TestFieldCollectionResource-1362566820503
[junit4:junit4]   2> 1498 T530 oasc.CachingDirectoryFactory.closeDirectory Closing directory:/mnt/ssd/jenkins/workspace/Lucene-Solr-trunk-Linux/solr/build/solr-core/test/J0/solrtest-TestFieldCollectionResource-1362566820503
[junit4:junit4]   2> 1498 T530 oejsh.ContextHandler.doStop stopped o.e.j.s.ServletContextHandler{/solr,null}
[junit4:junit4]   2> 1550 T530 oas.SolrTestCaseJ4.deleteCore ###deleteCore
[junit4:junit4]   2> NOTE: test params are: codec=Lucene42: {}, docValues:{}, sim=RandomSimilarityProvider(queryNorm=true,coord=crazy): {}, locale=en, timezone=America/Guayaquil
[junit4:junit4]   2> NOTE: Linux 3.2.0-38-generic x86/IBM Corporation 1.7.0 (32-bit)/cpus=8,threads=1,free=85865696,total=171180032
[junit4:junit4]   2> NOTE: All tests run in this JVM: [TestGroupingSearch, TestValueSourceCache, SliceStateUpdateTest, TestStressVersions, PreAnalyzedFieldTest, TestPHPSerializedResponseWriter, TestFieldTypeResource, TestSort, FieldMutatingUpdateProcessorTest, SpatialFilterTest, TestBadConfig, MoreLikeThisHandlerTest, ReturnFieldsTest, BinaryUpdateRequestHandlerTest, TermsComponentTest, CircularListTest, DocumentBuilderTest, SearchHandlerTest, SuggesterTest, DirectUpdateHandlerOptimizeTest, TestLFUCache, TestLRUCache, BadComponentTest, TestPluginEnable, TestFunctionQuery, LukeRequestHandlerTest, TestTrie, TestSweetSpotSimilarityFactory, SyncSliceTest, ClusterStateUpdateTest, ZkCLITest, SynonymTokenizerTest, BasicFunctionalityTest, TestFieldCollectionResource]
[junit4:junit4] Completed on J0 in 1.59s, 5 tests, 2 errors <<< FAILURES!

[...truncated 218 lines...]
[junit4:junit4] Suite: org.apache.solr.cloud.BasicDistributedZk2Test
[junit4:junit4]   2> 0 T1560 oas.BaseDistributedSearchTestCase.initHostContext Setting hostContext system property: /zeo/kk
[junit4:junit4]   2> 4 T1560 oas.SolrTestCaseJ4.setUp ###Starting testDistribSearch
[junit4:junit4]   2> Creating dataDir: /mnt/ssd/jenkins/workspace/Lucene-Solr-trunk-Linux/solr/build/solr-core/test/J0/./solrtest-BasicDistributedZk2Test-1362567174349
[junit4:junit4]   2> 5 T1560 oasc.ZkTestServer.run STARTING ZK TEST SERVER
[junit4:junit4]   2> 5 T1561 oasc.ZkTestServer$ZKServerMain.runFromConfig Starting server
[junit4:junit4]   2> 7 T1561 oazs.ZooKeeperServer.setTickTime tickTime set to 1000
[junit4:junit4]   2> 7 T1561 oazs.ZooKeeperServer.setMinSessionTimeout minSessionTimeout set to -1
[junit4:junit4]   2> 7 T1561 oazs.ZooKeeperServer.setMaxSessionTimeout maxSessionTimeout set to -1
[junit4:junit4]   2> 8 T1561 oazs.NIOServerCnxnFactory.configure binding to port 0.0.0.0/0.0.0.0:0
[junit4:junit4]   2> 8 T1561 oazsp.FileTxnSnapLog.save Snapshotting: 0x0 to /mnt/ssd/jenkins/workspace/Lucene-Solr-trunk-Linux/solr/build/solr-core/test/J0/./org.apache.solr.cloud.BasicDistributedZk2Test-1362567174348/zookeeper/server1/data/version-2/snapshot.0
[junit4:junit4]   2> 106 T1560 oasc.ZkTestServer.run start zk server on port:54873
[junit4:junit4]   2> 106 T1560 oaz.ZooKeeper.<init> Initiating client connection, connectString=127.0.0.1:54873 sessionTimeout=10000 watcher=org.apache.solr.common.cloud.ConnectionManager@d8a7ae77
[junit4:junit4]   2> 107 T1560 oascc.ConnectionManager.waitForConnected Waiting for client to connect to ZooKeeper
[junit4:junit4]   2> 107 T1566 oaz.ClientCnxn$SendThread.logStartConnect Opening socket connection to server localhost.localdomain/127.0.0.1:54873. Will not attempt to authenticate using SASL (Access denied ("javax.security.auth.AuthPermission" "getLoginConfiguration"))
[junit4:junit4]   2> 108 T1566 oaz.ClientCnxn$SendThread.primeConnection Socket connection established to localhost.localdomain/127.0.0.1:54873, initiating session
[junit4:junit4]   2> 108 T1562 oazs.NIOServerCnxnFactory.run Accepted socket connection from /127.0.0.1:42953
[junit4:junit4]   2> 108 T1562 oazs.ZooKeeperServer.processConnectRequest Client attempting to establish new session at /127.0.0.1:42953
[junit4:junit4]   2> 109 T1564 oazsp.FileTxnLog.append Creating new log file: log.1
[junit4:junit4]   2> 232 T1564 oazs.ZooKeeperServer.finishSessionInit Established session 0x13d3f5518d10000 with negotiated timeout 10000 for client /127.0.0.1:42953
[junit4:junit4]   2> 233 T1566 oaz.ClientCnxn$SendThread.onConnected Session establishment complete on server localhost.localdomain/127.0.0.1:54873, sessionid = 0x13d3f5518d10000, negotiated timeout = 10000
[junit4:junit4]   2> 233 T1567 oascc.ConnectionManager.process Watcher org.apache.solr.common.cloud.ConnectionManager@d8a7ae77 name:ZooKeeperConnection Watcher:127.0.0.1:54873 got event WatchedEvent state:SyncConnected type:None path:null path:null type:None
[junit4:junit4]   2> 234 T1560 oascc.ConnectionManager.waitForConnected Client is connected to ZooKeeper
[junit4:junit4]   2> 234 T1560 oascc.SolrZkClient.makePath makePath: /solr
[junit4:junit4]   2> 236 T1565 oazs.PrepRequestProcessor.pRequest2Txn Processed session termination for sessionid: 0x13d3f5518d10000
[junit4:junit4]   2> 237 T1567 oaz.ClientCnxn$EventThread.run EventThread shut down
[junit4:junit4]   2> 237 T1562 oazs.NIOServerCnxn.closeSock Closed socket connection for client /127.0.0.1:42953 which had sessionid 0x13d3f5518d10000
[junit4:junit4]   2> 237 T1560 oaz.ZooKeeper.close Session: 0x13d3f5518d10000 closed
[junit4:junit4]   2> 238 T1560 oaz.ZooKeeper.<init> Initiating client connection, connectString=127.0.0.1:54873/solr sessionTimeout=10000 watcher=org.apache.solr.common.cloud.ConnectionManager@2992632
[junit4:junit4]   2> 240 T1568 oaz.ClientCnxn$SendThread.logStartConnect Opening socket connection to server localhost.localdomain/127.0.0.1:54873. Will not attempt to authenticate using SASL (Access denied ("javax.security.auth.AuthPermission" "getLoginConfiguration"))
[junit4:junit4]   2> 240 T1560 oascc.ConnectionManager.waitForConnected Waiting for client to connect to ZooKeeper
[junit4:junit4]   2> 240 T1562 oazs.NIOServerCnxnFactory.run Accepted socket connection from /127.0.0.1:42954
[junit4:junit4]   2> 240 T1568 oaz.ClientCnxn$SendThread.primeConnection Socket connection established to localhost.localdomain/127.0.0.1:54873, initiating session
[junit4:junit4]   2> 241 T1562 oazs.ZooKeeperServer.processConnectRequest Client attempting to establish new session at /127.0.0.1:42954
[junit4:junit4]   2> 242 T1564 oazs.ZooKeeperServer.finishSessionInit Established session 0x13d3f5518d10001 with negotiated timeout 10000 for client /127.0.0.1:42954
[junit4:junit4]   2> 242 T1568 oaz.ClientCnxn$SendThread.onConnected Session establishment complete on server localhost.localdomain/127.0.0.1:54873, sessionid = 0x13d3f5518d10001, negotiated timeout = 10000
[junit4:junit4]   2> 243 T1569 oascc.ConnectionManager.process Watcher org.apache.solr.common.cloud.ConnectionManager@2992632 name:ZooKeeperConnection Watcher:127.0.0.1:54873/solr got event WatchedEvent state:SyncConnected type:None path:null path:null type:None
[junit4:junit4]   2> 243 T1560 oascc.ConnectionManager.waitForConnected Client is connected to ZooKeeper
[junit4:junit4]   2> 244 T1560 oascc.SolrZkClient.makePath makePath: /collections/collection1
[junit4:junit4]   2> 247 T1560 oascc.SolrZkClient.makePath makePath: /collections/collection1/shards
[junit4:junit4]   2> 253 T1560 oascc.SolrZkClient.makePath makePath: /collections/control_collection
[junit4:junit4]   2> 255 T1560 oascc.SolrZkClient.makePath makePath: /collections/control_collection/shards
[junit4:junit4]   2> 258 T1560 oasc.AbstractZkTestCase.putConfig put /mnt/ssd/jenkins/workspace/Lucene-Solr-trunk-Linux/solr/build/solr-core/test-files/solr/collection1/conf/solrconfig-tlog.xml to /configs/conf1/solrconfig.xml
[junit4:junit4]   2> 258 T1560 oascc.SolrZkClient.makePath makePath: /configs/conf1/solrconfig.xml
[junit4:junit4]   2> 262 T1560 oasc.AbstractZkTestCase.putConfig put /mnt/ssd/jenkins/workspace/Lucene-Solr-trunk-Linux/solr/build/solr-core/test-files/solr/collection1/conf/schema.xml to /configs/conf1/schema.xml
[junit4:junit4]   2> 263 T1560 oascc.SolrZkClient.makePath makePath: /configs/conf1/schema.xml
[junit4:junit4]   2> 273 T1560 oasc.AbstractZkTestCase.putConfig put /mnt/ssd/jenkins/workspace/Lucene-Solr-trunk-Linux/solr/build/solr-core/test-files/solr/collection1/conf/stopwords.txt to /configs/conf1/stopwords.txt
[junit4:junit4]   2> 273 T1560 oascc.SolrZkClient.makePath makePath: /configs/conf1/stopwords.txt
[junit4:junit4]   2> 275 T1560 oasc.AbstractZkTestCase.putConfig put /mnt/ssd/jenkins/workspace/Lucene-Solr-trunk-Linux/solr/build/solr-core/test-files/solr/collection1/conf/protwords.txt to /configs/conf1/protwords.txt
[junit4:junit4]   2> 276 T1560 oascc.SolrZkClient.makePath makePath: /configs/conf1/protwords.txt
[junit4:junit4]   2> 280 T1560 oasc.AbstractZkTestCase.putConfig put /mnt/ssd/jenkins/workspace/Lucene-Solr-trunk-Linux/solr/build/solr-core/test-files/solr/collection1/conf/currency.xml to /configs/conf1/currency.xml
[junit4:junit4]   2> 280 T1560 oascc.SolrZkClient.makePath makePath: /configs/conf1/currency.xml
[junit4:junit4]   2> 459 T1560 oasc.AbstractZkTestCase.putConfig put /mnt/ssd/jenkins/workspace/Lucene-Solr-trunk-Linux/solr/build/solr-core/test-files/solr/collection1/conf/open-exchange-rates.json to /configs/conf1/open-exchange-rates.json
[junit4:junit4]   2> 460 T1560 oascc.SolrZkClient.makePath makePath: /configs/conf1/open-exchange-rates.json
[junit4:junit4]   2> 480 T1560 oasc.AbstractZkTestCase.putConfig put /mnt/ssd/jenkins/workspace/Lucene-Solr-trunk-Linux/solr/build/solr-core/test-files/solr/collection1/conf/mapping-ISOLatin1Accent.txt to /configs/conf1/mapping-ISOLatin1Accent.txt
[junit4:junit4]   2> 480 T1560 oascc.SolrZkClient.makePath makePath: /configs/conf1/mapping-ISOLatin1Accent.txt
[junit4:junit4]   2> 743 T1560 oasc.AbstractZkTestCase.putConfig put /mnt/ssd/jenkins/workspace/Lucene-Solr-trunk-Linux/solr/build/solr-core/test-files/solr/collection1/conf/old_synonyms.txt to /configs/conf1/old_synonyms.txt
[junit4:junit4]   2> 745 T1560 oascc.SolrZkClient.makePath makePath: /configs/conf1/old_synonyms.txt
[junit4:junit4]   2> 751 T1560 oasc.AbstractZkTestCase.putConfig put /mnt/ssd/jenkins/workspace/Lucene-Solr-trunk-Linux/solr/build/solr-core/test-files/solr/collection1/conf/synonyms.txt to /configs/conf1/synonyms.txt
[junit4:junit4]   2> 753 T1560 oascc.SolrZkClient.makePath makePath: /configs/conf1/synonyms.txt
[junit4:junit4]   2> 770 T1565 oazs.PrepRequestProcessor.pRequest2Txn Processed session termination for sessionid: 0x13d3f5518d10001
[junit4:junit4]   2> 772 T1569 oaz.ClientCnxn$EventThread.run EventThread shut down
[junit4:junit4]   2> 772 T1562 oazs.NIOServerCnxn.closeSock Closed socket connection for client /127.0.0.1:42954 which had sessionid 0x13d3f5518d10001
[junit4:junit4]   2> 772 T1560 oaz.ZooKeeper.close Session: 0x13d3f5518d10001 closed
[junit4:junit4]   2> 845 T1560 oejs.Server.doStart jetty-8.1.8.v20121106
[junit4:junit4]   2> 847 T1560 oejs.AbstractConnector.doStart Started SelectChannelConnector@127.0.0.1:55854
[junit4:junit4]   2> 848 T1560 oass.SolrDispatchFilter.init SolrDispatchFilter.init()
[junit4:junit4]   2> 848 T1560 oasc.SolrResourceLoader.locateSolrHome JNDI not configured for solr (NoInitialContextEx)
[junit4:junit4]   2> 849 T1560 oasc.SolrResourceLoader.locateSolrHome using system property solr.solr.home: /mnt/ssd/jenkins/workspace/Lucene-Solr-trunk-Linux/solr/build/solr-core/test/J0/./org.apache.solr.cloud.BasicDistributedZk2Test-controljetty-1362567175118
[junit4:junit4]   2> 849 T1560 oasc.CoreContainer$Initializer.initialize looking for solr config file: /mnt/ssd/jenkins/workspace/Lucene-Solr-trunk-Linux/solr/build/solr-core/test/J0/./org.apache.solr.cloud.BasicDistributedZk2Test-controljetty-1362567175118/solr.xml
[junit4:junit4]   2> 850 T1560 oasc.CoreContainer.<init> New CoreContainer -1450727812
[junit4:junit4]   2> 851 T1560 oasc.CoreContainer.load Loading CoreContainer using Solr Home: '/mnt/ssd/jenkins/workspace/Lucene-Solr-trunk-Linux/solr/build/solr-core/test/J0/./org.apache.solr.cloud.BasicDistributedZk2Test-controljetty-1362567175118/'
[junit4:junit4]   2> 851 T1560 oasc.SolrResourceLoader.<init> new SolrResourceLoader for directory: '/mnt/ssd/jenkins/workspace/Lucene-Solr-trunk-Linux/solr/build/solr-core/test/J0/./org.apache.solr.cloud.BasicDistributedZk2Test-controljetty-1362567175118/'
[junit4:junit4]   2> 864 T1560 oashc.HttpShardHandlerFactory.getParameter Setting socketTimeout to: 120000
[junit4:junit4]   2> 865 T1560 oashc.HttpShardHandlerFactory.getParameter Setting urlScheme to: http://
[junit4:junit4]   2> 865 T1560 oashc.HttpShardHandlerFactory.getParameter Setting connTimeout to: 15000
[junit4:junit4]   2> 866 T1560 oashc.HttpShardHandlerFactory.getParameter Setting maxConnectionsPerHost to: 20
[junit4:junit4]   2> 866 T1560 oashc.HttpShardHandlerFactory.getParameter Setting corePoolSize to: 0
[junit4:junit4]   2> 867 T1560 oashc.HttpShardHandlerFactory.getParameter Setting maximumPoolSize to: 2147483647
[junit4:junit4]   2> 867 T1560 oashc.HttpShardHandlerFactory.getParameter Setting maxThreadIdleTime to: 5
[junit4:junit4]   2> 868 T1560 oashc.HttpShardHandlerFactory.getParameter Setting sizeOfQueue to: -1
[junit4:junit4]   2> 869 T1560 oashc.HttpShardHandlerFactory.getParameter Setting fairnessPolicy to: false
[junit4:junit4]   2> 869 T1560 oascsi.HttpClientUtil.createClient Creating new http client, config:maxConnectionsPerHost=20&maxConnections=10000&socketTimeout=120000&connTimeout=15000&retry=false
[junit4:junit4]   2> 877 T1560 oasc.CoreContainer.load Registering Log Listener
[junit4:junit4]   2> 887 T1560 oasc.CoreContainer.initZooKeeper Zookeeper client=127.0.0.1:54873/solr
[junit4:junit4]   2> 888 T1560 oasc.ZkController.checkChrootPath zkHost includes chroot
[junit4:junit4]   2> 889 T1560 oaz.ZooKeeper.<init> Initiating client connection, connectString=127.0.0.1:54873 sessionTimeout=60000 watcher=org.apache.solr.common.cloud.ConnectionManager@3abf7aa1
[junit4:junit4]   2> 890 T1579 oaz.ClientCnxn$SendThread.logStartConnect Opening socket connection to server localhost.localdomain/127.0.0.1:54873. Will not attempt to authenticate using SASL (Access denied ("javax.security.auth.AuthPermission" "getLoginConfiguration"))
[junit4:junit4]   2> 890 T1560 oascc.ConnectionManager.waitForConnected Waiting for client to connect to ZooKeeper
[junit4:junit4]   2> 890 T1579 oaz.ClientCnxn$SendThread.primeConnection Socket connection established to localhost.localdomain/127.0.0.1:54873, initiating session
[junit4:junit4]   2> 890 T1562 oazs.NIOServerCnxnFactory.run Accepted socket connection from /127.0.0.1:42967
[junit4:junit4]   2> 891 T1562 oazs.ZooKeeperServer.processConnectRequest Client attempting to establish new session at /127.0.0.1:42967
[junit4:junit4]   2> 892 T1564 oazs.ZooKeeperServer.finishSessionInit Established session 0x13d3f5518d10002 with negotiated timeout 20000 for client /127.0.0.1:42967
[junit4:junit4]   2> 892 T1579 oaz.ClientCnxn$SendThread.onConnected Session establishment complete on server localhost.localdomain/127.0.0.1:54873, sessionid = 0x13d3f5518d10002, negotiated timeout = 20000
[junit4:junit4]   2> 892 T1580 oascc.ConnectionManager.process Watcher org.apache.solr.common.cloud.ConnectionManager@3abf7aa1 name:ZooKeeperConnection Watcher:127.0.0.1:54873 got event WatchedEvent state:SyncConnected type:None path:null path:null type:None
[junit4:junit4]   2> 892 T1560 oascc.ConnectionManager.waitForConnected Client is connected to ZooKeeper
[junit4:junit4]   2> 893 T1565 oazs.PrepRequestProcessor.pRequest2Txn Processed session termination for sessionid: 0x13d3f5518d10002
[junit4:junit4]   2> 894 T1580 oaz.ClientCnxn$EventThread.run EventThread shut down
[junit4:junit4]   2> 894 T1562 oazs.NIOServerCnxn.closeSock Closed socket connection for client /127.0.0.1:42967 which had sessionid 0x13d3f5518d10002
[junit4:junit4]   2> 894 T1560 oaz.ZooKeeper.close Session: 0x13d3f5518d10002 closed
[junit4:junit4]   2> 895 T1560 oascsi.HttpClientUtil.createClient Creating new http client, config:maxConnections=500&maxConnectionsPerHost=16&socketTimeout=120000&connTimeout=15000
[junit4:junit4]   2> 899 T1560 oaz.ZooKeeper.<init> Initiating client connection, connectString=127.0.0.1:54873/solr sessionTimeout=30000 watcher=org.apache.solr.common.cloud.ConnectionManager@11684291
[junit4:junit4]   2> 901 T1581 oaz.ClientCnxn$SendThread.logStartConnect Opening socket connection to server localhost.localdomain/127.0.0.1:54873. Will not attempt to authenticate using SASL (Access denied ("javax.security.auth.AuthPermission" "getLoginConfiguration"))
[junit4:junit4]   2> 900 T1560 oascc.ConnectionManager.waitForConnected Waiting for client to connect to ZooKeeper
[junit4:junit4]   2> 901 T1581 oaz.ClientCnxn$SendThread.primeConnection Socket connection established to localhost.localdomain/127.0.0.1:54873, initiating session
[junit4:junit4]   2> 901 T1562 oazs.NIOServerCnxnFactory.run Accepted socket connection from /127.0.0.1:42968
[junit4:junit4]   2> 902 T1562 oazs.ZooKeeperServer.processConnectRequest Client attempting to establish new session at /127.0.0.1:42968
[junit4:junit4]   2> 902 T1564 oazs.ZooKeeperServer.finishSessionInit Established session 0x13d3f5518d10003 with negotiated timeout 20000 for client /127.0.0.1:42968
[junit4:junit4]   2> 902 T1581 oaz.ClientCnxn$SendThread.onConnected Session establishment complete on server localhost.localdomain/127.0.0.1:54873, sessionid = 0x13d3f5518d10003, negotiated timeout = 20000
[junit4:junit4]   2> 903 T1582 oascc.ConnectionManager.process Watcher org.apache.solr.common.cloud.ConnectionManager@11684291 name:ZooKeeperConnection Watcher:127.0.0.1:54873/solr got event WatchedEvent state:SyncConnected type:None path:null path:null type:None
[junit4:junit4]   2> 903 T1560 oascc.ConnectionManager.waitForConnected Client is connected to ZooKeeper
[junit4:junit4]   2> 904 T1565 oazs.PrepRequestProcessor.pRequest Got user-level KeeperException when processing sessionid:0x13d3f5518d10003 type:create cxid:0x2 zxid:0x1a txntype:-1 reqpath:n/a Error Path:/solr/overseer Error:KeeperErrorCode = NodeExists for /solr/overseer
[junit4:junit4]   2> 905 T1560 oascc.SolrZkClient.makePath makePath: /live_nodes
[junit4:junit4]   2> 906 T1560 oasc.ZkController.createEphemeralLiveNode Register node as live in ZooKeeper:/live_nodes/127.0.0.1:55854_zeo%2Fkk
[junit4:junit4]   2> 907 T1565 oazs.PrepRequestProcessor.pRequest Got user-level KeeperException when processing sessionid:0x13d3f5518d10003 type:delete cxid:0x8 zxid:0x1c txntype:-1 reqpath:n/a Error Path:/solr/live_nodes/127.0.0.1:55854_zeo%2Fkk Error:KeeperErrorCode = NoNode for /solr/live_nodes/127.0.0.1:55854_zeo%2Fkk
[junit4:junit4]   2> 907 T1560 oascc.SolrZkClient.makePath makePath: /live_nodes/127.0.0.1:55854_zeo%2Fkk
[junit4:junit4]   2> 909 T1560 oascc.SolrZkClient.makePath makePath: /overseer_elect/election
[junit4:junit4]   2> 912 T1565 oazs.PrepRequestProcessor.pRequest Got user-level KeeperException when processing sessionid:0x13d3f5518d10003 type:delete cxid:0x16 zxid:0x21 txntype:-1 reqpath:n/a Error Path:/solr/overseer_elect/leader Error:KeeperErrorCode = NoNode for /solr/overseer_elect/leader
[junit4:junit4]   2> 913 T1560 oascc.SolrZkClient.makePath makePath: /overseer_elect/leader
[junit4:junit4]   2> 969 T1560 oasc.Overseer.start Overseer (id=89297202338398211-127.0.0.1:55854_zeo%2Fkk-n_0000000000) starting
[junit4:junit4]   2> 970 T1565 oazs.PrepRequestProcessor.pRequest Got user-level KeeperException when processing sessionid:0x13d3f5518d10003 type:create cxid:0x1b zxid:0x23 txntype:-1 reqpath:n/a Error Path:/solr/overseer Error:KeeperErrorCode = NodeExists for /solr/overseer
[junit4:junit4]   2> 972 T1565 oazs.PrepRequestProcessor.pRequest Got user-level KeeperException when processing sessionid:0x13d3f5518d10003 type:create cxid:0x1c zxid:0x24 txntype:-1 reqpath:n/a Error Path:/solr/overseer Error:KeeperErrorCode = NodeExists for /solr/overseer
[junit4:junit4]   2> 972 T1565 oazs.PrepRequestProcessor.pRequest Got user-level KeeperException when processing sessionid:0x13d3f5518d10003 type:create cxid:0x1d zxid:0x25 txntype:-1 reqpath:n/a Error Path:/solr/overseer Error:KeeperErrorCode = NodeExists for /solr/overseer
[junit4:junit4]   2> 973 T1565 oazs.PrepRequestProcessor.pRequest Got user-level KeeperException when processing sessionid:0x13d3f5518d10003 type:create cxid:0x1e zxid:0x26 txntype:-1 reqpath:n/a Error Path:/solr/overseer Error:KeeperErrorCode = NodeExists for /solr/overseer
[junit4:junit4]   2> 974 T1584 oasc.OverseerCollectionProcessor.run Process current queue of collection creations
[junit4:junit4]   2> 974 T1560 oascc.SolrZkClient.makePath makePath: /clusterstate.json
[junit4:junit4]   2> 976 T1560 oascc.ZkStateReader.createClusterStateWatchersAndUpdate Updating cluster state from ZooKeeper... 
[junit4:junit4]   2> 977 T1583 oasc.Overseer$ClusterStateUpdater.run Starting to work on the main queue
[junit4:junit4]   2> 979 T1585 oasc.CoreContainer.create Creating SolrCore 'collection1' using instanceDir: /mnt/ssd/jenkins/workspace/Lucene-Solr-trunk-Linux/solr/build/solr-core/test/J0/./org.apache.solr.cloud.BasicDistributedZk2Test-controljetty-1362567175118/collection1
[junit4:junit4]   2> 980 T1585 oasc.ZkController.createCollectionZkNode Check for collection zkNode:control_collection
[junit4:junit4]   2> 980 T1585 oasc.ZkController.createCollectionZkNode Collection zkNode exists
[junit4:junit4]   2> 981 T1585 oasc.ZkController.readConfigName Load collection config from:/collections/control_collection
[junit4:junit4]   2> 981 T1585 oasc.SolrResourceLoader.<init> new SolrResourceLoader for directory: '/mnt/ssd/jenkins/workspace/Lucene-Solr-trunk-Linux/solr/build/solr-core/test/J0/./org.apache.solr.cloud.BasicDistributedZk2Test-controljetty-1362567175118/collection1/'
[junit4:junit4]   2> 982 T1585 oasc.SolrResourceLoader.replaceClassLoader Adding 'file:/mnt/ssd/jenkins/workspace/Lucene-Solr-trunk-Linux/solr/build/solr-core/test/J0/org.apache.solr.cloud.BasicDistributedZk2Test-controljetty-1362567175118/collection1/lib/README' to classloader
[junit4:junit4]   2> 982 T1585 oasc.SolrResourceLoader.replaceClassLoader Adding 'file:/mnt/ssd/jenkins/workspace/Lucene-Solr-trunk-Linux/solr/build/solr-core/test/J0/org.apache.solr.cloud.BasicDistributedZk2Test-controljetty-1362567175118/collection1/lib/classes/' to classloader
[junit4:junit4]   2> 1006 T1585 oasc.SolrConfig.<init> Using Lucene MatchVersion: LUCENE_50
[junit4:junit4]   2> 1051 T1585 oasc.SolrConfig.<init> Loaded SolrConfig: solrconfig.xml
[junit4:junit4]   2> 1052 T1585 oass.IndexSchema.readSchema Reading Solr Schema
[junit4:junit4]   2> 1057 T1585 oass.IndexSchema.readSchema Schema name=test
[junit4:junit4]   2> 1365 T1585 oass.OpenExchangeRatesOrgProvider.init Initialized with rates=open-exchange-rates.json, refreshInterval=1440.
[junit4:junit4]   2> 1370 T1585 oass.IndexSchema.readSchema default search field in schema is text
[junit4:junit4]   2> 1373 T1585 oass.IndexSchema.readSchema unique key field: id
[junit4:junit4]   2> 1382 T1585 oass.FileExchangeRateProvider.reload Reloading exchange rates from file currency.xml
[junit4:junit4]   2> 1386 T1585 oass.FileExchangeRateProvider.reload Reloading exchange rates from file currency.xml
[junit4:junit4]   2> 1391 T1585 oass.OpenExchangeRatesOrgProvider.reload Reloading exchange rates from open-exchange-rates.json
[junit4:junit4]   2> 1391 T1585 oass.OpenExchangeRatesOrgProvider$OpenExchangeRates.<init> WARNING Unknown key IMPORTANT NOTE
[junit4:junit4]   2> 1392 T1585 oass.OpenExchangeRatesOrgProvider$OpenExchangeRates.<init> WARNING Expected key, got STRING
[junit4:junit4]   2> 1392 T1585 oass.OpenExchangeRatesOrgProvider.reload Reloading exchange rates from open-exchange-rates.json
[junit4:junit4]   2> 1393 T1585 oass.OpenExchangeRatesOrgProvider$OpenExchangeRates.<init> WARNING Unknown key IMPORTANT NOTE
[junit4:junit4]   2> 1393 T1585 oass.OpenExchangeRatesOrgProvider$OpenExchangeRates.<init> WARNING Expected key, got STRING
[junit4:junit4]   2> 1394 T1585 oasc.SolrCore.<init> [collection1] Opening new SolrCore at /mnt/ssd/jenkins/workspace/Lucene-Solr-trunk-Linux/solr/build/solr-core/test/J0/./org.apache.solr.cloud.BasicDistributedZk2Test-controljetty-1362567175118/collection1/, dataDir=./org.apache.solr.cloud.BasicDistributedZk2Test-1362567174348/control/data/
[junit4:junit4]   2> 1394 T1585 oasc.JmxMonitoredMap.<init> JMX monitoring is enabled. Adding Solr mbeans to JMX Server: com.sun.jmx.mbeanserver.JmxMBeanServer@73894772
[junit4:junit4]   2> 1394 T1585 oasc.SolrCore.initDirectoryFactory org.apache.solr.core.MockDirectoryFactory
[junit4:junit4]   2> 1395 T1585 oasc.CachingDirectoryFactory.get return new directory for /mnt/ssd/jenkins/workspace/Lucene-Solr-trunk-Linux/solr/build/solr-core/test/J0/./org.apache.solr.cloud.BasicDistributedZk2Test-1362567174348/control/data forceNew:false
[junit4:junit4]   2> 1395 T1585 oasc.CachingDirectoryFactory.close Releasing directory:/mnt/ssd/jenkins/workspace/Lucene-Solr-trunk-Linux/solr/build/solr-core/test/J0/./org.apache.solr.cloud.BasicDistributedZk2Test-1362567174348/control/data
[junit4:junit4]   2> 1396 T1585 oasc.SolrCore.getNewIndexDir New index directory detected: old=null new=./org.apache.solr.cloud.BasicDistributedZk2Test-1362567174348/control/data/index/
[junit4:junit4]   2> 1396 T1585 oasc.SolrCore.initIndex WARNING [collection1] Solr index directory './org.apache.solr.cloud.BasicDistributedZk2Test-1362567174348/control/data/index' doesn't exist. Creating new index...
[junit4:junit4]   2> 1397 T1585 oasc.CachingDirectoryFactory.get return new directory for /mnt/ssd/jenkins/workspace/Lucene-Solr-trunk-Linux/solr/build/solr-core/test/J0/./org.apache.solr.cloud.BasicDistributedZk2Test-1362567174348/control/data/index forceNew:false
[junit4:junit4]   2> 1398 T1585 oasc.SolrDeletionPolicy.onCommit SolrDeletionPolicy.onCommit: commits:num=1
[junit4:junit4]   2> 		commit{dir=MockDirWrapper(org.apache.lucene.store.RAMDirectory@9da0d4d lockFactory=org.apache.lucene.store.NativeFSLockFactory@d0bdbef1),segFN=segments_1,generation=1,filenames=[segments_1]
[junit4:junit4]   2> 1398 T1585 oasc.SolrDeletionPolicy.updateCommits newest commit = 1[segments_1]
[junit4:junit4]   2> 1399 T1585 oasc.CachingDirectoryFactory.close Releasing directory:/mnt/ssd/jenkins/workspace/Lucene-Solr-trunk-Linux/solr/build/solr-core/test/J0/./org.apache.solr.cloud.BasicDistributedZk2Test-1362567174348/control/data/index
[junit4:junit4]   2> 1400 T1585 oasup.UpdateRequestProcessorChain.init inserting DistributedUpdateProcessorFactory into updateRequestProcessorChain "dedupe"
[junit4:junit4]   2> 1400 T1585 oasup.UpdateRequestProcessorChain.init inserting DistributedUpdateProcessorFactory into updateRequestProcessorChain "stored_sig"
[junit4:junit4]   2> 1401 T1585 oasup.UpdateRequestProcessorChain.init inserting DistributedUpdateProcessorFactory into updateRequestProcessorChain "distrib-dup-test-chain-implicit"
[junit4:junit4]   2> 1401 T1585 oasc.RequestHandlers.initHandlersFromConfig created standard: solr.StandardRequestHandler
[junit4:junit4]   2> 1401 T1585 oasc.RequestHandlers.initHandlersFromConfig created /get: solr.RealTimeGetHandler
[junit4:junit4]   2> 1402 T1585 oasc.RequestHandlers.initHandlersFromConfig adding lazy requestHandler: solr.ReplicationHandler
[junit4:junit4]   2> 1402 T1585 oasc.RequestHandlers.initHandlersFromConfig created /replication: solr.ReplicationHandler
[junit4:junit4]   2> 1402 T1585 oasc.RequestHandlers.initHandlersFromConfig created /update: solr.UpdateRequestHandler
[junit4:junit4]   2> 1403 T1585 oasc.RequestHandlers.initHandlersFromConfig created /admin/: org.apache.solr.handler.admin.AdminHandlers
[junit4:junit4]   2> 1404 T1585 oashl.XMLLoader.init xsltCacheLifetimeSeconds=60
[junit4:junit4]   2> 1406 T1585 oasc.CachingDirectoryFactory.close Releasing directory:/mnt/ssd/jenkins/workspace/Lucene-Solr-trunk-Linux/solr/build/solr-core/test/J0/./org.apache.solr.cloud.BasicDistributedZk2Test-1362567174348/control/data
[junit4:junit4]   2> 1406 T1585 oass.SolrIndexSearcher.<init> Opening Searcher@98540f9b main
[junit4:junit4]   2> 1406 T1585 oasu.UpdateHandler.clearLog Clearing tlog files, tlogDir=./org.apache.solr.cloud.BasicDistributedZk2Test-1362567174348/control/data/tlog
[junit4:junit4]   2> 1407 T1585 oasu.CommitTracker.<init> Hard AutoCommit: disabled
[junit4:junit4]   2> 1407 T1585 oasu.CommitTracker.<init> Soft AutoCommit: disabled
[junit4:junit4]   2> 1411 T1585 oasc.CachingDirectoryFactory.close Releasing directory:/mnt/ssd/jenkins/workspace/Lucene-Solr-trunk-Linux/solr/build/solr-core/test/J0/./org.apache.solr.cloud.BasicDistributedZk2Test-1362567174348/control/data
[junit4:junit4]   2> 1411 T1586 oasc.SolrCore.registerSearcher [collection1] Registered new searcher Searcher@98540f9b main{StandardDirectoryReader(segments_1:1)}
[junit4:junit4]   2> 1412 T1585 oasc.ZkController.publish publishing core=collection1 state=down
[junit4:junit4]   2> 1412 T1585 oasc.ZkController.publish numShards not found on descriptor - reading it from system property
[junit4:junit4]   2> 1413 T1565 oazs.PrepRequestProcessor.pRequest Got user-level KeeperException when processing sessionid:0x13d3f5518d10003 type:create cxid:0x50 zxid:0x29 txntype:-1 reqpath:n/a Error Path:/solr/overseer/queue Error:KeeperErrorCode = NoNode for /solr/overseer/queue
[junit4:junit4]   2> 2480 T1583 oascc.ZkStateReader.updateClusterState Updating cloud state from ZooKeeper... 
[junit4:junit4]   2> 2481 T1583 oasc.Overseer$ClusterStateUpdater.updateState Update state numShards=1 message={
[junit4:junit4]   2> 	  "base_url":"http://127.0.0.1:55854/zeo/kk",
[junit4:junit4]   2> 	  "state":"down",
[junit4:junit4]   2> 	  "operation":"state",
[junit4:junit4]   2> 	  "core_node_name":"1",
[junit4:junit4]   2> 	  "node_name":"127.0.0.1:55854_zeo%2Fkk",
[junit4:junit4]   2> 	  "numShards":"1",
[junit4:junit4]   2> 	  "roles":null,
[junit4:junit4]   2> 	  "collection":"control_collection",
[junit4:junit4]   2> 	  "shard":null,
[junit4:junit4]   2> 	  "core":"collection1"}
[junit4:junit4]   2> 2481 T1583 oasc.Overseer$ClusterStateUpdater.createCollection Create collection control_collection with numShards 1
[junit4:junit4]   2> 2482 T1583 oasc.Overseer$ClusterStateUpdater.updateState Assigning new node to shard shard=shard1
[junit4:junit4]   2> 2482 T1565 oazs.PrepRequestProcessor.pRequest Got user-level KeeperException when processing sessionid:0x13d3f5518d10003 type:create cxid:0x58 zxid:0x2c txntype:-1 reqpath:n/a Error Path:/solr/overseer/queue-work Error:KeeperErrorCode = NoNode for /solr/overseer/queue-work
[junit4:junit4]   2> 2486 T1582 oascc.ZkStateReader$2.process A cluster state change: WatchedEvent state:SyncConnected type:NodeDataChanged path:/clusterstate.json, has occurred - updating... (live nodes size: 1)
[junit4:junit4]   2> 3415 T1585 oasc.CoreContainer.registerCore registering core: collection1
[junit4:junit4]   2> 3415 T1585 oasc.ZkController.register Register replica - core:collection1 address:http://127.0.0.1:55854/zeo/kk collection:control_collection shard:shard1
[junit4:junit4]   2> 3416 T1585 oascc.SolrZkClient.makePath makePath: /collections/control_collection/leader_elect/shard1/election
[junit4:junit4]   2> 3421 T1565 oazs.PrepRequestProcessor.pRequest Got user-level KeeperException when processing sessionid:0x13d3f5518d10003 type:delete cxid:0x72 zxid:0x36 txntype:-1 reqpath:n/a Error Path:/solr/collections/control_collection/leaders Error:KeeperErrorCode = NoNode for /solr/collections/control_collection/leaders
[junit4:junit4]   2> 3421 T1585 oasc.ShardLeaderElectionContext.runLeaderProcess Running the leader process.
[junit4:junit4]   2> 3422 T1565 oazs.PrepRequestProcessor.pRequest Got user-level KeeperException when processing sessionid:0x13d3f5518d10003 type:create cxid:0x73 zxid:0x37 txntype:-1 reqpath:n/a Error Path:/solr/overseer Error:KeeperErrorCode = NodeExists for /solr/overseer
[junit4:junit4]   2> 3423 T1585 oasc.ShardLeaderElectionContext.waitForReplicasToComeUp Enough replicas found to continue.
[junit4:junit4]   2> 3423 T1585 oasc.ShardLeaderElectionContext.runLeaderProcess I may be the new leader - try and sync
[junit4:junit4]   2> 3424 T1585 oasc.SyncStrategy.sync Sync replicas to http://127.0.0.1:55854/zeo/kk/collection1/
[junit4:junit4]   2> 3424 T1585 oasc.SyncStrategy.syncReplicas Sync Success - now sync replicas to me
[junit4:junit4]   2> 3424 T1585 oasc.SyncStrategy.syncToMe http://127.0.0.1:55854/zeo/kk/collection1/ has no replicas
[junit4:junit4]   2> 3424 T1585 oasc.ShardLeaderElectionContext.runLeaderProcess I am the new leader: http://127.0.0.1:55854/zeo/kk/collection1/
[junit4:junit4]   2> 3425 T1585 oascc.SolrZkClient.makePath makePath: /collections/control_collection/leaders/shard1
[junit4:junit4]   2> 3427 T1565 oazs.PrepRequestProcessor.pRequest Got user-level KeeperException when processing sessionid:0x13d3f5518d10003 type:create cxid:0x7d zxid:0x3b txntype:-1 reqpath:n/a Error Path:/solr/overseer Error:KeeperErrorCode = NodeExists for /solr/overseer
[junit4:junit4]   2> 3990 T1583 oascc.ZkStateReader.updateClusterState Updating cloud state from ZooKeeper... 
[junit4:junit4]   2> 3995 T1582 oascc.ZkStateReader$2.process A cluster state change: WatchedEvent state:SyncConnected type:NodeDataChanged path:/clusterstate.json, has occurred - updating... (live nodes size: 1)
[junit4:junit4]   2> 4030 T1585 oasc.ZkController.register We are http://127.0.0.1:55854/zeo/kk/collection1/ and leader is http://127.0.0.1:55854/zeo/kk/collection1/
[junit4:junit4]   2> 4031 T1585 oasc.ZkController.register No LogReplay needed for core=collection1 baseURL=http://127.0.0.1:55854/zeo/kk
[junit4:junit4]   2> 4031 T1585 oasc.ZkController.checkRecovery I am the leader, no recovery necessary
[junit4:junit4]   2> 4031 T1585 oasc.ZkController.publish publishing core=collection1 state=active
[junit4:junit4]   2> 4031 T1585 oasc.ZkController.publish numShards not found on descriptor - reading it from system property
[junit4:junit4]   2> 4033 T1585 oascc.ZkStateReader.updateClusterState Updating cloud state from ZooKeeper... 
[junit4:junit4]   2> 4034 T1560 oass.SolrDispatchFilter.init user.dir=/mnt/ssd/jenkins/workspace/Lucene-Solr-trunk-Linux/solr/build/solr-core/test/J0
[junit4:junit4]   2> 4035 T1560 oass.SolrDispatchFilter.init SolrDispatchFilter.init() done
[junit4:junit4]   2> 4035 T1560 oascsi.HttpClientUtil.createClient Creating new http client, config:maxConnections=128&maxConnectionsPerHost=32&followRedirects=false
[junit4:junit4]   2> 4040 T1560 oascsi.HttpClientUtil.createClient Creating new http client, config:
[junit4:junit4]   2> 4041 T1560 oaz.ZooKeeper.<init> Initiating client connection, connectString=127.0.0.1:54873/solr sessionTimeout=10000 watcher=org.apache.solr.common.cloud.ConnectionManager@c01caf19
[junit4:junit4]   2> 4042 T1588 oaz.ClientCnxn$SendThread.logStartConnect Opening socket connection to server localhost.localdomain/127.0.0.1:54873. Will not attempt to authenticate using SASL (Access denied ("javax.security.auth.AuthPermission" "getLoginConfiguration"))
[junit4:junit4]   2> 4041 T1560 oascc.ConnectionManager.waitForConnected Waiting for client to connect to ZooKeeper
[junit4:junit4]   2> 4042 T1588 oaz.ClientCnxn$SendThread.primeConnection Socket connection established to localhost.localdomain/127.0.0.1:54873, initiating session
[junit4:junit4]   2> 4042 T1562 oazs.NIOServerCnxnFactory.run Accepted socket connection from /127.0.0.1:42976
[junit4:junit4]   2> 4043 T1562 oazs.ZooKeeperServer.processConnectRequest Client attempting to establish new session at /127.0.0.1:42976
[junit4:junit4]   2> 4043 T1564 oazs.ZooKeeperServer.finishSessionInit Established session 0x13d3f5518d10004 with negotiated timeout 10000 for client /127.0.0.1:42976
[junit4:junit4]   2> 4043 T1588 oaz.ClientCnxn$SendThread.onConnected Session establishment complete on server localhost.localdomain/127.0.0.1:54873, sessionid = 0x13d3f5518d10004, negotiated timeout = 10000
[junit4:junit4]   2> 4044 T1589 oascc.ConnectionManager.process Watcher org.apache.solr.common.cloud.ConnectionManager@c01caf19 name:ZooKeeperConnection Watcher:127.0.0.1:54873/solr got event WatchedEvent state:SyncConnected type:None path:null path:null type:None
[junit4:junit4]   2> 4044 T1560 oascc.ConnectionManager.waitForConnected Client is connected to ZooKeeper
[junit4:junit4]   2> 4045 T1560 oascc.ZkStateReader.createClusterStateWatchersAndUpdate Updating cluster state from ZooKeeper... 
[junit4:junit4]   2> 4047 T1560 oasc.ChaosMonkey.monkeyLog monkey: init - expire sessions:true cause connection loss:true
[junit4:junit4]   2> 4104 T1560 oejs.Server.doStart jetty-8.1.8.v20121106
[junit4:junit4]   2> 4106 T1560 oejs.AbstractConnector.doStart Started SelectChannelConnector@127.0.0.1:46476
[junit4:junit4]   2> 4107 T1560 oass.SolrDispatchFilter.init SolrDispatchFilter.init()
[junit4:junit4]   2> 4107 T1560 oasc.SolrResourceLoader.locateSolrHome JNDI not configured for solr (NoInitialContextEx)
[junit4:junit4]   2> 4108 T1560 oasc.SolrResourceLoader.locateSolrHome using system property solr.solr.home: /mnt/ssd/jenkins/workspace/Lucene-Solr-trunk-Linux/solr/build/solr-core/test/J0/./org.apache.solr.cloud.BasicDistributedZk2Test-jetty1-1362567178391
[junit4:junit4]   2> 4108 T1560 oasc.CoreContainer$Initializer.initialize looking for solr config file: /mnt/ssd/jenkins/workspace/Lucene-Solr-trunk-Linux/solr/build/solr-core/test/J0/./org.apache.solr.cloud.BasicDistributedZk2Test-jetty1-1362567178391/solr.xml
[junit4:junit4]   2> 4109 T1560 oasc.CoreContainer.<init> New CoreContainer -280094200
[junit4:junit4]   2> 4110 T1560 oasc.CoreContainer.load Loading CoreContainer using Solr Home: '/mnt/ssd/jenkins/workspace/Lucene-Solr-trunk-Linux/solr/build/solr-core/test/J0/./org.apache.solr.cloud.BasicDistributedZk2Test-jetty1-1362567178391/'
[junit4:junit4]   2> 4110 T1560 oasc.SolrResourceLoader.<init> new SolrResourceLoader for directory: '/mnt/ssd/jenkins/workspace/Lucene-Solr-trunk-Linux/solr/build/solr-core/test/J0/./org.apache.solr.cloud.BasicDistributedZk2Test-jetty1-1362567178391/'
[junit4:junit4]   2> 4123 T1560 oashc.HttpShardHandlerFactory.getParameter Setting socketTimeout to: 120000
[junit4:junit4]   2> 4123 T1560 oashc.HttpShardHandlerFactory.getParameter Setting urlScheme to: http://
[junit4:junit4]   2> 4124 T1560 oashc.HttpShardHandlerFactory.getParameter Setting connTimeout to: 15000
[junit4:junit4]   2> 4124 T1560 oashc.HttpShardHandlerFactory.getParameter Setting maxConnectionsPerHost to: 20
[junit4:junit4]   2> 4125 T1560 oashc.HttpShardHandlerFactory.getParameter Setting corePoolSize to: 0
[junit4:junit4]   2> 4125 T1560 oashc.HttpShardHandlerFactory.getParameter Setting maximumPoolSize to: 2147483647
[junit4:junit4]   2> 4126 T1560 oashc.HttpShardHandlerFactory.getParameter Setting maxThreadIdleTime to: 5
[junit4:junit4]   2> 4126 T1560 oashc.HttpShardHandlerFactory.getParameter Setting sizeOfQueue to: -1
[junit4:junit4]   2> 4127 T1560 oashc.HttpShardHandlerFactory.getParameter Setting fairnessPolicy to: false
[junit4:junit4]   2> 4127 T1560 oascsi.HttpClientUtil.createClient Creating new http client, config:maxConnectionsPerHost=20&maxConnections=10000&socketTimeout=120000&connTimeout=15000&retry=false
[junit4:junit4]   2> 4135 T1560 oasc.CoreContainer.load Registering Log Listener
[junit4:junit4]   2> 4145 T1560 oasc.CoreContainer.initZooKeeper Zookeeper client=127.0.0.1:54873/solr
[junit4:junit4]   2> 4146 T1560 oasc.ZkController.checkChrootPath zkHost includes chroot
[junit4:junit4]   2> 4146 T1560 oaz.ZooKeeper.<init> Initiating client connection, connectString=127.0.0.1:54873 sessionTimeout=60000 watcher=org.apache.solr.common.cloud.ConnectionManager@e043bdad
[junit4:junit4]   2> 4148 T1599 oaz.ClientCnxn$SendThread.logStartConnect Opening socket connection to server localhost.localdomain/127.0.0.1:54873. Will not attempt to authenticate using SASL (Access denied ("javax.security.auth.AuthPermission" "getLoginConfiguration"))
[junit4:junit4]   2> 4148 T1560 oascc.ConnectionManager.waitForConnected Waiting for client to connect to ZooKeeper
[junit4:junit4]   2> 4148 T1599 oaz.ClientCnxn$SendThread.primeConnection Socket connection established to localhost.localdomain/127.0.0.1:54873, initiating session
[junit4:junit4]   2> 4148 T1562 oazs.NIOServerCnxnFactory.run Accepted socket connection from /127.0.0.1:42977
[junit4:junit4]   2> 4149 T1562 oazs.ZooKeeperServer.processConnectRequest Client attempting to establish new session at /127.0.0.1:42977
[junit4:junit4]   2> 4150 T1564 oazs.ZooKeeperServer.finishSessionInit Established session 0x13d3f5518d10005 with negotiated timeout 20000 for client /127.0.0.1:42977
[junit4:junit4]   2> 4150 T1599 oaz.ClientCnxn$SendThread.onConnected Session establishment complete on server localhost.localdomain/127.0.0.1:54873, sessionid = 0x13d3f5518d10005, negotiated timeout = 20000
[junit4:junit4]   2> 4150 T1600 oascc.ConnectionManager.process Watcher org.apache.solr.common.cloud.ConnectionManager@e043bdad name:ZooKeeperConnection Watcher:127.0.0.1:54873 got event WatchedEvent state:SyncConnected type:None path:null path:null type:None
[junit4:junit4]   2> 4150 T1560 oascc.ConnectionManager.waitForConnected Client is connected to ZooKeeper
[junit4:junit4]   2> 4151 T1565 oazs.PrepRequestProcessor.pRequest2Txn Processed session termination for sessionid: 0x13d3f5518d10005
[junit4:junit4]   2> 4152 T1562 oazs.NIOServerCnxn.closeSock Closed socket connection for client /127.0.0.1:42977 which had sessionid 0x13d3f5518d10005
[junit4:junit4]   2> 4152 T1600 oaz.ClientCnxn$EventThread.run EventThread shut down
[junit4:junit4]   2> 4152 T1560 oaz.ZooKeeper.close Session: 0x13d3f5518d10005 closed
[junit4:junit4]   2> 4153 T1560 oascsi.HttpClientUtil.createClient Creating new http client, config:maxConnections=500&maxConnectionsPerHost=16&socketTimeout=120000&connTimeout=15000
[junit4:junit4]   2> 4157 T1560 oaz.ZooKeeper.<init> Initiating client connection, connectString=127.0.0.1:54873/solr sessionTimeout=30000 watcher=org.apache.solr.common.cloud.ConnectionManager@58af1684
[junit4:junit4]   2> 4158 T1601 oaz.ClientCnxn$SendThread.logStartConnect Opening socket connection to server localhost.localdomain/127.0.0.1:54873. Will not attempt to authenticate using SASL (Access denied ("javax.security.auth.AuthPermission" "getLoginConfiguration"))
[junit4:junit4]   2> 4158 T1560 oascc.ConnectionManager.waitForConnected Waiting for client to connect to ZooKeeper
[junit4:junit4]   2> 4159 T1601 oaz.ClientCnxn$SendThread.primeConnection Socket connection established to localhost.localdomain/127.0.0.1:54873, initiating session
[junit4:junit4]   2> 4159 T1562 oazs.NIOServerCnxnFactory.run Accepted socket connection from /127.0.0.1:42978
[junit4:junit4]   2> 4159 T1562 oazs.ZooKeeperServer.processConnectRequest Client attempting to establish new session at /127.0.0.1:42978
[junit4:junit4]   2> 4160 T1564 oazs.ZooKeeperServer.finishSessionInit Established session 0x13

[...truncated too long message...]

unit4]    > 	at org.apache.solr.client.solrj.impl.HttpSolrServer.request(HttpSolrServer.java:181)
[junit4:junit4]    > 	at org.apache.solr.client.solrj.request.AbstractUpdateRequest.process(AbstractUpdateRequest.java:117)
[junit4:junit4]    > 	at org.apache.solr.client.solrj.SolrServer.add(SolrServer.java:116)
[junit4:junit4]    > 	at org.apache.solr.client.solrj.SolrServer.add(SolrServer.java:102)
[junit4:junit4]    > 	at org.apache.solr.cloud.BasicDistributedZk2Test.testNodeWithoutCollectionForwarding(BasicDistributedZk2Test.java:200)
[junit4:junit4]    > 	at org.apache.solr.cloud.BasicDistributedZk2Test.doTest(BasicDistributedZk2Test.java:89)
[junit4:junit4]    > 	at org.apache.solr.BaseDistributedSearchTestCase.testDistribSearch(BaseDistributedSearchTestCase.java:806)
[junit4:junit4]    > 	at sun.reflect.NativeMethodAccessorImpl.invoke0(Native Method)
[junit4:junit4]    > 	at sun.reflect.NativeMethodAccessorImpl.invoke(NativeMethodAccessorImpl.java:88)
[junit4:junit4]    > 	at sun.reflect.DelegatingMethodAccessorImpl.invoke(DelegatingMethodAccessorImpl.java:55)
[junit4:junit4]    > 	at java.lang.reflect.Method.invoke(Method.java:613)
[junit4:junit4]    > 	at com.carrotsearch.randomizedtesting.RandomizedRunner.invoke(RandomizedRunner.java:1559)
[junit4:junit4]    > 	at com.carrotsearch.randomizedtesting.RandomizedRunner.access$600(RandomizedRunner.java:79)
[junit4:junit4]    > 	at com.carrotsearch.randomizedtesting.RandomizedRunner$6.evaluate(RandomizedRunner.java:737)
[junit4:junit4]    > 	at com.carrotsearch.randomizedtesting.RandomizedRunner$7.evaluate(RandomizedRunner.java:773)
[junit4:junit4]    > 	at com.carrotsearch.randomizedtesting.RandomizedRunner$8.evaluate(RandomizedRunner.java:787)
[junit4:junit4]    > 	at com.carrotsearch.randomizedtesting.rules.SystemPropertiesRestoreRule$1.evaluate(SystemPropertiesRestoreRule.java:53)
[junit4:junit4]    > 	at org.apache.lucene.util.TestRuleSetupTeardownChained$1.evaluate(TestRuleSetupTeardownChained.java:50)
[junit4:junit4]    > 	at org.apache.lucene.util.TestRuleFieldCacheSanity$1.evaluate(TestRuleFieldCacheSanity.java:51)
[junit4:junit4]    > 	at org.apache.lucene.util.AbstractBeforeAfterRule$1.evaluate(AbstractBeforeAfterRule.java:46)
[junit4:junit4]    > 	at com.carrotsearch.randomizedtesting.rules.SystemPropertiesInvariantRule$1.evaluate(SystemPropertiesInvariantRule.java:55)
[junit4:junit4]    > 	at org.apache.lucene.util.TestRuleThreadAndTestName$1.evaluate(TestRuleThreadAndTestName.java:49)
[junit4:junit4]    > 	at org.apache.lucene.util.TestRuleIgnoreAfterMaxFailures$1.evaluate(TestRuleIgnoreAfterMaxFailures.java:70)
[junit4:junit4]    > 	at org.apache.lucene.util.TestRuleMarkFailure$1.evaluate(TestRuleMarkFailure.java:48)
[junit4:junit4]    > 	at com.carrotsearch.randomizedtesting.rules.StatementAdapter.evaluate(StatementAdapter.java:36)
[junit4:junit4]    > 	at com.carrotsearch.randomizedtesting.ThreadLeakControl$StatementRunner.run(ThreadLeakControl.java:358)
[junit4:junit4]    > 	at com.carrotsearch.randomizedtesting.ThreadLeakControl.forkTimeoutingTask(ThreadLeakControl.java:782)
[junit4:junit4]    > 	at com.carrotsearch.randomizedtesting.ThreadLeakControl$3.evaluate(ThreadLeakControl.java:442)
[junit4:junit4]    > 	at com.carrotsearch.randomizedtesting.RandomizedRunner.runSingleTest(RandomizedRunner.java:746)
[junit4:junit4]    > 	at com.carrotsearch.randomizedtesting.RandomizedRunner$3.evaluate(RandomizedRunner.java:648)
[junit4:junit4]    > 	at com.carrotsearch.randomizedtesting.RandomizedRunner$4.evaluate(RandomizedRunner.java:682)
[junit4:junit4]    > 	at com.carrotsearch.randomizedtesting.RandomizedRunner$5.evaluate(RandomizedRunner.java:693)
[junit4:junit4]    > 	at com.carrotsearch.randomizedtesting.rules.StatementAdapter.evaluate(StatementAdapter.java:36)
[junit4:junit4]    > 	at com.carrotsearch.randomizedtesting.rules.SystemPropertiesRestoreRule$1.evaluate(SystemPropertiesRestoreRule.java:53)
[junit4:junit4]    > 	at org.apache.lucene.util.AbstractBeforeAfterRule$1.evaluate(AbstractBeforeAfterRule.java:46)
[junit4:junit4]    > 	at org.apache.lucene.util.TestRuleStoreClassName$1.evaluate(TestRuleStoreClassName.java:42)
[junit4:junit4]    > 	at com.carrotsearch.randomizedtesting.rules.SystemPropertiesInvariantRule$1.evaluate(SystemPropertiesInvariantRule.java:55)
[junit4:junit4]    > 	at com.carrotsearch.randomizedtesting.rules.NoShadowingOrOverridesOnMethodsRule$1.evaluate(NoShadowingOrOverridesOnMethodsRule.java:39)
[junit4:junit4]    > 	at com.carrotsearch.randomizedtesting.rules.NoShadowingOrOverridesOnMethodsRule$1.evaluate(NoShadowingOrOverridesOnMethodsRule.java:39)
[junit4:junit4]    > 	at com.carrotsearch.randomizedtesting.rules.StatementAdapter.evaluate(StatementAdapter.java:36)
[junit4:junit4]    > 	at org.apache.lucene.util.TestRuleAssertionsRequired$1.evaluate(TestRuleAssertionsRequired.java:43)
[junit4:junit4]    > 	at org.apache.lucene.util.TestRuleMarkFailure$1.evaluate(TestRuleMarkFailure.java:48)
[junit4:junit4]    > 	at org.apache.lucene.util.TestRuleIgnoreAfterMaxFailures$1.evaluate(TestRuleIgnoreAfterMaxFailures.java:70)
[junit4:junit4]    > 	at org.apache.lucene.util.TestRuleIgnoreTestSuites$1.evaluate(TestRuleIgnoreTestSuites.java:55)
[junit4:junit4]    > 	at com.carrotsearch.randomizedtesting.rules.StatementAdapter.evaluate(StatementAdapter.java:36)
[junit4:junit4]    > 	at com.carrotsearch.randomizedtesting.ThreadLeakControl$StatementRunner.run(ThreadLeakControl.java:358)
[junit4:junit4]    > 	at java.lang.Thread.run(Thread.java:780)
[junit4:junit4]   2> 28690 T1560 oas.SolrTestCaseJ4.deleteCore ###deleteCore
[junit4:junit4]   2> 28694 T1559 ccr.ThreadLeakControl.checkThreadLeaks WARNING Will linger awaiting termination of 3 leaked thread(s).
[junit4:junit4]   2> 28776 T1618 oascc.ZkStateReader$3.process WARNING ZooKeeper watch triggered, but Solr cannot talk to ZK
[junit4:junit4]   2> 28776 T1618 oascc.ZkStateReader$2.process A cluster state change: WatchedEvent state:SyncConnected type:NodeChildrenChanged path:/live_nodes, has occurred - updating... (live nodes size: 2)
[junit4:junit4]   2> 28777 T1618 oascc.ZkStateReader$2.process WARNING ZooKeeper watch triggered, but Solr cannot talk to ZK
[junit4:junit4]   2> 28777 T1618 oaz.ClientCnxn$EventThread.run EventThread shut down
[junit4:junit4]   2> 29656 T1563 oazs.SessionTrackerImpl.run SessionTrackerImpl exited loop!
[junit4:junit4]   2> 29882 T1634 oascc.ZkStateReader$3.process WARNING ZooKeeper watch triggered, but Solr cannot talk to ZK
[junit4:junit4]   2> 29883 T1634 oascc.ZkStateReader$2.process A cluster state change: WatchedEvent state:SyncConnected type:NodeChildrenChanged path:/live_nodes, has occurred - updating... (live nodes size: 1)
[junit4:junit4]   2> 29883 T1634 oascc.ZkStateReader$2.process WARNING ZooKeeper watch triggered, but Solr cannot talk to ZK
[junit4:junit4]   2> 29884 T1634 oaz.ClientCnxn$EventThread.run EventThread shut down
[junit4:junit4]   2> NOTE: test params are: codec=Lucene42: {}, docValues:{}, sim=RandomSimilarityProvider(queryNorm=false,coord=crazy): {}, locale=bg_BG, timezone=Pacific/Noumea
[junit4:junit4]   2> NOTE: Linux 3.2.0-38-generic x86/IBM Corporation 1.7.0 (32-bit)/cpus=8,threads=1,free=63464320,total=203227136
[junit4:junit4]   2> NOTE: All tests run in this JVM: [TestGroupingSearch, TestValueSourceCache, SliceStateUpdateTest, TestStressVersions, PreAnalyzedFieldTest, TestPHPSerializedResponseWriter, TestFieldTypeResource, TestSort, FieldMutatingUpdateProcessorTest, SpatialFilterTest, TestBadConfig, MoreLikeThisHandlerTest, ReturnFieldsTest, BinaryUpdateRequestHandlerTest, TermsComponentTest, CircularListTest, DocumentBuilderTest, SearchHandlerTest, SuggesterTest, DirectUpdateHandlerOptimizeTest, TestLFUCache, TestLRUCache, BadComponentTest, TestPluginEnable, TestFunctionQuery, LukeRequestHandlerTest, TestTrie, TestSweetSpotSimilarityFactory, SyncSliceTest, ClusterStateUpdateTest, ZkCLITest, SynonymTokenizerTest, BasicFunctionalityTest, TestFieldCollectionResource, WordBreakSolrSpellCheckerTest, DocValuesTest, TestWriterPerf, UnloadDistributedZkTest, TestStressRecovery, TestCharFilters, TestSolrDeletionPolicy1, TestSolrQueryParser, RecoveryZkTest, TestSearchPerf, TestDocumentBuilder, TestRemoteStreaming, TestDynamicFieldCollectionResource, TestPhraseSuggestions, SolrIndexSplitterTest, TestFastWriter, TestSolrIndexConfig, LeaderElectionTest, JsonLoaderTest, TestFastLRUCache, TestQuerySenderListener, AutoCommitTest, TermVectorComponentTest, TestQueryUtils, FastVectorHighlighterTest, LoggingHandlerTest, FileBasedSpellCheckerTest, UUIDFieldTest, TestReversedWildcardFilterFactory, ShowFileRequestHandlerTest, BasicDistributedZkTest, BasicDistributedZk2Test]
[junit4:junit4] Completed on J0 in 29.97s, 1 test, 1 error <<< FAILURES!

[...truncated 426 lines...]
BUILD FAILED
/mnt/ssd/jenkins/workspace/Lucene-Solr-trunk-Linux/build.xml:381: The following error occurred while executing this line:
/mnt/ssd/jenkins/workspace/Lucene-Solr-trunk-Linux/build.xml:374: The following error occurred while executing this line:
/mnt/ssd/jenkins/workspace/Lucene-Solr-trunk-Linux/build.xml:39: The following error occurred while executing this line:
/mnt/ssd/jenkins/workspace/Lucene-Solr-trunk-Linux/solr/build.xml:183: The following error occurred while executing this line:
/mnt/ssd/jenkins/workspace/Lucene-Solr-trunk-Linux/solr/common-build.xml:449: The following error occurred while executing this line:
/mnt/ssd/jenkins/workspace/Lucene-Solr-trunk-Linux/lucene/common-build.xml:1213: The following error occurred while executing this line:
/mnt/ssd/jenkins/workspace/Lucene-Solr-trunk-Linux/lucene/common-build.xml:877: There were test failures: 268 suites, 1134 tests, 3 errors, 14 ignored (8 assumptions)

Total time: 48 minutes 46 seconds
Build step 'Invoke Ant' marked build as failure
Archiving artifacts
Recording test results
Description set: Java: 32bit/ibm-j9-jdk7 
Email was triggered for: Failure
Sending email for trigger: Failure



Mime
View raw message