lucene-dev mailing list archives

Site index · List index
Message view « Date » · « Thread »
Top « Date » · « Thread »
From Policeman Jenkins Server <jenk...@thetaphi.de>
Subject [JENKINS] Lucene-Solr-4.x-MacOSX (64bit/jdk1.7.0) - Build # 337 - Failure!
Date Sun, 24 Mar 2013 04:14:12 GMT
Build: http://jenkins.thetaphi.de/job/Lucene-Solr-4.x-MacOSX/337/
Java: 64bit/jdk1.7.0 -XX:+UseConcMarkSweepGC

1 tests failed.
REGRESSION:  org.apache.solr.update.SoftAutoCommitTest.testSoftAndHardCommitMaxTimeRapidAdds

Error Message:
1: soft occured too fast: 1364096185912 + (500 * 1) !<= 1364096186380

Stack Trace:
java.lang.AssertionError: 1: soft occured too fast: 1364096185912 + (500 * 1) !<= 1364096186380
	at __randomizedtesting.SeedInfo.seed([960B46A0A430B5DD:CA1EE8994FB2F4A5]:0)
	at org.junit.Assert.fail(Assert.java:93)
	at org.junit.Assert.assertTrue(Assert.java:43)
	at org.apache.solr.update.SoftAutoCommitTest.testSoftAndHardCommitMaxTimeRapidAdds(SoftAutoCommitTest.java:321)
	at sun.reflect.NativeMethodAccessorImpl.invoke0(Native Method)
	at sun.reflect.NativeMethodAccessorImpl.invoke(NativeMethodAccessorImpl.java:57)
	at sun.reflect.DelegatingMethodAccessorImpl.invoke(DelegatingMethodAccessorImpl.java:43)
	at java.lang.reflect.Method.invoke(Method.java:601)
	at com.carrotsearch.randomizedtesting.RandomizedRunner.invoke(RandomizedRunner.java:1559)
	at com.carrotsearch.randomizedtesting.RandomizedRunner.access$600(RandomizedRunner.java:79)
	at com.carrotsearch.randomizedtesting.RandomizedRunner$6.evaluate(RandomizedRunner.java:737)
	at com.carrotsearch.randomizedtesting.RandomizedRunner$7.evaluate(RandomizedRunner.java:773)
	at com.carrotsearch.randomizedtesting.RandomizedRunner$8.evaluate(RandomizedRunner.java:787)
	at com.carrotsearch.randomizedtesting.rules.SystemPropertiesRestoreRule$1.evaluate(SystemPropertiesRestoreRule.java:53)
	at org.apache.lucene.util.TestRuleSetupTeardownChained$1.evaluate(TestRuleSetupTeardownChained.java:50)
	at org.apache.lucene.util.TestRuleFieldCacheSanity$1.evaluate(TestRuleFieldCacheSanity.java:51)
	at org.apache.lucene.util.AbstractBeforeAfterRule$1.evaluate(AbstractBeforeAfterRule.java:46)
	at com.carrotsearch.randomizedtesting.rules.SystemPropertiesInvariantRule$1.evaluate(SystemPropertiesInvariantRule.java:55)
	at org.apache.lucene.util.TestRuleThreadAndTestName$1.evaluate(TestRuleThreadAndTestName.java:49)
	at org.apache.lucene.util.TestRuleIgnoreAfterMaxFailures$1.evaluate(TestRuleIgnoreAfterMaxFailures.java:70)
	at org.apache.lucene.util.TestRuleMarkFailure$1.evaluate(TestRuleMarkFailure.java:48)
	at com.carrotsearch.randomizedtesting.rules.StatementAdapter.evaluate(StatementAdapter.java:36)
	at com.carrotsearch.randomizedtesting.ThreadLeakControl$StatementRunner.run(ThreadLeakControl.java:358)
	at com.carrotsearch.randomizedtesting.ThreadLeakControl.forkTimeoutingTask(ThreadLeakControl.java:782)
	at com.carrotsearch.randomizedtesting.ThreadLeakControl$3.evaluate(ThreadLeakControl.java:442)
	at com.carrotsearch.randomizedtesting.RandomizedRunner.runSingleTest(RandomizedRunner.java:746)
	at com.carrotsearch.randomizedtesting.RandomizedRunner$3.evaluate(RandomizedRunner.java:648)
	at com.carrotsearch.randomizedtesting.RandomizedRunner$4.evaluate(RandomizedRunner.java:682)
	at com.carrotsearch.randomizedtesting.RandomizedRunner$5.evaluate(RandomizedRunner.java:693)
	at com.carrotsearch.randomizedtesting.rules.StatementAdapter.evaluate(StatementAdapter.java:36)
	at com.carrotsearch.randomizedtesting.rules.SystemPropertiesRestoreRule$1.evaluate(SystemPropertiesRestoreRule.java:53)
	at org.apache.lucene.util.AbstractBeforeAfterRule$1.evaluate(AbstractBeforeAfterRule.java:46)
	at org.apache.lucene.util.TestRuleStoreClassName$1.evaluate(TestRuleStoreClassName.java:42)
	at com.carrotsearch.randomizedtesting.rules.SystemPropertiesInvariantRule$1.evaluate(SystemPropertiesInvariantRule.java:55)
	at com.carrotsearch.randomizedtesting.rules.NoShadowingOrOverridesOnMethodsRule$1.evaluate(NoShadowingOrOverridesOnMethodsRule.java:39)
	at com.carrotsearch.randomizedtesting.rules.NoShadowingOrOverridesOnMethodsRule$1.evaluate(NoShadowingOrOverridesOnMethodsRule.java:39)
	at com.carrotsearch.randomizedtesting.rules.StatementAdapter.evaluate(StatementAdapter.java:36)
	at org.apache.lucene.util.TestRuleAssertionsRequired$1.evaluate(TestRuleAssertionsRequired.java:43)
	at org.apache.lucene.util.TestRuleMarkFailure$1.evaluate(TestRuleMarkFailure.java:48)
	at org.apache.lucene.util.TestRuleIgnoreAfterMaxFailures$1.evaluate(TestRuleIgnoreAfterMaxFailures.java:70)
	at org.apache.lucene.util.TestRuleIgnoreTestSuites$1.evaluate(TestRuleIgnoreTestSuites.java:55)
	at com.carrotsearch.randomizedtesting.rules.StatementAdapter.evaluate(StatementAdapter.java:36)
	at com.carrotsearch.randomizedtesting.ThreadLeakControl$StatementRunner.run(ThreadLeakControl.java:358)
	at java.lang.Thread.run(Thread.java:722)




Build Log:
[...truncated 8975 lines...]
[junit4:junit4] Suite: org.apache.solr.update.SoftAutoCommitTest
[junit4:junit4]   2> 2 T17 oas.SolrTestCaseJ4.initCore ####initCore
[junit4:junit4]   2> Creating dataDir: /Users/jenkins/jenkins-slave/workspace/Lucene-Solr-4.x-MacOSX/solr/build/solr-core/test/J0/./solrtest-SoftAutoCommitTest-1364096180878
[junit4:junit4]   2> 4 T17 oasc.SolrResourceLoader.<init> new SolrResourceLoader for directory: '/Users/jenkins/jenkins-slave/workspace/Lucene-Solr-4.x-MacOSX/solr/build/solr-core/test-files/solr/collection1/'
[junit4:junit4]   2> 6 T17 oasc.SolrResourceLoader.replaceClassLoader Adding 'file:/Users/jenkins/jenkins-slave/workspace/Lucene-Solr-4.x-MacOSX/solr/build/solr-core/test-files/solr/collection1/lib/classes/' to classloader
[junit4:junit4]   2> 14 T17 oasc.SolrResourceLoader.replaceClassLoader Adding 'file:/Users/jenkins/jenkins-slave/workspace/Lucene-Solr-4.x-MacOSX/solr/build/solr-core/test-files/solr/collection1/lib/README' to classloader
[junit4:junit4]   2> 305 T17 oasc.SolrConfig.<init> Using Lucene MatchVersion: LUCENE_43
[junit4:junit4]   2> 510 T17 oasc.SolrConfig.<init> Loaded SolrConfig: solrconfig.xml
[junit4:junit4]   2> 512 T17 oass.IndexSchema.readSchema Reading Solr Schema
[junit4:junit4]   2> 565 T17 oass.IndexSchema.readSchema Schema name=test
[junit4:junit4]   2> 1491 T17 oass.OpenExchangeRatesOrgProvider.init Initialized with rates=open-exchange-rates.json, refreshInterval=1440.
[junit4:junit4]   2> 1510 T17 oass.IndexSchema.readSchema default search field in schema is text
[junit4:junit4]   2> 1515 T17 oass.IndexSchema.readSchema unique key field: id
[junit4:junit4]   2> 1550 T17 oass.FileExchangeRateProvider.reload Reloading exchange rates from file currency.xml
[junit4:junit4]   2> 1557 T17 oass.FileExchangeRateProvider.reload Reloading exchange rates from file currency.xml
[junit4:junit4]   2> 1566 T17 oass.OpenExchangeRatesOrgProvider.reload Reloading exchange rates from open-exchange-rates.json
[junit4:junit4]   2> 1568 T17 oass.OpenExchangeRatesOrgProvider$OpenExchangeRates.<init> WARNING Unknown key IMPORTANT NOTE
[junit4:junit4]   2> 1569 T17 oass.OpenExchangeRatesOrgProvider$OpenExchangeRates.<init> WARNING Expected key, got STRING
[junit4:junit4]   2> 1571 T17 oass.OpenExchangeRatesOrgProvider.reload Reloading exchange rates from open-exchange-rates.json
[junit4:junit4]   2> 1572 T17 oass.OpenExchangeRatesOrgProvider$OpenExchangeRates.<init> WARNING Unknown key IMPORTANT NOTE
[junit4:junit4]   2> 1573 T17 oass.OpenExchangeRatesOrgProvider$OpenExchangeRates.<init> WARNING Expected key, got STRING
[junit4:junit4]   2> 1574 T17 oasc.SolrResourceLoader.locateSolrHome JNDI not configured for solr (NoInitialContextEx)
[junit4:junit4]   2> 1575 T17 oasc.SolrResourceLoader.locateSolrHome using system property solr.solr.home: /Users/jenkins/jenkins-slave/workspace/Lucene-Solr-4.x-MacOSX/solr/build/solr-core/test-files/solr
[junit4:junit4]   2> 1576 T17 oasc.SolrResourceLoader.<init> new SolrResourceLoader for directory: '/Users/jenkins/jenkins-slave/workspace/Lucene-Solr-4.x-MacOSX/solr/build/solr-core/test-files/solr/'
[junit4:junit4]   2> 1600 T17 oasc.CoreContainer.<init> New CoreContainer 2145173627
[junit4:junit4]   2> 1602 T17 oasc.SolrCore.initDirectoryFactory org.apache.solr.core.MockDirectoryFactory
[junit4:junit4]   2> 1603 T17 oasc.SolrCore.<init> [collection1] Opening new SolrCore at /Users/jenkins/jenkins-slave/workspace/Lucene-Solr-4.x-MacOSX/solr/build/solr-core/test-files/solr/collection1/, dataDir=/Users/jenkins/jenkins-slave/workspace/Lucene-Solr-4.x-MacOSX/solr/build/solr-core/test/J0/./solrtest-SoftAutoCommitTest-1364096180878/
[junit4:junit4]   2> 1609 T17 oasc.JmxMonitoredMap.<init> JMX monitoring is enabled. Adding Solr mbeans to JMX Server: com.sun.jmx.mbeanserver.JmxMBeanServer@55c1c532
[junit4:junit4]   2> 1620 T17 oasc.SolrCore.initDirectoryFactory org.apache.solr.core.MockDirectoryFactory
[junit4:junit4]   2> 1633 T17 oasc.CachingDirectoryFactory.get return new directory for /Users/jenkins/jenkins-slave/workspace/Lucene-Solr-4.x-MacOSX/solr/build/solr-core/test/J0/./solrtest-SoftAutoCommitTest-1364096180878
[junit4:junit4]   2> 1634 T17 oasc.SolrCore.getNewIndexDir New index directory detected: old=null new=/Users/jenkins/jenkins-slave/workspace/Lucene-Solr-4.x-MacOSX/solr/build/solr-core/test/J0/./solrtest-SoftAutoCommitTest-1364096180878/index/
[junit4:junit4]   2> 1635 T17 oasc.SolrCore.initIndex WARNING [collection1] Solr index directory '/Users/jenkins/jenkins-slave/workspace/Lucene-Solr-4.x-MacOSX/solr/build/solr-core/test/J0/./solrtest-SoftAutoCommitTest-1364096180878/index' doesn't exist. Creating new index...
[junit4:junit4]   2> 1638 T17 oasc.CachingDirectoryFactory.get return new directory for /Users/jenkins/jenkins-slave/workspace/Lucene-Solr-4.x-MacOSX/solr/build/solr-core/test/J0/./solrtest-SoftAutoCommitTest-1364096180878/index
[junit4:junit4]   2> 1646 T17 oasc.SolrDeletionPolicy.onCommit SolrDeletionPolicy.onCommit: commits:num=1
[junit4:junit4]   2> 		commit{dir=RateLimitedDirectoryWrapper(MockDirWrapper(NRTCachingDirectory(org.apache.lucene.store.RAMDirectory@697b0672 lockFactory=org.apache.lucene.store.NativeFSLockFactory@3e1917a2; maxCacheMB=0.7138671875 maxMergeSizeMB=0.984375))),segFN=segments_1,generation=1,filenames=[segments_1]
[junit4:junit4]   2> 1647 T17 oasc.SolrDeletionPolicy.updateCommits newest commit = 1[segments_1]
[junit4:junit4]   2> 1675 T17 oasc.SolrCore.initWriters created xml: solr.XMLResponseWriter
[junit4:junit4]   2> 1772 T17 oasup.UpdateRequestProcessorChain.init inserting DistributedUpdateProcessorFactory into updateRequestProcessorChain "dedupe"
[junit4:junit4]   2> 1774 T17 oasup.UpdateRequestProcessorChain.init inserting DistributedUpdateProcessorFactory into updateRequestProcessorChain "dedupe-allfields"
[junit4:junit4]   2> 1776 T17 oasup.UpdateRequestProcessorChain.init inserting DistributedUpdateProcessorFactory into updateRequestProcessorChain "stored_sig"
[junit4:junit4]   2> 1789 T17 oasup.UpdateRequestProcessorChain.init inserting DistributedUpdateProcessorFactory into updateRequestProcessorChain "uniq-fields"
[junit4:junit4]   2> 1829 T17 oasup.UpdateRequestProcessorChain.init inserting DistributedUpdateProcessorFactory into updateRequestProcessorChain "distrib-dup-test-chain-implicit"
[junit4:junit4]   2> 1831 T17 oasc.RequestHandlers.initHandlersFromConfig adding lazy requestHandler: solr.ReplicationHandler
[junit4:junit4]   2> 1837 T17 oasc.RequestHandlers.initHandlersFromConfig created /replication: solr.ReplicationHandler
[junit4:junit4]   2> 1844 T17 oasc.RequestHandlers.initHandlersFromConfig created standard: solr.StandardRequestHandler
[junit4:junit4]   2> 1865 T17 oasc.RequestHandlers.initHandlersFromConfig created /get: solr.RealTimeGetHandler
[junit4:junit4]   2> 1903 T17 oasc.RequestHandlers.initHandlersFromConfig created dismax: solr.SearchHandler
[junit4:junit4]   2> 1906 T17 oasc.RequestHandlers.initHandlersFromConfig created mock: org.apache.solr.core.MockQuerySenderListenerReqHandler
[junit4:junit4]   2> 1911 T17 oasc.RequestHandlers.initHandlersFromConfig created /admin/: org.apache.solr.handler.admin.AdminHandlers
[junit4:junit4]   2> 1912 T17 oasc.RequestHandlers.initHandlersFromConfig created defaults: solr.StandardRequestHandler
[junit4:junit4]   2> 1913 T17 oasc.RequestHandlers.initHandlersFromConfig adding lazy requestHandler: solr.StandardRequestHandler
[junit4:junit4]   2> 1914 T17 oasc.RequestHandlers.initHandlersFromConfig created lazy: solr.StandardRequestHandler
[junit4:junit4]   2> 1929 T17 oasc.RequestHandlers.initHandlersFromConfig created /update: solr.UpdateRequestHandler
[junit4:junit4]   2> 1932 T17 oasc.RequestHandlers.initHandlersFromConfig created /terms: org.apache.solr.handler.component.SearchHandler
[junit4:junit4]   2> 1935 T17 oasc.RequestHandlers.initHandlersFromConfig created spellCheckCompRH: org.apache.solr.handler.component.SearchHandler
[junit4:junit4]   2> 1938 T17 oasc.RequestHandlers.initHandlersFromConfig created spellCheckCompRH_Direct: org.apache.solr.handler.component.SearchHandler
[junit4:junit4]   2> 1942 T17 oasc.RequestHandlers.initHandlersFromConfig created spellCheckWithWordbreak: org.apache.solr.handler.component.SearchHandler
[junit4:junit4]   2> 1945 T17 oasc.RequestHandlers.initHandlersFromConfig created spellCheckWithWordbreak_Direct: org.apache.solr.handler.component.SearchHandler
[junit4:junit4]   2> 1948 T17 oasc.RequestHandlers.initHandlersFromConfig created spellCheckCompRH1: org.apache.solr.handler.component.SearchHandler
[junit4:junit4]   2> 1952 T17 oasc.RequestHandlers.initHandlersFromConfig created mltrh: org.apache.solr.handler.component.SearchHandler
[junit4:junit4]   2> 1955 T17 oasc.RequestHandlers.initHandlersFromConfig created tvrh: org.apache.solr.handler.component.SearchHandler
[junit4:junit4]   2> 1976 T17 oasc.RequestHandlers.initHandlersFromConfig created /mlt: solr.MoreLikeThisHandler
[junit4:junit4]   2> 1991 T17 oasc.RequestHandlers.initHandlersFromConfig created /debug/dump: solr.DumpRequestHandler
[junit4:junit4]   2> 1999 T17 oashl.XMLLoader.init xsltCacheLifetimeSeconds=60
[junit4:junit4]   2> 2005 T17 oasc.SolrCore.initDeprecatedSupport WARNING solrconfig.xml uses deprecated <admin/gettableFiles>, Please update your config to use the ShowFileRequestHandler.
[junit4:junit4]   2> 2046 T17 oasc.SolrCore.initDeprecatedSupport WARNING adding ShowFileRequestHandler with hidden files: [THROW.ERROR.ON.ADD.UPDATEPROCESSOR.JS, SOLRCONFIG-HIGHLIGHT.XML, SCHEMA-REQUIRED-FIELDS.XML, TRIVIAL.UPDATEPROCESSOR1.JS, BAD-SCHEMA-DOCVALUES-NOT-REQUIRED-NO-DEFAULT.XML, BAD-SCHEMA-DUP-DYNAMICFIELD.XML, SCHEMA-MINIMAL.XML, SCHEMA-REPLICATION2.XML, SOLRCONFIG-CACHING.XML, SCHEMA-POSTINGSHIGHLIGHT.XML, SOLRCONFIG-REPEATER.XML, REGEX-BOOST-PROCESSOR-TEST.TXT, SOLRCONFIG-MERGEPOLICY.XML, CURRENCY.XML, BAD-SCHEMA-CURRENCY-FT-BOGUS-CODE-IN-XML.XML, BAD-SCHEMA-NONTEXT-ANALYZER.XML, SOLRCONFIG-TLOG.XML, SOLRCONFIG-MASTER.XML, SOLRCONFIG-COMPONENTS-NAME.XML, BAD-SCHEMA-UNIQUEKEY-MULTIVALUED.XML, SCHEMA11.XML, SOLRCONFIG-BASIC.XML, DA_COMPOUNDDICTIONARY.TXT, MISSLEADING.EXTENSION.UPDATEPROCESSOR.JS.TXT, SCHEMA-COPYFIELD-TEST.XML, SOLRCONFIG-SLAVE.XML, SOLRCONFIG-PROPINJECT-INDEXDEFAULT.XML, ELEVATE.XML, TRIVIAL.UPDATEPROCESSOR0.JS, SCHEMA-SWEETSPOT.XML, BAD-SOLRCONFIG-BOGUS-SCRIPTENGINE-NAME.XML, SCHEMA-CHARFILTERS.XML, SCHEMA-IB.XML, SOLRCONFIG-QUERYSENDER.XML, SOLRCONFIG-SNIPPET-PROCESSOR.XML, DA_UTF8.XML, SCHEMA-REPLICATION1.XML, CONDITIONAL.UPDATEPROCESSOR.JS, SCHEMA-TINY.XML, MISSING.FUNCTIONS.UPDATEPROCESSOR.JS, SOLRCONFIG-ENABLEPLUGIN.XML, HYPHENATION.DTD, STEMDICT.TXT, SCHEMA-PHRASESUGGEST.XML, HUNSPELL-TEST.AFF, BAD-SCHEMA-CURRENCY-FT-OER-NORATES.XML, SCHEMA-SNIPPET-TYPE.XML, STOPTYPES-1.TXT, STOPWORDSWRONGENCODING.TXT, SCHEMA-NUMERIC.XML, SOLRCONFIG-TRANSFORMERS.XML, SOLRCONFIG-PROPINJECT.XML, BAD-SCHEMA-NOT-INDEXED-BUT-TF.XML, SOLRCONFIG-SIMPLELOCK.XML, SCHEMA-DOCVALUES.XML, WDFTYPES.TXT, STOPTYPES-2.TXT, SCHEMA-REVERSED.XML, BAD-SCHEMA-CURRENCY-FT-MULTIVALUED.XML, SOLRCONFIG-SPELLCHECKCOMPONENT.XML, SOLRCONFIG-PHRASESUGGEST.XML, BAD-SCHEMA-CURRENCY-MULTIVALUED.XML, SCHEMA-DFR.XML, BAD-SCHEMA-NOT-INDEXED-BUT-POS.XML, KEEP-1.TXT, OPEN-EXCHANGE-RATES.JSON, SCHEMA-SPATIAL.XML, STOPWITHBOM.TXT, SOLRCONFIG-SPELLCHECKER.XML, SOLRCONFIG-POSTINGSHIGHLIGHT.XML, SCHEMA-BINARYFIELD.XML, SOLRCONFIG-UPDATE-PROCESSOR-CHAINS.XML, BAD-SCHEMA-OMIT-TF-BUT-NOT-POS.XML, BAD-SCHEMA-DUP-FIELDTYPE.XML, SCHEMA-XINCLUDE.XML, SOLRCONFIG-MASTER1.XML, SCHEMA-BEHAVIOR.XML, SYNONYMS.TXT, SOLRCONFIG-MINIMAL.XML, SCHEMA-DOCVALUESMULTI.XML, BAD-SCHEMA-UNSUPPORTED-DOCVALUES.XML, BAD-SCHEMA-CURRENCY-DYNAMIC-MULTIVALUED.XML, SCHEMA_CODEC.XML, BAD-SCHEMA-SWEETSPOT-PARTIAL-HYPERBOLIC.XML, SOLRCONFIG-SOLR-749.XML, SOLRCONFIG-MASTER1-KEEPONEBACKUP.XML, SCHEMA-EFF.XML, STOP-2.TXT, SOLRCONFIG-FUNCTIONQUERY.XML, SOLRCONFIG-TERMINDEX.XML, SCHEMA-LMDIRICHLET.XML, SOLRCONFIG-ELEVATE.XML, BAD-SCHEMA-SWEETSPOT-PARTIAL-NORMS.XML, BAD-SCHEMA-SWEETSPOT-PARTIAL-BASELINE.XML, STOPWORDS.TXT, SCHEMA-FOLDING.XML, SCHEMA-STOP-KEEP.XML, FUZZYSUGGEST.TXT, BAD-SCHEMA-NOT-INDEXED-BUT-NORMS.XML, SCHEMA-REST.XML, SOLRCONFIG-SOLCOREPROPERTIES.XML, STOP-1.TXT, SOLRCONFIG-MASTER2.XML, SCHEMA-SPELLCHECKER.XML, SOLRCONFIG-RESPONSE-LOG-COMPONENT.XML, SOLRCONFIG-LAZYWRITER.XML, SCHEMA-LUCENEMATCHVERSION.XML, FRENCHARTICLES.TXT, BAD-MP-SOLRCONFIG.XML, SCHEMA15.XML, SOLRCONFIG-REQHANDLER.INCL, SCHEMASURROUND.XML, SCHEMA-COLLATEFILTER.XML, SOLRCONFIG-MASTER3.XML, HUNSPELL-TEST.DIC, SOLRCONFIG-XINCLUDE.XML, BAD-SCHEMA-CODEC-GLOBAL-VS-FT-MISMATCH.XML, SOLRCONFIG-SLAVE1.XML, SOLRCONFIG-DELPOLICY1.XML, SCHEMA-SIM.XML, SCHEMA-SNIPPET-FIELD.XML, SCHEMA-COLLATE.XML, STOP-SNOWBALL.TXT, BAD-SCHEMA-SIM-GLOBAL-VS-FT-MISMATCH.XML, PROTWORDS.TXT, SCHEMA-TRIE.XML, SOLRCONFIG_CODEC.XML, SCHEMA-SYNONYM-TOKENIZER.XML, BAD-SOLRCONFIG-INVALID-SCRIPTFILE.XML, JASUGGEST.TXT, SCHEMA-DOCVALUESFACETING.XML, SCHEMA-TFIDF.XML, SOLRCONFIG-SCRIPT-UPDATEPROCESSOR.XML, SCHEMA-LMJELINEKMERCER.XML, PHRASESUGGEST.TXT, BAD-SOLRCONFIG-MISSING-SCRIPTFILE.XML, SOLRCONFIG-BASIC-LUCENEVERSION31.XML, BAD-SCHEMA-UNIQUEKEY-USES-DEFAULT.XML, OLD_SYNONYMS.TXT, SOLRCONFIG-DELPOLICY2.XML, XSLT, SOLRCONFIG-NATIVELOCK.XML, BAD-SCHEMA-DUP-FIELD.XML, SOLRCONFIG-NOCACHE.XML, BAD-SCHEMA-SWEETSPOT-BOTH-TF.XML, SCHEMA-BM25.XML, ADDFIELDS.UPDATEPROCESSOR.JS, SOLRCONFIG-QUERYSENDER-NOQUERY.XML, SOLRCONFIG-ALTDIRECTORY.XML, COMPOUNDDICTIONARY.TXT, SOLRCONFIG_PERF.XML, SOLRCONFIG-INDEXCONFIG.XML, BAD-SCHEMA-CURRENCY-FT-BOGUS-DEFAULT-CODE.XML, BAD-CURRENCY.XML, BAD-SCHEMA-ANALYZER-CLASS-AND-NESTED.XML, SCHEMA-NOT-REQUIRED-UNIQUE-KEY.XML, KEEP-2.TXT, SCHEMA12.XML, BAD-SCHEMA-UNIQUEKEY-IS-COPYFIELD-DEST.XML, MAPPING-ISOLATIN1ACCENT.TXT, BAD_SOLRCONFIG.XML, BAD-SCHEMA-EXTERNAL-FILEFIELD.XML]
[junit4:junit4]   2> 2056 T17 oass.SolrIndexSearcher.<init> Opening Searcher@29d7537c main
[junit4:junit4]   2> 2096 T17 oasu.CommitTracker.<init> Hard AutoCommit: disabled
[junit4:junit4]   2> 2097 T17 oasu.CommitTracker.<init> Soft AutoCommit: disabled
[junit4:junit4]   2> 2100 T17 oashc.SpellCheckComponent.inform Initializing spell checkers
[junit4:junit4]   2> 2252 T17 oass.DirectSolrSpellChecker.init init: {name=direct,classname=DirectSolrSpellChecker,field=lowerfilt,minQueryLength=3}
[junit4:junit4]   2> 2513 T18 oasc.SolrCore.registerSearcher [collection1] Registered new searcher Searcher@29d7537c main{StandardDirectoryReader(segments_1:1)}
[junit4:junit4]   2> 2545 T17 oasc.CoreContainer.registerCore registering core: collection1
[junit4:junit4]   2> 2556 T17 oas.SolrTestCaseJ4.initCore ####initCore end
[junit4:junit4]   2> 2572 T17 oas.SolrTestCaseJ4.setUp ###Starting testSoftAndHardCommitMaxTimeRapidAdds
[junit4:junit4]   2> 2574 T17 oasc.CoreContainer.reload Reloading SolrCore 'collection1' using instanceDir: /Users/jenkins/jenkins-slave/workspace/Lucene-Solr-4.x-MacOSX/solr/build/solr-core/test-files/solr/collection1
[junit4:junit4]   2> 2580 T17 oasc.SolrResourceLoader.<init> new SolrResourceLoader for directory: '/Users/jenkins/jenkins-slave/workspace/Lucene-Solr-4.x-MacOSX/solr/build/solr-core/test-files/solr/collection1/'
[junit4:junit4]   2> 2583 T17 oasc.SolrResourceLoader.replaceClassLoader Adding 'file:/Users/jenkins/jenkins-slave/workspace/Lucene-Solr-4.x-MacOSX/solr/build/solr-core/test-files/solr/collection1/lib/classes/' to classloader
[junit4:junit4]   2> 2585 T17 oasc.SolrResourceLoader.replaceClassLoader Adding 'file:/Users/jenkins/jenkins-slave/workspace/Lucene-Solr-4.x-MacOSX/solr/build/solr-core/test-files/solr/collection1/lib/README' to classloader
[junit4:junit4]   2> 2764 T17 oasc.SolrConfig.<init> Using Lucene MatchVersion: LUCENE_43
[junit4:junit4]   2> 2918 T17 oasc.SolrConfig.<init> Loaded SolrConfig: solrconfig.xml
[junit4:junit4]   2> 2921 T17 oass.IndexSchema.readSchema Reading Solr Schema
[junit4:junit4]   2> 3058 T17 oass.IndexSchema.readSchema Schema name=test
[junit4:junit4]   2> 4103 T17 oass.OpenExchangeRatesOrgProvider.init Initialized with rates=open-exchange-rates.json, refreshInterval=1440.
[junit4:junit4]   2> 4131 T17 oass.IndexSchema.readSchema default search field in schema is text
[junit4:junit4]   2> 4141 T17 oass.IndexSchema.readSchema unique key field: id
[junit4:junit4]   2> 4175 T17 oass.FileExchangeRateProvider.reload Reloading exchange rates from file currency.xml
[junit4:junit4]   2> 4187 T17 oass.FileExchangeRateProvider.reload Reloading exchange rates from file currency.xml
[junit4:junit4]   2> 4198 T17 oass.OpenExchangeRatesOrgProvider.reload Reloading exchange rates from open-exchange-rates.json
[junit4:junit4]   2> 4200 T17 oass.OpenExchangeRatesOrgProvider$OpenExchangeRates.<init> WARNING Unknown key IMPORTANT NOTE
[junit4:junit4]   2> 4201 T17 oass.OpenExchangeRatesOrgProvider$OpenExchangeRates.<init> WARNING Expected key, got STRING
[junit4:junit4]   2> 4202 T17 oass.OpenExchangeRatesOrgProvider.reload Reloading exchange rates from open-exchange-rates.json
[junit4:junit4]   2> 4204 T17 oass.OpenExchangeRatesOrgProvider$OpenExchangeRates.<init> WARNING Unknown key IMPORTANT NOTE
[junit4:junit4]   2> 4205 T17 oass.OpenExchangeRatesOrgProvider$OpenExchangeRates.<init> WARNING Expected key, got STRING
[junit4:junit4]   2> 4206 T17 oasc.SolrCore.<init> [collection1] Opening new SolrCore at /Users/jenkins/jenkins-slave/workspace/Lucene-Solr-4.x-MacOSX/solr/build/solr-core/test-files/solr/collection1/, dataDir=/Users/jenkins/jenkins-slave/workspace/Lucene-Solr-4.x-MacOSX/solr/build/solr-core/test/J0/./solrtest-SoftAutoCommitTest-1364096180878/
[junit4:junit4]   2> 4208 T17 oasc.JmxMonitoredMap.<init> JMX monitoring is enabled. Adding Solr mbeans to JMX Server: com.sun.jmx.mbeanserver.JmxMBeanServer@55c1c532
[junit4:junit4]   2> 4210 T17 oasc.SolrCore.getNewIndexDir New index directory detected: old=null new=/Users/jenkins/jenkins-slave/workspace/Lucene-Solr-4.x-MacOSX/solr/build/solr-core/test/J0/./solrtest-SoftAutoCommitTest-1364096180878/index/
[junit4:junit4]   2> 4211 T17 oasc.SolrCore.initWriters created xml: solr.XMLResponseWriter
[junit4:junit4]   2> 4218 T17 oasup.UpdateRequestProcessorChain.init inserting DistributedUpdateProcessorFactory into updateRequestProcessorChain "dedupe"
[junit4:junit4]   2> 4220 T17 oasup.UpdateRequestProcessorChain.init inserting DistributedUpdateProcessorFactory into updateRequestProcessorChain "dedupe-allfields"
[junit4:junit4]   2> 4221 T17 oasup.UpdateRequestProcessorChain.init inserting DistributedUpdateProcessorFactory into updateRequestProcessorChain "stored_sig"
[junit4:junit4]   2> 4223 T17 oasup.UpdateRequestProcessorChain.init inserting DistributedUpdateProcessorFactory into updateRequestProcessorChain "uniq-fields"
[junit4:junit4]   2> 4225 T17 oasup.UpdateRequestProcessorChain.init inserting DistributedUpdateProcessorFactory into updateRequestProcessorChain "distrib-dup-test-chain-implicit"
[junit4:junit4]   2> 4227 T17 oasc.RequestHandlers.initHandlersFromConfig adding lazy requestHandler: solr.ReplicationHandler
[junit4:junit4]   2> 4228 T17 oasc.RequestHandlers.initHandlersFromConfig created /replication: solr.ReplicationHandler
[junit4:junit4]   2> 4231 T17 oasc.RequestHandlers.initHandlersFromConfig created standard: solr.StandardRequestHandler
[junit4:junit4]   2> 4235 T17 oasc.RequestHandlers.initHandlersFromConfig created /get: solr.RealTimeGetHandler
[junit4:junit4]   2> 4238 T17 oasc.RequestHandlers.initHandlersFromConfig created dismax: solr.SearchHandler
[junit4:junit4]   2> 4242 T17 oasc.RequestHandlers.initHandlersFromConfig created mock: org.apache.solr.core.MockQuerySenderListenerReqHandler
[junit4:junit4]   2> 4244 T17 oasc.RequestHandlers.initHandlersFromConfig created /admin/: org.apache.solr.handler.admin.AdminHandlers
[junit4:junit4]   2> 4248 T17 oasc.RequestHandlers.initHandlersFromConfig created defaults: solr.StandardRequestHandler
[junit4:junit4]   2> 4249 T17 oasc.RequestHandlers.initHandlersFromConfig adding lazy requestHandler: solr.StandardRequestHandler
[junit4:junit4]   2> 4251 T17 oasc.RequestHandlers.initHandlersFromConfig created lazy: solr.StandardRequestHandler
[junit4:junit4]   2> 4254 T17 oasc.RequestHandlers.initHandlersFromConfig created /update: solr.UpdateRequestHandler
[junit4:junit4]   2> 4258 T17 oasc.RequestHandlers.initHandlersFromConfig created /terms: org.apache.solr.handler.component.SearchHandler
[junit4:junit4]   2> 4261 T17 oasc.RequestHandlers.initHandlersFromConfig created spellCheckCompRH: org.apache.solr.handler.component.SearchHandler
[junit4:junit4]   2> 4265 T17 oasc.RequestHandlers.initHandlersFromConfig created spellCheckCompRH_Direct: org.apache.solr.handler.component.SearchHandler
[junit4:junit4]   2> 4270 T17 oasc.RequestHandlers.initHandlersFromConfig created spellCheckWithWordbreak: org.apache.solr.handler.component.SearchHandler
[junit4:junit4]   2> 4274 T17 oasc.RequestHandlers.initHandlersFromConfig created spellCheckWithWordbreak_Direct: org.apache.solr.handler.component.SearchHandler
[junit4:junit4]   2> 4278 T17 oasc.RequestHandlers.initHandlersFromConfig created spellCheckCompRH1: org.apache.solr.handler.component.SearchHandler
[junit4:junit4]   2> 4283 T17 oasc.RequestHandlers.initHandlersFromConfig created mltrh: org.apache.solr.handler.component.SearchHandler
[junit4:junit4]   2> 4286 T17 oasc.RequestHandlers.initHandlersFromConfig created tvrh: org.apache.solr.handler.component.SearchHandler
[junit4:junit4]   2> 4311 T17 oasc.RequestHandlers.initHandlersFromConfig created /mlt: solr.MoreLikeThisHandler
[junit4:junit4]   2> 4315 T17 oasc.RequestHandlers.initHandlersFromConfig created /debug/dump: solr.DumpRequestHandler
[junit4:junit4]   2> 4318 T17 oashl.XMLLoader.init xsltCacheLifetimeSeconds=60
[junit4:junit4]   2> 4323 T17 oasc.SolrCore.initDeprecatedSupport WARNING solrconfig.xml uses deprecated <admin/gettableFiles>, Please update your config to use the ShowFileRequestHandler.
[junit4:junit4]   2> 4329 T17 oasc.SolrCore.initDeprecatedSupport WARNING adding ShowFileRequestHandler with hidden files: [THROW.ERROR.ON.ADD.UPDATEPROCESSOR.JS, SOLRCONFIG-HIGHLIGHT.XML, SCHEMA-REQUIRED-FIELDS.XML, TRIVIAL.UPDATEPROCESSOR1.JS, BAD-SCHEMA-DOCVALUES-NOT-REQUIRED-NO-DEFAULT.XML, BAD-SCHEMA-DUP-DYNAMICFIELD.XML, SCHEMA-MINIMAL.XML, SCHEMA-REPLICATION2.XML, SOLRCONFIG-CACHING.XML, SCHEMA-POSTINGSHIGHLIGHT.XML, SOLRCONFIG-REPEATER.XML, REGEX-BOOST-PROCESSOR-TEST.TXT, SOLRCONFIG-MERGEPOLICY.XML, CURRENCY.XML, BAD-SCHEMA-CURRENCY-FT-BOGUS-CODE-IN-XML.XML, BAD-SCHEMA-NONTEXT-ANALYZER.XML, SOLRCONFIG-TLOG.XML, SOLRCONFIG-MASTER.XML, SOLRCONFIG-COMPONENTS-NAME.XML, BAD-SCHEMA-UNIQUEKEY-MULTIVALUED.XML, SCHEMA11.XML, SOLRCONFIG-BASIC.XML, DA_COMPOUNDDICTIONARY.TXT, MISSLEADING.EXTENSION.UPDATEPROCESSOR.JS.TXT, SCHEMA-COPYFIELD-TEST.XML, SOLRCONFIG-SLAVE.XML, SOLRCONFIG-PROPINJECT-INDEXDEFAULT.XML, ELEVATE.XML, TRIVIAL.UPDATEPROCESSOR0.JS, SCHEMA-SWEETSPOT.XML, BAD-SOLRCONFIG-BOGUS-SCRIPTENGINE-NAME.XML, SCHEMA-CHARFILTERS.XML, SCHEMA-IB.XML, SOLRCONFIG-QUERYSENDER.XML, SOLRCONFIG-SNIPPET-PROCESSOR.XML, DA_UTF8.XML, SCHEMA-REPLICATION1.XML, CONDITIONAL.UPDATEPROCESSOR.JS, SCHEMA-TINY.XML, MISSING.FUNCTIONS.UPDATEPROCESSOR.JS, SOLRCONFIG-ENABLEPLUGIN.XML, HYPHENATION.DTD, STEMDICT.TXT, SCHEMA-PHRASESUGGEST.XML, HUNSPELL-TEST.AFF, BAD-SCHEMA-CURRENCY-FT-OER-NORATES.XML, SCHEMA-SNIPPET-TYPE.XML, STOPTYPES-1.TXT, STOPWORDSWRONGENCODING.TXT, SCHEMA-NUMERIC.XML, SOLRCONFIG-TRANSFORMERS.XML, SOLRCONFIG-PROPINJECT.XML, BAD-SCHEMA-NOT-INDEXED-BUT-TF.XML, SOLRCONFIG-SIMPLELOCK.XML, SCHEMA-DOCVALUES.XML, WDFTYPES.TXT, STOPTYPES-2.TXT, SCHEMA-REVERSED.XML, BAD-SCHEMA-CURRENCY-FT-MULTIVALUED.XML, SOLRCONFIG-SPELLCHECKCOMPONENT.XML, SOLRCONFIG-PHRASESUGGEST.XML, BAD-SCHEMA-CURRENCY-MULTIVALUED.XML, SCHEMA-DFR.XML, BAD-SCHEMA-NOT-INDEXED-BUT-POS.XML, KEEP-1.TXT, OPEN-EXCHANGE-RATES.JSON, SCHEMA-SPATIAL.XML, STOPWITHBOM.TXT, SOLRCONFIG-SPELLCHECKER.XML, SOLRCONFIG-POSTINGSHIGHLIGHT.XML, SCHEMA-BINARYFIELD.XML, SOLRCONFIG-UPDATE-PROCESSOR-CHAINS.XML, BAD-SCHEMA-OMIT-TF-BUT-NOT-POS.XML, BAD-SCHEMA-DUP-FIELDTYPE.XML, SCHEMA-XINCLUDE.XML, SOLRCONFIG-MASTER1.XML, SCHEMA-BEHAVIOR.XML, SYNONYMS.TXT, SOLRCONFIG-MINIMAL.XML, SCHEMA-DOCVALUESMULTI.XML, BAD-SCHEMA-UNSUPPORTED-DOCVALUES.XML, BAD-SCHEMA-CURRENCY-DYNAMIC-MULTIVALUED.XML, SCHEMA_CODEC.XML, BAD-SCHEMA-SWEETSPOT-PARTIAL-HYPERBOLIC.XML, SOLRCONFIG-SOLR-749.XML, SOLRCONFIG-MASTER1-KEEPONEBACKUP.XML, SCHEMA-EFF.XML, STOP-2.TXT, SOLRCONFIG-FUNCTIONQUERY.XML, SOLRCONFIG-TERMINDEX.XML, SCHEMA-LMDIRICHLET.XML, SOLRCONFIG-ELEVATE.XML, BAD-SCHEMA-SWEETSPOT-PARTIAL-NORMS.XML, BAD-SCHEMA-SWEETSPOT-PARTIAL-BASELINE.XML, STOPWORDS.TXT, SCHEMA-FOLDING.XML, SCHEMA-STOP-KEEP.XML, FUZZYSUGGEST.TXT, BAD-SCHEMA-NOT-INDEXED-BUT-NORMS.XML, SCHEMA-REST.XML, SOLRCONFIG-SOLCOREPROPERTIES.XML, STOP-1.TXT, SOLRCONFIG-MASTER2.XML, SCHEMA-SPELLCHECKER.XML, SOLRCONFIG-RESPONSE-LOG-COMPONENT.XML, SOLRCONFIG-LAZYWRITER.XML, SCHEMA-LUCENEMATCHVERSION.XML, FRENCHARTICLES.TXT, BAD-MP-SOLRCONFIG.XML, SCHEMA15.XML, SOLRCONFIG-REQHANDLER.INCL, SCHEMASURROUND.XML, SCHEMA-COLLATEFILTER.XML, SOLRCONFIG-MASTER3.XML, HUNSPELL-TEST.DIC, SOLRCONFIG-XINCLUDE.XML, BAD-SCHEMA-CODEC-GLOBAL-VS-FT-MISMATCH.XML, SOLRCONFIG-SLAVE1.XML, SOLRCONFIG-DELPOLICY1.XML, SCHEMA-SIM.XML, SCHEMA-SNIPPET-FIELD.XML, SCHEMA-COLLATE.XML, STOP-SNOWBALL.TXT, BAD-SCHEMA-SIM-GLOBAL-VS-FT-MISMATCH.XML, PROTWORDS.TXT, SCHEMA-TRIE.XML, SOLRCONFIG_CODEC.XML, SCHEMA-SYNONYM-TOKENIZER.XML, BAD-SOLRCONFIG-INVALID-SCRIPTFILE.XML, JASUGGEST.TXT, SCHEMA-DOCVALUESFACETING.XML, SCHEMA-TFIDF.XML, SOLRCONFIG-SCRIPT-UPDATEPROCESSOR.XML, SCHEMA-LMJELINEKMERCER.XML, PHRASESUGGEST.TXT, BAD-SOLRCONFIG-MISSING-SCRIPTFILE.XML, SOLRCONFIG-BASIC-LUCENEVERSION31.XML, BAD-SCHEMA-UNIQUEKEY-USES-DEFAULT.XML, OLD_SYNONYMS.TXT, SOLRCONFIG-DELPOLICY2.XML, XSLT, SOLRCONFIG-NATIVELOCK.XML, BAD-SCHEMA-DUP-FIELD.XML, SOLRCONFIG-NOCACHE.XML, BAD-SCHEMA-SWEETSPOT-BOTH-TF.XML, SCHEMA-BM25.XML, ADDFIELDS.UPDATEPROCESSOR.JS, SOLRCONFIG-QUERYSENDER-NOQUERY.XML, SOLRCONFIG-ALTDIRECTORY.XML, COMPOUNDDICTIONARY.TXT, SOLRCONFIG_PERF.XML, SOLRCONFIG-INDEXCONFIG.XML, BAD-SCHEMA-CURRENCY-FT-BOGUS-DEFAULT-CODE.XML, BAD-CURRENCY.XML, BAD-SCHEMA-ANALYZER-CLASS-AND-NESTED.XML, SCHEMA-NOT-REQUIRED-UNIQUE-KEY.XML, KEEP-2.TXT, SCHEMA12.XML, BAD-SCHEMA-UNIQUEKEY-IS-COPYFIELD-DEST.XML, MAPPING-ISOLATIN1ACCENT.TXT, BAD_SOLRCONFIG.XML, BAD-SCHEMA-EXTERNAL-FILEFIELD.XML]
[junit4:junit4]   2> 4336 T17 oass.SolrIndexSearcher.<init> Opening Searcher@d9f88de main
[junit4:junit4]   2> 4339 T17 oasu.CommitTracker.<init> Hard AutoCommit: disabled
[junit4:junit4]   2> 4340 T17 oasu.CommitTracker.<init> Soft AutoCommit: disabled
[junit4:junit4]   2> 4343 T17 oashc.SpellCheckComponent.inform Initializing spell checkers
[junit4:junit4]   2> 4348 T17 oass.DirectSolrSpellChecker.init init: {name=direct,classname=DirectSolrSpellChecker,field=lowerfilt,minQueryLength=3}
[junit4:junit4]   2> 4386 T19 oasc.SolrCore.registerSearcher [collection1] Registered new searcher Searcher@d9f88de main{StandardDirectoryReader(segments_1:1)}
[junit4:junit4]   2> 4417 T17 oasu.DefaultSolrCoreState.newIndexWriter Creating new IndexWriter...
[junit4:junit4]   2> 4418 T17 oasu.DefaultSolrCoreState.newIndexWriter Waiting until IndexWriter is unused... core=collection1
[junit4:junit4]   2> 4423 T17 oasc.SolrDeletionPolicy.onInit SolrDeletionPolicy.onInit: commits:num=1
[junit4:junit4]   2> 		commit{dir=RateLimitedDirectoryWrapper(MockDirWrapper(NRTCachingDirectory(org.apache.lucene.store.RAMDirectory@697b0672 lockFactory=org.apache.lucene.store.NativeFSLockFactory@3e1917a2; maxCacheMB=0.7138671875 maxMergeSizeMB=0.984375))),segFN=segments_1,generation=1,filenames=[segments_1]
[junit4:junit4]   2> 4424 T17 oasc.SolrDeletionPolicy.updateCommits newest commit = 1[segments_1]
[junit4:junit4]   2> 4425 T17 oasu.DefaultSolrCoreState.newIndexWriter New IndexWriter is ready to be used.
[junit4:junit4]   2> 4426 T17 oass.SolrIndexSearcher.<init> Opening Searcher@526d542f main
[junit4:junit4]   2> 4430 T17 oasc.CoreContainer.registerCore replacing core: collection1
[junit4:junit4]   2> 4431 T17 oasc.SolrCore.close [collection1]  CLOSING SolrCore org.apache.solr.core.SolrCore@2af426a0
[junit4:junit4]   2> 4441 T19 oasc.SolrCore.registerSearcher [collection1] Registered new searcher Searcher@526d542f main{StandardDirectoryReader(segments_1:1:nrt)}
[junit4:junit4]   2> 4492 T17 oasu.DirectUpdateHandler2.close closing DirectUpdateHandler2{commits=0,autocommits=0,soft autocommits=0,optimizes=0,rollbacks=0,expungeDeletes=0,docsPending=0,adds=0,deletesById=0,deletesByQuery=0,errors=0,cumulative_adds=0,cumulative_deletesById=0,cumulative_deletesByQuery=0,cumulative_errors=0}
[junit4:junit4]   2> 4494 T17 oasc.SolrCore.closeSearcher [collection1] Closing main searcher on request.
[junit4:junit4]   2> ASYNC  NEW_CORE C0 name=collection1 org.apache.solr.core.SolrCore@18ecbef8
[junit4:junit4]   2> 5011 T17 C0 UPDATE [collection1] webapp=null path=null params={} {add=[5000]} 0 452
[junit4:junit4]   2> 5097 T17 C0 UPDATE [collection1] webapp=null path=null params={} {add=[5001]} 0 3
[junit4:junit4]   2> 5154 T17 C0 UPDATE [collection1] webapp=null path=null params={} {add=[5002]} 0 3
[junit4:junit4]   2> 5193 T17 C0 UPDATE [collection1] webapp=null path=null params={} {add=[5003]} 0 6
[junit4:junit4]   2> 5233 T17 C0 UPDATE [collection1] webapp=null path=null params={} {add=[5004]} 0 14
[junit4:junit4]   2> 5503 T21 oasu.DirectUpdateHandler2.commit start commit{,optimize=false,openSearcher=true,waitSearcher=true,expungeDeletes=false,softCommit=true,prepareCommit=false}
[junit4:junit4]   2> 5506 T17 oas.SolrTestCaseJ4.tearDown ###Ending testSoftAndHardCommitMaxTimeRapidAdds
[junit4:junit4]   2> NOTE: reproduce with: ant test  -Dtestcase=SoftAutoCommitTest -Dtests.method=testSoftAndHardCommitMaxTimeRapidAdds -Dtests.seed=960B46A0A430B5DD -Dtests.slow=true -Dtests.locale=sl -Dtests.timezone=Africa/Maseru -Dtests.file.encoding=UTF-8
[junit4:junit4] FAILURE 3.06s | SoftAutoCommitTest.testSoftAndHardCommitMaxTimeRapidAdds <<<
[junit4:junit4]    > Throwable #1: java.lang.AssertionError: 1: soft occured too fast: 1364096185912 + (500 * 1) !<= 1364096186380
[junit4:junit4]    > 	at __randomizedtesting.SeedInfo.seed([960B46A0A430B5DD:CA1EE8994FB2F4A5]:0)
[junit4:junit4]    > 	at org.junit.Assert.fail(Assert.java:93)
[junit4:junit4]    > 	at org.junit.Assert.assertTrue(Assert.java:43)
[junit4:junit4]    > 	at org.apache.solr.update.SoftAutoCommitTest.testSoftAndHardCommitMaxTimeRapidAdds(SoftAutoCommitTest.java:321)
[junit4:junit4]    > 	at sun.reflect.NativeMethodAccessorImpl.invoke0(Native Method)
[junit4:junit4]    > 	at sun.reflect.NativeMethodAccessorImpl.invoke(NativeMethodAccessorImpl.java:57)
[junit4:junit4]    > 	at sun.reflect.DelegatingMethodAccessorImpl.invoke(DelegatingMethodAccessorImpl.java:43)
[junit4:junit4]    > 	at java.lang.reflect.Method.invoke(Method.java:601)
[junit4:junit4]    > 	at com.carrotsearch.randomizedtesting.RandomizedRunner.invoke(RandomizedRunner.java:1559)
[junit4:junit4]    > 	at com.carrotsearch.randomizedtesting.RandomizedRunner.access$600(RandomizedRunner.java:79)
[junit4:junit4]    > 	at com.carrotsearch.randomizedtesting.RandomizedRunner$6.evaluate(RandomizedRunner.java:737)
[junit4:junit4]    > 	at com.carrotsearch.randomizedtesting.RandomizedRunner$7.evaluate(RandomizedRunner.java:773)
[junit4:junit4]    > 	at com.carrotsearch.randomizedtesting.RandomizedRunner$8.evaluate(RandomizedRunner.java:787)
[junit4:junit4]    > 	at com.carrotsearch.randomizedtesting.rules.SystemPropertiesRestoreRule$1.evaluate(SystemPropertiesRestoreRule.java:53)
[junit4:junit4]    > 	at org.apache.lucene.util.TestRuleSetupTeardownChained$1.evaluate(TestRuleSetupTeardownChained.java:50)
[junit4:junit4]    > 	at org.apache.lucene.util.TestRuleFieldCacheSanity$1.evaluate(TestRuleFieldCacheSanity.java:51)
[junit4:junit4]    > 	at org.apache.lucene.util.AbstractBeforeAfterRule$1.evaluate(AbstractBeforeAfterRule.java:46)
[junit4:junit4]    > 	at com.carrotsearch.randomizedtesting.rules.SystemPropertiesInvariantRule$1.evaluate(SystemPropertiesInvariantRule.java:55)
[junit4:junit4]    > 	at org.apache.lucene.util.TestRuleThreadAndTestName$1.evaluate(TestRuleThreadAndTestName.java:49)
[junit4:junit4]    > 	at org.apache.lucene.util.TestRuleIgnoreAfterMaxFailures$1.evaluate(TestRuleIgnoreAfterMaxFailures.java:70)
[junit4:junit4]    > 	at org.apache.lucene.util.TestRuleMarkFailure$1.evaluate(TestRuleMarkFailure.java:48)
[junit4:junit4]    > 	at com.carrotsearch.randomizedtesting.rules.StatementAdapter.evaluate(StatementAdapter.java:36)
[junit4:junit4]    > 	at com.carrotsearch.randomizedtesting.ThreadLeakControl$StatementRunner.run(ThreadLeakControl.java:358)
[junit4:junit4]    > 	at com.carrotsearch.randomizedtesting.ThreadLeakControl.forkTimeoutingTask(ThreadLeakControl.java:782)
[junit4:junit4]    > 	at com.carrotsearch.randomizedtesting.ThreadLeakControl$3.evaluate(ThreadLeakControl.java:442)
[junit4:junit4]    > 	at com.carrotsearch.randomizedtesting.RandomizedRunner.runSingleTest(RandomizedRunner.java:746)
[junit4:junit4]    > 	at com.carrotsearch.randomizedtesting.RandomizedRunner$3.evaluate(RandomizedRunner.java:648)
[junit4:junit4]    > 	at com.carrotsearch.randomizedtesting.RandomizedRunner$4.evaluate(RandomizedRunner.java:682)
[junit4:junit4]    > 	at com.carrotsearch.randomizedtesting.RandomizedRunner$5.evaluate(RandomizedRunner.java:693)
[junit4:junit4]    > 	at com.carrotsearch.randomizedtesting.rules.StatementAdapter.evaluate(StatementAdapter.java:36)
[junit4:junit4]    > 	at com.carrotsearch.randomizedtesting.rules.SystemPropertiesRestoreRule$1.evaluate(SystemPropertiesRestoreRule.java:53)
[junit4:junit4]    > 	at org.apache.lucene.util.AbstractBeforeAfterRule$1.evaluate(AbstractBeforeAfterRule.java:46)
[junit4:junit4]    > 	at org.apache.lucene.util.TestRuleStoreClassName$1.evaluate(TestRuleStoreClassName.java:42)
[junit4:junit4]    > 	at com.carrotsearch.randomizedtesting.rules.SystemPropertiesInvariantRule$1.evaluate(SystemPropertiesInvariantRule.java:55)
[junit4:junit4]    > 	at com.carrotsearch.randomizedtesting.rules.NoShadowingOrOverridesOnMethodsRule$1.evaluate(NoShadowingOrOverridesOnMethodsRule.java:39)
[junit4:junit4]    > 	at com.carrotsearch.randomizedtesting.rules.NoShadowingOrOverridesOnMethodsRule$1.evaluate(NoShadowingOrOverridesOnMethodsRule.java:39)
[junit4:junit4]    > 	at com.carrotsearch.randomizedtesting.rules.StatementAdapter.evaluate(StatementAdapter.java:36)
[junit4:junit4]    > 	at org.apache.lucene.util.TestRuleAssertionsRequired$1.evaluate(TestRuleAssertionsRequired.java:43)
[junit4:junit4]    > 	at org.apache.lucene.util.TestRuleMarkFailure$1.evaluate(TestRuleMarkFailure.java:48)
[junit4:junit4]    > 	at org.apache.lucene.util.TestRuleIgnoreAfterMaxFailures$1.evaluate(TestRuleIgnoreAfterMaxFailures.java:70)
[junit4:junit4]    > 	at org.apache.lucene.util.TestRuleIgnoreTestSuites$1.evaluate(TestRuleIgnoreTestSuites.java:55)
[junit4:junit4]    > 	at com.carrotsearch.randomizedtesting.rules.StatementAdapter.evaluate(StatementAdapter.java:36)
[junit4:junit4]    > 	at com.carrotsearch.randomizedtesting.ThreadLeakControl$StatementRunner.run(ThreadLeakControl.java:358)
[junit4:junit4]    > 	at java.lang.Thread.run(Thread.java:722)
[junit4:junit4]   2> 5636 T17 oas.SolrTestCaseJ4.setUp ###Starting testSoftAndHardCommitMaxTimeDelete
[junit4:junit4]   2> 5638 T17 oasc.CoreContainer.reload Reloading SolrCore 'collection1' using instanceDir: /Users/jenkins/jenkins-slave/workspace/Lucene-Solr-4.x-MacOSX/solr/build/solr-core/test-files/solr/collection1
[junit4:junit4]   2> 5640 T17 oasc.SolrResourceLoader.<init> new SolrResourceLoader for directory: '/Users/jenkins/jenkins-slave/workspace/Lucene-Solr-4.x-MacOSX/solr/build/solr-core/test-files/solr/collection1/'
[junit4:junit4]   2> 5642 T17 oasc.SolrResourceLoader.replaceClassLoader Adding 'file:/Users/jenkins/jenkins-slave/workspace/Lucene-Solr-4.x-MacOSX/solr/build/solr-core/test-files/solr/collection1/lib/classes/' to classloader
[junit4:junit4]   2> 5644 T17 oasc.SolrResourceLoader.replaceClassLoader Adding 'file:/Users/jenkins/jenkins-slave/workspace/Lucene-Solr-4.x-MacOSX/solr/build/solr-core/test-files/solr/collection1/lib/README' to classloader
[junit4:junit4]   2> 5804 T17 oasc.SolrConfig.<init> Using Lucene MatchVersion: LUCENE_43
[junit4:junit4]   2> 5880 T21 oass.SolrIndexSearcher.<init> Opening Searcher@7121aee0 main
[junit4:junit4]   2> 5891 T19 oasc.SolrCore.registerSearcher [collection1] Registered new searcher Searcher@7121aee0 main{StandardDirectoryReader(segments_1:3:nrt _0(4.3):C5)}
[junit4:junit4]   2> 5893 T21 oasu.DirectUpdateHandler2.commit end_commit_flush
[junit4:junit4]   2> 5952 T17 oasc.SolrConfig.<init> Loaded SolrConfig: solrconfig.xml
[junit4:junit4]   2> 5953 T17 oass.IndexSchema.readSchema Reading Solr Schema
[junit4:junit4]   2> 6017 T17 oass.IndexSchema.readSchema Schema name=test
[junit4:junit4]   2> 6203 T20 oasu.DirectUpdateHandler2.commit start commit{,optimize=false,openSearcher=true,waitSearcher=true,expungeDeletes=false,softCommit=false,prepareCommit=false}
[junit4:junit4]   2> 6214 T20 oasc.SolrDeletionPolicy.onCommit SolrDeletionPolicy.onCommit: commits:num=2
[junit4:junit4]   2> 		commit{dir=RateLimitedDirectoryWrapper(MockDirWrapper(NRTCachingDirectory(org.apache.lucene.store.RAMDirectory@697b0672 lockFactory=org.apache.lucene.store.NativeFSLockFactory@3e1917a2; maxCacheMB=0.7138671875 maxMergeSizeMB=0.984375))),segFN=segments_1,generation=1,filenames=[segments_1]
[junit4:junit4]   2> 		commit{dir=RateLimitedDirectoryWrapper(MockDirWrapper(NRTCachingDirectory(org.apache.lucene.store.RAMDirectory@697b0672 lockFactory=org.apache.lucene.store.NativeFSLockFactory@3e1917a2; maxCacheMB=0.7138671875 maxMergeSizeMB=0.984375))),segFN=segments_2,generation=2,filenames=[_0_Lucene40_0.tim, _0.fnm, _0_Lucene40_0.frq, _0_nrm.cfe, segments_2, _0.fdx, _0_nrm.cfs, _0.si, _0_Lucene40_0.prx, _0.fdt, _0_Lucene40_0.tip]
[junit4:junit4]   2> 6216 T20 oasc.SolrDeletionPolicy.updateCommits newest commit = 2[_0_Lucene40_0.tim, _0.fnm, _0_Lucene40_0.frq, _0_nrm.cfe, segments_2, _0.fdx, _0_nrm.cfs, _0.si, _0_Lucene40_0.prx, _0.fdt, _0_Lucene40_0.tip]
[junit4:junit4]   2> 6218 T20 oass.SolrIndexSearcher.<init> Opening Searcher@437f0103 main
[junit4:junit4]   2> 6219 T20 oasu.DirectUpdateHandler2.commit end_commit_flush
[junit4:junit4]   2> 6235 T19 oasc.SolrCore.registerSearcher [collection1] Registered new searcher Searcher@437f0103 main{StandardDirectoryReader(segments_1:3:nrt _0(4.3):C5)}
[junit4:junit4]   2> 6850 T17 oass.OpenExchangeRatesOrgProvider.init Initialized with rates=open-exchange-rates.json, refreshInterval=1440.
[junit4:junit4]   2> 6865 T17 oass.IndexSchema.readSchema default search field in schema is text
[junit4:junit4]   2> 6869 T17 oass.IndexSchema.readSchema unique key field: id
[junit4:junit4]   2> 6894 T17 oass.FileExchangeRateProvider.reload Reloading exchange rates from file currency.xml
[junit4:junit4]   2> 6901 T17 oass.FileExchangeRateProvider.reload Reloading exchange rates from file currency.xml
[junit4:junit4]   2> 6908 T17 oass.OpenExchangeRatesOrgProvider.reload Reloading exchange rates from open-exchange-rates.json
[junit4:junit4]   2> 6912 T17 oass.OpenExchangeRatesOrgProvider$OpenExchangeRates.<init> WARNING Unknown key IMPORTANT NOTE
[junit4:junit4]   2> 6913 T17 oass.OpenExchangeRatesOrgProvider$OpenExchangeRates.<init> WARNING Expected key, got STRING
[junit4:junit4]   2> 6914 T17 oass.OpenExchangeRatesOrgProvider.reload Reloading exchange rates from open-exchange-rates.json
[junit4:junit4]   2> 6924 T17 oass.OpenExchangeRatesOrgProvider$OpenExchangeRates.<init> WARNING Unknown key IMPORTANT NOTE
[junit4:junit4]   2> 6926 T17 oass.OpenExchangeRatesOrgProvider$OpenExchangeRates.<init> WARNING Expected key, got STRING
[junit4:junit4]   2> 6927 T17 oasc.SolrCore.<init> [collection1] Opening new SolrCore at /Users/jenkins/jenkins-slave/workspace/Lucene-Solr-4.x-MacOSX/solr/build/solr-core/test-files/solr/collection1/, dataDir=/Users/jenkins/jenkins-slave/workspace/Lucene-Solr-4.x-MacOSX/solr/build/solr-core/test/J0/./solrtest-SoftAutoCommitTest-1364096180878/
[junit4:junit4]   2> 6928 T17 oasc.JmxMonitoredMap.<init> JMX monitoring is enabled. Adding Solr mbeans to JMX Server: com.sun.jmx.mbeanserver.JmxMBeanServer@55c1c532
[junit4:junit4]   2> 6930 T17 oasc.SolrCore.getNewIndexDir New index directory detected: old=null new=/Users/jenkins/jenkins-slave/workspace/Lucene-Solr-4.x-MacOSX/solr/build/solr-core/test/J0/./solrtest-SoftAutoCommitTest-1364096180878/index/
[junit4:junit4]   2> 6931 T17 oasc.SolrCore.initWriters created xml: solr.XMLResponseWriter
[junit4:junit4]   2> 6936 T17 oasup.UpdateRequestProcessorChain.init inserting DistributedUpdateProcessorFactory into updateRequestProcessorChain "dedupe"
[junit4:junit4]   2> 6938 T17 oasup.UpdateRequestProcessorChain.init inserting DistributedUpdateProcessorFactory into updateRequestProcessorChain "dedupe-allfields"
[junit4:junit4]   2> 6940 T17 oasup.UpdateRequestProcessorChain.init inserting DistributedUpdateProcessorFactory into updateRequestProcessorChain "stored_sig"
[junit4:junit4]   2> 6942 T17 oasup.UpdateRequestProcessorChain.init inserting DistributedUpdateProcessorFactory into updateRequestProcessorChain "uniq-fields"
[junit4:junit4]   2> 6944 T17 oasup.UpdateRequestProcessorChain.init inserting DistributedUpdateProcessorFactory into updateRequestProcessorChain "distrib-dup-test-chain-implicit"
[junit4:junit4]   2> 6950 T17 oasc.RequestHandlers.initHandlersFromConfig adding lazy requestHandler: solr.ReplicationHandler
[junit4:junit4]   2> 6952 T17 oasc.RequestHandlers.initHandlersFromConfig created /replication: solr.ReplicationHandler
[junit4:junit4]   2> 6954 T17 oasc.RequestHandlers.initHandlersFromConfig created standard: solr.StandardRequestHandler
[junit4:junit4]   2> 6956 T17 oasc.RequestHandlers.initHandlersFromConfig created /get: solr.RealTimeGetHandler
[junit4:junit4]   2> 6958 T17 oasc.RequestHandlers.initHandlersFromConfig created dismax: solr.SearchHandler
[junit4:junit4]   2> 6961 T17 oasc.RequestHandlers.initHandlersFromConfig created mock: org.apache.solr.core.MockQuerySenderListenerReqHandler
[junit4:junit4]   2> 6963 T17 oasc.RequestHandlers.initHandlersFromConfig created /admin/: org.apache.solr.handler.admin.AdminHandlers
[junit4:junit4]   2> 6965 T17 oasc.RequestHandlers.initHandlersFromConfig created defaults: solr.StandardRequestHandler
[junit4:junit4]   2> 6966 T17 oasc.RequestHandlers.initHandlersFromConfig adding lazy requestHandler: solr.StandardRequestHandler
[junit4:junit4]   2> 6967 T17 oasc.RequestHandlers.initHandlersFromConfig created lazy: solr.StandardRequestHandler
[junit4:junit4]   2> 6969 T17 oasc.RequestHandlers.initHandlersFromConfig created /update: solr.UpdateRequestHandler
[junit4:junit4]   2> 6972 T17 oasc.RequestHandlers.initHandlersFromConfig created /terms: org.apache.solr.handler.component.SearchHandler
[junit4:junit4]   2> 6974 T17 oasc.RequestHandlers.initHandlersFromConfig created spellCheckCompRH: org.apache.solr.handler.component.SearchHandler
[junit4:junit4]   2> 6976 T17 oasc.RequestHandlers.initHandlersFromConfig created spellCheckCompRH_Direct: org.apache.solr.handler.component.SearchHandler
[junit4:junit4]   2> 6978 T17 oasc.RequestHandlers.initHandlersFromConfig created spellCheckWithWordbreak: org.apache.solr.handler.component.SearchHandler
[junit4:junit4]   2> 6980 T17 oasc.RequestHandlers.initHandlersFromConfig created spellCheckWithWordbreak_Direct: org.apache.solr.handler.component.SearchHandler
[junit4:junit4]   2> 6982 T17 oasc.RequestHandlers.initHandlersFromConfig created spellCheckCompRH1: org.apache.solr.handler.component.SearchHandler
[junit4:junit4]   2> 6984 T17 oasc.RequestHandlers.initHandlersFromConfig created mltrh: org.apache.solr.handler.component.SearchHandler
[junit4:junit4]   2> 6986 T17 oasc.RequestHandlers.initHandlersFromConfig created tvrh: org.apache.solr.handler.component.SearchHandler
[junit4:junit4]   2> 6989 T17 oasc.RequestHandlers.initHandlersFromConfig created /mlt: solr.MoreLikeThisHandler
[junit4:junit4]   2> 6991 T17 oasc.RequestHandlers.initHandlersFromConfig created /debug/dump: solr.DumpRequestHandler
[junit4:junit4]   2> 7001 T17 oashl.XMLLoader.init xsltCacheLifetimeSeconds=60
[junit4:junit4]   2> 7004 T17 oasc.SolrCore.initDeprecatedSupport WARNING solrconfig.xml uses deprecated <admin/gettableFiles>, Please update your config to use the ShowFileRequestHandler.
[junit4:junit4]   2> 7008 T17 oasc.SolrCore.initDeprecatedSupport WARNING adding ShowFileRequestHandler with hidden files: [THROW.ERROR.ON.ADD.UPDATEPROCESSOR.JS, SOLRCONFIG-HIGHLIGHT.XML, SCHEMA-REQUIRED-FIELDS.XML, TRIVIAL.UPDATEPROCESSOR1.JS, BAD-SCHEMA-DOCVALUES-NOT-REQUIRED-NO-DEFAULT.XML, BAD-SCHEMA-DUP-DYNAMICFIELD.XML, SCHEMA-MINIMAL.XML, SCHEMA-REPLICATION2.XML, SOLRCONFIG-CACHING.XML, SCHEMA-POSTINGSHIGHLIGHT.XML, SOLRCONFIG-REPEATER.XML, REGEX-BOOST-PROCESSOR-TEST.TXT, SOLRCONFIG-MERGEPOLICY.XML, CURRENCY.XML, BAD-SCHEMA-CURRENCY-FT-BOGUS-CODE-IN-XML.XML, BAD-SCHEMA-NONTEXT-ANALYZER.XML, SOLRCONFIG-TLOG.XML, SOLRCONFIG-MASTER.XML, SOLRCONFIG-COMPONENTS-NAME.XML, BAD-SCHEMA-UNIQUEKEY-MULTIVALUED.XML, SCHEMA11.XML, SOLRCONFIG-BASIC.XML, DA_COMPOUNDDICTIONARY.TXT, MISSLEADING.EXTENSION.UPDATEPROCESSOR.JS.TXT, SCHEMA-COPYFIELD-TEST.XML, SOLRCONFIG-SLAVE.XML, SOLRCONFIG-PROPINJECT-INDEXDEFAULT.XML, ELEVATE.XML, TRIVIAL.UPDATEPROCESSOR0.JS, SCHEMA-SWEETSPOT.XML, BAD-SOLRCONFIG-BOGUS-SCRIPTENGINE-NAME.XML, SCHEMA-CHARFILTERS.XML, SCHEMA-IB.XML, SOLRCONFIG-QUERYSENDER.XML, SOLRCONFIG-SNIPPET-PROCESSOR.XML, DA_UTF8.XML, SCHEMA-REPLICATION1.XML, CONDITIONAL.UPDATEPROCESSOR.JS, SCHEMA-TINY.XML, MISSING.FUNCTIONS.UPDATEPROCESSOR.JS, SOLRCONFIG-ENABLEPLUGIN.XML, HYPHENATION.DTD, STEMDICT.TXT, SCHEMA-PHRASESUGGEST.XML, HUNSPELL-TEST.AFF, BAD-SCHEMA-CURRENCY-FT-OER-NORATES.XML, SCHEMA-SNIPPET-TYPE.XML, STOPTYPES-1.TXT, STOPWORDSWRONGENCODING.TXT, SCHEMA-NUMERIC.XML, SOLRCONFIG-TRANSFORMERS.XML, SOLRCONFIG-PROPINJECT.XML, BAD-SCHEMA-NOT-INDEXED-BUT-TF.XML, SOLRCONFIG-SIMPLELOCK.XML, SCHEMA-DOCVALUES.XML, WDFTYPES.TXT, STOPTYPES-2.TXT, SCHEMA-REVERSED.XML, BAD-SCHEMA-CURRENCY-FT-MULTIVALUED.XML, SOLRCONFIG-SPELLCHECKCOMPONENT.XML, SOLRCONFIG-PHRASESUGGEST.XML, BAD-SCHEMA-CURRENCY-MULTIVALUED.XML, SCHEMA-DFR.XML, BAD-SCHEMA-NOT-INDEXED-BUT-POS.XML, KEEP-1.TXT, OPEN-EXCHANGE-RATES.JSON, SCHEMA-SPATIAL.XML, STOPWITHBOM.TXT, SOLRCONFIG-SPELLCHECKER.XML, SOLRCONFIG-POSTINGSHIGHLIGHT.XML, SCHEMA-BINARYFIELD.XML, SOLRCONFIG-UPDATE-PROCESSOR-CHAINS.XML, BAD-SCHEMA-OMIT-TF-BUT-NOT-POS.XML, BAD-SCHEMA-DUP-FIELDTYPE.XML, SCHEMA-XINCLUDE.XML, SOLRCONFIG-MASTER1.XML, SCHEMA-BEHAVIOR.XML, SYNONYMS.TXT, SOLRCONFIG-MINIMAL.XML, SCHEMA-DOCVALUESMULTI.XML, BAD-SCHEMA-UNSUPPORTED-DOCVALUES.XML, BAD-SCHEMA-CURRENCY-DYNAMIC-MULTIVALUED.XML, SCHEMA_CODEC.XML, BAD-SCHEMA-SWEETSPOT-PARTIAL-HYPERBOLIC.XML, SOLRCONFIG-SOLR-749.XML, SOLRCONFIG-MASTER1-KEEPONEBACKUP.XML, SCHEMA-EFF.XML, STOP-2.TXT, SOLRCONFIG-FUNCTIONQUERY.XML, SOLRCONFIG-TERMINDEX.XML, SCHEMA-LMDIRICHLET.XML, SOLRCONFIG-ELEVATE.XML, BAD-SCHEMA-SWEETSPOT-PARTIAL-NORMS.XML, BAD-SCHEMA-SWEETSPOT-PARTIAL-BASELINE.XML, STOPWORDS.TXT, SCHEMA-FOLDING.XML, SCHEMA-STOP-KEEP.XML, FUZZYSUGGEST.TXT, BAD-SCHEMA-NOT-INDEXED-BUT-NORMS.XML, SCHEMA-REST.XML, SOLRCONFIG-SOLCOREPROPERTIES.XML, STOP-1.TXT, SOLRCONFIG-MASTER2.XML, SCHEMA-SPELLCHECKER.XML, SOLRCONFIG-RESPONSE-LOG-COMPONENT.XML, SOLRCONFIG-LAZYWRITER.XML, SCHEMA-LUCENEMATCHVERSION.XML, FRENCHARTICLES.TXT, BAD-MP-SOLRCONFIG.XML, SCHEMA15.XML, SOLRCONFIG-REQHANDLER.INCL, SCHEMASURROUND.XML, SCHEMA-COLLATEFILTER.XML, SOLRCONFIG-MASTER3.XML, HUNSPELL-TEST.DIC, SOLRCONFIG-XINCLUDE.XML, BAD-SCHEMA-CODEC-GLOBAL-VS-FT-MISMATCH.XML, SOLRCONFIG-SLAVE1.XML, SOLRCONFIG-DELPOLICY1.XML, SCHEMA-SIM.XML, SCHEMA-SNIPPET-FIELD.XML, SCHEMA-COLLATE.XML, STOP-SNOWBALL.TXT, BAD-SCHEMA-SIM-GLOBAL-VS-FT-MISMATCH.XML, PROTWORDS.TXT, SCHEMA-TRIE.XML, SOLRCONFIG_CODEC.XML, SCHEMA-SYNONYM-TOKENIZER.XML, BAD-SOLRCONFIG-INVALID-SCRIPTFILE.XML, JASUGGEST.TXT, SCHEMA-DOCVALUESFACETING.XML, SCHEMA-TFIDF.XML, SOLRCONFIG-SCRIPT-UPDATEPROCESSOR.XML, SCHEMA-LMJELINEKMERCER.XML, PHRASESUGGEST.TXT, BAD-SOLRCONFIG-MISSING-SCRIPTFILE.XML, SOLRCONFIG-BASIC-LUCENEVERSION31.XML, BAD-SCHEMA-UNIQUEKEY-USES-DEFAULT.XML, OLD_SYNONYMS.TXT, SOLRCONFIG-DELPOLICY2.XML, XSLT, SOLRCONFIG-NATIVELOCK.XML, BAD-SCHEMA-DUP-FIELD.XML, SOLRCONFIG-NOCACHE.XML, BAD-SCHEMA-SWEETSPOT-BOTH-TF.XML, SCHEMA-BM25.XML, ADDFIELDS.UPDATEPROCESSOR.JS, SOLRCONFIG-QUERYSENDER-NOQUERY.XML, SOLRCONFIG-ALTDIRECTORY.XML, COMPOUNDDICTIONARY.TXT, SOLRCONFIG_PERF.XML, SOLRCONFIG-INDEXCONFIG.XML, BAD-SCHEMA-CURRENCY-FT-BOGUS-DEFAULT-CODE.XML, BAD-CURRENCY.XML, BAD-SCHEMA-ANALYZER-CLASS-AND-NESTED.XML, SCHEMA-NOT-REQUIRED-UNIQUE-KEY.XML, KEEP-2.TXT, SCHEMA12.XML, BAD-SCHEMA-UNIQUEKEY-IS-COPYFIELD-DEST.XML, MAPPING-ISOLATIN1ACCENT.TXT, BAD_SOLRCONFIG.XML, BAD-SCHEMA-EXTERNAL-FILEFIELD.XML]
[junit4:junit4]   2> 7016 T17 oass.SolrIndexSearcher.<init> Opening Searcher@77fdbc1e main
[junit4:junit4]   2> 7017 T17 oasu.CommitTracker.<init> Hard AutoCommit: disabled
[junit4:junit4]   2> 7017 T17 oasu.CommitTracker.<init> Soft AutoCommit: disabled
[junit4:junit4]   2> 7019 T17 oashc.SpellCheckComponent.inform Initializing spell checkers
[junit4:junit4]   2> 7022 T17 oass.DirectSolrSpellChecker.init init: {name=direct,classname=DirectSolrSpellChecker,field=lowerfilt,minQueryLength=3}
[junit4:junit4]   2> 7047 T22 oasc.SolrCore.registerSearcher [collection1] Registered new searcher Searcher@77fdbc1e main{StandardDirectoryReader(segments_2:3:nrt _0(4.3):C5)}
[junit4:junit4]   2> 7079 T17 oasu.DefaultSolrCoreState.newIndexWriter Creating new IndexWriter...
[junit4:junit4]   2> 7080 T17 oasu.DefaultSolrCoreState.newIndexWriter Waiting until IndexWriter is unused... core=collection1
[junit4:junit4]   2> 7081 T17 oasu.DefaultSolrCoreState.newIndexWriter Closing old IndexWriter... core=collection1
[junit4:junit4]   2> 7089 T17 oasc.SolrDeletionPolicy.onInit SolrDeletionPolicy.onInit: commits:num=1
[junit4:junit4]   2> 		commit{dir=RateLimitedDirectoryWrapper(MockDirWrapper(NRTCachingDirectory(org.apache.lucene.store.RAMDirectory@697b0672 lockFactory=org.apache.lucene.store.NativeFSLockFactory@3e1917a2; maxCacheMB=0.7138671875 maxMergeSizeMB=0.984375))),segFN=segments_2,generation=2,filenames=[_0_Lucene40_0.tim, _0.fnm, _0_Lucene40_0.frq, _0_nrm.cfe, segments_2, _0.fdx, _0_nrm.cfs, _0_Lucene40_0.prx, _0.si, _0.fdt, _0_Lucene40_0.tip]
[junit4:junit4]   2> 7089 T17 oasc.SolrDeletionPolicy.updateCommits newest commit = 2[_0_Lucene40_0.tim, _0.fnm, _0_Lucene40_0.frq, _0_nrm.cfe, segments_2, _0.fdx, _0_nrm.cfs, _0_Lucene40_0.prx, _0.si, _0.fdt, _0_Lucene40_0.tip]
[junit4:junit4]   2> 7090 T17 oasu.DefaultSolrCoreState.newIndexWriter New IndexWriter is ready to be used.
[junit4:junit4]   2> 7097 T17 oass.SolrIndexSearcher.<init> Opening Searcher@558964ad main
[junit4:junit4]   2> 7099 T17 oasc.CoreContainer.registerCore replacing core: collection1
[junit4:junit4]   2> 7100 T17 oasc.SolrCore.close [collection1]  CLOSING SolrCore org.apache.solr.core.SolrCore@18ecbef8
[junit4:junit4]   2> 7103 T22 oasc.SolrCore.registerSearcher [collection1] Registered new searcher Searcher@558964ad main{StandardDirectoryReader(segments_2:3:nrt _0(4.3):C5)}
[junit4:junit4]   2> 7127 T17 oasu.DirectUpdateHandler2.close closing DirectUpdateHandler2{commits=2,autocommit maxTime=1200ms,autocommits=1,soft autocommit maxTime=500ms,soft autocommits=1,optimizes=0,rollbacks=0,expungeDeletes=0,docsPending=0,adds=0,deletesById=0,deletesByQuery=0,errors=0,cumulative_adds=5,cumulative_deletesById=0,cumulative_deletesByQuery=0,cumulative_errors=0}
[junit4:junit4]   2> 7129 T17 oasc.SolrCore.closeSearcher [collection1] Closing main searcher on request.
[junit4:junit4]   2> ASYNC  NEW_CORE C1 name=collection1 org.apache.solr.core.SolrCore@12b16656
[junit4:junit4]   2> 7155 T17 C1 UPDATE [collection1] webapp=null path=null params={} {add=[529]} 0 12
[junit4:junit4]   2> 7171 T17 C1 oasu.DirectUpdateHandler2.commit start commit{,optimize=false,openSearcher=true,waitSearcher=true,expungeDeletes=false,softCommit=false,prepareCommit=false}
[junit4:junit4]   2> 7224 T17 C1 oasc.SolrDeletionPolicy.onCommit SolrDeletionPolicy.onCommit: commits:num=2
[junit4:junit4]   2> 		commit{dir=RateLimitedDirectoryWrapper(MockDirWrapper(NRTCachingDirectory(org.apache.lucene.store.RAMDirectory@697b0672 lockFactory=org.apache.lucene.store.NativeFSLockFactory@3e1917a2; maxCacheMB=0.7138671875 maxMergeSizeMB=0.984375))),segFN=segments_2,generation=2,filenames=[_0_Lucene40_0.tim, _0.fnm, _0_Lucene40_0.frq, _0_nrm.cfe, segments_2, _0.fdx, _0_nrm.cfs, _0_Lucene40_0.prx, _0.si, _0.fdt, _0_Lucene40_0.tip]
[junit4:junit4]   2> 		commit{dir=RateLimitedDirectoryWrapper(MockDirWrapper(NRTCachingDirectory(org.apache.lucene.store.RAMDirectory@697b0672 lockFactory=org.apache.lucene.store.NativeFSLockFactory@3e1917a2; maxCacheMB=0.7138671875 maxMergeSizeMB=0.984375))),segFN=segments_3,generation=3,filenames=[_1_Lucene40_0.tim, _1_nrm.cfs, _0_Lucene40_0.tim, _0.fnm, _1_Lucene40_0.frq, _0_nrm.cfs, _0_Lucene40_0.prx, _1.fnm, _1_Lucene40_0.prx, _1_Lucene40_0.tip, _1_nrm.cfe, _0_Lucene40_0.tip, _1.fdx, _0_Lucene40_0.frq, _1.fdt, _1.si, _0_nrm.cfe, _0.fdx, _0.si, segments_3, _0.fdt]
[junit4:junit4]   2> 7227 T17 C1 oasc.SolrDeletionPolicy.updateCommits newest commit = 3[_1_Lucene40_0.tim, _1_nrm.cfs, _0_Lucene40_0.tim, _0.fnm, _1_Lucene40_0.frq, _0_nrm.cfs, _0_Lucene40_0.prx, _1.fnm, _1_Lucene40_0.prx, _1_Lucene40_0.tip, _1_nrm.cfe, _0_Lucene40_0.tip, _1.fdx, _0_Lucene40_0.frq, _1.fdt, _1.si, _0_nrm.cfe, _0.fdx, _0.si, segments_3, _0.fdt]
[junit4:junit4]   2> 7234 T17 C1 oass.SolrIndexSearcher.<init> Opening Searcher@3361477a main
[junit4:junit4]   2> 7236 T17 C1 oasu.DirectUpdateHandler2.commit end_commit_flush
[junit4:junit4]   2> 7242 T22 oasc.SolrCore.registerSearcher [collection1] Registered new searcher Searcher@3361477a main{StandardDirectoryReader(segments_3:5:nrt _0(4.3):C5 _1(4.3):C1)}
[junit4:junit4]   2> 7245 T17 C1 UPDATE [collection1] webapp=null path=null params={} {commit=} 0 74
[junit4:junit4]   2> 7259 T17 C1 UPDATE [collection1] webapp=null path=null params={} {delete=[529]} 0 1
[junit4:junit4]   2> 7760 T24 oasu.DirectUpdateHandler2.commit start commit{,optimize=false,openSearcher=true,waitSearcher=true,expungeDeletes=false,softCommit=true,prepareCommit=false}
[junit4:junit4]   2> 7776 T24 oass.SolrIndexSearcher.<init> Opening Searcher@386bc2d0 main
[junit4:junit4]   2> 7778 T24 oasu.DirectUpdateHandler2.commit end_commit_flush
[junit4:junit4]   2> 7781 T22 oasc.SolrCore.registerSearcher [collection1] Registered new searcher Searcher@386bc2d0 main{StandardDirectoryReader(segments_3:7:nrt _0(4.3):C5)}
[junit4:junit4]   2> 7788 T17 C1 UPDATE [collection1] webapp=null path=null params={} {add=[550]} 0 2
[junit4:junit4]   2> 8292 T24 oasu.DirectUpdateHandler2.commit start commit{,optimize=false,openSearcher=true,waitSearcher=true,expungeDeletes=false,softCommit=true,prepareCommit=false}
[junit4:junit4]   2> 8300 T24 oass.SolrIndexSearcher.<init> Opening Searcher@60a6f10f main
[junit4:junit4]   2> 8301 T24 oasu.DirectUpdateHandler2.commit end_commit_flush
[junit4:junit4]   2> 8305 T22 oasc.SolrCore.registerSearcher [collection1] Registered new searcher Searcher@60a6f10f main{StandardDirectoryReader(segments_3:9:nrt _0(4.3):C5 _2(4.3):C1)}
[junit4:junit4]   2> 8460 T23 oasu.DirectUpdateHandler2.commit start commit{,optimize=false,openSearcher=true,waitSearcher=true,expungeDeletes=false,softCommit=false,prepareCommit=false}
[junit4:junit4]   2> 8467 T23 oasc.SolrDeletionPolicy.onCommit SolrDeletionPolicy.onCommit: commits:num=2
[junit4:junit4]   2> 		commit{dir=RateLimitedDirectoryWrapper(MockDirWrapper(NRTCachingDirectory(org.apache.lucene.store.RAMDirectory@697b0672 lockFactory=org.apache.lucene.store.NativeFSLockFactory@3e1917a2; maxCacheMB=0.7138671875 maxMergeSizeMB=0.984375))),segFN=segments_3,generation=3,filenames=[_1_Lucene40_0.tim, _1_nrm.cfs, _0_Lucene40_0.tim, _0.fnm, _1_Lucene40_0.frq, _0_nrm.cfs, _0_Lucene40_0.prx, _1.fnm, _1_Lucene40_0.prx, _1_Lucene40_0.tip, _1_nrm.cfe, _0_Lucene40_0.tip, _1.fdx, _0_Lucene40_0.frq, _1.fdt, _1.si, _0_nrm.cfe, _0.fdx, _0.si, segments_3, _0.fdt]
[junit4:junit4]   2> 		commit{dir=RateLimitedDirectoryWrapper(MockDirWrapper(NRTCachingDirectory(org.apache.lucene.store.RAMDirectory@697b0672 lockFactory=org.apache.lucene.store.NativeFSLockFactory@3e1917a2; maxCacheMB=0.7138671875 maxMergeSizeMB=0.984375))),segFN=segments_4,generation=4,filenames=[_2.si, _0_Lucene40_0.tim, _0.fnm, _2.fdt, _0_nrm.cfs, _0_Lucene40_0.prx, _2.fdx, _2.fnm, _0_Lucene40_0.tip, _2_Lucene40_0.tip, _2_nrm.cfe, _0_Lucene40_0.frq, _2_Lucene40_0.frq, _2_Lucene40_0.prx, _0_nrm.cfe, _0.fdx, _2_Lucene40_0.tim, _2_nrm.cfs, _0.si, _0.fdt, segments_4]
[junit4:junit4]   2> 8468 T23 oasc.SolrDeletionPolicy.updateCommits newest commit = 4[_2.si, _0_Lucene40_0.tim, _0.fnm, _2.fdt, _0_nrm.cfs, _0_Lucene40_0.prx, _2.fdx, _2.fnm, _0_Lucene40_0.tip, _2_Lucene40_0.tip, _2_nrm.cfe, _0_Lucene40_0.frq, _2_Lucene40_0.frq, _2_Lucene40_0.prx, _0_nrm.cfe, _0.fdx, _2_Lucene40_0.tim, _2_nrm.cfs, _0.si, _0.fdt, segments_4]
[junit4:junit4]   2> 8470 T23 oass.SolrIndexSearcher.<init> Opening Searcher@19cd4acb main
[junit4:junit4]   2> 8471 T23 oasu.DirectUpdateHandler2.commit end_commit_flush
[junit4:junit4]   2> 8474 T22 oasc.SolrCore.registerSearcher [collection1] Registered new searcher Searcher@19cd4acb main{StandardDirectoryReader(segments_3:9:nrt _0(4.3):C5 _2(4.3):C1)}
[junit4:junit4]   2> 10472 T17 oas.SolrTestCaseJ4.tearDown ###Ending testSoftAndHardCommitMaxTimeDelete
[junit4:junit4]   2> 10485 T17 oas.SolrTestCaseJ4.setUp ###Starting testSoftAndHardCommitMaxTimeMixedAdds
[junit4:junit4]   2> 10486 T17 oasc.CoreContainer.reload Reloading SolrCore 'collection1' using instanceDir: /Users/jenkins/jenkins-slave/workspace/Lucene-Solr-4.x-MacOSX/solr/build/solr-core/test-files/solr/collection1
[junit4:junit4]   2> 10488 T17 oasc.SolrResourceLoader.<init> new SolrResourceLoader for directory: '/Users/jenkins/jenkins-slave/workspace/Lucene-Solr-4.x-MacOSX/solr/build/solr-core/test-files/solr/collection1/'
[junit4:junit4]   2> 10491 T17 oasc.SolrResourceLoader.replaceClassLoader Adding 'file:/Users/jenkins/jenkins-slave/workspace/Lucene-Solr-4.x-MacOSX/solr/build/solr-core/test-files/solr/collection1/lib/classes/' to classloader
[junit4:junit4]   2> 10492 T17 oasc.SolrResourceLoader.replaceClassLoader Adding 'file:/Users/jenkins/jenkins-slave/workspace/Lucene-Solr-4.x-MacOSX/solr/build/solr-core/test-files/solr/collection1/lib/README' to classloader
[junit4:junit4]   2> 10598 T17 oasc.SolrConfig.<init> Using Lucene MatchVersion: LUCENE_43
[junit4:junit4]   2> 10686 T17 oasc.SolrConfig.<init> Loaded SolrConfig: solrconfig.xml
[junit4:junit4]   2> 10687 T17 oass.IndexSchema.readSchema Reading Solr Schema
[junit4:junit4]   2> 10726 T17 oass.IndexSchema.readSchema Schema name=test
[junit4:junit4]   2> 11616 T17 oass.OpenExchangeRatesOrgProvider.init Initialized with rates=open-exchange-rates.json, refreshInterval=1440.
[junit4:junit4]   2> 11637 T17 oass.IndexSchema.readSchema default search field in schema is text
[junit4:junit4]   2> 11642 T17 oass.IndexSchema.readSchema unique key field: id
[junit4:junit4]   2> 11672 T17 oass.FileExchangeRateProvider.reload Reloading exchange rates from file currency.xml
[junit4:junit4]   2> 11679 T17 oass.FileExchangeRateProvider.reload Reloading exchange rates from file currency.xml
[junit4:junit4]   2> 11687 T17 oass.OpenExchangeRatesOrgProvider.reload Reloading exchange rates from open-exchange-rates.json
[junit4:junit4]   2> 11688 T17 oass.OpenExchangeRatesOrgProvider$OpenExchangeRates.<init> WARNING Unknown key IMPORTANT NOTE
[junit4:junit4]   2> 11689 T17 oass.OpenExchangeRatesOrgProvider$OpenExchangeRates.<init> WARNING Expected key, got STRING
[junit4:junit4]   2> 11690 T17 oass.OpenExchangeRatesOrgProvider.reload Reloading exchange rates from open-exchange-rates.json
[junit4:junit4]   2> 11691 T17 oass.OpenExchangeRatesOrgProvider$OpenExchangeRates.<init> WARNING Unknown key IMPORTANT NOTE
[junit4:junit4]   2> 11692 T17 oass.OpenExchangeRatesOrgProvider$OpenExchangeRates.<init> WARNING Expected key, got STRING
[junit4:junit4]   2> 11693 T17 oasc.SolrCore.<init> [collection1] Opening new SolrCore at /Users/jenkins/jenkins-slave/workspace/Lucene-Solr-4.x-MacOSX/solr/build/solr-core/test-files/solr/collection1/, dataDir=/Users/jenkins/jenkins-slave/workspace/Lucene-Solr-4.x-MacOSX/solr/build/solr-core/test/J0/./solrtest-SoftAutoCommitTest-1364096180878/
[junit4:junit4]   2> 11694 T17 oasc.JmxMonitoredMap.<init> JMX monitoring is enabled. Adding Solr mbeans to JMX Server: com.sun.jmx.mbeanserver.JmxMBeanServer@55c1c532
[junit4:junit4]   2> 11696 T17 oasc.SolrCore.getNewIndexDir New index directory detected: old=null new=/Users/jenkins/jenkins-slave/workspace/Lucene-Solr-4.x-MacOSX/solr/build/solr-core/test/J0/./solrtest-SoftAutoCommitTest-1364096180878/index/
[junit4:junit4]   2> 11697 T17 oasc.SolrCore.initWriters created xml: solr.XMLResponseWriter
[junit4:junit4]   2> 11702 T17 oasup.UpdateRequestProcessorChain.init inserting DistributedUpdateProcessorFactory into updateRequestProcessorChain "dedupe"
[junit4:junit4]   2> 11703 T17 oasup.UpdateRequestProcessorChain.init inserting DistributedUpdateProcessorFactory into updateRequestProcessorChain "dedupe-allfields"
[junit4:junit4]   2> 11704 T17 oasup.UpdateRequestProcessorChain.init inserting DistributedUpdateProcessorFactory into updateRequestProcessorChain "stored_sig"
[junit4:junit4]   2> 11705 T17 oasup.UpdateRequestProcessorChain.init inserting DistributedUpdateProcessorFactory into updateRequestProcessorChain "uniq-fields"
[junit4:junit4]   2> 11708 T17 oasup.UpdateRequestProcessorChain.init inserting DistributedUpdateProcessorFactory into updateRequestProcessorChain "distrib-dup-test-chain-implicit"
[junit4:junit4]   2> 11709 T17 oasc.RequestHandlers.initHandlersFromConfig adding lazy requestHandler: solr.ReplicationHandler
[junit4:junit4]   2> 11710 T17 oasc.RequestHandlers.initHandlersFromConfig created /replication: solr.ReplicationHandler
[junit4:junit4]   2> 11711 T17 oasc.RequestHandlers.initHandlersFromConfig created standard: solr.StandardRequestHandler
[junit4:junit4]   2> 11714 T17 oasc.RequestHandlers.initHandlersFromConfig created /get: solr.RealTimeGetHandler
[junit4:junit4]   2> 11716 T17 oasc.RequestHandlers.initHandlersFromConfig created dismax: solr.SearchHandler
[junit4:junit4]   2> 11717 T17 oasc.RequestHandlers.initHandlersFromConfig created mock: org.apache.solr.core.MockQuerySenderListenerReqHandler
[junit4:junit4]   2> 11719 T17 oasc.RequestHandlers.initHandlersFromConfig created /admin/: org.apache.solr.handler.admin.AdminHandlers
[junit4:junit4]   2> 11720 T17 oasc.RequestHandlers.initHandlersFromConfig created defaults: solr.StandardRequestHandler
[junit4:junit4]   2> 11721 T17 oasc.RequestHandlers.initHandlersFromConfig adding lazy requestHandler: solr.StandardRequestHandler
[junit4:junit4]   2> 11722 T17 oasc.RequestHandlers.initHandlersFromConfig created lazy: solr.StandardRequestHandler
[junit4:junit4]   2> 11723 T17 oasc.RequestHandlers.initHandlersFromConfig created /update: solr.UpdateRequestHandler
[junit4:junit4]   2> 11734 T17 oasc.RequestHandlers.initHandlersFromConfig created /terms: org.apache.solr.handler.component.SearchHandler
[junit4:junit4]   2> 11735 T17 oasc.RequestHandlers.initHandlersFromConfig created spellCheckCompRH: org.apache.solr.handler.component.SearchHandler
[junit4:junit4]   2> 11737 T17 oasc.RequestHandlers.initHandlersFromConfig created spellCheckCompRH_Direct: org.apache.solr.handler.component.SearchHandler
[junit4:junit4]   2> 11739 T17 oasc.RequestHandlers.initHandlersFromConfig created spellCheckWithWordbreak: org.apache.solr.handler.component.SearchHandler
[junit4:junit4]   2> 11741 T17 oasc.RequestHandlers.initHandlersFromConfig created spellCheckWithWordbreak_Direct: org.apache.solr.handler.component.SearchHandler
[junit4:junit4]   2> 11743 T17 oasc.RequestHandlers.initHandlersFromConfig created spellCheckCompRH1: org.apache.solr.handler.component.SearchHandler
[junit4:junit4]   2> 11744 T17 oasc.RequestHandlers.initHandlersFromConfig created mltrh: org.apache.solr.handler.component.SearchHandler
[junit4:junit4]   2> 11746 T17 oasc.RequestHandlers.initHandlersFromConfig created tvrh: org.apache.solr.handler.component.SearchHandler
[junit4:junit4]   2> 11747 T17 oasc.RequestHandlers.initHandlersFromConfig created /mlt: solr.MoreLikeThisHandler
[junit4:junit4]   2> 11749 T17 oasc.RequestHandlers.initHandlersFromConfig created /debug/dump: solr.DumpRequestHandler
[junit4:junit4]   2> 11758 T17 oashl.XMLLoader.init xsltCacheLifetimeSeconds=60
[junit4:junit4]   2> 11761 T17 oasc.SolrCore.initDeprecatedSupport WARNING solrconfig.xml uses deprecated <admin/gettableFiles>, Please update your config to use the ShowFileRequestHandler.
[junit4:junit4]   2> 11766 T17 oasc.SolrCore.initDeprecatedSupport WARNING adding ShowFileRequestHandler with hidden files: [THROW.ERROR.ON.ADD.UPDATEPROCESSOR.JS, SOLRCONFIG-HIGHLIGHT.XML, SCHEMA-REQUIRED-FIELDS.XML, TRIVIAL.UPDATEPROCESSOR1.JS, BAD-SCHEMA-DOCVALUES-NOT-REQUIRED-NO-DEFAULT.XML, BAD-SCHEMA-DUP-DYNAMICFIELD.XML, SCHEMA-MINIMAL.XML, SCHEMA-REPLICATION2.XML, SOLRCONFIG-CACHING.XML, SCHEMA-POSTINGSHIGHLIGHT.XML, SOLRCONFIG-REPEATER.XML, REGEX-BOOST-PROCESSOR-TEST.TXT, SOLRCONFIG-MERGEPOLICY.XML, CURRENCY.XML, BAD-SCHEMA-CURRENCY-FT-BOGUS-CODE-IN-XML.XML, BAD-SCHEMA-NONTEXT-ANALYZER.XML, SOLRCONFIG-TLOG.XML, SOLRCONFIG-MASTER.XML, SOLRCONFIG-COMPONENTS-NAME.XML, BAD-SCHEMA-UNIQUEKEY-MULTIVALUED.XML, SCHEMA11.XML, SOLRCONFIG-BASIC.XML, DA_COMPOUNDDICTIONARY.TXT, MISSLEADING.EXTENSION.UPDATEPROCESSOR.JS.TXT, SCHEMA-COPYFIELD-TEST.XML, SOLRCONFIG-SLAVE.XML, SOLRCONFIG-PROPINJECT-INDEXDEFAULT.XML, ELEVATE.XML, TRIVIAL.UPDATEPROCESSOR0.JS, SCHEMA-SWEETSPOT.XML, BAD-SOLRCONFIG-BOGUS-SCRIPTENGINE-NAME.XML, SCHEMA-CHARFILTERS.XML, SCHEMA-IB.XML, SOLRCONFIG-QUERYSENDER.XML, SOLRCONFIG-SNIPPET-PROCESSOR.XML, DA_UTF8.XML, SCHEMA-REPLICATION1.XML, CONDITIONAL.UPDATEPROCESSOR.JS, SCHEMA-TINY.XML, MISSING.FUNCTIONS.UPDATEPROCESSOR.JS, SOLRCONFIG-ENABLEPLUGIN.XML, HYPHENATION.DTD, STEMDICT.TXT, SCHEMA-PHRASESUGGEST.XML, HUNSPELL-TEST.AFF, BAD-SCHEMA-CURRENCY-FT-OER-NORATES.XML, SCHEMA-SNIPPET-TYPE.XML, STOPTYPES-1.TXT, STOPWORDSWRONGENCODING.TXT, SCHEMA-NUMERIC.XML, SOLRCONFIG-TRANSFORMERS.XML, SOLRCONFIG-PROPINJECT.XML, BAD-SCHEMA-NOT-INDEXED-BUT-TF.XML, SOLRCONFIG-SIMPLELOCK.XML, SCHEMA-DOCVALUES.XML, WDFTYPES.TXT, STOPTYPES-2.TXT, SCHEMA-REVERSED.XML, BAD-SCHEMA-CURRENCY-FT-MULTIVALUED.XML, SOLRCONFIG-SPELLCHECKCOMPONENT.XML, SOLRCONFIG-PHRASESUGGEST.XML, BAD-SCHEMA-CURRENCY-MULTIVALUED.XML, SCHEMA-DFR.XML, BAD-SCHEMA-NOT-INDEXED-BUT-POS.XML, KEEP-1.TXT, OPEN-EXCHANGE-RATES.JSON, SCHEMA-SPATIAL.XML, STOPWITHBOM.TXT, SOLRCONFIG-SPELLCHECKER.XML, SOLRCONFIG-POSTINGSHIGHLIGHT.XML, SCHEMA-BINARYFIELD.XML, SOLRCONFIG-UPDATE-PROCESSOR-CHAINS.XML, BAD-SCHEMA-OMIT-TF-BUT-NOT-POS.XML, BAD-SCHEMA-DUP-FIELDTYPE.XML, SCHEMA-XINCLUDE.XML, SOLRCONFIG-MASTER1.XML, SCHEMA-BEHAVIOR.XML, SYNONYMS.TXT, SOLRCONFIG-MINIMAL.XML, SCHEMA-DOCVALUESMULTI.XML, BAD-SCHEMA-UNSUPPORTED-DOCVALUES.XML, BAD-SCHEMA-CURRENCY-DYNAMIC-MULTIVALUED.XML, SCHEMA_CODEC.XML, BAD-SCHEMA-SWEETSPOT-PARTIAL-HYPERBOLIC.XML, SOLRCONFIG-SOLR-749.XML, SOLRCONFIG-MASTER1-KEEPONEBACKUP.XML, SCHEMA-EFF.XML, STOP-2.TXT, SOLRCONFIG-FUNCTIONQUERY.XML, SOLRCONFIG-TERMINDEX.XML, SCHEMA-LMDIRICHLET.XML, SOLRCONFIG-ELEVATE.XML, BAD-SCHEMA-SWEETSPOT-PARTIAL-NORMS.XML, BAD-SCHEMA-SWEETSPOT-PARTIAL-BASELINE.XML, STOPWORDS.TXT, SCHEMA-FOLDING.XML, SCHEMA-STOP-KEEP.XML, FUZZYSUGGEST.TXT, BAD-SCHEMA-NOT-INDEXED-BUT-NORMS.XML, SCHEMA-REST.XML, SOLRCONFIG-SOLCOREPROPERTIES.XML, STOP-1.TXT, SOLRCONFIG-MASTER2.XML, SCHEMA-SPELLCHECKER.XML, SOLRCONFIG-RESPONSE-LOG-COMPONENT.XML, SOLRCONFIG-LAZYWRITER.XML, SCHEMA-LUCENEMATCHVERSION.XML, FRENCHARTICLES.TXT, BAD-MP-SOLRCONFIG.XML, SCHEMA15.XML, SOLRCONFIG-REQHANDLER.INCL, SCHEMASURROUND.XML, SCHEMA-COLLATEFILTER.XML, SOLRCONFIG-MASTER3.XML, HUNSPELL-TEST.DIC, SOLRCONFIG-XINCLUDE.XML, BAD-SCHEMA-CODEC-GLOBAL-VS-FT-MISMATCH.XML, SOLRCONFIG-SLAVE1.XML, SOLRCONFIG-DELPOLICY1.XML, SCHEMA-SIM.XML, SCHEMA-SNIPPET-FIELD.XML, SCHEMA-COLLATE.XML, STOP-SNOWBALL.TXT, BAD-SCHEMA-SIM-GLOBAL-VS-FT-MISMATCH.XML, PROTWORDS.TXT, SCHEMA-TRIE.XML, SOLRCONFIG_CODEC.XML, SCHEMA-SYNONYM-TOKENIZER.XML, BAD-SOLRCONFIG-INVALID-SCRIPTFILE.XML, JASUGGEST.TXT, SCHEMA-DOCVALUESFACETING.XML, SCHEMA-TFIDF.XML, SOLRCONFIG-SCRIPT-UPDATEPROCESSOR.XML, SCHEMA-LMJELINEKMERCER.XML, PHRASESUGGEST.TXT, BAD-SOLRCONFIG-MISSING-SCRIPTFILE.XML, SOLRCONFIG-BASIC-LUCENEVERSION31.XML, BAD-SCHEMA-UNIQUEKEY-USES-DEFAULT.XML, OLD_SYNONYMS.TXT, SOLRCONFIG-DELPOLICY2.XML, XSLT, SOLRCONFIG-NATIVELOCK.XML, BAD-SCHEMA-DUP-FIELD.XML, SOLRCONFIG-NOCACHE.XML, BAD-SCHEMA-SWEETSPOT-BOTH-TF.XML, SCHEMA-BM25.XML, ADDFIELDS.UPDATEPROCESSOR.JS, SOLRCONFIG-QUERYSENDER-NOQUERY.XML, SOLRCONFIG-ALTDIRECTORY.XML, COMPOUNDDICTIONARY.TXT, SOLRCONFIG_PERF.XML, SOLRCONFIG-INDEXCONFIG.XML, BAD-SCHEMA-CURRENCY-FT-BOGUS-DEFAULT-CODE.XML, BAD-CURRENCY.XML, BAD-SCHEMA-ANALYZER-CLASS-AND-NESTED.XML, SCHEMA-NOT-REQUIRED-UNIQUE-KEY.XML, KEEP-2.TXT, SCHEMA12.XML, BAD-SCHEMA-UNIQUEKEY-IS-COPYFIELD-DEST.XML, MAPPING-ISOLATIN1ACCENT.TXT, BAD_SOLRCONFIG.XML, BAD-SCHEMA-EXTERNAL-FILEFIELD.XML]
[junit4:junit4]   2> 11774 T17 oass.SolrIndexSearcher.<init> Opening Searcher@31b681b7 main
[junit4:junit4]   2> 11775 T17 oasu.CommitTracker.<init> Hard AutoCommit: disabled
[junit4:junit4]   2> 11776 T17 oasu.CommitTracker.<init> Soft AutoCommit: disabled
[junit4:junit4]   2> 11777 T17 oashc.SpellCheckComponent.inform Initializing spell checkers
[junit4:junit4]   2> 11781 T17 oass.DirectSolrSpellChecker.init init: {name=direct,classname=DirectSolrSpellChecker,field=lowerfilt,minQueryLength=3}
[junit4:junit4]   2> 11801 T25 oasc.SolrCore.registerSearcher [collection1] Registered new searcher Searcher@31b681b7 main{StandardDirectoryReader(segments_4:9:nrt _0(4.3):C5 _2(4.3):C1)}
[junit4:junit4]   2> 11817 T17 oasu.DefaultSolrCoreState.newIndexWriter Creating new IndexWriter...
[junit4:junit4]   2> 11818 T17 oasu.DefaultSolrCoreState.newIndexWriter Waiting until IndexWriter is unused... core=collection1
[junit4:junit4]   2> 11818 T17 oasu.DefaultSolrCoreState.newIndexWriter Closing old IndexWriter... core=collection1
[junit4:junit4]   2> 11844 T17 oasc.SolrDeletionPolicy.onInit SolrDeletionPolicy.onInit: commits:num=1
[junit4:junit4]   2> 		commit{dir=RateLimitedDirectoryWrapper(MockDirWrapper(NRTCachingDirectory(org.apache.lucene.store.RAMDirectory@697b0672 lockFactory=org.apache.lucene.store.NativeFSLockFactory@3e1917a2; maxCacheMB=0.7138671875 maxMergeSizeMB=0.984375))),segFN=segments_4,generation=4,filenames=[_2.si, _0_Lucene40_0.tim, _0.fnm, _2.fdt, _0_nrm.cfs, _0_Lucene40_0.prx, _2.fdx, _2.fnm, _0_Lucene40_0.tip, _2_Lucene40_0.tip, _2_nrm.cfe, _0_Lucene40_0.frq, _2_Lucene40_0.frq, _2_Lucene40_0.prx, _0_nrm.cfe, _0.fdx, _2_nrm.cfs, _2_Lucene40_0.tim, _0.si, _0.fdt, segments_4]
[junit4:junit4]   2> 11846 T17 oasc.SolrDeletionPolicy.updateCommits newest commit = 4[_2.si, _0_Lucene40_0.tim, _0.fnm, _2.fdt, _0_nrm.cfs, _0_Lucene40_0.prx, _2.fdx, _2.fnm, _0_Lucene40_0.tip, _2_Lucene40_0.tip, _2_nrm.cfe, _0_Lucene40_0.frq, _2_Lucene40_0.frq, _2_Lucene40_0.prx, _0_nrm.cfe, _0.fdx, _2_nrm.cfs, _2_Lucene40_0.tim, _0.si, _0.fdt, segments_4]
[junit4:junit4]   2> 11847 T17 oasu.DefaultSolrCoreState.newIndexWriter New IndexWriter is ready to be used.
[junit4:junit4]   2> 11870 T17 oass.SolrIndexSearcher.<init> Opening Searcher@52e4ee0 main
[junit4:junit4]   2> 11871 T17 oasc.CoreContainer.registerCore replacing core: collection1
[junit4:junit4]   2> 11872 T17 oasc.SolrCore.close [collection1]  CLOSING SolrCore org.apache.solr.core.SolrCore@12b16656
[junit4:junit4]   2> 11880 T25 oasc.SolrCore.registerSearcher [collection1] Registered new searcher Searcher@52e4ee0 main{StandardDirectoryReader(segments_4:9:nrt _0(4.3):C5 _2(4.3):C1)}
[junit4:junit4]   2> 11912 T17 oasu.DirectUpdateHandler2.close closing DirectUpdateHandler2{commits=4,autocommit maxTime=1200ms,autocommits=1,soft autocommit maxTime=500ms,soft autocommits=2,optimizes=0,rollbacks=0,expungeDeletes=0,docsPending=0,adds=0,deletesById=0,deletesByQuery=0,errors=0,cumulative_adds=2,cumulative_deletesById=1,cumulative_deletesByQuery=0,cumulative_errors=0}
[junit4:junit4]   2> 11914 T17 oasc.SolrCore.closeSearcher [collection1] Closing main searcher on request.
[junit4:junit4]   2> ASYNC  NEW_CORE C2 name=collection1 org.apache.solr.core.SolrCore@13aad89e
[junit4:junit4]   2> 11931 T17 C2 UPDATE [collection1] webapp=null path=null params={} {add=[529]} 0 5
[junit4:junit4]   2> 12432 T27 oasu.DirectUpdateHandler2.commit start commit{,optimize=false,openSearcher=true,waitSearcher=true,expungeDeletes=false,softCommit=true,prepareCommit=false}
[junit4:junit4]   2> 12445 T27 oass.SolrIndexSearcher.<init> Opening Searcher@370b8836 main
[junit4:junit4]   2> 12446 T27 oasu.DirectUpdateHandler2.commit end_commit_flush
[junit4:junit4]   2> 12451 T25 oasc.SolrCore.registerSearcher [collection1] Registered new searcher Searcher@370b8836 main{StandardDirectoryReader(segments_4:11:nrt _0(4.3):C5 _2(4.3):C1 _3(4.3):C1)}
[junit4:junit4]   2> 12454 T17 C2 UPDATE [collection1] webapp=null path=null params={} {add=[530]} 0 3
[junit4:junit4]   2> 12960 T27 oasu.DirectUpdateHandler2.commit start commit{,optimize=false,openSearcher=true,waitSearcher=true,expungeDeletes=false,softCommit=true,prepareCommit=false}
[junit4:junit4]   2> 12967 T27 oass.SolrIndexSearcher.<init> Opening Searcher@69adbb91 main
[junit4:junit4]   2> 12969 T27 oasu.DirectUpdateHandler2.commit end_commit_flush
[junit4:junit4]   2> 12971 T25 oasc.SolrCore.registerSearcher [collection1] Registered new searcher Searcher@69adbb91 main{StandardDirectoryReader(segments_4:13:nrt _0(4.3):C5 _2(4.3):C1 _3(4.3):C1 _4(4.3):C1)}
[junit4:junit4]   2> 13132 T26 oasu.DirectUpdateHandler2.commit start commit{,optimize=false,openSearcher=true,waitSearcher=true,expungeDeletes=false,softCommit=false,prepareCommit=false}
[junit4:junit4]   2> 13135 T26 oasc.SolrDeletionPolicy.onCommit SolrDeletionPolicy.onCommit: commits:num=2
[junit4:junit4]   2> 		commit{dir=RateLimitedDirectoryWrapper(MockDirWrapper(NRTCachingDirectory(org.apache.lucene.store.RAMDirectory@697b0672 lockFactory=org.apache.lucene.store.NativeFSLockFactory@3e1917a2; maxCacheMB=0.7138671875 maxMergeSizeMB=0.984375))),segFN=segments_4,generation=4,filenames=[_2.si, _0_Lucene40_0.tim, _0.fnm, _2.fdt, _0_nrm.cfs, _0_Lucene40_0.prx, _2.fdx, _2.fnm, _0_Lucene40_0.tip, _2_Lucene40_0.tip, _2_nrm.cfe, _0_Lucene40_0.frq, _2_Lucene40_0.frq, _2_Lucene40_0.prx, _0_nrm.cfe, _0.fdx, _2_nrm.cfs, _2_Lucene40_0.tim, _0.si, _0.fdt, segments_4]
[junit4:junit4]   2> 		commit{dir=RateLimitedDirectoryWrapper(MockDirWrapper(NRTCachingDirectory(org.apache.lucene.store.RAMDirectory@697b0672 lockFactory=org.apache.lucene.store.NativeFSLockFactory@3e1917a2; maxCacheMB=0.7138671875 maxMergeSizeMB=0.984375))),segFN=segments_5,generation=5,filenames=[_2.si, _3_nrm.cfe, _4_nrm.cfe, _4.fnm, _3.fdt, _3.fnm, _0_Lucene40_0.prx, _4.fdx, _2_Lucene40_0.tip, _3_Lucene40_0.frq, _2_nrm.cfe, _0_Lucene40_0.frq, _4_Lucene40_0.tip, _3_Lucene40_0.prx, _4_Lucene40_0.tim, _0.si, _2_Lucene40_0.tim, _2_nrm.cfs, _4_Lucene40_0.prx, _3_Lucene40_0.tip, _3_Lucene40_0.tim, _0_Lucene40_0.tim, _0.fnm, _2.fdt, _4.si, _4.fdt, _0_nrm.cfs, _2.fdx, _0_Lucene40_0.tip, _2.fnm, _3.fdx, _3_nrm.cfs, _2_Lucene40_0.frq, _2_Lucene40_0.prx, _4_Lucene40_0.frq, _4_nrm.cfs, _0_nrm.cfe, _3.si, _0.fdx, segments_5, _0.fdt]
[junit4:junit4]   2> 13135 T26 oasc.SolrDeletionPolicy.updateCommits newest commit = 5[_2.si, _3_nrm.cfe, _4_nrm.cfe, _4.fnm, _3.fdt, _3.fnm, _0_Lucene40_0.prx, _4.fdx, _2_Lucene40_0.tip, _3_Lucene40_0.frq, _2_nrm.cfe, _0_Lucene40_0.frq, _4_Lucene40_0.tip, _3_Lucene40_0.prx, _4_Lucene40_0.tim, _0.si, _2_Lucene40_0.tim, _2_nrm.cfs, _4_Lucene40_0.prx, _3_Lucene40_0.tip, _3_Lucene40_0.tim, _0_Lucene40_0.tim, _0.fnm, _2.fdt, _4.si, _4.fdt, _0_nrm.cfs, _2.fdx, _0_Lucene40_0.tip, _2.fnm, _3.fdx, _3_nrm.cfs, _2_Lucene40_0.frq, _2_Lucene40_0.prx, _4_Lucene40_0.frq, _4_nrm.cfs, _0_nrm.cfe, _3.si, _0.fdx, segments_5, _0.fdt]
[junit4:junit4]   2> 13137 T26 oass.SolrIndexSearcher.<init> Opening Searcher@72da9d23 main
[junit4:junit4]   2> 13138 T26 oasu.DirectUpdateHandler2.commit end_commit_flush
[junit4:junit4]   2> 13141 T25 oasc.SolrCore.registerSearcher [collection1] Registered new searcher Searcher@72da9d23 main{StandardDirectoryReader(segments_4:13:nrt _0(4.3):C5 _2(4.3):C1 _3(4.3):C1 _4(4.3):C1)}
[junit4:junit4]   2> 16342 T17 oas.SolrTestCaseJ4.tearDown ###Ending testSoftAndHardCommitMaxTimeMixedAdds
[junit4:junit4]   2> 16346 T17 oas.SolrTestCaseJ4.deleteCore ###deleteCore
[junit4:junit4]   2> 16347 T17 oasc.CoreContainer.shutdown Shutting down CoreContainer instance=2145173627
[junit4:junit4]   2> 16348 T17 oasc.SolrCore.close [collection1]  CLOSING SolrCore org.apache.solr.core.SolrCore@13aad89e
[junit4:junit4]   2> 16373 T17 oasu.DirectUpdateHandler2.close closing DirectUpdateHandler2{commits=3,autocommit maxTime=1200ms,autocommits=1,soft autocommit maxTime=500ms,soft autocommits=2,optimizes=0,rollbacks=0,expungeDeletes=0,docsPending=0,adds=0,deletesById=0,deletesByQuery=0,errors=0,cumulative_adds=2,cumulative_deletesById=0,cumulative_deletesByQuery=0,cumulative_errors=0}
[junit4:junit4]   2> 16375 T17 oasu.SolrCoreState.decrefSolrCoreState Closing SolrCoreState
[junit4:junit4]   2> 16376 T17 oasu.DefaultSolrCoreState.closeIndexWriter SolrCoreState ref count has reached 0 - closing IndexWriter
[junit4:junit4]   2> 16377 T17 oasu.DefaultSolrCoreState.closeIndexWriter closing IndexWriter with IndexWriterCloser
[junit4:junit4]   2> 16379 T17 oasc.SolrCore.closeSearcher [collection1] Closing main searcher on request.
[junit4:junit4]   2> 16382 T17 oasc.CachingDirectoryFactory.close Closing directory when closing factory: /Users/jenkins/jenkins-slave/workspace/Lucene-Solr-4.x-MacOSX/solr/build/solr-core/test/J0/./solrtest-SoftAutoCommitTest-1364096180878/index
[junit4:junit4]   2> 16383 T17 oasc.CachingDirectoryFactory.closeDirectory Closing directory: /Users/jenkins/jenkins-slave/workspace/Lucene-Solr-4.x-MacOSX/solr/build/solr-core/test/J0/./solrtest-SoftAutoCommitTest-1364096180878/index
[junit4:junit4]   2> 16383 T17 oasc.CachingDirectoryFactory.close Closing directory when closing factory: /Users/jenkins/jenkins-slave/workspace/Lucene-Solr-4.x-MacOSX/solr/build/solr-core/test/J0/./solrtest-SoftAutoCommitTest-1364096180878
[junit4:junit4]   2> 16384 T17 oasc.CachingDirectoryFactory.closeDirectory Closing directory: /Users/jenkins/jenkins-slave/workspace/Lucene-Solr-4.x-MacOSX/solr/build/solr-core/test/J0/./solrtest-SoftAutoCommitTest-1364096180878
[junit4:junit4]   2> NOTE: test params are: codec=Lucene40, sim=RandomSimilarityProvider(queryNorm=false,coord=crazy): {}, locale=sl, timezone=Africa/Maseru
[junit4:junit4]   2> NOTE: Mac OS X 10.8.2 x86_64/Oracle Corporation 1.7.0_15 (64-bit)/cpus=2,threads=1,free=54328080,total=93126656
[junit4:junit4]   2> NOTE: All tests run in this JVM: [TestMergePolicyConfig, DefaultValueUpdateProcessorTest, SoftAutoCommitTest]
[junit4:junit4] Completed in 16.52s, 3 tests, 1 failure <<< FAILURES!

[...truncated 838 lines...]
BUILD FAILED
/Users/jenkins/jenkins-slave/workspace/Lucene-Solr-4.x-MacOSX/build.xml:381: The following error occurred while executing this line:
/Users/jenkins/jenkins-slave/workspace/Lucene-Solr-4.x-MacOSX/build.xml:361: The following error occurred while executing this line:
/Users/jenkins/jenkins-slave/workspace/Lucene-Solr-4.x-MacOSX/build.xml:39: The following error occurred while executing this line:
/Users/jenkins/jenkins-slave/workspace/Lucene-Solr-4.x-MacOSX/solr/build.xml:183: The following error occurred while executing this line:
/Users/jenkins/jenkins-slave/workspace/Lucene-Solr-4.x-MacOSX/solr/common-build.xml:449: The following error occurred while executing this line:
/Users/jenkins/jenkins-slave/workspace/Lucene-Solr-4.x-MacOSX/lucene/common-build.xml:1212: The following error occurred while executing this line:
/Users/jenkins/jenkins-slave/workspace/Lucene-Solr-4.x-MacOSX/lucene/common-build.xml:876: There were test failures: 273 suites, 1149 tests, 1 failure, 18 ignored (6 assumptions)

Total time: 72 minutes 30 seconds
Build step 'Invoke Ant' marked build as failure
Archiving artifacts
Recording test results
Description set: Java: 64bit/jdk1.7.0 -XX:+UseConcMarkSweepGC
Email was triggered for: Failure
Sending email for trigger: Failure



Mime
View raw message