lucene-dev mailing list archives

Site index · List index
Message view « Date » · « Thread »
Top « Date » · « Thread »
From Apache Jenkins Server <jenk...@builds.apache.org>
Subject [JENKINS] Lucene-Solr-NightlyTests-trunk - Build # 210 - Still Failing
Date Mon, 18 Mar 2013 14:42:04 GMT
Build: https://builds.apache.org/job/Lucene-Solr-NightlyTests-trunk/210/

8 tests failed.
REGRESSION:  org.apache.solr.cloud.SyncSliceTest.testDistribSearch

Error Message:
Test Setup Failure: shard1 should have just been set up to be inconsistent - but it's still consistent. Leader:http://127.0.0.1:13184/collection1 Dead Guy:http://127.0.0.1:13181/collection1skip list:[CloudJettyRunner [url=http://127.0.0.1:13193/collection1], CloudJettyRunner [url=http://127.0.0.1:13224/collection1]]

Stack Trace:
java.lang.AssertionError: Test Setup Failure: shard1 should have just been set up to be inconsistent - but it's still consistent. Leader:http://127.0.0.1:13184/collection1 Dead Guy:http://127.0.0.1:13181/collection1skip list:[CloudJettyRunner [url=http://127.0.0.1:13193/collection1], CloudJettyRunner [url=http://127.0.0.1:13224/collection1]]
	at __randomizedtesting.SeedInfo.seed([A5873DBB93C19062:2461B3A3E49EF05E]:0)
	at org.junit.Assert.fail(Assert.java:93)
	at org.junit.Assert.assertTrue(Assert.java:43)
	at org.junit.Assert.assertNotNull(Assert.java:526)
	at org.apache.solr.cloud.SyncSliceTest.doTest(SyncSliceTest.java:212)
	at org.apache.solr.BaseDistributedSearchTestCase.testDistribSearch(BaseDistributedSearchTestCase.java:806)
	at sun.reflect.NativeMethodAccessorImpl.invoke0(Native Method)
	at sun.reflect.NativeMethodAccessorImpl.invoke(NativeMethodAccessorImpl.java:57)
	at sun.reflect.DelegatingMethodAccessorImpl.invoke(DelegatingMethodAccessorImpl.java:43)
	at java.lang.reflect.Method.invoke(Method.java:601)
	at com.carrotsearch.randomizedtesting.RandomizedRunner.invoke(RandomizedRunner.java:1559)
	at com.carrotsearch.randomizedtesting.RandomizedRunner.access$600(RandomizedRunner.java:79)
	at com.carrotsearch.randomizedtesting.RandomizedRunner$6.evaluate(RandomizedRunner.java:737)
	at com.carrotsearch.randomizedtesting.RandomizedRunner$7.evaluate(RandomizedRunner.java:773)
	at com.carrotsearch.randomizedtesting.RandomizedRunner$8.evaluate(RandomizedRunner.java:787)
	at com.carrotsearch.randomizedtesting.rules.SystemPropertiesRestoreRule$1.evaluate(SystemPropertiesRestoreRule.java:53)
	at org.apache.lucene.util.TestRuleSetupTeardownChained$1.evaluate(TestRuleSetupTeardownChained.java:50)
	at org.apache.lucene.util.TestRuleFieldCacheSanity$1.evaluate(TestRuleFieldCacheSanity.java:51)
	at org.apache.lucene.util.AbstractBeforeAfterRule$1.evaluate(AbstractBeforeAfterRule.java:46)
	at com.carrotsearch.randomizedtesting.rules.SystemPropertiesInvariantRule$1.evaluate(SystemPropertiesInvariantRule.java:55)
	at org.apache.lucene.util.TestRuleThreadAndTestName$1.evaluate(TestRuleThreadAndTestName.java:49)
	at org.apache.lucene.util.TestRuleIgnoreAfterMaxFailures$1.evaluate(TestRuleIgnoreAfterMaxFailures.java:70)
	at org.apache.lucene.util.TestRuleMarkFailure$1.evaluate(TestRuleMarkFailure.java:48)
	at com.carrotsearch.randomizedtesting.rules.StatementAdapter.evaluate(StatementAdapter.java:36)
	at com.carrotsearch.randomizedtesting.ThreadLeakControl$StatementRunner.run(ThreadLeakControl.java:358)
	at com.carrotsearch.randomizedtesting.ThreadLeakControl.forkTimeoutingTask(ThreadLeakControl.java:782)
	at com.carrotsearch.randomizedtesting.ThreadLeakControl$3.evaluate(ThreadLeakControl.java:442)
	at com.carrotsearch.randomizedtesting.RandomizedRunner.runSingleTest(RandomizedRunner.java:746)
	at com.carrotsearch.randomizedtesting.RandomizedRunner$3.evaluate(RandomizedRunner.java:648)
	at com.carrotsearch.randomizedtesting.RandomizedRunner$4.evaluate(RandomizedRunner.java:682)
	at com.carrotsearch.randomizedtesting.RandomizedRunner$5.evaluate(RandomizedRunner.java:693)
	at com.carrotsearch.randomizedtesting.rules.StatementAdapter.evaluate(StatementAdapter.java:36)
	at com.carrotsearch.randomizedtesting.rules.SystemPropertiesRestoreRule$1.evaluate(SystemPropertiesRestoreRule.java:53)
	at org.apache.lucene.util.AbstractBeforeAfterRule$1.evaluate(AbstractBeforeAfterRule.java:46)
	at org.apache.lucene.util.TestRuleStoreClassName$1.evaluate(TestRuleStoreClassName.java:42)
	at com.carrotsearch.randomizedtesting.rules.SystemPropertiesInvariantRule$1.evaluate(SystemPropertiesInvariantRule.java:55)
	at com.carrotsearch.randomizedtesting.rules.NoShadowingOrOverridesOnMethodsRule$1.evaluate(NoShadowingOrOverridesOnMethodsRule.java:39)
	at com.carrotsearch.randomizedtesting.rules.NoShadowingOrOverridesOnMethodsRule$1.evaluate(NoShadowingOrOverridesOnMethodsRule.java:39)
	at com.carrotsearch.randomizedtesting.rules.StatementAdapter.evaluate(StatementAdapter.java:36)
	at org.apache.lucene.util.TestRuleAssertionsRequired$1.evaluate(TestRuleAssertionsRequired.java:43)
	at org.apache.lucene.util.TestRuleMarkFailure$1.evaluate(TestRuleMarkFailure.java:48)
	at org.apache.lucene.util.TestRuleIgnoreAfterMaxFailures$1.evaluate(TestRuleIgnoreAfterMaxFailures.java:70)
	at org.apache.lucene.util.TestRuleIgnoreTestSuites$1.evaluate(TestRuleIgnoreTestSuites.java:55)
	at com.carrotsearch.randomizedtesting.rules.StatementAdapter.evaluate(StatementAdapter.java:36)
	at com.carrotsearch.randomizedtesting.ThreadLeakControl$StatementRunner.run(ThreadLeakControl.java:358)
	at java.lang.Thread.run(Thread.java:722)


REGRESSION:  org.apache.solr.core.OpenCloseCoreStressTest.test10MinutesNew

Error Message:
Core 00001_core bad! expected:<270> but was:<264>

Stack Trace:
java.lang.AssertionError: Core 00001_core bad! expected:<270> but was:<264>
	at __randomizedtesting.SeedInfo.seed([A5873DBB93C19062:9FA2859AE10F7AD6]:0)
	at org.junit.Assert.fail(Assert.java:93)
	at org.junit.Assert.failNotEquals(Assert.java:647)
	at org.junit.Assert.assertEquals(Assert.java:128)
	at org.junit.Assert.assertEquals(Assert.java:472)
	at org.apache.solr.core.OpenCloseCoreStressTest.checkResults(OpenCloseCoreStressTest.java:303)
	at org.apache.solr.core.OpenCloseCoreStressTest.doStress(OpenCloseCoreStressTest.java:201)
	at org.apache.solr.core.OpenCloseCoreStressTest.test10MinutesNew(OpenCloseCoreStressTest.java:133)
	at sun.reflect.NativeMethodAccessorImpl.invoke0(Native Method)
	at sun.reflect.NativeMethodAccessorImpl.invoke(NativeMethodAccessorImpl.java:57)
	at sun.reflect.DelegatingMethodAccessorImpl.invoke(DelegatingMethodAccessorImpl.java:43)
	at java.lang.reflect.Method.invoke(Method.java:601)
	at com.carrotsearch.randomizedtesting.RandomizedRunner.invoke(RandomizedRunner.java:1559)
	at com.carrotsearch.randomizedtesting.RandomizedRunner.access$600(RandomizedRunner.java:79)
	at com.carrotsearch.randomizedtesting.RandomizedRunner$6.evaluate(RandomizedRunner.java:737)
	at com.carrotsearch.randomizedtesting.RandomizedRunner$7.evaluate(RandomizedRunner.java:773)
	at com.carrotsearch.randomizedtesting.RandomizedRunner$8.evaluate(RandomizedRunner.java:787)
	at com.carrotsearch.randomizedtesting.rules.SystemPropertiesRestoreRule$1.evaluate(SystemPropertiesRestoreRule.java:53)
	at org.apache.lucene.util.TestRuleSetupTeardownChained$1.evaluate(TestRuleSetupTeardownChained.java:50)
	at org.apache.lucene.util.TestRuleFieldCacheSanity$1.evaluate(TestRuleFieldCacheSanity.java:51)
	at org.apache.lucene.util.AbstractBeforeAfterRule$1.evaluate(AbstractBeforeAfterRule.java:46)
	at com.carrotsearch.randomizedtesting.rules.SystemPropertiesInvariantRule$1.evaluate(SystemPropertiesInvariantRule.java:55)
	at org.apache.lucene.util.TestRuleThreadAndTestName$1.evaluate(TestRuleThreadAndTestName.java:49)
	at org.apache.lucene.util.TestRuleIgnoreAfterMaxFailures$1.evaluate(TestRuleIgnoreAfterMaxFailures.java:70)
	at org.apache.lucene.util.TestRuleMarkFailure$1.evaluate(TestRuleMarkFailure.java:48)
	at com.carrotsearch.randomizedtesting.rules.StatementAdapter.evaluate(StatementAdapter.java:36)
	at com.carrotsearch.randomizedtesting.ThreadLeakControl$StatementRunner.run(ThreadLeakControl.java:358)
	at com.carrotsearch.randomizedtesting.ThreadLeakControl.forkTimeoutingTask(ThreadLeakControl.java:782)
	at com.carrotsearch.randomizedtesting.ThreadLeakControl$3.evaluate(ThreadLeakControl.java:442)
	at com.carrotsearch.randomizedtesting.RandomizedRunner.runSingleTest(RandomizedRunner.java:746)
	at com.carrotsearch.randomizedtesting.RandomizedRunner$3.evaluate(RandomizedRunner.java:648)
	at com.carrotsearch.randomizedtesting.RandomizedRunner$4.evaluate(RandomizedRunner.java:682)
	at com.carrotsearch.randomizedtesting.RandomizedRunner$5.evaluate(RandomizedRunner.java:693)
	at com.carrotsearch.randomizedtesting.rules.StatementAdapter.evaluate(StatementAdapter.java:36)
	at com.carrotsearch.randomizedtesting.rules.SystemPropertiesRestoreRule$1.evaluate(SystemPropertiesRestoreRule.java:53)
	at org.apache.lucene.util.AbstractBeforeAfterRule$1.evaluate(AbstractBeforeAfterRule.java:46)
	at org.apache.lucene.util.TestRuleStoreClassName$1.evaluate(TestRuleStoreClassName.java:42)
	at com.carrotsearch.randomizedtesting.rules.SystemPropertiesInvariantRule$1.evaluate(SystemPropertiesInvariantRule.java:55)
	at com.carrotsearch.randomizedtesting.rules.NoShadowingOrOverridesOnMethodsRule$1.evaluate(NoShadowingOrOverridesOnMethodsRule.java:39)
	at com.carrotsearch.randomizedtesting.rules.NoShadowingOrOverridesOnMethodsRule$1.evaluate(NoShadowingOrOverridesOnMethodsRule.java:39)
	at com.carrotsearch.randomizedtesting.rules.StatementAdapter.evaluate(StatementAdapter.java:36)
	at org.apache.lucene.util.TestRuleAssertionsRequired$1.evaluate(TestRuleAssertionsRequired.java:43)
	at org.apache.lucene.util.TestRuleMarkFailure$1.evaluate(TestRuleMarkFailure.java:48)
	at org.apache.lucene.util.TestRuleIgnoreAfterMaxFailures$1.evaluate(TestRuleIgnoreAfterMaxFailures.java:70)
	at org.apache.lucene.util.TestRuleIgnoreTestSuites$1.evaluate(TestRuleIgnoreTestSuites.java:55)
	at com.carrotsearch.randomizedtesting.rules.StatementAdapter.evaluate(StatementAdapter.java:36)
	at com.carrotsearch.randomizedtesting.ThreadLeakControl$StatementRunner.run(ThreadLeakControl.java:358)
	at java.lang.Thread.run(Thread.java:722)


REGRESSION:  org.apache.solr.core.OpenCloseCoreStressTest.test30SecondsNew

Error Message:
Core 00006_core bad! expected:<15> but was:<0>

Stack Trace:
java.lang.AssertionError: Core 00006_core bad! expected:<15> but was:<0>
	at __randomizedtesting.SeedInfo.seed([A5873DBB93C19062:C132216FC1016927]:0)
	at org.junit.Assert.fail(Assert.java:93)
	at org.junit.Assert.failNotEquals(Assert.java:647)
	at org.junit.Assert.assertEquals(Assert.java:128)
	at org.junit.Assert.assertEquals(Assert.java:472)
	at org.apache.solr.core.OpenCloseCoreStressTest.checkResults(OpenCloseCoreStressTest.java:303)
	at org.apache.solr.core.OpenCloseCoreStressTest.doStress(OpenCloseCoreStressTest.java:201)
	at org.apache.solr.core.OpenCloseCoreStressTest.test30SecondsNew(OpenCloseCoreStressTest.java:121)
	at sun.reflect.NativeMethodAccessorImpl.invoke0(Native Method)
	at sun.reflect.NativeMethodAccessorImpl.invoke(NativeMethodAccessorImpl.java:57)
	at sun.reflect.DelegatingMethodAccessorImpl.invoke(DelegatingMethodAccessorImpl.java:43)
	at java.lang.reflect.Method.invoke(Method.java:601)
	at com.carrotsearch.randomizedtesting.RandomizedRunner.invoke(RandomizedRunner.java:1559)
	at com.carrotsearch.randomizedtesting.RandomizedRunner.access$600(RandomizedRunner.java:79)
	at com.carrotsearch.randomizedtesting.RandomizedRunner$6.evaluate(RandomizedRunner.java:737)
	at com.carrotsearch.randomizedtesting.RandomizedRunner$7.evaluate(RandomizedRunner.java:773)
	at com.carrotsearch.randomizedtesting.RandomizedRunner$8.evaluate(RandomizedRunner.java:787)
	at com.carrotsearch.randomizedtesting.rules.SystemPropertiesRestoreRule$1.evaluate(SystemPropertiesRestoreRule.java:53)
	at org.apache.lucene.util.TestRuleSetupTeardownChained$1.evaluate(TestRuleSetupTeardownChained.java:50)
	at org.apache.lucene.util.TestRuleFieldCacheSanity$1.evaluate(TestRuleFieldCacheSanity.java:51)
	at org.apache.lucene.util.AbstractBeforeAfterRule$1.evaluate(AbstractBeforeAfterRule.java:46)
	at com.carrotsearch.randomizedtesting.rules.SystemPropertiesInvariantRule$1.evaluate(SystemPropertiesInvariantRule.java:55)
	at org.apache.lucene.util.TestRuleThreadAndTestName$1.evaluate(TestRuleThreadAndTestName.java:49)
	at org.apache.lucene.util.TestRuleIgnoreAfterMaxFailures$1.evaluate(TestRuleIgnoreAfterMaxFailures.java:70)
	at org.apache.lucene.util.TestRuleMarkFailure$1.evaluate(TestRuleMarkFailure.java:48)
	at com.carrotsearch.randomizedtesting.rules.StatementAdapter.evaluate(StatementAdapter.java:36)
	at com.carrotsearch.randomizedtesting.ThreadLeakControl$StatementRunner.run(ThreadLeakControl.java:358)
	at com.carrotsearch.randomizedtesting.ThreadLeakControl.forkTimeoutingTask(ThreadLeakControl.java:782)
	at com.carrotsearch.randomizedtesting.ThreadLeakControl$3.evaluate(ThreadLeakControl.java:442)
	at com.carrotsearch.randomizedtesting.RandomizedRunner.runSingleTest(RandomizedRunner.java:746)
	at com.carrotsearch.randomizedtesting.RandomizedRunner$3.evaluate(RandomizedRunner.java:648)
	at com.carrotsearch.randomizedtesting.RandomizedRunner$4.evaluate(RandomizedRunner.java:682)
	at com.carrotsearch.randomizedtesting.RandomizedRunner$5.evaluate(RandomizedRunner.java:693)
	at com.carrotsearch.randomizedtesting.rules.StatementAdapter.evaluate(StatementAdapter.java:36)
	at com.carrotsearch.randomizedtesting.rules.SystemPropertiesRestoreRule$1.evaluate(SystemPropertiesRestoreRule.java:53)
	at org.apache.lucene.util.AbstractBeforeAfterRule$1.evaluate(AbstractBeforeAfterRule.java:46)
	at org.apache.lucene.util.TestRuleStoreClassName$1.evaluate(TestRuleStoreClassName.java:42)
	at com.carrotsearch.randomizedtesting.rules.SystemPropertiesInvariantRule$1.evaluate(SystemPropertiesInvariantRule.java:55)
	at com.carrotsearch.randomizedtesting.rules.NoShadowingOrOverridesOnMethodsRule$1.evaluate(NoShadowingOrOverridesOnMethodsRule.java:39)
	at com.carrotsearch.randomizedtesting.rules.NoShadowingOrOverridesOnMethodsRule$1.evaluate(NoShadowingOrOverridesOnMethodsRule.java:39)
	at com.carrotsearch.randomizedtesting.rules.StatementAdapter.evaluate(StatementAdapter.java:36)
	at org.apache.lucene.util.TestRuleAssertionsRequired$1.evaluate(TestRuleAssertionsRequired.java:43)
	at org.apache.lucene.util.TestRuleMarkFailure$1.evaluate(TestRuleMarkFailure.java:48)
	at org.apache.lucene.util.TestRuleIgnoreAfterMaxFailures$1.evaluate(TestRuleIgnoreAfterMaxFailures.java:70)
	at org.apache.lucene.util.TestRuleIgnoreTestSuites$1.evaluate(TestRuleIgnoreTestSuites.java:55)
	at com.carrotsearch.randomizedtesting.rules.StatementAdapter.evaluate(StatementAdapter.java:36)
	at com.carrotsearch.randomizedtesting.ThreadLeakControl$StatementRunner.run(ThreadLeakControl.java:358)
	at java.lang.Thread.run(Thread.java:722)


REGRESSION:  org.apache.solr.core.OpenCloseCoreStressTest.test10MinutesOld

Error Message:
Core 00006_core bad! expected:<60> but was:<0>

Stack Trace:
java.lang.AssertionError: Core 00006_core bad! expected:<60> but was:<0>
	at __randomizedtesting.SeedInfo.seed([A5873DBB93C19062:67AF666D0F1616E6]:0)
	at org.junit.Assert.fail(Assert.java:93)
	at org.junit.Assert.failNotEquals(Assert.java:647)
	at org.junit.Assert.assertEquals(Assert.java:128)
	at org.junit.Assert.assertEquals(Assert.java:472)
	at org.apache.solr.core.OpenCloseCoreStressTest.checkResults(OpenCloseCoreStressTest.java:303)
	at org.apache.solr.core.OpenCloseCoreStressTest.doStress(OpenCloseCoreStressTest.java:201)
	at org.apache.solr.core.OpenCloseCoreStressTest.test10MinutesOld(OpenCloseCoreStressTest.java:127)
	at sun.reflect.NativeMethodAccessorImpl.invoke0(Native Method)
	at sun.reflect.NativeMethodAccessorImpl.invoke(NativeMethodAccessorImpl.java:57)
	at sun.reflect.DelegatingMethodAccessorImpl.invoke(DelegatingMethodAccessorImpl.java:43)
	at java.lang.reflect.Method.invoke(Method.java:601)
	at com.carrotsearch.randomizedtesting.RandomizedRunner.invoke(RandomizedRunner.java:1559)
	at com.carrotsearch.randomizedtesting.RandomizedRunner.access$600(RandomizedRunner.java:79)
	at com.carrotsearch.randomizedtesting.RandomizedRunner$6.evaluate(RandomizedRunner.java:737)
	at com.carrotsearch.randomizedtesting.RandomizedRunner$7.evaluate(RandomizedRunner.java:773)
	at com.carrotsearch.randomizedtesting.RandomizedRunner$8.evaluate(RandomizedRunner.java:787)
	at com.carrotsearch.randomizedtesting.rules.SystemPropertiesRestoreRule$1.evaluate(SystemPropertiesRestoreRule.java:53)
	at org.apache.lucene.util.TestRuleSetupTeardownChained$1.evaluate(TestRuleSetupTeardownChained.java:50)
	at org.apache.lucene.util.TestRuleFieldCacheSanity$1.evaluate(TestRuleFieldCacheSanity.java:51)
	at org.apache.lucene.util.AbstractBeforeAfterRule$1.evaluate(AbstractBeforeAfterRule.java:46)
	at com.carrotsearch.randomizedtesting.rules.SystemPropertiesInvariantRule$1.evaluate(SystemPropertiesInvariantRule.java:55)
	at org.apache.lucene.util.TestRuleThreadAndTestName$1.evaluate(TestRuleThreadAndTestName.java:49)
	at org.apache.lucene.util.TestRuleIgnoreAfterMaxFailures$1.evaluate(TestRuleIgnoreAfterMaxFailures.java:70)
	at org.apache.lucene.util.TestRuleMarkFailure$1.evaluate(TestRuleMarkFailure.java:48)
	at com.carrotsearch.randomizedtesting.rules.StatementAdapter.evaluate(StatementAdapter.java:36)
	at com.carrotsearch.randomizedtesting.ThreadLeakControl$StatementRunner.run(ThreadLeakControl.java:358)
	at com.carrotsearch.randomizedtesting.ThreadLeakControl.forkTimeoutingTask(ThreadLeakControl.java:782)
	at com.carrotsearch.randomizedtesting.ThreadLeakControl$3.evaluate(ThreadLeakControl.java:442)
	at com.carrotsearch.randomizedtesting.RandomizedRunner.runSingleTest(RandomizedRunner.java:746)
	at com.carrotsearch.randomizedtesting.RandomizedRunner$3.evaluate(RandomizedRunner.java:648)
	at com.carrotsearch.randomizedtesting.RandomizedRunner$4.evaluate(RandomizedRunner.java:682)
	at com.carrotsearch.randomizedtesting.RandomizedRunner$5.evaluate(RandomizedRunner.java:693)
	at com.carrotsearch.randomizedtesting.rules.StatementAdapter.evaluate(StatementAdapter.java:36)
	at com.carrotsearch.randomizedtesting.rules.SystemPropertiesRestoreRule$1.evaluate(SystemPropertiesRestoreRule.java:53)
	at org.apache.lucene.util.AbstractBeforeAfterRule$1.evaluate(AbstractBeforeAfterRule.java:46)
	at org.apache.lucene.util.TestRuleStoreClassName$1.evaluate(TestRuleStoreClassName.java:42)
	at com.carrotsearch.randomizedtesting.rules.SystemPropertiesInvariantRule$1.evaluate(SystemPropertiesInvariantRule.java:55)
	at com.carrotsearch.randomizedtesting.rules.NoShadowingOrOverridesOnMethodsRule$1.evaluate(NoShadowingOrOverridesOnMethodsRule.java:39)
	at com.carrotsearch.randomizedtesting.rules.NoShadowingOrOverridesOnMethodsRule$1.evaluate(NoShadowingOrOverridesOnMethodsRule.java:39)
	at com.carrotsearch.randomizedtesting.rules.StatementAdapter.evaluate(StatementAdapter.java:36)
	at org.apache.lucene.util.TestRuleAssertionsRequired$1.evaluate(TestRuleAssertionsRequired.java:43)
	at org.apache.lucene.util.TestRuleMarkFailure$1.evaluate(TestRuleMarkFailure.java:48)
	at org.apache.lucene.util.TestRuleIgnoreAfterMaxFailures$1.evaluate(TestRuleIgnoreAfterMaxFailures.java:70)
	at org.apache.lucene.util.TestRuleIgnoreTestSuites$1.evaluate(TestRuleIgnoreTestSuites.java:55)
	at com.carrotsearch.randomizedtesting.rules.StatementAdapter.evaluate(StatementAdapter.java:36)
	at com.carrotsearch.randomizedtesting.ThreadLeakControl$StatementRunner.run(ThreadLeakControl.java:358)
	at java.lang.Thread.run(Thread.java:722)


FAILED:  junit.framework.TestSuite.org.apache.solr.core.OpenCloseCoreStressTest

Error Message:
ERROR: SolrIndexSearcher opens=1894 closes=1893

Stack Trace:
java.lang.AssertionError: ERROR: SolrIndexSearcher opens=1894 closes=1893
	at __randomizedtesting.SeedInfo.seed([A5873DBB93C19062]:0)
	at org.junit.Assert.fail(Assert.java:93)
	at org.apache.solr.SolrTestCaseJ4.endTrackingSearchers(SolrTestCaseJ4.java:247)
	at org.apache.solr.SolrTestCaseJ4.afterClass(SolrTestCaseJ4.java:97)
	at sun.reflect.NativeMethodAccessorImpl.invoke0(Native Method)
	at sun.reflect.NativeMethodAccessorImpl.invoke(NativeMethodAccessorImpl.java:57)
	at sun.reflect.DelegatingMethodAccessorImpl.invoke(DelegatingMethodAccessorImpl.java:43)
	at java.lang.reflect.Method.invoke(Method.java:601)
	at com.carrotsearch.randomizedtesting.RandomizedRunner.invoke(RandomizedRunner.java:1559)
	at com.carrotsearch.randomizedtesting.RandomizedRunner.access$600(RandomizedRunner.java:79)
	at com.carrotsearch.randomizedtesting.RandomizedRunner$5.evaluate(RandomizedRunner.java:700)
	at com.carrotsearch.randomizedtesting.rules.StatementAdapter.evaluate(StatementAdapter.java:36)
	at com.carrotsearch.randomizedtesting.rules.SystemPropertiesRestoreRule$1.evaluate(SystemPropertiesRestoreRule.java:53)
	at org.apache.lucene.util.AbstractBeforeAfterRule$1.evaluate(AbstractBeforeAfterRule.java:46)
	at org.apache.lucene.util.TestRuleStoreClassName$1.evaluate(TestRuleStoreClassName.java:42)
	at com.carrotsearch.randomizedtesting.rules.SystemPropertiesInvariantRule$1.evaluate(SystemPropertiesInvariantRule.java:55)
	at com.carrotsearch.randomizedtesting.rules.NoShadowingOrOverridesOnMethodsRule$1.evaluate(NoShadowingOrOverridesOnMethodsRule.java:39)
	at com.carrotsearch.randomizedtesting.rules.NoShadowingOrOverridesOnMethodsRule$1.evaluate(NoShadowingOrOverridesOnMethodsRule.java:39)
	at com.carrotsearch.randomizedtesting.rules.StatementAdapter.evaluate(StatementAdapter.java:36)
	at org.apache.lucene.util.TestRuleAssertionsRequired$1.evaluate(TestRuleAssertionsRequired.java:43)
	at org.apache.lucene.util.TestRuleMarkFailure$1.evaluate(TestRuleMarkFailure.java:48)
	at org.apache.lucene.util.TestRuleIgnoreAfterMaxFailures$1.evaluate(TestRuleIgnoreAfterMaxFailures.java:70)
	at org.apache.lucene.util.TestRuleIgnoreTestSuites$1.evaluate(TestRuleIgnoreTestSuites.java:55)
	at com.carrotsearch.randomizedtesting.rules.StatementAdapter.evaluate(StatementAdapter.java:36)
	at com.carrotsearch.randomizedtesting.ThreadLeakControl$StatementRunner.run(ThreadLeakControl.java:358)
	at java.lang.Thread.run(Thread.java:722)


FAILED:  junit.framework.TestSuite.org.apache.solr.core.OpenCloseCoreStressTest

Error Message:
2 threads leaked from SUITE scope at org.apache.solr.core.OpenCloseCoreStressTest:     1) Thread[id=2466, name=searcherExecutor-3220-thread-1, state=WAITING, group=TGRP-OpenCloseCoreStressTest]         at sun.misc.Unsafe.park(Native Method)         at java.util.concurrent.locks.LockSupport.park(LockSupport.java:186)         at java.util.concurrent.locks.AbstractQueuedSynchronizer$ConditionObject.await(AbstractQueuedSynchronizer.java:2043)         at java.util.concurrent.LinkedBlockingQueue.take(LinkedBlockingQueue.java:442)         at java.util.concurrent.ThreadPoolExecutor.getTask(ThreadPoolExecutor.java:1068)         at java.util.concurrent.ThreadPoolExecutor.runWorker(ThreadPoolExecutor.java:1130)         at java.util.concurrent.ThreadPoolExecutor$Worker.run(ThreadPoolExecutor.java:615)         at java.lang.Thread.run(Thread.java:722)    2) Thread[id=2467, name=commitScheduler-3222-thread-1, state=WAITING, group=TGRP-OpenCloseCoreStressTest]         at sun.misc.Unsafe.park(Native Method)         at java.util.concurrent.locks.LockSupport.park(LockSupport.java:186)         at java.util.concurrent.locks.AbstractQueuedSynchronizer$ConditionObject.await(AbstractQueuedSynchronizer.java:2043)         at java.util.concurrent.ScheduledThreadPoolExecutor$DelayedWorkQueue.take(ScheduledThreadPoolExecutor.java:1079)         at java.util.concurrent.ScheduledThreadPoolExecutor$DelayedWorkQueue.take(ScheduledThreadPoolExecutor.java:807)         at java.util.concurrent.ThreadPoolExecutor.getTask(ThreadPoolExecutor.java:1068)         at java.util.concurrent.ThreadPoolExecutor.runWorker(ThreadPoolExecutor.java:1130)         at java.util.concurrent.ThreadPoolExecutor$Worker.run(ThreadPoolExecutor.java:615)         at java.lang.Thread.run(Thread.java:722)

Stack Trace:
com.carrotsearch.randomizedtesting.ThreadLeakError: 2 threads leaked from SUITE scope at org.apache.solr.core.OpenCloseCoreStressTest: 
   1) Thread[id=2466, name=searcherExecutor-3220-thread-1, state=WAITING, group=TGRP-OpenCloseCoreStressTest]
        at sun.misc.Unsafe.park(Native Method)
        at java.util.concurrent.locks.LockSupport.park(LockSupport.java:186)
        at java.util.concurrent.locks.AbstractQueuedSynchronizer$ConditionObject.await(AbstractQueuedSynchronizer.java:2043)
        at java.util.concurrent.LinkedBlockingQueue.take(LinkedBlockingQueue.java:442)
        at java.util.concurrent.ThreadPoolExecutor.getTask(ThreadPoolExecutor.java:1068)
        at java.util.concurrent.ThreadPoolExecutor.runWorker(ThreadPoolExecutor.java:1130)
        at java.util.concurrent.ThreadPoolExecutor$Worker.run(ThreadPoolExecutor.java:615)
        at java.lang.Thread.run(Thread.java:722)
   2) Thread[id=2467, name=commitScheduler-3222-thread-1, state=WAITING, group=TGRP-OpenCloseCoreStressTest]
        at sun.misc.Unsafe.park(Native Method)
        at java.util.concurrent.locks.LockSupport.park(LockSupport.java:186)
        at java.util.concurrent.locks.AbstractQueuedSynchronizer$ConditionObject.await(AbstractQueuedSynchronizer.java:2043)
        at java.util.concurrent.ScheduledThreadPoolExecutor$DelayedWorkQueue.take(ScheduledThreadPoolExecutor.java:1079)
        at java.util.concurrent.ScheduledThreadPoolExecutor$DelayedWorkQueue.take(ScheduledThreadPoolExecutor.java:807)
        at java.util.concurrent.ThreadPoolExecutor.getTask(ThreadPoolExecutor.java:1068)
        at java.util.concurrent.ThreadPoolExecutor.runWorker(ThreadPoolExecutor.java:1130)
        at java.util.concurrent.ThreadPoolExecutor$Worker.run(ThreadPoolExecutor.java:615)
        at java.lang.Thread.run(Thread.java:722)
	at __randomizedtesting.SeedInfo.seed([A5873DBB93C19062]:0)


FAILED:  junit.framework.TestSuite.org.apache.solr.core.OpenCloseCoreStressTest

Error Message:
There are still zombie threads that couldn't be terminated:    1) Thread[id=2466, name=searcherExecutor-3220-thread-1, state=WAITING, group=TGRP-OpenCloseCoreStressTest]         at sun.misc.Unsafe.park(Native Method)         at java.util.concurrent.locks.LockSupport.park(LockSupport.java:186)         at java.util.concurrent.locks.AbstractQueuedSynchronizer$ConditionObject.await(AbstractQueuedSynchronizer.java:2043)         at java.util.concurrent.LinkedBlockingQueue.take(LinkedBlockingQueue.java:442)         at java.util.concurrent.ThreadPoolExecutor.getTask(ThreadPoolExecutor.java:1068)         at java.util.concurrent.ThreadPoolExecutor.runWorker(ThreadPoolExecutor.java:1130)         at java.util.concurrent.ThreadPoolExecutor$Worker.run(ThreadPoolExecutor.java:615)         at java.lang.Thread.run(Thread.java:722)    2) Thread[id=2467, name=commitScheduler-3222-thread-1, state=WAITING, group=TGRP-OpenCloseCoreStressTest]         at sun.misc.Unsafe.park(Native Method)         at java.util.concurrent.locks.LockSupport.park(LockSupport.java:186)         at java.util.concurrent.locks.AbstractQueuedSynchronizer$ConditionObject.await(AbstractQueuedSynchronizer.java:2043)         at java.util.concurrent.ScheduledThreadPoolExecutor$DelayedWorkQueue.take(ScheduledThreadPoolExecutor.java:1079)         at java.util.concurrent.ScheduledThreadPoolExecutor$DelayedWorkQueue.take(ScheduledThreadPoolExecutor.java:807)         at java.util.concurrent.ThreadPoolExecutor.getTask(ThreadPoolExecutor.java:1068)         at java.util.concurrent.ThreadPoolExecutor.runWorker(ThreadPoolExecutor.java:1130)         at java.util.concurrent.ThreadPoolExecutor$Worker.run(ThreadPoolExecutor.java:615)         at java.lang.Thread.run(Thread.java:722)

Stack Trace:
com.carrotsearch.randomizedtesting.ThreadLeakError: There are still zombie threads that couldn't be terminated:
   1) Thread[id=2466, name=searcherExecutor-3220-thread-1, state=WAITING, group=TGRP-OpenCloseCoreStressTest]
        at sun.misc.Unsafe.park(Native Method)
        at java.util.concurrent.locks.LockSupport.park(LockSupport.java:186)
        at java.util.concurrent.locks.AbstractQueuedSynchronizer$ConditionObject.await(AbstractQueuedSynchronizer.java:2043)
        at java.util.concurrent.LinkedBlockingQueue.take(LinkedBlockingQueue.java:442)
        at java.util.concurrent.ThreadPoolExecutor.getTask(ThreadPoolExecutor.java:1068)
        at java.util.concurrent.ThreadPoolExecutor.runWorker(ThreadPoolExecutor.java:1130)
        at java.util.concurrent.ThreadPoolExecutor$Worker.run(ThreadPoolExecutor.java:615)
        at java.lang.Thread.run(Thread.java:722)
   2) Thread[id=2467, name=commitScheduler-3222-thread-1, state=WAITING, group=TGRP-OpenCloseCoreStressTest]
        at sun.misc.Unsafe.park(Native Method)
        at java.util.concurrent.locks.LockSupport.park(LockSupport.java:186)
        at java.util.concurrent.locks.AbstractQueuedSynchronizer$ConditionObject.await(AbstractQueuedSynchronizer.java:2043)
        at java.util.concurrent.ScheduledThreadPoolExecutor$DelayedWorkQueue.take(ScheduledThreadPoolExecutor.java:1079)
        at java.util.concurrent.ScheduledThreadPoolExecutor$DelayedWorkQueue.take(ScheduledThreadPoolExecutor.java:807)
        at java.util.concurrent.ThreadPoolExecutor.getTask(ThreadPoolExecutor.java:1068)
        at java.util.concurrent.ThreadPoolExecutor.runWorker(ThreadPoolExecutor.java:1130)
        at java.util.concurrent.ThreadPoolExecutor$Worker.run(ThreadPoolExecutor.java:615)
        at java.lang.Thread.run(Thread.java:722)
	at __randomizedtesting.SeedInfo.seed([A5873DBB93C19062]:0)


REGRESSION:  org.apache.solr.handler.component.DistributedSpellCheckComponentTest.testDistribSearch

Error Message:
Captured an uncaught exception in thread: Thread[id=248, name=Thread-172, state=RUNNABLE, group=TGRP-DistributedSpellCheckComponentTest]

Stack Trace:
com.carrotsearch.randomizedtesting.UncaughtExceptionError: Captured an uncaught exception in thread: Thread[id=248, name=Thread-172, state=RUNNABLE, group=TGRP-DistributedSpellCheckComponentTest]
	at __randomizedtesting.SeedInfo.seed([A5873DBB93C19062:2461B3A3E49EF05E]:0)
Caused by: java.lang.RuntimeException: org.apache.solr.client.solrj.SolrServerException: Timeout occured while waiting response from server at: http://127.0.0.1:27212
	at __randomizedtesting.SeedInfo.seed([A5873DBB93C19062]:0)
	at org.apache.solr.BaseDistributedSearchTestCase$5.run(BaseDistributedSearchTestCase.java:525)
Caused by: org.apache.solr.client.solrj.SolrServerException: Timeout occured while waiting response from server at: http://127.0.0.1:27212
	at org.apache.solr.client.solrj.impl.HttpSolrServer.request(HttpSolrServer.java:412)
	at org.apache.solr.client.solrj.impl.HttpSolrServer.request(HttpSolrServer.java:181)
	at org.apache.solr.client.solrj.request.QueryRequest.process(QueryRequest.java:90)
	at org.apache.solr.client.solrj.SolrServer.query(SolrServer.java:301)
	at org.apache.solr.BaseDistributedSearchTestCase$5.run(BaseDistributedSearchTestCase.java:520)
Caused by: java.net.SocketTimeoutException: Read timed out
	at java.net.SocketInputStream.socketRead0(Native Method)
	at java.net.SocketInputStream.read(SocketInputStream.java:150)
	at java.net.SocketInputStream.read(SocketInputStream.java:121)
	at org.apache.http.impl.io.AbstractSessionInputBuffer.fillBuffer(AbstractSessionInputBuffer.java:166)
	at org.apache.http.impl.io.SocketInputBuffer.fillBuffer(SocketInputBuffer.java:90)
	at org.apache.http.impl.io.AbstractSessionInputBuffer.readLine(AbstractSessionInputBuffer.java:281)
	at org.apache.http.impl.conn.DefaultHttpResponseParser.parseHead(DefaultHttpResponseParser.java:92)
	at org.apache.http.impl.conn.DefaultHttpResponseParser.parseHead(DefaultHttpResponseParser.java:62)
	at org.apache.http.impl.io.AbstractMessageParser.parse(AbstractMessageParser.java:254)
	at org.apache.http.impl.AbstractHttpClientConnection.receiveResponseHeader(AbstractHttpClientConnection.java:289)
	at org.apache.http.impl.conn.DefaultClientConnection.receiveResponseHeader(DefaultClientConnection.java:252)
	at org.apache.http.impl.conn.ManagedClientConnectionImpl.receiveResponseHeader(ManagedClientConnectionImpl.java:191)
	at org.apache.http.protocol.HttpRequestExecutor.doReceiveResponse(HttpRequestExecutor.java:300)
	at org.apache.http.protocol.HttpRequestExecutor.execute(HttpRequestExecutor.java:127)
	at org.apache.http.impl.client.DefaultRequestDirector.tryExecute(DefaultRequestDirector.java:717)
	at org.apache.http.impl.client.DefaultRequestDirector.execute(DefaultRequestDirector.java:522)
	at org.apache.http.impl.client.AbstractHttpClient.execute(AbstractHttpClient.java:906)
	at org.apache.http.impl.client.AbstractHttpClient.execute(AbstractHttpClient.java:805)
	at org.apache.http.impl.client.AbstractHttpClient.execute(AbstractHttpClient.java:784)
	at org.apache.solr.client.solrj.impl.HttpSolrServer.request(HttpSolrServer.java:353)
	... 4 more




Build Log:
[...truncated 8918 lines...]
[junit4:junit4] Suite: org.apache.solr.handler.component.DistributedSpellCheckComponentTest
[junit4:junit4]   2> 0 T33 oas.BaseDistributedSearchTestCase.initHostContext Setting hostContext system property: /
[junit4:junit4]   2> 6 T33 oas.SolrTestCaseJ4.setUp ###Starting testDistribSearch
[junit4:junit4]   2> 8 T33 oejs.Server.doStart jetty-8.1.8.v20121106
[junit4:junit4]   2> 13 T33 oejs.AbstractConnector.doStart Started SocketConnector@127.0.0.1:36167
[junit4:junit4]   2> 13 T33 oass.SolrDispatchFilter.init SolrDispatchFilter.init()
[junit4:junit4]   2> 14 T33 oasc.SolrResourceLoader.locateSolrHome JNDI not configured for solr (NoInitialContextEx)
[junit4:junit4]   2> 14 T33 oasc.SolrResourceLoader.locateSolrHome using system property solr.solr.home: /usr/home/hudson/hudson-slave/workspace/Lucene-Solr-NightlyTests-trunk/solr/build/solr-core/test-files/solr
[junit4:junit4]   2> 15 T33 oasc.CoreContainer$Initializer.initialize looking for solr config file: /usr/home/hudson/hudson-slave/workspace/Lucene-Solr-NightlyTests-trunk/solr/build/solr-core/test-files/solr/solr.xml
[junit4:junit4]   2> 15 T33 oasc.CoreContainer.<init> New CoreContainer 1088183477
[junit4:junit4]   2> 16 T33 oasc.CoreContainer.load Loading CoreContainer using Solr Home: '/usr/home/hudson/hudson-slave/workspace/Lucene-Solr-NightlyTests-trunk/solr/build/solr-core/test-files/solr/'
[junit4:junit4]   2> 17 T33 oasc.SolrResourceLoader.<init> new SolrResourceLoader for directory: '/usr/home/hudson/hudson-slave/workspace/Lucene-Solr-NightlyTests-trunk/solr/build/solr-core/test-files/solr/'
[junit4:junit4]   2> 75 T33 oashc.HttpShardHandlerFactory.getParameter Setting socketTimeout to: 120000
[junit4:junit4]   2> 76 T33 oashc.HttpShardHandlerFactory.getParameter Setting urlScheme to: http://
[junit4:junit4]   2> 76 T33 oashc.HttpShardHandlerFactory.getParameter Setting connTimeout to: 15000
[junit4:junit4]   2> 77 T33 oashc.HttpShardHandlerFactory.getParameter Setting maxConnectionsPerHost to: 20
[junit4:junit4]   2> 77 T33 oashc.HttpShardHandlerFactory.getParameter Setting corePoolSize to: 0
[junit4:junit4]   2> 78 T33 oashc.HttpShardHandlerFactory.getParameter Setting maximumPoolSize to: 2147483647
[junit4:junit4]   2> 78 T33 oashc.HttpShardHandlerFactory.getParameter Setting maxThreadIdleTime to: 5
[junit4:junit4]   2> 79 T33 oashc.HttpShardHandlerFactory.getParameter Setting sizeOfQueue to: -1
[junit4:junit4]   2> 79 T33 oashc.HttpShardHandlerFactory.getParameter Setting fairnessPolicy to: false
[junit4:junit4]   2> 80 T33 oascsi.HttpClientUtil.createClient Creating new http client, config:maxConnectionsPerHost=20&maxConnections=10000&socketTimeout=120000&connTimeout=15000&retry=false
[junit4:junit4]   2> 153 T33 oasc.CoreContainer.load Registering Log Listener
[junit4:junit4]   2> 174 T43 oasc.CoreContainer.create Creating SolrCore 'collection1' using instanceDir: /usr/home/hudson/hudson-slave/workspace/Lucene-Solr-NightlyTests-trunk/solr/build/solr-core/test-files/solr/collection1
[junit4:junit4]   2> 175 T43 oasc.SolrResourceLoader.<init> new SolrResourceLoader for directory: '/usr/home/hudson/hudson-slave/workspace/Lucene-Solr-NightlyTests-trunk/solr/build/solr-core/test-files/solr/collection1/'
[junit4:junit4]   2> 177 T43 oasc.SolrResourceLoader.replaceClassLoader Adding 'file:/usr/home/hudson/hudson-slave/workspace/Lucene-Solr-NightlyTests-trunk/solr/build/solr-core/test-files/solr/collection1/lib/README' to classloader
[junit4:junit4]   2> 177 T43 oasc.SolrResourceLoader.replaceClassLoader Adding 'file:/usr/home/hudson/hudson-slave/workspace/Lucene-Solr-NightlyTests-trunk/solr/build/solr-core/test-files/solr/collection1/lib/classes/' to classloader
[junit4:junit4]   2> 247 T43 oasc.SolrConfig.<init> Using Lucene MatchVersion: LUCENE_50
[junit4:junit4]   2> 329 T43 oasc.SolrConfig.<init> Loaded SolrConfig: solrconfig.xml
[junit4:junit4]   2> 331 T43 oass.IndexSchema.readSchema Reading Solr Schema
[junit4:junit4]   2> 382 T43 oass.IndexSchema.readSchema Schema name=test
[junit4:junit4]   2> 1830 T43 oass.OpenExchangeRatesOrgProvider.init Initialized with rates=open-exchange-rates.json, refreshInterval=1440.
[junit4:junit4]   2> 1857 T43 oass.IndexSchema.readSchema default search field in schema is text
[junit4:junit4]   2> 1861 T43 oass.IndexSchema.readSchema unique key field: id
[junit4:junit4]   2> 1918 T43 oass.FileExchangeRateProvider.reload Reloading exchange rates from file currency.xml
[junit4:junit4]   2> 1937 T43 oass.FileExchangeRateProvider.reload Reloading exchange rates from file currency.xml
[junit4:junit4]   2> 1944 T43 oass.OpenExchangeRatesOrgProvider.reload Reloading exchange rates from open-exchange-rates.json
[junit4:junit4]   2> 1949 T43 oass.OpenExchangeRatesOrgProvider$OpenExchangeRates.<init> WARNING Unknown key IMPORTANT NOTE
[junit4:junit4]   2> 1950 T43 oass.OpenExchangeRatesOrgProvider$OpenExchangeRates.<init> WARNING Expected key, got STRING
[junit4:junit4]   2> 1951 T43 oass.OpenExchangeRatesOrgProvider.reload Reloading exchange rates from open-exchange-rates.json
[junit4:junit4]   2> 1952 T43 oass.OpenExchangeRatesOrgProvider$OpenExchangeRates.<init> WARNING Unknown key IMPORTANT NOTE
[junit4:junit4]   2> 1953 T43 oass.OpenExchangeRatesOrgProvider$OpenExchangeRates.<init> WARNING Expected key, got STRING
[junit4:junit4]   2> 1954 T43 oasc.SolrCore.initDirectoryFactory solr.StandardDirectoryFactory
[junit4:junit4]   2> 2009 T43 oasc.SolrCore.<init> [collection1] Opening new SolrCore at /usr/home/hudson/hudson-slave/workspace/Lucene-Solr-NightlyTests-trunk/solr/build/solr-core/test-files/solr/collection1/, dataDir=./org.apache.solr.handler.component.DistributedSpellCheckComponentTest-1363616446779/control/data/
[junit4:junit4]   2> 2009 T43 oasc.JmxMonitoredMap.<init> JMX monitoring is enabled. Adding Solr mbeans to JMX Server: com.sun.jmx.mbeanserver.JmxMBeanServer@85379bc
[junit4:junit4]   2> 2011 T43 oasc.SolrCore.initDirectoryFactory solr.StandardDirectoryFactory
[junit4:junit4]   2> 2012 T43 oasc.CachingDirectoryFactory.get return new directory for /usr/home/hudson/hudson-slave/workspace/Lucene-Solr-NightlyTests-trunk/solr/build/solr-core/test/J0/org.apache.solr.handler.component.DistributedSpellCheckComponentTest-1363616446779/control/data forceNew: false
[junit4:junit4]   2> 2013 T43 oasc.SolrCore.getNewIndexDir New index directory detected: old=null new=./org.apache.solr.handler.component.DistributedSpellCheckComponentTest-1363616446779/control/data/index/
[junit4:junit4]   2> 2014 T43 oasc.SolrCore.initIndex WARNING [collection1] Solr index directory './org.apache.solr.handler.component.DistributedSpellCheckComponentTest-1363616446779/control/data/index' doesn't exist. Creating new index...
[junit4:junit4]   2> 2016 T43 oasc.CachingDirectoryFactory.get return new directory for /usr/home/hudson/hudson-slave/workspace/Lucene-Solr-NightlyTests-trunk/solr/build/solr-core/test/J0/org.apache.solr.handler.component.DistributedSpellCheckComponentTest-1363616446779/control/data/index forceNew: false
[junit4:junit4]   2> 2037 T43 oasc.SolrDeletionPolicy.onCommit SolrDeletionPolicy.onCommit: commits:num=1
[junit4:junit4]   2> 		commit{dir=RateLimitedDirectoryWrapper(org.apache.lucene.store.NIOFSDirectory@/usr/home/hudson/hudson-slave/workspace/Lucene-Solr-NightlyTests-trunk/solr/build/solr-core/test/J0/org.apache.solr.handler.component.DistributedSpellCheckComponentTest-1363616446779/control/data/index lockFactory=org.apache.lucene.store.NativeFSLockFactory@5beb1172),segFN=segments_1,generation=1,filenames=[segments_1]
[junit4:junit4]   2> 2037 T43 oasc.SolrDeletionPolicy.updateCommits newest commit = 1[segments_1]
[junit4:junit4]   2> 2038 T43 oasc.SolrCore.initWriters created xml: solr.XMLResponseWriter
[junit4:junit4]   2> 2041 T43 oasup.UpdateRequestProcessorChain.init inserting DistributedUpdateProcessorFactory into updateRequestProcessorChain "dedupe"
[junit4:junit4]   2> 2042 T43 oasup.UpdateRequestProcessorChain.init inserting DistributedUpdateProcessorFactory into updateRequestProcessorChain "dedupe-allfields"
[junit4:junit4]   2> 2043 T43 oasup.UpdateRequestProcessorChain.init inserting DistributedUpdateProcessorFactory into updateRequestProcessorChain "stored_sig"
[junit4:junit4]   2> 2044 T43 oasup.UpdateRequestProcessorChain.init inserting DistributedUpdateProcessorFactory into updateRequestProcessorChain "uniq-fields"
[junit4:junit4]   2> 2045 T43 oasup.UpdateRequestProcessorChain.init inserting DistributedUpdateProcessorFactory into updateRequestProcessorChain "distrib-dup-test-chain-implicit"
[junit4:junit4]   2> 2045 T43 oasc.RequestHandlers.initHandlersFromConfig adding lazy requestHandler: solr.ReplicationHandler
[junit4:junit4]   2> 2046 T43 oasc.RequestHandlers.initHandlersFromConfig created /replication: solr.ReplicationHandler
[junit4:junit4]   2> 2047 T43 oasc.RequestHandlers.initHandlersFromConfig created standard: solr.StandardRequestHandler
[junit4:junit4]   2> 2048 T43 oasc.RequestHandlers.initHandlersFromConfig created /get: solr.RealTimeGetHandler
[junit4:junit4]   2> 2049 T43 oasc.RequestHandlers.initHandlersFromConfig created dismax: solr.SearchHandler
[junit4:junit4]   2> 2049 T43 oasc.RequestHandlers.initHandlersFromConfig created mock: org.apache.solr.core.MockQuerySenderListenerReqHandler
[junit4:junit4]   2> 2050 T43 oasc.RequestHandlers.initHandlersFromConfig created /admin/: org.apache.solr.handler.admin.AdminHandlers
[junit4:junit4]   2> 2051 T43 oasc.RequestHandlers.initHandlersFromConfig created defaults: solr.StandardRequestHandler
[junit4:junit4]   2> 2051 T43 oasc.RequestHandlers.initHandlersFromConfig adding lazy requestHandler: solr.StandardRequestHandler
[junit4:junit4]   2> 2052 T43 oasc.RequestHandlers.initHandlersFromConfig created lazy: solr.StandardRequestHandler
[junit4:junit4]   2> 2053 T43 oasc.RequestHandlers.initHandlersFromConfig created /update: solr.UpdateRequestHandler
[junit4:junit4]   2> 2053 T43 oasc.RequestHandlers.initHandlersFromConfig created /terms: org.apache.solr.handler.component.SearchHandler
[junit4:junit4]   2> 2054 T43 oasc.RequestHandlers.initHandlersFromConfig created spellCheckCompRH: org.apache.solr.handler.component.SearchHandler
[junit4:junit4]   2> 2055 T43 oasc.RequestHandlers.initHandlersFromConfig created spellCheckCompRH_Direct: org.apache.solr.handler.component.SearchHandler
[junit4:junit4]   2> 2056 T43 oasc.RequestHandlers.initHandlersFromConfig created spellCheckWithWordbreak: org.apache.solr.handler.component.SearchHandler
[junit4:junit4]   2> 2057 T43 oasc.RequestHandlers.initHandlersFromConfig created spellCheckWithWordbreak_Direct: org.apache.solr.handler.component.SearchHandler
[junit4:junit4]   2> 2058 T43 oasc.RequestHandlers.initHandlersFromConfig created spellCheckCompRH1: org.apache.solr.handler.component.SearchHandler
[junit4:junit4]   2> 2059 T43 oasc.RequestHandlers.initHandlersFromConfig created mltrh: org.apache.solr.handler.component.SearchHandler
[junit4:junit4]   2> 2059 T43 oasc.RequestHandlers.initHandlersFromConfig created tvrh: org.apache.solr.handler.component.SearchHandler
[junit4:junit4]   2> 2060 T43 oasc.RequestHandlers.initHandlersFromConfig created /mlt: solr.MoreLikeThisHandler
[junit4:junit4]   2> 2061 T43 oasc.RequestHandlers.initHandlersFromConfig created /debug/dump: solr.DumpRequestHandler
[junit4:junit4]   2> 2075 T43 oashl.XMLLoader.init xsltCacheLifetimeSeconds=60
[junit4:junit4]   2> 2080 T43 oasc.SolrCore.initDeprecatedSupport WARNING solrconfig.xml uses deprecated <admin/gettableFiles>, Please update your config to use the ShowFileRequestHandler.
[junit4:junit4]   2> 2082 T43 oasc.SolrCore.initDeprecatedSupport WARNING adding ShowFileRequestHandler with hidden files: [THROW.ERROR.ON.ADD.UPDATEPROCESSOR.JS, SOLRCONFIG-HIGHLIGHT.XML, SCHEMA-REQUIRED-FIELDS.XML, SCHEMA-REPLICATION2.XML, BAD-SCHEMA-DUP-DYNAMICFIELD.XML, SCHEMA-MINIMAL.XML, TRIVIAL.UPDATEPROCESSOR1.JS, BAD-SCHEMA-DOCVALUES-NOT-REQUIRED-NO-DEFAULT.XML, SOLRCONFIG-CACHING.XML, SCHEMA-POSTINGSHIGHLIGHT.XML, SOLRCONFIG-REPEATER.XML, REGEX-BOOST-PROCESSOR-TEST.TXT, BAD-SCHEMA-NONTEXT-ANALYZER.XML, CURRENCY.XML, BAD-SCHEMA-CURRENCY-FT-BOGUS-CODE-IN-XML.XML, SOLRCONFIG-MERGEPOLICY.XML, SOLRCONFIG-TLOG.XML, SOLRCONFIG-MASTER.XML, SOLRCONFIG-COMPONENTS-NAME.XML, BAD-SCHEMA-UNIQUEKEY-MULTIVALUED.XML, SCHEMA11.XML, SOLRCONFIG-BASIC.XML, DA_COMPOUNDDICTIONARY.TXT, MISSLEADING.EXTENSION.UPDATEPROCESSOR.JS.TXT, SCHEMA-COPYFIELD-TEST.XML, SOLRCONFIG-SLAVE.XML, SOLRCONFIG-PROPINJECT-INDEXDEFAULT.XML, ELEVATE.XML, TRIVIAL.UPDATEPROCESSOR0.JS, SCHEMA-SWEETSPOT.XML, BAD-SOLRCONFIG-BOGUS-SCRIPTENGINE-NAME.XML, SCHEMA-CHARFILTERS.XML, SCHEMA-IB.XML, SOLRCONFIG-QUERYSENDER.XML, SOLRCONFIG-SNIPPET-PROCESSOR.XML, SCHEMA-REPLICATION1.XML, DA_UTF8.XML, CONDITIONAL.UPDATEPROCESSOR.JS, SCHEMA-TINY.XML, MISSING.FUNCTIONS.UPDATEPROCESSOR.JS, HYPHENATION.DTD, SOLRCONFIG-ENABLEPLUGIN.XML, STEMDICT.TXT, SCHEMA-PHRASESUGGEST.XML, HUNSPELL-TEST.AFF, BAD-SCHEMA-CURRENCY-FT-OER-NORATES.XML, SCHEMA-SNIPPET-TYPE.XML, STOPTYPES-1.TXT, STOPWORDSWRONGENCODING.TXT, SCHEMA-NUMERIC.XML, SOLRCONFIG-TRANSFORMERS.XML, SOLRCONFIG-PROPINJECT.XML, BAD-SCHEMA-NOT-INDEXED-BUT-TF.XML, SOLRCONFIG-SIMPLELOCK.XML, SCHEMA-DOCVALUES.XML, WDFTYPES.TXT, STOPTYPES-2.TXT, SCHEMA-REVERSED.XML, BAD-SCHEMA-CURRENCY-FT-MULTIVALUED.XML, SOLRCONFIG-SPELLCHECKCOMPONENT.XML, BAD-SCHEMA-CURRENCY-MULTIVALUED.XML, SCHEMA-DFR.XML, SOLRCONFIG-PHRASESUGGEST.XML, BAD-SCHEMA-NOT-INDEXED-BUT-POS.XML, KEEP-1.TXT, OPEN-EXCHANGE-RATES.JSON, SCHEMA-SPATIAL.XML, STOPWITHBOM.TXT, SOLRCONFIG-SPELLCHECKER.XML, SCHEMA-BINARYFIELD.XML, SOLRCONFIG-POSTINGSHIGHLIGHT.XML, SOLRCONFIG-UPDATE-PROCESSOR-CHAINS.XML, BAD-SCHEMA-OMIT-TF-BUT-NOT-POS.XML, BAD-SCHEMA-DUP-FIELDTYPE.XML, SCHEMA-XINCLUDE.XML, SOLRCONFIG-MASTER1.XML, SCHEMA-BEHAVIOR.XML, SYNONYMS.TXT, SOLRCONFIG-MINIMAL.XML, SCHEMA-DOCVALUESMULTI.XML, BAD-SCHEMA-CURRENCY-DYNAMIC-MULTIVALUED.XML, BAD-SCHEMA-UNSUPPORTED-DOCVALUES.XML, SCHEMA_CODEC.XML, BAD-SCHEMA-SWEETSPOT-PARTIAL-HYPERBOLIC.XML, SOLRCONFIG-SOLR-749.XML, SCHEMA-EFF.XML, SOLRCONFIG-MASTER1-KEEPONEBACKUP.XML, SOLRCONFIG-FUNCTIONQUERY.XML, STOP-2.TXT, SOLRCONFIG-TERMINDEX.XML, SCHEMA-LMDIRICHLET.XML, SOLRCONFIG-ELEVATE.XML, BAD-SCHEMA-SWEETSPOT-PARTIAL-NORMS.XML, BAD-SCHEMA-SWEETSPOT-PARTIAL-BASELINE.XML, STOPWORDS.TXT, SCHEMA-FOLDING.XML, SCHEMA-STOP-KEEP.XML, FUZZYSUGGEST.TXT, BAD-SCHEMA-NOT-INDEXED-BUT-NORMS.XML, SCHEMA-REST.XML, SOLRCONFIG-SOLCOREPROPERTIES.XML, STOP-1.TXT, SOLRCONFIG-MASTER2.XML, SCHEMA-SPELLCHECKER.XML, SOLRCONFIG-RESPONSE-LOG-COMPONENT.XML, SOLRCONFIG-LAZYWRITER.XML, SCHEMA-LUCENEMATCHVERSION.XML, BAD-MP-SOLRCONFIG.XML, FRENCHARTICLES.TXT, SCHEMA15.XML, SOLRCONFIG-REQHANDLER.INCL, SCHEMASURROUND.XML, SOLRCONFIG-MASTER3.XML, HUNSPELL-TEST.DIC, BAD-SCHEMA-CODEC-GLOBAL-VS-FT-MISMATCH.XML, SOLRCONFIG-XINCLUDE.XML, SOLRCONFIG-SLAVE1.XML, SOLRCONFIG-DELPOLICY1.XML, SCHEMA-SIM.XML, SCHEMA-SNIPPET-FIELD.XML, SCHEMA-COLLATE.XML, STOP-SNOWBALL.TXT, BAD-SCHEMA-SIM-GLOBAL-VS-FT-MISMATCH.XML, PROTWORDS.TXT, SCHEMA-TRIE.XML, SOLRCONFIG_CODEC.XML, SCHEMA-SYNONYM-TOKENIZER.XML, BAD-SOLRCONFIG-INVALID-SCRIPTFILE.XML, JASUGGEST.TXT, SCHEMA-DOCVALUESFACETING.XML, SCHEMA-TFIDF.XML, SOLRCONFIG-SCRIPT-UPDATEPROCESSOR.XML, SCHEMA-LMJELINEKMERCER.XML, PHRASESUGGEST.TXT, BAD-SOLRCONFIG-MISSING-SCRIPTFILE.XML, BAD-SCHEMA-UNIQUEKEY-USES-DEFAULT.XML, OLD_SYNONYMS.TXT, SOLRCONFIG-DELPOLICY2.XML, XSLT, SOLRCONFIG-NATIVELOCK.XML, BAD-SCHEMA-DUP-FIELD.XML, SOLRCONFIG-NOCACHE.XML, SCHEMA-BM25.XML, BAD-SCHEMA-SWEETSPOT-BOTH-TF.XML, ADDFIELDS.UPDATEPROCESSOR.JS, SOLRCONFIG-QUERYSENDER-NOQUERY.XML, SOLRCONFIG-ALTDIRECTORY.XML, COMPOUNDDICTIONARY.TXT, BAD-SCHEMA-CURRENCY-FT-BOGUS-DEFAULT-CODE.XML, BAD-CURRENCY.XML, SOLRCONFIG-INDEXCONFIG.XML, SOLRCONFIG_PERF.XML, BAD-SCHEMA-ANALYZER-CLASS-AND-NESTED.XML, SCHEMA-NOT-REQUIRED-UNIQUE-KEY.XML, KEEP-2.TXT, BAD-SCHEMA-UNIQUEKEY-IS-COPYFIELD-DEST.XML, SCHEMA12.XML, MAPPING-ISOLATIN1ACCENT.TXT, BAD_SOLRCONFIG.XML, BAD-SCHEMA-EXTERNAL-FILEFIELD.XML]
[junit4:junit4]   2> 2089 T43 oass.SolrIndexSearcher.<init> Opening Searcher@6b117085 main
[junit4:junit4]   2> 2090 T43 oasu.CommitTracker.<init> Hard AutoCommit: disabled
[junit4:junit4]   2> 2090 T43 oasu.CommitTracker.<init> Soft AutoCommit: disabled
[junit4:junit4]   2> 2091 T43 oashc.SpellCheckComponent.inform Initializing spell checkers
[junit4:junit4]   2> 2101 T43 oass.DirectSolrSpellChecker.init init: {name=direct,classname=DirectSolrSpellChecker,field=lowerfilt,minQueryLength=3}
[junit4:junit4]   2> 2169 T44 oasc.SolrCore.registerSearcher [collection1] Registered new searcher Searcher@6b117085 main{StandardDirectoryReader(segments_1:1)}
[junit4:junit4]   2> 2187 T43 oasc.CoreContainer.registerCore registering core: collection1
[junit4:junit4]   2> 2188 T33 oass.SolrDispatchFilter.init user.dir=/usr/home/hudson/hudson-slave/workspace/Lucene-Solr-NightlyTests-trunk/solr/build/solr-core/test/J0
[junit4:junit4]   2> 2189 T33 oass.SolrDispatchFilter.init SolrDispatchFilter.init() done
[junit4:junit4]   2> 2317 T33 oascsi.HttpClientUtil.createClient Creating new http client, config:maxConnections=128&maxConnectionsPerHost=32&followRedirects=false
[junit4:junit4]   2> 2349 T33 oejs.Server.doStart jetty-8.1.8.v20121106
[junit4:junit4]   2> 2353 T33 oejs.AbstractConnector.doStart Started SocketConnector@127.0.0.1:27176
[junit4:junit4]   2> 2354 T33 oass.SolrDispatchFilter.init SolrDispatchFilter.init()
[junit4:junit4]   2> 2354 T33 oasc.SolrResourceLoader.locateSolrHome JNDI not configured for solr (NoInitialContextEx)
[junit4:junit4]   2> 2355 T33 oasc.SolrResourceLoader.locateSolrHome using system property solr.solr.home: /usr/home/hudson/hudson-slave/workspace/Lucene-Solr-NightlyTests-trunk/solr/build/solr-core/test-files/solr
[junit4:junit4]   2> 2356 T33 oasc.CoreContainer$Initializer.initialize looking for solr config file: /usr/home/hudson/hudson-slave/workspace/Lucene-Solr-NightlyTests-trunk/solr/build/solr-core/test-files/solr/solr.xml
[junit4:junit4]   2> 2356 T33 oasc.CoreContainer.<init> New CoreContainer 880070643
[junit4:junit4]   2> 2357 T33 oasc.CoreContainer.load Loading CoreContainer using Solr Home: '/usr/home/hudson/hudson-slave/workspace/Lucene-Solr-NightlyTests-trunk/solr/build/solr-core/test-files/solr/'
[junit4:junit4]   2> 2358 T33 oasc.SolrResourceLoader.<init> new SolrResourceLoader for directory: '/usr/home/hudson/hudson-slave/workspace/Lucene-Solr-NightlyTests-trunk/solr/build/solr-core/test-files/solr/'
[junit4:junit4]   2> 2429 T33 oashc.HttpShardHandlerFactory.getParameter Setting socketTimeout to: 120000
[junit4:junit4]   2> 2430 T33 oashc.HttpShardHandlerFactory.getParameter Setting urlScheme to: http://
[junit4:junit4]   2> 2431 T33 oashc.HttpShardHandlerFactory.getParameter Setting connTimeout to: 15000
[junit4:junit4]   2> 2431 T33 oashc.HttpShardHandlerFactory.getParameter Setting maxConnectionsPerHost to: 20
[junit4:junit4]   2> 2432 T33 oashc.HttpShardHandlerFactory.getParameter Setting corePoolSize to: 0
[junit4:junit4]   2> 2432 T33 oashc.HttpShardHandlerFactory.getParameter Setting maximumPoolSize to: 2147483647
[junit4:junit4]   2> 2433 T33 oashc.HttpShardHandlerFactory.getParameter Setting maxThreadIdleTime to: 5
[junit4:junit4]   2> 2433 T33 oashc.HttpShardHandlerFactory.getParameter Setting sizeOfQueue to: -1
[junit4:junit4]   2> 2434 T33 oashc.HttpShardHandlerFactory.getParameter Setting fairnessPolicy to: false
[junit4:junit4]   2> 2435 T33 oascsi.HttpClientUtil.createClient Creating new http client, config:maxConnectionsPerHost=20&maxConnections=10000&socketTimeout=120000&connTimeout=15000&retry=false
[junit4:junit4]   2> 2458 T33 oasc.CoreContainer.load Registering Log Listener
[junit4:junit4]   2> 2490 T55 oasc.CoreContainer.create Creating SolrCore 'collection1' using instanceDir: /usr/home/hudson/hudson-slave/workspace/Lucene-Solr-NightlyTests-trunk/solr/build/solr-core/test-files/solr/collection1
[junit4:junit4]   2> 2491 T55 oasc.SolrResourceLoader.<init> new SolrResourceLoader for directory: '/usr/home/hudson/hudson-slave/workspace/Lucene-Solr-NightlyTests-trunk/solr/build/solr-core/test-files/solr/collection1/'
[junit4:junit4]   2> 2493 T55 oasc.SolrResourceLoader.replaceClassLoader Adding 'file:/usr/home/hudson/hudson-slave/workspace/Lucene-Solr-NightlyTests-trunk/solr/build/solr-core/test-files/solr/collection1/lib/README' to classloader
[junit4:junit4]   2> 2494 T55 oasc.SolrResourceLoader.replaceClassLoader Adding 'file:/usr/home/hudson/hudson-slave/workspace/Lucene-Solr-NightlyTests-trunk/solr/build/solr-core/test-files/solr/collection1/lib/classes/' to classloader
[junit4:junit4]   2> 2579 T55 oasc.SolrConfig.<init> Using Lucene MatchVersion: LUCENE_50
[junit4:junit4]   2> 2670 T55 oasc.SolrConfig.<init> Loaded SolrConfig: solrconfig.xml
[junit4:junit4]   2> 2671 T55 oass.IndexSchema.readSchema Reading Solr Schema
[junit4:junit4]   2> 2713 T55 oass.IndexSchema.readSchema Schema name=test
[junit4:junit4]   2> 3735 T55 oass.OpenExchangeRatesOrgProvider.init Initialized with rates=open-exchange-rates.json, refreshInterval=1440.
[junit4:junit4]   2> 3764 T55 oass.IndexSchema.readSchema default search field in schema is text
[junit4:junit4]   2> 3772 T55 oass.IndexSchema.readSchema unique key field: id
[junit4:junit4]   2> 3813 T55 oass.FileExchangeRateProvider.reload Reloading exchange rates from file currency.xml
[junit4:junit4]   2> 3823 T55 oass.FileExchangeRateProvider.reload Reloading exchange rates from file currency.xml
[junit4:junit4]   2> 3832 T55 oass.OpenExchangeRatesOrgProvider.reload Reloading exchange rates from open-exchange-rates.json
[junit4:junit4]   2> 3834 T55 oass.OpenExchangeRatesOrgProvider$OpenExchangeRates.<init> WARNING Unknown key IMPORTANT NOTE
[junit4:junit4]   2> 3835 T55 oass.OpenExchangeRatesOrgProvider$OpenExchangeRates.<init> WARNING Expected key, got STRING
[junit4:junit4]   2> 3836 T55 oass.OpenExchangeRatesOrgProvider.reload Reloading exchange rates from open-exchange-rates.json
[junit4:junit4]   2> 3837 T55 oass.OpenExchangeRatesOrgProvider$OpenExchangeRates.<init> WARNING Unknown key IMPORTANT NOTE
[junit4:junit4]   2> 3837 T55 oass.OpenExchangeRatesOrgProvider$OpenExchangeRates.<init> WARNING Expected key, got STRING
[junit4:junit4]   2> 3838 T55 oasc.SolrCore.initDirectoryFactory solr.StandardDirectoryFactory
[junit4:junit4]   2> 3839 T55 oasc.SolrCore.<init> [collection1] Opening new SolrCore at /usr/home/hudson/hudson-slave/workspace/Lucene-Solr-NightlyTests-trunk/solr/build/solr-core/test-files/solr/collection1/, dataDir=./org.apache.solr.handler.component.DistributedSpellCheckComponentTest-1363616446779/shard0/data/
[junit4:junit4]   2> 3840 T55 oasc.JmxMonitoredMap.<init> JMX monitoring is enabled. Adding Solr mbeans to JMX Server: com.sun.jmx.mbeanserver.JmxMBeanServer@85379bc
[junit4:junit4]   2> 3842 T55 oasc.SolrCore.initDirectoryFactory solr.StandardDirectoryFactory
[junit4:junit4]   2> 3844 T55 oasc.CachingDirectoryFactory.get return new directory for /usr/home/hudson/hudson-slave/workspace/Lucene-Solr-NightlyTests-trunk/solr/build/solr-core/test/J0/org.apache.solr.handler.component.DistributedSpellCheckComponentTest-1363616446779/shard0/data forceNew: false
[junit4:junit4]   2> 3846 T55 oasc.SolrCore.getNewIndexDir New index directory detected: old=null new=./org.apache.solr.handler.component.DistributedSpellCheckComponentTest-1363616446779/shard0/data/index/
[junit4:junit4]   2> 3847 T55 oasc.SolrCore.initIndex WARNING [collection1] Solr index directory './org.apache.solr.handler.component.DistributedSpellCheckComponentTest-1363616446779/shard0/data/index' doesn't exist. Creating new index...
[junit4:junit4]   2> 3849 T55 oasc.CachingDirectoryFactory.get return new directory for /usr/home/hudson/hudson-slave/workspace/Lucene-Solr-NightlyTests-trunk/solr/build/solr-core/test/J0/org.apache.solr.handler.component.DistributedSpellCheckComponentTest-1363616446779/shard0/data/index forceNew: false
[junit4:junit4]   2> 3859 T55 oasc.SolrDeletionPolicy.onCommit SolrDeletionPolicy.onCommit: commits:num=1
[junit4:junit4]   2> 		commit{dir=RateLimitedDirectoryWrapper(org.apache.lucene.store.NIOFSDirectory@/usr/home/hudson/hudson-slave/workspace/Lucene-Solr-NightlyTests-trunk/solr/build/solr-core/test/J0/org.apache.solr.handler.component.DistributedSpellCheckComponentTest-1363616446779/shard0/data/index lockFactory=org.apache.lucene.store.NativeFSLockFactory@59af11e8),segFN=segments_1,generation=1,filenames=[segments_1]
[junit4:junit4]   2> 3860 T55 oasc.SolrDeletionPolicy.updateCommits newest commit = 1[segments_1]
[junit4:junit4]   2> 3862 T55 oasc.SolrCore.initWriters created xml: solr.XMLResponseWriter
[junit4:junit4]   2> 3867 T55 oasup.UpdateRequestProcessorChain.init inserting DistributedUpdateProcessorFactory into updateRequestProcessorChain "dedupe"
[junit4:junit4]   2> 3868 T55 oasup.UpdateRequestProcessorChain.init inserting DistributedUpdateProcessorFactory into updateRequestProcessorChain "dedupe-allfields"
[junit4:junit4]   2> 3869 T55 oasup.UpdateRequestProcessorChain.init inserting DistributedUpdateProcessorFactory into updateRequestProcessorChain "stored_sig"
[junit4:junit4]   2> 3870 T55 oasup.UpdateRequestProcessorChain.init inserting DistributedUpdateProcessorFactory into updateRequestProcessorChain "uniq-fields"
[junit4:junit4]   2> 3872 T55 oasup.UpdateRequestProcessorChain.init inserting DistributedUpdateProcessorFactory into updateRequestProcessorChain "distrib-dup-test-chain-implicit"
[junit4:junit4]   2> 3873 T55 oasc.RequestHandlers.initHandlersFromConfig adding lazy requestHandler: solr.ReplicationHandler
[junit4:junit4]   2> 3874 T55 oasc.RequestHandlers.initHandlersFromConfig created /replication: solr.ReplicationHandler
[junit4:junit4]   2> 3876 T55 oasc.RequestHandlers.initHandlersFromConfig created standard: solr.StandardRequestHandler
[junit4:junit4]   2> 3878 T55 oasc.RequestHandlers.initHandlersFromConfig created /get: solr.RealTimeGetHandler
[junit4:junit4]   2> 3879 T55 oasc.RequestHandlers.initHandlersFromConfig created dismax: solr.SearchHandler
[junit4:junit4]   2> 3881 T55 oasc.RequestHandlers.initHandlersFromConfig created mock: org.apache.solr.core.MockQuerySenderListenerReqHandler
[junit4:junit4]   2> 3882 T55 oasc.RequestHandlers.initHandlersFromConfig created /admin/: org.apache.solr.handler.admin.AdminHandlers
[junit4:junit4]   2> 3883 T55 oasc.RequestHandlers.initHandlersFromConfig created defaults: solr.StandardRequestHandler
[junit4:junit4]   2> 3884 T55 oasc.RequestHandlers.initHandlersFromConfig adding lazy requestHandler: solr.StandardRequestHandler
[junit4:junit4]   2> 3885 T55 oasc.RequestHandlers.initHandlersFromConfig created lazy: solr.StandardRequestHandler
[junit4:junit4]   2> 3887 T55 oasc.RequestHandlers.initHandlersFromConfig created /update: solr.UpdateRequestHandler
[junit4:junit4]   2> 3889 T55 oasc.RequestHandlers.initHandlersFromConfig created /terms: org.apache.solr.handler.component.SearchHandler
[junit4:junit4]   2> 3891 T55 oasc.RequestHandlers.initHandlersFromConfig created spellCheckCompRH: org.apache.solr.handler.component.SearchHandler
[junit4:junit4]   2> 3893 T55 oasc.RequestHandlers.initHandlersFromConfig created spellCheckCompRH_Direct: org.apache.solr.handler.component.SearchHandler
[junit4:junit4]   2> 3895 T55 oasc.RequestHandlers.initHandlersFromConfig created spellCheckWithWordbreak: org.apache.solr.handler.component.SearchHandler
[junit4:junit4]   2> 3897 T55 oasc.RequestHandlers.initHandlersFromConfig created spellCheckWithWordbreak_Direct: org.apache.solr.handler.component.SearchHandler
[junit4:junit4]   2> 3899 T55 oasc.RequestHandlers.initHandlersFromConfig created spellCheckCompRH1: org.apache.solr.handler.component.SearchHandler
[junit4:junit4]   2> 3901 T55 oasc.RequestHandlers.initHandlersFromConfig created mltrh: org.apache.solr.handler.component.SearchHandler
[junit4:junit4]   2> 3903 T55 oasc.RequestHandlers.initHandlersFromConfig created tvrh: org.apache.solr.handler.component.SearchHandler
[junit4:junit4]   2> 3906 T55 oasc.RequestHandlers.initHandlersFromConfig created /mlt: solr.MoreLikeThisHandler
[junit4:junit4]   2> 3908 T55 oasc.RequestHandlers.initHandlersFromConfig created /debug/dump: solr.DumpRequestHandler
[junit4:junit4]   2> 3927 T55 oashl.XMLLoader.init xsltCacheLifetimeSeconds=60
[junit4:junit4]   2> 3935 T55 oasc.SolrCore.initDeprecatedSupport WARNING solrconfig.xml uses deprecated <admin/gettableFiles>, Please update your config to use the ShowFileRequestHandler.
[junit4:junit4]   2> 3939 T55 oasc.SolrCore.initDeprecatedSupport WARNING adding ShowFileRequestHandler with hidden files: [THROW.ERROR.ON.ADD.UPDATEPROCESSOR.JS, SOLRCONFIG-HIGHLIGHT.XML, SCHEMA-REQUIRED-FIELDS.XML, SCHEMA-REPLICATION2.XML, BAD-SCHEMA-DUP-DYNAMICFIELD.XML, SCHEMA-MINIMAL.XML, TRIVIAL.UPDATEPROCESSOR1.JS, BAD-SCHEMA-DOCVALUES-NOT-REQUIRED-NO-DEFAULT.XML, SOLRCONFIG-CACHING.XML, SCHEMA-POSTINGSHIGHLIGHT.XML, SOLRCONFIG-REPEATER.XML, REGEX-BOOST-PROCESSOR-TEST.TXT, BAD-SCHEMA-NONTEXT-ANALYZER.XML, CURRENCY.XML, BAD-SCHEMA-CURRENCY-FT-BOGUS-CODE-IN-XML.XML, SOLRCONFIG-MERGEPOLICY.XML, SOLRCONFIG-TLOG.XML, SOLRCONFIG-MASTER.XML, SOLRCONFIG-COMPONENTS-NAME.XML, BAD-SCHEMA-UNIQUEKEY-MULTIVALUED.XML, SCHEMA11.XML, SOLRCONFIG-BASIC.XML, DA_COMPOUNDDICTIONARY.TXT, MISSLEADING.EXTENSION.UPDATEPROCESSOR.JS.TXT, SCHEMA-COPYFIELD-TEST.XML, SOLRCONFIG-SLAVE.XML, SOLRCONFIG-PROPINJECT-INDEXDEFAULT.XML, ELEVATE.XML, TRIVIAL.UPDATEPROCESSOR0.JS, SCHEMA-SWEETSPOT.XML, BAD-SOLRCONFIG-BOGUS-SCRIPTENGINE-NAME.XML, SCHEMA-CHARFILTERS.XML, SCHEMA-IB.XML, SOLRCONFIG-QUERYSENDER.XML, SOLRCONFIG-SNIPPET-PROCESSOR.XML, SCHEMA-REPLICATION1.XML, DA_UTF8.XML, CONDITIONAL.UPDATEPROCESSOR.JS, SCHEMA-TINY.XML, MISSING.FUNCTIONS.UPDATEPROCESSOR.JS, HYPHENATION.DTD, SOLRCONFIG-ENABLEPLUGIN.XML, STEMDICT.TXT, SCHEMA-PHRASESUGGEST.XML, HUNSPELL-TEST.AFF, BAD-SCHEMA-CURRENCY-FT-OER-NORATES.XML, SCHEMA-SNIPPET-TYPE.XML, STOPTYPES-1.TXT, STOPWORDSWRONGENCODING.TXT, SCHEMA-NUMERIC.XML, SOLRCONFIG-TRANSFORMERS.XML, SOLRCONFIG-PROPINJECT.XML, BAD-SCHEMA-NOT-INDEXED-BUT-TF.XML, SOLRCONFIG-SIMPLELOCK.XML, SCHEMA-DOCVALUES.XML, WDFTYPES.TXT, STOPTYPES-2.TXT, SCHEMA-REVERSED.XML, BAD-SCHEMA-CURRENCY-FT-MULTIVALUED.XML, SOLRCONFIG-SPELLCHECKCOMPONENT.XML, BAD-SCHEMA-CURRENCY-MULTIVALUED.XML, SCHEMA-DFR.XML, SOLRCONFIG-PHRASESUGGEST.XML, BAD-SCHEMA-NOT-INDEXED-BUT-POS.XML, KEEP-1.TXT, OPEN-EXCHANGE-RATES.JSON, SCHEMA-SPATIAL.XML, STOPWITHBOM.TXT, SOLRCONFIG-SPELLCHECKER.XML, SCHEMA-BINARYFIELD.XML, SOLRCONFIG-POSTINGSHIGHLIGHT.XML, SOLRCONFIG-UPDATE-PROCESSOR-CHAINS.XML, BAD-SCHEMA-OMIT-TF-BUT-NOT-POS.XML, BAD-SCHEMA-DUP-FIELDTYPE.XML, SCHEMA-XINCLUDE.XML, SOLRCONFIG-MASTER1.XML, SCHEMA-BEHAVIOR.XML, SYNONYMS.TXT, SOLRCONFIG-MINIMAL.XML, SCHEMA-DOCVALUESMULTI.XML, BAD-SCHEMA-CURRENCY-DYNAMIC-MULTIVALUED.XML, BAD-SCHEMA-UNSUPPORTED-DOCVALUES.XML, SCHEMA_CODEC.XML, BAD-SCHEMA-SWEETSPOT-PARTIAL-HYPERBOLIC.XML, SOLRCONFIG-SOLR-749.XML, SCHEMA-EFF.XML, SOLRCONFIG-MASTER1-KEEPONEBACKUP.XML, SOLRCONFIG-FUNCTIONQUERY.XML, STOP-2.TXT, SOLRCONFIG-TERMINDEX.XML, SCHEMA-LMDIRICHLET.XML, SOLRCONFIG-ELEVATE.XML, BAD-SCHEMA-SWEETSPOT-PARTIAL-NORMS.XML, BAD-SCHEMA-SWEETSPOT-PARTIAL-BASELINE.XML, STOPWORDS.TXT, SCHEMA-FOLDING.XML, SCHEMA-STOP-KEEP.XML, FUZZYSUGGEST.TXT, BAD-SCHEMA-NOT-INDEXED-BUT-NORMS.XML, SCHEMA-REST.XML, SOLRCONFIG-SOLCOREPROPERTIES.XML, STOP-1.TXT, SOLRCONFIG-MASTER2.XML, SCHEMA-SPELLCHECKER.XML, SOLRCONFIG-RESPONSE-LOG-COMPONENT.XML, SOLRCONFIG-LAZYWRITER.XML, SCHEMA-LUCENEMATCHVERSION.XML, BAD-MP-SOLRCONFIG.XML, FRENCHARTICLES.TXT, SCHEMA15.XML, SOLRCONFIG-REQHANDLER.INCL, SCHEMASURROUND.XML, SOLRCONFIG-MASTER3.XML, HUNSPELL-TEST.DIC, BAD-SCHEMA-CODEC-GLOBAL-VS-FT-MISMATCH.XML, SOLRCONFIG-XINCLUDE.XML, SOLRCONFIG-SLAVE1.XML, SOLRCONFIG-DELPOLICY1.XML, SCHEMA-SIM.XML, SCHEMA-SNIPPET-FIELD.XML, SCHEMA-COLLATE.XML, STOP-SNOWBALL.TXT, BAD-SCHEMA-SIM-GLOBAL-VS-FT-MISMATCH.XML, PROTWORDS.TXT, SCHEMA-TRIE.XML, SOLRCONFIG_CODEC.XML, SCHEMA-SYNONYM-TOKENIZER.XML, BAD-SOLRCONFIG-INVALID-SCRIPTFILE.XML, JASUGGEST.TXT, SCHEMA-DOCVALUESFACETING.XML, SCHEMA-TFIDF.XML, SOLRCONFIG-SCRIPT-UPDATEPROCESSOR.XML, SCHEMA-LMJELINEKMERCER.XML, PHRASESUGGEST.TXT, BAD-SOLRCONFIG-MISSING-SCRIPTFILE.XML, BAD-SCHEMA-UNIQUEKEY-USES-DEFAULT.XML, OLD_SYNONYMS.TXT, SOLRCONFIG-DELPOLICY2.XML, XSLT, SOLRCONFIG-NATIVELOCK.XML, BAD-SCHEMA-DUP-FIELD.XML, SOLRCONFIG-NOCACHE.XML, SCHEMA-BM25.XML, BAD-SCHEMA-SWEETSPOT-BOTH-TF.XML, ADDFIELDS.UPDATEPROCESSOR.JS, SOLRCONFIG-QUERYSENDER-NOQUERY.XML, SOLRCONFIG-ALTDIRECTORY.XML, COMPOUNDDICTIONARY.TXT, BAD-SCHEMA-CURRENCY-FT-BOGUS-DEFAULT-CODE.XML, BAD-CURRENCY.XML, SOLRCONFIG-INDEXCONFIG.XML, SOLRCONFIG_PERF.XML, BAD-SCHEMA-ANALYZER-CLASS-AND-NESTED.XML, SCHEMA-NOT-REQUIRED-UNIQUE-KEY.XML, KEEP-2.TXT, BAD-SCHEMA-UNIQUEKEY-IS-COPYFIELD-DEST.XML, SCHEMA12.XML, MAPPING-ISOLATIN1ACCENT.TXT, BAD_SOLRCONFIG.XML, BAD-SCHEMA-EXTERNAL-FILEFIELD.XML]
[junit4:junit4]   2> 3948 T55 oass.SolrIndexSearcher.<init> Opening Searcher@1bbb5095 main
[junit4:junit4]   2> 3950 T55 oasu.CommitTracker.<init> Hard AutoCommit: disabled
[junit4:junit4]   2> 3950 T55 oasu.CommitTracker.<init> Soft AutoCommit: disabled
[junit4:junit4]   2> 3952 T55 oashc.SpellCheckComponent.inform Initializing spell checkers
[junit4:junit4]   2> 3967 T55 oass.DirectSolrSpellChecker.init init: {name=direct,classname=DirectSolrSpellChecker,field=lowerfilt,minQueryLength=3}
[junit4:junit4]   2> 4055 T56 oasc.SolrCore.registerSearcher [collection1] Registered new searcher Searcher@1bbb5095 main{StandardDirectoryReader(segments_1:1)}
[junit4:junit4]   2> 4081 T55 oasc.CoreContainer.registerCore registering core: collection1
[junit4:junit4]   2> 4083 T33 oass.SolrDispatchFilter.init user.dir=/usr/home/hudson/hudson-slave/workspace/Lucene-Solr-NightlyTests-trunk/solr/build/solr-core/test/J0
[junit4:junit4]   2> 4084 T33 oass.SolrDispatchFilter.init SolrDispatchFilter.init() done
[junit4:junit4]   2> 4085 T33 oascsi.HttpClientUtil.createClient Creating new http client, config:maxConnections=128&maxConnectionsPerHost=32&followRedirects=false
[junit4:junit4]   2> ASYNC  NEW_CORE C2 name=collection1 org.apache.solr.core.SolrCore@dd78445
[junit4:junit4]   2> 5825 T36 C2 oasu.DirectUpdateHandler2.deleteAll [collection1] REMOVING ALL DOCUMENTS FROM INDEX
[junit4:junit4]   2> 5836 T36 C2 oasc.SolrDeletionPolicy.onInit SolrDeletionPolicy.onInit: commits:num=1
[junit4:junit4]   2> 		commit{dir=RateLimitedDirectoryWrapper(org.apache.lucene.store.NIOFSDirectory@/usr/home/hudson/hudson-slave/workspace/Lucene-Solr-NightlyTests-trunk/solr/build/solr-core/test/J0/org.apache.solr.handler.component.DistributedSpellCheckComponentTest-1363616446779/control/data/index lockFactory=org.apache.lucene.store.NativeFSLockFactory@5beb1172),segFN=segments_1,generation=1,filenames=[segments_1]
[junit4:junit4]   2> 5845 T36 C2 oasc.SolrDeletionPolicy.updateCommits newest commit = 1[segments_1]
[junit4:junit4]   2> 5849 T36 C2 UPDATE [collection1] webapp= path=/update params={wt=javabin&version=2} {deleteByQuery=*:*} 0 80
[junit4:junit4]   2> ASYNC  NEW_CORE C3 name=collection1 org.apache.solr.core.SolrCore@5b5e3d2c
[junit4:junit4]   2> 6000 T48 C3 oasu.DirectUpdateHandler2.deleteAll [collection1] REMOVING ALL DOCUMENTS FROM INDEX
[junit4:junit4]   2> 6010 T48 C3 oasc.SolrDeletionPolicy.onInit SolrDeletionPolicy.onInit: commits:num=1
[junit4:junit4]   2> 		commit{dir=RateLimitedDirectoryWrapper(org.apache.lucene.store.NIOFSDirectory@/usr/home/hudson/hudson-slave/workspace/Lucene-Solr-NightlyTests-trunk/solr/build/solr-core/test/J0/org.apache.solr.handler.component.DistributedSpellCheckComponentTest-1363616446779/shard0/data/index lockFactory=org.apache.lucene.store.NativeFSLockFactory@59af11e8),segFN=segments_1,generation=1,filenames=[segments_1]
[junit4:junit4]   2> 6014 T48 C3 oasc.SolrDeletionPolicy.updateCommits newest commit = 1[segments_1]
[junit4:junit4]   2> 6017 T48 C3 UPDATE [collection1] webapp= path=/update params={wt=javabin&version=2} {deleteByQuery=*:*} 0 17
[junit4:junit4]   2> 6040 T36 C2 UPDATE [collection1] webapp= path=/update params={wt=javabin&version=2} {add=[1]} 0 15
[junit4:junit4]   2> 6054 T48 C3 UPDATE [collection1] webapp= path=/update params={wt=javabin&version=2} {add=[1]} 0 8
[junit4:junit4]   2> 6064 T36 C2 UPDATE [collection1] webapp= path=/update params={wt=javabin&version=2} {add=[2]} 0 4
[junit4:junit4]   2> 6073 T48 C3 UPDATE [collection1] webapp= path=/update params={wt=javabin&version=2} {add=[2]} 0 4
[junit4:junit4]   2> 6081 T36 C2 UPDATE [collection1] webapp= path=/update params={wt=javabin&version=2} {add=[3]} 0 3
[junit4:junit4]   2> 6091 T48 C3 UPDATE [collection1] webapp= path=/update params={wt=javabin&version=2} {add=[3]} 0 3
[junit4:junit4]   2> 6099 T36 C2 UPDATE [collection1] webapp= path=/update params={wt=javabin&version=2} {add=[4]} 0 3
[junit4:junit4]   2> 6108 T48 C3 UPDATE [collection1] webapp= path=/update params={wt=javabin&version=2} {add=[4]} 0 4
[junit4:junit4]   2> 6116 T36 C2 UPDATE [collection1] webapp= path=/update params={wt=javabin&version=2} {add=[5]} 0 3
[junit4:junit4]   2> 6126 T48 C3 UPDATE [collection1] webapp= path=/update params={wt=javabin&version=2} {add=[5]} 0 2
[junit4:junit4]   2> 6136 T36 C2 UPDATE [collection1] webapp= path=/update params={wt=javabin&version=2} {add=[6]} 0 4
[junit4:junit4]   2> 6144 T48 C3 UPDATE [collection1] webapp= path=/update params={wt=javabin&version=2} {add=[6]} 0 3
[junit4:junit4]   2> 6153 T36 C2 UPDATE [collection1] webapp= path=/update params={wt=javabin&version=2} {add=[7]} 0 4
[junit4:junit4]   2> 6161 T48 C3 UPDATE [collection1] webapp= path=/update params={wt=javabin&version=2} {add=[7]} 0 3
[junit4:junit4]   2> 6171 T36 C2 UPDATE [collection1] webapp= path=/update params={wt=javabin&version=2} {add=[8]} 0 4
[junit4:junit4]   2> 6180 T48 C3 UPDATE [collection1] webapp= path=/update params={wt=javabin&version=2} {add=[8]} 0 3
[junit4:junit4]   2> 6190 T36 C2 UPDATE [collection1] webapp= path=/update params={wt=javabin&version=2} {add=[9]} 0 5
[junit4:junit4]   2> 6200 T48 C3 UPDATE [collection1] webapp= path=/update params={wt=javabin&version=2} {add=[9]} 0 5
[junit4:junit4]   2> 6365 T36 C2 UPDATE [collection1] webapp= path=/update params={wt=javabin&version=2} {add=[10]} 0 159
[junit4:junit4]   2> 6410 T48 C3 UPDATE [collection1] webapp= path=/update params={wt=javabin&version=2} {add=[10]} 0 39
[junit4:junit4]   2> 6421 T36 C2 UPDATE [collection1] webapp= path=/update params={wt=javabin&version=2} {add=[12]} 0 5
[junit4:junit4]   2> 6433 T48 C3 UPDATE [collection1] webapp= path=/update params={wt=javabin&version=2} {add=[12]} 0 6
[junit4:junit4]   2> 6444 T36 C2 UPDATE [collection1] webapp= path=/update params={wt=javabin&version=2} {add=[13]} 0 5
[junit4:junit4]   2> 6455 T48 C3 UPDATE [collection1] webapp= path=/update params={wt=javabin&version=2} {add=[13]} 0 4
[junit4:junit4]   2> 6466 T36 C2 UPDATE [collection1] webapp= path=/update params={wt=javabin&version=2} {add=[14]} 0 5
[junit4:junit4]   2> 6476 T48 C3 UPDATE [collection1] webapp= path=/update params={wt=javabin&version=2} {add=[14]} 0 5
[junit4:junit4]   2> 6486 T36 C2 UPDATE [collection1] webapp= path=/update params={wt=javabin&version=2} {add=[15]} 0 4
[junit4:junit4]   2> 6495 T48 C3 UPDATE [collection1] webapp= path=/update params={wt=javabin&version=2} {add=[15]} 0 4
[junit4:junit4]   2> 6506 T36 C2 UPDATE [collection1] webapp= path=/update params={wt=javabin&version=2} {add=[16]} 0 4
[junit4:junit4]   2> 6516 T48 C3 UPDATE [collection1] webapp= path=/update params={wt=javabin&version=2} {add=[16]} 0 4
[junit4:junit4]   2> 6525 T36 C2 UPDATE [collection1] webapp= path=/update params={wt=javabin&version=2} {add=[17]} 0 4
[junit4:junit4]   2> 6534 T48 C3 UPDATE [collection1] webapp= path=/update params={wt=javabin&version=2} {add=[17]} 0 4
[junit4:junit4]   2> 6544 T36 C2 UPDATE [collection1] webapp= path=/update params={wt=javabin&version=2} {add=[18]} 0 5
[junit4:junit4]   2> 6553 T48 C3 UPDATE [collection1] webapp= path=/update params={wt=javabin&version=2} {add=[18]} 0 4
[junit4:junit4]   2> 6562 T36 C2 UPDATE [collection1] webapp= path=/update params={wt=javabin&version=2} {add=[19]} 0 4
[junit4:junit4]   2> 6570 T48 C3 UPDATE [collection1] webapp= path=/update params={wt=javabin&version=2} {add=[19]} 0 4
[junit4:junit4]   2> 6579 T36 C2 UPDATE [collection1] webapp= path=/update params={wt=javabin&version=2} {add=[20]} 0 4
[junit4:junit4]   2> 6588 T48 C3 UPDATE [collection1] webapp= path=/update params={wt=javabin&version=2} {add=[20]} 0 3
[junit4:junit4]   2> 6632 T36 C2 UPDATE [collection1] webapp= path=/update params={wt=javabin&version=2} {add=[21]} 0 39
[junit4:junit4]   2> 6672 T48 C3 UPDATE [collection1] webapp= path=/update params={wt=javabin&version=2} {add=[21]} 0 35
[junit4:junit4]   2> 6686 T36 C2 UPDATE [collection1] webapp= path=/update params={wt=javabin&version=2} {add=[22]} 0 7
[junit4:junit4]   2> 6700 T48 C3 UPDATE [collection1] webapp= path=/update params={wt=javabin&version=2} {add=[22]} 0 8
[junit4:junit4]   2> 6711 T36 C2 UPDATE [collection1] webapp= path=/update params={wt=javabin&version=2} {add=[23]} 0 5
[junit4:junit4]   2> 6721 T48 C3 UPDATE [collection1] webapp= path=/update params={wt=javabin&version=2} {add=[23]} 0 5
[junit4:junit4]   2> 6732 T36 C2 UPDATE [collection1] webapp= path=/update params={wt=javabin&version=2} {add=[24]} 0 5
[junit4:junit4]   2> 6742 T48 C3 UPDATE [collection1] webapp= path=/update params={wt=javabin&version=2} {add=[24]} 0 5
[junit4:junit4]   2> 6752 T36 C2 UPDATE [collection1] webapp= path=/update params={wt=javabin&version=2} {add=[25]} 0 3
[junit4:junit4]   2> 6761 T48 C3 UPDATE [collection1] webapp= path=/update params={wt=javabin&version=2} {add=[25]} 0 4
[junit4:junit4]   2> 6805 T36 C2 oasu.DirectUpdateHandler2.commit start commit{,optimize=false,openSearcher=true,waitSearcher=true,expungeDeletes=false,softCommit=false,prepareCommit=false}
[junit4:junit4]   2> 7366 T36 C2 oasc.SolrDeletionPolicy.onCommit SolrDeletionPolicy.onCommit: commits:num=2
[junit4:junit4]   2> 		commit{dir=RateLimitedDirectoryWrapper(org.apache.lucene.store.NIOFSDirectory@/usr/home/hudson/hudson-slave/workspace/Lucene-Solr-NightlyTests-trunk/solr/build/solr-core/test/J0/org.apache.solr.handler.component.DistributedSpellCheckComponentTest-1363616446779/control/data/index lockFactory=org.apache.lucene.store.NativeFSLockFactory@5beb1172),segFN=segments_1,generation=1,filenames=[segments_1]
[junit4:junit4]   2> 		commit{dir=RateLimitedDirectoryWrapper(org.apache.lucene.store.NIOFSDirectory@/usr/home/hudson/hudson-slave/workspace/Lucene-Solr-NightlyTests-trunk/solr/build/solr-core/test/J0/org.apache.solr.handler.component.DistributedSpellCheckComponentTest-1363616446779/control/data/index lockFactory=org.apache.lucene.store.NativeFSLockFactory@5beb1172),segFN=segments_2,generation=2,filenames=[_2_Lucene41WithOrds_0.doc, _2_Asserting_0.pos, _1_Lucene42_0.dvm, _1_Lucene41WithOrds_0.doc, _1_MockFixedIntBlock_0.pyl, _0_MockFixedIntBlock_0.tib, _1_Lucene42_0.dvd, _2_MockFixedIntBlock_0.tii, _1.fnm, _1_Asserting_0.tim, _2_MockFixedIntBlock_0.tib, _2_MockFixedIntBlock_0.pyl, _0_MockFixedIntBlock_0.tii, _1_Asserting_0.tip, _2_MockFixedIntBlock_0.frq, _0_Asserting_0.doc, _1.nvm, _1_Asserting_0.pos, _0.fnm, _1_MockFixedIntBlock_0.frq, _1.nvd, _2.fdt, _0_MockFixedIntBlock_0.pos, _2.fdx, _2_Asserting_0.tim, _1.fdx, _2.nvm, _2_Lucene42_0.dvm, _2_Asserting_0.tip, _1_MockFixedIntBlock_0.skp, _2_MockFixedIntBlock_0.pos, _1.fdt, _2_Lucene41WithOrds_0.pos, _1_Lucene41WithOrds_0.tii, _2.nvd, _1_Lucene41WithOrds_0.tib, _2_MockFixedIntBlock_0.doc, _1_MockFixedIntBlock_0.pos, _2_Lucene42_0.dvd, _2.si, _0_Lucene41WithOrds_0.tib, _0_Asserting_0.tim, _0_Asserting_0.tip, _0_Lucene42_0.dvd, _1_MockFixedIntBlock_0.doc, _1_Asserting_0.doc, _2_MockFixedIntBlock_0.skp, _0_Lucene41WithOrds_0.tii, _1_Lucene41WithOrds_0.pos, _0_Lucene41WithOrds_0.pos, _0_Lucene42_0.dvm, _0_MockFixedIntBlock_0.skp, _0_MockFixedIntBlock_0.pyl, _2_Asserting_0.doc, _0.nvd, _0.si, _1_MockFixedIntBlock_0.tii, _2_Lucene41WithOrds_0.tii, _0_Lucene41WithOrds_0.doc, _2_Lucene41WithOrds_0.tib, _0.nvm, _2.fnm, _0_MockFixedIntBlock_0.frq, _0_MockFixedIntBlock_0.doc, _1.si, segments_2, _1_MockFixedIntBlock_0.tib, _0.fdx, _0_Asserting_0.pos, _0.fdt]
[junit4:junit4]   2> 7367 T36 C2 oasc.SolrDeletionPolicy.updateCommits newest commit = 2[_2_Lucene41WithOrds_0.doc, _2_Asserting_0.pos, _1_Lucene42_0.dvm, _1_Lucene41WithOrds_0.doc, _1_MockFixedIntBlock_0.pyl, _0_MockFixedIntBlock_0.tib, _1_Lucene42_0.dvd, _2_MockFixedIntBlock_0.tii, _1.fnm, _1_Asserting_0.tim, _2_MockFixedIntBlock_0.tib, _2_MockFixedIntBlock_0.pyl, _0_MockFixedIntBlock_0.tii, _1_Asserting_0.tip, _2_MockFixedIntBlock_0.frq, _0_Asserting_0.doc, _1.nvm, _1_Asserting_0.pos, _0.fnm, _1_MockFixedIntBlock_0.frq, _1.nvd, _2.fdt, _0_MockFixedIntBlock_0.pos, _2.fdx, _2_Asserting_0.tim, _1.fdx, _2.nvm, _2_Lucene42_0.dvm, _2_Asserting_0.tip, _1_MockFixedIntBlock_0.skp, _2_MockFixedIntBlock_0.pos, _1.fdt, _2_Lucene41WithOrds_0.pos, _1_Lucene41WithOrds_0.tii, _2.nvd, _1_Lucene41WithOrds_0.tib, _2_MockFixedIntBlock_0.doc, _1_MockFixedIntBlock_0.pos, _2_Lucene42_0.dvd, _2.si, _0_Lucene41WithOrds_0.tib, _0_Asserting_0.tim, _0_Asserting_0.tip, _0_Lucene42_0.dvd, _1_MockFixedIntBlock_0.doc, _1_Asserting_0.doc, _2_MockFixedIntBlock_0.skp, _0_Lucene41WithOrds_0.tii, _1_Lucene41WithOrds_0.pos, _0_Lucene41WithOrds_0.pos, _0_Lucene42_0.dvm, _0_MockFixedIntBlock_0.skp, _0_MockFixedIntBlock_0.pyl, _2_Asserting_0.doc, _0.nvd, _0.si, _1_MockFixedIntBlock_0.tii, _2_Lucene41WithOrds_0.tii, _0_Lucene41WithOrds_0.doc, _2_Lucene41WithOrds_0.tib, _0.nvm, _2.fnm, _0_MockFixedIntBlock_0.frq, _0_MockFixedIntBlock_0.doc, _1.si, segments_2, _1_MockFixedIntBlock_0.tib, _0.fdx, _0_Asserting_0.pos, _0.fdt]
[junit4:junit4]   2> 7456 T36 C2 oass.SolrIndexSearcher.<init> Opening Searcher@665507c1 main
[junit4:junit4]   2> 7458 T36 C2 oasu.DirectUpdateHandler2.commit end_commit_flush
[junit4:junit4]   2> 7462 T44 oasc.SolrCore.registerSearcher [collection1] Registered new searcher Searcher@665507c1 main{StandardDirectoryReader(segments_2:8 _0(5.0):C10 _1(5.0):C10 _2(5.0):C4)}
[junit4:junit4]   2> 7464 T36 C2 UPDATE [collection1] webapp= path=/update params={waitSearcher=true&commit=true&wt=javabin&version=2&softCommit=false} {commit=} 0 659
[junit4:junit4]   2> 7471 T48 C3 oasu.DirectUpdateHandler2.commit start commit{,optimize=false,openSearcher=true,waitSearcher=true,expungeDeletes=false,softCommit=false,prepareCommit=false}
[junit4:junit4]   2> 7867 T48 C3 oasc.SolrDeletionPolicy.onCommit SolrDeletionPolicy.onCommit: commits:num=2
[junit4:junit4]   2> 		commit{dir=RateLimitedDirectoryWrapper(org.apache.lucene.store.NIOFSDirectory@/usr/home/hudson/hudson-slave/workspace/Lucene-Solr-NightlyTests-trunk/solr/build/solr-core/test/J0/org.apache.solr.handler.component.DistributedSpellCheckComponentTest-1363616446779/shard0/data/index lockFactory=org.apache.lucene.store.NativeFSLockFactory@59af11e8),segFN=segments_1,generation=1,filenames=[segments_1]
[junit4:junit4]   2> 		commit{dir=RateLimitedDirectoryWrapper(org.apache.lucene.store.NIOFSDirectory@/usr/home/hudson/hudson-slave/workspace/Lucene-Solr-NightlyTests-trunk/solr/build/solr-core/test/J0/org.apache.solr.handler.component.DistributedSpellCheckComponentTest-1363616446779/shard0/data/index lockFactory=org.apache.lucene.store.NativeFSLockFactory@59af11e8),segFN=segments_2,generation=2,filenames=[_2_Lucene41WithOrds_0.doc, _2_Asserting_0.pos, _1_Lucene42_0.dvm, _1_Lucene41WithOrds_0.doc, _1_MockFixedIntBlock_0.pyl, _0_MockFixedIntBlock_0.tib, _1_Lucene42_0.dvd, _2_MockFixedIntBlock_0.tii, _1.fnm, _1_Asserting_0.tim, _2_MockFixedIntBlock_0.tib, _2_MockFixedIntBlock_0.pyl, _0_MockFixedIntBlock_0.tii, _1_Asserting_0.tip, _2_MockFixedIntBlock_0.frq, _0_Asserting_0.doc, _1.nvm, _1_Asserting_0.pos, _0.fnm, _1_MockFixedIntBlock_0.frq, _1.nvd, _2.fdt, _0_MockFixedIntBlock_0.pos, _2.fdx, _2_Asserting_0.tim, _1.fdx, _2.nvm, _2_Lucene42_0.dvm, _2_Asserting_0.tip, _1_MockFixedIntBlock_0.skp, _2_MockFixedIntBlock_0.pos, _1.fdt, _2_Lucene41WithOrds_0.pos, _1_Lucene41WithOrds_0.tii, _2.nvd, _1_Lucene41WithOrds_0.tib, _2_MockFixedIntBlock_0.doc, _1_MockFixedIntBlock_0.pos, _2_Lucene42_0.dvd, _2.si, _0_Lucene41WithOrds_0.tib, _0_Asserting_0.tim, _0_Asserting_0.tip, _0_Lucene42_0.dvd, _1_MockFixedIntBlock_0.doc, _1_Asserting_0.doc, _2_MockFixedIntBlock_0.skp, _0_Lucene41WithOrds_0.tii, _1_Lucene41WithOrds_0.pos, _0_Lucene41WithOrds_0.pos, _0_Lucene42_0.dvm, _0_MockFixedIntBlock_0.skp, _0_MockFixedIntBlock_0.pyl, _2_Asserting_0.doc, _0.nvd, _0.si, _1_MockFixedIntBlock_0.tii, _2_Lucene41WithOrds_0.tii, _0_Lucene41WithOrds_0.doc, _2_Lucene41WithOrds_0.tib, _0.nvm, _2.fnm, _0_MockFixedIntBlock_0.frq, _0_MockFixedIntBlock_0.doc, _1.si, segments_2, _1_MockFixedIntBlock_0.tib, _0.fdx, _0_Asserting_0.pos, _0.fdt]
[junit4:junit4]   2> 7869 T48 C3 oasc.SolrDeletionPolicy.updateCommits newest commit = 2[_2_Lucene41WithOrds_0.doc, _2_Asserting_0.pos, _1_Lucene42_0.dvm, _1_Lucene41WithOrds_0.doc, _1_MockFixedIntBlock_0.pyl, _0_MockFixedIntBlock_0.tib, _1_Lucene42_0.dvd, _2_MockFixedIntBlock_0.tii, _1.fnm, _1_Asserting_0.tim, _2_MockFixedIntBlock_0.tib, _2_MockFixedIntBlock_0.pyl, _0_MockFixedIntBlock_0.tii, _1_Asserting_0.tip, _2_MockFixedIntBlock_0.frq, _0_Asserting_0.doc, _1.nvm, _1_Asserting_0.pos, _0.fnm, _1_MockFixedIntBlock_0.frq, _1.nvd, _2.fdt, _0_MockFixedIntBlock_0.pos, _2.fdx, _2_Asserting_0.tim, _1.fdx, _2.nvm, _2_Lucene42_0.dvm, _2_Asserting_0.tip, _1_MockFixedIntBlock_0.skp, _2_MockFixedIntBlock_0.pos, _1.fdt, _2_Lucene41WithOrds_0.pos, _1_Lucene41WithOrds_0.tii, _2.nvd, _1_Lucene41WithOrds_0.tib, _2_MockFixedIntBlock_0.doc, _1_MockFixedIntBlock_0.pos, _2_Lucene42_0.dvd, _2.si, _0_Lucene41WithOrds_0.tib, _0_Asserting_0.tim, _0_Asserting_0.tip, _0_Lucene42_0.dvd, _1_MockFixedIntBlock_0.doc, _1_Asserting_0.doc, _2_MockFixedIntBlock_0.skp, _0_Lucene41WithOrds_0.tii, _1_Lucene41WithOrds_0.pos, _0_Lucene41WithOrds_0.pos, _0_Lucene42_0.dvm, _0_MockFixedIntBlock_0.skp, _0_MockFixedIntBlock_0.pyl, _2_Asserting_0.doc, _0.nvd, _0.si, _1_MockFixedIntBlock_0.tii, _2_Lucene41WithOrds_0.tii, _0_Lucene41WithOrds_0.doc, _2_Lucene41WithOrds_0.tib, _0.nvm, _2.fnm, _0_MockFixedIntBlock_0.frq, _0_MockFixedIntBlock_0.doc, _1.si, segments_2, _1_MockFixedIntBlock_0.tib, _0.fdx, _0_Asserting_0.pos, _0.fdt]
[junit4:junit4]   2> 7985 T48 C3 oass.SolrIndexSearcher.<init> Opening Searcher@5aeb7c20 main
[junit4:junit4]   2> 7986 T48 C3 oasu.DirectUpdateHandler2.commit end_commit_flush
[junit4:junit4]   2> 7990 T56 oasc.SolrCore.registerSearcher [collection1] Registered new searcher Searcher@5aeb7c20 main{StandardDirectoryReader(segments_2:8 _0(5.0):C10 _1(5.0):C10 _2(5.0):C4)}
[junit4:junit4]   2> 7991 T48 C3 UPDATE [collection1] webapp= path=/update params={waitSearcher=true&commit=true&wt=javabin&version=2&softCommit=false} {commit=} 0 520
[junit4:junit4]   2> 8467 T36 C2 REQ [collection1] webapp= path=/select params={spellcheck=true&shards.qt=spellCheckCompRH&q=*:*&wt=javabin&qt=spellCheckCompRH&version=2&spellcheck.build=true} hits=24 status=0 QTime=439 
[junit4:junit4]   2> 9036 T49 C3 REQ [collection1] webapp= path=/select params={spellcheck=true&spellcheck.extendedResults=false&shards.qt=spellCheckCompRH&distrib=false&wt=javabin&version=2&spellcheck.onlyMorePopular=false&rows=10&NOW=1363616455285&shard.url=127.0.0.1:27176/&fl=id,score&start=0&q=*:*&spellcheck.count=5&isShard=true&qt=spellCheckCompRH&fsv=true&spellcheck.build=true} hits=24 status=0 QTime=291 
[junit4:junit4]   2> 9128 T49 C3 REQ [collection1] webapp= path=/select params={spellcheck=false&spellcheck.extendedResults=false&shards.qt=spellCheckCompRH&ids=3,2,1,10,7,6,5,4,9,8&distrib=false&wt=javabin&version=2&spellcheck.onlyMorePopular=false&NOW=1363616455285&shard.url=127.0.0.1:27176/&q=*:*&spellcheck.count=1&qt=spellCheckCompRH&isShard=true&spellcheck.build=true} status=0 QTime=24 
[junit4:junit4]   2> 9145 T48 C3 oashc.SpellCheckComponent.finishStage 127.0.0.1:27176/ null
[junit4:junit4]   2> 9146 T48 C3 oashc.SpellCheckComponent.finishStage 127.0.0.1:27176/ null
[junit4:junit4]   2> 9153 T48 C3 REQ [collection1] webapp= path=/select params={spellcheck=true&shards=127.0.0.1:27176/&shards.qt=spellCheckCompRH&q=*:*&wt=javabin&qt=spellCheckCompRH&version=2&spellcheck.build=true} hits=24 status=0 QTime=641 
[junit4:junit4]   2> 9472 T36 C2 REQ [collection1] webapp= path=/select params={spellcheck=true&fl=id,lowerfilt&shards.qt=spellCheckCompRH_Direct&q=*:*&spellcheck.q=toyata&distrib=false&wt=javabin&qt=spellCheckCompRH_Direct&version=2} hits=24 status=0 QTime=301 
[junit4:junit4]   2> 9561 T49 C3 REQ [collection1] webapp= path=/select params={spellcheck=true&spellcheck.extendedResults=false&shards.qt=spellCheckCompRH_Direct&spellcheck.q=toyata&distrib=false&wt=javabin&version=2&spellcheck.onlyMorePopular=false&rows=10&NOW=1363616456262&shard.url=[ff01::114]:33332/|127.0.0.1:27176/&fl=id,score&start=0&q=*:*&spellcheck.dictionary=direct&spellcheck.count=5&isShard=true&qt=spellCheckCompRH_Direct&fsv=true} hits=24 status=0 QTime=47 
[junit4:junit4]   2> 9579 T49 C3 REQ [collection1] webapp= path=/select params={spellcheck=false&spellcheck.extendedResults=false&shards.qt=spellCheckCompRH_Direct&ids=3,2,1,10,7,6,5,4,9,8&spellcheck.q=toyata&distrib=false&wt=javabin&version=2&spellcheck.onlyMorePopular=false&NOW=1363616456262&shard.url=[ff01::114]:33332/|127.0.0.1:27176/&fl=id,lowerfilt&q=*:*&spellcheck.dictionary=direct&spellcheck.count=1&isShard=true&qt=spellCheckCompRH_Direct} status=0 QTime=9 
[junit4:junit4]   2> 9582 T48 C3 oashc.SpellCheckComponent.finishStage [ff01::114]:33332/|127.0.0.1:27176/ {suggestions={toyata={numFound=1,startOffset=0,endOffset=6,suggestion=[toyota]}}}
[junit4:junit4]   2> 9583 T48 C3 oashc.SpellCheckComponent.finishStage [ff01::114]:33332/|127.0.0.1:27176/ null
[junit4:junit4]   2> 9584 T48 C3 REQ [collection1] webapp= path=/select params={spellcheck=true&shards=[ff01::114]:33332/|127.0.0.1:27176/&fl=id,lowerfilt&shards.qt=spellCheckCompRH_Direct&q=*:*&spellcheck.q=toyata&wt=javabin&qt=spellCheckCompRH_Direct&version=2} hits=24 status=0 QTime=95 
[junit4:junit4]   2> 9587 T33 oas.BaseDistributedSearchTestCase.query starting stress...
[junit4:junit4]   2> 9672 T49 C3 REQ [collection1] webapp= path=/select params={spellcheck=true&spellcheck.extendedResults=false&shards.qt=spellCheckCompRH_Direct&spellcheck.q=toyata&distrib=false&wt=javabin&version=2&spellcheck.onlyMorePopular=false&rows=10&NOW=1363616456384&shard.url=[ff01::114]:33332/|127.0.0.1:27176/&fl=id,score&start=0&q=*:*&spellcheck.dictionary=direct&spellcheck.count=5&isShard=true&qt=spellCheckCompRH_Direct&fsv=true} hits=24 status=0 QTime=48 
[junit4:junit4]   2> 9781 T49 C3 REQ [collection1] webapp= path=/select params={spellcheck=false&spellcheck.extendedResults=false&shards.qt=spellCheckCompRH_Direct&ids=3,2,1,10,7,6,5,4,9,8&spellcheck.q=toyata&distrib=false&wt=javabin&version=2&spellcheck.onlyMorePopular=false&NOW=1363616456384&shard.url=[ff01::114]:33332/|127.0.0.1:27176/&fl=id,lowerfilt&q=*:*&spellcheck.dictionary=direct&spellcheck.count=1&isShard=true&qt=spellCheckCompRH_Direct} status=0 QTime=9 
[junit4:junit4]   2> 9784 T51 C3 oashc.SpellCheckComponent.finishStage [ff01::114]:33332/|127.0.0.1:27176/ {suggestions={toyata={numFound=1,startOffset=0,endOffset=6,suggestion=[toyota]}}}
[junit4:junit4]   2> 9785 T51 C3 oashc.SpellCheckComponent.finishStage [ff01::114]:33332/|127.0.0.1:27176/ null
[junit4:junit4]   2> 9788 T51 C3 REQ [collection1] webapp= path=/select params={spellcheck=true&shards=[ff01::114]:33332/|127.0.0.1:27176/&fl=id,lowerfilt&shards.qt=spellCheckCompRH_Direct&q=*:*&spellcheck.q=toyata&wt=javabin&qt=spellCheckCompRH_Direct&version=2} hits=24 status=0 QTime=177 
[junit4:junit4]   2> 9812 T52 C3 REQ [collection1] webapp= path=/select params={spellcheck=true&spellcheck.extendedResults=false&shards.qt=spellCheckCompRH_Direct&spellcheck.q=toyata&distrib=false&wt=javabin&version=2&spellcheck.onlyMorePopular=false&rows=10&NOW=1363616456389&shard.url=[ff01::114]:33332/|127.0.0.1:27176/&fl=id,score&start=0&q=*:*&spellcheck.dictionary=direct&spellcheck.count=5&isShard=true&qt=spellCheckCompRH_Direct&fsv=true} hits=24 status=0 QTime=45 
[junit4:junit4]   2> 9838 T52 C3 REQ [collection1] webapp= path=/select params={spellcheck=false&spellcheck.extendedResults=false&shards.qt=spellCheckCompRH_Direct&ids=3,2,1,10,7,6,5,4,9,8&spellcheck.q=toyata&distrib=false&wt=javabin&version=2&spellcheck.onlyMorePopular=false&NOW=1363616456389&shard.url=[ff01::114]:33332/|127.0.0.1:27176/&fl=id,lowerfilt&q=*:*&spellcheck.dictionary=direct&spellcheck.count=1&isShard=true&qt=spellCheckCompRH_Direct} status=0 QTime=11 
[junit4:junit4]   2> 9852 T48 C3 oashc.SpellCheckComponent.finishStage [ff01::114]:33332/|127.0.0.1:27176/ {suggestions={toyata={numFound=1,startOffset=0,endOffset=6,suggestion=[toyota]}}}
[junit4:junit4]   2> 9853 T48 C3 oashc.SpellCheckComponent.finishStage [ff01::114]:33332/|127.0.0.1:27176/ null
[junit4:junit4]   2> 9854 T48 C3 REQ [collection1] webapp= path=/select params={spellcheck=true&shards=[ff01::114]:33332/|127.0.0.1:27176/&fl=id,lowerfilt&shards.qt=spellCheckCompRH_Direct&q=*:*&spellcheck.q=toyata&wt=javabin&qt=spellCheckCompRH_Direct&version=2} hits=24 status=0 QTime=238 
[junit4:junit4]   2> 9857 T53 C3 REQ [collection1] webapp= path=/select params={spellcheck=true&spellcheck.extendedResults=false&shards.qt=spellCheckCompRH_Direct&spellcheck.q=toyata&distrib=false&wt=javabin&version=2&spellcheck.onlyMorePopular=false&rows=10&NOW=1363616456570&shard.url=[ff01::114]:33332/|127.0.0.1:27176/&fl=id,score&start=0&q=*:*&spellcheck.dictionary=direct&spellcheck.count=5&isShard=true&qt=spellCheckCompRH_Direct&fsv=true} hits=24 status=0 QTime=50 
[junit4:junit4]   2> 9871 T49 C3 REQ [collection1] webapp= path=/select params={spellcheck=true&spellcheck.extendedResults=false&shards.qt=spellCheckCompRH_Direct&spellcheck.q=toyata&distrib=false&wt=javabin&version=2&spellcheck.onlyMorePopular=false&rows=10&NOW=1363616456382&shard.url=[ff01::114]:33332/|127.0.0.1:27176/&fl=id,score&start=0&q=*:*&spellcheck.dictionary=direct&spellcheck.count=5&isShard=true&qt=spellCheckCompRH_Direct&fsv=true} hits=24 status=0 QTime=80 
[junit4:junit4]   2> 9878 T52 C3 REQ [collection1] webapp= path=/select params={spellcheck=false&spellcheck.extendedResults=false&shards.qt=spellCheckCompRH_Direct&ids=3,2,1,10,7,6,5,4,9,8&spellcheck.q=toyata&distrib=false&wt=javabin&version=2&spellcheck.onlyMorePopular=false&NOW=1363616456570&shard.url=[ff01::114]:33332/|127.0.0.1:27176/&fl=id,lowerfilt&q=*:*&spellcheck.dictionary=direct&spellcheck.count=1&isShard=true&qt=spellCheckCompRH_Direct} status=0 QTime=7 
[junit4:junit4]   2> 9881 T51 C3 oashc.SpellCheckComponent.finishStage [ff01::114]:33332/|127.0.0.1:27176/ {suggestions={toyata={numFound=1,startOffset=0,endOffset=6,suggestion=[toyota]}}}
[junit4:junit4]   2> 9882 T51 C3 oashc.SpellCheckComponent.finishStage [ff01::114]:33332/|127.0.0.1:27176/ null
[junit4:junit4]   2> 9883 T51 C3 REQ [collection1] webapp= path=/select params={spellcheck=true&shards=[ff01::114]:33332/|127.0.0.1:27176/&fl=id,lowerfilt&shards.qt=spellCheckCompRH_Direct&q=*:*&spellcheck.q=toyata&wt=javabin&qt=spellCheckCompRH_Direct&version=2} hits=24 status=0 QTime=86 
[junit4:junit4]   2> 9923 T49 C3 REQ [collection1] webapp= path=/select params={spellcheck=false&spellcheck.extendedResults=false&shards.qt=spellCheckCompRH_Direct&ids=3,2,1,10,7,6,5,4,9,8&spellcheck.q=toyata&distrib=false&wt=javabin&version=2&spellcheck.onlyMorePopular=false&NOW=1363616456382&shard.url=[ff01::114]:33332/|127.0.0.1:27176/&fl=id,lowerfilt&q=*:*&spellcheck.dictionary=direct&spellcheck.count=1&isShard=true&qt=spellCheckCompRH_Direct} status=0 QTime=8 
[junit4:junit4]   2> 9926 T50 C3 oashc.SpellCheckComponent.finishStage [ff01::114]:33332/|127.0.0.1:27176/ {suggestions={toyata={numFound=1,startOffset=0,endOffset=6,suggestion=[toyota]}}}
[junit4:junit4]   2> 9927 T50 C3 oashc.SpellCheckComponent.finishStage [ff01::114]:33332/|127.0.0.1:27176/ null
[junit4:junit4]   2> 9928 T50 C3 REQ [collection1] webapp= path=/select params={spellcheck=true&shards=[ff01::114]:33332/|127.0.0.1:27176/&fl=id,lowerfilt&shards.qt=spellCheckCompRH_Direct&q=*:*&spellcheck.q=toyata&wt=javabin&qt=spellCheckCompRH_Direct&version=2} hits=24 status=0 QTime=319 
[junit4:junit4]   2> 9944 T53 C3 REQ [collection1] webapp= path=/select params={spellcheck=true&spellcheck.extendedResults=false&shards.qt=spellCheckCompRH_Direct&spellcheck.q=toyata&distrib=false&wt=javabin&version=2&spellcheck.onlyMorePopular=false&rows=10&NOW=1363616456634&shard.url=[ff01::114]:33332/|127.0.0.1:27176/&fl=id,score&start=0&q=*:*&spellcheck.dictionary=direct&spellcheck.count=5&isShard=true&qt=spellCheckCompRH_Direct&fsv=true} hits=24 status=0 QTime=67 
[junit4:junit4]   2> 9973 T53 C3 REQ [collection1] webapp= path=/select params={spellcheck=false&spellcheck.extendedResults=false&shards.qt=spellCheckCompRH_Direct&ids=3,2,1,10,7,6,5,4,9,8&spellcheck.q=toyata&distrib=false&wt=javabin&version=2&spellcheck.onlyMorePopular=false&NOW=1363616456634&shard.url=[ff01::114]:33332/|127.0.0.1:27176/&fl=id,lowerfilt&q=*:*&spellcheck.dictionary=direct&spellcheck.count=1&isShard=true&qt=spellCheckCompRH_Direct} status=0 QTime=9 
[junit4:junit4]   2> 9976 T48 C3 oashc.SpellCheckComponent.finishStage [ff01::114]:33332/|127.0.0.1:27176/ {suggestions={toyata={numFound=1,startOffset=0,endOffset=6,suggestion=[toyota]}}}
[junit4:junit4]   2> 9980 T48 C3 oashc.SpellCheckComponent.finishStage [ff01::114]:33332/|127.0.0.1:27176/ null
[junit4:junit4]   2> 9981 T48 C3 REQ [collection1] webapp= path=/select params={spellcheck=true&shards=[ff01::114]:33332/|127.0.0.1:27176/&fl=id,lowerfilt&shards.qt=spellCheckCompRH_Direct&q=*:*&spellcheck.q=toyata&wt=javabin&qt=spellCheckCompRH_Direct&version=2} hits=24 status=0 QTime=120 
[junit4:junit4]   2> 10011 T49 C3 REQ [collection1] webapp= path=/select params={spellcheck=true&spellcheck.extendedResults=false&shards.qt=spellCheckCompRH_Direct&spellcheck.q=toyata&distrib=false&wt=javabin&version=2&spellcheck.onlyMorePopular=false&rows=10&NOW=1363616456709&shard.url=[ff01::114]:33332/|127.0.0.1:27176/&fl=id,score&start=0&q=*:*&spellcheck.dictionary=direct&spellcheck.count=5&isShard=true&qt=spellCheckCompRH_Direct&fsv=true} hits=24 status=0 QTime=44 
[junit4:junit4]   2> 10027 T49 C3 REQ [collection1] webapp= path=/select params={spellcheck=false&spellcheck.extendedResults=false&shards.qt=spellCheckCompRH_Direct&ids=3,2,1,10,7,6,5,4,9,8&spellcheck.q=toyata&distrib=false&wt=javabin&version=2&spellcheck.onlyMorePopular=false&NOW=1363616456709&shard.url=[ff01::114]:33332/|127.0.0.1:27176/&fl=id,lowerfilt&q=*:*&spellcheck.dictionary=direct&spellcheck.count=1&isShard=true&qt=spellCheckCompRH_Direct} status=0 QTime=7 
[junit4:junit4]   2> 10030 T50 C3 oashc.SpellCheckComponent.finishStage [ff01::114]:33332/|127.0.0.1:27176/ {suggestions={toyata={numFound=1,startOffset=0,endOffset=6,suggestion=[toyota]}}}
[junit4:junit4]   2> 10031 T50 C3 oashc.SpellCheckComponent.finishStage [ff01::114]:33332/|127.0.0.1:27176/ null
[junit4:junit4]   2> 10032 T50 C3 REQ [collection1] webapp= path=/select params={spellcheck=true&shards=[ff01::114]:33332/|127.0.0.1:27176/&fl=id,lowerfilt&shards.qt=spellCheckCompRH_Direct&q=*:*&spellcheck.q=toyata&wt=javabin&qt=spellCheckCompRH_Direct&version=2} hits=24 status=0 QTime=96 
[junit4:junit4]   2> 10083 T36 C2 REQ [collection1] webapp= path=/select params={spellcheck=true&fl=id,lowerfilt&spellcheck.extendedResults=true&shards.qt=spellCheckCompRH_Direct&q=*:*&spellcheck.q=toyata&distrib=false&wt=javabin&qt=spellCheckCompRH_Direct&version=2} hits=24 status=0 QTime=42 
[junit4:junit4]   2> 10147 T49 C3 REQ [collection1] webapp= path=/select params={spellcheck=true&spellcheck.extendedResults=true&shards.qt=spellCheckCompRH_Direct&spellcheck.q=toyata&distrib=false&wt=javabin&version=2&spellcheck.onlyMorePopular=false&rows=10&NOW=1363616456888&shard.url=127.0.0.1:27176/|[ff01::213]:33332/&fl=id,score&start=0&q=*:*&spellcheck.dictionary=direct&spellcheck.count=5&isShard=true&qt=spellCheckCompRH_Direct&fsv=true} hits=24 status=0 QTime=20 
[junit4:junit4]   2> 10164 T49 C3 REQ [collection1] webapp= path=/select params={spellcheck=false&spellcheck.extendedResults=true&shards.qt=spellCheckCompRH_Direct&ids=3,2,1,10,7,6,5,4,9,8&spellcheck.q=toyata&distrib=false&wt=javabin&version=2&spellcheck.onlyMorePopular=false&NOW=1363616456888&shard.url=127.0.0.1:27176/|[ff01::213]:33332/&fl=id,lowerfilt&q=*:*&spellcheck.dictionary=direct&spellcheck.count=1&isShard=true&qt=spellCheckCompRH_Direct} status=0 QTime=8 
[junit4:junit4]   2> 10168 T50 C3 oashc.SpellCheckComponent.finishStage 127.0.0.1:27176/|[ff01::213]:33332/ {suggestions={toyata={numFound=1,startOffset=0,endOffset=6,origFreq=0,suggestion=[{word=toyota,freq=1}]},correctlySpelled=true}}
[junit4:junit4]   2> 10169 T50 C3 oashc.SpellCheckComponent.finishStage 127.0.0.1:27176/|[ff01::213]:33332/ null
[junit4:junit4]   2> 10170 T50 C3 REQ [collection1] webapp= path=/select params={spellcheck=true&shards=127.0.0.1:27176/|[ff01::213]:33332/&fl=id,lowerfilt&spellcheck.extendedResults=true&shards.qt=spellCheckCompRH_Direct&q=*:*&spellcheck.q=toyata&wt=javabin&qt=spellCheckCompRH_Direct&version=2} hits=24 status=0 QTime=55 
[junit4:junit4]   2> 10172 T33 oas.BaseDistributedSearchTestCase.query starting stress...
[junit4:junit4]   2> 10208 T49 C3 REQ [collection1] webapp= path=/select params={spellcheck=true&spellcheck.extendedResults=true&shards.qt=spellCheckCompRH_Direct&spellcheck.q=toyata&distrib=false&wt=javabin&version=2&spellcheck.onlyMorePopular=false&rows=10&NOW=1363616456955&shard.url=127.0.0.1:27176/|[ff01::213]:33332/&fl=id,score&start=0&q=*:*&spellcheck.dictionary=direct&spellcheck.count=5&isShard=true&qt=spellCheckCompRH_Direct&fsv=true} hits=24 status=0 QTime=17 
[junit4:junit4]   2> 10209 T52 C3 REQ [collection1] webapp= path=/select params={spellcheck=true&spellcheck.extendedResults=true&shards.qt=spellCheckCompRH_Direct&spellcheck.q=toyata&distrib=false&wt=javabin&version=2&spellcheck.onlyMorePopular=false&rows=10&NOW=1363616456956&shard.url=127.0.0.1:27176/|[ff01::213]:33332/&fl=id,score&start=0&q=*:*&spellcheck.dictionary=direct&spellcheck.count=5&isShard=true&qt=spellCheckCompRH_Direct&fsv=true} hits=24 status=0 QTime=16 
[junit4:junit4]   2> 10229 T49 C3 REQ [collection1] webapp= path=/select params={spellcheck=false&spellcheck.extendedResults=true&shards.qt=spellCheckCompRH_Direct&ids=3,2,1,10,7,6,5,4,9,8&spellcheck.q=toyata&distrib=false&wt=javabin&version=2&spellcheck.onlyMorePopular=false&NOW=1363616456955&shard.url=127.0.0.1:27176/|[ff01::213]:33332/&fl=id,lowerfilt&q=*:*&spellcheck.dictionary=direct&spellcheck.count=1&isShard=true&qt=spellCheckCompRH_Direct} status=0 QTime=7 
[junit4:junit4]   2> 10230 T52 C3 REQ [collection1] webapp= path=/select params={spellcheck=false&spellcheck.extendedResults=true&shards.qt=spellCheckCompRH_Direct&ids=3,2,1,10,7,6,5,4,9,8&spellcheck.q=toyata&distrib=false&wt=javabin&version=2&spellcheck.onlyMorePopular=false&NOW=1363616456956&shard.url=127.0.0.1:27176/|[ff01::213]:33332/&fl=id,lowerfilt&q=*:*&spellcheck.dictionary=direct&spellcheck.count=1&isShard=true&qt=spellCheckCompRH_Direct} status=0 QTime=9 
[junit4:junit4]   2> 10232 T53 C3 REQ [collection1] webapp= path=/select params={spellcheck=true&spellcheck.extendedResults=true&shards.qt=spellCheckCompRH_Direct&spellcheck.q=toyata&distrib=false&wt=javabin&version=2&spellcheck.onlyMorePopular=false&rows=10&NOW=1363616456955&shard.url=127.0.0.1:27176/|[ff01::213]:33332/&fl=id,score&start=0&q=*:*&spellcheck.dictionary=direct&spellcheck.count=5&isShard=true&qt=spellCheckCompRH_Direct&fsv=true} hits=24 status=0 QTime=25 
[junit4:junit4]   2> 10233 T51 C3 oashc.SpellCheckComponent.finishStage 127.0.0.1:27176/|[ff01::213]:33332/ {suggestions={toyata={numFound=1,startOffset=0,endOffset=6,origFreq=0,suggestion=[{word=toyota,freq=1}]},correctlySpelled=true}}
[junit4:junit4]   2> 10233 T50 C3 oashc.SpellCheckComponent.finishStage 127.0.0.1:27176/|[ff01::213]:33332/ {suggestions={toyata={numFound=1,startOffset=0,endOffset=6,origFreq=0,suggestion=[{word=toyota,freq=1}]},correctlySpelled=true}}
[junit4:junit4]   2> 10234 T51 C3 oashc.SpellCheckComponent.finishStage 127.0.0.1:27176/|[ff01::213]:33332/ null
[junit4:junit4]   2> 10234 T50 C3 oashc.SpellCheckComponent.finishStage 127.0.0.1:27176/|[ff01::213]:33332/ null
[junit4:junit4]   2> 10235 T51 C3 REQ [collection1] webapp= path=/select params={spellcheck=true&shards=127.0.0.1:27176/|[ff01::213]:33332/&fl=id,lowerfilt&spellcheck.extendedResults=true&shards.qt=spellCheckCompRH_Direct&q=*:*&spellcheck.q=toyata&wt=javabin&qt=spellCheckCompRH_Direct&version=2} hits=24 status=0 QTime=52 
[junit4:junit4]   2> 10236 T50 C3 REQ [collection1] webapp= path=/select params={spellcheck=true&shards=127.0.0.1:27176/|[ff01::213]:33332/&fl=id,lowerfilt&spellcheck.extendedResults=true&shards.qt=spellCheckCompRH_Direct&q=*:*&spellcheck.q=toyata&wt=javabin&qt=spellCheckCompRH_Direct&version=2} hits=24 status=0 QTime=54 
[junit4:junit4]   2> 10251 T53 C3 REQ [collection1] webapp= path=/select params={spellcheck=false&spellcheck.extendedResults=true&shards.qt=spellCheckCompRH_Direct&ids=3,2,1,10,7,6,5,4,9,8&spellcheck.q=toyata&distrib=false&wt=javabin&version=2&spellcheck.onlyMorePopular=false&NOW=1363616456955&shard.url=127.0.0.1:27176/|[ff01::213]:33332/&fl=id,lowerfilt&q=*:*&spellcheck.dictionary=direct&spellcheck.count=1&isShard=true&qt=spellCheckCompRH_Direct} status=0 QTime=8 
[junit4:junit4]   2> 10254 T48 C3 oashc.SpellCheckComponent.finishStage 127.0.0.1:27176/|[ff01::213]:33332/ {suggestions={toyata={numFound=1,startOffset=0,endOffset=6,origFreq=0,suggestion=[{word=toyota,freq=1}]},correctlySpelled=true}}
[junit4:junit4]   2> 10255 T48 C3 oashc.SpellCheckComponent.finishStage 127.0.0.1:27176/|[ff01::213]:33332/ null
[junit4:junit4]   2> 10256 T48 C3 REQ [collection1] webapp= path=/select params={spellcheck=true&shards=127.0.0.1:27176/|[ff01::213]:33332/&fl=id,lowerfilt&spellcheck.extendedResults=true&shards.qt=spellCheckCompRH_Direct&q=*:*&spellcheck.q=toyata&wt=javabin&qt=spellCheckCompRH_Direct&version=2} hits=24 status=0 QTime=74 
[junit4:junit4]   2> 10264 T52 C3 REQ [collection1] webapp= path=/select params={spellcheck=true&spellcheck.extendedResults=true&shards.qt=spellCheckCompRH_Direct&spellcheck.q=toyata&distrib=false&wt=javabin&version=2&spellcheck.onlyMorePopular=false&rows=10&NOW=1363616457017&shard.url=127.0.0.1:27176/|[ff01::213]:33332/&fl=id,score&start=0&q=*:*&spellcheck.dictionary=direct&spellcheck.count=5&isShard=true&qt=spellCheckCompRH_Direct&fsv=true} hits=24 status=0 QTime=14 
[junit4:junit4]   2> 10265 T49 C3 REQ [collection1] webapp= path=/select params={spellcheck=true&spellcheck.extendedResults=true&shards.qt=spellCheckCompRH_Direct&spellcheck.q=toyata&distrib=false&wt=javabin&version=2&spellcheck.onlyMorePopular=false&rows=10&NOW=1363616457017&shard.url=127.0.0.1:27176/|[ff01::213]:33332/&fl=id,score&start=0&q=*:*&spellcheck.dictionary=direct&spellcheck.count=5&isShard=true&qt=spellCheckCompRH_Direct&fsv=true} hits=24 status=0 QTime=16 
[junit4:junit4]   2> 10280 T53 C3 REQ [collection1] webapp= path=/select params={spellcheck=false&spellcheck.extendedResults=true&shards.qt=spellCheckCompRH_Direct&ids=3,2,1,10,7,6,5,4,9,8&spellcheck.q=toyata&distrib=false&wt=javabin&version=2&spellcheck.onlyMorePopular=false&NOW=1363616457017&shard.url=127.0.0.1:27176/|[ff01::213]:33332/&fl=id,lowerfilt&q=*:*&spellcheck.dictionary=direct&spellcheck.count=1&isShard=true&qt=spellCheckCompRH_Direct} status=0 QTime=7 
[junit4:junit4]   2> 10280 T49 C3 REQ [collection1] webapp= path=/select params={spellcheck=false&spellcheck.extendedResults=true&shards.qt=spellCheckCompRH_Direct&ids=3,2,1,10,7,6,5,4,9,8&spellcheck.q=toyata&distrib=false&wt=javabin&version=2&spellcheck.onlyMorePopular=false&NOW=1363616457017&shard.url=127.0.0.1:27176/|[ff01::213]:33332/&fl=id,lowerfilt&q=*:*&spellcheck.dictionary=direct&spellcheck.count=1&isShard=true&qt=spellCheckCompRH_Direct} status=0 QTime=7 
[junit4:junit4]   2> 10283 T52 C3 REQ [collection1] webapp= path=/select params={spellcheck=true&spellcheck.extendedResults=true&shards.qt=spellCheckCompRH_Direct&spellcheck.q=toyata&distrib=false&wt=javabin&version=2&spellcheck.onlyMorePopular=false&rows=10&NOW=1363616457037&shard.url=127.0.0.1:27176/|[ff01::213]:33332/&fl=id,score&start=0&q=*:*&spellcheck.dictionary=direct&spellcheck.count=5&isShard=true&qt=spellCheckCompRH_Direct&fsv=true} hits=24 status=0 QTime=12 
[junit4:junit4]   2> 10283 T51 C3 oashc.SpellCheckComponent.finishStage 127.0.0.1:27176/|[ff01::213]:33332/ {suggestions={toyata={numFound=1,startOffset=0,endOffset=6,origFreq=0,suggestion=[{word=toyota,freq=1}]},correctlySpelled=true}}
[junit4:junit4]   2> 10284 T50 C3 oashc.SpellCheckComponent.finishStage 127.0.0.1:27176/|[ff01::213]:33332/ {suggestions={toyata={numFound=1,startOffset=0,endOffset=6,origFreq=0,suggestion=[{word=toyota,freq=1}]},correctlySpelled=true}}
[junit4:junit4]   2> 10285 T50 C3 oashc.SpellCheckComponent.finishStage 127.0.0.1:27176/|[ff01::213]:33332/ null
[junit4:junit4]   2> 10285 T51 C3 oashc.SpellCheckComponent.finishStage 127.0.0.1:27176/|[ff01::213]:33332/ null
[junit4:junit4]   2> 10287 T51 C3 REQ [collection1] webapp= path=/select params={spellcheck=true&shards=127.0.0.1:27176/|[ff01::213]:33332/&fl=id,lowerfilt&spellcheck.extendedResults=true&shards.qt=spellCheckCompRH_Direct&q=*:*&spellcheck.q=toyata&wt=javabin&qt=spellCheckCompRH_Direct&version=2} hits=24 status=0 QTime=43 
[junit4:junit4]   2> 10287 T50 C3 REQ [collection1] webapp= path=/select params={spellcheck=true&shards=127.0.0.1:27176/|[ff01::213]:33332/&fl=id,lowerfilt&spellcheck.extendedResults=true&shards.qt=spellCheckCompRH_Direct&q=*:*&spellcheck.q=toyata&wt=javabin&qt=spellCheckCompRH_Direct&version=2} hits=24 status=0 QTime=43 
[junit4:junit4]   2> 10303 T52 C3 REQ [collection1] webapp= path=/select params={spellcheck=false&spellcheck.extendedResults=true&shards.qt=spellCheckCompRH_Direct&ids=3,2,1,10,7,6,5,4,9,8&spellcheck.q=toyata&distrib=false&wt=javabin&version=2&spellcheck.onlyMorePopular=false&NOW=1363616457037&shard.url=127.0.0.1:27176/|[ff01::213]:33332/&fl=id,lowerfilt&q=*:*&spellcheck.dictionary=direct&spellcheck.count=1&isShard=true&qt=spellCheckCompRH_Direct} status=0 QTime=9 
[junit4:junit4]   2> 10306 T48 C3 oashc.SpellCheckComponent.finishStage 127.0.0.1:27176/|[ff01::213]:33332/ {suggestions={toyata={numFound=1,startOffset=0,endOffset=6,origFreq=0,suggestion=[{word=toyota,freq=1}]},correctlySpelled=true}}
[junit4:junit4]   2> 10308 T48 C3 oashc.SpellCheckComponent.finishStage 127.0.0.1:27176/|[ff01::213]:33332/ null
[junit4:junit4]   2> 10309 T48 C3 REQ [collection1] webapp= path=/select params={spellcheck=true&shards=127.0.0.1:27176/|[ff01::213]:33332/&fl=id,lowerfilt&spellcheck.extendedResults=true&shards.qt=spellCheckCompRH_Direct&q=*:*&spellcheck.q=toyata&wt=javabin&qt=spellCheckCompRH_Direct&version=2} hits=24 status=0 QTime=45 
[junit4:junit4]   2> 10337 T36 C2 REQ [collection1] webapp= path=/select params={spellcheck=true&fl=id,lowerfilt&spellcheck.extendedResults=true&shards.qt=spellCheckCompRH_Direct&q=*:*&spellcheck.q=bluo&distrib=false&spellcheck.count=4&wt=javabin&qt=spellCheckCompRH_Direct&version=2} hits=24 status=0 QTime=14 
[junit4:junit4]   2> 10360 T52 C3 REQ [collection1] webapp= path=/select params={spellcheck=true&spellcheck.extendedResults=true&shards.qt=spellCheckCompRH_Direct&spellcheck.q=bluo&distrib=false&wt=javabin&version=2&spellcheck.onlyMorePopular=false&rows=10&NOW=1363616457118&shard.url=127.0.0.1:27176/&fl=id,score&start=0&q=*:*&spellcheck.dictionary=direct&spellcheck.count=5&isShard=true&qt=spellCheckCompRH_Direct&fsv=true} hits=24 status=0 QTime=9 
[junit4:junit4]   2> 10378 T52 C3 REQ [collection1] webapp= path=/select params={spellcheck=false&spellcheck.extendedResults=true&shards.qt=spellCheckCompRH_Direct&ids=3,2,1,10,7,6,5,4,9,8&spellcheck.q=bluo&distrib=false&wt=javabin&version=2&spellcheck.onlyMorePopular=false&NOW=1363616457118&shard.url=127.0.0.1:27176/&fl=id,lowerfilt&q=*:*&spellcheck.dictionary=direct&spellcheck.count=4&isShard=true&qt=spellCheckCompRH_Direct} status=0 QTime=8 
[junit4:junit4]   2> 10381 T48 C3 oashc.SpellCheckComponent.finishStage 127.0.0.1:27176/ {suggestions={bluo={numFound=1,startOffset=0,endOffset=4,origFreq=0,suggestion=[{word=blue,freq=1}]},correctlySpelled=true}}
[junit4:junit4]   2> 10382 T48 C3 oashc.SpellCheckComponent.finishStage 127.0.0.1:27176/ null
[junit4:junit4]   2> 10383 T48 C3 REQ [collection1] webapp= path=/select params={spellcheck=true&shards=127.0.0.1:27176/&fl=id,lowerfilt&spellcheck.extendedResults=true&shards.qt=spellCheckCompRH_Direct&q=*:*&spellcheck.q=bluo&spellcheck.count=4&wt=javabin&qt=spellCheckCompRH_Direct&version=2} hits=24 status=0 QTime=38 
[junit4:junit4]   2> 10385 T33 oas.BaseDistributedSearchTestCase.query starting stress...
[junit4:junit4]   2> 10407 T49 C3 REQ [collection1] webapp= path=/select params={spellcheck=true&spellcheck.extendedResults=true&shards.qt=spellCheckCompRH_Direct&spellcheck.q=bluo&distrib=false&wt=javabin&version=2&spellcheck.onlyMorePopular=false&rows=10&NOW=1363616457165&shard.url=127.0.0.1:27176/&fl=id,score&start=0&q=*:*&spellcheck.dictionary=direct&spellcheck.count=5&isShard=true&qt=spellCheckCompRH_Direct&fsv=true} hits=24 status=0 QTime=9 
[junit4:junit4]   2> 10407 T53 C3 REQ [collection1] webapp= path=/select params={spellcheck=true&spellcheck.extendedResults=true&shards.qt=spellCheckCompRH_Direct&spellcheck.q=bluo&distrib=false&wt=javabin&version=2&spellcheck.onlyMorePopular=false&rows=10&NOW=1363616457164&shard.url=127.0.0.1:27176/&fl=id,score&start=0&q=*:*&spellcheck.dictionary=direct&spellcheck.count=5&isShard=true&qt=spellCheckCompRH_Direct&fsv=true} hits=24 status=0 QTime=9 
[junit4:junit4]   2> 10407 T52 C3 REQ [collection1] webapp= path=/select params={spellcheck=true&spellcheck.extendedResults=true&shards.qt=spellCheckCompRH_Direct&spellcheck.q=bluo&distrib=false&wt=javabin&version=2&spellcheck.onlyMorePopular=false&rows=10&NOW=1363616457164&shard.url=127.0.0.1:27176/&fl=id,score&start=0&q=*:*&spellcheck.dictionary=direct&spellcheck.count=5&isShard=true&qt=spellCheckCompRH_Direct&fsv=true} hits=24 status=0 QTime=8 
[junit4:junit4]   2> 10426 T49 C3 REQ [collection1] webapp= path=/select params={spellcheck=false&spellcheck.extendedResults=true&shards.qt=spellCheckCompRH_Direct&ids=3,2,1,10,7,6,5,4,9,8&spellcheck.q=bluo&distrib=false&wt=javabin&version=2&spellcheck.onlyMorePopular=false&NOW=1363616457164&shard.url=127.0.0.1:27176/&fl=id,lowerfilt&q=*:*&spellcheck.dictionary=direct&spellcheck.count=4&isShard=true&qt=spellCheckCompRH_Direct} status=0 QTime=9 
[junit4:junit4]   2> 10426 T53 C3 REQ [collection1] webapp= path=/select params={spellcheck=false&spellcheck.extendedResults=true&shards.qt=spellCheckCompRH_Direct&ids=3,2,1,10,7,6,5,4,9,8&spellcheck.q=bluo&distrib=false&wt=javabin&version=2&spellcheck.onlyMorePopular=false&NOW=1363616457164&shard.url=127.0.0.1:27176/&fl=id,lowerfilt&q=*:*&spellcheck.dictionary=direct&spellcheck.count=4&isShard=true&qt=spellCheckCompRH_Direct} status=0 QTime=9 
[junit4:junit4]   2> 10428 T52 C3 REQ [collection1] webapp= path=/select params={spellcheck=false&spellcheck.extendedResults=true&shards.qt=spellCheckCompRH_Direct&ids=3,2,1,10,7,6,5,4,9,8&spellcheck.q=bluo&distrib=false&wt=javabin&version=2&spellcheck.onlyMorePopular=false&NOW=1363616457165&shard.url=127.0.0.1:27176/&fl=id,lowerfilt&q=*:*&spellcheck.dictionary=direct&spellcheck.count=4&isShard=true&qt=spellCheckCompRH_Direct} status=0 QTime=8 
[junit4:junit4]   2> 10429 T48 C3 oashc.SpellCheckComponent.finishStage 127.0.0.1:27176/ {suggestions={bluo={numFound=1,startOffset=0,endOffset=4,origFreq=0,suggestion=[{word=blue,freq=1}]},correctlySpelled=true}}
[junit4:junit4]   2> 10430 T50 C3 oashc.SpellCheckComponent.finishStage 127.0.0.1:27176/ {suggestions={bluo={numFound=1,startOffset=0,endOffset=4,origFreq=0,suggestion=[{word=blue,freq=1}]},correctlySpelled=true}}
[junit4:junit4]   2> 10430 T48 C3 oashc.SpellCheckComponent.finishStage 127.0.0.1:27176/ null
[junit4:junit4]   2> 10431 T51 C3 oashc.SpellCheckComponent.finishStage 127.0.0.1:27176/ {suggestions={bluo={numFound=1,startOffset=0,endOffset=4,origFreq=0,suggestion=[{word=blue,freq=1}]},correctlySpelled=true}}
[junit4:junit4]   2> 10431 T50 C3 oashc.SpellCheckComponent.finishStage 127.0.0.1:27176/ null
[junit4:junit4]   2> 10432 T48 C3 REQ [collection1] webapp= path=/select params={spellcheck=true&shards=127.0.0.1:27176/&fl=id,lowerfilt&spellcheck.extendedResults=true&shards.qt=spellCheckCompRH_Direct&q=*:*&spellcheck.q=bluo&spellcheck.count=4&wt=javabin&qt=spellCheckCompRH_Direct&version=2} hits=24 status=0 QTime=41 
[junit4:junit4]   2> 10432 T51 C3 oashc.SpellCheckComponent.finishStage 127.0.0.1:27176/ null
[junit4:junit4]   2> 10433 T50 C3 REQ [collection1] webapp= path=/select params={spellcheck=true&shards=127.0.0.1:27176/&fl=id,lowerfilt&spellcheck.extendedResults=true&shards.qt=spellCheckCompRH_Direct&q=*:*&spellcheck.q=bluo&spellcheck.count=4&wt=javabin&qt=spellCheckCompRH_Direct&version=2} hits=24 status=0 QTime=42 
[junit4:junit4]   2> 10435 T51 C3 REQ [collection1] webapp= path=/select params={spellcheck=true&shards=127.0.0.1:27176/&fl=id,lowerfilt&spellcheck.extendedResults=true&shards.qt=spellCheckCompRH_Direct&q=*:*&spellcheck.q=bluo&spellcheck.count=4&wt=javabin&qt=spellCheckCompRH_Direct&version=2} hits=24 status=0 QTime=43 
[junit4:junit4]   2> 10456 T52 C3 REQ [collection1] webapp= path=/select params={spellcheck=true&spellcheck.extendedResults=true&shards.qt=spellCheckCompRH_Direct&spellcheck.q=bluo&distrib=false&wt=javabin&version=2&spellcheck.onlyMorePopular=false&rows=10&NOW=1363616457214&shard.url=127.0.0.1:27176/&fl=id,score&start=0&q=*:*&spellcheck.dictionary=direct&spellcheck.count=5&isShard=true&qt=spellCheckCompRH_Direct&fsv=true} hits=24 status=0 QTime=7 
[junit4:junit4]   2> 10461 T49 C3 REQ [collection1] webapp= path=/select params={spellcheck=true&spellcheck.extendedResults=true&shards.qt=spellCheckCompRH_Direct&spellcheck.q=bluo&distrib=false&wt=javabin&version=2&spellcheck.onlyMorePopular=false&rows=10&NOW=1363616457216&shard.url=127.0.0.1:27176/&fl=id,score&start=0&q=*:*&spellcheck.dictionary=direct&spellcheck.count=5&isShard=true&qt=spellCheckCompRH_Direct&fsv=true} hits=24 status=0 QTime=11 
[junit4:junit4]   2> 10461 T53 C3 REQ [collection1] webapp= path=/select params={spellcheck=true&spellcheck.extendedResults=true&shards.qt=spellCheckCompRH_Direct&spellcheck.q=bluo&distrib=false&wt=javabin&version=2&spellcheck.onlyMorePopular=false&rows=10&NOW=1363616457216&shard.url=127.0.0.1:27176/&fl=id,score&start=0&q=*:*&spellcheck.dictionary=direct&spellcheck.count=5&isShard=true&qt=spellCheckCompRH_Direct&fsv=true} hits=24 status=0 QTime=8 
[junit4:junit4]   2> 10478 T49 C3 REQ [collection1] webapp= path=/select params={spellcheck=false&spellcheck.extendedResults=true&shards.qt=spellCheckCompRH_Direct&ids=3,2,1,10,7,6,5,4,9,8&spellcheck.q=bluo&distrib=false&wt=javabin&version=2&spellcheck.onlyMorePopular=false&NOW=1363616457216&shard.url=127.0.0.1:27176/&fl=id,lowerfilt&q=*:*&spellcheck.dictionary=direct&spellcheck.count=4&isShard=true&qt=spellCheckCompRH_Direct} status=0 QTime=8 
[junit4:junit4]   2> 10479 T53 C3 REQ [collection1] webapp= path=/select params={spellcheck=false&spellcheck.extendedResults=true&shards.qt=spellCheckCompRH_Direct&ids=3,2,1,10,7,6,5,4,9,8&spellcheck.q=bluo&distrib=false&wt=javabin&version=2&spellcheck.onlyMorePopular=false&NOW=1363616457216&shard.url=127.0.0.1:27176/&fl=id,lowerfilt&q=*:*&spellcheck.dictionary=direct&spellcheck.count=4&isShard=true&qt=spellCheckCompRH_Direct} status=0 QTime=8 
[junit4:junit4]   2> 10483 T51 C3 oashc.SpellCheckComponent.finishStage 127.0.0.1:27176/ {suggestions={bluo={numFound=1,startOffset=0,endOffset=4,origFreq=0,suggestion=[{word=blue,freq=1}]},correctlySpelled=true}}
[junit4:junit4]   2> 10483 T50 C3 oashc.SpellCheckComponent.finishStage 127.0.0.1:27176/ {suggestions={bluo={numFound=1,startOffset=0,endOffset=4,origFreq=0,suggestion=[{word=blue,freq=1}]},correctlySpelled=true}}
[junit4:junit4]   2> 10484 T51 C3 oashc.SpellCheckComponent.finishStage 127.0.0.1:27176/ null
[junit4:junit4]   2> 10485 T50 C3 oashc.SpellCheckComponent.finishStage 127.0.0.1:27176/ null
[junit4:junit4]   2> 10486 T51 C3 REQ [collection1] webapp= path=/select params={spellcheck=true&shards=127.0.0.1:27176/&fl=id,lowerfilt&spellcheck.extendedResults=true&shards.qt=spellCheckCompRH_Direct&q=*:*&spellcheck.q=bluo&spellcheck.count=4&wt=javabin&qt=spellCheckCompRH_Direct&version=2} hits=24 status=0 QTime=43 
[junit4:junit4]   2> 10486 T50 C3 REQ [collection1] webapp= path=/select params={spellcheck=true&shards=127.0.0.1:27176/&fl=id,lowerfilt&spellcheck.extendedResults=true&shards.qt=spellCheckCompRH_Direct&q=*:*&spellcheck.q=bluo&spellcheck.count=4&wt=javabin&qt=spellCheckCompRH_Direct&version=2} hits=24 status=0 QTime=43 
[junit4:junit4]   2> 10491 T52 C3 REQ [collection1] webapp= path=/select params={spellcheck=false&spellcheck.extendedResults=true&shards.qt=spellCheckCompRH_Direct&ids=3,2,1,10,7,6,5,4,9,8&spellcheck.q=bluo&distrib=false&wt=javabin&version=2&spellcheck.onlyMorePopular=false&NOW=1363616457214&shard.url=127.0.0.1:27176/&fl=id,lowerfilt&q=*:*&spellcheck.dictionary=direct&spellcheck.count=4&isShard=true&qt=spellCheckCompRH_Direct} status=0 QTime=6 
[junit4:junit4]   2> 10494 T48 C3 oashc.SpellCheckComponent.finishStage 127.0.0.1:27176/ {suggestions={bluo={numFound=1,startOffset=0,endOffset=4,origFreq=0,suggestion=[{word=blue,freq=1}]},correctlySpelled=true}}
[junit4:junit4]   2> 10495 T48 C3 oashc.SpellCheckComponent.finishStage 127.0.0.1:27176/ null
[junit4:junit4]   2> 10496 T48 C3 REQ [collection1] webapp= path=/select params={spellcheck=true&shards=127.0.0.1:27176/&fl=id,lowerfilt&spellcheck.extendedResults=true&shards.qt=spellCheckCompRH_Direct&q=*:*&spellcheck.q=bluo&spellcheck.count=4&wt=javabin&qt=spellCheckCompRH_Direct&version=2} hits=24 status=0 QTime=55 
[junit4:junit4]   2> 10645 T36 C2 REQ [collection1] webapp= path=/select params={spellcheck=true&fl=id,lowerfilt&spellcheck.extendedResults=true&shards.qt=spellCheckCompRH_Direct&q=The+quick+reb+fox+jumped+over+the+lazy+brown+dogs&distrib=false&spellcheck.count=4&wt=javabin&spellcheck.collate=true&qt=spellCheckCompRH_Direct&version=2} hits=0 status=0 QTime=140 
[junit4:junit4]   2> 10697 T52 C3 REQ [collection1] webapp= path=/select params={spellcheck=true&spellcheck.extendedResults=true&shards.qt=spellCheckCompRH_Direct&distrib=false&wt=javabin&spellcheck.collate=true&version=2&spellcheck.onlyMorePopular=false&rows=10&NOW=1363616457435&shard.url=127.0.0.1:27176/|[ff01::083]:33332/&fl=id,score&start=0&q=The+quick+reb+fox+jumped+over+the+lazy+brown+dogs&spellcheck.dictionary=direct&spellcheck.count=5&isShard=true&qt=spellCheckCompRH_Direct&fsv=true} hits=0 status=0 QTime=23 
[junit4:junit4]   2> 10700 T48 C3 oashc.SpellCheckComponent.finishStage 127.0.0.1:27176/|[ff01::083]:33332/ {suggestions={reb={numFound=1,startOffset=10,endOffset=13,origFreq=0,suggestion=[{word=red,freq=13}]},dogs={numFound=1,startOffset=45,endOffset=49,origFreq=0,suggestion=[{word=dogs.,freq=13}]},correctlySpelled=false,collation=The quick red fox jumped over the lazy brown dogs.}}
[junit4:junit4]   2> 10701 T48 C3 REQ [collection1] webapp= path=/select params={spellcheck=true&shards=127.0.0.1:27176/|[ff01::083]:33332/&fl=id,lowerfilt&spellcheck.extendedResults=true&shards.qt=spellCheckCompRH_Direct&q=The+quick+reb+fox+jumped+over+the+lazy+brown+dogs&spellcheck.count=4&wt=javabin&spellcheck.collate=true&qt=spellCheckCompRH_Direct&version=2} hits=0 status=0 QTime=39 
[junit4:junit4]   2> 10703 T33 oas.BaseDistributedSearchTestCase.query starting stress...
[junit4:junit4]   2> 10736 T52 C3 REQ [collection1] webapp= path=/select params={spellcheck=true&spellcheck.extendedResults=true&shards.qt=spellCheckCompRH_Direct&distrib=false&wt=javabin&spellcheck.collate=true&version=2&spellcheck.onlyMorePopular=false&rows=10&NOW=1363616457482&shard.url=127.0.0.1:27176/|[ff01::083]:33332/&fl=id,score&start=0&q=The+quick+reb+fox+jumped+over+the+lazy+brown+dogs&spellcheck.dictionary=direct&spellcheck.count=5&isShard=true&qt=spellCheckCompRH_Direct&fsv=true} hits=0 status=0 QTime=19 
[junit4:junit4]   2> 10739 T48 C3 oashc.SpellCheckComponent.finishStage 127.0.0.1:27176/|[ff01::083]:33332/ {suggestions={reb={numFound=1,startOffset=10,endOffset=13,origFreq=0,suggestion=[{word=red,freq=13}]},dogs={numFound=1,startOffset=45,endOffset=49,origFreq=0,suggestion=[{word=dogs.,freq=13}]},correctlySpelled=false,collation=The quick red fox jumped over the lazy brown dogs.}}
[junit4:junit4]   2> 10740 T53 C3 REQ [collection1] webapp= path=/select params={spellcheck=true&spellcheck.extendedResults=true&shards.qt=spellCheckCompRH_Direct&distrib=false&wt=javabin&spellcheck.collate=true&version=2&spellcheck.onlyMorePopular=false&rows=10&NOW=1363616457483&shard.url=127.0.0.1:27176/|[ff01::083]:33332/&fl=id,score&start=0&q=The+quick+reb+fox+jumped+over+the+lazy+brown+dogs&spellcheck.dictionary=direct&spellcheck.count=5&isShard=true&qt=spellCheckCompRH_Direct&fsv=true} hits=0 status=0 QTime=21 
[junit4:junit4]   2> 10740 T48 C3 REQ [collection1] webapp= path=/select params={spellcheck=true&shards=127.0.0.1:27176/|[ff01::083]:33332/&fl=id,lowerfilt&spellcheck.extendedResults=true&shards.qt=spellCheckCompRH_Direct&q=The+quick+reb+fox+jumped+over+the+lazy+brown+dogs&spellcheck.count=4&wt=javabin&spellcheck.collate=true&qt=spellCheckCompRH_Direct&version=2} hits=0 status=0 QTime=31 
[junit4:junit4]   2> 10740 T49 C3 REQ [collection1] webapp= path=/select params={spellcheck=true&spellcheck.extendedResults=true&shards.qt=spellCheckCompRH_Direct&distrib=false&wt=javabin&spellcheck.collate=true&version=2&spellcheck.onlyMorePopular=false&rows=10&NOW=1363616457483&shard.url=127.0.0.1:27176/|[ff01::083]:33332/&fl=id,score&start=0&q=The+quick+reb+fox+jumped+over+the+lazy+brown+dogs&spellcheck.dictionary=direct&spellcheck.count=5&isShard=true&qt=spellCheckCompRH_Direct&fsv=true} hits=0 status=0 QTime=21 
[junit4:junit4]   2> 10742 T50 C3 oashc.SpellCheckComponent.finishStage 127.0.0.1:27176/|[ff01::083]:33332/ {suggestions={reb={numFound=1,startOffset=10,endOffset=13,origFreq=0,suggestion=[{word=red,freq=13}]},dogs={numFound=1,startOffset=45,endOffset=49,origFreq=0,suggestion=[{word=dogs.,freq=13}]},correctlySpelled=false,collation=The quick red fox jumped over the lazy brown dogs.}}
[junit4:junit4]   2> 10744 T50 C3 REQ [collection1] webapp= path=/select params={spellcheck=true&shards=127.0.0.1:27176/|[ff01::083]:33332/&fl=id,lowerfilt&spellcheck.extendedResults=true&shards.qt=spellCheckCompRH_Direct&q=The+quick+reb+fox+jumped+over+the+lazy+brown+dogs&spellcheck.count=4&wt=javabin&spellcheck.collate=true&qt=spellCheckCompRH_Direct&version=2} hits=0 status=0 QTime=34 
[junit4:junit4]   2> 10745 T51 C3 oashc.SpellCheckComponent.finishStage 127.0.0.1:27176/|[ff01::083]:33332/ {suggestions={reb={numFound=1,startOffset=10,endOffset=13,origFreq=0,suggestion=[{word=red,freq=13}]},dogs={numFound=1,startOffset=45,endOffset=49,origFreq=0,suggestion=[{word=dogs.,freq=13}]},correctlySpelled=false,collation=The quick red fox jumped over the lazy brown dogs.}}
[junit4:junit4]   2> 10747 T51 C3 REQ [collection1] webapp= path=/select params={spellcheck=true&shards=127.0.0.1:27176/|[ff01::083]:33332/&fl=id,lowerfilt&spellcheck.extendedResults=true&shards.qt=spellCheckCompRH_Direct&q=The+quick+reb+fox+jumped+over+the+lazy+brown+dogs&spellcheck.count=4&wt=javabin&spellcheck.collate=true&qt=spellCheckCompRH_Direct&version=2} hits=0 status=0 QTime=36 
[junit4:junit4]   2> 10780 T49 C3 REQ [collection1] webapp= path=/select params={spellcheck=true&spellcheck.extendedResults=true&shards.qt=spellCheckCompRH_Direct&distrib=false&wt=javabin&spellcheck.collate=true&version=2&spellcheck.onlyMorePopular=false&rows=10&NOW=1363616457523&shard.url=127.0.0.1:27176/|[ff01::083]:33332/&fl=id,score&start=0&q=The+quick+reb+fox+jumped+over+the+lazy+brown+dogs&spellcheck.dictionary=direct&spellcheck.count=5&isShard=true&qt=spellCheckCompRH_Direct&fsv=true} hits=0 status=0 QTime=20 
[junit4:junit4]   2> 10780 T53 C3 REQ [collection1] webapp= path=/select params={spellcheck=true&spellcheck.extendedResults=true&shards.qt=spellCheckCompRH_Direct&distrib=false&wt=javabin&spellcheck.collate=true&version=2&spellcheck.onlyMorePopular=false&rows=10&NOW=1363616457524&shard.url=127.0.0.1:27176/|[ff01::083]:33332/&fl=id,score&start=0&q=The+quick+reb+fox+jumped+over+the+lazy+brown+dogs&spellcheck.dictionary=direct&spellcheck.count=5&isShard=true&qt=spellCheckCompRH_Direct&fsv=true} hits=0 status=0 QTime=19 
[junit4:junit4]   2> 10783 T48 C3 oashc.SpellCheckComponent.finishStage 127.0.0.1:27176/|[ff01::083]:33332/ {suggestions={reb={numFound=1,startOffset=10,endOffset=13,origFreq=0,suggestion=[{word=red,freq=13}]},dogs={numFound=1,startOffset=45,endOffset=49,origFreq=0,suggestion=[{word=dogs.,freq=13}]},correctlySpelled=false,collation=The quick red fox jumped over the lazy brown dogs.}}
[junit4:junit4]   2> 10783 T50 C3 oashc.SpellCheckComponent.finishStage 127.0.0.1:27176/|[ff01::083]:33332/ {suggestions={reb={numFound=1,startOffset=10,endOffset=13,origFreq=0,suggestion=[{word=red,freq=13}]},dogs={numFound=1,startOffset=45,endOffset=49,origFreq=0,suggestion=[{word=dogs.,freq=13}]},correctlySpelled=false,collation=The quick red fox jumped over the lazy brown dogs.}}
[junit4:junit4]   2> 10784 T50 C3 REQ [collection1] webapp= path=/select params={spellcheck=true&shards=127.0.0.1:27176/|[ff01::083]:33332/&fl=id,lowerfilt&spellcheck.extendedResults=true&shards.qt=spellCheckCompRH_Direct&q=The+quick+reb+fox+jumped+over+the+lazy+brown+dogs&spellcheck.count=4&wt=javabin&spellcheck.collate=true&qt=spellCheckCompRH_Direct&version=2} hits=0 status=0 QTime=33 
[junit4:junit4]   2> 10784 T48 C3 REQ [collection1] webapp= path=/select params={spellcheck=true&shards=127.0.0.1:27176/|[ff01::083]:33332/&fl=id,lowerfilt&spellcheck.extendedResults=true&shards.qt=spellCheckCompRH_Direct&q=The+quick+reb+fox+jumped+over+the+lazy+brown+dogs&spellcheck.count=4&wt=javabin&spellcheck.collate=true&qt=spellCheckCompRH_Direct&version=2} hits=0 status=0 QTime=34 
[junit4:junit4]   2> 10805 T49 C3 REQ [collection1] webapp= path=/select params={spellcheck=true&spellcheck.extendedResults=true&shards.qt=spellCheckCompRH_Direct&distrib=false&wt=javabin&spellcheck.collate=true&version=2&spellcheck.onlyMorePopular=false&rows=10&NOW=1363616457550&shard.url=127.0.0.1:27176/|[ff01::083]:33332/&fl=id,score&start=0&q=The+quick+reb+fox+jumped+over+the+lazy+brown+dogs&spellcheck.dictionary=direct&spellcheck.count=5&isShard=true&qt=spellCheckCompRH_Direct&fsv=true} hits=0 status=0 QTime=18 
[junit4:junit4]   2> 10807 T51 C3 oashc.SpellCheckComponent.finishStage 127.0.0.1:27176/|[ff01::083]:33332/ {suggestions={reb={numFound=1,startOffset=10,endOffset=13,origFreq=0,suggestion=[{word=red,freq=13}]},dogs={numFound=1,startOffset=45,endOffset=49,origFreq=0,suggestion=[{word=dogs.,freq=13}]},correctlySpelled=false,collation=The quick red fox jumped over the lazy brown dogs.}}
[junit4:junit4]   2> 10809 T51 C3 REQ [collection1] webapp= path=/select params={spellcheck=true&shards=127.0.0.1:27176/|[ff01::083]:33332/&fl=id,lowerfilt&spellcheck.extendedResults=true&shards.qt=spellCheckCompRH_Direct&q=The+quick+reb+fox+jumped+over+the+lazy+brown+dogs&spellcheck.count=4&wt=javabin&spellcheck.collate=true&qt=spellCheckCompRH_Direct&version=2} hits=0 status=0 QTime=32 
[junit4:junit4]   2> 10855 T36 C2 REQ [collection1] webapp= path=/select params={spellcheck=true&shards.qt=spellCheckCompRH_Direct&spellcheck.extendedResults=true&spellcheck.collateExtendedResults=true&spellcheck.maxCollationTries=10&spellcheck.maxCollations=10&distrib=false&wt=javabin&spellcheck.collate=true&version=2&fl=id,lowerfilt&q=lowerfilt:(%2Bquock+%2Breb)&spellcheck.count=10&qt=spellCheckCompRH_Direct} hits=0 status=0 QTime=39 
[junit4:junit4]   2> 10895 T49 C3 REQ [collection1] webapp= path=/select params={spellcheck=true&spellcheck.extendedResults=true&shards.qt=spellCheckCompRH_Direct&spellcheck.collateExtendedResults=true&spellcheck.maxCollationTries=10&spellcheck.maxCollations=10&distrib=false&wt=javabin&spellcheck.collate=true&version=2&rows=10&spellcheck.onlyMorePopular=false&NOW=1363616457647&shard.url=[ff01::083]:33332/|127.0.0.1:27176/|[ff01::213]:33332/|[ff01::114]:33332/&fl=id,score&start=0&q=lowerfilt:(%2Bquock+%2Breb)&spellcheck.dictionary=direct&spellcheck.count=10&isShard=true&qt=spellCheckCompRH_Direct&fsv=true} hits=0 status=0 QTime=16 
[junit4:junit4]   2> 10898 T51 C3 oashc.SpellCheckComponent.finishStage [ff01::083]:33332/|127.0.0.1:27176/|[ff01::213]:33332/|[ff01::114]:33332/ {suggestions={quock={numFound=2,startOffset=12,endOffset=17,origFreq=0,suggestion=[{word=quick,freq=1}, {word=quote,freq=12}]},reb={numFound=1,startOffset=19,endOffset=22,origFreq=0,suggestion=[{word=red,freq=13}]},correctlySpelled=false,collation={collationQuery=lowerfilt:(+quick +red),hits=1,misspellingsAndCorrections={quock=quick,reb=red},collationInternalRank=0},collation={collationQuery=lowerfilt:(+quote +red),hits=12,misspellingsAndCorrections={quock=quote,reb=red},collationInternalRank=1}}}
[junit4:junit4]   2> 10899 T51 C3 REQ [collection1] webapp= path=/select params={spellcheck=true&shards.qt=spellCheckCompRH_Direct&spellcheck.extendedResults=true&spellcheck.collateExtendedResults=true&spellcheck.maxCollationTries=10&spellcheck.maxCollations=10&wt=javabin&spellcheck.collate=true&version=2&fl=id,lowerfilt&shards=[ff01::083]:33332/|127.0.0.1:27176/|[ff01::213]:33332/|[ff01::114]:33332/&q=lowerfilt:(%2Bquock+%2Breb)&spellcheck.count=10&qt=spellCheckCompRH_Direct} hits=0 status=0 QTime=25 
[junit4:junit4]   2> 10900 T33 oas.BaseDistributedSearchTestCase.query starting stress...
[junit4:junit4]   2> 10924 T49 C3 REQ [collection1] webapp= path=/select params={spellcheck=true&spellcheck.extendedResults=true&shards.qt=spellCheckCompRH_Direct&spellcheck.collateExtendedResults=true&spellcheck.maxCollationTries=10&spellcheck.maxCollations=10&distrib=false&wt=javabin&spellcheck.collate=true&version=2&rows=10&spellcheck.onlyMorePopular=false&NOW=1363616457679&shard.url=[ff01::083]:33332/|127.0.0.1:27176/|[ff01::213]:33332/|[ff01::114]:33332/&fl=id,score&start=0&q=lowerfilt:(%2Bquock+%2Breb)&spellcheck.dictionary=direct&spellcheck.count=10&isShard=true&qt=spellCheckCompRH_Direct&fsv=true} hits=0 status=0 QTime=12 
[junit4:junit4]   2> 10925 T53 C3 REQ [collection1] webapp= path=/select params={spellcheck=true&spellcheck.extendedResults=true&shards.qt=spellCheckCompRH_Direct&spellcheck.collateExtendedResults=true&spellcheck.maxCollationTries=10&spellcheck.maxCollations=10&distrib=false&wt=javabin&spellcheck.collate=true&version=2&rows=10&spellcheck.onlyMorePopular=false&NOW=1363616457680&shard.url=[ff01::083]:33332/|127.0.0.1:27176/|[ff01::213]:33332/|[ff01::114]:33332/&fl=id,score&start=0&q=lowerfilt:(%2Bquock+%2Breb)&spellcheck.dictionary=direct&spellcheck.count=10&isShard=true&qt=spellCheckCompRH_Direct&fsv=true} hits=0 status=0 QTime=13 
[junit4:junit4]   2> 10926 T48 C3 oashc.SpellCheckComponent.finishStage [ff01::083]:33332/|127.0.0.1:27176/|[ff01::213]:33332/|[ff01::114]:33332/ {suggestions={quock={numFound=2,startOffset=12,endOffset=17,origFreq=0,suggestion=[{word=quick,freq=1}, {word=quote,freq=12}]},reb={numFound=1,startOffset=19,endOffset=22,origFreq=0,suggestion=[{word=red,freq=13}]},correctlySpelled=false,collation={collationQuery=lowerfilt:(+quick +red),hits=1,misspellingsAndCorrections={quock=quick,reb=red},collationInternalRank=0},collation={collationQuery=lowerfilt:(+quote +red),hits=12,misspellingsAndCorrections={quock=quote,reb=red},collationInternalRank=1}}}
[junit4:junit4]   2> 10927 T51 C3 oashc.SpellCheckComponent.finishStage [ff01::083]:33332/|127.0.0.1:27176/|[ff01::213]:33332/|[ff01::114]:33332/ {suggestions={quock={numFound=2,startOffset=12,endOffset=17,origFreq=0,suggestion=[{word=quick,freq=1}, {word=quote,freq=12}]},reb={numFound=1,startOffset=19,endOffset=22,origFreq=0,suggestion=[{word=red,freq=13}]},correctlySpelled=false,collation={collationQuery=lowerfilt:(+quick +red),hits=1,misspellingsAndCorrections={quock=quick,reb=red},collationInternalRank=0},collation={collationQuery=lowerfilt:(+quote +red),hits=12,misspellingsAndCorrections={quock=quote,reb=red},collationInternalRank=1}}}
[junit4:junit4]   2> 10927 T48 C3 REQ [collection1] webapp= path=/select params={spellcheck=true&shards.qt=spellCheckCompRH_Direct&spellcheck.extendedResults=true&spellcheck.collateExtendedResults=true&spellcheck.maxCollationTries=10&spellcheck.maxCollations=10&wt=javabin&spellcheck.collate=true&version=2&fl=id,lowerfilt&shards=[ff01::083]:33332/|127.0.0.1:27176/|[ff01::213]:33332/|[ff01::114]:33332/&q=lowerfilt:(%2Bquock+%2Breb)&spellcheck.count=10&qt=spellCheckCompRH_Direct} hits=0 status=0 QTime=21 
[junit4:junit4]   2> 10928 T51 C3 REQ [collection1] webapp= path=/select params={spellcheck=true&shards.qt=spellCheckCompRH_Direct&spellcheck.extendedResults=true&spellcheck.collateExtendedResults=true&spellcheck.maxCollationTries=10&spellcheck.maxCollations=10&wt=javabin&spellcheck.collate=true&version=2&fl=id,lowerfilt&shards=[ff01::083]:33332/|127.0.0.1:27176/|[ff01::213]:33332/|[ff01::114]:33332/&q=lowerfilt:(%2Bquock+%2Breb)&spellcheck.count=10&qt=spellCheckCompRH_Direct} hits=0 status=0 QTime=21 
[junit4:junit4]   2> 10929 T52 C3 REQ [collection1] webapp= path=/select params={spellcheck=true&spellcheck.extendedResults=true&shards.qt=spellCheckCompRH_Direct&spellcheck.collateExtendedResults=true&spellcheck.maxCollationTries=10&spellcheck.maxCollations=10&distrib=false&wt=javabin&spellcheck.collate=true&version=2&rows=10&spellcheck.onlyMorePopular=false&NOW=1363616457680&shard.url=[ff01::083]:33332/|127.0.0.1:27176/|[ff01::213]:33332/|[ff01::114]:33332/&fl=id,score&start=0&q=lowerfilt:(%2Bquock+%2Breb)&spellcheck.dictionary=direct&spellcheck.count=10&isShard=true&qt=spellCheckCompRH_Direct&fsv=true} hits=0 status=0 QTime=17 
[junit4:junit4]   2> 10932 T50 C3 oashc.SpellCheckComponent.finishStage [ff01::083]:33332/|127.0.0.1:27176/|[ff01::213]:33332/|[ff01::114]:33332/ {suggestions={quock={numFound=2,startOffset=12,endOffset=17,origFreq=0,suggestion=[{word=quick,freq=1}, {word=quote,freq=12}]},reb={numFound=1,startOffset=19,endOffset=22,origFreq=0,suggestion=[{word=red,freq=13}]},correctlySpelled=false,collation={collationQuery=lowerfilt:(+quick +red),hits=1,misspellingsAndCorrections={quock=quick,reb=red},collationInternalRank=0},collation={collationQuery=lowerfilt:(+quote +red),hits=12,misspellingsAndCorrections={quock=quote,reb=red},collationInternalRank=1}}}
[junit4:junit4]   2> 10933 T50 C3 REQ [collection1] webapp= path=/select params={spellcheck=true&shards.qt=spellCheckCompRH_Direct&spellcheck.extendedResults=true&spellcheck.collateExtendedResults=true&spellcheck.maxCollationTries=10&spellcheck.maxCollations=10&wt=javabin&spellcheck.collate=true&version=2&fl=id,lowerfilt&shards=[ff01::083]:33332/|127.0.0.1:27176/|[ff01::213]:33332/|[ff01::114]:33332/&q=lowerfilt:(%2Bquock+%2Breb)&spellcheck.count=10&qt=spellCheckCompRH_Direct} hits=0 status=0 QTime=26 
[junit4:junit4]   2> 10958 T52 C3 REQ [collection1] webapp= path=/select params={spellcheck=true&spellcheck.extendedResults=true&shards.qt=spellCheckCompRH_Direct&spellcheck.collateExtendedResults=true&spellcheck.maxCollationTries=10&spellcheck.maxCollations=10&distrib=false&wt=javabin&spellcheck.collate=true&version=2&rows=10&spellcheck.onlyMorePopular=false&NOW=1363616457708&shard.url=[ff01::083]:33332/|127.0.0.1:27176/|[ff01::213]:33332/|[ff01::114]:33332/&fl=id,score&start=0&q=lowerfilt:(%2Bquock+%2Breb)&spellcheck.dictionary=direct&spellcheck.count=10&isShard=true&qt=spellCheckCompRH_Direct&fsv=true} hits=0 status=0 QTime=17 
[junit4:junit4]   2> 10960 T53 C3 REQ [collection1] webapp= path=/select params={spellcheck=true&spellcheck.extendedResults=true&shards.qt=spellCheckCompRH_Direct&spellcheck.collateExtendedResults=true&spellcheck.maxCollationTries=10&spellcheck.maxCollations=10&distrib=false&wt=javabin&spellcheck.collate=true&version=2&rows=10&spellcheck.onlyMorePopular=false&NOW=1363616457708&shard.url=[ff01::083]:33332/|127.0.0.1:27176/|[ff01::213]:33332/|[ff01::114]:33332/&fl=id,score&start=0&q=lowerfilt:(%2Bquock+%2Breb)&spellcheck.dictionary=direct&spellcheck.count=10&isShard=true&qt=spellCheckCompRH_Direct&fsv=true} hits=0 status=0 QTime=18 
[junit4:junit4]   2> 10962 T48 C3 oashc.SpellCheckComponent.finishStage [ff01::083]:33332/|127.0.0.1:27176/|[ff01::213]:33332/|[ff01::114]:33332/ {suggestions={quock={numFound=2,startOffset=12,endOffset=17,origFreq=0,suggestion=[{word=quick,freq=1}, {word=quote,freq=12}]},reb={numFound=1,startOffset=19,endOffset=22,origFreq=0,suggestion=[{word=red,freq=13}]},correctlySpelled=false,collation={collationQuery=lowerfilt:(+quick +red),hits=1,misspellingsAndCorrections={quock=quick,reb=red},collationInternalRank=0},collation={collationQuery=lowerfilt:(+quote +red),hits=12,misspellingsAndCorrections={quock=quote,reb=red},collationInternalRank=1}}}
[junit4:junit4]   2> 10963 T51 C3 oashc.SpellCheckComponent.finishStage [ff01::083]:33332/|127.0.0.1:27176/|[ff01::213]:33332/|[ff01::114]:33332/ {suggestions={quock={numFound=2,startOffset=12,endOffset=17,origFreq=0,suggestion=[{word=quick,freq=1}, {word=quote,freq=12}]},reb={numFound=1,startOffset=19,endOffset=22,origFreq=0,suggestion=[{word=red,freq=13}]},correctlySpelled=false,collation={collationQuery=lowerfilt:(+quick +red),hits=1,misspellingsAndCorrections={quock=quick,reb=red},collationInternalRank=0},collation={collationQuery=lowerfilt:(+quote +red),hits=12,misspellingsAndCorrections={quock=quote,reb=red},collationInternalRank=1}}}
[junit4:junit4]   2> 10964 T48 C3 REQ [collection1] webapp= path=/select params={spellcheck=true&shards.qt=spellCheckCompRH_Direct&spellcheck.extendedResults=true&spellcheck.collateExtendedResults=true&spellcheck.maxCollationTries=10&spellcheck.maxCollations=10&wt=javabin&spellcheck.collate=true&version=2&fl=id,lowerfilt&shards=[ff01::083]:33332/|127.0.0.1:27176/|[ff01::213]:33332/|[ff01::114]:33332/&q=lowerfilt:(%2Bquock+%2Breb)&spellcheck.count=10&qt=spellCheckCompRH_Direct} hits=0 status=0 QTime=29 
[junit4:junit4]   2> 10964 T51 C3 REQ [collection1] webapp= path=/select params={spellcheck=true&shards.qt=spellCheckCompRH_Direct&spellcheck.extendedResults=true&spellcheck.collateExtendedResults=true&spellcheck.maxCollationTries=10&spellcheck.maxCollations=10&wt=javabin&spellcheck.collate=true&version=2&fl=id,lowerfilt&shards=[ff01::083]:33332/|127.0.0.1:27176/|[ff01::213]:33332/|[ff01::114]:33332/&q=lowerfilt:(%2Bquock+%2Breb)&spellcheck.count=10&qt=spellCheckCompRH_Direct} hits=0 status=0 QTime=29 
[junit4:junit4]   2> 10966 T49 C3 REQ [collection1] webapp= path=/select params={spellcheck=true&spellcheck.extendedResults=true&shards.qt=spellCheckCompRH_Direct&spellcheck.collateExtendedResults=true&spellcheck.maxCollationTries=10&spellcheck.maxCollations=10&distrib=false&wt=javabin&spellcheck.collate=true&version=2&rows=10&spellcheck.onlyMorePopular=false&NOW=1363616457713&shard.url=[ff01::083]:33332/|127.0.0.1:27176/|[ff01::213]:33332/|[ff01::114]:33332/&fl=id,score&start=0&q=lowerfilt:(%2Bquock+%2Breb)&spellcheck.dictionary=direct&spellcheck.count=10&isShard=true&qt=spellCheckCompRH_Direct&fsv=true} hits=0 status=0 QTime=18 
[junit4:junit4]   2> 10972 T50 C3 oashc.SpellCheckComponent.finishStage [ff01::083]:33332/|127.0.0.1:27176/|[ff01::213]:33332/|[ff01::114]:33332/ {suggestions={quock={numFound=2,startOffset=12,endOffset=17,origFreq=0,suggestion=[{word=quick,freq=1}, {word=quote,freq=12}]},reb={numFound=1,startOffset=19,endOffset=22,origFreq=0,suggestion=[{word=red,freq=13}]},correctlySpelled=false,collation={collationQuery=lowerfilt:(+quick +red),hits=1,misspellingsAndCorrections={quock=quick,reb=red},collationInternalRank=0},collation={collationQuery=lowerfilt:(+quote +red),hits=12,misspellingsAndCorrections={quock=quote,reb=red},collationInternalRank=1}}}
[junit4:junit4]   2> 10973 T50 C3 REQ [collection1] webapp= path=/select params={spellcheck=true&shards.qt=spellCheckCompRH_Direct&spellcheck.extendedResults=true&spellcheck.collateExtendedResults=true&spellcheck.maxCollationTries=10&spellcheck.maxCollations=10&wt=javabin&spellcheck.collate=true&version=2&fl=id,lowerfilt&shards=[ff01::083]:33332/|127.0.0.1:27176/|[ff01::213]:33332/|[ff01::114]:33332/&q=lowerfilt:(%2Bquock+%2Breb)&spellcheck.count=10&qt=spellCheckCompRH_Direct} hits=0 status=0 QTime=33 
[junit4:junit4]   2> 10995 T36 C2 REQ [collection1] webapp= path=/select params={spellcheck=true&shards.qt=spellCheckCompRH_Direct&spellcheck.extendedResults=true&spellcheck.collateExtendedResults=false&spellcheck.maxCollationTries=10&spellcheck.maxCollations=10&distrib=false&wt=javabin&spellcheck.collate=true&version=2&fl=id,lowerfilt&q=lowerfilt:(%2Bquock+%2Breb)&spellcheck.count=10&qt=spellCheckCompRH_Direct} hits=0 status=0 QTime=15 
[junit4:junit4]   2> 11028 T49 C3 REQ [collection1] webapp= path=/select params={spellcheck=true&spellcheck.extendedResults=true&shards.qt=spellCheckCompRH_Direct&spellcheck.collateExtendedResults=false&spellcheck.maxCollationTries=10&spellcheck.maxCollations=10&distrib=false&wt=javabin&spellcheck.collate=true&version=2&rows=10&spellcheck.onlyMorePopular=false&NOW=1363616457776&shard.url=[ff01::083]:33332/|[ff01::114]:33332/|127.0.0.1:27176/|[ff01::213]:33332/&fl=id,score&start=0&q=lowerfilt:(%2Bquock+%2Breb)&spellcheck.dictionary=direct&spellcheck.count=10&isShard=true&qt=spellCheckCompRH_Direct&fsv=true} hits=0 status=0 QTime=18 
[junit4:junit4]   2> 11031 T50 C3 oashc.SpellCheckComponent.finishStage [ff01::083]:33332/|[ff01::114]:33332/|127.0.0.1:27176/|[ff01::213]:33332/ {suggestions={quock={numFound=2,startOffset=12,endOffset=17,origFreq=0,suggestion=[{word=quick,freq=1}, {word=quote,freq=12}]},reb={numFound=1,startOffset=19,endOffset=22,origFreq=0,suggestion=[{word=red,freq=13}]},correctlySpelled=false,collation=lowerfilt:(+quick +red),collationInternalRank=0,collation=lowerfilt:(+quote +red),collationInternalRank=1}}
[junit4:junit4]   2> 11033 T50 C3 REQ [collection1] webapp= path=/select params={spellcheck=true&shards.qt=spellCheckCompRH_Direct&spellcheck.extendedResults=true&spellcheck.collateExtendedResults=false&spellcheck.maxCollationTries=10&spellcheck.maxCollations=10&wt=javabin&spellcheck.collate=true&version=2&fl=id,lowerfilt&shards=[ff01::083]:33332/|[ff01::114]:33332/|127.0.0.1:27176/|[ff01::213]:33332/&q=lowerfilt:(%2Bquock+%2Breb)&spellcheck.count=10&qt=spellCheckCompRH_Direct} hits=0 status=0 QTime=30 
[junit4:junit4]   2> 11035 T33 oas.BaseDistributedSearchTestCase.query starting stress...
[junit4:junit4]   2> 11066 T49 C3 REQ [collection1] webapp= path=/select params={spellcheck=true&spellcheck.extendedResults=true&shards.qt=spellCheckCompRH_Direct&spellcheck.collateExtendedResults=false&spellcheck.maxCollationTries=10&spellcheck.maxCollations=10&distrib=false&wt=javabin&spellcheck.collate=true&version=2&rows=10&spellcheck.onlyMorePopular=false&NOW=1363616457816&shard.url=[ff01::083]:33332/|[ff01::114]:33332/|127.0.0.1:27176/|[ff01::213]:33332/&fl=id,score&start=0&q=lowerfilt:(%2Bquock+%2Breb)&spellcheck.dictionary=direct&spellcheck.count=10&isShard=true&qt=spellCheckCompRH_Direct&fsv=true} hits=0 status=0 QTime=15 
[junit4:junit4]   2> 11069 T48 C3 oashc.SpellCheckComponent.finishStage [ff01::083]:33332/|[ff01::114]:33332/|127.0.0.1:27176/|[ff01::213]:33332/ {suggestions={quock={numFound=2,startOffset=12,endOffset=17,origFreq=0,suggestion=[{word=quick,freq=1}, {word=quote,freq=12}]},reb={numFound=1,startOffset=19,endOffset=22,origFreq=0,suggestion=[{word=red,freq=13}]},correctlySpelled=false,collation=lowerfilt:(+quick +red),collationInternalRank=0,collation=lowerfilt:(+quote +red),collationInternalRank=1}}
[junit4:junit4]   2> 11070 T53 C3 REQ [collection1] webapp= path=/select params={spellcheck=true&spellcheck.extendedResults=true&shards.qt=spellCheckCompRH_Direct&spellcheck.collateExtendedResults=false&spellcheck.maxCollationTries=10&spellcheck.maxCollations=10&distrib=false&wt=javabin&spellcheck.collate=true&version=2&rows=10&spellcheck.onlyMorePopular=false&NOW=1363616457815&shard.url=[ff01::083]:33332/|[ff01::114]:33332/|127.0.0.1:27176/|[ff01::213]:33332/&fl=id,score&start=0&q=lowerfilt:(%2Bquock+%2Breb)&spellcheck.dictionary=direct&spellcheck.count=10&isShard=true&qt=spellCheckCompRH_Direct&fsv=true} hits=0 status=0 QTime=18 
[junit4:junit4]   2> 11070 T48 C3 REQ [collection1] webapp= path=/select params={spellcheck=true&shards.qt=spellCheckCompRH_Direct&spellcheck.extendedResults=true&spellcheck.collateExtendedResults=false&spellcheck.maxCollationTries=10&spellcheck.maxCollations=10&wt=javabin&spellcheck.collate=true&version=2&fl=id,lowerfilt&shards=[ff01::083]:33332/|[ff01::114]:33332/|127.0.0.1:27176/|[ff01::213]:33332/&q=lowerfilt:(%2Bquock+%2Breb)&spellcheck.count=10&qt=spellCheckCompRH_Direct} hits=0 status=0 QTime=27 
[junit4:junit4]   2> 11070 T52 C3 REQ [collection1] webapp= path=/select params={spellcheck=true&spellcheck.extendedResults=true&shards.qt=spellCheckCompRH_Direct&spellcheck.collateExtendedResults=false&spellcheck.maxCollationTries=10&spellcheck.maxCollations=10&distrib=false&wt=javabin&spellcheck.collate=true&version=2&rows=10&spellcheck.onlyMorePopular=false&NOW=1363616457816&shard.url=[ff01::083]:33332/|[ff01::114]:33332/|127.0.0.1:27176/|[ff01::213]:33332/&fl=id,score&start=0&q=lowerfilt:(%2Bquock+%2Breb)&spellcheck.dictionary=direct&spellcheck.count=10&isShard=true&qt=spellCheckCompRH_Direct&fsv=true} hits=0 status=0 QTime=19 
[junit4:junit4]   2> 11073 T50 C3 oashc.SpellCheckComponent.finishStage [ff01::083]:33332/|[ff01::114]:33332/|127.0.0.1:27176/|[ff01::213]:33332/ {suggestions={quock={numFound=2,startOffset=12,endOffset=17,origFreq=0,suggestion=[{word=quick,freq=1}, {word=quote,freq=12}]},reb={numFound=1,startOffset=19,endOffset=22,origFreq=0,suggestion=[{word=red,freq=13}]},correctlySpelled=false,collation=lowerfilt:(+quick +red),collationInternalRank=0,collation=lowerfilt:(+quote +red),collationInternalRank=1}}
[junit4:junit4]   2> 11074 T50 C3 REQ [collection1] webapp= path=/select params={spellcheck=true&shards.qt=spellCheckCompRH_Direct&spellcheck.extendedResults=true&spellcheck.collateExtendedResults=false&spellcheck.maxCollationTries=10&spellcheck.maxCollations=10&wt=javabin&spellcheck.collate=true&version=2&fl=id,lowerfilt&shards=[ff01::083]:33332/|[ff01::114]:33332/|127.0.0.1:27176/|[ff01::213]:33332/&q=lowerfilt:(%2Bquock+%2Breb)&spellcheck.count=10&qt=spellCheckCompRH_Direct} hits=0 status=0 QTime=32 
[junit4:junit4]   2> 11074 T51 C3 oashc.SpellCheckComponent.finishStage [ff01::083]:33332/|[ff01::114]:33332/|127.0.0.1:27176/|[ff01::213]:33332/ {suggestions={quock={numFound=2,startOffset=12,endOffset=17,origFreq=0,suggestion=[{word=quick,freq=1}, {word=quote,freq=12}]},reb={numFound=1,startOffset=19,endOffset=22,origFreq=0,suggestion=[{word=red,freq=13}]},correctlySpelled=false,collation=lowerfilt:(+quick +red),collationInternalRank=0,collation=lowerfilt:(+quote +red),collationInternalRank=1}}
[junit4:junit4]   2> 11076 T51 C3 REQ [collection1] webapp= path=/select params={spellcheck=true&shards.qt=spellCheckCompRH_Direct&spellcheck.extendedResults=true&spellcheck.collateExtendedResults=false&spellcheck.maxCollationTries=10&spellcheck.maxCollations=10&wt=javabin&spellcheck.collate=true&version=2&fl=id,lowerfilt&shards=[ff01::083]:33332/|[ff01::114]:33332/|127.0.0.1:27176/|[ff01::213]:33332/&q=lowerfilt:(%2Bquock+%2Breb)&spellcheck.count=10&qt=spellCheckCompRH_Direct} hits=0 status=0 QTime=33 
[junit4:junit4]   2> 11103 T53 C3 REQ [collection1] webapp= path=/select params={spellcheck=true&spellcheck.extendedResults=true&shards.qt=spellCheckCompRH_Direct&spellcheck.collateExtendedResults=false&spellcheck.maxCollationTries=10&spellcheck.maxCollations=10&distrib=false&wt=javabin&spellcheck.collate=true&version=2&rows=10&spellcheck.onlyMorePopular=false&NOW=1363616457854&shard.url=[ff01::083]:33332/|[ff01::114]:33332/|127.0.0.1:27176/|[ff01::213]:33332/&fl=id,score&start=0&q=lowerfilt:(%2Bquock+%2Breb)&spellcheck.dictionary=direct&spellcheck.count=10&isShard=true&qt=spellCheckCompRH_Direct&fsv=true} hits=0 status=0 QTime=17 
[junit4:junit4]   2> 11104 T52 C3 REQ [collection1] webapp= path=/select params={spellcheck=true&spellcheck.extendedResults=true&shards.qt=spellCheckCompRH_Direct&spellcheck.collateExtendedResults=false&spellcheck.maxCollationTries=10&spellcheck.maxCollations=10&distrib=false&wt=javabin&spellcheck.collate=true&version=2&rows=10&spellcheck.onlyMorePopular=false&NOW=1363616457852&shard.url=[ff01::083]:33332/|[ff01::114]:33332/|127.0.0.1:27176/|[ff01::213]:33332/&fl=id,score&start=0&q=lowerfilt:(%2Bquock+%2Breb)&spellcheck.dictionary=direct&spellcheck.count=10&isShard=true&qt=spellCheckCompRH_Direct&fsv=true} hits=0 status=0 QTime=18 
[junit4:junit4]   2> 11106 T50 C3 oashc.SpellCheckComponent.finishStage [ff01::083]:33332/|[ff01::114]:33332/|127.0.0.1:27176/|[ff01::213]:33332/ {suggestions={quock={numFound=2,startOffset=12,endOffset=17,origFreq=0,suggestion=[{word=quick,freq=1}, {word=quote,freq=12}]},reb={numFound=1,startOffset=19,endOffset=22,origFreq=0,suggestion=[{word=red,freq=13}]},correctlySpelled=false,collation=lowerfilt:(+quick +red),collationInternalRank=0,collation=lowerfilt:(+quote +red),collationInternalRank=1}}
[junit4:junit4]   2> 11107 T50 C3 REQ [collection1] webapp= path=/select params={spellcheck=true&shards.qt=spellCheckCompRH_Direct&spellcheck.extendedResults=true&spellcheck.collateExtendedResults=false&spellcheck.maxCollationTries=10&spellcheck.maxCollations=10&wt=javabin&spellcheck.collate=true&version=2&fl=id,lowerfilt&shards=[ff01::083]:33332/|[ff01::114]:33332/|127.0.0.1:27176/|[ff01::213]:33332/&q=lowerfilt:(%2Bquock+%2Breb)&spellcheck.count=10&qt=spellCheckCompRH_Direct} hits=0 status=0 QTime=26 
[junit4:junit4]   2> 11108 T48 C3 oashc.SpellCheckComponent.finishStage [ff01::083]:33332/|[ff01::114]:33332/|127.0.0.1:27176/|[ff01::213]:33332/ {suggestions={quock={numFound=2,startOffset=12,endOffset=17,origFreq=0,suggestion=[{word=quick,freq=1}, {word=quote,freq=12}]},reb={numFound=1,startOffset=19,endOffset=22,origFreq=0,suggestion=[{word=red,freq=13}]},correctlySpelled=false,collation=lowerfilt:(+quick +red),collationInternalRank=0,collation=lowerfilt:(+quote +red),collationInternalRank=1}}
[junit4:junit4]   2> 11109 T48 C3 REQ [collection1] webapp= path=/select params={spellcheck=true&shards.qt=spellCheckCompRH_Direct&spellcheck.extendedResults=true&spellcheck.collateExtendedResults=false&spellcheck.maxCollationTries=10&spellcheck.maxCollations=10&wt=javabin&spellcheck.collate=true&version=2&fl=id,lowerfilt&shards=[ff01::083]:33332/|[ff01::114]:33332/|127.0.0.1:27176/|[ff01::213]:33332/&q=lowerfilt:(%2Bquock+%2Breb)&spellcheck.count=10&qt=spellCheckCompRH_Direct} hits=0 status=0 QTime=30 
[junit4:junit4]   2> 11111 T49 C3 REQ [collection1] webapp= path=/select params={spellcheck=true&spellcheck.extendedResults=true&shards.qt=spellCheckCompRH_Direct&spellcheck.collateExtendedResults=false&spellcheck.maxCollationTries=10&spellcheck.maxCollations=10&distrib=false&wt=javabin&spellcheck.collate=true&version=2&rows=10&spellcheck.onlyMorePopular=false&NOW=1363616457858&shard.url=[ff01::083]:33332/|[ff01::114]:33332/|127.0.0.1:27176/|[ff01::213]:33332/&fl=id,score&start=0&q=lowerfilt:(%2Bquock+%2Breb)&spellcheck.dictionary=direct&spellcheck.count=10&isShard=true&qt=spellCheckCompRH_Direct&fsv=true} hits=0 status=0 QTime=17 
[junit4:junit4]   2> 11113 T51 C3 oashc.SpellCheckComponent.finishStage [ff01::083]:33332/|[ff01::114]:33332/|127.0.0.1:27176/|[ff01::213]:33332/ {suggestions={quock={numFound=2,startOffset=12,endOffset=17,origFreq=0,suggestion=[{word=quick,freq=1}, {word=quote,freq=12}]},reb={numFound=1,startOffset=19,endOffset=22,origFreq=0,suggestion=[{word=red,freq=13}]},correctlySpelled=false,collation=lowerfilt:(+quick +red),collationInternalRank=0,collation=lowerfilt:(+quote +red),collationInternalRank=1}}
[junit4:junit4]   2> 11114 T51 C3 REQ [collection1] webapp= path=/select params={spellcheck=true&shards.qt=spellCheckCompRH_Direct&spellcheck.extendedResults=true&spellcheck.collateExtendedResults=false&spellcheck.maxCollationTries=10&spellcheck.maxCollations=10&wt=javabin&spellcheck.collate=true&version=2&fl=id,lowerfilt&shards=[ff01::083]:33332/|[ff01::114]:33332/|127.0.0.1:27176/|[ff01::213]:33332/&q=lowerfilt:(%2Bquock+%2Breb)&spellcheck.count=10&qt=spellCheckCompRH_Direct} hits=0 status=0 QTime=29 
[junit4:junit4]   2> 11139 T36 C2 REQ [collection1] webapp= path=/select params={spellcheck=true&shards.qt=spellCheckCompRH_Direct&spellcheck.extendedResults=true&spellcheck.collateExtendedResults=false&spellcheck.maxCollationTries=0&spellcheck.maxCollations=1&distrib=false&wt=javabin&spellcheck.collate=true&version=2&fl=id,lowerfilt&q=lowerfilt:(%2Bquock+%2Breb)&spellcheck.count=10&qt=spellCheckCompRH_Direct} hits=0 status=0 QTime=17 
[junit4:junit4]   2> 11168 T49 C3 REQ [collection1] webapp= path=/select params={spellcheck=true&spellcheck.extendedResults=true&shards.qt=spellCheckCompRH_Direct&spellcheck.collateExtendedResults=false&spellcheck.maxCollationTries=0&spellcheck.maxCollations=1&distrib=false&wt=javabin&spellcheck.collate=true&version=2&rows=10&spellcheck.onlyMorePopular=false&NOW=1363616457919&shard.url=[ff01::213]:33332/|127.0.0.1:27176/|[ff01::083]:33332/|[ff01::114]:33332/&fl=id,score&start=0&q=lowerfilt:(%2Bquock+%2Breb)&spellcheck.dictionary=direct&spellcheck.count=10&isShard=true&qt=spellCheckCompRH_Direct&fsv=true} hits=0 status=0 QTime=16 
[junit4:junit4]   2> 11170 T51 C3 oashc.SpellCheckComponent.finishStage [ff01::213]:33332/|127.0.0.1:27176/|[ff01::083]:33332/|[ff01::114]:33332/ {suggestions={quock={numFound=2,startOffset=12,endOffset=17,origFreq=0,suggestion=[{word=quick,freq=1}, {word=quote,freq=12}]},reb={numFound=1,startOffset=19,endOffset=22,origFreq=0,suggestion=[{word=red,freq=13}]},correctlySpelled=false,collation=lowerfilt:(+quick +red)}}
[junit4:junit4]   2> 11171 T51 C3 REQ [collection1] webapp= path=/select params={spellcheck=true&shards.qt=spellCheckCompRH_Direct&spellcheck.extendedResults=true&spellcheck.collateExtendedResults=false&spellcheck.maxCollationTries=0&spellcheck.maxCollations=1&wt=javabin&spellcheck.collate=true&version=2&fl=id,lowerfilt&shards=[ff01::213]:33332/|127.0.0.1:27176/|[ff01::083]:33332/|[ff01::114]:33332/&q=lowerfilt:(%2Bquock+%2Breb)&spellcheck.count=10&qt=spellCheckCompRH_Direct} hits=0 status=0 QTime=25 
[junit4:junit4]   2> 11173 T33 oas.BaseDistributedSearchTestCase.query starting stress...
[junit4:junit4]   2> 11202 T53 C3 REQ [collection1] webapp= path=/select params={spellcheck=true&spellcheck.extendedResults=true&shards.qt=spellCheckCompRH_Direct&spellcheck.collateExtendedResults=false&spellcheck.maxCollationTries=0&spellcheck.maxCollations=1&distrib=false&wt=javabin&spellcheck.collate=true&version=2&rows=10&spellcheck.onlyMorePopular=false&NOW=1363616457954&shard.url=[ff01::213]:33332/|127.0.0.1:27176/|[ff01::083]:33332/|[ff01::114]:33332/&fl=id,score&start=0&q=lowerfilt:(%2Bquock+%2Breb)&spellcheck.dictionary=direct&spellcheck.count=10&isShard=true&qt=spellCheckCompRH_Direct&fsv=true} hits=0 status=0 QTime=16 
[junit4:junit4]   2> 11202 T49 C3 REQ [collection1] webapp= path=/select params={spellcheck=true&spellcheck.extendedResults=true&shards.qt=spellCheckCompRH_Direct&spellcheck.collateExtendedResults=false&spellcheck.maxCollationTries=0&spellcheck.maxCollations=1&distrib=false&wt=javabin&spellcheck.collate=true&version=2&rows=10&spellcheck.onlyMorePopular=false&NOW=1363616457954&shard.url=[ff01::213]:33332/|127.0.0.1:27176/|[ff01::083]:33332/|[ff01::114]:33332/&fl=id,score&start=0&q=lowerfilt:(%2Bquock+%2Breb)&spellcheck.dictionary=direct&spellcheck.count=10&isShard=true&qt=spellCheckCompRH_Direct&fsv=true} hits=0 status=0 QTime=16 
[junit4:junit4]   2> 11202 T52 C3 REQ [collection1] webapp= path=/select params={spellcheck=true&spellcheck.extendedResults=true&shards.qt=spellCheckCompRH_Direct&spellcheck.collateExtendedResults=false&spellcheck.maxCollationTries=0&spellcheck.maxCollations=1&distrib=false&wt=javabin&spellcheck.collate=true&version=2&rows=10&spellcheck.onlyMorePopular=false&NOW=1363616457954&shard.url=[ff01::213]:33332/|127.0.0.1:27176/|[ff01::083]:33332/|[ff01::114]:33332/&fl=id,score&start=0&q=lowerfilt:(%2Bquock+%2Breb)&spellcheck.dictionary=direct&spellcheck.count=10&isShard=true&qt=spellCheckCompRH_Direct&fsv=true} hits=0 status=0 QTime=15 
[junit4:junit4]   2> 11205 T50 C3 oashc.SpellCheckComponent.finishStage [ff01::213]:33332/|127.0.0.1:27176/|[ff01::083]:33332/|[ff01::114]:33332/ {suggestions={quock={numFound=2,startOffset=12,endOffset=17,origFreq=0,suggestion=[{word=quick,freq=1}, {word=quote,freq=12}]},reb={numFound=1,startOffset=19,endOffset=22,origFreq=0,suggestion=[{word=red,freq=13}]},correctlySpelled=false,collation=lowerfilt:(+quick +red)}}
[junit4:junit4]   2> 11206 T51 C3 oashc.SpellCheckComponent.finishStage [ff01::213]:33332/|127.0.0.1:27176/|[ff01::083]:33332/|[ff01::114]:33332/ {suggestions={quock={numFound=2,startOffset=12,endOffset=17,origFreq=0,suggestion=[{word=quick,freq=1}, {word=quote,freq=12}]},reb={numFound=1,startOffset=19,endOffset=22,origFreq=0,suggestion=[{word=red,freq=13}]},correctlySpelled=false,collation=lowerfilt:(+quick +red)}}
[junit4:junit4]   2> 11206 T48 C3 oashc.SpellCheckComponent.finishStage [ff01::213]:33332/|127.0.0.1:27176/|[ff01::083]:33332/|[ff01::114]:33332/ {suggestions={quock={numFound=2,startOffset=12,endOffset=17,origFreq=0,suggestion=[{word=quick,freq=1}, {word=quote,freq=12}]},reb={numFound=1,startOffset=19,endOffset=22,origFreq=0,suggestion=[{word=red,freq=13}]},correctlySpelled=false,collation=lowerfilt:(+quick +red)}}
[junit4:junit4]   2> 11207 T50 C3 REQ [collection1] webapp= path=/select params={spellcheck=true&shards.qt=spellCheckCompRH_Direct&spellcheck.extendedResults=true&spellcheck.collateExtendedResults=false&spellcheck.maxCollationTries=0&spellcheck.maxCollations=1&wt=javabin&spellcheck.collate=true&version=2&fl=id,lowerfilt&shards=[ff01::213]:33332/|127.0.0.1:27176/|[ff01::083]:33332/|[ff01::114]:33332/&q=lowerfilt:(%2Bquock+%2Breb)&spellcheck.count=10&qt=spellCheckCompRH_Direct} hits=0 status=0 QTime=26 
[junit4:junit4]   2> 11208 T51 C3 REQ [collection1] webapp= path=/select params={spellcheck=true&shards.qt=spellCheckCompRH_Direct&spellcheck.extendedResults=true&spellcheck.collateExtendedResults=false&spellcheck.maxCollationTries=0&spellcheck.maxCollations=1&wt=javabin&spellcheck.collate=true&version=2&fl=id,lowerfilt&shards=[ff01::213]:33332/|127.0.0.1:27176/|[ff01::083]:33332/|[ff01::114]:33332/&q=lowerfilt:(%2Bquock+%2Breb)&spellcheck.count=10&qt=spellCheckCompRH_Direct} hits=0 status=0 QTime=27 
[junit4:junit4]   2> 11210 T48 C3 REQ [collection1] webapp= path=/select params={spellcheck=true&shards.qt=spellCheckCompRH_Direct&spellcheck.extendedResults=true&spellcheck.collateExtendedResults=false&spellcheck.maxCollationTries=0&spellcheck.maxCollations=1&wt=javabin&spellcheck.collate=true&version=2&fl=id,lowerfilt&shards=[ff01::213]:33332/|127.0.0.1:27176/|[ff01::083]:33332/|[ff01::114]:33332/&q=lowerfilt:(%2Bquock+%2Breb)&spellcheck.count=10&qt=spellCheckCompRH_Direct} hits=0 status=0 QTime=29 
[junit4:junit4]   2> 11238 T52 C3 REQ [collection1] webapp= path=/select params={spellcheck=true&spellcheck.extendedResults=true&shards.qt=spellCheckCompRH_Direct&spellcheck.collateExtendedResults=false&spellcheck.maxCollationTries=0&spellcheck.maxCollations=1&distrib=false&wt=javabin&spellcheck.collate=true&version=2&rows=10&spellcheck.onlyMorePopular=false&NOW=1363616457989&shard.url=[ff01::213]:33332/|127.0.0.1:27176/|[ff01::083]:33332/|[ff01::114]:33332/&fl=id,score&start=0&q=lowerfilt:(%2Bquock+%2Breb)&spellcheck.dictionary=direct&spellcheck.count=10&isShard=true&qt=spellCheckCompRH_Direct&fsv=true} hits=0 status=0 QTime=16 
[junit4:junit4]   2> 11238 T53 C3 REQ [collection1] webapp= path=/select params={spellcheck=true&spellcheck.extendedResults=true&shards.qt=spellCheckCompRH_Direct&spellcheck.collateExtendedResults=false&spellcheck.maxCollationTries=0&spellcheck.maxCollations=1&distrib=false&wt=javabin&spellcheck.collate=true&version=2&rows=10&spellcheck.onlyMorePopular=false&NOW=1363616457990&shard.url=[ff01::213]:33332/|127.0.0.1:27176/|[ff01::083]:33332/|[ff01::114]:33332/&fl=id,score&start=0&q=lowerfilt:(%2Bquock+%2Breb)&spellcheck.dictionary=direct&spellcheck.count=10&isShard=true&qt=spellCheckCompRH_Direct&fsv=true} hits=0 status=0 QTime=15 
[junit4:junit4]   2> 11239 T49 C3 REQ [collection1] webapp= path=/select params={spellcheck=true&spellcheck.extendedResults=true&shards.qt=spellCheckCompRH_Direct&spellcheck.collateExtendedResults=false&spellcheck.maxCollationTries=0&spellcheck.maxCollations=1&distrib=false&wt=javabin&spellcheck.collate=true&version=2&rows=10&spellcheck.onlyMorePopular=false&NOW=1363616457989&shard.url=[ff01::213]:33332/|127.0.0.1:27176/|[ff01::083]:33332/|[ff01::114]:33332/&fl=id,score&start=0&q=lowerfilt:(%2Bquock+%2Breb)&spellcheck.dictionary=direct&spellcheck.count=10&isShard=true&qt=spellCheckCompRH_Direct&fsv=true} hits=0 status=0 QTime=16 
[junit4:junit4]   2> 11240 T48 C3 oashc.SpellCheckComponent.finishStage [ff01::213]:33332/|127.0.0.1:27176/|[ff01::083]:33332/|[ff01::114]:33332/ {suggestions={quock={numFound=2,startOffset=12,endOffset=17,origFreq=0,suggestion=[{word=quick,freq=1}, {word=quote,freq=12}]},reb={numFound=1,startOffset=19,endOffset=22,origFreq=0,suggestion=[{word=red,freq=13}]},correctlySpelled=false,collation=lowerfilt:(+quick +red)}}
[junit4:junit4]   2> 11240 T50 C3 oashc.SpellCheckComponent.finishStage [ff01::213]:33332/|127.0.0.1:27176/|[ff01::083]:33332/|[ff01::114]:33332/ {suggestions={quock={numFound=2,startOffset=12,endOffset=17,origFreq=0,suggestion=[{word=quick,freq=1}, {word=quote,freq=12}]},reb={numFound=1,startOffset=19,endOffset=22,origFreq=0,suggestion=[{word=red,freq=13}]},correctlySpelled=false,collation=lowerfilt:(+quick +red)}}
[junit4:junit4]   2> 11242 T48 C3 REQ [collection1] webapp= path=/select params={spellcheck=true&shards.qt=spellCheckCompRH_Direct&spellcheck.extendedResults=true&spellcheck.collateExtendedResults=false&spellcheck.maxCollationTries=0&spellcheck.maxCollations=1&wt=javabin&spellcheck.collate=true&version=2&fl=id,lowerfilt&shards=[ff01::213]:33332/|127.0.0.1:27176/|[ff01::083]:33332/|[ff01::114]:33332/&q=lowerfilt:(%2Bquock+%2Breb)&spellcheck.count=10&qt=spellCheckCompRH_Direct} hits=0 status=0 QTime=25 
[junit4:junit4]   2> 11243 T50 C3 REQ [collection1] webapp= path=/select params={spellcheck=true&shards.qt=spellCheckCompRH_Direct&spellcheck.extendedResults=true&spellcheck.collateExtendedResults=false&spellcheck.maxCollationTries=0&spellcheck.maxCollations=1&wt=javabin&spellcheck.collate=true&version=2&fl=id,lowerfilt&shards=[ff01::213]:33332/|127.0.0.1:27176/|[ff01::083]:33332/|[ff01::114]:33332/&q=lowerfilt:(%2Bquock+%2Breb)&spellcheck.count=10&qt=spellCheckCompRH_Direct} hits=0 status=0 QTime=27 
[junit4:junit4]   2> 11242 T51 C3 oashc.SpellCheckComponent.finishStage [ff01::213]:33332/|127.0.0.1:27176/|[ff01::083]:33332/|[ff01::114]:33332/ {suggestions={quock={numFound=2,startOffset=12,endOffset=17,origFreq=0,suggestion=[{word=quick,freq=1}, {word=quote,freq=12}]},reb={numFound=1,startOffset=19,endOffset=22,origFreq=0,suggestion=[{word=red,freq=13}]},correctlySpelled=false,collation=lowerfilt:(+quick +red)}}
[junit4:junit4]   2> 11246 T51 C3 REQ [collection1] webapp= path=/select params={spellcheck=true&shards.qt=spellCheckCompRH_Direct&spellcheck.extendedResults=true&spellcheck.collateExtendedResults=false&spellcheck.maxCollationTries=0&spellcheck.maxCollations=1&wt=javabin&spellcheck.collate=true&version=2&fl=id,lowerfilt&shards=[ff01::213]:33332/|127.0.0.1:27176/|[ff01::083]:33332/|[ff01::114]:33332/&q=lowerfilt:(%2Bquock+%2Breb)&spellcheck.count=10&qt=spellCheckCompRH_Direct} hits=0 status=0 QTime=30 
[junit4:junit4]   2> 11319 T36 C2 REQ [collection1] webapp= path=/select params={spellcheck=true&spellcheck.maxResultsForSuggest=10&shards.qt=spellCheckCompRH&spellcheck.extendedResults=true&spellcheck.collateExtendedResults=true&spellcheck.maxCollationTries=10&spellcheck.maxCollations=1&distrib=false&wt=javabin&spellcheck.collate=true&version=2&fl=id,lowerfilt&q=lowerfilt:("quote+red+fox")&spellcheck.count=10&qt=spellCheckCompRH&spellcheck.alternativeTermCount=5} hits=12 status=0 QTime=61 
[junit4:junit4]   2> 11339 T49 C3 REQ [collection1] webapp= path=/select params={spellcheck=true&spellcheck.maxResultsForSuggest=10&spellcheck.extendedResults=true&shards.qt=spellCheckCompRH&spellcheck.collateExtendedResults=true&spellcheck.maxCollationTries=10&spellcheck.maxCollations=1&distrib=false&wt=javabin&spellcheck.collate=true&version=2&rows=10&spellcheck.onlyMorePopular=false&NOW=1363616458100&shard.url=127.0.0.1:27176/|[ff01::213]:33332/|[ff01::083]:33332/&fl=id,score&start=0&q=lowerfilt:("quote+red+fox")&spellcheck.count=10&isShard=true&qt=spellCheckCompRH&fsv=true&spellcheck.alternativeTermCount=5} hits=12 status=0 QTime=4 
[junit4:junit4]   2> 11361 T49 C3 REQ [collection1] webapp= path=/select params={spellcheck=false&spellcheck.maxResultsForSuggest=10&spellcheck.extendedResults=true&shards.qt=spellCheckCompRH&spellcheck.collateExtendedResults=true&ids=21,20,19,17,22,18,15,16,13,14&spellcheck.maxCollationTries=10&spellcheck.maxCollations=1&distrib=false&wt=javabin&spellcheck.collate=true&version=2&spellcheck.onlyMorePopular=false&NOW=1363616458100&shard.url=127.0.0.1:27176/|[ff01::213]:33332/|[ff01::083]:33332/&fl=id,lowerfilt&q=lowerfilt:("quote+red+fox")&spellcheck.count=10&isShard=true&qt=spellCheckCompRH&spellcheck.alternativeTermCount=5} status=0 QTime=9 
[junit4:junit4]   2> 11368 T51 C3 REQ [collection1] webapp= path=/select params={spellcheck=true&spellcheck.maxResultsForSuggest=10&shards.qt=spellCheckCompRH&spellcheck.extendedResults=true&spellcheck.collateExtendedResults=true&spellcheck.maxCollationTries=10&spellcheck.maxCollations=1&wt=javabin&spellcheck.collate=true&version=2&shards=127.0.0.1:27176/|[ff01::213]:33332/|[ff01::083]:33332/&fl=id,lowerfilt&q=lowerfilt:("quote+red+fox")&spellcheck.count=10&qt=spellCheckCompRH&spellcheck.alternativeTermCount=5} hits=12 status=0 QTime=41 
[junit4:junit4]   2> 11372 T33 oas.BaseDistributedSearchTestCase.query starting stress...
[junit4:junit4]   2> 11389 T49 C3 REQ [collection1] webapp= path=/select params={spellcheck=true&spellcheck.maxResultsForSuggest=10&spellcheck.extendedResults=true&shards.qt=spellCheckCompRH&spellcheck.collateExtendedResults=true&spellcheck.maxCollationTries=10&spellcheck.maxCollations=1&distrib=false&wt=javabin&spellcheck.collate=true&version=2&rows=10&spellcheck.onlyMorePopular=false&NOW=1363616458153&shard.url=127.0.0.1:27176/|[ff01::213]:33332/|[ff01::083]:33332/&fl=id,score&start=0&q=lowerfilt:("quote+red+fox")&spellcheck.count=10&isShard=true&qt=spellCheckCompRH&fsv=true&spellcheck.alternativeTermCount=5} hits=12 status=0 QTime=3 
[junit4:junit4]   2> 11391 T52 C3 REQ [collection1] webapp= path=/select params={spellcheck=true&spellcheck.maxResultsForSuggest=10&spellcheck.extendedResults=true&shards.qt=spellCheckCompRH&spellcheck.collateExtendedResults=true&spellcheck.maxCollationTries=10&spellcheck.maxCollations=1&distrib=false&wt=javabin&spellcheck.collate=true&version=2&rows=10&spellcheck.onlyMorePopular=false&NOW=1363616458154&shard.url=127.0.0.1:27176/|[ff01::213]:33332/|[ff01::083]:33332/&fl=id,score&start=0&q=lowerfilt:("quote+red+fox")&spellcheck.count=10&isShard=true&qt=spellCheckCompRH&fsv=true&spellcheck.alternativeTermCount=5} hits=12 status=0 QTime=2 
[junit4:junit4]   2> 11402 T49 C3 REQ [collection1] webapp= path=/select params={spellcheck=true&spellcheck.maxResultsForSuggest=10&spellcheck.extendedResults=true&shards.qt=spellCheckCompRH&spellcheck.collateExtendedResults=true&spellcheck.maxCollationTries=10&spellcheck.maxCollations=1&distrib=false&wt=javabin&spellcheck.collate=true&version=2&rows=10&spellcheck.onlyMorePopular=false&NOW=1363616458154&shard.url=127.0.0.1:27176/|[ff01::213]:33332/|[ff01::083]:33332/&fl=id,score&start=0&q=lowerfilt:("quote+red+fox")&spellcheck.count=10&isShard=true&qt=spellCheckCompRH&fsv=true&spellcheck.alternativeTermCount=5} hits=12 status=0 QTime=2 
[junit4:junit4]   2> 11412 T53 C3 REQ [collection1] webapp= path=/select params={spellcheck=false&spellcheck.maxResultsForSuggest=10&spellcheck.extendedResults=true&shards.qt=spellCheckCompRH&spellcheck.collateExtendedResults=true&ids=21,20,19,17,22,18,15,16,13,14&spellcheck.maxCollationTries=10&spellcheck.maxCollations=1&distrib=false&wt=javabin&spellcheck.collate=true&version=2&spellcheck.onlyMorePopular=false&NOW=1363616458154&shard.url=127.0.0.1:27176/|[ff01::213]:33332/|[ff01::083]:33332/&fl=id,lowerfilt&q=lowerfilt:("quote+red+fox")&spellcheck.count=10&isShard=true&qt=spellCheckCompRH&spellcheck.alternativeTermCount=5} status=0 QTime=12 
[junit4:junit4]   2> 11418 T52 C3 REQ [collection1] webapp= path=/select params={spellcheck=false&spellcheck.maxResultsForSuggest=10&spellcheck.extendedResults=true&shards.qt=spellCheckCompRH&spellcheck.collateExtendedResults=true&ids=21,20,19,17,22,18,15,16,13,14&spellcheck.maxCollationTries=10&spellcheck.maxCollations=1&distrib=false&wt=javabin&spellcheck.collate=true&version=2&spellcheck.onlyMorePopular=false&NOW=1363616458153&shard.url=127.0.0.1:27176/|[ff01::213]:33332/|[ff01::083]:33332/&fl=id,lowerfilt&q=lowerfilt:("quote+red+fox")&spellcheck.count=10&isShard=true&qt=spellCheckCompRH&spellcheck.alternativeTermCount=5} status=0 QTime=21 
[junit4:junit4]   2> 11423 T51 C3 REQ [collection1] webapp= path=/select params={spellcheck=true&spellcheck.maxResultsForSuggest=10&shards.qt=spellCheckCompRH&spellcheck.extendedResults=true&spellcheck.collateExtendedResults=true&spellcheck.maxCollationTries=10&spellcheck.maxCollations=1&wt=javabin&spellcheck.collate=true&version=2&shards=127.0.0.1:27176/|[ff01::213]:33332/|[ff01::083]:33332/&fl=id,lowerfilt&q=lowerfilt:("quote+red+fox")&spellcheck.count=10&qt=spellCheckCompRH&spellcheck.alternativeTermCount=5} hits=12 status=0 QTime=43 
[junit4:junit4]   2> 11426 T48 C3 REQ [collection1] webapp= path=/select params={spellcheck=true&spellcheck.maxResultsForSuggest=10&shards.qt=spellCheckCompRH&spellcheck.extendedResults=true&spellcheck.collateExtendedResults=true&spellcheck.maxCollationTries=10&spellcheck.maxCollations=1&wt=javabin&spellcheck.collate=true&version=2&shards=127.0.0.1:27176/|[ff01::213]:33332/|[ff01::083]:33332/&fl=id,lowerfilt&q=lowerfilt:("quote+red+fox")&spellcheck.count=10&qt=spellCheckCompRH&spellcheck.alternativeTermCount=5} hits=12 status=0 QTime=45 
[junit4:junit4]   2> 11434 T49 C3 REQ [collection1] webapp= path=/select params={spellcheck=false&spellcheck.maxResultsForSuggest=10&spellcheck.extendedResults=true&shards.qt=spellCheckCompRH&spellcheck.collateExtendedResults=true&ids=21,20,19,17,22,18,15,16,13,14&spellcheck.maxCollationTries=10&spellcheck.maxCollations=1&distrib=false&wt=javabin&spellcheck.collate=true&version=2&spellcheck.onlyMorePopular=false&NOW=1363616458154&shard.url=127.0.0.1:27176/|[ff01::213]:33332/|[ff01::083]:33332/&fl=id,lowerfilt&q=lowerfilt:("quote+red+fox")&spellcheck.count=10&isShard=true&qt=spellCheckCompRH&spellcheck.alternativeTermCount=5} status=0 QTime=9 
[junit4:junit4]   2> 11438 T50 C3 REQ [collection1] webapp= path=/select params={spellcheck=true&spellcheck.maxResultsForSuggest=10&shards.qt=spellCheckCompRH&spellcheck.extendedResults=true&spellcheck.collateExtendedResults=true&spellcheck.maxCollationTries=10&spellcheck.maxCollations=1&wt=javabin&spellcheck.collate=true&version=2&shards=127.0.0.1:27176/|[ff01::213]:33332/|[ff01::083]:33332/&fl=id,lowerfilt&q=lowerfilt:("quote+red+fox")&spellcheck.count=10&qt=spellCheckCompRH&spellcheck.alternativeTermCount=5} hits=12 status=0 QTime=57 
[junit4:junit4]   2> 11439 T53 C3 REQ [collection1] webapp= path=/select params={spellcheck=true&spellcheck.maxResultsForSuggest=10&spellcheck.extendedResults=true&shards.qt=spellCheckCompRH&spellcheck.collateExtendedResults=true&spellcheck.maxCollationTries=10&spellcheck.maxCollations=1&distrib=false&wt=javabin&spellcheck.collate=true&version=2&rows=10&spellcheck.onlyMorePopular=false&NOW=1363616458204&shard.url=127.0.0.1:27176/|[ff01::213]:33332/|[ff01::083]:33332/&fl=id,score&start=0&q=lowerfilt:("quote+red+fox")&spellcheck.count=10&isShard=true&qt=spellCheckCompRH&fsv=true&spellcheck.alternativeTermCount=5} hits=12 status=0 QTime=3 
[junit4:junit4]   2> 11440 T52 C3 REQ [collection1] webapp= path=/select params={spellcheck=true&spellcheck.maxResultsForSuggest=10&spellcheck.extendedResults=true&shards.qt=spellCheckCompRH&spellcheck.collateExtendedResults=true&spellcheck.maxCollationTries=10&spellcheck.maxCollations=1&distrib=false&wt=javabin&spellcheck.collate=true&version=2&rows=10&spellcheck.onlyMorePopular=false&NOW=1363616458206&shard.url=127.0.0.1:27176/|[ff01::213]:33332/|[ff01::083]:33332/&fl=id,score&start=0&q=lowerfilt:("quote+red+fox")&spellcheck.count=10&isShard=true&qt=spellCheckCompRH&fsv=true&spellcheck.alternativeTermCount=5} hits=12 status=0 QTime=2 
[junit4:junit4]   2> 11454 T53 C3 REQ [collection1] webapp= path=/select params={spellcheck=false&spellcheck.maxResultsForSuggest=10&spellcheck.extendedResults=true&shards.qt=spellCheckCompRH&spellcheck.collateExtendedResults=true&ids=21,20,19,17,22,18,15,16,13,14&spellcheck.maxCollationTries=10&spellcheck.maxCollations=1&distrib=false&wt=javabin&spellcheck.collate=true&version=2&spellcheck.onlyMorePopular=false&NOW=1363616458206&shard.url=127.0.0.1:27176/|[ff01::213]:33332/|[ff01::083]:33332/&fl=id,lowerfilt&q=lowerfilt:("quote+red+fox")&spellcheck.count=10&isShard=true&qt=spellCheckCompRH&spellcheck.alternativeTermCount=5} status=0 QTime=6 
[junit4:junit4]   2> 11455 T52 C3 REQ [collection1] webapp= path=/select params={spellcheck=false&spellcheck.maxResultsForSuggest=10&spellcheck.extendedResults=true&shards.qt=spellCheckCompRH&spellcheck.collateExtendedResults=true&ids=21,20,19,17,22,18,15,16,13,14&spellcheck.maxCollationTries=10&spellcheck.maxCollations=1&distrib=false&wt=javabin&spellcheck.collate=true&version=2&spellcheck.onlyMorePopular=false&NOW=1363616458204&shard.url=127.0.0.1:27176/|[ff01::213]:33332/|[ff01::083]:33332/&fl=id,lowerfilt&q=lowerfilt:("quote+red+fox")&spellcheck.count=10&isShard=true&qt=spellCheckCompRH&spellcheck.alternativeTermCount=5} status=0 QTime=9 
[junit4:junit4]   2> 11455 T49 C3 REQ [collection1] webapp= path=/select params={spellcheck=true&spellcheck.maxResultsForSuggest=10&spellcheck.extendedResults=true&shards.qt=spellCheckCompRH&spellcheck.collateExtendedResults=true&spellcheck.maxCollationTries=10&spellcheck.maxCollations=1&distrib=false&wt=javabin&spellcheck.collate=true&version=2&rows=10&spellcheck.onlyMorePopular=false&NOW=1363616458219&shard.url=127.0.0.1:27176/|[ff01::213]:33332/|[ff01::083]:33332/&fl=id,score&start=0&q=lowerfilt:("quote+red+fox")&spellcheck.count=10&isShard=true&qt=spellCheckCompRH&fsv=true&spellcheck.alternativeTermCount=5} hits=12 status=0 QTime=2 
[junit4:junit4]   2> 11458 T48 C3 REQ [collection1] webapp= path=/select params={spellcheck=true&spellcheck.maxResultsForSuggest=10&shards.qt=spellCheckCompRH&spellcheck.extendedResults=true&spellcheck.collateExtendedResults=true&spellcheck.maxCollationTries=10&spellcheck.maxCollations=1&wt=javabin&spellcheck.collate=true&version=2&shards=127.0.0.1:27176/|[ff01::213]:33332/|[ff01::083]:33332/&fl=id,lowerfilt&q=lowerfilt:("quote+red+fox")&spellcheck.count=10&qt=spellCheckCompRH&spellcheck.alternativeTermCount=5} hits=12 status=0 QTime=24 
[junit4:junit4]   2> 11458 T51 C3 REQ [collection1] webapp= path=/select params={spellcheck=true&spellcheck.maxResultsForSuggest=10&shards.qt=spellCheckCompRH&spellcheck.extendedResults=true&spellcheck.collateExtendedResults=true&spellcheck.maxCollationTries=10&spellcheck.maxCollations=1&wt=javabin&spellcheck.collate=true&version=2&shards=127.0.0.1:27176/|[ff01::213]:33332/|[ff01::083]:33332/&fl=id,lowerfilt&q=lowerfilt:("quote+red+fox")&spellcheck.count=10&qt=spellCheckCompRH&spellcheck.alternativeTermCount=5} hits=12 status=0 QTime=27 
[junit4:junit4]   2> 11474 T49 C3 REQ [collection1] webapp= path=/select params={spellcheck=false&spellcheck.maxResultsForSuggest=10&spellcheck.extendedResults=true&shards.qt=spellCheckCompRH&spellcheck.collateExtendedResults=true&ids=21,20,19,17,22,18,15,16,13,14&spellcheck.maxCollationTries=10&spellcheck.maxCollations=1&distrib=false&wt=javabin&spellcheck.collate=true&version=2&spellcheck.onlyMorePopular=false&NOW=1363616458219&shard.url=127.0.0.1:27176/|[ff01::213]:33332/|[ff01::083]:33332/&fl=id,lowerfilt&q=lowerfilt:("quote+red+fox")&spellcheck.count=10&isShard=true&qt=spellCheckCompRH&spellcheck.alternativeTermCount=5} status=0 QTime=10 
[junit4:junit4]   2> 11478 T50 C3 REQ [collection1] webapp= path=/select params={spellcheck=true&spellcheck.maxResultsForSuggest=10&shards.qt=spellCheckCompRH&spellcheck.extendedResults=true&spellcheck.collateExtendedResults=true&spellcheck.maxCollationTries=10&spellcheck.maxCollations=1&wt=javabin&spellcheck.collate=true&version=2&shards=127.0.0.1:27176/|[ff01::213]:33332/|[ff01::083]:33332/&fl=id,lowerfilt&q=lowerfilt:("quote+red+fox")&spellcheck.count=10&qt=spellCheckCompRH&spellcheck.alternativeTermCount=5} hits=12 status=0 QTime=32 
[junit4:junit4]   2> 11549 T36 C2 REQ [collection1] webapp= path=/select params={spellcheck=true&spellcheck.maxResultsForSuggest=10&shards.qt=spellCheckCompRH&spellcheck.extendedResults=true&spellcheck.collateExtendedResults=true&spellcheck.maxCollationTries=10&spellcheck.maxCollations=1&distrib=false&wt=javabin&spellcheck.collate=true&version=2&fl=id,lowerfilt&q=lowerfilt:("rod+fix")&spellcheck.count=10&qt=spellCheckCompRH&spellcheck.alternativeTermCount=5} hits=1 status=0 QTime=63 
[junit4:junit4]   2> 11586 T49 C3 REQ [collection1] webapp= path=/select params={spellcheck=true&spellcheck.maxResultsForSuggest=10&spellcheck.extendedResults=true&shards.qt=spellCheckCompRH&spellcheck.collateExtendedResults=true&spellcheck.maxCollationTries=10&spellcheck.maxCollations=1&distrib=false&wt=javabin&spellcheck.collate=true&version=2&rows=10&spellcheck.onlyMorePopular=false&NOW=1363616458329&shard.url=127.0.0.1:27176/|[ff01::213]:33332/|[ff01::083]:33332/|[ff01::114]:33332/&fl=id,score&start=0&q=lowerfilt:("rod+fix")&spellcheck.count=10&isShard=true&qt=spellCheckCompRH&fsv=true&spellcheck.alternativeTermCount=5} hits=1 status=0 QTime=24 
[junit4:junit4]   2> 11595 T49 C3 REQ [collection1] webapp= path=/select params={spellcheck=false&spellcheck.maxResultsForSuggest=10&spellcheck.extendedResults=true&shards.qt=spellCheckCompRH&spellcheck.collateExtendedResults=true&ids=25&spellcheck.maxCollationTries=10&spellcheck.maxCollations=1&distrib=false&wt=javabin&spellcheck.collate=true&version=2&spellcheck.onlyMorePopular=false&NOW=1363616458329&shard.url=127.0.0.1:27176/|[ff01::213]:33332/|[ff01::083]:33332/|[ff01::114]:33332/&fl=id,lowerfilt&q=lowerfilt:("rod+fix")&spellcheck.count=10&isShard=true&qt=spellCheckCompRH&spellcheck.alternativeTermCount=5} status=0 QTime=2 
[junit4:junit4]   2> 11598 T50 C3 oashc.SpellCheckComponent.finishStage 127.0.0.1:27176/|[ff01::213]:33332/|[ff01::083]:33332/|[ff01::114]:33332/ {suggestions={rod={numFound=2,startOffset=12,endOffset=15,origFreq=1,suggestion=[{word=red,freq=13}, {word=ford,freq=1}]},fix={numFound=1,startOffset=16,endOffset=19,origFreq=1,suggestion=[{word=fox,freq=13}]},correctlySpelled=false,collation={collationQuery=lowerfilt:("red fox"),hits=13,misspellingsAndCorrections={rod=red,fix=fox},collationInternalRank=2}}}
[junit4:junit4]   2> 11599 T50 C3 oashc.SpellCheckComponent.finishStage 127.0.0.1:27176/|[ff01::213]:33332/|[ff01::083]:33332/|[ff01::114]:33332/ null
[junit4:junit4]   2> 11600 T50 C3 REQ [collection1] webapp= path=/select params={spellcheck=true&spellcheck.maxResultsForSuggest=10&shards.qt=spellCheckCompRH&spellcheck.extendedResults=true&spellcheck.collateExtendedResults=true&spellcheck.maxCollationTries=10&spellcheck.maxCollations=1&wt=javabin&spellcheck.collate=true&version=2&shards=127.0.0.1:27176/|[ff01::213]:33332/|[ff01::083]:33332/|[ff01::114]:33332/&fl=id,lowerfilt&q=lowerfilt:("rod+fix")&spellcheck.count=10&qt=spellCheckCompRH&spellcheck.alternativeTermCount=5} hits=1 status=0 QTime=44 
[junit4:junit4]   2> 11615 T33 oas.BaseDistributedSearchTestCase.query starting stress...
[junit4:junit4]   2> 11642 T49 C3 REQ [collection1] webapp= path=/select params={spellcheck=true&spellcheck.maxResultsForSuggest=10&spellcheck.extendedResults=true&shards.qt=spellCheckCompRH&spellcheck.collateExtendedResults=true&spellcheck.maxCollationTries=10&spellcheck.maxCollations=1&distrib=false&wt=javabin&spellcheck.collate=true&version=2&rows=10&spellcheck.onlyMorePopular=false&NOW=1363616458395&shard.url=127.0.0.1:27176/|[ff01::213]:33332/|[ff01::083]:33332/|[ff01::114]:33332/&fl=id,score&start=0&q=lowerfilt:("rod+fix")&spellcheck.count=10&isShard=true&qt=spellCheckCompRH&fsv=true&spellcheck.alternativeTermCount=5} hits=1 status=0 QTime=15 
[junit4:junit4]   2> 11647 T52 C3 REQ [collection1] webapp= path=/select params={spellcheck=true&spellcheck.maxResultsForSuggest=10&spellcheck.extendedResults=true&shards.qt=spellCheckCompRH&spellcheck.collateExtendedResults=true&spellcheck.maxCollationTries=10&spellcheck.maxCollations=1&distrib=false&wt=javabin&spellcheck.collate=true&version=2&rows=10&spellcheck.onlyMorePopular=false&NOW=1363616458395&shard.url=127.0.0.1:27176/|[ff01::213]:33332/|[ff01::083]:33332/|[ff01::114]:33332/&fl=id,score&start=0&q=lowerfilt:("rod+fix")&spellcheck.count=10&isShard=true&qt=spellCheckCompRH&fsv=true&spellcheck.alternativeTermCount=5} hits=1 status=0 QTime=19 
[junit4:junit4]   2> 11648 T53 C3 REQ [collection1] webapp= path=/select params={spellcheck=true&spellcheck.maxResultsForSuggest=10&spellcheck.extendedResults=true&shards.qt=spellCheckCompRH&spellcheck.collateExtendedResults=true&spellcheck.maxCollationTries=10&spellcheck.maxCollations=1&distrib=false&wt=javabin&spellcheck.collate=true&version=2&rows=10&spellcheck.onlyMorePopular=false&NOW=1363616458394&shard.url=127.0.0.1:27176/|[ff01::213]:33332/|[ff01::083]:33332/|[ff01::114]:33332/&fl=id,score&start=0&q=lowerfilt:("rod+fix")&spellcheck.count=10&isShard=true&qt=spellCheckCompRH&fsv=true&spellcheck.alternativeTermCount=5} hits=1 status=0 QTime=19 
[junit4:junit4]   2> 11652 T49 C3 REQ [collection1] webapp= path=/select params={spellcheck=false&spellcheck.maxResultsForSuggest=10&spellcheck.extendedResults=true&shards.qt=spellCheckCompRH&spellcheck.collateExtendedResults=true&ids=25&spellcheck.maxCollationTries=10&spellcheck.maxCollations=1&distrib=false&wt=javabin&spellcheck.collate=true&version=2&spellcheck.onlyMorePopular=false&NOW=1363616458395&shard.url=127.0.0.1:27176/|[ff01::213]:33332/|[ff01::083]:33332/|[ff01::114]:33332/&fl=id,lowerfilt&q=lowerfilt:("rod+fix")&spellcheck.count=10&isShard=true&qt=spellCheckCompRH&spellcheck.alternativeTermCount=5} status=0 QTime=2 
[junit4:junit4]   2> 11654 T50 C3 oashc.SpellCheckComponent.finishStage 127.0.0.1:27176/|[ff01::213]:33332/|[ff01::083]:33332/|[ff01::114]:33332/ {suggestions={rod={numFound=2,startOffset=12,endOffset=15,origFreq=1,suggestion=[{word=red,freq=13}, {word=ford,freq=1}]},fix={numFound=1,startOffset=16,endOffset=19,origFreq=1,suggestion=[{word=fox,freq=13}]},correctlySpelled=false,collation={collationQuery=lowerfilt:("red fox"),hits=13,misspellingsAndCorrections={rod=red,fix=fox},collationInternalRank=2}}}
[junit4:junit4]   2> 11655 T50 C3 oashc.SpellCheckComponent.finishStage 127.0.0.1:27176/|[ff01::213]:33332/|[ff01::083]:33332/|[ff01::114]:33332/ null
[junit4:junit4]   2> 11656 T53 C3 REQ [collection1] webapp= path=/select params={spellcheck=false&spellcheck.maxResultsForSuggest=10&spellcheck.extendedResults=true&shards.qt=spellCheckCompRH&spellcheck.collateExtendedResults=true&ids=25&spellcheck.maxCollationTries=10&spellcheck.maxCollations=1&distrib=false&wt=javabin&spellcheck.collate=true&version=2&spellcheck.onlyMorePopular=false&NOW=1363616458395&shard.url=127.0.0.1:27176/|[ff01::213]:33332/|[ff01::083]:33332/|[ff01::114]:33332/&fl=id,lowerfilt&q=lowerfilt:("rod+fix")&spellcheck.count=10&isShard=true&qt=spellCheckCompRH&spellcheck.alternativeTermCount=5} status=0 QTime=1 
[junit4:junit4]   2> 11656 T52 C3 REQ [collection1] webapp= path=/select params={spellcheck=false&spellcheck.maxResultsForSuggest=10&spellcheck.extendedResults=true&shards.qt=spellCheckCompRH&spellcheck.collateExtendedResults=true&ids=25&spellcheck.maxCollationTries=10&spellcheck.maxCollations=1&distrib=false&wt=javabin&spellcheck.collate=true&version=2&spellcheck.onlyMorePopular=false&NOW=1363616458394&shard.url=127.0.0.1:27176/|[ff01::213]:33332/|[ff01::083]:33332/|[ff01::114]:33332/&fl=id,lowerfilt&q=lowerfilt:("rod+fix")&spellcheck.count=10&isShard=true&qt=spellCheckCompRH&spellcheck.alternativeTermCount=5} status=0 QTime=1 
[junit4:junit4]   2> 11656 T50 C3 REQ [collection1] webapp= path=/select params={spellcheck=true&spellcheck.maxResultsForSuggest=10&shards.qt=spellCheckCompRH&spellcheck.extendedResults=true&spellcheck.collateExtendedResults=true&spellcheck.maxCollationTries=10&spellcheck.maxCollations=1&wt=javabin&spellcheck.collate=true&version=2&shards=127.0.0.1:27176/|[ff01::213]:33332/|[ff01::083]:33332/|[ff01::114]:33332/&fl=id,lowerfilt&q=lowerfilt:("rod+fix")&spellcheck.count=10&qt=spellCheckCompRH&spellcheck.alternativeTermCount=5} hits=1 status=0 QTime=34 
[junit4:junit4]   2> 11658 T48 C3 oashc.SpellCheckComponent.finishStage 127.0.0.1:27176/|[ff01::213]:33332/|[ff01::083]:33332/|[ff01::114]:33332/ {suggestions={rod={numFound=2,startOffset=12,endOffset=15,origFreq=1,suggestion=[{word=red,freq=13}, {word=ford,freq=1}]},fix={numFound=1,startOffset=16,endOffset=19,origFreq=1,suggestion=[{word=fox,freq=13}]},correctlySpelled=false,collation={collationQuery=lowerfilt:("red fox"),hits=13,misspellingsAndCorrections={rod=red,fix=fox},collationInternalRank=2}}}
[junit4:junit4]   2> 11658 T51 C3 oashc.SpellCheckComponent.finishStage 127.0.0.1:27176/|[ff01::213]:33332/|[ff01::083]:33332/|[ff01::114]:33332/ {suggestions={rod={numFound=2,startOffset=12,endOffset=15,origFreq=1,suggestion=[{word=red,freq=13}, {word=ford,freq=1}]},fix={numFound=1,startOffset=16,endOffset=19,origFreq=1,suggestion=[{word=fox,freq=13}]},correctlySpelled=false,collation={collationQuery=lowerfilt:("red fox"),hits=13,misspellingsAndCorrections={rod=red,fix=fox},collationInternalRank=2}}}
[junit4:junit4]   2> 11659 T48 C3 oashc.SpellCheckComponent.finishStage 127.0.0.1:27176/|[ff01::213]:33332/|[ff01::083]:33332/|[ff01::114]:33332/ null
[junit4:junit4]   2> 11659 T51 C3 oashc.SpellCheckComponent.finishStage 127.0.0.1:27176/|[ff01::213]:33332/|[ff01::083]:33332/|[ff01::114]:33332/ null
[junit4:junit4]   2> 11660 T48 C3 REQ [collection1] webapp= path=/select params={spellcheck=true&spellcheck.maxResultsForSuggest=10&shards.qt=spellCheckCompRH&spellcheck.extendedResults=true&spellcheck.collateExtendedResults=true&spellcheck.maxCollationTries=10&spellcheck.maxCollations=1&wt=javabin&spellcheck.collate=true&version=2&shards=127.0.0.1:27176/|[ff01::213]:33332/|[ff01::083]:33332/|[ff01::114]:33332/&fl=id,lowerfilt&q=lowerfilt:("rod+fix")&spellcheck.count=10&qt=spellCheckCompRH&spellcheck.alternativeTermCount=5} hits=1 status=0 QTime=38 
[junit4:junit4]   2> 11660 T51 C3 REQ [collection1] webapp= path=/select params={spellcheck=true&spellcheck.maxResultsForSuggest=10&shards.qt=spellCheckCompRH&spellcheck.extendedResults=true&spellcheck.collateExtendedResults=true&spellcheck.maxCollationTries=10&spellcheck.maxCollations=1&wt=javabin&spellcheck.collate=true&version=2&shards=127.0.0.1:27176/|[ff01::213]:33332/|[ff01::083]:33332/|[ff01::114]:33332/&fl=id,lowerfilt&q=lowerfilt:("rod+fix")&spellcheck.count=10&qt=spellCheckCompRH&spellcheck.alternativeTermCount=5} hits=1 status=0 QTime=39 
[junit4:junit4]   2> 11685 T49 C3 REQ [collection1] webapp= path=/select params={spellcheck=true&spellcheck.maxResultsForSuggest=10&spellcheck.extendedResults=true&shards.qt=spellCheckCompRH&spellcheck.collateExtendedResults=true&spellcheck.maxCollationTries=10&spellcheck.maxCollations=1&distrib=false&wt=javabin&spellcheck.collate=true&version=2&rows=10&spellcheck.onlyMorePopular=false&NOW=1363616458440&shard.url=127.0.0.1:27176/|[ff01::213]:33332/|[ff01::083]:33332/|[ff01::114]:33332/&fl=id,score&start=0&q=lowerfilt:("rod+fix")&spellcheck.count=10&isShard

[...truncated too long message...]

 docValues:{}, sim=DefaultSimilarity, locale=vi, timezone=America/Cuiaba
[junit4:junit4]   2> NOTE: FreeBSD 9.0-RELEASE amd64/Oracle Corporation 1.7.0_17 (64-bit)/cpus=16,threads=3,free=176256160,total=418512896
[junit4:junit4]   2> NOTE: All tests run in this JVM: [SortByFunctionTest, IndexSchemaRuntimeFieldTest, DistanceFunctionTest, OpenCloseCoreStressTest]
[junit4:junit4]   2> NOTE: download the large Jenkins line-docs file by running 'ant get-jenkins-line-docs' in the lucene directory.
[junit4:junit4]   2> NOTE: reproduce with: ant test  -Dtestcase=OpenCloseCoreStressTest -Dtests.seed=A5873DBB93C19062 -Dtests.multiplier=2 -Dtests.nightly=true -Dtests.slow=true -Dtests.linedocsfile=/home/hudson/lucene-data/enwiki.random.lines.txt -Dtests.locale=vi -Dtests.timezone=America/Cuiaba -Dtests.file.encoding=US-ASCII
[junit4:junit4] ERROR   0.00s J1 | OpenCloseCoreStressTest (suite) <<<
[junit4:junit4]    > Throwable #1: java.lang.AssertionError: ERROR: SolrIndexSearcher opens=1894 closes=1893
[junit4:junit4]    > 	at __randomizedtesting.SeedInfo.seed([A5873DBB93C19062]:0)
[junit4:junit4]    > 	at org.junit.Assert.fail(Assert.java:93)
[junit4:junit4]    > 	at org.apache.solr.SolrTestCaseJ4.endTrackingSearchers(SolrTestCaseJ4.java:247)
[junit4:junit4]    > 	at org.apache.solr.SolrTestCaseJ4.afterClass(SolrTestCaseJ4.java:97)
[junit4:junit4]    > 	at sun.reflect.NativeMethodAccessorImpl.invoke0(Native Method)
[junit4:junit4]    > 	at sun.reflect.NativeMethodAccessorImpl.invoke(NativeMethodAccessorImpl.java:57)
[junit4:junit4]    > 	at sun.reflect.DelegatingMethodAccessorImpl.invoke(DelegatingMethodAccessorImpl.java:43)
[junit4:junit4]    > 	at java.lang.reflect.Method.invoke(Method.java:601)
[junit4:junit4]    > 	at com.carrotsearch.randomizedtesting.RandomizedRunner.invoke(RandomizedRunner.java:1559)
[junit4:junit4]    > 	at com.carrotsearch.randomizedtesting.RandomizedRunner.access$600(RandomizedRunner.java:79)
[junit4:junit4]    > 	at com.carrotsearch.randomizedtesting.RandomizedRunner$5.evaluate(RandomizedRunner.java:700)
[junit4:junit4]    > 	at com.carrotsearch.randomizedtesting.rules.StatementAdapter.evaluate(StatementAdapter.java:36)
[junit4:junit4]    > 	at com.carrotsearch.randomizedtesting.rules.SystemPropertiesRestoreRule$1.evaluate(SystemPropertiesRestoreRule.java:53)
[junit4:junit4]    > 	at org.apache.lucene.util.AbstractBeforeAfterRule$1.evaluate(AbstractBeforeAfterRule.java:46)
[junit4:junit4]    > 	at org.apache.lucene.util.TestRuleStoreClassName$1.evaluate(TestRuleStoreClassName.java:42)
[junit4:junit4]    > 	at com.carrotsearch.randomizedtesting.rules.SystemPropertiesInvariantRule$1.evaluate(SystemPropertiesInvariantRule.java:55)
[junit4:junit4]    > 	at com.carrotsearch.randomizedtesting.rules.NoShadowingOrOverridesOnMethodsRule$1.evaluate(NoShadowingOrOverridesOnMethodsRule.java:39)
[junit4:junit4]    > 	at com.carrotsearch.randomizedtesting.rules.NoShadowingOrOverridesOnMethodsRule$1.evaluate(NoShadowingOrOverridesOnMethodsRule.java:39)
[junit4:junit4]    > 	at com.carrotsearch.randomizedtesting.rules.StatementAdapter.evaluate(StatementAdapter.java:36)
[junit4:junit4]    > 	at org.apache.lucene.util.TestRuleAssertionsRequired$1.evaluate(TestRuleAssertionsRequired.java:43)
[junit4:junit4]    > 	at org.apache.lucene.util.TestRuleMarkFailure$1.evaluate(TestRuleMarkFailure.java:48)
[junit4:junit4]    > 	at org.apache.lucene.util.TestRuleIgnoreAfterMaxFailures$1.evaluate(TestRuleIgnoreAfterMaxFailures.java:70)
[junit4:junit4]    > 	at org.apache.lucene.util.TestRuleIgnoreTestSuites$1.evaluate(TestRuleIgnoreTestSuites.java:55)
[junit4:junit4]    > 	at com.carrotsearch.randomizedtesting.rules.StatementAdapter.evaluate(StatementAdapter.java:36)
[junit4:junit4]    > 	at com.carrotsearch.randomizedtesting.ThreadLeakControl$StatementRunner.run(ThreadLeakControl.java:358)
[junit4:junit4]    > 	at java.lang.Thread.run(Thread.java:722)
[junit4:junit4]    > Throwable #2: com.carrotsearch.randomizedtesting.ThreadLeakError: 2 threads leaked from SUITE scope at org.apache.solr.core.OpenCloseCoreStressTest: 
[junit4:junit4]    >    1) Thread[id=2466, name=searcherExecutor-3220-thread-1, state=WAITING, group=TGRP-OpenCloseCoreStressTest]
[junit4:junit4]    >         at sun.misc.Unsafe.park(Native Method)
[junit4:junit4]    >         at java.util.concurrent.locks.LockSupport.park(LockSupport.java:186)
[junit4:junit4]    >         at java.util.concurrent.locks.AbstractQueuedSynchronizer$ConditionObject.await(AbstractQueuedSynchronizer.java:2043)
[junit4:junit4]    >         at java.util.concurrent.LinkedBlockingQueue.take(LinkedBlockingQueue.java:442)
[junit4:junit4]    >         at java.util.concurrent.ThreadPoolExecutor.getTask(ThreadPoolExecutor.java:1068)
[junit4:junit4]    >         at java.util.concurrent.ThreadPoolExecutor.runWorker(ThreadPoolExecutor.java:1130)
[junit4:junit4]    >         at java.util.concurrent.ThreadPoolExecutor$Worker.run(ThreadPoolExecutor.java:615)
[junit4:junit4]    >         at java.lang.Thread.run(Thread.java:722)
[junit4:junit4]    >    2) Thread[id=2467, name=commitScheduler-3222-thread-1, state=WAITING, group=TGRP-OpenCloseCoreStressTest]
[junit4:junit4]    >         at sun.misc.Unsafe.park(Native Method)
[junit4:junit4]    >         at java.util.concurrent.locks.LockSupport.park(LockSupport.java:186)
[junit4:junit4]    >         at java.util.concurrent.locks.AbstractQueuedSynchronizer$ConditionObject.await(AbstractQueuedSynchronizer.java:2043)
[junit4:junit4]    >         at java.util.concurrent.ScheduledThreadPoolExecutor$DelayedWorkQueue.take(ScheduledThreadPoolExecutor.java:1079)
[junit4:junit4]    >         at java.util.concurrent.ScheduledThreadPoolExecutor$DelayedWorkQueue.take(ScheduledThreadPoolExecutor.java:807)
[junit4:junit4]    >         at java.util.concurrent.ThreadPoolExecutor.getTask(ThreadPoolExecutor.java:1068)
[junit4:junit4]    >         at java.util.concurrent.ThreadPoolExecutor.runWorker(ThreadPoolExecutor.java:1130)
[junit4:junit4]    >         at java.util.concurrent.ThreadPoolExecutor$Worker.run(ThreadPoolExecutor.java:615)
[junit4:junit4]    >         at java.lang.Thread.run(Thread.java:722)
[junit4:junit4]    > 	at __randomizedtesting.SeedInfo.seed([A5873DBB93C19062]:0)
[junit4:junit4]    > Throwable #3: com.carrotsearch.randomizedtesting.ThreadLeakError: There are still zombie threads that couldn't be terminated:
[junit4:junit4]    >    1) Thread[id=2466, name=searcherExecutor-3220-thread-1, state=WAITING, group=TGRP-OpenCloseCoreStressTest]
[junit4:junit4]    >         at sun.misc.Unsafe.park(Native Method)
[junit4:junit4]    >         at java.util.concurrent.locks.LockSupport.park(LockSupport.java:186)
[junit4:junit4]    >         at java.util.concurrent.locks.AbstractQueuedSynchronizer$ConditionObject.await(AbstractQueuedSynchronizer.java:2043)
[junit4:junit4]    >         at java.util.concurrent.LinkedBlockingQueue.take(LinkedBlockingQueue.java:442)
[junit4:junit4]    >         at java.util.concurrent.ThreadPoolExecutor.getTask(ThreadPoolExecutor.java:1068)
[junit4:junit4]    >         at java.util.concurrent.ThreadPoolExecutor.runWorker(ThreadPoolExecutor.java:1130)
[junit4:junit4]    >         at java.util.concurrent.ThreadPoolExecutor$Worker.run(ThreadPoolExecutor.java:615)
[junit4:junit4]    >         at java.lang.Thread.run(Thread.java:722)
[junit4:junit4]    >    2) Thread[id=2467, name=commitScheduler-3222-thread-1, state=WAITING, group=TGRP-OpenCloseCoreStressTest]
[junit4:junit4]    >         at sun.misc.Unsafe.park(Native Method)
[junit4:junit4]    >         at java.util.concurrent.locks.LockSupport.park(LockSupport.java:186)
[junit4:junit4]    >         at java.util.concurrent.locks.AbstractQueuedSynchronizer$ConditionObject.await(AbstractQueuedSynchronizer.java:2043)
[junit4:junit4]    >         at java.util.concurrent.ScheduledThreadPoolExecutor$DelayedWorkQueue.take(ScheduledThreadPoolExecutor.java:1079)
[junit4:junit4]    >         at java.util.concurrent.ScheduledThreadPoolExecutor$DelayedWorkQueue.take(ScheduledThreadPoolExecutor.java:807)
[junit4:junit4]    >         at java.util.concurrent.ThreadPoolExecutor.getTask(ThreadPoolExecutor.java:1068)
[junit4:junit4]    >         at java.util.concurrent.ThreadPoolExecutor.runWorker(ThreadPoolExecutor.java:1130)
[junit4:junit4]    >         at java.util.concurrent.ThreadPoolExecutor$Worker.run(ThreadPoolExecutor.java:615)
[junit4:junit4]    >         at java.lang.Thread.run(Thread.java:722)
[junit4:junit4]    > 	at __randomizedtesting.SeedInfo.seed([A5873DBB93C19062]:0)
[junit4:junit4] Completed on J1 in 1225.86s, 6 tests, 4 failures, 2 errors, 2 skipped <<< FAILURES!

[...truncated 592 lines...]
BUILD FAILED
/usr/home/hudson/hudson-slave/workspace/Lucene-Solr-NightlyTests-trunk/build.xml:382: The following error occurred while executing this line:
/usr/home/hudson/hudson-slave/workspace/Lucene-Solr-NightlyTests-trunk/build.xml:355: The following error occurred while executing this line:
/usr/home/hudson/hudson-slave/workspace/Lucene-Solr-NightlyTests-trunk/build.xml:39: The following error occurred while executing this line:
/usr/home/hudson/hudson-slave/workspace/Lucene-Solr-NightlyTests-trunk/solr/build.xml:183: The following error occurred while executing this line:
/usr/home/hudson/hudson-slave/workspace/Lucene-Solr-NightlyTests-trunk/solr/common-build.xml:449: The following error occurred while executing this line:
/usr/home/hudson/hudson-slave/workspace/Lucene-Solr-NightlyTests-trunk/lucene/common-build.xml:1210: The following error occurred while executing this line:
/usr/home/hudson/hudson-slave/workspace/Lucene-Solr-NightlyTests-trunk/lucene/common-build.xml:874: There were test failures: 272 suites, 1144 tests, 3 suite-level errors, 1 error, 4 failures, 666 ignored (4 assumptions)

Total time: 91 minutes 55 seconds
Build step 'Invoke Ant' marked build as failure
Archiving artifacts
Recording test results
Email was triggered for: Failure
Sending email for trigger: Failure



Mime
View raw message