lucene-dev mailing list archives

Site index · List index
Message view « Date » · « Thread »
Top « Date » · « Thread »
From Apache Jenkins Server <jenk...@builds.apache.org>
Subject [JENKINS] Lucene-Solr-NightlyTests-trunk - Build # 213 - Still Failing
Date Thu, 21 Mar 2013 08:12:16 GMT
Build: https://builds.apache.org/job/Lucene-Solr-NightlyTests-trunk/213/

1 tests failed.
FAILED:  org.apache.solr.core.OpenCloseCoreStressTest.test10MinutesNew

Error Message:
Core 00016_core bad! expected:<424> but was:<415>

Stack Trace:
java.lang.AssertionError: Core 00016_core bad! expected:<424> but was:<415>
	at __randomizedtesting.SeedInfo.seed([45CC1D206B77F209:7FE9A50119B918BD]:0)
	at org.junit.Assert.fail(Assert.java:93)
	at org.junit.Assert.failNotEquals(Assert.java:647)
	at org.junit.Assert.assertEquals(Assert.java:128)
	at org.junit.Assert.assertEquals(Assert.java:472)
	at org.apache.solr.core.OpenCloseCoreStressTest.checkResults(OpenCloseCoreStressTest.java:303)
	at org.apache.solr.core.OpenCloseCoreStressTest.doStress(OpenCloseCoreStressTest.java:201)
	at org.apache.solr.core.OpenCloseCoreStressTest.test10MinutesNew(OpenCloseCoreStressTest.java:133)
	at sun.reflect.NativeMethodAccessorImpl.invoke0(Native Method)
	at sun.reflect.NativeMethodAccessorImpl.invoke(NativeMethodAccessorImpl.java:57)
	at sun.reflect.DelegatingMethodAccessorImpl.invoke(DelegatingMethodAccessorImpl.java:43)
	at java.lang.reflect.Method.invoke(Method.java:601)
	at com.carrotsearch.randomizedtesting.RandomizedRunner.invoke(RandomizedRunner.java:1559)
	at com.carrotsearch.randomizedtesting.RandomizedRunner.access$600(RandomizedRunner.java:79)
	at com.carrotsearch.randomizedtesting.RandomizedRunner$6.evaluate(RandomizedRunner.java:737)
	at com.carrotsearch.randomizedtesting.RandomizedRunner$7.evaluate(RandomizedRunner.java:773)
	at com.carrotsearch.randomizedtesting.RandomizedRunner$8.evaluate(RandomizedRunner.java:787)
	at com.carrotsearch.randomizedtesting.rules.SystemPropertiesRestoreRule$1.evaluate(SystemPropertiesRestoreRule.java:53)
	at org.apache.lucene.util.TestRuleSetupTeardownChained$1.evaluate(TestRuleSetupTeardownChained.java:50)
	at org.apache.lucene.util.TestRuleFieldCacheSanity$1.evaluate(TestRuleFieldCacheSanity.java:51)
	at org.apache.lucene.util.AbstractBeforeAfterRule$1.evaluate(AbstractBeforeAfterRule.java:46)
	at com.carrotsearch.randomizedtesting.rules.SystemPropertiesInvariantRule$1.evaluate(SystemPropertiesInvariantRule.java:55)
	at org.apache.lucene.util.TestRuleThreadAndTestName$1.evaluate(TestRuleThreadAndTestName.java:49)
	at org.apache.lucene.util.TestRuleIgnoreAfterMaxFailures$1.evaluate(TestRuleIgnoreAfterMaxFailures.java:70)
	at org.apache.lucene.util.TestRuleMarkFailure$1.evaluate(TestRuleMarkFailure.java:48)
	at com.carrotsearch.randomizedtesting.rules.StatementAdapter.evaluate(StatementAdapter.java:36)
	at com.carrotsearch.randomizedtesting.ThreadLeakControl$StatementRunner.run(ThreadLeakControl.java:358)
	at com.carrotsearch.randomizedtesting.ThreadLeakControl.forkTimeoutingTask(ThreadLeakControl.java:782)
	at com.carrotsearch.randomizedtesting.ThreadLeakControl$3.evaluate(ThreadLeakControl.java:442)
	at com.carrotsearch.randomizedtesting.RandomizedRunner.runSingleTest(RandomizedRunner.java:746)
	at com.carrotsearch.randomizedtesting.RandomizedRunner$3.evaluate(RandomizedRunner.java:648)
	at com.carrotsearch.randomizedtesting.RandomizedRunner$4.evaluate(RandomizedRunner.java:682)
	at com.carrotsearch.randomizedtesting.RandomizedRunner$5.evaluate(RandomizedRunner.java:693)
	at com.carrotsearch.randomizedtesting.rules.StatementAdapter.evaluate(StatementAdapter.java:36)
	at com.carrotsearch.randomizedtesting.rules.SystemPropertiesRestoreRule$1.evaluate(SystemPropertiesRestoreRule.java:53)
	at org.apache.lucene.util.AbstractBeforeAfterRule$1.evaluate(AbstractBeforeAfterRule.java:46)
	at org.apache.lucene.util.TestRuleStoreClassName$1.evaluate(TestRuleStoreClassName.java:42)
	at com.carrotsearch.randomizedtesting.rules.SystemPropertiesInvariantRule$1.evaluate(SystemPropertiesInvariantRule.java:55)
	at com.carrotsearch.randomizedtesting.rules.NoShadowingOrOverridesOnMethodsRule$1.evaluate(NoShadowingOrOverridesOnMethodsRule.java:39)
	at com.carrotsearch.randomizedtesting.rules.NoShadowingOrOverridesOnMethodsRule$1.evaluate(NoShadowingOrOverridesOnMethodsRule.java:39)
	at com.carrotsearch.randomizedtesting.rules.StatementAdapter.evaluate(StatementAdapter.java:36)
	at org.apache.lucene.util.TestRuleAssertionsRequired$1.evaluate(TestRuleAssertionsRequired.java:43)
	at org.apache.lucene.util.TestRuleMarkFailure$1.evaluate(TestRuleMarkFailure.java:48)
	at org.apache.lucene.util.TestRuleIgnoreAfterMaxFailures$1.evaluate(TestRuleIgnoreAfterMaxFailures.java:70)
	at org.apache.lucene.util.TestRuleIgnoreTestSuites$1.evaluate(TestRuleIgnoreTestSuites.java:55)
	at com.carrotsearch.randomizedtesting.rules.StatementAdapter.evaluate(StatementAdapter.java:36)
	at com.carrotsearch.randomizedtesting.ThreadLeakControl$StatementRunner.run(ThreadLeakControl.java:358)
	at java.lang.Thread.run(Thread.java:722)




Build Log:
[...truncated 9258 lines...]
[junit4:junit4] Suite: org.apache.solr.core.OpenCloseCoreStressTest
[junit4:junit4]   2> 6 T2213 oas.SolrTestCaseJ4.setUp ###Starting test30SecondsNew
[junit4:junit4]   2> 97 T2213 oejs.Server.doStart jetty-8.1.8.v20121106
[junit4:junit4]   2> 100 T2213 oejs.AbstractConnector.doStart Started SocketConnector@127.0.0.1:13244
[junit4:junit4]   2> 101 T2213 oass.SolrDispatchFilter.init SolrDispatchFilter.init()
[junit4:junit4]   2> 101 T2213 oasc.SolrResourceLoader.locateSolrHome JNDI not configured for solr (NoInitialContextEx)
[junit4:junit4]   2> 101 T2213 oasc.SolrResourceLoader.locateSolrHome using system property solr.solr.home: /usr/home/hudson/hudson-slave/workspace/Lucene-Solr-NightlyTests-trunk/solr/build/solr-core/test/J1/./OpenCloseCoreStressTest_
[junit4:junit4]   2> 102 T2213 oasc.CoreContainer$Initializer.initialize looking for solr config file: /usr/home/hudson/hudson-slave/workspace/Lucene-Solr-NightlyTests-trunk/solr/build/solr-core/test/J1/./OpenCloseCoreStressTest_/solr.xml
[junit4:junit4]   2> 102 T2213 oasc.CoreContainer.<init> New CoreContainer 1807052112
[junit4:junit4]   2> 103 T2213 oasc.CoreContainer.load Loading CoreContainer using Solr Home: '/usr/home/hudson/hudson-slave/workspace/Lucene-Solr-NightlyTests-trunk/solr/build/solr-core/test/J1/./OpenCloseCoreStressTest_/'
[junit4:junit4]   2> 103 T2213 oasc.SolrResourceLoader.<init> new SolrResourceLoader for directory: '/usr/home/hudson/hudson-slave/workspace/Lucene-Solr-NightlyTests-trunk/solr/build/solr-core/test/J1/./OpenCloseCoreStressTest_/'
[junit4:junit4]   2> 134 T2213 oasc.SolrProperties.walkFromHere Looking for cores in /usr/home/hudson/hudson-slave/workspace/Lucene-Solr-NightlyTests-trunk/solr/build/solr-core/test/J1/./OpenCloseCoreStressTest_
[junit4:junit4]   2> 135 T2213 oasc.SolrProperties.walkFromHere Discovered properties file /usr/home/hudson/hudson-slave/workspace/Lucene-Solr-NightlyTests-trunk/solr/build/solr-core/test/J1/./OpenCloseCoreStressTest_/00014_core/core.properties, adding to cores
[junit4:junit4]   2> 140 T2213 oasc.SolrProperties.walkFromHere Discovered properties file /usr/home/hudson/hudson-slave/workspace/Lucene-Solr-NightlyTests-trunk/solr/build/solr-core/test/J1/./OpenCloseCoreStressTest_/00008_core/core.properties, adding to cores
[junit4:junit4]   2> 141 T2213 oasc.SolrProperties.walkFromHere Discovered properties file /usr/home/hudson/hudson-slave/workspace/Lucene-Solr-NightlyTests-trunk/solr/build/solr-core/test/J1/./OpenCloseCoreStressTest_/00010_core/core.properties, adding to cores
[junit4:junit4]   2> 141 T2213 oasc.SolrProperties.walkFromHere Discovered properties file /usr/home/hudson/hudson-slave/workspace/Lucene-Solr-NightlyTests-trunk/solr/build/solr-core/test/J1/./OpenCloseCoreStressTest_/00004_core/core.properties, adding to cores
[junit4:junit4]   2> 142 T2213 oasc.SolrProperties.walkFromHere Discovered properties file /usr/home/hudson/hudson-slave/workspace/Lucene-Solr-NightlyTests-trunk/solr/build/solr-core/test/J1/./OpenCloseCoreStressTest_/00018_core/core.properties, adding to cores
[junit4:junit4]   2> 143 T2213 oasc.SolrProperties.walkFromHere Discovered properties file /usr/home/hudson/hudson-slave/workspace/Lucene-Solr-NightlyTests-trunk/solr/build/solr-core/test/J1/./OpenCloseCoreStressTest_/00000_core/core.properties, adding to cores
[junit4:junit4]   2> 144 T2213 oasc.SolrProperties.walkFromHere Discovered properties file /usr/home/hudson/hudson-slave/workspace/Lucene-Solr-NightlyTests-trunk/solr/build/solr-core/test/J1/./OpenCloseCoreStressTest_/00005_core/core.properties, adding to cores
[junit4:junit4]   2> 144 T2213 oasc.SolrProperties.walkFromHere Discovered properties file /usr/home/hudson/hudson-slave/workspace/Lucene-Solr-NightlyTests-trunk/solr/build/solr-core/test/J1/./OpenCloseCoreStressTest_/00019_core/core.properties, adding to cores
[junit4:junit4]   2> 145 T2213 oasc.SolrProperties.walkFromHere Discovered properties file /usr/home/hudson/hudson-slave/workspace/Lucene-Solr-NightlyTests-trunk/solr/build/solr-core/test/J1/./OpenCloseCoreStressTest_/00001_core/core.properties, adding to cores
[junit4:junit4]   2> 145 T2213 oasc.SolrProperties.walkFromHere Discovered properties file /usr/home/hudson/hudson-slave/workspace/Lucene-Solr-NightlyTests-trunk/solr/build/solr-core/test/J1/./OpenCloseCoreStressTest_/00015_core/core.properties, adding to cores
[junit4:junit4]   2> 146 T2213 oasc.SolrProperties.walkFromHere Discovered properties file /usr/home/hudson/hudson-slave/workspace/Lucene-Solr-NightlyTests-trunk/solr/build/solr-core/test/J1/./OpenCloseCoreStressTest_/00009_core/core.properties, adding to cores
[junit4:junit4]   2> 147 T2213 oasc.SolrProperties.walkFromHere Discovered properties file /usr/home/hudson/hudson-slave/workspace/Lucene-Solr-NightlyTests-trunk/solr/build/solr-core/test/J1/./OpenCloseCoreStressTest_/00011_core/core.properties, adding to cores
[junit4:junit4]   2> 147 T2213 oasc.SolrProperties.walkFromHere Discovered properties file /usr/home/hudson/hudson-slave/workspace/Lucene-Solr-NightlyTests-trunk/solr/build/solr-core/test/J1/./OpenCloseCoreStressTest_/00007_core/core.properties, adding to cores
[junit4:junit4]   2> 149 T2213 oasc.SolrProperties.walkFromHere Discovered properties file /usr/home/hudson/hudson-slave/workspace/Lucene-Solr-NightlyTests-trunk/solr/build/solr-core/test/J1/./OpenCloseCoreStressTest_/00003_core/core.properties, adding to cores
[junit4:junit4]   2> 149 T2213 oasc.SolrProperties.walkFromHere Discovered properties file /usr/home/hudson/hudson-slave/workspace/Lucene-Solr-NightlyTests-trunk/solr/build/solr-core/test/J1/./OpenCloseCoreStressTest_/00017_core/core.properties, adding to cores
[junit4:junit4]   2> 150 T2213 oasc.SolrProperties.walkFromHere Discovered properties file /usr/home/hudson/hudson-slave/workspace/Lucene-Solr-NightlyTests-trunk/solr/build/solr-core/test/J1/./OpenCloseCoreStressTest_/00013_core/core.properties, adding to cores
[junit4:junit4]   2> 151 T2213 oasc.SolrProperties.walkFromHere Discovered properties file /usr/home/hudson/hudson-slave/workspace/Lucene-Solr-NightlyTests-trunk/solr/build/solr-core/test/J1/./OpenCloseCoreStressTest_/00016_core/core.properties, adding to cores
[junit4:junit4]   2> 151 T2213 oasc.SolrProperties.walkFromHere Discovered properties file /usr/home/hudson/hudson-slave/workspace/Lucene-Solr-NightlyTests-trunk/solr/build/solr-core/test/J1/./OpenCloseCoreStressTest_/00012_core/core.properties, adding to cores
[junit4:junit4]   2> 152 T2213 oasc.SolrProperties.walkFromHere Discovered properties file /usr/home/hudson/hudson-slave/workspace/Lucene-Solr-NightlyTests-trunk/solr/build/solr-core/test/J1/./OpenCloseCoreStressTest_/00006_core/core.properties, adding to cores
[junit4:junit4]   2> 153 T2213 oasc.SolrProperties.walkFromHere Discovered properties file /usr/home/hudson/hudson-slave/workspace/Lucene-Solr-NightlyTests-trunk/solr/build/solr-core/test/J1/./OpenCloseCoreStressTest_/00002_core/core.properties, adding to cores
[junit4:junit4]   2> 153 T2213 oasc.SolrProperties.walkFromHere Looking for cores in /usr/home/hudson/hudson-slave/workspace/Lucene-Solr-NightlyTests-trunk/solr/build/solr-core/test/J1/./OpenCloseCoreStressTest_
[junit4:junit4]   2> 154 T2213 oasc.SolrProperties.walkFromHere Discovered properties file /usr/home/hudson/hudson-slave/workspace/Lucene-Solr-NightlyTests-trunk/solr/build/solr-core/test/J1/./OpenCloseCoreStressTest_/00014_core/core.properties, adding to cores
[junit4:junit4]   2> 155 T2213 oasc.SolrProperties.walkFromHere Discovered properties file /usr/home/hudson/hudson-slave/workspace/Lucene-Solr-NightlyTests-trunk/solr/build/solr-core/test/J1/./OpenCloseCoreStressTest_/00008_core/core.properties, adding to cores
[junit4:junit4]   2> 155 T2213 oasc.SolrProperties.walkFromHere Discovered properties file /usr/home/hudson/hudson-slave/workspace/Lucene-Solr-NightlyTests-trunk/solr/build/solr-core/test/J1/./OpenCloseCoreStressTest_/00010_core/core.properties, adding to cores
[junit4:junit4]   2> 156 T2213 oasc.SolrProperties.walkFromHere Discovered properties file /usr/home/hudson/hudson-slave/workspace/Lucene-Solr-NightlyTests-trunk/solr/build/solr-core/test/J1/./OpenCloseCoreStressTest_/00004_core/core.properties, adding to cores
[junit4:junit4]   2> 157 T2213 oasc.SolrProperties.walkFromHere Discovered properties file /usr/home/hudson/hudson-slave/workspace/Lucene-Solr-NightlyTests-trunk/solr/build/solr-core/test/J1/./OpenCloseCoreStressTest_/00018_core/core.properties, adding to cores
[junit4:junit4]   2> 157 T2213 oasc.SolrProperties.walkFromHere Discovered properties file /usr/home/hudson/hudson-slave/workspace/Lucene-Solr-NightlyTests-trunk/solr/build/solr-core/test/J1/./OpenCloseCoreStressTest_/00000_core/core.properties, adding to cores
[junit4:junit4]   2> 158 T2213 oasc.SolrProperties.walkFromHere Discovered properties file /usr/home/hudson/hudson-slave/workspace/Lucene-Solr-NightlyTests-trunk/solr/build/solr-core/test/J1/./OpenCloseCoreStressTest_/00005_core/core.properties, adding to cores
[junit4:junit4]   2> 159 T2213 oasc.SolrProperties.walkFromHere Discovered properties file /usr/home/hudson/hudson-slave/workspace/Lucene-Solr-NightlyTests-trunk/solr/build/solr-core/test/J1/./OpenCloseCoreStressTest_/00019_core/core.properties, adding to cores
[junit4:junit4]   2> 159 T2213 oasc.SolrProperties.walkFromHere Discovered properties file /usr/home/hudson/hudson-slave/workspace/Lucene-Solr-NightlyTests-trunk/solr/build/solr-core/test/J1/./OpenCloseCoreStressTest_/00001_core/core.properties, adding to cores
[junit4:junit4]   2> 160 T2213 oasc.SolrProperties.walkFromHere Discovered properties file /usr/home/hudson/hudson-slave/workspace/Lucene-Solr-NightlyTests-trunk/solr/build/solr-core/test/J1/./OpenCloseCoreStressTest_/00015_core/core.properties, adding to cores
[junit4:junit4]   2> 161 T2213 oasc.SolrProperties.walkFromHere Discovered properties file /usr/home/hudson/hudson-slave/workspace/Lucene-Solr-NightlyTests-trunk/solr/build/solr-core/test/J1/./OpenCloseCoreStressTest_/00009_core/core.properties, adding to cores
[junit4:junit4]   2> 161 T2213 oasc.SolrProperties.walkFromHere Discovered properties file /usr/home/hudson/hudson-slave/workspace/Lucene-Solr-NightlyTests-trunk/solr/build/solr-core/test/J1/./OpenCloseCoreStressTest_/00011_core/core.properties, adding to cores
[junit4:junit4]   2> 162 T2213 oasc.SolrProperties.walkFromHere Discovered properties file /usr/home/hudson/hudson-slave/workspace/Lucene-Solr-NightlyTests-trunk/solr/build/solr-core/test/J1/./OpenCloseCoreStressTest_/00007_core/core.properties, adding to cores
[junit4:junit4]   2> 163 T2213 oasc.SolrProperties.walkFromHere Discovered properties file /usr/home/hudson/hudson-slave/workspace/Lucene-Solr-NightlyTests-trunk/solr/build/solr-core/test/J1/./OpenCloseCoreStressTest_/00003_core/core.properties, adding to cores
[junit4:junit4]   2> 163 T2213 oasc.SolrProperties.walkFromHere Discovered properties file /usr/home/hudson/hudson-slave/workspace/Lucene-Solr-NightlyTests-trunk/solr/build/solr-core/test/J1/./OpenCloseCoreStressTest_/00017_core/core.properties, adding to cores
[junit4:junit4]   2> 164 T2213 oasc.SolrProperties.walkFromHere Discovered properties file /usr/home/hudson/hudson-slave/workspace/Lucene-Solr-NightlyTests-trunk/solr/build/solr-core/test/J1/./OpenCloseCoreStressTest_/00013_core/core.properties, adding to cores
[junit4:junit4]   2> 164 T2213 oasc.SolrProperties.walkFromHere Discovered properties file /usr/home/hudson/hudson-slave/workspace/Lucene-Solr-NightlyTests-trunk/solr/build/solr-core/test/J1/./OpenCloseCoreStressTest_/00016_core/core.properties, adding to cores
[junit4:junit4]   2> 165 T2213 oasc.SolrProperties.walkFromHere Discovered properties file /usr/home/hudson/hudson-slave/workspace/Lucene-Solr-NightlyTests-trunk/solr/build/solr-core/test/J1/./OpenCloseCoreStressTest_/00012_core/core.properties, adding to cores
[junit4:junit4]   2> 166 T2213 oasc.SolrProperties.walkFromHere Discovered properties file /usr/home/hudson/hudson-slave/workspace/Lucene-Solr-NightlyTests-trunk/solr/build/solr-core/test/J1/./OpenCloseCoreStressTest_/00006_core/core.properties, adding to cores
[junit4:junit4]   2> 166 T2213 oasc.SolrProperties.walkFromHere Discovered properties file /usr/home/hudson/hudson-slave/workspace/Lucene-Solr-NightlyTests-trunk/solr/build/solr-core/test/J1/./OpenCloseCoreStressTest_/00002_core/core.properties, adding to cores
[junit4:junit4]   2> 167 T2213 oashc.HttpShardHandlerFactory.getParameter Setting socketTimeout to: 0
[junit4:junit4]   2> 168 T2213 oashc.HttpShardHandlerFactory.getParameter Setting urlScheme to: http://
[junit4:junit4]   2> 168 T2213 oashc.HttpShardHandlerFactory.getParameter Setting connTimeout to: 0
[junit4:junit4]   2> 168 T2213 oashc.HttpShardHandlerFactory.getParameter Setting maxConnectionsPerHost to: 20
[junit4:junit4]   2> 169 T2213 oashc.HttpShardHandlerFactory.getParameter Setting corePoolSize to: 0
[junit4:junit4]   2> 169 T2213 oashc.HttpShardHandlerFactory.getParameter Setting maximumPoolSize to: 2147483647
[junit4:junit4]   2> 170 T2213 oashc.HttpShardHandlerFactory.getParameter Setting maxThreadIdleTime to: 5
[junit4:junit4]   2> 170 T2213 oashc.HttpShardHandlerFactory.getParameter Setting sizeOfQueue to: -1
[junit4:junit4]   2> 170 T2213 oashc.HttpShardHandlerFactory.getParameter Setting fairnessPolicy to: false
[junit4:junit4]   2> 171 T2213 oascsi.HttpClientUtil.createClient Creating new http client, config:maxConnectionsPerHost=20&maxConnections=10000&socketTimeout=0&connTimeout=0&retry=false
[junit4:junit4]   2> 187 T2213 oasc.CoreMaps.allocateLazyCores Allocating transient cache for 10 transient cores
[junit4:junit4]   2> 188 T2213 oasc.CoreContainer.load Registering Log Listener
[junit4:junit4]   2> 190 T2213 oass.SolrDispatchFilter.init user.dir=/usr/home/hudson/hudson-slave/workspace/Lucene-Solr-NightlyTests-trunk/solr/build/solr-core/test/J1
[junit4:junit4]   2> 190 T2213 oass.SolrDispatchFilter.init SolrDispatchFilter.init() done
[junit4:junit4]   2> 191 T2213 oascsi.HttpClientUtil.createClient Creating new http client, config:maxConnections=128&maxConnectionsPerHost=32&followRedirects=false
[junit4:junit4]   2> 202 T2213 oascsi.HttpClientUtil.createClient Creating new http client, config:maxConnections=128&maxConnectionsPerHost=32&followRedirects=false
[junit4:junit4]   2> 214 T2213 oascsi.HttpClientUtil.createClient Creating new http client, config:maxConnections=128&maxConnectionsPerHost=32&followRedirects=false
[junit4:junit4]   2> 225 T2213 oascsi.HttpClientUtil.createClient Creating new http client, config:maxConnections=128&maxConnectionsPerHost=32&followRedirects=false
[junit4:junit4]   2> 237 T2213 oascsi.HttpClientUtil.createClient Creating new http client, config:maxConnections=128&maxConnectionsPerHost=32&followRedirects=false
[junit4:junit4]   2> 249 T2213 oascsi.HttpClientUtil.createClient Creating new http client, config:maxConnections=128&maxConnectionsPerHost=32&followRedirects=false
[junit4:junit4]   2> 260 T2213 oascsi.HttpClientUtil.createClient Creating new http client, config:maxConnections=128&maxConnectionsPerHost=32&followRedirects=false
[junit4:junit4]   2> 271 T2213 oascsi.HttpClientUtil.createClient Creating new http client, config:maxConnections=128&maxConnectionsPerHost=32&followRedirects=false
[junit4:junit4]   2> 283 T2213 oascsi.HttpClientUtil.createClient Creating new http client, config:maxConnections=128&maxConnectionsPerHost=32&followRedirects=false
[junit4:junit4]   2> 295 T2213 oascsi.HttpClientUtil.createClient Creating new http client, config:maxConnections=128&maxConnectionsPerHost=32&followRedirects=false
[junit4:junit4]   2> 306 T2213 oascsi.HttpClientUtil.createClient Creating new http client, config:maxConnections=128&maxConnectionsPerHost=32&followRedirects=false
[junit4:junit4]   2> 317 T2213 oascsi.HttpClientUtil.createClient Creating new http client, config:maxConnections=128&maxConnectionsPerHost=32&followRedirects=false
[junit4:junit4]   2> 329 T2213 oascsi.HttpClientUtil.createClient Creating new http client, config:maxConnections=128&maxConnectionsPerHost=32&followRedirects=false
[junit4:junit4]   2> 341 T2213 oascsi.HttpClientUtil.createClient Creating new http client, config:maxConnections=128&maxConnectionsPerHost=32&followRedirects=false
[junit4:junit4]   2> 352 T2213 oascsi.HttpClientUtil.createClient Creating new http client, config:maxConnections=128&maxConnectionsPerHost=32&followRedirects=false
[junit4:junit4]   2> 363 T2213 oascsi.HttpClientUtil.createClient Creating new http client, config:maxConnections=128&maxConnectionsPerHost=32&followRedirects=false
[junit4:junit4]   2> 374 T2213 oascsi.HttpClientUtil.createClient Creating new http client, config:maxConnections=128&maxConnectionsPerHost=32&followRedirects=false
[junit4:junit4]   2> 385 T2213 oascsi.HttpClientUtil.createClient Creating new http client, config:maxConnections=128&maxConnectionsPerHost=32&followRedirects=false
[junit4:junit4]   2> 396 T2213 oascsi.HttpClientUtil.createClient Creating new http client, config:maxConnections=128&maxConnectionsPerHost=32&followRedirects=false
[junit4:junit4]   2> 407 T2213 oascsi.HttpClientUtil.createClient Creating new http client, config:maxConnections=128&maxConnectionsPerHost=32&followRedirects=false
[junit4:junit4]   2> 418 T2213 oascsi.HttpClientUtil.createClient Creating new http client, config:maxConnections=128&maxConnectionsPerHost=32&followRedirects=false
[junit4:junit4]   2> 429 T2213 oascsi.HttpClientUtil.createClient Creating new http client, config:maxConnections=128&maxConnectionsPerHost=32&followRedirects=false
[junit4:junit4]   2> 440 T2213 oascsi.HttpClientUtil.createClient Creating new http client, config:maxConnections=128&maxConnectionsPerHost=32&followRedirects=false
[junit4:junit4]   2> 451 T2213 oascsi.HttpClientUtil.createClient Creating new http client, config:maxConnections=128&maxConnectionsPerHost=32&followRedirects=false
[junit4:junit4]   2> 462 T2213 oascsi.HttpClientUtil.createClient Creating new http client, config:maxConnections=128&maxConnectionsPerHost=32&followRedirects=false
[junit4:junit4]   2> 473 T2213 oascsi.HttpClientUtil.createClient Creating new http client, config:maxConnections=128&maxConnectionsPerHost=32&followRedirects=false
[junit4:junit4]   2> 484 T2213 oascsi.HttpClientUtil.createClient Creating new http client, config:maxConnections=128&maxConnectionsPerHost=32&followRedirects=false
[junit4:junit4]   2> 495 T2213 oascsi.HttpClientUtil.createClient Creating new http client, config:maxConnections=128&maxConnectionsPerHost=32&followRedirects=false
[junit4:junit4]   2> 506 T2213 oascsi.HttpClientUtil.createClient Creating new http client, config:maxConnections=128&maxConnectionsPerHost=32&followRedirects=false
[junit4:junit4]   2> 517 T2213 oascsi.HttpClientUtil.createClient Creating new http client, config:maxConnections=128&maxConnectionsPerHost=32&followRedirects=false
[junit4:junit4]   2> 528 T2213 oasc.OpenCloseCoreStressTest.doStress Starting indexing and querying
[junit4:junit4]   2> 529 T2213 oasc.OpenCloseCoreStressTest.doStress 
[junit4:junit4]   2> 	
[junit4:junit4]   2> 	
[junit4:junit4]   2> 	
[junit4:junit4]   2> 	
[junit4:junit4]   2> 	Starting a 30 second cycle, seconds left: 30. Seconds run so far: 0.
[junit4:junit4]   2> 531 T2225 oasc.OneIndexer.run Starting indexing thread: 2225
[junit4:junit4]   2> 531 T2226 oasc.OneIndexer.run Starting indexing thread: 2226
[junit4:junit4]   2> 531 T2224 oasc.OneIndexer.run Starting indexing thread: 2224
[junit4:junit4]   2> 532 T2228 oasc.OneIndexer.run Starting indexing thread: 2228
[junit4:junit4]   2> 533 T2229 oasc.OneIndexer.run Starting indexing thread: 2229
[junit4:junit4]   2> 532 T2227 oasc.OneIndexer.run Starting indexing thread: 2227
[junit4:junit4]   2> 533 T2230 oasc.OneIndexer.run Starting indexing thread: 2230
[junit4:junit4]   2> 533 T2231 oasc.OneIndexer.run Starting indexing thread: 2231
[junit4:junit4]   2> 533 T2232 oasc.OneIndexer.run Starting indexing thread: 2232
[junit4:junit4]   2> 534 T2233 oasc.OneIndexer.run Starting indexing thread: 2233
[junit4:junit4]   2> 535 T2235 oasc.OneIndexer.run Starting indexing thread: 2235
[junit4:junit4]   2> 535 T2236 oasc.OneIndexer.run Starting indexing thread: 2236
[junit4:junit4]   2> 536 T2237 oasc.OneIndexer.run Starting indexing thread: 2237
[junit4:junit4]   2> 535 T2234 oasc.OneIndexer.run Starting indexing thread: 2234
[junit4:junit4]   2> 537 T2238 oasc.OneIndexer.run Starting indexing thread: 2238
[junit4:junit4]   2> 539 T2216 oasc.CoreContainer.create Creating SolrCore '00012_core' using instanceDir: /usr/home/hudson/hudson-slave/workspace/Lucene-Solr-NightlyTests-trunk/solr/build/solr-core/test/J1/./OpenCloseCoreStressTest_/00012_core
[junit4:junit4]   2> 539 T2217 oasc.CoreContainer.create Creating SolrCore '00007_core' using instanceDir: /usr/home/hudson/hudson-slave/workspace/Lucene-Solr-NightlyTests-trunk/solr/build/solr-core/test/J1/./OpenCloseCoreStressTest_/00007_core
[junit4:junit4]   2> 540 T2218 oasc.CoreContainer.create Creating SolrCore '00004_core' using instanceDir: /usr/home/hudson/hudson-slave/workspace/Lucene-Solr-NightlyTests-trunk/solr/build/solr-core/test/J1/./OpenCloseCoreStressTest_/00004_core
[junit4:junit4]   2> 540 T2239 oasc.OneQuery.run Starting query thread: 2239
[junit4:junit4]   2> 540 T2219 oasc.CoreContainer.create Creating SolrCore '00002_core' using instanceDir: /usr/home/hudson/hudson-slave/workspace/Lucene-Solr-NightlyTests-trunk/solr/build/solr-core/test/J1/./OpenCloseCoreStressTest_/00002_core
[junit4:junit4]   2> 541 T2244 oasc.OneQuery.run Starting query thread: 2244
[junit4:junit4]   2> 541 T2246 oasc.OneQuery.run Starting query thread: 2246
[junit4:junit4]   2> 540 T2240 oasc.OneQuery.run Starting query thread: 2240
[junit4:junit4]   2> 541 T2247 oasc.OneQuery.run Starting query thread: 2247
[junit4:junit4]   2> 542 T2250 oasc.OneQuery.run Starting query thread: 2250
[junit4:junit4]   2> 542 T2251 oasc.OneQuery.run Starting query thread: 2251
[junit4:junit4]   2> 542 T2253 oasc.OneQuery.run Starting query thread: 2253
[junit4:junit4]   2> 541 T2245 oasc.OneQuery.run Starting query thread: 2245
[junit4:junit4]   2> 541 T2218 oasc.SolrResourceLoader.<init> new SolrResourceLoader for directory: '/usr/home/hudson/hudson-slave/workspace/Lucene-Solr-NightlyTests-trunk/solr/build/solr-core/test/J1/./OpenCloseCoreStressTest_/00004_core/'
[junit4:junit4]   2> 541 T2217 oasc.SolrResourceLoader.<init> new SolrResourceLoader for directory: '/usr/home/hudson/hudson-slave/workspace/Lucene-Solr-NightlyTests-trunk/solr/build/solr-core/test/J1/./OpenCloseCoreStressTest_/00007_core/'
[junit4:junit4]   2> 540 T2216 oasc.SolrResourceLoader.<init> new SolrResourceLoader for directory: '/usr/home/hudson/hudson-slave/workspace/Lucene-Solr-NightlyTests-trunk/solr/build/solr-core/test/J1/./OpenCloseCoreStressTest_/00012_core/'
[junit4:junit4]   2> 543 T2257 oasc.CoreContainer.create Creating SolrCore '00014_core' using instanceDir: /usr/home/hudson/hudson-slave/workspace/Lucene-Solr-NightlyTests-trunk/solr/build/solr-core/test/J1/./OpenCloseCoreStressTest_/00014_core
[junit4:junit4]   2> 541 T2243 oasc.OneQuery.run Starting query thread: 2243
[junit4:junit4]   2> 541 T2242 oasc.OneQuery.run Starting query thread: 2242
[junit4:junit4]   2> 540 T2220 oasc.CoreContainer.create Creating SolrCore '00019_core' using instanceDir: /usr/home/hudson/hudson-slave/workspace/Lucene-Solr-NightlyTests-trunk/solr/build/solr-core/test/J1/./OpenCloseCoreStressTest_/00019_core
[junit4:junit4]   2> 540 T2241 oasc.OneQuery.run Starting query thread: 2241
[junit4:junit4]   2> 543 T2258 oasc.CoreContainer.create Creating SolrCore '00008_core' using instanceDir: /usr/home/hudson/hudson-slave/workspace/Lucene-Solr-NightlyTests-trunk/solr/build/solr-core/test/J1/./OpenCloseCoreStressTest_/00008_core
[junit4:junit4]   2> 542 T2256 oasc.CoreContainer.create Creating SolrCore '00017_core' using instanceDir: /usr/home/hudson/hudson-slave/workspace/Lucene-Solr-NightlyTests-trunk/solr/build/solr-core/test/J1/./OpenCloseCoreStressTest_/00017_core
[junit4:junit4]   2> 544 T2220 oasc.SolrResourceLoader.<init> new SolrResourceLoader for directory: '/usr/home/hudson/hudson-slave/workspace/Lucene-Solr-NightlyTests-trunk/solr/build/solr-core/test/J1/./OpenCloseCoreStressTest_/00019_core/'
[junit4:junit4]   2> 542 T2255 oasc.OneQuery.run Starting query thread: 2255
[junit4:junit4]   2> 542 T2252 oasc.CoreContainer.create Creating SolrCore '00001_core' using instanceDir: /usr/home/hudson/hudson-slave/workspace/Lucene-Solr-NightlyTests-trunk/solr/build/solr-core/test/J1/./OpenCloseCoreStressTest_/00001_core
[junit4:junit4]   2> 542 T2254 oasc.OneQuery.run Starting query thread: 2254
[junit4:junit4]   2> 545 T2256 oasc.SolrResourceLoader.<init> new SolrResourceLoader for directory: '/usr/home/hudson/hudson-slave/workspace/Lucene-Solr-NightlyTests-trunk/solr/build/solr-core/test/J1/./OpenCloseCoreStressTest_/00017_core/'
[junit4:junit4]   2> 541 T2219 oasc.SolrResourceLoader.<init> new SolrResourceLoader for directory: '/usr/home/hudson/hudson-slave/workspace/Lucene-Solr-NightlyTests-trunk/solr/build/solr-core/test/J1/./OpenCloseCoreStressTest_/00002_core/'
[junit4:junit4]   2> 545 T2252 oasc.SolrResourceLoader.<init> new SolrResourceLoader for directory: '/usr/home/hudson/hudson-slave/workspace/Lucene-Solr-NightlyTests-trunk/solr/build/solr-core/test/J1/./OpenCloseCoreStressTest_/00001_core/'
[junit4:junit4]   2> 541 T2222 oasc.CoreContainer.create Creating SolrCore '00011_core' using instanceDir: /usr/home/hudson/hudson-slave/workspace/Lucene-Solr-NightlyTests-trunk/solr/build/solr-core/test/J1/./OpenCloseCoreStressTest_/00011_core
[junit4:junit4]   2> 541 T2248 oasc.OneQuery.run Starting query thread: 2248
[junit4:junit4]   2> 545 T2258 oasc.SolrResourceLoader.<init> new SolrResourceLoader for directory: '/usr/home/hudson/hudson-slave/workspace/Lucene-Solr-NightlyTests-trunk/solr/build/solr-core/test/J1/./OpenCloseCoreStressTest_/00008_core/'
[junit4:junit4]   2> 544 T2257 oasc.SolrResourceLoader.<init> new SolrResourceLoader for directory: '/usr/home/hudson/hudson-slave/workspace/Lucene-Solr-NightlyTests-trunk/solr/build/solr-core/test/J1/./OpenCloseCoreStressTest_/00014_core/'
[junit4:junit4]   2> 546 T2222 oasc.SolrResourceLoader.<init> new SolrResourceLoader for directory: '/usr/home/hudson/hudson-slave/workspace/Lucene-Solr-NightlyTests-trunk/solr/build/solr-core/test/J1/./OpenCloseCoreStressTest_/00011_core/'
[junit4:junit4]   2> 634 T2218 oasc.SolrConfig.<init> Using Lucene MatchVersion: LUCENE_41
[junit4:junit4]   2> 634 T2220 oasc.SolrConfig.<init> Using Lucene MatchVersion: LUCENE_41
[junit4:junit4]   2> 639 T2252 oasc.SolrConfig.<init> Using Lucene MatchVersion: LUCENE_41
[junit4:junit4]   2> 643 T2263 oasc.CoreContainer.create Creating SolrCore '00000_core' using instanceDir: /usr/home/hudson/hudson-slave/workspace/Lucene-Solr-NightlyTests-trunk/solr/build/solr-core/test/J1/./OpenCloseCoreStressTest_/00000_core
[junit4:junit4]   2> 645 T2264 oasc.CoreContainer.create Creating SolrCore '00009_core' using instanceDir: /usr/home/hudson/hudson-slave/workspace/Lucene-Solr-NightlyTests-trunk/solr/build/solr-core/test/J1/./OpenCloseCoreStressTest_/00009_core
[junit4:junit4]   2> 645 T2263 oasc.SolrResourceLoader.<init> new SolrResourceLoader for directory: '/usr/home/hudson/hudson-slave/workspace/Lucene-Solr-NightlyTests-trunk/solr/build/solr-core/test/J1/./OpenCloseCoreStressTest_/00000_core/'
[junit4:junit4]   2> 647 T2269 oasc.CoreContainer.create Creating SolrCore '00010_core' using instanceDir: /usr/home/hudson/hudson-slave/workspace/Lucene-Solr-NightlyTests-trunk/solr/build/solr-core/test/J1/./OpenCloseCoreStressTest_/00010_core
[junit4:junit4]   2> 646 T2216 oasc.SolrConfig.<init> Using Lucene MatchVersion: LUCENE_41
[junit4:junit4]   2> 647 T2264 oasc.SolrResourceLoader.<init> new SolrResourceLoader for directory: '/usr/home/hudson/hudson-slave/workspace/Lucene-Solr-NightlyTests-trunk/solr/build/solr-core/test/J1/./OpenCloseCoreStressTest_/00009_core/'
[junit4:junit4]   2> 646 T2267 oasc.CoreContainer.create Creating SolrCore '00018_core' using instanceDir: /usr/home/hudson/hudson-slave/workspace/Lucene-Solr-NightlyTests-trunk/solr/build/solr-core/test/J1/./OpenCloseCoreStressTest_/00018_core
[junit4:junit4]   2> 645 T2266 oasc.CoreContainer.create Creating SolrCore '00006_core' using instanceDir: /usr/home/hudson/hudson-slave/workspace/Lucene-Solr-NightlyTests-trunk/solr/build/solr-core/test/J1/./OpenCloseCoreStressTest_/00006_core
[junit4:junit4]   2> 649 T2217 oasc.SolrConfig.<init> Using Lucene MatchVersion: LUCENE_41
[junit4:junit4]   2> 648 T2257 oasc.SolrConfig.<init> Using Lucene MatchVersion: LUCENE_41
[junit4:junit4]   2> 648 T2269 oasc.SolrResourceLoader.<init> new SolrResourceLoader for directory: '/usr/home/hudson/hudson-slave/workspace/Lucene-Solr-NightlyTests-trunk/solr/build/solr-core/test/J1/./OpenCloseCoreStressTest_/00010_core/'
[junit4:junit4]   2> 649 T2267 oasc.SolrResourceLoader.<init> new SolrResourceLoader for directory: '/usr/home/hudson/hudson-slave/workspace/Lucene-Solr-NightlyTests-trunk/solr/build/solr-core/test/J1/./OpenCloseCoreStressTest_/00018_core/'
[junit4:junit4]   2> 650 T2258 oasc.SolrConfig.<init> Using Lucene MatchVersion: LUCENE_41
[junit4:junit4]   2> 650 T2266 oasc.SolrResourceLoader.<init> new SolrResourceLoader for directory: '/usr/home/hudson/hudson-slave/workspace/Lucene-Solr-NightlyTests-trunk/solr/build/solr-core/test/J1/./OpenCloseCoreStressTest_/00006_core/'
[junit4:junit4]   2> 651 T2276 oasc.CoreContainer.create Creating SolrCore '00005_core' using instanceDir: /usr/home/hudson/hudson-slave/workspace/Lucene-Solr-NightlyTests-trunk/solr/build/solr-core/test/J1/./OpenCloseCoreStressTest_/00005_core
[junit4:junit4]   2> 652 T2222 oasc.SolrConfig.<init> Using Lucene MatchVersion: LUCENE_41
[junit4:junit4]   2> 652 T2276 oasc.SolrResourceLoader.<init> new SolrResourceLoader for directory: '/usr/home/hudson/hudson-slave/workspace/Lucene-Solr-NightlyTests-trunk/solr/build/solr-core/test/J1/./OpenCloseCoreStressTest_/00005_core/'
[junit4:junit4]   2> 667 T2256 oasc.SolrConfig.<init> Using Lucene MatchVersion: LUCENE_41
[junit4:junit4]   2> 683 T2219 oasc.SolrConfig.<init> Using Lucene MatchVersion: LUCENE_41
[junit4:junit4]   2> 791 T2263 oasc.SolrConfig.<init> Using Lucene MatchVersion: LUCENE_41
[junit4:junit4]   2> 796 T2266 oasc.SolrConfig.<init> Using Lucene MatchVersion: LUCENE_41
[junit4:junit4]   2> 815 T2267 oasc.SolrConfig.<init> Using Lucene MatchVersion: LUCENE_41
[junit4:junit4]   2> 822 T2264 oasc.SolrConfig.<init> Using Lucene MatchVersion: LUCENE_41
[junit4:junit4]   2> 827 T2269 oasc.SolrConfig.<init> Using Lucene MatchVersion: LUCENE_41
[junit4:junit4]   2> 844 T2218 oasc.SolrConfig.<init> Loaded SolrConfig: solrconfig-minimal.xml
[junit4:junit4]   2> 847 T2218 oass.IndexSchema.readSchema Reading Solr Schema
[junit4:junit4]   2> 847 T2220 oasc.SolrConfig.<init> Loaded SolrConfig: solrconfig-minimal.xml
[junit4:junit4]   2> 848 T2276 oasc.SolrConfig.<init> Using Lucene MatchVersion: LUCENE_41
[junit4:junit4]   2> 849 T2220 oass.IndexSchema.readSchema Reading Solr Schema
[junit4:junit4]   2> 853 T2252 oasc.SolrConfig.<init> Loaded SolrConfig: solrconfig-minimal.xml
[junit4:junit4]   2> 858 T2252 oass.IndexSchema.readSchema Reading Solr Schema
[junit4:junit4]   2> 858 T2220 oass.IndexSchema.readSchema Schema name=tiny
[junit4:junit4]   2> 858 T2217 oasc.SolrConfig.<init> Loaded SolrConfig: solrconfig-minimal.xml
[junit4:junit4]   2> 859 T2218 oass.IndexSchema.readSchema Schema name=tiny
[junit4:junit4]   2> 861 T2217 oass.IndexSchema.readSchema Reading Solr Schema
[junit4:junit4]   2> 869 T2252 oass.IndexSchema.readSchema Schema name=tiny
[junit4:junit4]   2> 870 T2258 oasc.SolrConfig.<init> Loaded SolrConfig: solrconfig-minimal.xml
[junit4:junit4]   2> 870 T2257 oasc.SolrConfig.<init> Loaded SolrConfig: solrconfig-minimal.xml
[junit4:junit4]   2> 872 T2257 oass.IndexSchema.readSchema Reading Solr Schema
[junit4:junit4]   2> 874 T2258 oass.IndexSchema.readSchema Reading Solr Schema
[junit4:junit4]   2> 874 T2217 oass.IndexSchema.readSchema Schema name=tiny
[junit4:junit4]   2> 878 T2216 oasc.SolrConfig.<init> Loaded SolrConfig: solrconfig-minimal.xml
[junit4:junit4]   2> 880 T2222 oasc.SolrConfig.<init> Loaded SolrConfig: solrconfig-minimal.xml
[junit4:junit4]   2> 882 T2216 oass.IndexSchema.readSchema Reading Solr Schema
[junit4:junit4]   2> 885 T2222 oass.IndexSchema.readSchema Reading Solr Schema
[junit4:junit4]   2> 885 T2257 oass.IndexSchema.readSchema Schema name=tiny
[junit4:junit4]   2> 886 T2258 oass.IndexSchema.readSchema Schema name=tiny
[junit4:junit4]   2> 894 T2216 oass.IndexSchema.readSchema Schema name=tiny
[junit4:junit4]   2> 898 T2222 oass.IndexSchema.readSchema Schema name=tiny
[junit4:junit4]   2> 904 T2256 oasc.SolrConfig.<init> Loaded SolrConfig: solrconfig-minimal.xml
[junit4:junit4]   2> 906 T2256 oass.IndexSchema.readSchema Reading Solr Schema
[junit4:junit4]   2> 917 T2256 oass.IndexSchema.readSchema Schema name=tiny
[junit4:junit4]   2> 922 T2219 oasc.SolrConfig.<init> Loaded SolrConfig: solrconfig-minimal.xml
[junit4:junit4]   2> 925 T2219 oass.IndexSchema.readSchema Reading Solr Schema
[junit4:junit4]   2> 935 T2219 oass.IndexSchema.readSchema Schema name=tiny
[junit4:junit4]   2> 970 T2217 oass.IndexSchema.readSchema unique key field: id
[junit4:junit4]   2> 971 T2252 oass.IndexSchema.readSchema unique key field: id
[junit4:junit4]   2> 971 T2258 oass.IndexSchema.readSchema unique key field: id
[junit4:junit4]   2> 975 T2217 oasc.SolrCore.initDirectoryFactory org.apache.solr.core.MockFSDirectoryFactory
[junit4:junit4]   2> 976 T2218 oass.IndexSchema.readSchema unique key field: id
[junit4:junit4]   2> 976 T2220 oass.IndexSchema.readSchema unique key field: id
[junit4:junit4]   2> 977 T2258 oasc.SolrCore.initDirectoryFactory org.apache.solr.core.MockFSDirectoryFactory
[junit4:junit4]   2> 976 T2252 oasc.SolrCore.initDirectoryFactory org.apache.solr.core.MockFSDirectoryFactory
[junit4:junit4]   2> 977 T2217 oasc.SolrCore.<init> [00007_core] Opening new SolrCore at /usr/home/hudson/hudson-slave/workspace/Lucene-Solr-NightlyTests-trunk/solr/build/solr-core/test/J1/./OpenCloseCoreStressTest_/00007_core/, dataDir=/usr/home/hudson/hudson-slave/workspace/Lucene-Solr-NightlyTests-trunk/solr/build/solr-core/test/J1/OpenCloseCoreStressTest_/00007_core/data/
[junit4:junit4]   2> 978 T2217 oasc.JmxMonitoredMap.<init> JMX monitoring is enabled. Adding Solr mbeans to JMX Server: com.sun.jmx.mbeanserver.JmxMBeanServer@433d44fc
[junit4:junit4]   2> 978 T2257 oass.IndexSchema.readSchema unique key field: id
[junit4:junit4]   2> 978 T2217 oasc.SolrCore.initDirectoryFactory org.apache.solr.core.MockFSDirectoryFactory
[junit4:junit4]   2> 979 T2258 oasc.SolrCore.<init> [00008_core] Opening new SolrCore at /usr/home/hudson/hudson-slave/workspace/Lucene-Solr-NightlyTests-trunk/solr/build/solr-core/test/J1/./OpenCloseCoreStressTest_/00008_core/, dataDir=/usr/home/hudson/hudson-slave/workspace/Lucene-Solr-NightlyTests-trunk/solr/build/solr-core/test/J1/OpenCloseCoreStressTest_/00008_core/data/
[junit4:junit4]   2> 979 T2252 oasc.SolrCore.<init> [00001_core] Opening new SolrCore at /usr/home/hudson/hudson-slave/workspace/Lucene-Solr-NightlyTests-trunk/solr/build/solr-core/test/J1/./OpenCloseCoreStressTest_/00001_core/, dataDir=/usr/home/hudson/hudson-slave/workspace/Lucene-Solr-NightlyTests-trunk/solr/build/solr-core/test/J1/OpenCloseCoreStressTest_/00001_core/data/
[junit4:junit4]   2> 979 T2258 oasc.JmxMonitoredMap.<init> JMX monitoring is enabled. Adding Solr mbeans to JMX Server: com.sun.jmx.mbeanserver.JmxMBeanServer@433d44fc
[junit4:junit4]   2> 980 T2252 oasc.JmxMonitoredMap.<init> JMX monitoring is enabled. Adding Solr mbeans to JMX Server: com.sun.jmx.mbeanserver.JmxMBeanServer@433d44fc
[junit4:junit4]   2> 980 T2218 oasc.SolrCore.initDirectoryFactory org.apache.solr.core.MockFSDirectoryFactory
[junit4:junit4]   2> 980 T2258 oasc.SolrCore.initDirectoryFactory org.apache.solr.core.MockFSDirectoryFactory
[junit4:junit4]   2> 980 T2252 oasc.SolrCore.initDirectoryFactory org.apache.solr.core.MockFSDirectoryFactory
[junit4:junit4]   2> 981 T2220 oasc.SolrCore.initDirectoryFactory org.apache.solr.core.MockFSDirectoryFactory
[junit4:junit4]   2> 982 T2218 oasc.SolrCore.<init> [00004_core] Opening new SolrCore at /usr/home/hudson/hudson-slave/workspace/Lucene-Solr-NightlyTests-trunk/solr/build/solr-core/test/J1/./OpenCloseCoreStressTest_/00004_core/, dataDir=/usr/home/hudson/hudson-slave/workspace/Lucene-Solr-NightlyTests-trunk/solr/build/solr-core/test/J1/OpenCloseCoreStressTest_/00004_core/data/
[junit4:junit4]   2> 982 T2217 oasc.CachingDirectoryFactory.get return new directory for /usr/home/hudson/hudson-slave/workspace/Lucene-Solr-NightlyTests-trunk/solr/build/solr-core/test/J1/OpenCloseCoreStressTest_/00007_core/data forceNew: false
[junit4:junit4]   2> 982 T2218 oasc.JmxMonitoredMap.<init> JMX monitoring is enabled. Adding Solr mbeans to JMX Server: com.sun.jmx.mbeanserver.JmxMBeanServer@433d44fc
[junit4:junit4]   2> 983 T2257 oasc.SolrCore.initDirectoryFactory org.apache.solr.core.MockFSDirectoryFactory
[junit4:junit4]   2> 983 T2218 oasc.SolrCore.initDirectoryFactory org.apache.solr.core.MockFSDirectoryFactory
[junit4:junit4]   2> 983 T2220 oasc.SolrCore.<init> [00019_core] Opening new SolrCore at /usr/home/hudson/hudson-slave/workspace/Lucene-Solr-NightlyTests-trunk/solr/build/solr-core/test/J1/./OpenCloseCoreStressTest_/00019_core/, dataDir=/usr/home/hudson/hudson-slave/workspace/Lucene-Solr-NightlyTests-trunk/solr/build/solr-core/test/J1/OpenCloseCoreStressTest_/00019_core/data/
[junit4:junit4]   2> 983 T2258 oasc.CachingDirectoryFactory.get return new directory for /usr/home/hudson/hudson-slave/workspace/Lucene-Solr-NightlyTests-trunk/solr/build/solr-core/test/J1/OpenCloseCoreStressTest_/00008_core/data forceNew: false
[junit4:junit4]   2> 984 T2220 oasc.JmxMonitoredMap.<init> JMX monitoring is enabled. Adding Solr mbeans to JMX Server: com.sun.jmx.mbeanserver.JmxMBeanServer@433d44fc
[junit4:junit4]   2> 984 T2257 oasc.SolrCore.<init> [00014_core] Opening new SolrCore at /usr/home/hudson/hudson-slave/workspace/Lucene-Solr-NightlyTests-trunk/solr/build/solr-core/test/J1/./OpenCloseCoreStressTest_/00014_core/, dataDir=/usr/home/hudson/hudson-slave/workspace/Lucene-Solr-NightlyTests-trunk/solr/build/solr-core/test/J1/OpenCloseCoreStressTest_/00014_core/data/
[junit4:junit4]   2> 984 T2252 oasc.CachingDirectoryFactory.get return new directory for /usr/home/hudson/hudson-slave/workspace/Lucene-Solr-NightlyTests-trunk/solr/build/solr-core/test/J1/OpenCloseCoreStressTest_/00001_core/data forceNew: false
[junit4:junit4]   2> 984 T2257 oasc.JmxMonitoredMap.<init> JMX monitoring is enabled. Adding Solr mbeans to JMX Server: com.sun.jmx.mbeanserver.JmxMBeanServer@433d44fc
[junit4:junit4]   2> 984 T2220 oasc.SolrCore.initDirectoryFactory org.apache.solr.core.MockFSDirectoryFactory
[junit4:junit4]   2> 985 T2217 oasc.SolrCore.getNewIndexDir New index directory detected: old=null new=/usr/home/hudson/hudson-slave/workspace/Lucene-Solr-NightlyTests-trunk/solr/build/solr-core/test/J1/OpenCloseCoreStressTest_/00007_core/data/index/
[junit4:junit4]   2> 985 T2257 oasc.SolrCore.initDirectoryFactory org.apache.solr.core.MockFSDirectoryFactory
[junit4:junit4]   2> 985 T2218 oasc.CachingDirectoryFactory.get return new directory for /usr/home/hudson/hudson-slave/workspace/Lucene-Solr-NightlyTests-trunk/solr/build/solr-core/test/J1/OpenCloseCoreStressTest_/00004_core/data forceNew: false
[junit4:junit4]   2> 985 T2216 oass.IndexSchema.readSchema unique key field: id
[junit4:junit4]   2> 987 T2258 oasc.SolrCore.getNewIndexDir New index directory detected: old=null new=/usr/home/hudson/hudson-slave/workspace/Lucene-Solr-NightlyTests-trunk/solr/build/solr-core/test/J1/OpenCloseCoreStressTest_/00008_core/data/index/
[junit4:junit4]   2> 988 T2252 oasc.SolrCore.getNewIndexDir New index directory detected: old=null new=/usr/home/hudson/hudson-slave/workspace/Lucene-Solr-NightlyTests-trunk/solr/build/solr-core/test/J1/OpenCloseCoreStressTest_/00001_core/data/index/
[junit4:junit4]   2> 988 T2222 oass.IndexSchema.readSchema unique key field: id
[junit4:junit4]   2> 988 T2217 oasc.SolrCore.initIndex WARNING [00007_core] Solr index directory '/usr/home/hudson/hudson-slave/workspace/Lucene-Solr-NightlyTests-trunk/solr/build/solr-core/test/J1/OpenCloseCoreStressTest_/00007_core/data/index' doesn't exist. Creating new index...
[junit4:junit4]   2> 988 T2220 oasc.CachingDirectoryFactory.get return new directory for /usr/home/hudson/hudson-slave/workspace/Lucene-Solr-NightlyTests-trunk/solr/build/solr-core/test/J1/OpenCloseCoreStressTest_/00019_core/data forceNew: false
[junit4:junit4]   2> 988 T2257 oasc.CachingDirectoryFactory.get return new directory for /usr/home/hudson/hudson-slave/workspace/Lucene-Solr-NightlyTests-trunk/solr/build/solr-core/test/J1/OpenCloseCoreStressTest_/00014_core/data forceNew: false
[junit4:junit4]   2> 989 T2218 oasc.SolrCore.getNewIndexDir New index directory detected: old=null new=/usr/home/hudson/hudson-slave/workspace/Lucene-Solr-NightlyTests-trunk/solr/build/solr-core/test/J1/OpenCloseCoreStressTest_/00004_core/data/index/
[junit4:junit4]   2> 989 T2217 oasc.CachingDirectoryFactory.get return new directory for /usr/home/hudson/hudson-slave/workspace/Lucene-Solr-NightlyTests-trunk/solr/build/solr-core/test/J1/OpenCloseCoreStressTest_/00007_core/data/index forceNew: false
[junit4:junit4]   2> 991 T2216 oasc.SolrCore.initDirectoryFactory org.apache.solr.core.MockFSDirectoryFactory
[junit4:junit4]   2> 992 T2258 oasc.SolrCore.initIndex WARNING [00008_core] Solr index directory '/usr/home/hudson/hudson-slave/workspace/Lucene-Solr-NightlyTests-trunk/solr/build/solr-core/test/J1/OpenCloseCoreStressTest_/00008_core/data/index' doesn't exist. Creating new index...
[junit4:junit4]   2> 993 T2216 oasc.SolrCore.<init> [00012_core] Opening new SolrCore at /usr/home/hudson/hudson-slave/workspace/Lucene-Solr-NightlyTests-trunk/solr/build/solr-core/test/J1/./OpenCloseCoreStressTest_/00012_core/, dataDir=/usr/home/hudson/hudson-slave/workspace/Lucene-Solr-NightlyTests-trunk/solr/build/solr-core/test/J1/OpenCloseCoreStressTest_/00012_core/data/
[junit4:junit4]   2> 993 T2218 oasc.SolrCore.initIndex WARNING [00004_core] Solr index directory '/usr/home/hudson/hudson-slave/workspace/Lucene-Solr-NightlyTests-trunk/solr/build/solr-core/test/J1/OpenCloseCoreStressTest_/00004_core/data/index' doesn't exist. Creating new index...
[junit4:junit4]   2> 993 T2216 oasc.JmxMonitoredMap.<init> JMX monitoring is enabled. Adding Solr mbeans to JMX Server: com.sun.jmx.mbeanserver.JmxMBeanServer@433d44fc
[junit4:junit4]   2> 993 T2258 oasc.CachingDirectoryFactory.get return new directory for /usr/home/hudson/hudson-slave/workspace/Lucene-Solr-NightlyTests-trunk/solr/build/solr-core/test/J1/OpenCloseCoreStressTest_/00008_core/data/index forceNew: false
[junit4:junit4]   2> 993 T2257 oasc.SolrCore.getNewIndexDir New index directory detected: old=null new=/usr/home/hudson/hudson-slave/workspace/Lucene-Solr-NightlyTests-trunk/solr/build/solr-core/test/J1/OpenCloseCoreStressTest_/00014_core/data/index/
[junit4:junit4]   2> 992 T2252 oasc.SolrCore.initIndex WARNING [00001_core] Solr index directory '/usr/home/hudson/hudson-slave/workspace/Lucene-Solr-NightlyTests-trunk/solr/build/solr-core/test/J1/OpenCloseCoreStressTest_/00001_core/data/index' doesn't exist. Creating new index...
[junit4:junit4]   2> 994 T2218 oasc.CachingDirectoryFactory.get return new directory for /usr/home/hudson/hudson-slave/workspace/Lucene-Solr-NightlyTests-trunk/solr/build/solr-core/test/J1/OpenCloseCoreStressTest_/00004_core/data/index forceNew: false
[junit4:junit4]   2> 993 T2220 oasc.SolrCore.getNewIndexDir New index directory detected: old=null new=/usr/home/hudson/hudson-slave/workspace/Lucene-Solr-NightlyTests-trunk/solr/build/solr-core/test/J1/OpenCloseCoreStressTest_/00019_core/data/index/
[junit4:junit4]   2> 994 T2216 oasc.SolrCore.initDirectoryFactory org.apache.solr.core.MockFSDirectoryFactory
[junit4:junit4]   2> 994 T2222 oasc.SolrCore.initDirectoryFactory org.apache.solr.core.MockFSDirectoryFactory
[junit4:junit4]   2> 995 T2252 oasc.CachingDirectoryFactory.get return new directory for /usr/home/hudson/hudson-slave/workspace/Lucene-Solr-NightlyTests-trunk/solr/build/solr-core/test/J1/OpenCloseCoreStressTest_/00001_core/data/index forceNew: false
[junit4:junit4]   2> 995 T2257 oasc.SolrCore.initIndex WARNING [00014_core] Solr index directory '/usr/home/hudson/hudson-slave/workspace/Lucene-Solr-NightlyTests-trunk/solr/build/solr-core/test/J1/OpenCloseCoreStressTest_/00014_core/data/index' doesn't exist. Creating new index...
[junit4:junit4]   2> 997 T2257 oasc.CachingDirectoryFactory.get return new directory for /usr/home/hudson/hudson-slave/workspace/Lucene-Solr-NightlyTests-trunk/solr/build/solr-core/test/J1/OpenCloseCoreStressTest_/00014_core/data/index forceNew: false
[junit4:junit4]   2> 998 T2222 oasc.SolrCore.<init> [00011_core] Opening new SolrCore at /usr/home/hudson/hudson-slave/workspace/Lucene-Solr-NightlyTests-trunk/solr/build/solr-core/test/J1/./OpenCloseCoreStressTest_/00011_core/, dataDir=/usr/home/hudson/hudson-slave/workspace/Lucene-Solr-NightlyTests-trunk/solr/build/solr-core/test/J1/OpenCloseCoreStressTest_/00011_core/data/
[junit4:junit4]   2> 998 T2222 oasc.JmxMonitoredMap.<init> JMX monitoring is enabled. Adding Solr mbeans to JMX Server: com.sun.jmx.mbeanserver.JmxMBeanServer@433d44fc
[junit4:junit4]   2> 998 T2216 oasc.CachingDirectoryFactory.get return new directory for /usr/home/hudson/hudson-slave/workspace/Lucene-Solr-NightlyTests-trunk/solr/build/solr-core/test/J1/OpenCloseCoreStressTest_/00012_core/data forceNew: false
[junit4:junit4]   2> 999 T2222 oasc.SolrCore.initDirectoryFactory org.apache.solr.core.MockFSDirectoryFactory
[junit4:junit4]   2> 999 T2220 oasc.SolrCore.initIndex WARNING [00019_core] Solr index directory '/usr/home/hudson/hudson-slave/workspace/Lucene-Solr-NightlyTests-trunk/solr/build/solr-core/test/J1/OpenCloseCoreStressTest_/00019_core/data/index' doesn't exist. Creating new index...
[junit4:junit4]   2> 1000 T2220 oasc.CachingDirectoryFactory.get return new directory for /usr/home/hudson/hudson-slave/workspace/Lucene-Solr-NightlyTests-trunk/solr/build/solr-core/test/J1/OpenCloseCoreStressTest_/00019_core/data/index forceNew: false
[junit4:junit4]   2> 1003 T2222 oasc.CachingDirectoryFactory.get return new directory for /usr/home/hudson/hudson-slave/workspace/Lucene-Solr-NightlyTests-trunk/solr/build/solr-core/test/J1/OpenCloseCoreStressTest_/00011_core/data forceNew: false
[junit4:junit4]   2> 1003 T2216 oasc.SolrCore.getNewIndexDir New index directory detected: old=null new=/usr/home/hudson/hudson-slave/workspace/Lucene-Solr-NightlyTests-trunk/solr/build/solr-core/test/J1/OpenCloseCoreStressTest_/00012_core/data/index/
[junit4:junit4]   2> 1007 T2256 oass.IndexSchema.readSchema unique key field: id
[junit4:junit4]   2> 1007 T2216 oasc.SolrCore.initIndex WARNING [00012_core] Solr index directory '/usr/home/hudson/hudson-slave/workspace/Lucene-Solr-NightlyTests-trunk/solr/build/solr-core/test/J1/OpenCloseCoreStressTest_/00012_core/data/index' doesn't exist. Creating new index...
[junit4:junit4]   2> 1008 T2222 oasc.SolrCore.getNewIndexDir New index directory detected: old=null new=/usr/home/hudson/hudson-slave/workspace/Lucene-Solr-NightlyTests-trunk/solr/build/solr-core/test/J1/OpenCloseCoreStressTest_/00011_core/data/index/
[junit4:junit4]   2> 1008 T2216 oasc.CachingDirectoryFactory.get return new directory for /usr/home/hudson/hudson-slave/workspace/Lucene-Solr-NightlyTests-trunk/solr/build/solr-core/test/J1/OpenCloseCoreStressTest_/00012_core/data/index forceNew: false
[junit4:junit4]   2> 1011 T2217 oasc.SolrDeletionPolicy.onCommit SolrDeletionPolicy.onCommit: commits:num=1
[junit4:junit4]   2> 		commit{dir=MockDirWrapper(org.apache.lucene.store.MMapDirectory@/usr/home/hudson/hudson-slave/workspace/Lucene-Solr-NightlyTests-trunk/solr/build/solr-core/test/J1/OpenCloseCoreStressTest_/00007_core/data/index lockFactory=org.apache.lucene.store.NativeFSLockFactory@44bae16a),segFN=segments_1,generation=1,filenames=[segments_1]
[junit4:junit4]   2> 1011 T2222 oasc.SolrCore.initIndex WARNING [00011_core] Solr index directory '/usr/home/hudson/hudson-slave/workspace/Lucene-Solr-NightlyTests-trunk/solr/build/solr-core/test/J1/OpenCloseCoreStressTest_/00011_core/data/index' doesn't exist. Creating new index...
[junit4:junit4]   2> 1012 T2217 oasc.SolrDeletionPolicy.updateCommits newest commit = 1[segments_1]
[junit4:junit4]   2> 1012 T2256 oasc.SolrCore.initDirectoryFactory org.apache.solr.core.MockFSDirectoryFactory
[junit4:junit4]   2> 1015 T2256 oasc.SolrCore.<init> [00017_core] Opening new SolrCore at /usr/home/hudson/hudson-slave/workspace/Lucene-Solr-NightlyTests-trunk/solr/build/solr-core/test/J1/./OpenCloseCoreStressTest_/00017_core/, dataDir=/usr/home/hudson/hudson-slave/workspace/Lucene-Solr-NightlyTests-trunk/solr/build/solr-core/test/J1/OpenCloseCoreStressTest_/00017_core/data/
[junit4:junit4]   2> 1015 T2256 oasc.JmxMonitoredMap.<init> JMX monitoring is enabled. Adding Solr mbeans to JMX Server: com.sun.jmx.mbeanserver.JmxMBeanServer@433d44fc
[junit4:junit4]   2> 1015 T2217 oasc.SolrCore.initWriters created json: solr.JSONResponseWriter
[junit4:junit4]   2> 1016 T2222 oasc.CachingDirectoryFactory.get return new directory for /usr/home/hudson/hudson-slave/workspace/Lucene-Solr-NightlyTests-trunk/solr/build/solr-core/test/J1/OpenCloseCoreStressTest_/00011_core/data/index forceNew: false
[junit4:junit4]   2> 1016 T2256 oasc.SolrCore.initDirectoryFactory org.apache.solr.core.MockFSDirectoryFactory
[junit4:junit4]   2> 1018 T2217 oasc.RequestHandlers.initHandlersFromConfig created /admin/: solr.admin.AdminHandlers
[junit4:junit4]   2> 1018 T2217 oasc.RequestHandlers.initHandlersFromConfig created /select: solr.SearchHandler
[junit4:junit4]   2> 1019 T2256 oasc.CachingDirectoryFactory.get return new directory for /usr/home/hudson/hudson-slave/workspace/Lucene-Solr-NightlyTests-trunk/solr/build/solr-core/test/J1/OpenCloseCoreStressTest_/00017_core/data forceNew: false
[junit4:junit4]   2> 1019 T2217 oasc.RequestHandlers.initHandlersFromConfig created /update: solr.UpdateRequestHandler
[junit4:junit4]   2> 1022 T2256 oasc.SolrCore.getNewIndexDir New index directory detected: old=null new=/usr/home/hudson/hudson-slave/workspace/Lucene-Solr-NightlyTests-trunk/solr/build/solr-core/test/J1/OpenCloseCoreStressTest_/00017_core/data/index/
[junit4:junit4]   2> 1024 T2256 oasc.SolrCore.initIndex WARNING [00017_core] Solr index directory '/usr/home/hudson/hudson-slave/workspace/Lucene-Solr-NightlyTests-trunk/solr/build/solr-core/test/J1/OpenCloseCoreStressTest_/00017_core/data/index' doesn't exist. Creating new index...
[junit4:junit4]   2> 1025 T2256 oasc.CachingDirectoryFactory.get return new directory for /usr/home/hudson/hudson-slave/workspace/Lucene-Solr-NightlyTests-trunk/solr/build/solr-core/test/J1/OpenCloseCoreStressTest_/00017_core/data/index forceNew: false
[junit4:junit4]   2> 1028 T2219 oass.IndexSchema.readSchema unique key field: id
[junit4:junit4]   2> 1031 T2219 oasc.SolrCore.initDirectoryFactory org.apache.solr.core.MockFSDirectoryFactory
[junit4:junit4]   2> 1034 T2219 oasc.SolrCore.<init> [00002_core] Opening new SolrCore at /usr/home/hudson/hudson-slave/workspace/Lucene-Solr-NightlyTests-trunk/solr/build/solr-core/test/J1/./OpenCloseCoreStressTest_/00002_core/, dataDir=/usr/home/hudson/hudson-slave/workspace/Lucene-Solr-NightlyTests-trunk/solr/build/solr-core/test/J1/OpenCloseCoreStressTest_/00002_core/data/
[junit4:junit4]   2> 1034 T2266 oasc.SolrConfig.<init> Loaded SolrConfig: solrconfig-minimal.xml
[junit4:junit4]   2> 1034 T2219 oasc.JmxMonitoredMap.<init> JMX monitoring is enabled. Adding Solr mbeans to JMX Server: com.sun.jmx.mbeanserver.JmxMBeanServer@433d44fc
[junit4:junit4]   2> 1035 T2222 oasc.SolrDeletionPolicy.onCommit SolrDeletionPolicy.onCommit: commits:num=1
[junit4:junit4]   2> 		commit{dir=MockDirWrapper(org.apache.lucene.store.MMapDirectory@/usr/home/hudson/hudson-slave/workspace/Lucene-Solr-NightlyTests-trunk/solr/build/solr-core/test/J1/OpenCloseCoreStressTest_/00011_core/data/index lockFactory=org.apache.lucene.store.NativeFSLockFactory@4da39c20),segFN=segments_1,generation=1,filenames=[segments_1]
[junit4:junit4]   2> 1035 T2222 oasc.SolrDeletionPolicy.updateCommits newest commit = 1[segments_1]
[junit4:junit4]   2> 1035 T2219 oasc.SolrCore.initDirectoryFactory org.apache.solr.core.MockFSDirectoryFactory
[junit4:junit4]   2> 1037 T2266 oass.IndexSchema.readSchema Reading Solr Schema
[junit4:junit4]   2> 1038 T2263 oasc.SolrConfig.<init> Loaded SolrConfig: solrconfig-minimal.xml
[junit4:junit4]   2> 1039 T2219 oasc.CachingDirectoryFactory.get return new directory for /usr/home/hudson/hudson-slave/workspace/Lucene-Solr-NightlyTests-trunk/solr/build/solr-core/test/J1/OpenCloseCoreStressTest_/00002_core/data forceNew: false
[junit4:junit4]   2> 1039 T2222 oasc.SolrCore.initWriters created json: solr.JSONResponseWriter
[junit4:junit4]   2> 1040 T2263 oass.IndexSchema.readSchema Reading Solr Schema
[junit4:junit4]   2> 1041 T2216 oasc.SolrDeletionPolicy.onCommit SolrDeletionPolicy.onCommit: commits:num=1
[junit4:junit4]   2> 		commit{dir=MockDirWrapper(org.apache.lucene.store.MMapDirectory@/usr/home/hudson/hudson-slave/workspace/Lucene-Solr-NightlyTests-trunk/solr/build/solr-core/test/J1/OpenCloseCoreStressTest_/00012_core/data/index lockFactory=org.apache.lucene.store.NativeFSLockFactory@5abe700d),segFN=segments_1,generation=1,filenames=[segments_1]
[junit4:junit4]   2> 1041 T2219 oasc.SolrCore.getNewIndexDir New index directory detected: old=null new=/usr/home/hudson/hudson-slave/workspace/Lucene-Solr-NightlyTests-trunk/solr/build/solr-core/test/J1/OpenCloseCoreStressTest_/00002_core/data/index/
[junit4:junit4]   2> 1042 T2220 oasc.SolrDeletionPolicy.onCommit SolrDeletionPolicy.onCommit: commits:num=1
[junit4:junit4]   2> 		commit{dir=MockDirWrapper(org.apache.lucene.store.MMapDirectory@/usr/home/hudson/hudson-slave/workspace/Lucene-Solr-NightlyTests-trunk/solr/build/solr-core/test/J1/OpenCloseCoreStressTest_/00019_core/data/index lockFactory=org.apache.lucene.store.NativeFSLockFactory@34fd4590),segFN=segments_1,generation=1,filenames=[segments_1]
[junit4:junit4]   2> 1041 T2216 oasc.SolrDeletionPolicy.updateCommits newest commit = 1[segments_1]
[junit4:junit4]   2> 1041 T2222 oasc.RequestHandlers.initHandlersFromConfig created /admin/: solr.admin.AdminHandlers
[junit4:junit4]   2> 1042 T2258 oasc.SolrDeletionPolicy.onCommit SolrDeletionPolicy.onCommit: commits:num=1
[junit4:junit4]   2> 		commit{dir=MockDirWrapper(org.apache.lucene.store.MMapDirectory@/usr/home/hudson/hudson-slave/workspace/Lucene-Solr-NightlyTests-trunk/solr/build/solr-core/test/J1/OpenCloseCoreStressTest_/00008_core/data/index lockFactory=org.apache.lucene.store.NativeFSLockFactory@210a0bcb),segFN=segments_1,generation=1,filenames=[segments_1]
[junit4:junit4]   2> 1042 T2252 oasc.SolrDeletionPolicy.onCommit SolrDeletionPolicy.onCommit: commits:num=1
[junit4:junit4]   2> 		commit{dir=MockDirWrapper(org.apache.lucene.store.MMapDirectory@/usr/home/hudson/hudson-slave/workspace/Lucene-Solr-NightlyTests-trunk/solr/build/solr-core/test/J1/OpenCloseCoreStressTest_/00001_core/data/index lockFactory=org.apache.lucene.store.NativeFSLockFactory@4ee8f85e),segFN=segments_1,generation=1,filenames=[segments_1]
[junit4:junit4]   2> 1043 T2258 oasc.SolrDeletionPolicy.updateCommits newest commit = 1[segments_1]
[junit4:junit4]   2> 1043 T2252 oasc.SolrDeletionPolicy.updateCommits newest commit = 1[segments_1]
[junit4:junit4]   2> 1042 T2218 oasc.SolrDeletionPolicy.onCommit SolrDeletionPolicy.onCommit: commits:num=1
[junit4:junit4]   2> 		commit{dir=MockDirWrapper(org.apache.lucene.store.MMapDirectory@/usr/home/hudson/hudson-slave/workspace/Lucene-Solr-NightlyTests-trunk/solr/build/solr-core/test/J1/OpenCloseCoreStressTest_/00004_core/data/index lockFactory=org.apache.lucene.store.NativeFSLockFactory@3aab7661),segFN=segments_1,generation=1,filenames=[segments_1]
[junit4:junit4]   2> 1042 T2257 oasc.SolrDeletionPolicy.onCommit SolrDeletionPolicy.onCommit: commits:num=1
[junit4:junit4]   2> 		commit{dir=MockDirWrapper(org.apache.lucene.store.MMapDirectory@/usr/home/hudson/hudson-slave/workspace/Lucene-Solr-NightlyTests-trunk/solr/build/solr-core/test/J1/OpenCloseCoreStressTest_/00014_core/data/index lockFactory=org.apache.lucene.store.NativeFSLockFactory@1a8c4d5f),segFN=segments_1,generation=1,filenames=[segments_1]
[junit4:junit4]   2> 1044 T2218 oasc.SolrDeletionPolicy.updateCommits newest commit = 1[segments_1]
[junit4:junit4]   2> 1044 T2257 oasc.SolrDeletionPolicy.updateCommits newest commit = 1[segments_1]
[junit4:junit4]   2> 1044 T2220 oasc.SolrDeletionPolicy.updateCommits newest commit = 1[segments_1]
[junit4:junit4]   2> 1043 T2222 oasc.RequestHandlers.initHandlersFromConfig created /select: solr.SearchHandler
[junit4:junit4]   2> 1045 T2219 oasc.SolrCore.initIndex WARNING [00002_core] Solr index directory '/usr/home/hudson/hudson-slave/workspace/Lucene-Solr-NightlyTests-trunk/solr/build/solr-core/test/J1/OpenCloseCoreStressTest_/00002_core/data/index' doesn't exist. Creating new index...
[junit4:junit4]   2> 1045 T2222 oasc.RequestHandlers.initHandlersFromConfig created /update: solr.UpdateRequestHandler
[junit4:junit4]   2> 1046 T2219 oasc.CachingDirectoryFactory.get return new directory for /usr/home/hudson/hudson-slave/workspace/Lucene-Solr-NightlyTests-trunk/solr/build/solr-core/test/J1/OpenCloseCoreStressTest_/00002_core/data/index forceNew: false
[junit4:junit4]   2> 1048 T2216 oasc.SolrCore.initWriters created json: solr.JSONResponseWriter
[junit4:junit4]   2> 1050 T2216 oasc.RequestHandlers.initHandlersFromConfig created /admin/: solr.admin.AdminHandlers
[junit4:junit4]   2> 1050 T2252 oasc.SolrCore.initWriters created json: solr.JSONResponseWriter
[junit4:junit4]   2> 1051 T2216 oasc.RequestHandlers.initHandlersFromConfig created /select: solr.SearchHandler
[junit4:junit4]   2> 1051 T2256 oasc.SolrDeletionPolicy.onCommit SolrDeletionPolicy.onCommit: commits:num=1
[junit4:junit4]   2> 		commit{dir=MockDirWrapper(org.apache.lucene.store.MMapDirectory@/usr/home/hudson/hudson-slave/workspace/Lucene-Solr-NightlyTests-trunk/solr/build/solr-core/test/J1/OpenCloseCoreStressTest_/00017_core/data/index lockFactory=org.apache.lucene.store.NativeFSLockFactory@2e6510ba),segFN=segments_1,generation=1,filenames=[segments_1]
[junit4:junit4]   2> 1051 T2216 oasc.RequestHandlers.initHandlersFromConfig created /update: solr.UpdateRequestHandler
[junit4:junit4]   2> 1051 T2256 oasc.SolrDeletionPolicy.updateCommits newest commit = 1[segments_1]
[junit4:junit4]   2> 1052 T2252 oasc.RequestHandlers.initHandlersFromConfig created /admin/: solr.admin.AdminHandlers
[junit4:junit4]   2> 1053 T2252 oasc.RequestHandlers.initHandlersFromConfig created /select: solr.SearchHandler
[junit4:junit4]   2> 1053 T2252 oasc.RequestHandlers.initHandlersFromConfig created /update: solr.UpdateRequestHandler
[junit4:junit4]   2> 1053 T2258 oasc.SolrCore.initWriters created json: solr.JSONResponseWriter
[junit4:junit4]   2> 1055 T2258 oasc.RequestHandlers.initHandlersFromConfig created /admin/: solr.admin.AdminHandlers
[junit4:junit4]   2> 1056 T2258 oasc.RequestHandlers.initHandlersFromConfig created /select: solr.SearchHandler
[junit4:junit4]   2> 1056 T2220 oasc.SolrCore.initWriters created json: solr.JSONResponseWriter
[junit4:junit4]   2> 1057 T2258 oasc.RequestHandlers.initHandlersFromConfig created /update: solr.UpdateRequestHandler
[junit4:junit4]   2> 1059 T2220 oasc.RequestHandlers.initHandlersFromConfig created /admin/: solr.admin.AdminHandlers
[junit4:junit4]   2> 1059 T2220 oasc.RequestHandlers.initHandlersFromConfig created /select: solr.SearchHandler
[junit4:junit4]   2> 1060 T2257 oasc.SolrCore.initWriters created json: solr.JSONResponseWriter
[junit4:junit4]   2> 1060 T2220 oasc.RequestHandlers.initHandlersFromConfig created /update: solr.UpdateRequestHandler
[junit4:junit4]   2> 1062 T2257 oasc.RequestHandlers.initHandlersFromConfig created /admin/: solr.admin.AdminHandlers
[junit4:junit4]   2> 1063 T2257 oasc.RequestHandlers.initHandlersFromConfig created /select: solr.SearchHandler
[junit4:junit4]   2> 1063 T2218 oasc.SolrCore.initWriters created json: solr.JSONResponseWriter
[junit4:junit4]   2> 1064 T2257 oasc.RequestHandlers.initHandlersFromConfig created /update: solr.UpdateRequestHandler
[junit4:junit4]   2> 1066 T2218 oasc.RequestHandlers.initHandlersFromConfig created /admin/: solr.admin.AdminHandlers
[junit4:junit4]   2> 1066 T2218 oasc.RequestHandlers.initHandlersFromConfig created /select: solr.SearchHandler
[junit4:junit4]   2> 1067 T2218 oasc.RequestHandlers.initHandlersFromConfig created /update: solr.UpdateRequestHandler
[junit4:junit4]   2> 1067 T2256 oasc.SolrCore.initWriters created json: solr.JSONResponseWriter
[junit4:junit4]   2> 1069 T2256 oasc.RequestHandlers.initHandlersFromConfig created /admin/: solr.admin.AdminHandlers
[junit4:junit4]   2> 1070 T2256 oasc.RequestHandlers.initHandlersFromConfig created /select: solr.SearchHandler
[junit4:junit4]   2> 1071 T2256 oasc.RequestHandlers.initHandlersFromConfig created /update: solr.UpdateRequestHandler
[junit4:junit4]   2> 1097 T2219 oasc.SolrDeletionPolicy.onCommit SolrDeletionPolicy.onCommit: commits:num=1
[junit4:junit4]   2> 		commit{dir=MockDirWrapper(org.apache.lucene.store.MMapDirectory@/usr/home/hudson/hudson-slave/workspace/Lucene-Solr-NightlyTests-trunk/solr/build/solr-core/test/J1/OpenCloseCoreStressTest_/00002_core/data/index lockFactory=org.apache.lucene.store.NativeFSLockFactory@2e80c7ec),segFN=segments_1,generation=1,filenames=[segments_1]
[junit4:junit4]   2> 1098 T2219 oasc.SolrDeletionPolicy.updateCommits newest commit = 1[segments_1]
[junit4:junit4]   2> 1104 T2219 oasc.SolrCore.initWriters created json: solr.JSONResponseWriter
[junit4:junit4]   2> 1106 T2219 oasc.RequestHandlers.initHandlersFromConfig created /admin/: solr.admin.AdminHandlers
[junit4:junit4]   2> 1107 T2219 oasc.RequestHandlers.initHandlersFromConfig created /select: solr.SearchHandler
[junit4:junit4]   2> 1108 T2219 oasc.RequestHandlers.initHandlersFromConfig created /update: solr.UpdateRequestHandler
[junit4:junit4]   2> 1136 T2267 oasc.SolrConfig.<init> Loaded SolrConfig: solrconfig-minimal.xml
[junit4:junit4]   2> 1141 T2267 oass.IndexSchema.readSchema Reading Solr Schema
[junit4:junit4]   2> 1156 T2264 oasc.SolrConfig.<init> Loaded SolrConfig: solrconfig-minimal.xml
[junit4:junit4]   2> 1156 T2276 oasc.SolrConfig.<init> Loaded SolrConfig: solrconfig-minimal.xml
[junit4:junit4]   2> 1159 T2269 oasc.SolrConfig.<init> Loaded SolrConfig: solrconfig-minimal.xml
[junit4:junit4]   2> 1162 T2264 oass.IndexSchema.readSchema Reading Solr Schema
[junit4:junit4]   2> 1162 T2217 oashl.XMLLoader.init xsltCacheLifetimeSeconds=60
[junit4:junit4]   2> 1162 T2276 oass.IndexSchema.readSchema Reading Solr Schema
[junit4:junit4]   2> 1164 T2269 oass.IndexSchema.readSchema Reading Solr Schema
[junit4:junit4]   2> 1165 T2218 oashl.XMLLoader.init xsltCacheLifetimeSeconds=60
[junit4:junit4]   2> 1167 T2257 oashl.XMLLoader.init xsltCacheLifetimeSeconds=60
[junit4:junit4]   2> 1168 T2216 oashl.XMLLoader.init xsltCacheLifetimeSeconds=60
[junit4:junit4]   2> 1169 T2258 oashl.XMLLoader.init xsltCacheLifetimeSeconds=60
[junit4:junit4]   2> 1169 T2222 oashl.XMLLoader.init xsltCacheLifetimeSeconds=60
[junit4:junit4]   2> 1170 T2256 oashl.XMLLoader.init xsltCacheLifetimeSeconds=60
[junit4:junit4]   2> 1171 T2252 oashl.XMLLoader.init xsltCacheLifetimeSeconds=60
[junit4:junit4]   2> 1172 T2220 oashl.XMLLoader.init xsltCacheLifetimeSeconds=60
[junit4:junit4]   2> 1173 T2219 oashl.XMLLoader.init xsltCacheLifetimeSeconds=60
[junit4:junit4]   2> 1173 T2266 oass.IndexSchema.readSchema Schema name=tiny
[junit4:junit4]   2> 1178 T2263 oass.IndexSchema.readSchema Schema name=tiny
[junit4:junit4]   2> 1198 T2217 oass.SolrIndexSearcher.<init> Opening Searcher@25eb9d54 main
[junit4:junit4]   2> 1199 T2217 oasc.SolrCore.registerSearcher [00007_core] Registered new searcher Searcher@25eb9d54 main{StandardDirectoryReader(segments_1:1)}
[junit4:junit4]   2> 1199 T2217 oasu.CommitTracker.<init> Hard AutoCommit: disabled
[junit4:junit4]   2> 1200 T2217 oasu.CommitTracker.<init> Soft AutoCommit: disabled
[junit4:junit4]   2> 1201 T2218 oass.SolrIndexSearcher.<init> Opening Searcher@2c5203e6 main
[junit4:junit4]   2> 1202 T2218 oasc.SolrCore.registerSearcher [00004_core] Registered new searcher Searcher@2c5203e6 main{StandardDirectoryReader(segments_1:1)}
[junit4:junit4]   2> 1203 T2218 oasu.CommitTracker.<init> Hard AutoCommit: disabled
[junit4:junit4]   2> 1204 T2257 oass.SolrIndexSearcher.<init> Opening Searcher@407d3823 main
[junit4:junit4]   2> 1204 T2218 oasu.CommitTracker.<init> Soft AutoCommit: disabled
[junit4:junit4]   2> 1205 T2257 oasc.SolrCore.registerSearcher [00014_core] Registered new searcher Searcher@407d3823 main{StandardDirectoryReader(segments_1:1)}
[junit4:junit4]   2> 1205 T2257 oasu.CommitTracker.<init> Hard AutoCommit: disabled
[junit4:junit4]   2> 1206 T2257 oasu.CommitTracker.<init> Soft AutoCommit: disabled
[junit4:junit4]   2> 1207 T2258 oass.SolrIndexSearcher.<init> Opening Searcher@56bffd25 main
[junit4:junit4]   2> 1207 T2216 oass.SolrIndexSearcher.<init> Opening Searcher@77bf154a main
[junit4:junit4]   2> 1208 T2219 oass.SolrIndexSearcher.<init> Opening Searcher@6236bbb6 main
[junit4:junit4]   2> 1208 T2217 oasc.CoreMaps.putTransientCore Opening transient core 00007_core
[junit4:junit4]   2> 1208 T2222 oass.SolrIndexSearcher.<init> Opening Searcher@5542e8ec main
[junit4:junit4]   2> 1207 T2256 oass.SolrIndexSearcher.<init> Opening Searcher@66c5da46 main
[junit4:junit4]   2> 1208 T2258 oasc.SolrCore.registerSearcher [00008_core] Registered new searcher Searcher@56bffd25 main{StandardDirectoryReader(segments_1:1)}
[junit4:junit4]   2> 1209 T2216 oasc.SolrCore.registerSearcher [00012_core] Registered new searcher Searcher@77bf154a main{StandardDirectoryReader(segments_1:1)}
[junit4:junit4]   2> 1208 T2220 oass.SolrIndexSearcher.<init> Opening Searcher@3a60ddaf main
[junit4:junit4]   2> 1209 T2258 oasu.CommitTracker.<init> Hard AutoCommit: disabled
[junit4:junit4]   2> 1209 T2222 oasc.SolrCore.registerSearcher [00011_core] Registered new searcher Searcher@5542e8ec main{StandardDirectoryReader(segments_1:1)}
[junit4:junit4]   2> 1210 T2258 oasu.CommitTracker.<init> Soft AutoCommit: disabled
[junit4:junit4]   2> 1210 T2220 oasc.SolrCore.registerSearcher [00019_core] Registered new searcher Searcher@3a60ddaf main{StandardDirectoryReader(segments_1:1)}
[junit4:junit4]   2> 1209 T2216 oasu.CommitTracker.<init> Hard AutoCommit: disabled
[junit4:junit4]   2> 1210 T2276 oass.IndexSchema.readSchema Schema name=tiny
[junit4:junit4]   2> 1211 T2218 oasc.CoreMaps.putTransientCore Opening transient core 00004_core
[junit4:junit4]   2> 1211 T2216 oasu.CommitTracker.<init> Soft AutoCommit: disabled
[junit4:junit4]   2> 1209 T2256 oasc.SolrCore.registerSearcher [00017_core] Registered new searcher Searcher@66c5da46 main{StandardDirectoryReader(segments_1:1)}
[junit4:junit4]   2> 1209 T2219 oasc.SolrCore.registerSearcher [00002_core] Registered new searcher Searcher@6236bbb6 main{StandardDirectoryReader(segments_1:1)}
[junit4:junit4]   2> 1211 T2256 oasu.CommitTracker.<init> Hard AutoCommit: disabled
[junit4:junit4]   2> 1209 T2252 oass.SolrIndexSearcher.<init> Opening Searcher@6ba5341f main
[junit4:junit4]   2> 1212 T2257 oasc.CoreMaps.putTransientCore Opening transient core 00014_core
[junit4:junit4]   2> 1212 T2219 oasu.CommitTracker.<init> Hard AutoCommit: disabled
[junit4:junit4]   2> 1212 T2256 oasu.CommitTracker.<init> Soft AutoCommit: disabled
[junit4:junit4]   2> 1211 T2267 oass.IndexSchema.readSchema Schema name=tiny
[junit4:junit4]   2> 1210 T2220 oasu.CommitTracker.<init> Hard AutoCommit: disabled
[junit4:junit4]   2> 1210 T2269 oass.IndexSchema.readSchema Schema name=tiny
[junit4:junit4]   2> 1213 T2252 oasc.SolrCore.registerSearcher [00001_core] Registered new searcher Searcher@6ba5341f main{StandardDirectoryReader(segments_1:1)}
[junit4:junit4]   2> 1210 T2264 oass.IndexSchema.readSchema Schema name=tiny
[junit4:junit4]   2> 1210 T2222 oasu.CommitTracker.<init> Hard AutoCommit: disabled
[junit4:junit4]   2> 1210 T2217 oasc.CoreContainer.registerCore registering core: 00007_core
[junit4:junit4]   2> 1213 T2252 oasu.CommitTracker.<init> Hard AutoCommit: disabled
[junit4:junit4]   2> 1213 T2220 oasu.CommitTracker.<init> Soft AutoCommit: disabled
[junit4:junit4]   2> 1214 T2252 oasu.CommitTracker.<init> Soft AutoCommit: disabled
[junit4:junit4]   2> 1212 T2219 oasu.CommitTracker.<init> Soft AutoCommit: disabled
[junit4:junit4]   2> 1212 T2218 oasc.CoreContainer.registerCore registering core: 00004_core
[junit4:junit4]   2> 1214 T2222 oasu.CommitTracker.<init> Soft AutoCommit: disabled
[junit4:junit4]   2> 1215 T2257 oasc.CoreContainer.registerCore registering core: 00014_core
[junit4:junit4]   2> 1217 T2216 oasc.CoreMaps.putTransientCore Opening transient core 00012_core
[junit4:junit4]   2> 1220 T2216 oasc.CoreContainer.registerCore registering core: 00012_core
[junit4:junit4]   2> 1221 T2258 oasc.CoreMaps.putTransientCore Opening transient core 00008_core
[junit4:junit4]   2> 1221 T2258 oasc.CoreContainer.registerCore registering core: 00008_core
[junit4:junit4]   2> 1222 T2256 oasc.CoreMaps.putTransientCore Opening transient core 00017_core
[junit4:junit4]   2> 1222 T2256 oasc.CoreContainer.registerCore registering core: 00017_core
[junit4:junit4]   2> 1229 T2222 oasc.CoreMaps.putTransientCore Opening transient core 00011_core
[junit4:junit4]   2> 1229 T2219 oasc.CoreMaps.putTransientCore Opening transient core 00002_core
[junit4:junit4]   2> 1229 T2252 oasc.CoreMaps.putTransientCore Opening transient core 00001_core
[junit4:junit4]   2> 1230 T2219 oasc.CoreContainer.registerCore registering core: 00002_core
[junit4:junit4]   2> 1230 T2252 oasc.CoreContainer.registerCore registering core: 00001_core
[junit4:junit4]   2> 1229 T2222 oasc.CoreContainer.registerCore registering core: 00011_core
[junit4:junit4]   2> 1230 T2220 oasc.CoreMaps.putTransientCore Opening transient core 00019_core
[junit4:junit4]   2> 1231 T2220 oasc.CoreContainer.registerCore registering core: 00019_core
[junit4:junit4]   2> ASYNC  NEW_CORE C165 name=00014_core org.apache.solr.core.SolrCore@41e87fb0
[junit4:junit4]   2> 1232 T2262 C165 REQ [00014_core] webapp=/solr path=/select params={q=*:*&wt=javabin&qt=/select&version=2} hits=0 status=0 QTime=0 
[junit4:junit4]   2> ASYNC  NEW_CORE C166 name=00004_core org.apache.solr.core.SolrCore@3aa60c12
[junit4:junit4]   2> 1243 T2268 C166 REQ [00004_core] webapp=/solr path=/select params={q=*:*&wt=javabin&qt=/select&version=2} hits=0 status=0 QTime=0 
[junit4:junit4]   2> ASYNC  NEW_CORE C167 name=00007_core org.apache.solr.core.SolrCore@43d005c0
[junit4:junit4]   2> 1244 T2217 C167 oasc.SolrDeletionPolicy.onInit SolrDeletionPolicy.onInit: commits:num=1
[junit4:junit4]   2> 		commit{dir=MockDirWrapper(org.apache.lucene.store.MMapDirectory@/usr/home/hudson/hudson-slave/workspace/Lucene-Solr-NightlyTests-trunk/solr/build/solr-core/test/J1/OpenCloseCoreStressTest_/00007_core/data/index lockFactory=org.apache.lucene.store.NativeFSLockFactory@44bae16a),segFN=segments_1,generation=1,filenames=[segments_1]
[junit4:junit4]   2> 1245 T2217 C167 oasc.SolrDeletionPolicy.updateCommits newest commit = 1[segments_1]
[junit4:junit4]   2> ASYNC  NEW_CORE C168 name=00012_core org.apache.solr.core.SolrCore@5dd4aa77
[junit4:junit4]   2> 1246 T2216 C168 oasc.SolrDeletionPolicy.onInit SolrDeletionPolicy.onInit: commits:num=1
[junit4:junit4]   2> 		commit{dir=MockDirWrapper(org.apache.lucene.store.MMapDirectory@/usr/home/hudson/hudson-slave/workspace/Lucene-Solr-NightlyTests-trunk/solr/build/solr-core/test/J1/OpenCloseCoreStressTest_/00012_core/data/index lockFactory=org.apache.lucene.store.NativeFSLockFactory@5abe700d),segFN=segments_1,generation=1,filenames=[segments_1]
[junit4:junit4]   2> 1246 T2216 C168 oasc.SolrDeletionPolicy.updateCommits newest commit = 1[segments_1]
[junit4:junit4]   2> ASYNC  NEW_CORE C169 name=00017_core org.apache.solr.core.SolrCore@7096bdc9
[junit4:junit4]   2> 1247 T2275 C169 REQ [00017_core] webapp=/solr path=/select params={q=*:*&wt=javabin&qt=/select&version=2} hits=0 status=0 QTime=0 
[junit4:junit4]   2> 1248 T2257 C165 oasc.SolrDeletionPolicy.onInit SolrDeletionPolicy.onInit: commits:num=1
[junit4:junit4]   2> 		commit{dir=MockDirWrapper(org.apache.lucene.store.MMapDirectory@/usr/home/hudson/hudson-slave/workspace/Lucene-Solr-NightlyTests-trunk/solr/build/solr-core/test/J1/OpenCloseCoreStressTest_/00014_core/data/index lockFactory=org.apache.lucene.store.NativeFSLockFactory@1a8c4d5f),segFN=segments_1,generation=1,filenames=[segments_1]
[junit4:junit4]   2> 1248 T2257 C165 oasc.SolrDeletionPolicy.updateCommits newest commit = 1[segments_1]
[junit4:junit4]   2> 1248 T2249 C166 oasc.SolrDeletionPolicy.onInit SolrDeletionPolicy.onInit: commits:num=1
[junit4:junit4]   2> 		commit{dir=MockDirWrapper(org.apache.lucene.store.MMapDirectory@/usr/home/hudson/hudson-slave/workspace/Lucene-Solr-NightlyTests-trunk/solr/build/solr-core/test/J1/OpenCloseCoreStressTest_/00004_core/data/index lockFactory=org.apache.lucene.store.NativeFSLockFactory@3aab7661),segFN=segments_1,generation=1,filenames=[segments_1]
[junit4:junit4]   2> 1258 T2249 C166 oasc.SolrDeletionPolicy.updateCommits newest commit = 1[segments_1]
[junit4:junit4]   2> 1259 T2274 C165 REQ [00014_core] webapp=/solr path=/select params={q=*:*&wt=javabin&qt=/select&version=2} hits=0 status=0 QTime=0 
[junit4:junit4]   2> 1263 T2265 C166 REQ [00004_core] webapp=/solr path=/select params={q=*:*&wt=javabin&qt=/select&version=2} hits=0 status=0 QTime=1 
[junit4:junit4]   2> 1263 T2221 C167 UPDATE [00007_core] webapp=/solr path=/update params={wt=javabin&version=2} {add=[id8]} 0 31
[junit4:junit4]   2> 1262 T2217 C167 UPDATE [00007_core] webapp=/solr path=/update params={wt=javabin&version=2} {add=[id1]} 0 31
[junit4:junit4]   2> 1264 T2216 C168 UPDATE [00012_core] webapp=/solr path=/update params={wt=javabin&version=2} {add=[id3]} 0 24
[junit4:junit4]   2> 1267 T2257 C165 UPDATE [00014_core] webapp=/solr path=/update params={wt=javabin&version=2} {add=[id11]} 0 38
[junit4:junit4]   2> 1269 T2270 C169 REQ [00017_core] webapp=/solr path=/select params={q=*:*&wt=javabin&qt=/select&version=2} hits=0 status=0 QTime=0 
[junit4:junit4]   2> ASYNC  NEW_CORE C170 name=00002_core org.apache.solr.core.SolrCore@2992a8b
[junit4:junit4]   2> 1273 T2219 C170 oasc.SolrDeletionPolicy.onInit SolrDeletionPolicy.onInit: commits:num=1
[junit4:junit4]   2> 		commit{dir=MockDirWrapper(org.apache.lucene.store.MMapDirectory@/usr/home/hudson/hudson-slave/workspace/Lucene-Solr-NightlyTests-trunk/solr/build/solr-core/test/J1/OpenCloseCoreStressTest_/00002_core/data/index lockFactory=org.apache.lucene.store.NativeFSLockFactory@2e80c7ec),segFN=segments_1,generation=1,filenames=[segments_1]
[junit4:junit4]   2> 1273 T2219 C170 oasc.SolrDeletionPolicy.updateCommits newest commit = 1[segments_1]
[junit4:junit4]   2> ASYNC  NEW_CORE C171 name=00011_core org.apache.solr.core.SolrCore@cb1d853
[junit4:junit4]   2> 1274 T2222 C171 oasc.SolrDeletionPolicy.onInit SolrDeletionPolicy.onInit: commits:num=1
[junit4:junit4]   2> 		commit{dir=MockDirWrapper(org.apache.lucene.store.MMapDirectory@/usr/home/hudson/hudson-slave/workspace/Lucene-Solr-NightlyTests-trunk/solr/build/solr-core/test/J1/OpenCloseCoreStressTest_/00011_core/data/index lockFactory=org.apache.lucene.store.NativeFSLockFactory@4da39c20),segFN=segments_1,generation=1,filenames=[segments_1]
[junit4:junit4]   2> 1275 T2222 C171 oasc.SolrDeletionPolicy.updateCommits newest commit = 1[segments_1]
[junit4:junit4]   2> 1275 T2249 C166 UPDATE [00004_core] webapp=/solr path=/update params={wt=javabin&version=2} {add=[id10]} 0 39
[junit4:junit4]   2> 1276 T2218 C166 UPDATE [00004_core] webapp=/solr path=/update params={wt=javabin&version=2} {add=[id4]} 0 31
[junit4:junit4]   2> 1275 T2260 C166 UPDATE [00004_core] webapp=/solr path=/update params={wt=javabin&version=2} {add=[id15]} 0 17
[junit4:junit4]   2> ASYNC  NEW_CORE C172 name=00008_core org.apache.solr.core.SolrCore@e29a308
[junit4:junit4]   2> 1276 T2258 C172 oasc.SolrDeletionPolicy.onInit SolrDeletionPolicy.onInit: commits:num=1
[junit4:junit4]   2> 		commit{dir=MockDirWrapper(org.apache.lucene.store.MMapDirectory@/usr/home/hudson/hudson-slave/workspace/Lucene-Solr-NightlyTests-trunk/solr/build/solr-core/test/J1/OpenCloseCoreStressTest_/00008_core/data/index lockFactory=org.apache.lucene.store.NativeFSLockFactory@210a0bcb),segFN=segments_1,generation=1,filenames=[segments_1]
[junit4:junit4]   2> 1277 T2258 C172 oasc.SolrDeletionPolicy.updateCommits newest commit = 1[segments_1]
[junit4:junit4]   2> 1277 T2256 C169 oasc.SolrDeletionPolicy.onInit SolrDeletionPolicy.onInit: commits:num=1
[junit4:junit4]   2> 		commit{dir=MockDirWrapper(org.apache.lucene.store.MMapDirectory@/usr/home/hudson/hudson-slave/workspace/Lucene-Solr-NightlyTests-trunk/solr/build/solr-core/test/J1/OpenCloseCoreStressTest_/00017_core/data/index lockFactory=org.apache.lucene.store.NativeFSLockFactory@2e6510ba),segFN=segments_1,generation=1,filenames=[segments_1]
[junit4:junit4]   2> 1278 T2219 C170 UPDATE [00002_core] webapp=/solr path=/update params={wt=javabin&version=2} {add=[id2]} 0 14
[junit4:junit4]   2> ASYNC  NEW_CORE C173 name=00019_core org.apache.solr.core.SolrCore@31a3fd33
[junit4:junit4]   2> 1278 T2220 C173 oasc.SolrDeletionPolicy.onInit SolrDeletionPolicy.onInit: commits:num=1
[junit4:junit4]   2> 		commit{dir=MockDirWrapper(org.apache.lucene.store.MMapDirectory@/usr/home/hudson/hudson-slave/workspace/Lucene-Solr-NightlyTests-trunk/solr/build/solr-core/test/J1/OpenCloseCoreStressTest_/00019_core/data/index lockFactory=org.apache.lucene.store.NativeFSLockFactory@34fd4590),segFN=segments_1,generation=1,filenames=[segments_1]
[junit4:junit4]   2> 1278 T2256 C169 oasc.SolrDeletionPolicy.updateCommits newest commit = 1[segments_1]
[junit4:junit4]   2> 1278 T2220 C173 oasc.SolrDeletionPolicy.updateCommits newest commit = 1[segments_1]
[junit4:junit4]   2> 1280 T2222 C171 UPDATE [00011_core] webapp=/solr path=/update params={wt=javabin&version=2} {add=[id9]} 0 17
[junit4:junit4]   2> ASYNC  NEW_CORE C174 name=00001_core org.apache.solr.core.SolrCore@4f8e697b
[junit4:junit4]   2> 1281 T2252 C174 oasc.SolrDeletionPolicy.onInit SolrDeletionPolicy.onInit: commits:num=1
[junit4:junit4]   2> 		commit{dir=MockDirWrapper(org.apache.lucene.store.MMapDirectory@/usr/home/hudson/hudson-slave/workspace/Lucene-Solr-NightlyTests-trunk/solr/build/solr-core/test/J1/OpenCloseCoreStressTest_/00001_core/data/index lockFactory=org.apache.lucene.store.NativeFSLockFactory@4ee8f85e),segFN=segments_1,generation=1,filenames=[segments_1]
[junit4:junit4]   2> 1281 T2252 C174 oasc.SolrDeletionPolicy.updateCommits newest commit = 1[segments_1]
[junit4:junit4]   2> 1281 T2249 oasc.CoreContainer.create Creating SolrCore '00013_core' using instanceDir: /usr/home/hudson/hudson-slave/workspace/Lucene-Solr-NightlyTests-trunk/solr/build/solr-core/test/J1/./OpenCloseCoreStressTest_/00013_core
[junit4:junit4]   2> 1283 T2249 oasc.SolrResourceLoader.<init> new SolrResourceLoader for directory: '/usr/home/hudson/hudson-slave/workspace/Lucene-Solr-NightlyTests-trunk/solr/build/solr-core/test/J1/./OpenCloseCoreStressTest_/00013_core/'
[junit4:junit4]   2> 1285 T2258 C172 UPDATE [00008_core] webapp=/solr path=/update params={wt=javabin&version=2} {add=[id12]} 0 19
[junit4:junit4]   2> 1290 T2266 oass.IndexSchema.readSchema unique key field: id
[junit4:junit4]   2> 1291 T2263 oass.IndexSchema.readSchema unique key field: id
[junit4:junit4]   2> 1291 T2258 C166 UPDATE [00004_core] webapp=/solr path=/update params={wt=javabin&version=2} {add=[id25]} 0 1
[junit4:junit4]   2> 1292 T2267 oass.IndexSchema.readSchema unique key field: id
[junit4:junit4]   2> 1293 T2266 oasc.SolrCore.initDirectoryFactory org.apache.solr.core.MockFSDirectoryFactory
[junit4:junit4]   2> 1294 T2263 oasc.SolrCore.initDirectoryFactory org.apache.solr.core.MockFSDirectoryFactory
[junit4:junit4]   2> 1294 T2258 C172 UPDATE [00008_core] webapp=/solr path=/update params={wt=javabin&version=2} {add=[id26]} 0 0
[junit4:junit4]   2> 1301 T2266 oasc.SolrCore.<init> [00006_core] Opening new SolrCore at /usr/home/hudson/hudson-slave/workspace/Lucene-Solr-NightlyTests-trunk/solr/build/solr-core/test/J1/./OpenCloseCoreStressTest_/00006_core/, dataDir=/usr/home/hudson/hudson-slave/workspace/Lucene-Solr-NightlyTests-trunk/solr/build/solr-core/test/J1/OpenCloseCoreStressTest_/00006_core/data/
[junit4:junit4]   2> 1301 T2263 oasc.SolrCore.<init> [00000_core] Opening new SolrCore at /usr/home/hudson/hudson-slave/workspace/Lucene-Solr-NightlyTests-trunk/solr/build/solr-core/test/J1/./OpenCloseCoreStressTest_/00000_core/, dataDir=/usr/home/hudson/hudson-slave/workspace/Lucene-Solr-NightlyTests-trunk/solr/build/solr-core/test/J1/OpenCloseCoreStressTest_/00000_core/data/
[junit4:junit4]   2> 1301 T2266 oasc.JmxMonitoredMap.<init> JMX monitoring is enabled. Adding Solr mbeans to JMX Server: com.sun.jmx.mbeanserver.JmxMBeanServer@433d44fc
[junit4:junit4]   2> 1301 T2276 oass.IndexSchema.readSchema unique key field: id
[junit4:junit4]   2> 1301 T2267 oasc.SolrCore.initDirectoryFactory org.apache.solr.core.MockFSDirectoryFactory
[junit4:junit4]   2> 1301 T2263 oasc.JmxMonitoredMap.<init> JMX monitoring is enabled. Adding Solr mbeans to JMX Server: com.sun.jmx.mbeanserver.JmxMBeanServer@433d44fc
[junit4:junit4]   2> 1302 T2266 oasc.SolrCore.initDirectoryFactory org.apache.solr.core.MockFSDirectoryFactory
[junit4:junit4]   2> 1303 T2267 oasc.SolrCore.<init> [00018_core] Opening new SolrCore at /usr/home/hudson/hudson-slave/workspace/Lucene-Solr-NightlyTests-trunk/solr/build/solr-core/test/J1/./OpenCloseCoreStressTest_/00018_core/, dataDir=/usr/home/hudson/hudson-slave/workspace/Lucene-Solr-NightlyTests-trunk/solr/build/solr-core/test/J1/OpenCloseCoreStressTest_/00018_core/data/
[junit4:junit4]   2> 1303 T2221 C173 UPDATE [00019_core] webapp=/solr path=/update params={wt=javabin&version=2} {add=[id16]} 0 35
[junit4:junit4]   2> 1304 T2267 oasc.JmxMonitoredMap.<init> JMX monitoring is enabled. Adding Solr mbeans to JMX Server: com.sun.jmx.mbeanserver.JmxMBeanServer@433d44fc
[junit4:junit4]   2> 1304 T2220 C173 UPDATE [00019_core] webapp=/solr path=/update params={wt=javabin&version=2} {add=[id5]} 0 39
[junit4:junit4]   2> 1303 T2222 C174 UPDATE [00001_core] webapp=/solr path=/update params={wt=javabin&version=2} {add=[id24]} 0 19
[junit4:junit4]   2> 1303 T2217 C174 UPDATE [00001_core] webapp=/solr path=/update params={wt=javabin&version=2} {add=[id17]} 0 18
[junit4:junit4]   2> 1303 T2263 oasc.SolrCore.initDirectoryFactory org.apache.solr.core.MockFSDirectoryFactory
[junit4:junit4]   2> 1305 T2276 oasc.SolrCore.initDirectoryFactory org.apache.solr.core.MockFSDirectoryFactory
[junit4:junit4]   2> 1305 T2266 oasc.CachingDirectoryFactory.get return new directory for /usr/home/hudson/hudson-slave/workspace/Lucene-Solr-NightlyTests-trunk/solr/build/solr-core/test/J1/OpenCloseCoreStressTest_/00006_core/data forceNew: false
[junit4:junit4]   2> 1304 T2267 oasc.SolrCore.initDirectoryFactory org.apache.solr.core.MockFSDirectoryFactory
[junit4:junit4]   2> 1304 T2259 C169 UPDATE [00017_core] webapp=/solr path=/update params={wt=javabin&version=2} {add=[id13]} 0 37
[junit4:junit4]   2> 1306 T2276 oasc.SolrCore.<init> [00005_core] Opening new SolrCore at /usr/home/hudson/hudson-slave/workspace/Lucene-Solr-NightlyTests-trunk/solr/build/solr-core/test/J1/./OpenCloseCoreStressTest_/00005_core/, dataDir=/usr/home/hudson/hudson-slave/workspace/Lucene-Solr-NightlyTests-trunk/solr/build/solr-core/test/J1/OpenCloseCoreStressTest_/00005_core/data/
[junit4:junit4]   2> 1304 T2261 C173 UPDATE [00019_core] webapp=/solr path=/update params={wt=javabin&version=2} {add=[id14]} 0 34
[junit4:junit4]   2> 1306 T2276 oasc.JmxMonitoredMap.<init> JMX monitoring is enabled. Adding Solr mbeans to JMX Server: com.sun.jmx.mbeanserver.JmxMBeanServer@433d44fc
[junit4:junit4]   2> 1304 T2252 C174 UPDATE [00001_core] webapp=/solr path=/update params={wt=javabin&version=2} {add=[id7]} 0 34
[junit4:junit4]   2> 1307 T2276 oasc.SolrCore.initDirectoryFactory org.apache.solr.core.MockFSDirectoryFactory
[junit4:junit4]   2> 1307 T2267 oasc.CachingDirectoryFactory.get return new directory for /usr/home/hudson/hudson-slave/workspace/Lucene-Solr-NightlyTests-trunk/solr/build/solr-core/test/J1/OpenCloseCoreStressTest_/00018_core/data forceNew: false
[junit4:junit4]   2> 1308 T2269 oass.IndexSchema.readSchema unique key field: id
[junit4:junit4]   2> 1308 T2222 C174 UPDATE [00001_core] webapp=/solr path=/update params={wt=javabin&version=2} {add=[id30]} 0 1
[junit4:junit4]   2> 1308 T2264 oass.IndexSchema.readSchema unique key field: id
[junit4:junit4]   2> 1304 T2216 C169 UPDATE [00017_core] webapp=/solr path=/update params={wt=javabin&version=2} {add=[id18]} 0 33
[junit4:junit4]   2> 1308 T2267 oasc.SolrCore.getNewIndexDir New index directory detected: old=null new=/usr/home/hudson/hudson-slave/workspace/Lucene-Solr-NightlyTests-trunk/solr/build/solr-core/test/J1/OpenCloseCoreStressTest_/00018_core/data/index/
[junit4:junit4]   2> 1304 T2256 C169 UPDATE [00017_core] webapp=/solr path=/update params={wt=javabin&version=2} {add=[id6]} 0 38
[junit4:junit4]   2> 1307 T2266 oasc.SolrCore.getNewIndexDir New index directory detected: old=null new=/usr/home/hudson/hudson-slave/workspace/Lucene-Solr-NightlyTests-trunk/solr/build/solr-core/test/J1/OpenCloseCoreStressTest_/00006_core/data/index/
[junit4:junit4]   2> 1307 T2263 oasc.CachingDirectoryFactory.get return new directory for /usr/home/hudson/hudson-slave/workspace/Lucene-Solr-NightlyTests-trunk/solr/build/solr-core/test/J1/OpenCloseCoreStressTest_/00000_core/data forceNew: false
[junit4:junit4]   2> 1309 T2276 oasc.CachingDirectoryFactory.get return new directory for /usr/home/hudson/hudson-slave/workspace/Lucene-Solr-NightlyTests-trunk/solr/build/solr-core/test/J1/OpenCloseCoreStressTest_/00005_core/data forceNew: false
[junit4:junit4]   2> 1309 T2261 oasc.CoreContainer.create Creating SolrCore '00003_core' using instanceDir: /usr/home/hudson/hudson-slave/workspace/Lucene-Solr-NightlyTests-trunk/solr/build/solr-core/test/J1/./OpenCloseCoreStressTest_/00003_core
[junit4:junit4]   2> 1310 T2269 oasc.SolrCore.initDirectoryFactory org.apache.solr.core.MockFSDirectoryFactory
[junit4:junit4]   2> 1309 T2267 oasc.SolrCore.initIndex WARNING [00018_core] Solr index directory '/usr/home/hudson/hudson-slave/workspace/Lucene-Solr-NightlyTests-trunk/solr/build/solr-core/test/J1/OpenCloseCoreStressTest_/00018_core/data/index' doesn't exist. Creating new index...
[junit4:junit4]   2> 1310 T2266 oasc.SolrCore.initIndex WARNING [00006_core] Solr index directory '/usr/home/hudson/hudson-slave/workspace/Lucene-Solr-NightlyTests-trunk/solr/build/solr-core/test/J1/OpenCloseCoreStressTest_/00006_core/data/index' doesn't exist. Creating new index...
[junit4:junit4]   2> 1310 T2264 oasc.SolrCore.initDirectoryFactory org.apache.solr.core.MockFSDirectoryFactory
[junit4:junit4]   2> 1311 T2276 oasc.SolrCore.getNewIndexDir New index directory detected: old=null new=/usr/home/hudson/hudson-slave/workspace/Lucene-Solr-NightlyTests-trunk/solr/build/solr-core/test/J1/OpenCloseCoreStressTest_/00005_core/data/index/
[junit4:junit4]   2> 1311 T2261 oasc.SolrResourceLoader.<init> new SolrResourceLoader for directory: '/usr/home/hudson/hudson-slave/workspace/Lucene-Solr-NightlyTests-trunk/solr/build/solr-core/test/J1/./OpenCloseCoreStressTest_/00003_core/'
[junit4:junit4]   2> 1310 T2263 oasc.SolrCore.getNewIndexDir New index directory detected: old=null new=/usr/home/hudson/hudson-slave/workspace/Lucene-Solr-NightlyTests-trunk/solr/build/solr-core/test/J1/OpenCloseCoreStressTest_/00000_core/data/index/
[junit4:junit4]   2> 1311 T2267 oasc.CachingDirectoryFactory.get return new directory for /usr/home/hudson/hudson-slave/workspace/Lucene-Solr-NightlyTests-trunk/solr/build/solr-core/test/J1/OpenCloseCoreStressTest_/00018_core/data/index forceNew: false
[junit4:junit4]   2> 1311 T2269 oasc.SolrCore.<init> [00010_core] Opening new SolrCore at /usr/home/hudson/hudson-slave/workspace/Lucene-Solr-NightlyTests-trunk/solr/build/solr-core/test/J1/./OpenCloseCoreStressTest_/00010_core/, dataDir=/usr/home/hudson/hudson-slave/workspace/Lucene-Solr-NightlyTests-trunk/solr/build/solr-core/test/J1/OpenCloseCoreStressTest_/00010_core/data/
[junit4:junit4]   2> 1311 T2276 oasc.SolrCore.initIndex WARNING [00005_core] Solr index directory '/usr/home/hudson/hudson-slave/workspace/Lucene-Solr-NightlyTests-trunk/solr/build/solr-core/test/J1/OpenCloseCoreStressTest_/00005_core/data/index' doesn't exist. Creating new index...
[junit4:junit4]   2> 1312 T2256 C174 UPDATE [00001_core] webapp=/solr path=/update params={wt=javabin&version=2} {add=[id37]} 0 1
[junit4:junit4]   2> 1311 T2266 oasc.CachingDirectoryFactory.get return new directory for /usr/home/hudson/hudson-slave/workspace/Lucene-Solr-NightlyTests-trunk/solr/build/solr-core/test/J1/OpenCloseCoreStressTest_/00006_core/data/index forceNew: false
[junit4:junit4]   2> 1311 T2264 oasc.SolrCore.<init> [00009_core] Opening new SolrCore at /usr/home/hudson/hudson-slave/workspace/Lucene-Solr-NightlyTests-trunk/solr/build/solr-core/test/J1/./OpenCloseCoreStressTest_/00009_core/, dataDir=/usr/home/hudson/hudson-slave/workspace/Lucene-Solr-NightlyTests-trunk/solr/build/solr-core/test/J1/OpenCloseCoreStressTest_/00009_core/data/
[junit4:junit4]   2> 1312 T2269 oasc.JmxMonitoredMap.<init> JMX monitoring is enabled. Adding Solr mbeans to JMX Server: com.sun.jmx.mbeanserver.JmxMBeanServer@433d44fc
[junit4:junit4]   2> 1313 T2264 oasc.JmxMonitoredMap.<init> JMX monitoring is enabled. Adding Solr mbeans to JMX Server: com.sun.jmx.mbeanserver.JmxMBeanServer@433d44fc
[junit4:junit4]   2> 1312 T2276 oasc.CachingDirectoryFactory.get return new directory for /usr/home/hudson/hudson-slave/workspace/Lucene-Solr-NightlyTests-trunk/solr/build/solr-core/test/J1/OpenCloseCoreStressTest_/00005_core/data/index forceNew: false
[junit4:junit4]   2> 1313 T2263 oasc.SolrCore.initIndex WARNING [00000_core] Solr index directory '/usr/home/hudson/hudson-slave/workspace/Lucene-Solr-NightlyTests-trunk/solr/build/solr-core/test/J1/OpenCloseCoreStressTest_/00000_core/data/index' doesn't exist. Creating new index...
[junit4:junit4]   2> 1313 T2264 oasc.SolrCore.initDirectoryFactory org.apache.solr.core.MockFSDirectoryFactory
[junit4:junit4]   2> 1313 T2269 oasc.SolrCore.initDirectoryFactory org.apache.solr.core.MockFSDirectoryFactory
[junit4:junit4]   2> 1314 T2263 oasc.CachingDirectoryFactory.get return new directory for /usr/home/hudson/hudson-slave/workspace/Lucene-Solr-NightlyTests-trunk/solr/build/solr-core/test/J1/OpenCloseCoreStressTest_/00000_core/data/index forceNew: false
[junit4:junit4]   2> 1314 T2264 oasc.CachingDirectoryFactory.get return new directory for /usr/home/hudson/hudson-slave/workspace/Lucene-Solr-NightlyTests-trunk/solr/build/solr-core/test/J1/OpenCloseCoreStressTest_/00009_core/data forceNew: false
[junit4:junit4]   2> 1315 T2269 oasc.CachingDirectoryFactory.get return new directory for /usr/home/hudson/hudson-slave/workspace/Lucene-Solr-NightlyTests-trunk/solr/build/solr-core/test/J1/OpenCloseCoreStressTest_/00010_core/data forceNew: false
[junit4:junit4]   2> 1316 T2264 oasc.SolrCore.getNewIndexDir New index directory detected: old=null new=/usr/home/hudson/hudson-slave/workspace/Lucene-Solr-NightlyTests-trunk/solr/build/solr-core/test/J1/OpenCloseCoreStressTest_/00009_core/data/index/
[junit4:junit4]   2> 1316 T2256 C173 UPDATE [00019_core] webapp=/solr path=/update params={wt=javabin&version=2} {add=[id38]} 0 1
[junit4:junit4]   2> 1317 T2264 oasc.SolrCore.initIndex WARNING [00009_core] Solr index directory '/usr/home/hudson/hudson-slave/workspace/Lucene-Solr-NightlyTests-trunk/solr/build/solr-core/test/J1/OpenCloseCoreStressTest_/00009_core/data/index' doesn't exist. Creating new index...
[junit4:junit4]   2> 1318 T2269 oasc.SolrCore.getNewIndexDir New index directory detected: old=null new=/usr/home/hudson/hudson-slave/workspace/Lucene-Solr-NightlyTests-trunk/solr/build/solr-core/test/J1/OpenCloseCoreStressTest_/00010_core/data/index/
[junit4:junit4]   2> 1318 T2264 oasc.CachingDirectoryFactory.get return new directory for /usr/home/hudson/hudson-slave/workspace/Lucene-Solr-NightlyTests-trunk/solr/build/solr-core/test/J1/OpenCloseCoreStressTest_/00009_core/data/index forceNew: false
[junit4:junit4]   2> 1319 T2269 oasc.SolrCore.initIndex WARNING [00010_core] Solr index directory '/usr/home/hudson/hudson-slave/workspace/Lucene-Solr-NightlyTests-trunk/solr/build/solr-core/test/J1/OpenCloseCoreStressTest_/00010_core/data/index' doesn't exist. Creating new index...
[junit4:junit4]   2> 1320 T2256 C173 UPDATE [00019_core] webapp=/solr path=/update params={wt=javabin&version=2} {add=[id39]} 0 1
[junit4:junit4]   2> 1320 T2269 oasc.CachingDirectoryFactory.get return new directory for /usr/home/hudson/hudson-slave/workspace/Lucene-Solr-NightlyTests-trunk/solr/build/solr-core/test/J1/OpenCloseCoreStressTest_/00010_core/data/index forceNew: false
[junit4:junit4]   2> 1323 T2256 C166 UPDATE [00004_core] webapp=/solr path=/update params={wt=javabin&version=2} {add=[id40]} 0 1
[junit4:junit4]   2> 1327 T2256 C168 UPDATE [00012_core] webapp=/solr path=/update params={wt=javabin&version=2} {add=[id41]} 0 1
[junit4:junit4]   2> 1329 T2256 C166 UPDATE [00004_core] webapp=/solr path=/update params={wt=javabin&version=2} {add=[id42]} 0 0
[junit4:junit4]   2> 1333 T2256 C165 UPDATE [00014_core] webapp=/solr path=/update params={wt=javabin&version=2} {add=[id43]} 0 1
[junit4:junit4]   2> 1335 T2256 oasc.CoreContainer.create Creating SolrCore '00016_core' using instanceDir: /usr/home/hudson/hudson-slave/workspace/Lucene-Solr-NightlyTests-trunk/solr/build/solr-core/test/J1/./OpenCloseCoreStressTest_/00016_core
[junit4:junit4]   2> 1336 T2256 oasc.SolrResourceLoader.<init> new SolrResourceLoader for directory: '/usr/home/hudson/hudson-slave/workspace/Lucene-Solr-NightlyTests-trunk/solr/build/solr-core/test/J1/./OpenCloseCoreStressTest_/00016_core/'
[junit4:junit4]   2> 1338 T2267 oasc.SolrDeletionPolicy.onCommit SolrDeletionPolicy.onCommit: commits:num=1
[junit4:junit4]   2> 		commit{dir=MockDirWrapper(org.apache.lucene.store.MMapDirectory@/usr/home/hudson/hudson-slave/workspace/Lucene-Solr-NightlyTests-trunk/solr/build/solr-core/test/J1/OpenCloseCoreStressTest_/00018_core/data/index lockFactory=org.apache.lucene.store.NativeFSLockFactory@8b7c81c),segFN=segments_1,generation=1,filenames=[segments_1]
[junit4:junit4]   2> 1339 T2267 oasc.SolrDeletionPolicy.updateCommits newest commit = 1[segments_1]
[junit4:junit4]   2> 1340 T2267 oasc.SolrCore.initWriters created json: solr.JSONResponseWriter
[junit4:junit4]   2> 1342 T2267 oasc.RequestHandlers.initHandlersFromConfig created /admin/: solr.admin.AdminHandlers
[junit4:junit4]   2> 1342 T2267 oasc.RequestHandlers.initHandlersFromConfig created /select: solr.SearchHandler
[junit4:junit4]   2> 1343 T2267 oasc.RequestHandlers.initHandlersFromConfig created /update: solr.UpdateRequestHandler
[junit4:junit4]   2> 1346 T2276 oasc.SolrDeletionPolicy.onCommit SolrDeletionPolicy.onCommit: commits:num=1
[junit4:junit4]   2> 		commit{dir=MockDirWrapper(org.apache.lucene.store.MMapDirectory@/usr/home/hudson/hudson-slave/workspace/Lucene-Solr-NightlyTests-trunk/solr/build/solr-core/test/J1/OpenCloseCoreStressTest_/00005_core/data/index lockFactory=org.apache.lucene.store.NativeFSLockFactory@66568de4),segFN=segments_1,generation=1,filenames=[segments_1]
[junit4:junit4]   2> 1346 T2266 oasc.SolrDeletionPolicy.onCommit SolrDeletionPolicy.onCommit: commits:num=1
[junit4:junit4]   2> 		commit{dir=MockDirWrapper(org.apache.lucene.store.MMapDirectory@/usr/home/hudson/hudson-slave/workspace/Lucene-Solr-NightlyTests-trunk/solr/build/solr-core/test/J1/OpenCloseCoreStressTest_/00006_core/data/index lockFactory=org.apache.lucene.store.NativeFSLockFactory@b589bb5),segFN=segments_1,generation=1,filenames=[segments_1]
[junit4:junit4]   2> 1346 T2264 oasc.SolrDeletionPolicy.onCommit SolrDeletionPolicy.onCommit: commits:num=1
[junit4:junit4]   2> 		commit{dir=MockDirWrapper(org.apache.lucene.store.MMapDirectory@/usr/home/hudson/hudson-slave/workspace/Lucene-Solr-NightlyTests-trunk/solr/build/solr-core/test/J1/OpenCloseCoreStressTest_/00009_core/data/index lockFactory=org.apache.lucene.store.NativeFSLockFactory@43faa483),segFN=segments_1,generation=1,filenames=[segments_1]
[junit4:junit4]   2> 1346 T2269 oasc.SolrDeletionPolicy.onCommit SolrDeletionPolicy.onCommit: commits:num=1
[junit4:junit4]   2> 		commit{dir=MockDirWrapper(org.apache.lucene.store.MMapDirectory@/usr/home/hudson/hudson-slave/workspace/Lucene-Solr-NightlyTests-trunk/solr/build/solr-core/test/J1/OpenCloseCoreStressTest_/00010_core/data/index lockFactory=org.apache.lucene.store.NativeFSLockFactory@4a1daec),segFN=segments_1,generation=1,filenames=[segments_1]
[junit4:junit4]   2> 1347 T2264 oasc.SolrDeletionPolicy.updateCommits newest commit = 1[segments_1]
[junit4:junit4]   2> 1347 T2269 oasc.SolrDeletionPolicy.updateCommits newest commit = 1[segments_1]
[junit4:junit4]   2> 1346 T2263 oasc.SolrDeletionPolicy.onCommit SolrDeletionPolicy.onCommit: commits:num=1
[junit4:junit4]   2> 		commit{dir=MockDirWrapper(org.apache.lucene.store.MMapDirectory@/usr/home/hudson/hudson-slave/workspace/Lucene-Solr-NightlyTests-trunk/solr/build/solr-core/test/J1/OpenCloseCoreStressTest_/00000_core/data/index lockFactory=org.apache.lucene.store.NativeFSLockFactory@5daf5535),segFN=segments_1,generation=1,filenames=[segments_1]
[junit4:junit4]   2> 1346 T2266 oasc.SolrDeletionPolicy.updateCommits newest commit = 1[segments_1]
[junit4:junit4]   2> 1347 T2263 oasc.SolrDeletionPolicy.updateCommits newest commit = 1[segments_1]
[junit4:junit4]   2> 1346 T2276 oasc.SolrDeletionPolicy.updateCommits newest commit = 1[segments_1]
[junit4:junit4]   2> 1349 T2264 oasc.SolrCore.initWriters created json: solr.JSONResponseWriter
[junit4:junit4]   2> 1350 T2263 oasc.SolrCore.initWriters created json: solr.JSONResponseWriter
[junit4:junit4]   2> 1350 T2276 oasc.SolrCore.initWriters created json: solr.JSONResponseWriter
[junit4:junit4]   2> 1351 T2275 oasc.CoreContainer.create Creating SolrCore '00015_core' using instanceDir: /usr/home/hudson/hudson-slave/workspace/Lucene-Solr-NightlyTests-trunk/solr/build/solr-core/test/J1/./OpenCloseCoreStressTest_/00015_core
[junit4:junit4]   2> 1351 T2266 oasc.SolrCore.initWriters created json: solr.JSONResponseWriter
[junit4:junit4]   2> 1352 T2264 oasc.RequestHandlers.initHandlersFromConfig created /admin/: solr.admin.AdminHandlers
[junit4:junit4]   2> 1352 T2275 oasc.SolrResourceLoader.<init> new SolrResourceLoader for directory: '/usr/home/hudson/hudson-slave/workspace/Lucene-Solr-NightlyTests-trunk/solr/build/solr-core/test/J1/./OpenCloseCoreStressTest_/00015_core/'
[junit4:junit4]   2> 1352 T2269 oasc.SolrCore.initWriters created json: solr.JSONResponseWriter
[junit4:junit4]   2> 1352 T2276 oasc.RequestHandlers.initHandlersFromConfig created /admin/: solr.admin.AdminHandlers
[junit4:junit4]   2> 1353 T2263 oasc.RequestHandlers.initHandlersFromConfig created /admin/: solr.admin.AdminHandlers
[junit4:junit4]   2> 1353 T2264 oasc.RequestHandlers.initHandlersFromConfig created /select: solr.SearchHandler
[junit4:junit4]   2> 1353 T2276 oasc.RequestHandlers.initHandlersFromConfig created /select: solr.SearchHandler
[junit4:junit4]   2> 1354 T2263 oasc.RequestHandlers.initHandlersFromConfig created /select: solr.SearchHandler
[junit4:junit4]   2> 1354 T2276 oasc.RequestHandlers.initHandlersFromConfig created /update: solr.UpdateRequestHandler
[junit4:junit4]   2> 1354 T2266 oasc.RequestHandlers.initHandlersFromConfig created /admin/: solr.admin.AdminHandlers
[junit4:junit4]   2> 1354 T2264 oasc.RequestHandlers.initHandlersFromConfig created /update: solr.UpdateRequestHandler
[junit4:junit4]   2> 1354 T2263 oasc.RequestHandlers.initHandlersFromConfig created /update: solr.UpdateRequestHandler
[junit4:junit4]   2> 1355 T2266 oasc.RequestHandlers.initHandlersFromConfig created /select: solr.SearchHandler
[junit4:junit4]   2> 1355 T2269 oasc.RequestHandlers.initHandlersFromConfig created /admin/: solr.admin.AdminHandlers
[junit4:junit4]   2> 1356 T2266 oasc.RequestHandlers.initHandlersFromConfig created /update: solr.UpdateRequestHandler
[junit4:junit4]   2> 1356 T2269 oasc.RequestHandlers.initHandlersFromConfig created /select: solr.SearchHandler
[junit4:junit4]   2> 1356 T2269 oasc.RequestHandlers.initHandlersFromConfig created /update: solr.UpdateRequestHandler
[junit4:junit4]   2> 1373 T2270 C172 REQ [00008_core] webapp=/solr path=/select params={q=*:*&wt=javabin&qt=/select&version=2} hits=0 status=0 QTime=0 
[junit4:junit4]   2> 1406 T2276 oashl.XMLLoader.init xsltCacheLifetimeSeconds=60
[junit4:junit4]   2> 1407 T2263 oashl.XMLLoader.init xsltCacheLifetimeSeconds=60
[junit4:junit4]   2> 1408 T2267 oashl.XMLLoader.init xsltCacheLifetimeSeconds=60
[junit4:junit4]   2> 1408 T2266 oashl.XMLLoader.init xsltCacheLifetimeSeconds=60
[junit4:junit4]   2> 1408 T2269 oashl.XMLLoader.init xsltCacheLifetimeSeconds=60
[junit4:junit4]   2> 1409 T2264 oashl.XMLLoader.init xsltCacheLifetimeSeconds=60
[junit4:junit4]   2> 1417 T2276 oass.SolrIndexSearcher.<init> Opening Searcher@f4b6e71 main
[junit4:junit4]   2> 1418 T2276 oasc.SolrCore.registerSearcher [00005_core] Registered new searcher Searcher@f4b6e71 main{StandardDirectoryReader(segments_1:1)}
[junit4:junit4]   2> 1418 T2263 oass.SolrIndexSearcher.<init> Opening Searcher@1f309977 main
[junit4:junit4]   2> 1418 T2276 oasu.CommitTracker.<init> Hard AutoCommit: disabled
[junit4:junit4]   2> 1419 T2276 oasu.CommitTracker.<init> Soft AutoCommit: disabled
[junit4:junit4]   2> 1419 T2263 oasc.SolrCore.registerSearcher [00000_core] Registered new searcher Searcher@1f309977 main{StandardDirectoryReader(segments_1:1)}
[junit4:junit4]   2> 1419 T2263 oasu.CommitTracker.<init> Hard AutoCommit: disabled
[junit4:junit4]   2> 1420 T2263 oasu.CommitTracker.<init> Soft AutoCommit: disabled
[junit4:junit4]   2> 1422 T2267 oass.SolrIndexSearcher.<init> Opening Searcher@7a92df6f main
[junit4:junit4]   2> 1422 T2266 oass.SolrIndexSearcher.<init> Opening Searcher@71ccff6b main
[junit4:junit4]   2> 1423 T2269 oass.SolrIndexSearcher.<init> Opening Searcher@5dde0a75 main
[junit4:junit4]   2> 1423 T2264 oass.SolrIndexSearcher.<init> Opening Searcher@6335c035 main
[junit4:junit4]   2> 1423 T2276 oasc.CoreMaps.putTransientCore Opening transient core 00005_core
[junit4:junit4]   2> 1423 T2267 oasc.SolrCore.registerSearcher [00018_core] Registered new searcher Searcher@7a92df6f main{StandardDirectoryReader(segments_1:1)}
[junit4:junit4]   2> 1424 T2266 oasc.SolrCore.registerSearcher [00006_core] Registered new searcher Searcher@71ccff6b main{StandardDirectoryReader(segments_1:1)}
[junit4:junit4]   2> 1424 T2276 oasc.CoreContainer.registerCore registering core: 00005_core
[junit4:junit4]   2> 1424 T2267 oasu.CommitTracker.<init> Hard AutoCommit: disabled
[junit4:junit4]   2> 1424 T2269 oasc.SolrCore.registerSearcher [00010_core] Registered new searcher Searcher@5dde0a75 main{StandardDirectoryReader(segments_1:1)}
[junit4:junit4]   2> 1425 T2267 oasu.CommitTracker.<init> Soft AutoCommit: disabled
[junit4:junit4]   2> 1424 T2264 oasc.SolrCore.registerSearcher [00009_core] Registered new searcher Searcher@6335c035 main{StandardDirectoryReader(segments_1:1)}
[junit4:junit4]   2> 1424 T2223 oasc.SolrCore.close [00007_core]  CLOSING SolrCore org.apache.solr.core.SolrCore@43d005c0
[junit4:junit4]   2> 1424 T2266 oasu.CommitTracker.<init> Hard AutoCommit: disabled
[junit4:junit4]   2> 1424 T2263 oasc.CoreMaps.putTransientCore Opening transient core 00000_core
[junit4:junit4]   2> 1425 T2264 oasu.CommitTracker.<init> Hard AutoCommit: disabled
[junit4:junit4]   2> 1426 T2263 oasc.CoreContainer.registerCore registering core: 00000_core
[junit4:junit4]   2> 1425 T2269 oasu.CommitTracker.<init> Hard AutoCommit: disabled
[junit4:junit4]   2> 1426 T2266 oasu.CommitTracker.<init> Soft AutoCommit: disabled
[junit4:junit4]   2> 1426 T2264 oasu.CommitTracker.<init> Soft AutoCommit: disabled
[junit4:junit4]   2> 1426 T2269 oasu.CommitTracker.<init> Soft AutoCommit: disabled
[junit4:junit4]   2> 1430 T2249 oasc.SolrConfig.<init> Using Lucene MatchVersion: LUCENE_41
[junit4:junit4]   2> 1431 T2261 oasc.SolrConfig.<init> Using Lucene MatchVersion: LUCENE_41
[junit4:junit4]   2> 1431 T2223 oasu.DirectUpdateHandler2.close closing DirectUpdateHandler2{commits=0,autocommits=0,soft autocommits=0,optimizes=0,rollbacks=0,expungeDeletes=0,docsPending=2,adds=2,deletesById=0,deletesByQuery=0,errors=0,cumulative_adds=2,cumulative_deletesById=0,cumulative_deletesByQuery=0,cumulative_errors=0}
[junit4:junit4]   2> 1431 T2267 oasc.CoreMaps.putTransientCore Opening transient core 00018_core
[junit4:junit4]   2> 1432 T2223 oasu.SolrCoreState.decrefSolrCoreState Closing SolrCoreState
[junit4:junit4]   2> 1432 T2267 oasc.CoreContainer.registerCore registering core: 00018_core
[junit4:junit4]   2> 1432 T2223 oasu.DefaultSolrCoreState.closeIndexWriter SolrCoreState ref count has reached 0 - closing IndexWriter
[junit4:junit4]   2> 1433 T2223 oasu.DefaultSolrCoreState.closeIndexWriter closing IndexWriter with IndexWriterCloser
[junit4:junit4]   2> 1433 T2266 oasc.CoreMaps.putTransientCore Opening transient core 00006_core
[junit4:junit4]   2> ASYNC  NEW_CORE C175 name=00005_core org.apache.solr.core.SolrCore@75471931
[junit4:junit4]   2> 1434 T2276 C175 REQ [00005_core] webapp=/solr path=/select params={q=*:*&wt=javabin&qt=/select&version=2} hits=0 status=0 QTime=0 
[junit4:junit4]   2> 1434 T2269 oasc.CoreMaps.putTransientCore Opening transient core 00010_core
[junit4:junit4]   2> 1434 T2266 oasc.CoreContainer.registerCore registering core: 00006_core
[junit4:junit4]   2> 1434 T2269 oasc.CoreContainer.registerCore registering core: 00010_core
[junit4:junit4]   2> 1434 T2264 oasc.CoreMaps.putTransientCore Opening transient core 00009_core
[junit4:junit4]   2> 1435 T2264 oasc.CoreContainer.registerCore registering core: 00009_core
[junit4:junit4]   2> ASYNC  NEW_CORE C176 name=00000_core org.apache.solr.core.SolrCore@7116a40e
[junit4:junit4]   2> 1443 T2263 C176 REQ [00000_core] webapp=/solr path=/select params={q=*:*&wt=javabin&qt=/select&version=2} hits=0 status=0 QTime=0 
[junit4:junit4]   2> 1455 T2259 C176 oasc.SolrDeletionPolicy.onInit SolrDeletionPolicy.onInit: commits:num=1
[junit4:junit4]   2> 		commit{dir=MockDirWrapper(org.apache.lucene.store.MMapDirectory@/usr/home/hudson/hudson-slave/workspace/Lucene-Solr-NightlyTests-trunk/solr/build/solr-core/test/J1/OpenCloseCoreStressTest_/00000_core/data/index lockFactory=org.apache.lucene.store.NativeFSLockFactory@5daf5535),segFN=segments_1,generation=1,filenames=[segments_1]
[junit4:junit4]   2> 1455 T2259 C176 oasc.SolrDeletionPolicy.updateCommits newest commit = 1[segments_1]
[junit4:junit4]   2> ASYNC  NEW_CORE C177 name=00018_core org.apache.solr.core.SolrCore@4d0d89dd
[junit4:junit4]   2> 1460 T2267 C177 REQ [00018_core] webapp=/solr path=/select params={q=*:*&wt=javabin&qt=/select&version=2} hits=0 status=0 QTime=0 
[junit4:junit4]   2> ASYNC  NEW_CORE C178 name=00010_core org.apache.solr.core.SolrCore@461d284e
[junit4:junit4]   2> 1460 T2269 C178 REQ [00010_core] webapp=/solr path=/select params={q=*:*&wt=javabin&qt=/select&version=2} hits=0 status=0 QTime=0 
[junit4:junit4]   2> ASYNC  NEW_CORE C179 name=00009_core org.apache.solr.core.SolrCore@29faa6f4
[junit4:junit4]   2> 1462 T2272 C179 REQ [00009_core] webapp=/solr path=/select params={q=*:*&wt=javabin&qt=/select&version=2} hits=0 status=0 QTime=0 
[junit4:junit4]   2> ASYNC  NEW_CORE C180 name=00006_core org.apache.solr.core.SolrCore@402f8a25
[junit4:junit4]   2> 1463 T2273 C180 REQ [00006_core] webapp=/solr path=/select params={q=*:*&wt=javabin&qt=/select&version=2} hits=0 status=0 QTime=0 
[junit4:junit4]   2> 1464 T2252 C177 oasc.SolrDeletionPolicy.onInit SolrDeletionPolicy.onInit: commits:num=1
[junit4:junit4]   2> 		commit{dir=MockDirWrapper(org.apache.lucene.store.MMapDirectory@/usr/home/hudson/hudson-slave/workspace/Lucene-Solr-NightlyTests-trunk/solr/build/solr-core/test/J1/OpenCloseCoreStressTest_/00018_core/data/index lockFactory=org.apache.lucene.store.NativeFSLockFactory@8b7c81c),segFN=segments_1,generation=1,filenames=[segments_1]
[junit4:junit4]   2> 1464 T2252 C177 oasc.SolrDeletionPolicy.updateCommits newest commit = 1[segments_1]
[junit4:junit4]   2> 1467 T2264 C179 REQ [00009_core] webapp=/solr path=/select params={q=*:*&wt=javabin&qt=/select&version=2} hits=0 status=0 QTime=0 
[junit4:junit4]   2> 1467 T2271 C180 REQ [00006_core] webapp=/solr path=/select params={q=*:*&wt=javabin&qt=/select&version=2} hits=0 status=0 QTime=0 
[junit4:junit4]   2> 1468 T2266 C180 REQ [00006_core] webapp=/solr path=/select params={q=*:*&wt=javabin&qt=/select&version=2} hits=0 status=0 QTime=0 
[junit4:junit4]   2> 1469 T2258 C178 oasc.SolrDeletionPolicy.onInit SolrDeletionPolicy.onInit: commits:num=1
[junit4:junit4]   2> 		commit{dir=MockDirWrapper(org.apache.lucene.store.MMapDirectory@/usr/home/hudson/hudson-slave/workspace/Lucene-Solr-NightlyTests-trunk/solr/build/solr-core/test/J1/OpenCloseCoreStressTest_/00010_core/data/index lockFactory=org.apache.lucene.store.NativeFSLockFactory@4a1daec),segFN=segments_1,generation=1,filenames=[segments_1]
[junit4:junit4]   2> 1469 T2258 C178 oasc.SolrDeletionPolicy.updateCommits newest commit = 1[segments_1]
[junit4:junit4]   2> 1470 T2268 C180 REQ [00006_core] webapp=/solr path=/select params={q=*:*&wt=javabin&qt=/select&version=2} hits=0 status=0 QTime=0 
[junit4:junit4]   2> 1470 T2259 C176 UPDATE [00000_core] webapp=/solr path=/update params={wt=javabin&version=2} {add=[id32]} 0 24
[junit4:junit4]   2> 1470 T2218 C176 UPDATE [00000_core] webapp=/solr path=/update params={wt=javabin&version=2} {add=[id20]} 0 20
[junit4:junit4]   2> 1471 T2220 C179 oasc.SolrDeletionPolicy.onInit SolrDeletionPolicy.onInit: commits:num=1
[junit4:junit4]   2> 		commit{dir=MockDirWrapper(org.apache.lucene.store.MMapDirectory@/usr/home/hudson/hudson-slave/workspace/Lucene-Solr-NightlyTests-trunk/solr/build/solr-core/test/J1/OpenCloseCoreStressTest_/00009_core/data/index lockFactory=org.apache.lucene.store.NativeFSLockFactory@43faa483),segFN=segments_1,generation=1,filenames=[segments_1]
[junit4:junit4]   2> 1471 T2220 C179 oasc.SolrDeletionPolicy.updateCommits newest commit = 1[segments_1]
[junit4:junit4]   2> 1473 T2252 C177 UPDATE [00018_core] webapp=/solr path=/update params={wt=javabin&version=2} {add=[id34]} 0 20
[junit4:junit4]   2> 1473 T2222 C177 UPDATE [00018_core] webapp=/solr path=/update params={wt=javabin&version=2} {add=[id35]} 0 14
[junit4:junit4]   2> 1473 T2219 C177 UPDATE [00018_core] webapp=/solr path=/update params={wt=javabin&version=2} {add=[id23]} 0 9
[junit4:junit4]   2> 1473 T2258 C178 UPDATE [00010_core] webapp=/solr path=/update params={wt=javabin&version=2} {add=[id27]} 0 17
[junit4:junit4]   2> 1473 T2217 C180 oasc.SolrDeletionPolicy.onInit SolrDeletionPolicy.onInit: commits:num=1
[junit4:junit4]   2> 		commit{dir=MockDirWrapper(org.apache.lucene.store.MMapDirectory@/usr/home/hudson/hudson-slave/workspace/Lucene-Solr-NightlyTests-trunk/solr/build/solr-core/test/J1/OpenCloseCoreStressTest_/00006_core/data/index lockFactory=org.apache.lucene.store.NativeFSLockFactory@b589bb5),segFN=segments_1,generation=1,filenames=[segments_1]
[junit4:junit4]   2> 1474 T2217 C180 oasc.SolrDeletionPolicy.updateCommits newest commit = 1[segments_1]
[junit4:junit4]   2> 1474 T2220 C179 UPDATE [00009_core] webapp=/solr path=/update params={wt=javabin&version=2} {add=[id29]} 0 15
[junit4:junit4]   2> 1477 T2257 C179 UPDATE [00009_core] webapp=/solr path=/update params={wt=javabin&version=2} {add=[id19]} 0 13
[junit4:junit4]   2> 1478 T2270 C166 REQ [00004_core] webapp=/solr path=/select params={q=*:*&wt=javabin&qt=/select&version=2} hits=0 status=0 QTime=0 
[junit4:junit4]   2> 1478 T2252 C176 UPDATE [00000_core] webapp=/solr path=/update params={wt=javabin&version=2} {add=[id48]} 0 0
[junit4:junit4]   2> 1478 T2258 C177 UPDATE [00018_core] webapp=/solr path=/update params={wt=javabin&version=2} {add=[id50]} 0 0
[junit4:junit4]   2> 1479 T2217 C180 UPDATE [00006_core] webapp=/solr path=/update params={wt=javabin&version=2} {add=[id31]} 0 15
[junit4:junit4]   2> 1479 T2221 C180 UPDATE [00006_core] webapp=/solr path=/update params={wt=javabin&version=2} {add=[id28]} 0 11
[junit4:junit4]   2> 1480 T2259 C179 UPDATE [00009_core] webapp=/solr path=/update params={wt=javabin&version=2} {add=[id45]} 0 7
[junit4:junit4]   2> 1483 T2258 C178 UPDATE [00010_core] webapp=/solr path=/update params={wt=javabin&version=2} {add=[id54]} 0 1
[junit4:junit4]   2> 1484 T2259 C172 UPDATE [00008_core] webapp=/solr path=/update params={wt=javabin&version=2} {add=[id57]} 0 1
[junit4:junit4]   2> 1487 T2217 C175 oasc.SolrDeletionPolicy.onInit SolrDeletionPolicy.onInit: commits:num=1
[junit4:junit4]   2> 		commit{dir=MockDirWrapper(org.apache.lucene.store.MMapDirectory@/usr/home/hudson/hudson-slave/workspace/Lucene-Solr-NightlyTests-trunk/solr/build/solr-core/test/J1/OpenCloseCoreStressTest_/00005_core/data/index lockFactory=org.apache.lucene.store.NativeFSLockFactory@66568de4),segFN=segments_1,generation=1,filenames=[segments_1]
[junit4:junit4]   2> 1487 T2217 C175 oasc.SolrDeletionPolicy.updateCommits newest commit = 1[segments_1]
[junit4:junit4]   2> 1490 T2217 C175 UPDATE [00005_core] webapp=/solr path=/update params={wt=javabin&version=2} {add=[id55]} 0 8
[junit4:junit4]   2> 1494 T2217 C172 UPDATE [00008_core] webapp=/solr path=/update params={wt=javabin&version=2} {add=[id60]} 0 1
[junit4:junit4]   2> 1496 T2217 C177 UPDATE [00018_core] webapp=/solr path=/update params={wt=javabin&version=2} {add=[id61]} 0 0
[junit4:junit4]   2> 1513 T2256 oasc.SolrConfig.<init> Using Lucene MatchVersion: LUCENE_41
[junit4:junit4]   2> 1515 T2275 oasc.SolrConfig.<init> Using Lucene MatchVersion: LUCENE_41
[junit4:junit4]   2> 1525 T2223 C167 oasc.SolrDeletionPolicy.onCommit SolrDeletionPolicy.onCommit: commits:num=2
[junit4:junit4]   2> 		commit{dir=MockDirWrapper(org.apache.lucene.store.MMapDirectory@/usr/home/hudson/hudson-slave/workspace/Lucene-Solr-NightlyTests-trunk/solr/build/solr-core/test/J1/OpenCloseCoreStressTest_/00007_core/data/index lockFactory=org.apache.lucene.store.NativeFSLockFactory@44bae16a),segFN=segments_1,generation=1,filenames=[segments_1]
[junit4:junit4]   2> 		commit{dir=MockDirWrapper(org.apache.lucene.store.MMapDirectory@/usr/home/hudson/hudson-slave/workspace/Lucene-Solr-NightlyTests-trunk/solr/build/solr-core/test/J1/OpenCloseCoreStressTest_/00007_core/data/index lockFactory=org.apache.lucene.store.NativeFSLockFactory@44bae16a),segFN=segments_2,generation=2,filenames=[_0.cbnd, _0.fnm, _0.pos, _0.tim, segments_2, _0.fdx, _0.cbnm, _0.si, _0.doc, _0.tip, _0.fdt]
[junit4:junit4]   2> 1525 T2223 C167 oasc.SolrDeletionPolicy.updateCommits newest commit = 2[_0.cbnd, _0.fnm, _0.pos, _0.tim, segments_2, _0.fdx, _0.cbnm, _0.si, _0.doc, _0.tip, _0.fdt]
[junit4:junit4]   2> 1529 T2223 oasc.SolrCore.closeSearcher [00007_core] Closing main searcher on request.
[junit4:junit4]   2> 1529 T2223 oasc.CachingDirectoryFactory.close Closing directory when closing factory: /usr/home/hudson/hudson-slave/workspace/Lucene-Solr-NightlyTests-trunk/solr/build/solr-core/test/J1/OpenCloseCoreStressTest_/00007_core/data
[junit4:junit4]   2> 1529 T2223 oasc.CachingDirectoryFactory.closeDirectory Closing directory: /usr/home/hudson/hudson-slave/workspace/Lucene-Solr-NightlyTests-trunk/solr/build/solr-core/test/J1/OpenCloseCoreStressTest_/00007_core/data
[junit4:junit4]   2> 1531 T2223 oasc.CachingDirectoryFactory.close Closing directory when closing factory: /usr/home/hudson/hudson-slave/workspace/Lucene-Solr-NightlyTests-trunk/solr/build/solr-core/test/J1/OpenCloseCoreStressTest_/00007_core/data/index
[junit4:junit4]   2> 1531 T2223 oasc.CachingDirectoryFactory.closeDirectory Closing directory: /usr/home/hudson/hudson-slave/workspace/Lucene-Solr-NightlyTests-trunk/solr/build/solr-core/test/J1/OpenCloseCoreStressTest_/00007_core/data/index
[junit4:junit4]   2> 1537 T2276 C165 REQ [00014_core] webapp=/solr path=/select params={q=*:*&wt=javabin&qt=/select&version=2} hits=0 status=0 QTime=0 
[junit4:junit4]   2> 1547 T2223 oasc.SolrCore.close [00011_core]  CLOSING SolrCore org.apache.solr.core.SolrCore@cb1d853
[junit4:junit4]   2> 1547 T2218 oasc.CoreContainer.create Creating SolrCore '00007_core' using instanceDir: /usr/home/hudson/hudson-slave/workspace/Lucene-Solr-NightlyTests-trunk/solr/build/solr-core/test/J1/./OpenCloseCoreStressTest_/00007_core
[junit4:junit4]   2> 1547 T2263 C179 REQ [00009_core] webapp=/solr path=/select params={q=*:*&wt=javabin&qt=/select&version=2} hits=0 status=0 QTime=0 
[junit4:junit4]   2> 1548 T2218 oasc.SolrResourceLoader.<init> new SolrResourceLoader for directory: '/usr/home/hudson/hudson-slave/workspace/Lucene-Solr-NightlyTests-trunk/solr/build/solr-core/test/J1/./OpenCloseCoreStressTest_/00007_core/'
[junit4:junit4]   2> 1550 T2223 oasu.DirectUpdateHandler2.close closing DirectUpdateHandler2{commits=0,autocommits=0,soft autocommits=0,optimizes=0,rollbacks=0,expungeDeletes=0,docsPending=1,adds=1,deletesById=0,deletesByQuery=0,errors=0,cumulative_adds=1,cumulative_deletesById=0,cumulative_deletesByQuery=0,cumulative_errors=0}
[junit4:junit4]   2> 1551 T2223 oasu.SolrCoreState.decrefSolrCoreState Closing SolrCoreState
[junit4:junit4]   2> 1551 T2223 oasu.DefaultSolrCoreState.closeIndexWriter SolrCoreState ref count has reached 0 - closing IndexWriter
[junit4:junit4]   2> 1551 T2223 oasu.DefaultSolrCoreState.closeIndexWriter closing IndexWriter with IndexWriterCloser
[junit4:junit4]   2> 1571 T2264 C180 REQ [00006_core] webapp=/solr path=/select params={q=*:*&wt=javabin&qt=/select&version=2} hits=0 status=0 QTime=0 
[junit4:junit4]   2> 1574 T2268 C179 REQ [00009_core] webapp=/solr path=/select params={q=*:*&wt=javabin&qt=/select&version=2} hits=0 status=0 QTime=0 
[junit4:junit4]   2> 1580 T2261 oasc.SolrConfig.<init> Loaded SolrConfig: solrconfig-minimal.xml
[junit4:junit4]   2> 1581 T2249 oasc.SolrConfig.<init> Loaded SolrConfig: solrconfig-minimal.xml
[junit4:junit4]   2> 1582 T2261 oass.IndexSchema.readSchema Reading Solr Schema
[junit4:junit4]   2> 1582 T2249 oass.IndexSchema.readSchema Reading Solr Schema
[junit4:junit4]   2> 1593 T2223 C171 oasc.SolrDeletionPolicy.onCommit SolrDeletionPolicy.onCommit: commits:num=2
[junit4:junit4]   2> 		commit{dir=MockDirWrapper(org.apache.lucene.store.MMapDirectory@/usr/home/hudson/hudson-slave/workspace/Lucene-Solr-NightlyTests-trunk/solr/build/solr-core/test/J1/OpenCloseCoreStressTest_/00011_core/data/index lockFactory=org.apache.lucene.store.NativeFSLockFactory@4da39c20),segFN=segments_1,generation=1,filenames=[segments_1]
[junit4:junit4]   2> 		commit{dir=MockDirWrapper(org.apache.lucene.store.MMapDirectory@/usr/home/hudson/hudson-slave/workspace/Lucene-Solr-NightlyTests-trunk/solr/build/solr-core/test/J1/OpenCloseCoreStressTest_/00011_core/data/index lockFactory=org.apache.lucene.store.NativeFSLockFactory@4da39c20),segFN=segments_2,generation=2,filenames=[_0.cbnd, _0.fnm, _0.pos, _0.tim, segments_2, _0.fdx, _0.cbnm, _0.si, _0.doc, _0.tip, _0.fdt]
[junit4:junit4]   2> 1593 T2223 C171 oasc.SolrDeletionPolicy.updateCommits newest commit = 2[_0.cbnd, _0.fnm, _0.pos, _0.tim, segments_2, _0.fdx, _0.cbnm, _0.si, _0.doc, _0.tip, _0.fdt]
[junit4:junit4]   2> 1597 T2223 oasc.SolrCore.closeSearcher [00011_core] Closing main searcher on request.
[junit4:junit4]   2> 1597 T2223 oasc.CachingDirectoryFactory.close Closing directory when closing factory: /usr/home/hudson/hudson-slave/workspace/Lucene-Solr-NightlyTests-trunk/solr/build/solr-core/test/J1/OpenCloseCoreStressTest_/00011_core/data
[junit4:junit4]   2> 1598 T2223 oasc.CachingDirectoryFactory.closeDirectory Closing directory: /usr/home/hudson/hudson-slave/workspace/Lucene-Solr-NightlyTests-trunk/solr/build/solr-core/test/J1/OpenCloseCoreStressTest_/00011_core/data
[junit4:junit4]   2> 1599 T2223 oasc.CachingDirectoryFactory.close Closing directory when closing factory: /usr/home/hudson/hudson-slave/workspace/Lucene-Solr-NightlyTests-trunk/solr/build/solr-core/test/J1/OpenCloseCoreStressTest_/00011_core/data/index
[junit4:junit4]   2> 1600 T2223 oasc.CachingDirectoryFactory.closeDirectory Closing directory: /usr/home/hudson/hudson-slave/workspace/Lucene-Solr-NightlyTests-trunk/solr/build/solr-core/test/J1/OpenCloseCoreStressTest_/00011_core/data/index
[junit4:junit4]   2> 1609 T2256 oasc.SolrConfig.<init> Loaded SolrConfig: solrconfig-minimal.xml
[junit4:junit4]   2> 1610 T2256 oass.IndexSchema.readSchema Reading Solr Schema
[junit4:junit4]   2> 1611 T2275 oasc.SolrConfig.<init> Loaded SolrConfig: solrconfig-minimal.xml
[junit4:junit4]   2> 1611 T2249 oass.IndexSchema.readSchema Schema name=tiny
[junit4:junit4]   2> 1612 T2275 oass.IndexSchema.readSchema Reading Solr Schema
[junit4:junit4]   2> 1611 T2261 oass.IndexSchema.readSchema Schema name=tiny
[junit4:junit4]   2> 1614 T2256 oass.IndexSchema.readSchema Schema name=tiny
[junit4:junit4]   2> 1616 T2275 oass.IndexSchema.readSchema Schema name=tiny
[junit4:junit4]   2> 1617 T2223 oasc.SolrCore.close [00002_core]  CLOSING SolrCore org.apache.solr.core.SolrCore@2992a8b
[junit4:junit4]   2> 1617 T2217 oasc.CoreContainer.create Creating SolrCore '00011_core' using instanceDir: /usr/home/hudson/hudson-slave/workspace/Lucene-Solr-NightlyTests-trunk/solr/build/solr-core/test/J1/./OpenCloseCoreStressTest_/00011_core
[junit4:junit4]   2> 1618 T2217 oasc.SolrResourceLoader.<init> new SolrResourceLoader for directory: '/usr/home/hudson/hudson-slave/workspace/Lucene-Solr-NightlyTests-trunk/solr/build/solr-core/test/J1/./OpenCloseCoreStressTest_/00011_core/'
[junit4:junit4]   2> 1621 T2223 oasu.DirectUpdateHandler2.close closing DirectUpdateHandler2{commits=0,autocommits=0,soft autocommits=0,optimizes=0,rollbacks=0,expungeDeletes=0,docsPending=1,adds=1,deletesById=0,deletesByQuery=0,errors=0,cumulative_adds=1,cumulative_deletesById=0,cumulative_deletesByQuery=0,cumulative_errors=0}
[junit4:junit4]   2> 1621 T2223 oasu.SolrCoreState.decrefSolrCoreState Closing SolrCoreState
[junit4:junit4]   2> 1622 T2223 oasu.DefaultSolrCoreState.closeIndexWriter SolrCoreState ref count has reached 0 - closing IndexWriter
[junit4:junit4]   2> 1622 T2223 oasu.DefaultSolrCoreState.closeIndexWriter closing IndexWriter with IndexWriterCloser
[junit4:junit4]   2> 1650 T2256 oass.IndexSchema.readSchema unique key field: id
[junit4:junit4]   2> 1650 T2275 oass.IndexSchema.readSchema unique key field: id
[junit4:junit4]   2> 1650 T2218 oasc.SolrConfig.<init> Using Lucene MatchVersion: LUCENE_41
[junit4:junit4]   2> 1651 T2263 C178 REQ [00010_core] webapp=/solr path=/select params={q=*:*&wt=javabin&qt=/select&version=2} hits=0 status=0 QTime=0 
[junit4:junit4]   2> 1652 T2256 oasc.SolrCore.initDirectoryFactory org.apache.solr.core.MockFSDirectoryFactory
[junit4:junit4]   2> 1652 T2275 oasc.SolrCore.initDirectoryFactory org.apache.solr.core.MockFSDirectoryFactory
[junit4:junit4]   2> 1652 T2256 oasc.SolrCore.<init> [00016_core] Opening new SolrCore at /usr/home/hudson/hudson-slave/workspace/Lucene-Solr-NightlyTests-trunk/solr/build/solr-core/test/J1/./OpenCloseCoreStressTest_/00016_core/, dataDir=/usr/home/hudson/hudson-slave/workspace/Lucene-Solr-NightlyTests-trunk/solr/build/solr-core/test/J1/OpenCloseCoreStressTest_/00016_core/data/
[junit4:junit4]   2> 1653 T2275 oasc.SolrCore.<init> [00015_core] Opening new SolrCore at /usr/home/hudson/hudson-slave/workspace/Lucene-Solr-NightlyTests-trunk/solr/build/solr-core/test/J1/./OpenCloseCoreStressTest_/00015_core/, dataDir=/usr/home/hudson/hudson-slave/workspace/Lucene-Solr-NightlyTests-trunk/solr/build/solr-core/test/J1/OpenCloseCoreStressTest_/00015_core/data/
[junit4:junit4]   2> 1653 T2256 oasc.JmxMonitoredMap.<init> JMX monitoring is enabled. Adding Solr mbeans to JMX Server: com.sun.jmx.mbeanserver.JmxMBeanServer@433d44fc
[junit4:junit4]   2> 1653 T2275 oasc.JmxMonitoredMap.<init> JMX monitoring is enabled. Adding Solr mbeans to JMX Server: com.sun.jmx.mbeanserver.JmxMBeanServer@433d44fc
[junit4:junit4]   2> 1653 T2256 oasc.SolrCore.initDirectoryFactory org.apache.solr.core.MockFSDirectoryFactory
[junit4:junit4]   2> 1653 T2275 oasc.SolrCore.initDirectoryFactory org.apache.solr.core.MockFSDirectoryFactory
[junit4:junit4]   2> 1655 T2256 oasc.CachingDirectoryFactory.get return new directory for /usr/home/hudson/hudson-slave/workspace/Lucene-Solr-NightlyTests-trunk/solr/build/solr-core/test/J1/OpenCloseCoreStressTest_/00016_core/data forceNew: false
[junit4:junit4]   2> 1655 T2275 oasc.CachingDirectoryFactory.get return new directory for /usr/home/hudson/hudson-slave/workspace/Lucene-Solr-NightlyTests-trunk/solr/build/solr-core/test/J1/OpenCloseCoreStressTest_/00015_core/data forceNew: false
[junit4:junit4]   2> 1656 T2256 oasc.SolrCore.getNewIndexDir New index directory detected: old=null new=/usr/home/hudson/hudson-slave/workspace/Lucene-Solr-NightlyTests-trunk/solr/build/solr-core/test/J1/OpenCloseCoreStressTest_/00016_core/data/index/
[junit4:junit4]   2> 1656 T2275 oasc.SolrCore.getNewIndexDir New index directory detected: old=null new=/usr/home/hudson/hudson-slave/workspace/Lucene-Solr-NightlyTests-trunk/solr/build/solr-core/test/J1/OpenCloseCoreStressTest_/00015_core/data/index/
[junit4:junit4]   2> 1657 T2256 oasc.SolrCore.initIndex WARNING [00016_core] Solr index directory '/usr/home/hudson/hudson-slave/workspace/Lucene-Solr-NightlyTests-trunk/solr/build/solr-core/test/J1/OpenCloseCoreStressTest_/00016_core/data/index' doesn't exist. Creating new index...
[junit4:junit4]   2> 1657 T2275 oasc.SolrCore.initIndex WARNING [00015_core] Solr index directory '/usr/home/hudson/hudson-slave/workspace/Lucene-Solr-NightlyTests-trunk/solr/build/solr-core/test/J1/OpenCloseCoreStressTest_/00015_core/data/index' doesn't exist. Creating new index...
[junit4:junit4]   2> 1657 T2256 oasc.CachingDirectoryFactory.get return new directory for /usr/home/hudson/hudson-slave/workspace/Lucene-Solr-NightlyTests-trunk/solr/build/solr-core/test/J1/OpenCloseCoreStressTest_/00016_core/data/index forceNew: false
[junit4:junit4]   2> 1658 T2275 oasc.CachingDirectoryFactory.get return new directory for /usr/home/hudson/hudson-slave/workspace/Lucene-Solr-NightlyTests-trunk/solr/build/solr-core/test/J1/OpenCloseCoreStressTest_/00015_core/data/index forceNew: false
[junit4:junit4]   2> 1663 T2249 oass.IndexSchema.readSchema unique key field: id
[junit4:junit4]   2> 1663 T2261 oass.IndexSchema.readSchema unique key field: id
[junit4:junit4]   2> 1665 T2261 oasc.SolrCore.initDirectoryFactory org.apache.solr.core.MockFSDirectoryFactory
[junit4:junit4]   2> 1665 T2249 oasc.SolrCore.initDirectoryFactory org.apache.solr.core.MockFSDirectoryFactory
[junit4:junit4]   2> 1666 T2261 oasc.SolrCore.<init> [00003_core] Opening new SolrCore at /usr/home/hudson/hudson-slave/workspace/Lucene-Solr-NightlyTests-trunk/solr/build/solr-core/test/J1/./OpenCloseCoreStressTest_/00003_core/, dataDir=/usr/home/hudson/hudson-slave/workspace/Lucene-Solr-NightlyTests-trunk/solr/build/solr-core/test/J1/OpenCloseCoreStressTest_/00003_core/data/
[junit4:junit4]   2> 1666 T2249 oasc.SolrCore.<init> [00013_core] Opening new SolrCore at /usr/home/hudson/hudson-slave/workspace/Lucene-Solr-NightlyTests-trunk/solr/build/solr-core/test/J1/./OpenCloseCoreStressTest_/00013_core/, dataDir=/usr/home/hudson/hudson-slave/workspace/Lucene-Solr-NightlyTests-trunk/solr/build/solr-core/test/J1/OpenCloseCoreStressTest_/00013_core/data/
[junit4:junit4]   2> 1667 T2249 oasc.JmxMonitoredMap.<init> JMX monitoring is enabled. Adding Solr mbeans to JMX Server: com.sun.jmx.mbeanserver.JmxMBeanServer@433d44fc
[junit4:junit4]   2> 1667 T2261 oasc.JmxMonitoredMap.<init> JMX monitoring is enabled. Adding Solr mbeans to JMX Server: com.sun.jmx.mbeanserver.JmxMBeanServer@433d44fc
[junit4:junit4]   2> 1668 T2261 oasc.SolrCore.initDirectoryFactory org.apache.solr.core.MockFSDirectoryFactory
[junit4:junit4]   2> 1668 T2249 oasc.SolrCore.initDirectoryFactory org.apache.solr.core.MockFSDirectoryFactory
[junit4:junit4]   2> 1669 T2261 oasc.CachingDirectoryFactory.get return new directory for /usr/home/hudson/hudson-slave/workspace/Lucene-Solr-NightlyTests-trunk/solr/build/solr-core/test/J1/OpenCloseCoreStressTest_/00003_core/data forceNew: false
[junit4:junit4]   2> 1670 T2249 oasc.CachingDirectoryFactory.get return new directory for /usr/home/hudson/hudson-slave/workspace/Lucene-Solr-NightlyTests-trunk/solr/build/solr-core/test/J1/OpenCloseCoreStressTest_/00013_core/data forceNew: false
[junit4:junit4]   2> 1671 T2261 oasc.SolrCore.getNewIndexDir New index directory detected: old=null new=/usr/home/hudson/hudson-slave/workspace/Lucene-Solr-NightlyTests-trunk/solr/build/solr-core/test/J1/OpenCloseCoreStressTest_/00003_core/data/index/
[junit4:junit4]   2> 1671 T2249 oasc.SolrCore.getNewIndexDir New index directory detected: old=null new=/usr/home/hudson/hudson-slave/workspace/Lucene-Solr-NightlyTests-trunk/solr/build/solr-core/test/J1/OpenCloseCoreStressTest_/00013_core/data/index/
[junit4:junit4]   2> 1672 T2261 oasc.SolrCore.initIndex WARNING [00003_core] Solr index directory '/usr/home/hudson/hudson-slave/workspace/Lucene-Solr-NightlyTests-trunk/solr/build/solr-core/test/J1/OpenCloseCoreStressTest_/00003_core/data/index' doesn't exist. Creating new index...
[junit4:junit4]   2> 1672 T2249 oasc.SolrCore.initIndex WARNING [00013_core] Solr index directory '/usr/home/hudson/hudson-slave/workspace/Lucene-Solr-NightlyTests-trunk/solr/build/solr-core/test/J1/OpenCloseCoreStressTest_/00013_core/data/index' doesn't exist. Creating new index...
[junit4:junit4]   2> 1673 T2275 oasc.SolrDeletionPolicy.onCommit SolrDeletionPolicy.onCommit: commits:num=1
[junit4:junit4]   2> 		commit{dir=MockDirWrapper(org.apache.lucene.store.MMapDirectory@/usr/home/hudson/hudson-slave/workspace/Lucene-Solr-NightlyTests-trunk/solr/build/solr-core/test/J1/OpenCloseCoreStressTest_/00015_core/data/index lockFactory=org.apache.lucene.store.NativeFSLockFactory@48cd954c),segFN=segments_1,generation=1,filenames=[segments_1]
[junit4:junit4]   2> 1673 T2275 oasc.SolrDeletionPolicy.updateCommits newest commit = 1[segments_1]
[junit4:junit4]   2> 1675 T2275 oasc.SolrCore.initWriters created json: solr.JSONResponseWriter
[junit4:junit4]   2> 1675 T2261 oasc.CachingDirectoryFactory.get return new directory for /usr/home/hudson/hudson-slave/workspace/Lucene-Solr-NightlyTests-trunk/solr/build/solr-core/test/J1/OpenCloseCoreStressTest_/00003_core/data/index forceNew: false
[junit4:junit4]   2> 1676 T2264 C166 REQ [00004_core] webapp=/solr path=/select params={q=*:*&wt=javabin&qt=/select&version=2} hits=0 status=0 QTime=1 
[junit4:junit4]   2> 1676 T2249 oasc.CachingDirectoryFactory.get return new directory for /usr/home/hudson/hudson-slave/workspace/Lucene-Solr-NightlyTests-trunk/solr/build/solr-core/test/J1/OpenCloseCoreStressTest_/00013_core/data/index forceNew: false
[junit4:junit4]   2> 1677 T2275 oasc.RequestHandlers.initHandlersFromConfig created /admin/: solr.admin.AdminHandlers
[junit4:junit4]   2> 1678 T2275 oasc.RequestHandlers.initHandlersFromConfig created /select: solr.SearchHandler
[junit4:junit4]   2> 1678 T2275 oasc.RequestHandlers.initHandlersFromConfig created /update: solr.UpdateRequestHandler
[junit4:junit4]   2> 1678 T2268 C180 REQ [00006_core] webapp=/solr path=/select params={q=*:*&wt=javabin&qt=/select&version=2} hits=0 status=0 QTime=0 
[junit4:junit4]   2> 1680 T2223 C170 oasc.SolrDeletionPolicy.onCommit SolrDeletionPolicy.onCommit: commits:num=2
[junit4:junit4]   2> 		commit{dir=MockDirWrapper(org.apache.lucene.store.MMapDirectory@/usr/home/hudson/hudson-slave/workspace/Lucene-Solr-NightlyTests-trunk/solr/build/solr-core/test/J1/OpenCloseCoreStressTest_/00002_core/data/index lockFactory=org.apache.lucene.store.NativeFSLockFactory@2e80c7ec),segFN=segments_1,generation=1,filenames=[segments_1]
[junit4:junit4]   2> 		commit{dir=MockDirWrapper(org.apache.lucene.store.MMapDirectory@/usr/home/hudson/hudson-slave/workspace/Lucene-Solr-NightlyTests-trunk/solr/build/solr-core/test/J1/OpenCloseCoreStressTest_/00002_core/data/index lockFactory=org.apache.lucene.store.NativeFSLockFactory@2e80c7ec),segFN=segments_2,generation=2,filenames=[_0.cbnd, _0.fnm, _0.pos, _0.tim, segments_2, _0.fdx, _0.cbnm, _0.si, _0.doc, _0.tip, _0.fdt]
[junit4:junit4]   2> 1681 T2223 C170 oasc.SolrDeletionPolicy.updateCommits newest commit = 2[_0.cbnd, _0.fnm, _0.pos, _0.tim, segments_2, _0.fdx, _0.cbnm, _0.si, _0.doc, _0.tip, _0.fdt]
[junit4:junit4]   2> 1681 T2256 oasc.SolrDeletionPolicy.onCommit SolrDeletionPolicy.onCommit: commits:num=1
[junit4:junit4]   2> 		commit{dir=MockDirWrapper(org.apache.lucene.store.NIOFSDirectory@/usr/home/hudson/hudson-slave/workspace/Lucene-Solr-NightlyTests-trunk/solr/build/solr-core/test/J1/OpenCloseCoreStressTest_/00016_core/data/index lockFactory=org.apache.lucene.store.NativeFSLockFactory@119ac833),segFN=segments_1,generation=1,filenames=[segments_1]
[junit4:junit4]   2> 1681 T2256 oasc.SolrDeletionPolicy.updateCommits newest commit = 1[segments_1]
[junit4:junit4]   2> 1684 T2256 oasc.SolrCore.initWriters created json: solr.JSONResponseWriter
[junit4:junit4]   2> 1685 T2223 oasc.SolrCore.closeSearcher [00002_core] Closing main searcher on request.
[junit4:junit4]   2> 1685 T2223 oasc.CachingDirectoryFactory.close Closing directory when closing factory: /usr/home/hudson/hudson-slave/workspace/Lucene-Solr-NightlyTests-trunk/solr/build/solr-core/test/J1/OpenCloseCoreStressTest_/00002_core/data/index
[junit4:junit4]   2> 1685 T2223 oasc.CachingDirectoryFactory.closeDirectory Closing directory: /usr/home/hudson/hudson-slave/workspace/Lucene-Solr-NightlyTests-trunk/solr/build/solr-core/test/J1/OpenCloseCoreStressTest_/00002_core/data/index
[junit4:junit4]   2> 1686 T2256 oasc.RequestHandlers.initHandlersFromConfig created /admin/: solr.admin.AdminHandlers
[junit4:junit4]   2> 1687 T2256 oasc.RequestHandlers.initHandlersFromConfig created /select: solr.SearchHandler
[junit4:junit4]   2> 1687 T2256 oasc.RequestHandlers.initHandlersFromConfig created /update: solr.UpdateRequestHandler
[junit4:junit4]   2> 1696 T2249 oasc.SolrDeletionPolicy.onCommit SolrDeletionPolicy.onCommit: commits:num=1
[junit4:junit4]   2> 		commit{dir=MockDirWrapper(org.apache.lucene.store.MMapDirectory@/usr/home/hudson/hudson-slave/workspace/Lucene-Solr-NightlyTests-trunk/solr/build/solr-core/test/J1/OpenCloseCoreStressTest_/00013_core/data/index lockFactory=org.apache.lucene.store.NativeFSLockFactory@de2ab9d),segFN=segments_1,generation=1,filenames=[segments_1]
[junit4:junit4]   2> 1697 T2261 oasc.SolrDeletionPolicy.onCommit SolrDeletionPolicy.onCommit: commits:num=1
[junit4:junit4]   2> 		commit{dir=MockDirWrapper(org.apache.lucene.store.MMapDirectory@/usr/home/hudson/hudson-slave/workspace/Lucene-Solr-NightlyTests-trunk/solr/build/solr-core/test/J1/OpenCloseCoreStressTest_/00003_core/data/index lockFactory=org.apache.lucene.store.NativeFSLockFactory@22f144e7),segFN=segments_1,generation=1,filenames=[segments_1]
[junit4:junit4]   2> 1697 T2249 oasc.SolrDeletionPolicy.updateCommits newest commit = 1[segments_1]
[junit4:junit4]   2> 1697 T2261 oasc.SolrDeletionPolicy.updateCommits newest commit = 1[segments_1]
[junit4:junit4]   2> 1700 T2249 oasc.SolrCore.initWriters created json: solr.JSONResponseWriter
[junit4:junit4]   2> 1701 T2261 oasc.SolrCore.initWriters created json: solr.JSONResponseWriter
[junit4:junit4]   2> 1703 T2249 oasc.RequestHandlers.initHandlersFromConfig created /admin/: solr.admin.AdminHandlers
[junit4:junit4]   2> 1703 T2275 oashl.XMLLoader.init xsltCacheLifetimeSeconds=60
[junit4:junit4]   2> 1703 T2261 oasc.RequestHandlers.initHandlersFromConfig created /admin/: solr.admin.AdminHandlers
[junit4:junit4]   2> 1704 T2249 oasc.RequestHandlers.initHandlersFromConfig created /select: solr.SearchHandler
[junit4:junit4]   2> 1704 T2256 oashl.XMLLoader.init xsltCacheLifetimeSeconds=60
[junit4:junit4]   2> 1704 T2261 oasc.RequestHandlers.initHandlersFromConfig created /select: solr.SearchHandler
[junit4:junit4]   2> 1704 T2249 oasc.RequestHandlers.initHandlersFromConfig created /update: solr.UpdateRequestHandler
[junit4:junit4]   2> 1705 T2261 oasc.RequestHandlers.initHandlersFromConfig created /update: solr.UpdateRequestHandler
[junit4:junit4]   2> 1705 T2223 oasc.CachingDirectoryFactory.close Closing directory when closing factory: /usr/home/hudson/hudson-slave/workspace/Lucene-Solr-NightlyTests-trunk/solr/build/solr-core/test/J1/OpenCloseCoreStressTest_/00002_core/data
[junit4:junit4]   2> 1706 T2223 oasc.CachingDirectoryFactory.closeDirectory Closing directory: /usr/home/hudson/hudson-slave/workspace/Lucene-Solr-NightlyTests-trunk/solr/build/solr-core/test/J1/OpenCloseCoreStressTest_/00002_core/data
[junit4:junit4]   2> 1707 T2223 oasc.SolrCore.close [00017_core]  CLOSING SolrCore org.apache.solr.core.SolrCore@7096bdc9
[junit4:junit4]   2> 1707 T2258 oasc.CoreContainer.create Creating SolrCore '00002_core' using instanceDir: /usr/home/hudson/hudson-slave/workspace/Lucene-Solr-NightlyTests-trunk/solr/build/solr-core/test/J1/./OpenCloseCoreStressTest_/00002_core
[junit4:junit4]   2> 1709 T2258 oasc.SolrResourceLoader.<init> new SolrResourceLoader for directory: '/usr/home/hudson/hudson-slave/workspace/Lucene-Solr-NightlyTests-trunk/solr/build/solr-core/test/J1/./OpenCloseCoreStressTest_/00002_core/'
[junit4:junit4]   2> 1711 T2223 oasu.DirectUpdateHandler2.close closing DirectUpdateHandler2{commits=0,autocommits=0,soft autocommits=0,optimizes=0,rollbacks=0,expungeDeletes=0,docsPending=3,adds=3,deletesById=0,deletesByQuery=0,errors=0,cumulative_adds=3,cumulative_deletesById=0,cumulative_deletesByQuery=0,cumulative_errors=0}
[junit4:junit4]   2> 1711 T2223 oasu.SolrCoreState.decrefSolrCoreState Closing SolrCoreState
[junit4:junit4]   2> 1711 T2223 oasu.DefaultSolrCoreState.closeIndexWriter SolrCoreState ref count has reached 0 - closing IndexWriter
[junit4:junit4]   2> 1712 T2223 oasu.DefaultSolrCoreState.closeIndexWriter closing IndexWriter with IndexWriterCloser
[junit4:junit4]   2> 1712 T2275 oass.SolrIndexSearcher.<init> Opening Searcher@420d948 main
[junit4:junit4]   2> 1712 T2256 oass.SolrIndexSearcher.<init> Opening Searcher@76e1e0c2 main
[junit4:junit4]   2> 1713 T2256 oasc.SolrCore.registerSearcher [00016_core] Registered new searcher Searcher@76e1e0c2 main{StandardDirectoryReader(segments_1:1)}
[junit4:junit4]   2> 1713 T2275 oasc.SolrCore.registerSearcher [00015_core] Registered new searcher Searcher@420d948 main{StandardDirectoryReader(segments_1:1)}
[junit4:junit4]   2> 1713 T2256 oasu.CommitTracker.<init> Hard AutoCommit: disabled
[junit4:junit4]   2> 1713 T2275 oasu.CommitTracker.<init> Hard AutoCommit: disabled
[junit4:junit4]   2> 1714 T2256 oasu.CommitTracker.<init> Soft AutoCommit: disabled
[junit4:junit4]   2> 1714 T2275 oasu.CommitTracker.<init> Soft AutoCommit: disabled
[junit4:junit4]   2> 1715 T2217 oasc.SolrConfig.<init> Using Lucene MatchVersion: LUCENE_41
[junit4:junit4]   2> 1718 T2256 oasc.CoreMaps.putTransientCore Opening transient core 00016_core
[junit4:junit4]   2> 1718 T2275 oasc.CoreMaps.putTransientCore Opening transient core 00015_core
[junit4:junit4]   2> 1718 T2256 oasc.CoreContainer.registerCore registering core: 00016_core
[junit4:junit4]   2> 1718 T2275 oasc.CoreContainer.registerCore registering core: 00015_core
[junit4:junit4]   2> ASYNC  NEW_CORE C181 name=00015_core org.apache.solr.core.SolrCore@21202580
[junit4:junit4]   2> 1745 T2275 C181 REQ [00015_core] webapp=/solr path=/select params={q=*:*&wt=javabin&qt=/select&version=2} hits=0 status=0 QTime=0 
[junit4:junit4]   2> 1746 T2274 C181 REQ [00015_core] webapp=/solr path=/select params={q=*:*&wt=javabin&qt=/select&version=2} hits=0 status=0 QTime=0 
[junit4:junit4]   2> 1748 T2265 C181 REQ [00015_core] webapp=/solr path=/select params={q=*:*&wt=javabin&qt=/select&version=2} hits=0 status=0 QTime=1 
[junit4:junit4]   2> ASYNC  NEW_CORE C182 name=00016_core org.apache.solr.core.SolrCore@36f944eb
[junit4:junit4]   2> 1749 T2269 C182 REQ [00016_core] webapp=/solr path=/select params={q=*:*&wt=javabin&qt=/select&version=2} hits=0 status=0 QTime=1 
[junit4:junit4]   2> 1750 T2270 C181 REQ [00015_core] webapp=/solr path=/select params={q=*:*&wt=javabin&qt=/select&version=2} hits=0 status=0 QTime=0 
[junit4:junit4]   2> 1750 T2272 C182 REQ [00016_core] webapp=/solr path=/select params={q=*:*&wt=javabin&qt=/select&version=2} hits=0 status=0 QTime=0 
[junit4:junit4]   2> 1751 T2262 C182 REQ [00016_core] webapp=/solr path=/select params={q=*:*&wt=javabin&qt=/select&version=2} hits=0 status=0 QTime=0 
[junit4:junit4]   2> 1752 T2267 C181 REQ [00015_core] webapp=/solr path=/select params={q=*:*&wt=javabin&qt=/select&version=2} hits=0 status=0 QTime=0 
[junit4:junit4]   2> 1754 T2261 oashl.XMLLoader.init xsltCacheLifetimeSeconds=60
[junit4:junit4]   2> 1754 T2222 C182 oasc.SolrDeletionPolicy.onInit SolrDeletionPolicy.onInit: commits:num=1
[junit4:junit4]   2> 		commit{dir=MockDirWrapper(org.apache.lucene.store.NIOFSDirectory@/usr/home/hudson/hudson-slave/workspace/Lucene-Solr-NightlyTests-trunk/solr/build/solr-core/test/J1/OpenCloseCoreStressTest_/00016_core/data/index lockFactory=org.apache.lucene.store.NativeFSLockFactory@119ac833),segFN=segments_1,generation=1,filenames=[segments_1]
[junit4:junit4]   2> 1754 T2249 oashl.XMLLoader.init xsltCacheLifetimeSeconds=60
[junit4:junit4]   2> 1755 T2222 C182 oasc.SolrDeletionPolicy.updateCommits newest commit = 1[segments_1]
[junit4:junit4]   2> 1756 T2219 C181 oasc.SolrDeletionPolicy.onInit SolrDeletionPolicy.onInit: commits:num=1
[junit4:junit4]   2> 		commit{dir=MockDirWrapper(org.apache.lucene.store.MMapDirectory@/usr/home/hudson/hudson-slave/workspace/Lucene-Solr-NightlyTests-trunk/solr/build/solr-core/test/J1/OpenCloseCoreStressTest_/00015_core/data/index lockFactory=org.apache.lucene.store.NativeFSLockFactory@48cd954c),segFN=segments_1,generation=1,filenames=[segments_1]
[junit4:junit4]   2> 1757 T2219 C181 oasc.SolrDeletionPolicy.updateCommits newest commit = 1[segments_1]
[junit4:junit4]   2> 1758 T2256 C182 UPDATE [00016_core] webapp=/solr path=/update params={wt=javabin&version=2} {add=[id44]} 0 8
[junit4:junit4]   2> 1758 T2222 C182 UPDATE [00016_core] webapp=/solr path=/update params={wt=javabin&version=2} {add=[id47]} 0 11
[junit4:junit4]   2> 1760 T2219 C181 UPDATE [00015_core] webapp=/solr path=/update params={wt=javabin&version=2} {add=[id49]} 0 9
[junit4:junit4]   2> 1762 T2256 C180 UPDATE [00006_core] webapp=/solr path=/update params={wt=javabin&version=2} {add=[id63]} 0 1
[junit4:junit4]   2> 1763 T2261 oass.SolrIndexSearcher.<init> Opening Searcher@db6f0b9 main
[junit4:junit4]   2> 1764 T2261 oasc.SolrCore.registerSearcher [00003_core] Registered new searcher Searcher@db6f0b9 main{StandardDirectoryReader(segments_1:1)}
[junit4:junit4]   2> 1764 T2261 oasu.CommitTracker.<init> Hard AutoCommit: disabled
[junit4:junit4]   2> 1764 T2261 oasu.CommitTracker.<init> Soft AutoCommit: disabled
[junit4:junit4]   2> 1765 T2249 oass.SolrIndexSearcher.<init> Opening Searcher@5bfeef84 main
[junit4:junit4]   2> 1767 T2249 oasc.SolrCore.registerSearcher [00013_core] Registered new searcher Searcher@5bfeef84 main{StandardDirectoryReader(segments_1:1)}
[junit4:junit4]   2> 1767 T2249 oasu.CommitTracker.<init> Hard AutoCommit: disabled
[junit4:junit4]   2> 1768 T2249 oasu.CommitTracker.<init> Soft AutoCommit: disabled
[junit4:junit4]   2> 1768 T2261 oasc.CoreMaps.putTransientCore Opening transient core 00003_core
[junit4:junit4]   2> 1769 T2261 oasc.CoreContainer.registerCore registering core: 00003_core
[junit4:junit4]   2> 1771 T2218 oasc.SolrConfig.<init> Loaded SolrConfig: solrconfig-minimal.xml
[junit4:junit4]   2> 1772 T2218 oass.IndexSchema.readSchema Reading Solr Schema
[junit4:junit4]   2> 1774 T2249 oasc.CoreMaps.putTransientCore Opening transient core 00013_core
[junit4:junit4]   2> 1774 T2249 oasc.CoreContainer.registerCore registering core: 00013_core
[junit4:junit4]   2> ASYNC  NEW_CORE C183 name=00003_core org.apache.solr.core.SolrCore@3ccf785e
[junit4:junit4]   2> 1780 T2261 C183 oasc.SolrDeletionPolicy.onInit SolrDeletionPolicy.onInit: commits:num=1
[junit4:junit4]   2> 		commit{dir=MockDirWrapper(org.apache.lucene.store.MMapDirectory@/usr/home/hudson/hudson-slave/workspace/Lucene-Solr-NightlyTests-trunk/solr/build/solr-core/test/J1/OpenCloseCoreStressTest_/00003_core/data/index lockFactory=org.apache.lucene.store.NativeFSLockFactory@22f144e7),segFN=segments_1,generation=1,filenames=[segments_1]
[junit4:junit4]   2> 1781 T2264 C165 REQ [00014_core] webapp=/solr path=/select params={q=*:*&wt=javabin&qt=/select&version=2} hits=0 status=0 QTime=1 
[junit4:junit4]   2> 1781 T2261 C183 oasc.SolrDeletionPolicy.updateCommits newest commit = 1[segments_1]
[junit4:junit4]   2> 1784 T2268 C166 REQ [00004_core] webapp=/solr path=/select params={q=*:*&wt=javabin&qt=/select&version=2} hits=0 status=0 QTime=0 
[junit4:junit4]   2> 1786 T2220 C183 UPDATE [00003_core] webapp=/solr path=/update params={wt=javabin&version=2} {add=[id51]} 0 9
[junit4:junit4]   2> ASYNC  NEW_CORE C184 name=00013_core org.apache.solr.core.SolrCore@3ca23333
[junit4:junit4]   2> 1787 T2266 C184 REQ [00013_core] webapp=/solr path=/select params={q=*:*&wt=javabin&qt=/select&version=2} hits=0 status=0 QTime=0 
[junit4:junit4]   2> 1787 T2273 C184 REQ [00013_core] webapp=/solr path=/select params={q=*:*&wt=javabin&qt=/select&version=2} hits=0 status=0 QTime=0 
[junit4:junit4]   2> 1789 T2261 C183 UPDATE [00003_core] webapp=/solr path=/update params={wt=javabin&version=2} {add=[id33]} 0 13
[junit4:junit4]   2> 1789 T2260 C184 oasc.SolrDeletionPolicy.onInit SolrDeletionPolicy.onInit: commits:num=1
[junit4:junit4]   2> 		commit{dir=MockDirWrapper(org.apache.lucene.store.MMapDirectory@/usr/home/hudson/hudson-slave/workspace/Lucene-Solr-NightlyTests-trunk/solr/build/solr-core/test/J1/OpenCloseCoreStressTest_/00013_core/data/index lockFactory=org.apache.lucene.store.NativeFSLockFactory@de2ab9d),segFN=segments_1,generation=1,filenames=[segments_1]
[junit4:junit4]   2> 1790 T2260 C184 oasc.SolrDeletionPolicy.updateCommits newest commit = 1[segments_1]
[junit4:junit4]   2> 1795 T2249 C184 UPDATE [00013_core] webapp=/solr path=/update params={wt=javabin&version=2} {add=[id21]} 0 8
[junit4:junit4]   2> 1795 T2216 C184 UPDATE [00013_core] webapp=/solr path=/update params={wt=javabin&version=2} {add=[id36]} 0 9
[junit4:junit4]   2> 1796 T2260 C184 UPDATE [00013_core] webapp=/solr path=/update params={wt=javabin&version=2} {add=[id22]} 0 11
[junit4:junit4]   2> 1797 T2218 oass.IndexSchema.readSchema Schema name=tiny
[junit4:junit4]   2> 1799 T2249 C177 UPDATE [00018_core] webapp=/solr path=/update params={wt=javabin&version=2} {add=[id69]} 0 1
[junit4:junit4]   2> 1822 T2217 oasc.SolrConfig.<init> Loaded SolrConfig: solrconfig-minimal.xml
[junit4:junit4]   2> 1823 T2217 oass.IndexSchema.readSchema Reading Solr Schema
[junit4:junit4]   2> 1827 T2218 oass.IndexSchema.readSchema unique key field: id
[junit4:junit4]   2> 1828 T2217 oass.IndexSchema.readSchema Schema name=tiny
[junit4:junit4]   2> 1828 T2218 oasc.SolrCore.initDirectoryFactory org.apache.solr.core.MockFSDirectoryFactory
[junit4:junit4]   2> 1829 T2258 oasc.SolrConfig.<init> Using Lucene MatchVersion: LUCENE_41
[junit4:junit4]   2> 1829 T2218 oasc.SolrCore.<init> [00007_core] Opening new SolrCore at /usr/home/hudson/hudson-slave/workspace/Lucene-Solr-NightlyTests-trunk/solr/build/solr-core/test/J1/./OpenCloseCoreStressTest_/00007_core/, dataDir=/usr/home/hudson/hudson-slave/workspace/Lucene-Solr-NightlyTests-trunk/solr/build/solr-core/test/J1/OpenCloseCoreStressTest_/00007_core/data/
[junit4:junit4]   2> 1830 T2218 oasc.JmxMonitoredMap.<init> JMX monitoring is enabled. Adding Solr mbeans to JMX Server: com.sun.jmx.mbeanserver.JmxMBeanServer@433d44fc
[junit4:junit4]   2> 1830 T2218 oasc.SolrCore.initDirectoryFactory org.apache.solr.core.MockFSDirectoryFactory
[junit4:junit4]   2> 1831 T2218 oasc.CachingDirectoryFactory.get return new directory for /usr/home/hudson/hudson-slave/workspace/Lucene-Solr-NightlyTests-trunk/solr/build/solr-core/test/J1/OpenCloseCoreStressTest_/00007_core/data forceNew: false
[junit4:junit4]   2> 1832 T2218 oasc.SolrCore.getNewIndexDir New index directory detected: old=null new=/usr/home/hudson/hudson-slave/workspace/Lucene-Solr-NightlyTests-trunk/solr/build/solr-core/test/J1/OpenCloseCoreStressTest_/00007_core/data/index/
[junit4:junit4]   2> 1833 T2218 oasc.SolrCore.initWriters created json: solr.JSONResponseWriter
[junit4:junit4]   2> 1835 T2218 oasc.RequestHandlers.initHandlersFromConfig created /admin/: solr.admin.AdminHandlers
[junit4:junit4]   2> 1835 T2218 oasc.RequestHandlers.initHandlersFromConfig created /select: solr.SearchHandler
[junit4:junit4]   2> 1836 T2218 oasc.RequestHandlers.initHandlersFromConfig created /update: solr.UpdateRequestHandler
[junit4:junit4]   2> 1839 T2218 oashl.XMLLoader.init xsltCacheLifetimeSeconds=60
[junit4:junit4]   2> 1847 T2218 oasc.CachingDirectoryFactory.get return new directory for /usr/home/hudson/hudson-slave/workspace/Lucene-Solr-NightlyTests-trunk/solr/build/solr-core/test/J1/OpenCloseCoreStressTest_/00007_core/data/index forceNew: false
[junit4:junit4]   2> 1850 T2223 C169 oasc.SolrDeletionPolicy.onCommit SolrDeletionPolicy.onCommit: commits:num=2
[junit4:junit4]   2> 		commit{dir=MockDirWrapper(org.apache.lucene.store.MMapDirectory@/usr/home/hudson/hudson-slave/workspace/Lucene-Solr-NightlyTests-trunk/solr/build/solr-core/test/J1/OpenCloseCoreStressTest_/00017_core/data/index lockFactory=org.apache.lucene.store.NativeFSLockFactory@2e6510ba),segFN=segments_1,generation=1,filenames=[segments_1]
[junit4:junit4]   2> 		commit{dir=MockDirWrapper(org.apache.lucene.store.MMapDirectory@/usr/home/hudson/hudson-slave/workspace/Lucene-Solr-NightlyTests-trunk/solr/build/solr-core/test/J1/OpenCloseCoreStressTest_/00017_core/data/index lockFactory=org.apache.lucene.store.NativeFSLockFactory@2e6510ba),segFN=segments_2,generation=2,filenames=[_1.doc, _0.cbnd, _0.fnm, _0.cbnm, _1.fnm, _1.fdx, _1.fdt, _1.pos, _0.pos, _1.cbnm, _1.si, _0.tim, segments_2, _0.fdx, _0.si, _1.tip, _1.cbnd, _0.tip, _0.doc, _1.tim, _0.fdt]
[junit4:junit4]   2> 1851 T2223 C169 oasc.SolrDeletionPolicy.updateCommits newest commit = 2[_1.doc, _0.cbnd, _0.fnm, _0.cbnm, _1.fnm, _1.fdx, _1.fdt, _1.pos, _0.pos, _1.cbnm, _1.si, _0.tim, segments_2, _0.fdx, _0.si, _1.tip, _1.cbnd, _0.tip, _0.doc, _1.tim, _0.fdt]
[junit4:junit4]   2> 1851 T2275 C184 REQ [00013_core] webapp=/solr path=/select params={q=*:*&wt=javabin&qt=/select&version=2} hits=0 status=0 QTime=1 
[junit4:junit4]   2> 1853 T2265 C178 REQ [00010_core] webapp=/solr path=/select params={q=*:*&wt=javabin&qt=/select&version=2} hits=0 status=0 QTime=0 
[junit4:junit4]   2> 1853 T2274 C179 REQ [00009_core] webapp=/solr path=/select params={q=*:*&wt=javabin&qt=/select&version=2} hits=0 status=0 QTime=0 
[junit4:junit4]   2> 1854 T2223 oasc.SolrCore.closeSearcher [00017_core] Closing main searcher on request.
[junit4:junit4]   2> 1854 T2223 oasc.CachingDirectoryFactory.close Closing directory when closing factory: /usr/home/hudson/hudson-slave/workspace/Lucene-Solr-NightlyTests-trunk/solr/build/solr-core/test/J1/OpenCloseCoreStressTest_/00017_core/data
[junit4:junit4]   2> 1854 T2223 oasc.CachingDirectoryFactory.closeDirectory Closing directory: /usr/home/hudson/hudson-slave/workspace/Lucene-Solr-NightlyTests-trunk/solr/build/solr-core/test/J1/OpenCloseCoreStressTest_/00017_core/data
[junit4:junit4]   2> 1855 T2262 C179 REQ [00009_core] webapp=/solr path=/select params={q=*:*&wt=javabin&qt=/select&version=2} hits=0 status=0 QTime=0 
[junit4:junit4]   2> 1855 T2270 C179 REQ [00009_core] webapp=/solr path=/select params={q=*:*&wt=javabin&qt=/select&version=2} hits=0 status=0 QTime=0 
[junit4:junit4]   2> 1855 T2272 C182 REQ [00016_core] webapp=/solr path=/select params={q=*:*&wt=javabin&qt=/select&version=2} hits=0 status=0 QTime=0 
[junit4:junit4]   2> 1856 T2223 oasc.CachingDirectoryFactory.close Closing directory when closing factory: /usr/home/hudson/hudson-slave/workspace/Lucene-Solr-NightlyTests-trunk/solr/build/solr-core/test/J1/OpenCloseCoreStressTest_/00017_core/data/index
[junit4:junit4]   2> 1856 T2223 oasc.CachingDirectoryFactory.closeDirectory Closing directory: /usr/home/hudson/hudson-slave/workspace/Lucene-Solr-NightlyTests-trunk/solr/build/solr-core/test/J1/OpenCloseCoreStressTest_/00017_core/data/index
[junit4:junit4]   2> 1861 T2218 oass.SolrIndexSearcher.<init> Opening Searcher@1583b5d4 main
[junit4:junit4]   2> 1862 T2217 oass.IndexSchema.readSchema unique key field: id
[junit4:junit4]   2> 1862 T2218 oasc.SolrCore.registerSearcher [00007_core] Registered new searcher Searcher@1583b5d4 main{StandardDirectoryReader(segments_2:3 _0(5.0):C2)}
[junit4:junit4]   2> 1863 T2218 oasu.CommitTracker.<init> Hard AutoCommit: disabled
[junit4:junit4]   2> 1863 T2218 oasu.CommitTracker.<init> Soft AutoCommit: disabled
[junit4:junit4]   2> 1864 T2217 oasc.SolrCore.initDirectoryFactory org.apache.solr.core.MockFSDirectoryFactory
[junit4:junit4]   2> 1865 T2217 oasc.SolrCore.<init> [00011_core] Opening new SolrCore at /usr/home/hudson/hudson-slave/workspace/Lucene-Solr-NightlyTests-trunk/solr/build/solr-core/test/J1/./OpenCloseCoreStressTest_/00011_core/, dataDir=/usr/home/hudson/hudson-slave/workspace/Lucene-Solr-NightlyTests-trunk/solr/build/solr-core/test/J1/OpenCloseCoreStressTest_/00011_core/data/
[junit4:junit4]   2> 1865 T2217 oasc.JmxMonitoredMap.<init> JMX monitoring is enabled. Adding Solr mbeans to JMX Server: com.sun.jmx.mbeanserver.JmxMBeanServer@433d44fc
[junit4:junit4]   2> 1866 T2217 oasc.SolrCore.initDirectoryFactory org.apache.solr.core.MockFSDirectoryFactory
[junit4:junit4]   2> 1867 T2217 oasc.CachingDirectoryFactory.get return new directory for /usr/home/hudson/hudson-slave/workspace/Lucene-Solr-NightlyTests-trunk/solr/build/solr-core/test/J1/OpenCloseCoreStressTest_/00011_core/data forceNew: false
[junit4:junit4]   2> 1867 T2218 oasc.CoreMaps.putTransientCore Opening transient core 00007_core
[junit4:junit4]   2> 1867 T2217 oasc.SolrCore.getNewIndexDir New index directory detected: old=null new=/usr/home/hudson/hudson-slave/workspace/Lucene-Solr-NightlyTests-trunk/solr/build/solr-core/test/J1/OpenCloseCoreStressTest_/00011_core/data/index/
[junit4:junit4]   2> 1868 T2218 oasc.CoreContainer.registerCore registering core: 00007_core
[junit4:junit4]   2> 1868 T2217 oasc.SolrCore.initWriters created json: solr.JSONResponseWriter
[junit4:junit4]   2> 1870 T2217 oasc.RequestHandlers.initHandlersFromConfig created /admin/: solr.admin.AdminHandlers
[junit4:junit4]   2> 1871 T2217 oasc.RequestHandlers.initHandlersFromConfig created /select: solr.SearchHandler
[junit4:junit4]   2> 1871 T2217 oasc.RequestHandlers.initHandlersFromConfig created /update: solr.UpdateRequestHandler
[junit4:junit4]   2> ASYNC  NEW_CORE C185 name=00007_core org.apache.solr.core.SolrCore@4b9e4ff8
[junit4:junit4]   2> 1875 T2276 C185 REQ [00007_core] webapp=/solr path=/select params={q=*:*&wt=javabin&qt=/select&version=2} hits=2 status=0 QTime=1 
[junit4:junit4]   2> 1879 T2223 oasc.SolrCore.close [00001_core]  CLOSING SolrCore org.apache.solr.core.SolrCore@4f8e697b
[junit4:junit4]   2> 1879 T2219 oasc.CoreContainer.create Creating SolrCore '00017_core' using instanceDir: /usr/home/hudson/hudson-slave/workspace/Lucene-Solr-NightlyTests-trunk/solr/build/solr-core/test/J1/./OpenCloseCoreStressTest_/00017_core
[junit4:junit4]   2> 1880 T2219 oasc.SolrResourceLoader.<init> new SolrResourceLoader for directory: '/usr/home/hudson/hudson-slave/workspace/Lucene-Solr-NightlyTests-trunk/solr/build/solr-core/test/J1/./OpenCloseCoreStressTest_/00017_core/'
[junit4:junit4]   2> 1881 T2218 C185 oasc.SolrDeletionPolicy.onInit SolrDeletionPolicy.onInit: commits:num=1
[junit4:junit4]   2> 		commit{dir=MockDirWrapper(org.apache.lucene.store.NIOFSDirectory@/usr/home/hudson/hudson-slave/workspace/Lucene-Solr-NightlyTests-trunk/solr/build/solr-core/test/J1/OpenCloseCoreStressTest_/00007_core/data/index lockFactory=org.apache.lucene.store.NativeFSLockFactory@24ef992e),segFN=segments_2,generation=2,filenames=[_0.cbnd, _0.fnm, _0.pos, _0.tim, segments_2, _0.fdx, _0.cbnm, _0.si, _0.tip, _0.doc, _0.fdt]
[junit4:junit4]   2> 1882 T2218 C185 oasc.SolrDeletionPolicy.updateCommits newest commit = 2[_0.cbnd, _0.fnm, _0.pos, _0.tim, segments_2, _0.fdx, _0.cbnm, _0.si, _0.tip, _0.doc, _0.fdt]
[junit4:junit4]   2> 1883 T2223 oasu.DirectUpdateHandler2.close closing DirectUpdateHandler2{commits=0,autocommits=0,soft autocommits=0,optimizes=0,rollbacks=0,expungeDeletes=0,docsPending=5,adds=5,deletesById=0,deletesByQuery=0,errors=0,cumulative_adds=5,cumulative_deletesById=0,cumulative_deletesByQuery=0,cumulative_errors=0}
[junit4:junit4]   2> 1883 T2223 oasu.SolrCoreState.decrefSolrCoreState Closing SolrCoreState
[junit4:junit4]   2> 1883 T2223 oasu.DefaultSolrCoreState.closeIndexWriter SolrCoreState ref count has reached 0 - closing IndexWriter
[junit4:junit4]   2> 1883 T2223 oasu.DefaultSolrCoreState.closeIndexWriter closing IndexWriter with IndexWriterCloser
[junit4:junit4]   2> 1885 T2218 C185 UPDATE [00007_core] webapp=/solr path=/update params={wt=javabin&version=2} {add=[id46]} 0 9
[junit4:junit4]   2> 1885 T2222 C185 UPDATE [00007_core] webapp=/solr path=/update params={wt=javabin&version=2} {add=[id64]} 0 8
[junit4:junit4]   2> 1885 T2256 C185 UPDATE [00007_core] webapp=/solr path=/update params={wt=javabin&version=2} {add=[id66]} 0 10
[junit4:junit4]   2> 1889 T2256 C177 UPDATE [00018_core] webapp=/solr path=/update params={wt=javabin&version=2} {add=[id75]} 0 1
[junit4:junit4]   2> 1889 T2268 C182 REQ [00016_core] webapp=/solr path=/select params={q=*:*&wt=javabin&qt=/select&version=2} hits=0 status=0 QTime=1 
[junit4:junit4]   2> 1889 T2222 C180 UPDATE [00006_core] webapp=/solr path=/update params={wt=javabin&version=2} {add=[id74]} 0 1
[junit4:junit4]   2> 1890 T2217 oashl.XMLLoader.init xsltCacheLifetimeSeconds=60
[junit4:junit4]   2> 1891 T2273 C165 REQ [00014_core] webapp=/solr path=/select params={q=*:*&wt=javabin&qt=/select&version=2} hits=0 status=0 QTime=0 
[junit4:junit4]   2> 1892 T2222 C177 UPDATE [00018_core] webapp=/solr path=/update params={wt=javabin&version=2} {add=[id77]} 0 0
[junit4:junit4]   2> 1894 T2217 oasc.CachingDirectoryFactory.get return new directory for /usr/home/hudson/hudson-slave/workspace/Lucene-Solr-NightlyTests-trunk/solr/build/solr-core/test/J1/OpenCloseCoreStressTest_/00011_core/data/index forceNew: false
[junit4:junit4]   2> 1896 T2222 C183 UPDATE [00003_core] webapp=/solr path=/update params={wt=javabin&version=2} {add=[id78]} 0 1
[junit4:junit4]   2> 1899 T2222 C184 UPDATE [00013_core] webapp=/solr path=/update params={wt=javabin&version=2} {add=[id79]} 0 1
[junit4:junit4]   2> 1903 T2217 oass.SolrIndexSearcher.<init> Opening Searcher@2bfbe8ef main
[junit4:junit4]   2> 1903 T2222 C180 UPDATE [00006_core] webapp=/solr path=/update params={wt=javabin&version=2} {add=[id80]} 0 1
[junit4:junit4]   2> 1904 T2217 oasc.SolrCore.registerSearcher [00011_core] Registered new searcher Searcher@2bfbe8ef main{StandardDirectoryReader(segments_2:3 _0(5.0):C1)}
[junit4:junit4]   2> 1904 T2217 oasu.CommitTracker.<init> Hard AutoCommit: disabled
[junit4:junit4]   2> 1904 T2217 oasu.CommitTracker.<init> Soft AutoCommit: disabled
[junit4:junit4]   2> 1908 T2217 oasc.CoreMaps.putTransientCore Opening transient core 00011_core
[junit4:junit4]   2> 1908 T2258 oasc.SolrConfig.<init> Loaded SolrConfig: solrconfig-minimal.xml
[junit4:junit4]   2> 1908 T2217 oasc.CoreContainer.registerCore registering core: 00011_core
[junit4:junit4]   2> 1909 T2258 oass.IndexSchema.readSchema Reading Solr Schema
[junit4:junit4]   2> ASYNC  NEW_CORE C186 name=00011_core org.apache.solr.core.SolrCore@7a167c54
[junit4:junit4]   2> 1921 T2217 C186 oasc.SolrDeletionPolicy.onInit SolrDeletionPolicy.onInit: commits:num=1
[junit4:junit4]   2> 		commit{dir=MockDirWrapper(org.apache.lucene.store.NIOFSDirectory@/usr/home/hudson/hudson-slave/workspace/Lucene-Solr-NightlyTests-trunk/solr/build/solr-core/test/J1/OpenCloseCoreStressTest_/00011_core/data/index lockFactory=org.apache.lucene.store.NativeFSLockFactory@2d0f8378),segFN=segments_2,generation=2,filenames=[_0.cbnd, _0.fnm, _0.pos, _0.tim, segments_2, _0.fdx, _0.cbnm, _0.si, _0.tip, _0.doc, _0.fdt]
[junit4:junit4]   2> 1922 T2217 C186 oasc.SolrDeletionPolicy.updateCommits newest commit = 2[_0.cbnd, _0.fnm, _0.pos, _0.tim, segments_2, _0.fdx, _0.cbnm, _0.si, _0.tip, _0.doc, _0.fdt]
[junit4:junit4]   2> 1926 T2258 oass.IndexSchema.readSchema Schema name=tiny
[junit4:junit4]   2> 1927 T2216 C186 UPDATE [00011_core] webapp=/solr path=/update params={wt=javabin&version=2} {add=[id70]} 0 12
[junit4:junit4]   2> 1927 T2217 C186 UPDATE [00011_core] webapp=/solr path=/update params={wt=javabin&version=2} {add=[id62]} 0 12
[junit4:junit4]   2> 1927 T2260 C186 UPDATE [00011_core] webapp=/solr path=/update params={wt=javabin&version=2} {add=[id71]} 0 12
[junit4:junit4]   2> 1931 T2260 C184 UPDATE [00013_core] webapp=/solr path=/update params={wt=javabin&version=2} {add=[id84]} 0 1
[junit4:junit4]   2> 1956 T2258 oass.IndexSchema.readSchema unique key field: id
[junit4:junit4]   2> 1957 T2265 C179 REQ [00009_core] webapp=/solr path=/select params={q=*:*&wt=javabin&qt=/select&version=2} hits=0 status=0 QTime=0 
[junit4:junit4]   2> 1957 T2219 oasc.SolrConfig.<init> Using Lucene MatchVersion: LUCENE_41
[junit4:junit4]   2> 1958 T2258 oasc.SolrCore.initDirectoryFactory org.apache.solr.core.MockFSDirectoryFactory
[junit4:junit4]   2> 1959 T2258 oasc.SolrCore.<init> [00002_core] Opening new SolrCore at /usr/home/hudson/hudson-slave/workspace/Lucene-Solr-NightlyTests-trunk/solr/build/solr-core/test/J1/./OpenCloseCoreStressTest_/00002_core/, dataDir=/usr/home/hudson/hudson-slave/workspace/Lucene-Solr-NightlyTests-trunk/solr/build/solr-core/test/J1/OpenCloseCoreStressTest_/00002_core/data/
[junit4:junit4]   2> 1959 T2258 oasc.JmxMonitoredMap.<init> JMX monitoring is enabled. Adding Solr mbeans to JMX Server: com.sun.jmx.mbeanserver.JmxMBeanServer@433d44fc
[junit4:junit4]   2> 1959 T2272 C184 REQ [00013_core] webapp=/solr path=/select params={q=*:*&wt=javabin&qt=/select&version=2} hits=0 status=0 QTime=0 
[junit4:junit4]   2> 1960 T2258 oasc.SolrCore.initDirectoryFactory org.apache.solr.core.MockFSDirectoryFactory
[junit4:junit4]   2> 1961 T2258 oasc.CachingDirectoryFactory.get return new directory for /usr/home/hudson/hudson-slave/workspace/Lucene-Solr-NightlyTests-trunk/solr/build/solr-core/test/J1/OpenCloseCoreStressTest_/00002_core/data forceNew: false
[junit4:junit4]   2> 1961 T2258 oasc.SolrCore.getNewIndexDir New index directory detected: old=null new=/usr/home/hudson/hudson-slave/workspace/Lucene-Solr-NightlyTests-trunk/solr/build/solr-core/test/J1/OpenCloseCoreStressTest_/00002_core/data/index/
[junit4:junit4]   2> 1962 T2258 oasc.SolrCore.initWriters created json: solr.JSONResponseWriter
[junit4:junit4]   2> 1964 T2258 oasc.RequestHandlers.initHandlersFromConfig created /admin/: solr.admin.AdminHandlers
[junit4:junit4]   2> 1965 T2258 oasc.RequestHandlers.initHandlersFromConfig created /select: solr.SearchHandler
[junit4:junit4]   2> 1965 T2258 oasc.RequestHandlers.initHandlersFromConfig created /update: solr.UpdateRequestHandler
[junit4:junit4]   2> 1968 T2258 oashl.XMLLoader.init xsltCacheLifetimeSeconds=60
[junit4:junit4]   2> 1979 T2223 C174 oasc.SolrDeletionPolicy.onCommit SolrDeletionPolicy.onCommit: commits:num=2
[junit4:junit4]   2> 		commit{dir=MockDirWrapper(org.apache.lucene.store.MMapDirectory@/usr/home/hudson/hudson-slave/workspace/Lucene-Solr-NightlyTests-trunk/solr/build/solr-core/test/J1/OpenCloseCoreStressTest_/00001_core/data/index lockFactory=org.apache.lucene.store.NativeFSLockFactory@4ee8f85e),segFN=segments_1,generation=1,filenames=[segments_1]
[junit4:junit4]   2> 		commit{dir=MockDirWrapper(org.apache.lucene.store.MMapDirectory@/usr/home/hudson/hudson-slave/workspace/Lucene-Solr-NightlyTests-trunk/solr/build/solr-core/test/J1/OpenCloseCoreStressTest_/00001_core/data/index lockFactory=org.apache.lucene.store.NativeFSLockFactory@4ee8f85e),segFN=segments_2,generation=2,filenames=[_1.doc, _0.cbnd, _0.fnm, _0.cbnm, _1.fnm, _1.fdx, _1.fdt, _1.pos, _0.pos, _1.cbnm, _1.si, _0.tim, segments_2, _0.fdx, _0.si, _1.tip, _1.cbnd, _0.tip, _0.doc, _1.tim, _0.fdt]
[junit4:junit4]   2> 1980 T2223 C174 oasc.SolrDeletionPolicy.updateCommits newest commit = 2[_1.doc, _0.cbnd, _0.fnm, _0.cbnm, _1.fnm, _1.fdx, _1.fdt, _1.pos, _0.pos, _1.cbnm, _1.si, _0.tim, segments_2, _0.fdx, _0.si, _1.tip, _1.cbnd, _0.tip, _0.doc, _1.tim, _0.fdt]
[junit4:junit4]   2> 1983 T2223 oasc.SolrCore.closeSearcher [00001_core] Closing main searcher on request.
[junit4:junit4]   2> 1983 T2223 oasc.CachingDirectoryFactory.close Closing directory when closing factory: /usr/home/hudson/hudson-slave/workspace/Lucene-Solr-NightlyTests-trunk/solr/build/solr-core/test/J1/OpenCloseCoreStressTest_/00001_core/data/index
[junit4:junit4]   2> 1983 T2223 oasc.CachingDirectoryFactory.closeDirectory Closing directory: /usr/home/hudson/hudson-slave/workspace/Lucene-Solr-NightlyTests-trunk/solr/build/solr-core/test/J1/OpenCloseCoreStressTest_/00001_core/data/index
[junit4:junit4]   2> 1983 T2258 oasc.CachingDirectoryFactory.get return new directory for /usr/home/hudson/hudson-slave/workspace/Lucene-Solr-NightlyTests-trunk/solr/build/solr-core/test/J1/OpenCloseCoreStressTest_/00002_core/data/index forceNew: false
[junit4:junit4]   2> 1993 T2258 oass.SolrIndexSearcher.<init> Opening Searcher@6635a49b main
[junit4:junit4]   2> 1994 T2258 oasc.SolrCore.registerSearcher [00002_core] Registered new searcher Searcher@6635a49b main{StandardDirectoryReader(segments_2:3 _0(5.0):C1)}
[junit4:junit4]   2> 1995 T2258 oasu.CommitTracker.<init> Hard AutoCommit: disabled
[junit4:junit4]   2> 1995 T2258 oasu.CommitTracker.<init> Soft AutoCommit: disabled
[junit4:junit4]   2> 1999 T2258 oasc.CoreMaps.putTransientCore Opening transient core 00002_core
[junit4:junit4]   2> 1999 T2258 oasc.CoreContainer.registerCore registering core: 00002_core
[junit4:junit4]   2> 2009 T2223 oasc.CachingDirectoryFactory.close Closing directory when closing factory: /usr/home/hudson/hudson-slave/workspace/Lucene-Solr-NightlyTests-trunk/solr/build/solr-core/test/J1/OpenCloseCoreStressTest_/00001_core/data
[junit4:junit4]   2> 2009 T2223 oasc.CachingDirectoryFactory.closeDirectory Closing directory: /usr/home/hudson/hudson-slave/workspace/Lucene-Solr-NightlyTests-trunk/solr/build/solr-core/test/J1/OpenCloseCoreStressTest_/00001_core/data
[junit4:junit4]   2> 2010 T2223 oasc.SolrCore.close [00019_core]  CLOSING SolrCore org.apache.solr.core.SolrCore@31a3fd33
[junit4:junit4]   2> 2010 T2259 oasc.CoreContainer.create Creating SolrCore '00001_core' using instanceDir: /usr/home/hudson/hudson-slave/workspace/Lucene-Solr-NightlyTests-trunk/solr/build/solr-core/test/J1/./OpenCloseCoreStressTest_/00001_core
[junit4:junit4]   2> 2011 T2259 oasc.SolrResourceLoader.<init> new SolrResourceLoader for directory: '/usr/home/hudson/hudson-slave/workspace/Lucene-Solr-NightlyTests-trunk/solr/build/solr-core/test/J1/./OpenCloseCoreStressTest_/00001_core/'
[junit4:junit4]   2> ASYNC  NEW_CORE C187 name=00002_core org.apache.solr.core.SolrCore@58e2006a
[junit4:junit4]   2> 2011 T2258 C187 oasc.SolrDeletionPolicy.onInit SolrDeletionPolicy.onInit: commits:num=1
[junit4:junit4]   2> 		commit{dir=MockDirWrapper(org.apache.lucene.store.NIOFSDirectory@/usr/home/hudson/hudson-slave/workspace/Lucene-Solr-NightlyTests-trunk/solr/build/solr-core/test/J1/OpenCloseCoreStressTest_/00002_core/data/index lockFactory=org.apache.lucene.store.NativeFSLockFactory@3459b8d),segFN=segments_2,generation=2,filenames=[_0.cbnd, _0.fnm, _0.pos, _0.tim, segments_2, _0.fdx, _0.cbnm, _0.si, _0.tip, _0.doc, _0.fdt]
[junit4:junit4]   2> 2012 T2258 C187 oasc.SolrDeletionPolicy.updateCommits newest commit = 2[_0.cbnd, _0.fnm, _0.pos, _0.tim, segments_2, _0.fdx, _0.cbnm, _0.si, _0.tip, _0.doc, _0.fdt]
[junit4:junit4]   2> 2015 T2223 oasu.DirectUpdateHandler2.close closing DirectUpdateHandler2{commits=0,autocommits=0,soft autocommits=0,optimizes=0,rollbacks=0,expungeDeletes=0,docsPending=5,adds=5,deletesById=0,deletesByQuery=0,errors=0,cumulative_adds=5,cumulative_deletesById=0,cumulative_deletesByQuery=0,cumulative_errors=0}
[junit4:junit4]   2> 2015 T2223 oasu.SolrCoreState.decrefSolrCoreState Closing SolrCoreState
[junit4:junit4]   2> 2015 T2223 oasu.DefaultSolrCoreState.closeIndexWriter SolrCoreState ref count has reached 0 - closing IndexWriter
[junit4:junit4]   2> 2015 T2223 oasu.DefaultSolrCoreState.closeIndexWriter closing IndexWriter with IndexWriterCloser
[junit4:junit4]   2> 2023 T2258 C187 UPDATE [00002_core] webapp=/solr path=/update params={wt=javabin&version=2} {add=[id58]} 0 18
[junit4:junit4]   2> 2023 T2249 C187 UPDATE [00002_core] webapp=/solr path=/update params={wt=javabin&version=2} {add=[id72]} 0 15
[junit4:junit4]   2> 2023 T2222 C187 UPDATE [00002_core] webapp=/solr path=/update params={wt=javabin&version=2} {add=[id81]} 0 15
[junit4:junit4]   2> 2023 T2216 C187 UPDATE [00002_core] webapp=/solr path=/update params={wt=javabin&version=2} {add=[id83]} 0 15
[junit4:junit4]   2> 2023 T2257 C187 UPDATE [00002_core] webapp=/solr path=/update params={wt=javabin&version=2} {add=[id52]} 0 15
[junit4:junit4]   2> 2027 T2222 C180 UPDATE [00006_core] webapp=/solr path=/update params={wt=javabin&version=2} {add=[id88]} 0 1
[junit4:junit4]   2> 2028 T2257 C183 UPDATE [00003_core] webapp=/solr path=/update params={wt=javabin&version=2} {add=[id90]} 0 1
[junit4:junit4]   2> 2028 T2216 C179 UPDATE [00009_core] webapp=/solr path=/update params={wt=javabin&version=2} {add=[id89]} 0 1
[junit4:junit4]   2> 2031 T2257 C180 UPDATE [00006_core] webapp=/solr path=/update params={wt=javabin&version=2} {add=[id92]} 0 1
[junit4:junit4]   2> 2031 T2216 C187 UPDATE [00002_core] webapp=/solr path=/update params={wt=javabin&version=2} {add=[id93]} 0 0
[junit4:junit4]   2> 2034 T2257 C182 UPDATE [00016_core] webapp=/solr path=/update params={wt=javabin&version=2} {add=[id94]} 0 0
[junit4:junit4]   2> 2042 T2219 oasc.SolrConfig.<init> Loaded SolrConfig: solrconfig-minimal.xml
[junit4:junit4]   2> 2043 T2219 oass.IndexSchema.readSchema Reading Solr Schema
[junit4:junit4]   2> 2057 T2219 oass.IndexSchema.readSchema Schema name=tiny
[junit4:junit4]   2> 2086 T2219 oass.IndexSchema.readSchema unique key field: id
[junit4:junit4]   2> 2088 T2219 oasc.SolrCore.initDirectoryFactory org.apache.solr.core.MockFSDirectoryFactory
[junit4:junit4]   2> 2088 T2259 oasc.SolrConfig.<init> Using Lucene MatchVersion: LUCENE_41
[junit4:junit4]   2> 2088 T2219 oasc.SolrCore.<init> [00017_core] Opening new SolrCore at /usr/home/hudson/hudson-slave/workspace/Lucene-Solr-NightlyTests-trunk/solr/build/solr-core/test/J1/./OpenCloseCoreStressTest_/00017_core/, dataDir=/usr/home/hudson/hudson-slave/workspace/Lucene-Solr-NightlyTests-trunk/solr/build/solr-core/test/J1/OpenCloseCoreStressTest_/00017_core/data/
[junit4:junit4]   2> 2089 T2219 oasc.JmxMonitoredMap.<init> JMX monitoring is enabled. Adding Solr mbeans to JMX Server: com.sun.jmx.mbeanserver.JmxMBeanServer@433d44fc
[junit4:junit4]   2> 2089 T2219 oasc.SolrCore.initDirectoryFactory org.apache.solr.core.MockFSDirectoryFactory
[junit4:junit4]   2> 2090 T2219 oasc.CachingDirectoryFactory.get return new directory for /usr/home/hudson/hudson-slave/workspace/Lucene-Solr-NightlyTests-trunk/solr/build/solr-core/test/J1/OpenCloseCoreStressTest_/00017_core/data forceNew: false
[junit4:junit4]   2> 2091 T2219 oasc.SolrCore.getNewIndexDir New index directory detected: old=null new=/usr/home/hudson/hudson-slave/workspace/Lucene-Solr-NightlyTests-trunk/solr/build/solr-core/test/J1/OpenCloseCoreStressTest_/00017_core/data/index/
[junit4:junit4]   2> 2092 T2219 oasc.SolrCore.initWriters created json: solr.JSONResponseWriter
[junit4:junit4]   2> 2094 T2219 oasc.RequestHandlers.initHandlersFromConfig created /admin/: solr.admin.AdminHandlers
[junit4:junit4]   2> 2094 T2219 oasc.RequestHandlers.initHandlersFromConfig created /select: solr.SearchHandler
[junit4:junit4]   2> 2095 T2219 oasc.RequestHandlers.initHandlersFromConfig created /update: solr.UpdateRequestHandler
[junit4:junit4]   2> 2103 T2223 C173 oasc.SolrDeletionPolicy.onCommit SolrDeletionPolicy.onCommit: commits:num=2
[junit4:junit4]   2> 		commit{dir=MockDirWrapper(org.apache.lucene.store.MMapDirectory@/usr/home/hudson/hudson-slave/workspace/Lucene-Solr-NightlyTests-trunk/solr/build/solr-core/test/J1/OpenCloseCoreStressTest_/00019_core/data/index lockFactory=org.apache.lucene.store.NativeFSLockFactory@34fd4590),segFN=segments_1,generation=1,filenames=[segments_1]
[junit4:junit4]   2> 		commit{dir=MockDirWrapper(org.apache.lucene.store.MMapDirectory@/usr/home/hudson/hudson-slave/workspace/Lucene-Solr-NightlyTests-trunk/solr/build/solr-core/test/J1/OpenCloseCoreStressTest_/00019_core/data/index lockFactory=org.apache.lucene.store.NativeFSLockFactory@34fd4590),segFN=segments_2,generation=2,filenames=[_1.doc, _0.cbnd, _0.fnm, _0.cbnm, _1.fnm, _1.fdx, _1.fdt, _1.pos, _0.pos, _1.cbnm, _1.si, _0.tim, segments_2, _0.fdx, _0.si, _1.tip, _1.cbnd, _0.tip, _0.doc, _1.tim, _0.fdt]
[junit4:junit4]   2> 2104 T2223 C173 oasc.SolrDeletionPolicy.updateCommits newest commit = 2[_1.doc, _0.cbnd, _0.fnm, _0.cbnm, _1.fnm, _1.fdx, _1.fdt, _1.pos, _0.pos, _1.cbnm, _1.si, _0.tim, segments_2, _0.fdx, _0.si, _1.tip, _1.cbnd, _0.tip, _0.doc, _1.tim, _0.fdt]
[junit4:junit4]   2> 2107 T2223 oasc.SolrCore.closeSearcher [00019_core] Closing main searcher on request.
[junit4:junit4]   2> 2107 T2223 oasc.CachingDirectoryFactory.close Closing directory when closing factory: /usr/home/hudson/hudson-slave/workspace/Lucene-Solr-NightlyTests-trunk/solr/build/solr-core/test/J1/OpenCloseCoreStressTest_/00019_core/data/index
[junit4:junit4]   2> 2107 T2223 oasc.CachingDirectoryFactory.closeDirectory Closing directory: /usr/home/hudson/hudson-slave/workspace/Lucene-Solr-NightlyTests-trunk/solr/build/solr-core/test/J1/OpenCloseCoreStressTest_/00019_core/data/index
[junit4:junit4]   2> 2115 T2219 oashl.XMLLoader.init xsltCacheLifetimeSeconds=60
[junit4:junit4]   2> 2120 T2219 oasc.CachingDirectoryFactory.get return new directory for /usr/home/hudson/hudson-slave/workspace/Lucene-Solr-NightlyTests-trunk/solr/build/solr-core/test/J1/OpenCloseCoreStressTest_/00017_core/data/index forceNew: false
[junit4:junit4]   2> 2129 T2223 oasc.CachingDirectoryFactory.close Closing directory when closing factory: /usr/home/hudson/hudson-slave/workspace/Lucene-Solr-NightlyTests-trunk/solr/build/solr-core/test/J1/OpenCloseCoreStressTest_/00019_core/data
[junit4:junit4]   2> 2129 T2223 oasc.CachingDirectoryFactory.closeDirectory Closing directory: /usr/home/hudson/hudson-slave/workspace/Lucene-Solr-NightlyTests-trunk/solr/build/solr-core/test/J1/OpenCloseCoreStressTest_/00019_core/data
[junit4:junit4]   2> 2130 T2223 oasc.SolrCore.close [00012_core]  CLOSING SolrCore org.apache.solr.core.SolrCore@5dd4aa77
[junit4:junit4]   2> 2130 T2264 oasc.CoreContainer.create Creating SolrCore '00019_core' using instanceDir: /usr/home/hudson/hudson-slave/workspace/Lucene-Solr-NightlyTests-trunk/solr/build/solr-core/test/J1/./OpenCloseCoreStressTest_/00019_core
[junit4:junit4]   2> 2132 T2264 oasc.SolrResourceLoader.<init> new SolrResourceLoader for directory: '/usr/home/hudson/hudson-slave/workspace/Lucene-Solr-NightlyTests-trunk/solr/build/solr-core/test/J1/./OpenCloseCoreStressTest_/00019_core/'
[junit4:junit4]   2> 2133 T2223 oasu.DirectUpdateHandler2.close closing DirectUpdateHandler2{commits=0,autocommits=0,soft autocommits=0,optimizes=0,rollbacks=0,expungeDeletes=0,docsPending=2,adds=2,deletesById=0,deletesByQuery=0,errors=0,cumulative_adds=2,cumulative_deletesById=0,cumulative_deletesByQuery=0,cumulative_errors=0}
[junit4:junit4]   2> 2133 T2223 oasu.SolrCoreState.decrefSolrCoreState Closing SolrCoreState
[junit4:junit4]   2> 2133 T2223 oasu.DefaultSolrCoreState.closeIndexWriter SolrCoreState ref count has reached 0 - closing IndexWriter
[junit4:junit4]   2> 2133 T2223 oasu.DefaultSolrCoreState.closeIndexWriter closing IndexWriter with IndexWriterCloser
[junit4:junit4]   2> 2139 T2219 oass.SolrIndexSearcher.<init> Opening Searcher@26b0c4f1 main
[junit4:junit4]   2> 2140 T2219 oasc.SolrCore.registerSearcher [00017_core] Registered new searcher Searcher@26b0c4f1 main{StandardDirectoryReader(segments_2:5 _0(5.0):C2 _1(5.0):C1)}
[junit4:junit4]   2> 2141 T2219 oasu.CommitTracker.<init> Hard AutoCommit: disabled
[junit4:junit4]   2> 2141 T2219 oasu.CommitTracker.<init> Soft AutoCommit: disabled
[junit4:junit4]   2> 2147 T2219 oasc.CoreMaps.putTransientCore Opening transient core 00017_core
[junit4:junit4]   2> 2147 T2219 oasc.CoreContainer.registerCore registering core: 00017_core
[junit4:junit4]   2> 2151 T2259 oasc.SolrConfig.<init> Loaded SolrConfig: solrconfig-minimal.xml
[junit4:junit4]   2> 2152 T2259 oass.IndexSchema.readSchema Reading Solr Schema
[junit4:junit4]   2> ASYNC  NEW_CORE C188 name=00017_core org.apache.solr.core.SolrCore@6400a657
[junit4:junit4]   2> 2155 T2273 C188 REQ [00017_core] webapp=/solr path=/select params={q=*:*&wt=javabin&qt=/select&version=2} hits=3 status=0 QTime=0 
[junit4:junit4]   2> 2159 T2216 C188 oasc.SolrDeletionPolicy.onInit SolrDeletionPolicy.onInit: commits:num=1
[junit4:junit4]   2> 		commit{dir=MockDirWrapper(org.apache.lucene.store.NIOFSDirectory@/usr/home/hudson/hudson-slave/workspace/Lucene-Solr-NightlyTests-trunk/solr/build/solr-core/test/J1/OpenCloseCoreStressTest_/00017_core/data/index lockFactory=org.apache.lucene.store.NativeFSLockFactory@315c5913),segFN=segments_2,generation=2,filenames=[_1.doc, _0.cbnd, _0.fnm, _0.cbnm, _1.fnm, _1.fdx, _1.pos, _1.fdt, _0.pos, _1.cbnm, _1.si, _0.tim, segments_2, _0.fdx, _0.si, _1.cbnd, _1.tip, _0.doc, _0.tip, _1.tim, _0.fdt]
[junit4:junit4]   2> 2160 T2216 C188 oasc.SolrDeletionPolicy.updateCommits newest commit = 2[_1.doc, _0.cbnd, _0.fnm, _0.cbnm, _1.fnm, _1.fdx, _1.pos, _1.fdt, _0.pos, _1.cbnm, _1.si, _0.tim, segments_2, _0.fdx, _0.si, _1.cbnd, _1.tip, _0.doc, _0.tip, _1.tim, _0.fdt]
[junit4:junit4]   2> 2161 T2216 C188 UPDATE [00017_core] webapp=/solr path=/update params={wt=javabin&version=2} {add=[id95]} 0 8
[junit4:junit4]   2> 2162 T2218 C188 UPDATE [00017_core] webapp=/solr path=/update params={wt=javabin&version=2} {add=[id73]} 0 9
[junit4:junit4]   2> 2162 T2219 C188 UPDATE [00017_core] webapp=/solr path=/update params={wt=javabin&version=2} {add=[id65]} 0 5
[junit4:junit4]   2> 2164 T2259 oass.IndexSchema.readSchema Schema name=tiny
[junit4:junit4]   2> 2165 T2219 C188 UPDATE [00017_core] webapp=/solr path=/update params={wt=javabin&version=2} {add=[id99]} 0 0
[junit4:junit4]   2> 2178 T2223 C168 oasc.SolrDeletionPolicy.onCommit SolrDeletionPolicy.onCommit: commits:num=2
[junit4:junit4]   2> 		commit{dir=MockDirWrapper(org.apache.lucene.store.MMapDirectory@/usr/home/hudson/hudson-slave/workspace/Lucene-Solr-NightlyTests-trunk/solr/build/solr-core/test/J1/OpenCloseCoreStressTest_/00012_core/data/index lockFactory=org.apache.lucene.store.NativeFSLockFactory@5abe700d),segFN=segments_1,generation=1,filenames=[segments_1]
[junit4:junit4]   2> 		commit{dir=MockDirWrapper(org.apache.lucene.store.MMapDirectory@/usr/home/hudson/hudson-slave/workspace/Lucene-Solr-NightlyTests-trunk/solr/build/solr-core/test/J1/OpenCloseCoreStressTest_/00012_core/data/index lockFactory=org.apache.lucene.store.NativeFSLockFactory@5abe700d),segFN=segments_2,generation=2,filenames=[_0.cbnd, _0.fnm, _0.pos, _0.tim, segments_2, _0.fdx, _0.cbnm, _0.si, _0.doc, _0.tip, _0.fdt]
[junit4:junit4]   2> 2179 T2223 C168 oasc.SolrDeletionPolicy.updateCommits newest commit = 2[_0.cbnd, _0.fnm, _0.pos, _0.tim, segments_2, _0.fdx, _0.cbnm, _0.si, _0.doc, _0.tip, _0.fdt]
[junit4:junit4]   2> 2181 T2223 oasc.SolrCore.closeSearcher [00012_core] Closing main searcher on request.
[junit4:junit4]   2> 2181 T2223 oasc.CachingDirectoryFactory.close Closing directory when closing factory: /usr/home/hudson/hudson-slave/workspace/Lucene-Solr-NightlyTests-trunk/solr/build/solr-core/test/J1/OpenCloseCoreStressTest_/00012_core/data/index
[junit4:junit4]   2> 2181 T2223 oasc.CachingDirectoryFactory.closeDirectory Closing directory: /usr/home/hudson/hudson-slave/workspace/Lucene-Solr-NightlyTests-trunk/solr/build/solr-core/test/J1/OpenCloseCoreStressTest_/00012_core/data/index
[junit4:junit4]   2> 2190 T2259 oass.IndexSchema.readSchema unique key field: id
[junit4:junit4]   2> 2191 T2259 oasc.SolrCore.initDirectoryFactory org.apache.solr.core.MockFSDirectoryFactory
[junit4:junit4]   2> 2192 T2223 oasc.CachingDirectoryFactory.close Closing directory when closing factory: /usr/home/hudson/hudson-slave/workspace/Lucene-Solr-NightlyTests-trunk/solr/build/solr-core/test/J1/OpenCloseCoreStressTest_/00012_core/data
[junit4:junit4]   2> 2192 T2223 oasc.CachingDirectoryFactory.closeDirectory Closing directory: /usr/home/hudson/hudson-slave/workspace/Lucene-Solr-NightlyTests-trunk/solr/build/solr-core/test/J1/OpenCloseCoreStressTest_/00012_core/data
[junit4:junit4]   2> 2192 T2259 oasc.SolrCore.<init> [00001_core] Opening new SolrCore at /usr/home/hudson/hudson-slave/workspace/Lucene-Solr-NightlyTests-trunk/solr/build/solr-core/test/J1/./OpenCloseCoreStressTest_/00001_core/, dataDir=/usr/home/hudson/hudson-slave/workspace/Lucene-Solr-NightlyTests-trunk/solr/build/solr-core/test/J1/OpenCloseCoreStressTest_/00001_core/data/
[junit4:junit4]   2> 2192 T2259 oasc.JmxMonitoredMap.<init> JMX monitoring is enabled. Adding Solr mbeans to JMX Server: com.sun.jmx.mbeanserver.JmxMBeanServer@433d44fc
[junit4:junit4]   2> 2192 T2223 oasc.SolrCore.close [00000_core]  CLOSING SolrCore org.apache.solr.core.SolrCore@7116a40e
[junit4:junit4]   2> 2192 T2259 oasc.SolrCore.initDirectoryFactory org.apache.solr.core.MockFSDirectoryFactory
[junit4:junit4]   2> 2192 T2261 oasc.CoreContainer.create Creating SolrCore '00012_core' using instanceDir: /usr/home/hudson/hudson-slave/workspace/Lucene-Solr-NightlyTests-trunk/solr/build/solr-core/test/J1/./OpenCloseCoreStressTest_/00012_core
[junit4:junit4]   2> 2193 T2261 oasc.SolrResourceLoader.<init> new SolrResourceLoader for directory: '/usr/home/hudson/hudson-slave/workspace/Lucene-Solr-NightlyTests-trunk/solr/build/solr-core/test/J1/./OpenCloseCoreStressTest_/00012_core/'
[junit4:junit4]   2> 2193 T2259 oasc.CachingDirectoryFactory.get return new directory for /usr/home/hudson/hudson-slave/workspace/Lucene-Solr-NightlyTests-trunk/solr/build/solr-core/test/J1/OpenCloseCoreStressTest_/00001_core/data forceNew: false
[junit4:junit4]   2> 2194 T2259 oasc.SolrCore.getNewIndexDir New index directory detected: old=null new=/usr/home/hudson/hudson-slave/workspace/Lucene-Solr-NightlyTests-trunk/solr/build/solr-core/test/J1/OpenCloseCoreStressTest_/00001_core/data/index/
[junit4:junit4]   2> 2195 T2223 oasu.DirectUpdateHandler2.close closing DirectUpdateHandler2{commits=0,autocommits=0,soft autocommits=0,optimizes=0,rollbacks=0,expungeDeletes=0,docsPending=3,adds=3,deletesById=0,deletesByQuery=0,errors=0,cumulative_adds=3,cumulative_deletesById=0,cumulative_deletesByQuery=0,cumulative_errors=0}
[junit4:junit4]   2> 2195 T2223 oasu.SolrCoreState.decrefSolrCoreState Closing SolrCoreState
[junit4:junit4]   2> 2195 T2259 oasc.SolrCore.initWriters created json: solr.JSONResponseWriter
[junit4:junit4]   2> 2195 T2223 oasu.DefaultSolrCoreState.closeIndexWriter SolrCoreState ref count has reached 0 - closing IndexWriter
[junit4:junit4]   2> 2195 T2223 oasu.DefaultSolrCoreState.closeIndexWriter closing IndexWriter with IndexWriterCloser
[junit4:junit4]   2> 2196 T2259 oasc.RequestHandlers.initHandlersFromConfig created /admin/: solr.admin.AdminHandlers
[junit4:junit4]   2> 2197 T2259 oasc.RequestHandlers.initHandler

[...truncated too long message...]

slave/workspace/Lucene-Solr-NightlyTests-trunk/solr/build/solr-core/test/J1/OpenCloseCoreStressTest_/00008_core/data
[junit4:junit4]   2> 696875 T2213 oasc.CachingDirectoryFactory.closeDirectory Closing directory: /usr/home/hudson/hudson-slave/workspace/Lucene-Solr-NightlyTests-trunk/solr/build/solr-core/test/J1/OpenCloseCoreStressTest_/00008_core/data
[junit4:junit4]   2> 696876 T2213 oasc.SolrCore.close [00011_core]  CLOSING SolrCore org.apache.solr.core.SolrCore@4ae34338
[junit4:junit4]   2> 696881 T2213 oasu.DirectUpdateHandler2.close closing DirectUpdateHandler2{commits=7,autocommits=0,soft autocommits=6,optimizes=0,rollbacks=0,expungeDeletes=0,docsPending=0,adds=0,deletesById=0,deletesByQuery=0,errors=0,cumulative_adds=6418,cumulative_deletesById=0,cumulative_deletesByQuery=0,cumulative_errors=0}
[junit4:junit4]   2> 696881 T2213 oasu.SolrCoreState.decrefSolrCoreState Closing SolrCoreState
[junit4:junit4]   2> 696882 T2213 oasu.DefaultSolrCoreState.closeIndexWriter SolrCoreState ref count has reached 0 - closing IndexWriter
[junit4:junit4]   2> 696882 T2213 oasu.DefaultSolrCoreState.closeIndexWriter closing IndexWriter with IndexWriterCloser
[junit4:junit4]   2> 696884 T2213 oasc.SolrCore.closeSearcher [00011_core] Closing main searcher on request.
[junit4:junit4]   2> 696885 T2213 oasc.CachingDirectoryFactory.close Closing directory when closing factory: /usr/home/hudson/hudson-slave/workspace/Lucene-Solr-NightlyTests-trunk/solr/build/solr-core/test/J1/OpenCloseCoreStressTest_/00011_core/data
[junit4:junit4]   2> 696885 T2213 oasc.CachingDirectoryFactory.closeDirectory Closing directory: /usr/home/hudson/hudson-slave/workspace/Lucene-Solr-NightlyTests-trunk/solr/build/solr-core/test/J1/OpenCloseCoreStressTest_/00011_core/data
[junit4:junit4]   2> 696886 T2213 oasc.CachingDirectoryFactory.close Closing directory when closing factory: /usr/home/hudson/hudson-slave/workspace/Lucene-Solr-NightlyTests-trunk/solr/build/solr-core/test/J1/OpenCloseCoreStressTest_/00011_core/data/index
[junit4:junit4]   2> 696887 T2213 oasc.CachingDirectoryFactory.closeDirectory Closing directory: /usr/home/hudson/hudson-slave/workspace/Lucene-Solr-NightlyTests-trunk/solr/build/solr-core/test/J1/OpenCloseCoreStressTest_/00011_core/data/index
[junit4:junit4]   2> 696996 T2213 oasc.SolrCore.close [00001_core]  CLOSING SolrCore org.apache.solr.core.SolrCore@455909ef
[junit4:junit4]   2> 697000 T2213 oasu.DirectUpdateHandler2.close closing DirectUpdateHandler2{commits=6,autocommits=0,soft autocommits=5,optimizes=0,rollbacks=0,expungeDeletes=0,docsPending=0,adds=0,deletesById=0,deletesByQuery=0,errors=0,cumulative_adds=6410,cumulative_deletesById=0,cumulative_deletesByQuery=0,cumulative_errors=0}
[junit4:junit4]   2> 697001 T2213 oasu.SolrCoreState.decrefSolrCoreState Closing SolrCoreState
[junit4:junit4]   2> 697001 T2213 oasu.DefaultSolrCoreState.closeIndexWriter SolrCoreState ref count has reached 0 - closing IndexWriter
[junit4:junit4]   2> 697002 T2213 oasu.DefaultSolrCoreState.closeIndexWriter closing IndexWriter with IndexWriterCloser
[junit4:junit4]   2> 697014 T2213 C1918 oasc.SolrDeletionPolicy.onCommit SolrDeletionPolicy.onCommit: commits:num=2
[junit4:junit4]   2> 		commit{dir=MockDirWrapper(org.apache.lucene.store.NIOFSDirectory@/usr/home/hudson/hudson-slave/workspace/Lucene-Solr-NightlyTests-trunk/solr/build/solr-core/test/J1/OpenCloseCoreStressTest_/00001_core/data/index lockFactory=org.apache.lucene.store.NativeFSLockFactory@66190ddd),segFN=segments_2,generation=2,filenames=[_d.tim, _c.tim, _3.fdt, _k.fnm, _c.cbnd, _9.tip, _9.tim, _f.si, _c.si, _h.fdt, _f.cbnm, _c.tip, _h.fdx, _d.doc, _d.tip, _g.fdt, _g.fdx, _f.pos, _9.fdt, _9.fdx, _f.fdt, _f.fdx, _e.si, _c.cbnm, _3.si, _d.cbnd, _j.fdx, _d.cbnm, _j.fdt, _e.cbnm, _j.cbnm, _e.fdx, _3.fnm, _i.si, _e.pos, _i.pos, _e.fdt, _i.fdx, _k.cbnd, _i.fdt, _h.pos, _j.si, _9.fnm, _k.cbnm, _d.fdx, _3.fdx, _d.fdt, _c.fnm, _e.cbnd, _k.doc, _j.pos, _f.tip, _g.cbnd, _f.tim, _g.tim, _g.tip, _c.fdx, _9.pos, _i.cbnm, _c.fdt, _g.pos, _k.tim, _d.pos, _h.si, _k.tip, _9.si, _f.cbnd, _k.si, _e.fnm, _i.tip, _i.tim, _k.pos, _h.tip, _h.fnm, _h.tim, _3.doc, _d.fnm, _j.tip, _9.doc, _i.cbnd, _e.doc, _d.si, _g.cbnm, _c.doc, _j.tim, _h.cbnm, _j.cbnd, _g.si, _h.cbnd, _k.fdt, _3.tim, _9.cbnm, _k.fdx, _h.doc, _3.pos, _e.tim, _c.pos, _e.tip, _9.cbnd, _g.fnm, _g.doc, _j.doc, _f.doc, _i.doc, _3.cbnm, _3.cbnd, _f.fnm, _j.fnm, segments_2, _3.tip, _i.fnm]
[junit4:junit4]   2> 		commit{dir=MockDirWrapper(org.apache.lucene.store.NIOFSDirectory@/usr/home/hudson/hudson-slave/workspace/Lucene-Solr-NightlyTests-trunk/solr/build/solr-core/test/J1/OpenCloseCoreStressTest_/00001_core/data/index lockFactory=org.apache.lucene.store.NativeFSLockFactory@66190ddd),segFN=segments_3,generation=3,filenames=[_f.doc, _f.tip, _l.fnm, _l.si, _l.cbnm, _f.tim, _f.pos, _l.doc, _l.cbnd, _f.fdt, _f.si, _f.fdx, _f.fnm, _l.tip, _f.cbnm, _l.fdx, _l.tim, _l.fdt, _f.cbnd, _l.pos, segments_3]
[junit4:junit4]   2> 697014 T2213 C1918 oasc.SolrDeletionPolicy.updateCommits newest commit = 3[_f.doc, _f.tip, _l.fnm, _l.si, _l.cbnm, _f.tim, _f.pos, _l.doc, _l.cbnd, _f.fdt, _f.si, _f.fdx, _f.fnm, _l.tip, _f.cbnm, _l.fdx, _l.tim, _l.fdt, _f.cbnd, _l.pos, segments_3]
[junit4:junit4]   2> 697071 T2213 oasc.SolrCore.closeSearcher [00001_core] Closing main searcher on request.
[junit4:junit4]   2> 697097 T2213 oasc.CachingDirectoryFactory.close Closing directory when closing factory: /usr/home/hudson/hudson-slave/workspace/Lucene-Solr-NightlyTests-trunk/solr/build/solr-core/test/J1/OpenCloseCoreStressTest_/00001_core/data/index
[junit4:junit4]   2> 697098 T2213 oasc.CachingDirectoryFactory.closeDirectory Closing directory: /usr/home/hudson/hudson-slave/workspace/Lucene-Solr-NightlyTests-trunk/solr/build/solr-core/test/J1/OpenCloseCoreStressTest_/00001_core/data/index
[junit4:junit4]   2> 697132 T2213 oasc.CachingDirectoryFactory.close Closing directory when closing factory: /usr/home/hudson/hudson-slave/workspace/Lucene-Solr-NightlyTests-trunk/solr/build/solr-core/test/J1/OpenCloseCoreStressTest_/00001_core/data
[junit4:junit4]   2> 697132 T2213 oasc.CachingDirectoryFactory.closeDirectory Closing directory: /usr/home/hudson/hudson-slave/workspace/Lucene-Solr-NightlyTests-trunk/solr/build/solr-core/test/J1/OpenCloseCoreStressTest_/00001_core/data
[junit4:junit4]   2> 697133 T2213 oejsh.ContextHandler.doStop stopped o.e.j.s.ServletContextHandler{/solr,null}
[junit4:junit4]   2> 697783 T2213 oas.SolrTestCaseJ4.tearDown ###Ending test30SecondsOld
[junit4:junit4] IGNOR/A 0.00s J1 | OpenCloseCoreStressTest.test1HourNew
[junit4:junit4]    > Assumption #1: 'weekly' test group is disabled (@Weekly)
[junit4:junit4]   2> 697788 T2213 oas.SolrTestCaseJ4.deleteCore ###deleteCore
[junit4:junit4]   2> NOTE: test params are: codec=CheapBastard, sim=RandomSimilarityProvider(queryNorm=false,coord=crazy): {}, locale=da, timezone=Pacific/Rarotonga
[junit4:junit4]   2> NOTE: FreeBSD 9.0-RELEASE amd64/Oracle Corporation 1.7.0_17 (64-bit)/cpus=16,threads=1,free=268067320,total=529137664
[junit4:junit4]   2> NOTE: All tests run in this JVM: [TestMergePolicyConfig, TimeZoneUtilsTest, CurrencyFieldOpenExchangeTest, TestQuerySenderNoQuery, TestUpdate, TestQueryTypes, SampleTest, TestStressLucene, XsltUpdateRequestHandlerTest, SimplePostToolTest, TestJmxIntegration, TestSolrXMLSerializer, TestComponentsName, TestRecovery, DirectSolrSpellCheckerTest, SolrCmdDistributorTest, TestFiltering, OpenExchangeRatesOrgProviderTest, TestFieldResource, TestLMJelinekMercerSimilarityFactory, TestPostingsSolrHighlighter, DocValuesMultiTest, DisMaxRequestHandlerTest, TestWordDelimiterFilterFactory, ZkSolrClientTest, DOMUtilTest, TestSuggestSpellingConverter, TestNumberUtils, TestBM25SimilarityFactory, TestRandomFaceting, PingRequestHandlerTest, HighlighterTest, SignatureUpdateProcessorFactoryTest, TestAnalyzedSuggestions, EchoParamsTest, LeaderElectionIntegrationTest, SuggesterTSTTest, TestLazyCores, CollectionsAPIDistributedZkTest, TestBinaryField, SolrCoreCheckLockOnStartupTest, TestSolrJ, TestOmitPositions, SolrTestCaseJ4Test, TestUtils, TestFieldTypeResource, CopyFieldTest, SpellCheckCollatorTest, TestRangeQuery, TestDefaultSimilarityFactory, FileUtilsTest, TestHashPartitioner, TestCSVLoader, TestStressReorder, DefaultValueUpdateProcessorTest, OutputWriterTest, FieldAnalysisRequestHandlerTest, TestSystemIdResolver, NotRequiredUniqueKeyTest, ConvertedLegacyTest, SortByFunctionTest, SpellPossibilityIteratorTest, TestIndexSearcher, TestArbitraryIndexDir, ChaosMonkeySafeLeaderTest, BasicDistributedZk2Test, OpenCloseCoreStressTest]
[junit4:junit4] Completed on J1 in 697.82s, 6 tests, 1 failure, 2 skipped <<< FAILURES!

[...truncated 404 lines...]
BUILD FAILED
/usr/home/hudson/hudson-slave/workspace/Lucene-Solr-NightlyTests-trunk/build.xml:382: The following error occurred while executing this line:
/usr/home/hudson/hudson-slave/workspace/Lucene-Solr-NightlyTests-trunk/build.xml:355: The following error occurred while executing this line:
/usr/home/hudson/hudson-slave/workspace/Lucene-Solr-NightlyTests-trunk/build.xml:39: The following error occurred while executing this line:
/usr/home/hudson/hudson-slave/workspace/Lucene-Solr-NightlyTests-trunk/solr/build.xml:183: The following error occurred while executing this line:
/usr/home/hudson/hudson-slave/workspace/Lucene-Solr-NightlyTests-trunk/solr/common-build.xml:449: The following error occurred while executing this line:
/usr/home/hudson/hudson-slave/workspace/Lucene-Solr-NightlyTests-trunk/lucene/common-build.xml:1210: The following error occurred while executing this line:
/usr/home/hudson/hudson-slave/workspace/Lucene-Solr-NightlyTests-trunk/lucene/common-build.xml:874: There were test failures: 272 suites, 1144 tests, 1 failure, 25 ignored (6 assumptions)

Total time: 96 minutes 37 seconds
Build step 'Invoke Ant' marked build as failure
Archiving artifacts
Recording test results
Email was triggered for: Failure
Sending email for trigger: Failure



Mime
View raw message