lucene-dev mailing list archives

Site index · List index
Message view « Date » · « Thread »
Top « Date » · « Thread »
From Policeman Jenkins Server <jenk...@thetaphi.de>
Subject [JENKINS] Lucene-Solr-4.x-Linux (32bit/jdk1.6.0_41) - Build # 4799 - Failure!
Date Sun, 24 Mar 2013 02:18:31 GMT
Build: http://jenkins.thetaphi.de/job/Lucene-Solr-4.x-Linux/4799/
Java: 32bit/jdk1.6.0_41 -server -XX:+UseParallelGC

3 tests failed.
FAILED:  junit.framework.TestSuite.org.apache.lucene.index.sorter.TestSortingMergePolicy

Error Message:
Suite timeout exceeded (>= 7200000 msec).

Stack Trace:
java.lang.Exception: Suite timeout exceeded (>= 7200000 msec).
	at __randomizedtesting.SeedInfo.seed([F29F7C2CE206417F]:0)


FAILED:  junit.framework.TestSuite.org.apache.lucene.index.sorter.TestSortingMergePolicy

Error Message:
Captured an uncaught exception in thread: Thread[id=15, name=Lucene Merge Thread #0, state=RUNNABLE,
group=TGRP-TestSortingMergePolicy]

Stack Trace:
com.carrotsearch.randomizedtesting.UncaughtExceptionError: Captured an uncaught exception
in thread: Thread[id=15, name=Lucene Merge Thread #0, state=RUNNABLE, group=TGRP-TestSortingMergePolicy]
Caused by: org.apache.lucene.index.MergePolicy$MergeException: java.lang.AssertionError: info.dir=MockDirWrapper(org.apache.lucene.store.RAMDirectory@15b011c
lockFactory=org.apache.lucene.store.SingleInstanceLockFactory@1a5e65f) vs MockDirWrapper(RateLimitedDirectoryWrapper(org.apache.lucene.store.RAMDirectory@b79701
lockFactory=org.apache.lucene.store.SingleInstanceLockFactory@11adeb7))
	at __randomizedtesting.SeedInfo.seed([F29F7C2CE206417F]:0)
	at org.apache.lucene.index.ConcurrentMergeScheduler.handleMergeException(ConcurrentMergeScheduler.java:541)
	at org.apache.lucene.index.ConcurrentMergeScheduler$MergeThread.run(ConcurrentMergeScheduler.java:514)
Caused by: java.lang.AssertionError: info.dir=MockDirWrapper(org.apache.lucene.store.RAMDirectory@15b011c
lockFactory=org.apache.lucene.store.SingleInstanceLockFactory@1a5e65f) vs MockDirWrapper(RateLimitedDirectoryWrapper(org.apache.lucene.store.RAMDirectory@b79701
lockFactory=org.apache.lucene.store.SingleInstanceLockFactory@11adeb7))
	at org.apache.lucene.index.IndexWriter$ReaderPool.get(IndexWriter.java:531)
	at org.apache.lucene.index.IndexWriter.mergeMiddle(IndexWriter.java:3626)
	at org.apache.lucene.index.IndexWriter.merge(IndexWriter.java:3296)
	at org.apache.lucene.index.ConcurrentMergeScheduler.doMerge(ConcurrentMergeScheduler.java:401)
	at org.apache.lucene.index.ConcurrentMergeScheduler$MergeThread.run(ConcurrentMergeScheduler.java:478)


REGRESSION:  org.apache.lucene.index.sorter.TestSortingMergePolicy.testSortingMP

Error Message:
Test abandoned because suite timeout was reached.

Stack Trace:
java.lang.Exception: Test abandoned because suite timeout was reached.
	at __randomizedtesting.SeedInfo.seed([F29F7C2CE206417F]:0)




Build Log:
[...truncated 7033 lines...]
[junit4:junit4] Suite: org.apache.lucene.index.sorter.TestSortingMergePolicy
[junit4:junit4]   2> 24-Mar-2013 02:13:31 com.carrotsearch.randomizedtesting.RandomizedRunner$QueueUncaughtExceptionsHandler
uncaughtException
[junit4:junit4]   2> WARNING: Uncaught exception in thread: Thread[Lucene Merge Thread
#0,6,TGRP-TestSortingMergePolicy]
[junit4:junit4]   2> org.apache.lucene.index.MergePolicy$MergeException: java.lang.AssertionError:
info.dir=MockDirWrapper(org.apache.lucene.store.RAMDirectory@15b011c lockFactory=org.apache.lucene.store.SingleInstanceLockFactory@1a5e65f)
vs MockDirWrapper(RateLimitedDirectoryWrapper(org.apache.lucene.store.RAMDirectory@b79701
lockFactory=org.apache.lucene.store.SingleInstanceLockFactory@11adeb7))
[junit4:junit4]   2> 	at __randomizedtesting.SeedInfo.seed([F29F7C2CE206417F]:0)
[junit4:junit4]   2> 	at org.apache.lucene.index.ConcurrentMergeScheduler.handleMergeException(ConcurrentMergeScheduler.java:541)
[junit4:junit4]   2> 	at org.apache.lucene.index.ConcurrentMergeScheduler$MergeThread.run(ConcurrentMergeScheduler.java:514)
[junit4:junit4]   2> Caused by: java.lang.AssertionError: info.dir=MockDirWrapper(org.apache.lucene.store.RAMDirectory@15b011c
lockFactory=org.apache.lucene.store.SingleInstanceLockFactory@1a5e65f) vs MockDirWrapper(RateLimitedDirectoryWrapper(org.apache.lucene.store.RAMDirectory@b79701
lockFactory=org.apache.lucene.store.SingleInstanceLockFactory@11adeb7))
[junit4:junit4]   2> 	at org.apache.lucene.index.IndexWriter$ReaderPool.get(IndexWriter.java:531)
[junit4:junit4]   2> 	at org.apache.lucene.index.IndexWriter.mergeMiddle(IndexWriter.java:3626)
[junit4:junit4]   2> 	at org.apache.lucene.index.IndexWriter.merge(IndexWriter.java:3296)
[junit4:junit4]   2> 	at org.apache.lucene.index.ConcurrentMergeScheduler.doMerge(ConcurrentMergeScheduler.java:401)
[junit4:junit4]   2> 	at org.apache.lucene.index.ConcurrentMergeScheduler$MergeThread.run(ConcurrentMergeScheduler.java:478)
[junit4:junit4]   2> 24-Mar-2013 04:13:33 com.carrotsearch.randomizedtesting.ThreadLeakControl$2
evaluate
[junit4:junit4]   2> WARNING: Suite execution timed out: org.apache.lucene.index.sorter.TestSortingMergePolicy
[junit4:junit4]   2> ==== jstack at approximately timeout time ====
[junit4:junit4]   2> "TEST-TestSortingMergePolicy.testSortingMP-seed#[F29F7C2CE206417F]"
ID=14 TIMED_WAITING on org.apache.lucene.index.IndexWriter@4218cb
[junit4:junit4]   2> 	at java.lang.Object.wait(Native Method)
[junit4:junit4]   2> 	- timed waiting on org.apache.lucene.index.IndexWriter@4218cb
[junit4:junit4]   2> 	at org.apache.lucene.index.IndexWriter.doWait(IndexWriter.java:3907)
[junit4:junit4]   2> 	at org.apache.lucene.index.IndexWriter.forceMerge(IndexWriter.java:1684)
[junit4:junit4]   2> 	at org.apache.lucene.index.IndexWriter.forceMerge(IndexWriter.java:1610)
[junit4:junit4]   2> 	at org.apache.lucene.index.sorter.TestSortingMergePolicy.createRandomIndexes(TestSortingMergePolicy.java:83)
[junit4:junit4]   2> 	at org.apache.lucene.index.sorter.TestSortingMergePolicy.setUp(TestSortingMergePolicy.java:53)
[junit4:junit4]   2> 	at sun.reflect.NativeMethodAccessorImpl.invoke0(Native Method)
[junit4:junit4]   2> 	at sun.reflect.NativeMethodAccessorImpl.invoke(NativeMethodAccessorImpl.java:39)
[junit4:junit4]   2> 	at sun.reflect.DelegatingMethodAccessorImpl.invoke(DelegatingMethodAccessorImpl.java:25)
[junit4:junit4]   2> 	at java.lang.reflect.Method.invoke(Method.java:597)
[junit4:junit4]   2> 	at com.carrotsearch.randomizedtesting.RandomizedRunner.invoke(RandomizedRunner.java:1559)
[junit4:junit4]   2> 	at com.carrotsearch.randomizedtesting.RandomizedRunner.access$600(RandomizedRunner.java:79)
[junit4:junit4]   2> 	at com.carrotsearch.randomizedtesting.RandomizedRunner$7.evaluate(RandomizedRunner.java:771)
[junit4:junit4]   2> 	at com.carrotsearch.randomizedtesting.RandomizedRunner$8.evaluate(RandomizedRunner.java:787)
[junit4:junit4]   2> 	at org.apache.lucene.util.TestRuleSetupTeardownChained$1.evaluate(TestRuleSetupTeardownChained.java:50)
[junit4:junit4]   2> 	at org.apache.lucene.util.TestRuleFieldCacheSanity$1.evaluate(TestRuleFieldCacheSanity.java:51)
[junit4:junit4]   2> 	at org.apache.lucene.util.AbstractBeforeAfterRule$1.evaluate(AbstractBeforeAfterRule.java:46)
[junit4:junit4]   2> 	at com.carrotsearch.randomizedtesting.rules.SystemPropertiesInvariantRule$1.evaluate(SystemPropertiesInvariantRule.java:55)
[junit4:junit4]   2> 	at org.apache.lucene.util.TestRuleThreadAndTestName$1.evaluate(TestRuleThreadAndTestName.java:49)
[junit4:junit4]   2> 	at org.apache.lucene.util.TestRuleIgnoreAfterMaxFailures$1.evaluate(TestRuleIgnoreAfterMaxFailures.java:70)
[junit4:junit4]   2> 	at org.apache.lucene.util.TestRuleMarkFailure$1.evaluate(TestRuleMarkFailure.java:48)
[junit4:junit4]   2> 	at com.carrotsearch.randomizedtesting.rules.StatementAdapter.evaluate(StatementAdapter.java:36)
[junit4:junit4]   2> 	at com.carrotsearch.randomizedtesting.ThreadLeakControl$StatementRunner.run(ThreadLeakControl.java:358)
[junit4:junit4]   2> 	at com.carrotsearch.randomizedtesting.ThreadLeakControl.forkTimeoutingTask(ThreadLeakControl.java:782)
[junit4:junit4]   2> 	at com.carrotsearch.randomizedtesting.ThreadLeakControl$3.evaluate(ThreadLeakControl.java:442)
[junit4:junit4]   2> 	at com.carrotsearch.randomizedtesting.RandomizedRunner.runSingleTest(RandomizedRunner.java:746)
[junit4:junit4]   2> 	at com.carrotsearch.randomizedtesting.RandomizedRunner$3.evaluate(RandomizedRunner.java:648)
[junit4:junit4]   2> 	at com.carrotsearch.randomizedtesting.RandomizedRunner$4.evaluate(RandomizedRunner.java:682)
[junit4:junit4]   2> 	at com.carrotsearch.randomizedtesting.RandomizedRunner$5.evaluate(RandomizedRunner.java:693)
[junit4:junit4]   2> 	at org.apache.lucene.util.AbstractBeforeAfterRule$1.evaluate(AbstractBeforeAfterRule.java:46)
[junit4:junit4]   2> 	at org.apache.lucene.util.TestRuleStoreClassName$1.evaluate(TestRuleStoreClassName.java:42)
[junit4:junit4]   2> 	at com.carrotsearch.randomizedtesting.rules.SystemPropertiesInvariantRule$1.evaluate(SystemPropertiesInvariantRule.java:55)
[junit4:junit4]   2> 	at com.carrotsearch.randomizedtesting.rules.NoShadowingOrOverridesOnMethodsRule$1.evaluate(NoShadowingOrOverridesOnMethodsRule.java:39)
[junit4:junit4]   2> 	at com.carrotsearch.randomizedtesting.rules.NoShadowingOrOverridesOnMethodsRule$1.evaluate(NoShadowingOrOverridesOnMethodsRule.java:39)
[junit4:junit4]   2> 	at com.carrotsearch.randomizedtesting.rules.StatementAdapter.evaluate(StatementAdapter.java:36)
[junit4:junit4]   2> 	at org.apache.lucene.util.TestRuleAssertionsRequired$1.evaluate(TestRuleAssertionsRequired.java:43)
[junit4:junit4]   2> 	at org.apache.lucene.util.TestRuleMarkFailure$1.evaluate(TestRuleMarkFailure.java:48)
[junit4:junit4]   2> 	at org.apache.lucene.util.TestRuleIgnoreAfterMaxFailures$1.evaluate(TestRuleIgnoreAfterMaxFailures.java:70)
[junit4:junit4]   2> 	at org.apache.lucene.util.TestRuleIgnoreTestSuites$1.evaluate(TestRuleIgnoreTestSuites.java:55)
[junit4:junit4]   2> 	at com.carrotsearch.randomizedtesting.rules.StatementAdapter.evaluate(StatementAdapter.java:36)
[junit4:junit4]   2> 	at com.carrotsearch.randomizedtesting.ThreadLeakControl$StatementRunner.run(ThreadLeakControl.java:358)
[junit4:junit4]   2> 	at java.lang.Thread.run(Thread.java:662)
[junit4:junit4]   2> 
[junit4:junit4]   2> "SUITE-TestSortingMergePolicy-seed#[F29F7C2CE206417F]" ID=13 RUNNABLE
[junit4:junit4]   2> 	at sun.management.ThreadImpl.dumpThreads0(Native Method)
[junit4:junit4]   2> 	at sun.management.ThreadImpl.dumpAllThreads(ThreadImpl.java:433)
[junit4:junit4]   2> 	at com.carrotsearch.randomizedtesting.ThreadLeakControl.formatThreadStacksFull(ThreadLeakControl.java:655)
[junit4:junit4]   2> 	at com.carrotsearch.randomizedtesting.ThreadLeakControl.access$800(ThreadLeakControl.java:60)
[junit4:junit4]   2> 	at com.carrotsearch.randomizedtesting.ThreadLeakControl$2.evaluate(ThreadLeakControl.java:396)
[junit4:junit4]   2> 	- locked java.lang.Object@169c6f2
[junit4:junit4]   2> 	at com.carrotsearch.randomizedtesting.RandomizedRunner.runSuite(RandomizedRunner.java:556)
[junit4:junit4]   2> 	at com.carrotsearch.randomizedtesting.RandomizedRunner.access$200(RandomizedRunner.java:79)
[junit4:junit4]   2> 	at com.carrotsearch.randomizedtesting.RandomizedRunner$1.run(RandomizedRunner.java:492)
[junit4:junit4]   2> 
[junit4:junit4]   2> "Signal Dispatcher" ID=4 RUNNABLE
[junit4:junit4]   2> 
[junit4:junit4]   2> "Finalizer" ID=3 WAITING on java.lang.ref.ReferenceQueue$Lock@1843ca4
[junit4:junit4]   2> 	at java.lang.Object.wait(Native Method)
[junit4:junit4]   2> 	- waiting on java.lang.ref.ReferenceQueue$Lock@1843ca4
[junit4:junit4]   2> 	at java.lang.ref.ReferenceQueue.remove(ReferenceQueue.java:118)
[junit4:junit4]   2> 	at java.lang.ref.ReferenceQueue.remove(ReferenceQueue.java:134)
[junit4:junit4]   2> 	at java.lang.ref.Finalizer$FinalizerThread.run(Finalizer.java:159)
[junit4:junit4]   2> 
[junit4:junit4]   2> "Reference Handler" ID=2 WAITING on java.lang.ref.Reference$Lock@a96606
[junit4:junit4]   2> 	at java.lang.Object.wait(Native Method)
[junit4:junit4]   2> 	- waiting on java.lang.ref.Reference$Lock@a96606
[junit4:junit4]   2> 	at java.lang.Object.wait(Object.java:485)
[junit4:junit4]   2> 	at java.lang.ref.Reference$ReferenceHandler.run(Reference.java:116)
[junit4:junit4]   2> 
[junit4:junit4]   2> "main" ID=1 WAITING on com.carrotsearch.randomizedtesting.RandomizedRunner$1@1ba1d9
[junit4:junit4]   2> 	at java.lang.Object.wait(Native Method)
[junit4:junit4]   2> 	- waiting on com.carrotsearch.randomizedtesting.RandomizedRunner$1@1ba1d9
[junit4:junit4]   2> 	at java.lang.Thread.join(Thread.java:1186)
[junit4:junit4]   2> 	at java.lang.Thread.join(Thread.java:1239)
[junit4:junit4]   2> 	at com.carrotsearch.randomizedtesting.RandomizedRunner.runSuite(RandomizedRunner.java:502)
[junit4:junit4]   2> 	at com.carrotsearch.randomizedtesting.RandomizedRunner.run(RandomizedRunner.java:399)
[junit4:junit4]   2> 	at com.carrotsearch.ant.tasks.junit4.slave.SlaveMain.execute(SlaveMain.java:180)
[junit4:junit4]   2> 	at com.carrotsearch.ant.tasks.junit4.slave.SlaveMain.main(SlaveMain.java:275)
[junit4:junit4]   2> 	at com.carrotsearch.ant.tasks.junit4.slave.SlaveMainSafe.main(SlaveMainSafe.java:12)
[junit4:junit4]   2> 
[junit4:junit4]   2> ^^==============================================
[junit4:junit4]   2> 
[junit4:junit4]   2> NOTE: reproduce with: ant test  -Dtestcase=TestSortingMergePolicy
-Dtests.method=testSortingMP -Dtests.seed=F29F7C2CE206417F -Dtests.multiplier=3 -Dtests.slow=true
-Dtests.locale=en_IE -Dtests.timezone=Asia/Istanbul -Dtests.file.encoding=UTF-8
[junit4:junit4] ERROR   7204s J0 | TestSortingMergePolicy.testSortingMP <<<
[junit4:junit4]    > Throwable #1: java.lang.Exception: Test abandoned because suite timeout
was reached.
[junit4:junit4]    > 	at __randomizedtesting.SeedInfo.seed([F29F7C2CE206417F]:0)
[junit4:junit4]   2> 24-Mar-2013 04:13:34 com.carrotsearch.randomizedtesting.ThreadLeakControl
checkThreadLeaks
[junit4:junit4]   2> WARNING: Will linger awaiting termination of 1 leaked thread(s).
[junit4:junit4]   2> 24-Mar-2013 04:13:54 com.carrotsearch.randomizedtesting.ThreadLeakControl
checkThreadLeaks
[junit4:junit4]   2> SEVERE: 1 thread leaked from SUITE scope at org.apache.lucene.index.sorter.TestSortingMergePolicy:

[junit4:junit4]   2>    1) Thread[id=14, name=TEST-TestSortingMergePolicy.testSortingMP-seed#[F29F7C2CE206417F],
state=TIMED_WAITING, group=TGRP-TestSortingMergePolicy]
[junit4:junit4]   2>         at java.lang.Object.wait(Native Method)
[junit4:junit4]   2>         at org.apache.lucene.index.IndexWriter.doWait(IndexWriter.java:3907)
[junit4:junit4]   2>         at org.apache.lucene.index.IndexWriter.forceMerge(IndexWriter.java:1684)
[junit4:junit4]   2>         at org.apache.lucene.index.IndexWriter.forceMerge(IndexWriter.java:1610)
[junit4:junit4]   2>         at org.apache.lucene.index.sorter.TestSortingMergePolicy.createRandomIndexes(TestSortingMergePolicy.java:83)
[junit4:junit4]   2>         at org.apache.lucene.index.sorter.TestSortingMergePolicy.setUp(TestSortingMergePolicy.java:53)
[junit4:junit4]   2>         at sun.reflect.NativeMethodAccessorImpl.invoke0(Native Method)
[junit4:junit4]   2>         at sun.reflect.NativeMethodAccessorImpl.invoke(NativeMethodAccessorImpl.java:39)
[junit4:junit4]   2>         at sun.reflect.DelegatingMethodAccessorImpl.invoke(DelegatingMethodAccessorImpl.java:25)
[junit4:junit4]   2>         at java.lang.reflect.Method.invoke(Method.java:597)
[junit4:junit4]   2>         at com.carrotsearch.randomizedtesting.RandomizedRunner.invoke(RandomizedRunner.java:1559)
[junit4:junit4]   2>         at com.carrotsearch.randomizedtesting.RandomizedRunner.access$600(RandomizedRunner.java:79)
[junit4:junit4]   2>         at com.carrotsearch.randomizedtesting.RandomizedRunner$7.evaluate(RandomizedRunner.java:771)
[junit4:junit4]   2>         at com.carrotsearch.randomizedtesting.RandomizedRunner$8.evaluate(RandomizedRunner.java:787)
[junit4:junit4]   2>         at org.apache.lucene.util.TestRuleSetupTeardownChained$1.evaluate(TestRuleSetupTeardownChained.java:50)
[junit4:junit4]   2>         at org.apache.lucene.util.TestRuleFieldCacheSanity$1.evaluate(TestRuleFieldCacheSanity.java:51)
[junit4:junit4]   2>         at org.apache.lucene.util.AbstractBeforeAfterRule$1.evaluate(AbstractBeforeAfterRule.java:46)
[junit4:junit4]   2>         at com.carrotsearch.randomizedtesting.rules.SystemPropertiesInvariantRule$1.evaluate(SystemPropertiesInvariantRule.java:55)
[junit4:junit4]   2>         at org.apache.lucene.util.TestRuleThreadAndTestName$1.evaluate(TestRuleThreadAndTestName.java:49)
[junit4:junit4]   2>         at org.apache.lucene.util.TestRuleIgnoreAfterMaxFailures$1.evaluate(TestRuleIgnoreAfterMaxFailures.java:70)
[junit4:junit4]   2>         at org.apache.lucene.util.TestRuleMarkFailure$1.evaluate(TestRuleMarkFailure.java:48)
[junit4:junit4]   2>         at com.carrotsearch.randomizedtesting.rules.StatementAdapter.evaluate(StatementAdapter.java:36)
[junit4:junit4]   2>         at com.carrotsearch.randomizedtesting.ThreadLeakControl$StatementRunner.run(ThreadLeakControl.java:358)
[junit4:junit4]   2>         at com.carrotsearch.randomizedtesting.ThreadLeakControl.forkTimeoutingTask(ThreadLeakControl.java:782)
[junit4:junit4]   2>         at com.carrotsearch.randomizedtesting.ThreadLeakControl$3.evaluate(ThreadLeakControl.java:442)
[junit4:junit4]   2>         at com.carrotsearch.randomizedtesting.RandomizedRunner.runSingleTest(RandomizedRunner.java:746)
[junit4:junit4]   2>         at com.carrotsearch.randomizedtesting.RandomizedRunner$3.evaluate(RandomizedRunner.java:648)
[junit4:junit4]   2>         at com.carrotsearch.randomizedtesting.RandomizedRunner$4.evaluate(RandomizedRunner.java:682)
[junit4:junit4]   2>         at com.carrotsearch.randomizedtesting.RandomizedRunner$5.evaluate(RandomizedRunner.java:693)
[junit4:junit4]   2>         at org.apache.lucene.util.AbstractBeforeAfterRule$1.evaluate(AbstractBeforeAfterRule.java:46)
[junit4:junit4]   2>         at org.apache.lucene.util.TestRuleStoreClassName$1.evaluate(TestRuleStoreClassName.java:42)
[junit4:junit4]   2>         at com.carrotsearch.randomizedtesting.rules.SystemPropertiesInvariantRule$1.evaluate(SystemPropertiesInvariantRule.java:55)
[junit4:junit4]   2>         at com.carrotsearch.randomizedtesting.rules.NoShadowingOrOverridesOnMethodsRule$1.evaluate(NoShadowingOrOverridesOnMethodsRule.java:39)
[junit4:junit4]   2>         at com.carrotsearch.randomizedtesting.rules.NoShadowingOrOverridesOnMethodsRule$1.evaluate(NoShadowingOrOverridesOnMethodsRule.java:39)
[junit4:junit4]   2>         at com.carrotsearch.randomizedtesting.rules.StatementAdapter.evaluate(StatementAdapter.java:36)
[junit4:junit4]   2>         at org.apache.lucene.util.TestRuleAssertionsRequired$1.evaluate(TestRuleAssertionsRequired.java:43)
[junit4:junit4]   2>         at org.apache.lucene.util.TestRuleMarkFailure$1.evaluate(TestRuleMarkFailure.java:48)
[junit4:junit4]   2>         at org.apache.lucene.util.TestRuleIgnoreAfterMaxFailures$1.evaluate(TestRuleIgnoreAfterMaxFailures.java:70)
[junit4:junit4]   2>         at org.apache.lucene.util.TestRuleIgnoreTestSuites$1.evaluate(TestRuleIgnoreTestSuites.java:55)
[junit4:junit4]   2>         at com.carrotsearch.randomizedtesting.rules.StatementAdapter.evaluate(StatementAdapter.java:36)
[junit4:junit4]   2>         at com.carrotsearch.randomizedtesting.ThreadLeakControl$StatementRunner.run(ThreadLeakControl.java:358)
[junit4:junit4]   2>         at java.lang.Thread.run(Thread.java:662)
[junit4:junit4]   2> 24-Mar-2013 04:13:54 com.carrotsearch.randomizedtesting.ThreadLeakControl
tryToInterruptAll
[junit4:junit4]   2> INFO: Starting to interrupt leaked threads:
[junit4:junit4]   2>    1) Thread[id=14, name=TEST-TestSortingMergePolicy.testSortingMP-seed#[F29F7C2CE206417F],
state=TIMED_WAITING, group=TGRP-TestSortingMergePolicy]
[junit4:junit4]   2> 24-Mar-2013 04:13:54 com.carrotsearch.randomizedtesting.ThreadLeakControl
tryToInterruptAll
[junit4:junit4]   2> INFO: All leaked threads terminated.
[junit4:junit4]   2> NOTE: test params are: codec=SimpleText, sim=DefaultSimilarity, locale=en_IE,
timezone=Asia/Istanbul
[junit4:junit4]   2> NOTE: Linux 3.2.0-39-generic i386/Sun Microsystems Inc. 1.6.0_41 (32-bit)/cpus=8,threads=1,free=62309664,total=177471488
[junit4:junit4]   2> NOTE: All tests run in this JVM: [TestHighFreqTerms, TestLazyDocument,
TestSortingMergePolicy]
[junit4:junit4]   2> NOTE: reproduce with: ant test  -Dtestcase=TestSortingMergePolicy
-Dtests.seed=F29F7C2CE206417F -Dtests.multiplier=3 -Dtests.slow=true -Dtests.locale=en_IE
-Dtests.timezone=Asia/Istanbul -Dtests.file.encoding=UTF-8
[junit4:junit4] ERROR   0.00s J0 | TestSortingMergePolicy (suite) <<<
[junit4:junit4]    > Throwable #1: java.lang.Exception: Suite timeout exceeded (>= 7200000
msec).
[junit4:junit4]    > 	at __randomizedtesting.SeedInfo.seed([F29F7C2CE206417F]:0)
[junit4:junit4]    > Throwable #2: com.carrotsearch.randomizedtesting.UncaughtExceptionError:
Captured an uncaught exception in thread: Thread[id=15, name=Lucene Merge Thread #0, state=RUNNABLE,
group=TGRP-TestSortingMergePolicy]
[junit4:junit4]    > Caused by: org.apache.lucene.index.MergePolicy$MergeException: java.lang.AssertionError:
info.dir=MockDirWrapper(org.apache.lucene.store.RAMDirectory@15b011c lockFactory=org.apache.lucene.store.SingleInstanceLockFactory@1a5e65f)
vs MockDirWrapper(RateLimitedDirectoryWrapper(org.apache.lucene.store.RAMDirectory@b79701
lockFactory=org.apache.lucene.store.SingleInstanceLockFactory@11adeb7))
[junit4:junit4]    > 	at __randomizedtesting.SeedInfo.seed([F29F7C2CE206417F]:0)
[junit4:junit4]    > 	at org.apache.lucene.index.ConcurrentMergeScheduler.handleMergeException(ConcurrentMergeScheduler.java:541)
[junit4:junit4]    > 	at org.apache.lucene.index.ConcurrentMergeScheduler$MergeThread.run(ConcurrentMergeScheduler.java:514)
[junit4:junit4]    > Caused by: java.lang.AssertionError: info.dir=MockDirWrapper(org.apache.lucene.store.RAMDirectory@15b011c
lockFactory=org.apache.lucene.store.SingleInstanceLockFactory@1a5e65f) vs MockDirWrapper(RateLimitedDirectoryWrapper(org.apache.lucene.store.RAMDirectory@b79701
lockFactory=org.apache.lucene.store.SingleInstanceLockFactory@11adeb7))
[junit4:junit4]    > 	at org.apache.lucene.index.IndexWriter$ReaderPool.get(IndexWriter.java:531)
[junit4:junit4]    > 	at org.apache.lucene.index.IndexWriter.mergeMiddle(IndexWriter.java:3626)
[junit4:junit4]    > 	at org.apache.lucene.index.IndexWriter.merge(IndexWriter.java:3296)
[junit4:junit4]    > 	at org.apache.lucene.index.ConcurrentMergeScheduler.doMerge(ConcurrentMergeScheduler.java:401)
[junit4:junit4]    > 	at org.apache.lucene.index.ConcurrentMergeScheduler$MergeThread.run(ConcurrentMergeScheduler.java:478)
[junit4:junit4] Completed on J0 in 7224.21s, 1 test, 3 errors <<< FAILURES!

[...truncated 11 lines...]
BUILD FAILED
/mnt/ssd/jenkins/workspace/Lucene-Solr-4.x-Linux/build.xml:381: The following error occurred
while executing this line:
/mnt/ssd/jenkins/workspace/Lucene-Solr-4.x-Linux/build.xml:361: The following error occurred
while executing this line:
/mnt/ssd/jenkins/workspace/Lucene-Solr-4.x-Linux/build.xml:39: The following error occurred
while executing this line:
/mnt/ssd/jenkins/workspace/Lucene-Solr-4.x-Linux/lucene/build.xml:548: The following error
occurred while executing this line:
/mnt/ssd/jenkins/workspace/Lucene-Solr-4.x-Linux/lucene/common-build.xml:1756: The following
error occurred while executing this line:
/mnt/ssd/jenkins/workspace/Lucene-Solr-4.x-Linux/lucene/module-build.xml:61: The following
error occurred while executing this line:
/mnt/ssd/jenkins/workspace/Lucene-Solr-4.x-Linux/lucene/common-build.xml:1212: The following
error occurred while executing this line:
/mnt/ssd/jenkins/workspace/Lucene-Solr-4.x-Linux/lucene/common-build.xml:876: There were test
failures: 10 suites, 39 tests, 2 suite-level errors, 1 error, 2 ignored (2 assumptions)

Total time: 141 minutes 53 seconds
Build step 'Invoke Ant' marked build as failure
Archiving artifacts
Recording test results
Description set: Java: 32bit/jdk1.6.0_41 -server -XX:+UseParallelGC
Email was triggered for: Failure
Sending email for trigger: Failure



Mime
View raw message