lucene-dev mailing list archives

Site index · List index
Message view « Date » · « Thread »
Top « Date » · « Thread »
From Apache Jenkins Server <jenk...@builds.apache.org>
Subject [JENKINS] Lucene-Solr-Tests-4.x-java7 - Build # 1090 - Failure
Date Sat, 23 Mar 2013 06:32:52 GMT
Build: https://builds.apache.org/job/Lucene-Solr-Tests-4.x-java7/1090/

1 tests failed.
REGRESSION:  org.apache.solr.update.SoftAutoCommitTest.testSoftAndHardCommitMaxTimeDelete

Error Message:
Got a hard commit we weren't expecting

Stack Trace:
java.lang.AssertionError: Got a hard commit we weren't expecting
	at __randomizedtesting.SeedInfo.seed([172D0E63F7D8C007:D061B6FEEC700DB7]:0)
	at org.junit.Assert.fail(Assert.java:93)
	at org.junit.Assert.assertTrue(Assert.java:43)
	at org.junit.Assert.assertNull(Assert.java:551)
	at org.apache.solr.update.SoftAutoCommitTest.testSoftAndHardCommitMaxTimeDelete(SoftAutoCommitTest.java:279)
	at sun.reflect.NativeMethodAccessorImpl.invoke0(Native Method)
	at sun.reflect.NativeMethodAccessorImpl.invoke(NativeMethodAccessorImpl.java:57)
	at sun.reflect.DelegatingMethodAccessorImpl.invoke(DelegatingMethodAccessorImpl.java:43)
	at java.lang.reflect.Method.invoke(Method.java:601)
	at com.carrotsearch.randomizedtesting.RandomizedRunner.invoke(RandomizedRunner.java:1559)
	at com.carrotsearch.randomizedtesting.RandomizedRunner.access$600(RandomizedRunner.java:79)
	at com.carrotsearch.randomizedtesting.RandomizedRunner$6.evaluate(RandomizedRunner.java:737)
	at com.carrotsearch.randomizedtesting.RandomizedRunner$7.evaluate(RandomizedRunner.java:773)
	at com.carrotsearch.randomizedtesting.RandomizedRunner$8.evaluate(RandomizedRunner.java:787)
	at com.carrotsearch.randomizedtesting.rules.SystemPropertiesRestoreRule$1.evaluate(SystemPropertiesRestoreRule.java:53)
	at org.apache.lucene.util.TestRuleSetupTeardownChained$1.evaluate(TestRuleSetupTeardownChained.java:50)
	at org.apache.lucene.util.TestRuleFieldCacheSanity$1.evaluate(TestRuleFieldCacheSanity.java:51)
	at org.apache.lucene.util.AbstractBeforeAfterRule$1.evaluate(AbstractBeforeAfterRule.java:46)
	at com.carrotsearch.randomizedtesting.rules.SystemPropertiesInvariantRule$1.evaluate(SystemPropertiesInvariantRule.java:55)
	at org.apache.lucene.util.TestRuleThreadAndTestName$1.evaluate(TestRuleThreadAndTestName.java:49)
	at org.apache.lucene.util.TestRuleIgnoreAfterMaxFailures$1.evaluate(TestRuleIgnoreAfterMaxFailures.java:70)
	at org.apache.lucene.util.TestRuleMarkFailure$1.evaluate(TestRuleMarkFailure.java:48)
	at com.carrotsearch.randomizedtesting.rules.StatementAdapter.evaluate(StatementAdapter.java:36)
	at com.carrotsearch.randomizedtesting.ThreadLeakControl$StatementRunner.run(ThreadLeakControl.java:358)
	at com.carrotsearch.randomizedtesting.ThreadLeakControl.forkTimeoutingTask(ThreadLeakControl.java:782)
	at com.carrotsearch.randomizedtesting.ThreadLeakControl$3.evaluate(ThreadLeakControl.java:442)
	at com.carrotsearch.randomizedtesting.RandomizedRunner.runSingleTest(RandomizedRunner.java:746)
	at com.carrotsearch.randomizedtesting.RandomizedRunner$3.evaluate(RandomizedRunner.java:648)
	at com.carrotsearch.randomizedtesting.RandomizedRunner$4.evaluate(RandomizedRunner.java:682)
	at com.carrotsearch.randomizedtesting.RandomizedRunner$5.evaluate(RandomizedRunner.java:693)
	at com.carrotsearch.randomizedtesting.rules.StatementAdapter.evaluate(StatementAdapter.java:36)
	at com.carrotsearch.randomizedtesting.rules.SystemPropertiesRestoreRule$1.evaluate(SystemPropertiesRestoreRule.java:53)
	at org.apache.lucene.util.AbstractBeforeAfterRule$1.evaluate(AbstractBeforeAfterRule.java:46)
	at org.apache.lucene.util.TestRuleStoreClassName$1.evaluate(TestRuleStoreClassName.java:42)
	at com.carrotsearch.randomizedtesting.rules.SystemPropertiesInvariantRule$1.evaluate(SystemPropertiesInvariantRule.java:55)
	at com.carrotsearch.randomizedtesting.rules.NoShadowingOrOverridesOnMethodsRule$1.evaluate(NoShadowingOrOverridesOnMethodsRule.java:39)
	at com.carrotsearch.randomizedtesting.rules.NoShadowingOrOverridesOnMethodsRule$1.evaluate(NoShadowingOrOverridesOnMethodsRule.java:39)
	at com.carrotsearch.randomizedtesting.rules.StatementAdapter.evaluate(StatementAdapter.java:36)
	at org.apache.lucene.util.TestRuleAssertionsRequired$1.evaluate(TestRuleAssertionsRequired.java:43)
	at org.apache.lucene.util.TestRuleMarkFailure$1.evaluate(TestRuleMarkFailure.java:48)
	at org.apache.lucene.util.TestRuleIgnoreAfterMaxFailures$1.evaluate(TestRuleIgnoreAfterMaxFailures.java:70)
	at org.apache.lucene.util.TestRuleIgnoreTestSuites$1.evaluate(TestRuleIgnoreTestSuites.java:55)
	at com.carrotsearch.randomizedtesting.rules.StatementAdapter.evaluate(StatementAdapter.java:36)
	at com.carrotsearch.randomizedtesting.ThreadLeakControl$StatementRunner.run(ThreadLeakControl.java:358)
	at java.lang.Thread.run(Thread.java:722)




Build Log:
[...truncated 9114 lines...]
[junit4:junit4] Suite: org.apache.solr.update.SoftAutoCommitTest
[junit4:junit4]   2> 1 T568 oas.SolrTestCaseJ4.initCore ####initCore
[junit4:junit4]   2> Creating dataDir: /usr/home/hudson/hudson-slave/workspace/Lucene-Solr-Tests-4.x-java7/solr/build/solr-core/test/J0/./solrtest-SoftAutoCommitTest-1364019288036
[junit4:junit4]   2> 2 T568 oasc.SolrResourceLoader.<init> new SolrResourceLoader for directory: '/usr/home/hudson/hudson-slave/workspace/Lucene-Solr-Tests-4.x-java7/solr/build/solr-core/test-files/solr/collection1/'
[junit4:junit4]   2> 4 T568 oasc.SolrResourceLoader.replaceClassLoader Adding 'file:/usr/home/hudson/hudson-slave/workspace/Lucene-Solr-Tests-4.x-java7/solr/build/solr-core/test-files/solr/collection1/lib/README' to classloader
[junit4:junit4]   2> 4 T568 oasc.SolrResourceLoader.replaceClassLoader Adding 'file:/usr/home/hudson/hudson-slave/workspace/Lucene-Solr-Tests-4.x-java7/solr/build/solr-core/test-files/solr/collection1/lib/classes/' to classloader
[junit4:junit4]   2> 91 T568 oasc.SolrConfig.<init> Using Lucene MatchVersion: LUCENE_43
[junit4:junit4]   2> 165 T568 oasc.SolrConfig.<init> Loaded SolrConfig: solrconfig.xml
[junit4:junit4]   2> 166 T568 oass.IndexSchema.readSchema Reading Solr Schema
[junit4:junit4]   2> 173 T568 oass.IndexSchema.readSchema Schema name=test
[junit4:junit4]   2> 762 T568 oass.OpenExchangeRatesOrgProvider.init Initialized with rates=open-exchange-rates.json, refreshInterval=1440.
[junit4:junit4]   2> 770 T568 oass.IndexSchema.readSchema default search field in schema is text
[junit4:junit4]   2> 773 T568 oass.IndexSchema.readSchema unique key field: id
[junit4:junit4]   2> 782 T568 oass.FileExchangeRateProvider.reload Reloading exchange rates from file currency.xml
[junit4:junit4]   2> 785 T568 oass.FileExchangeRateProvider.reload Reloading exchange rates from file currency.xml
[junit4:junit4]   2> 788 T568 oass.OpenExchangeRatesOrgProvider.reload Reloading exchange rates from open-exchange-rates.json
[junit4:junit4]   2> 789 T568 oass.OpenExchangeRatesOrgProvider$OpenExchangeRates.<init> WARNING Unknown key IMPORTANT NOTE
[junit4:junit4]   2> 789 T568 oass.OpenExchangeRatesOrgProvider$OpenExchangeRates.<init> WARNING Expected key, got STRING
[junit4:junit4]   2> 790 T568 oass.OpenExchangeRatesOrgProvider.reload Reloading exchange rates from open-exchange-rates.json
[junit4:junit4]   2> 790 T568 oass.OpenExchangeRatesOrgProvider$OpenExchangeRates.<init> WARNING Unknown key IMPORTANT NOTE
[junit4:junit4]   2> 790 T568 oass.OpenExchangeRatesOrgProvider$OpenExchangeRates.<init> WARNING Expected key, got STRING
[junit4:junit4]   2> 791 T568 oasc.SolrResourceLoader.locateSolrHome JNDI not configured for solr (NoInitialContextEx)
[junit4:junit4]   2> 791 T568 oasc.SolrResourceLoader.locateSolrHome using system property solr.solr.home: /usr/home/hudson/hudson-slave/workspace/Lucene-Solr-Tests-4.x-java7/solr/build/solr-core/test-files/solr
[junit4:junit4]   2> 791 T568 oasc.SolrResourceLoader.<init> new SolrResourceLoader for directory: '/usr/home/hudson/hudson-slave/workspace/Lucene-Solr-Tests-4.x-java7/solr/build/solr-core/test-files/solr/'
[junit4:junit4]   2> 802 T568 oasc.CoreContainer.<init> New CoreContainer 297261607
[junit4:junit4]   2> 802 T568 oasc.SolrCore.initDirectoryFactory org.apache.solr.core.MockDirectoryFactory
[junit4:junit4]   2> 802 T568 oasc.SolrCore.<init> [collection1] Opening new SolrCore at /usr/home/hudson/hudson-slave/workspace/Lucene-Solr-Tests-4.x-java7/solr/build/solr-core/test-files/solr/collection1/, dataDir=/usr/home/hudson/hudson-slave/workspace/Lucene-Solr-Tests-4.x-java7/solr/build/solr-core/test/J0/./solrtest-SoftAutoCommitTest-1364019288036/
[junit4:junit4]   2> 803 T568 oasc.JmxMonitoredMap.<init> JMX monitoring is enabled. Adding Solr mbeans to JMX Server: com.sun.jmx.mbeanserver.JmxMBeanServer@3d0360b8
[junit4:junit4]   2> 803 T568 oasc.SolrCore.initDirectoryFactory org.apache.solr.core.MockDirectoryFactory
[junit4:junit4]   2> 804 T568 oasc.CachingDirectoryFactory.get return new directory for /usr/home/hudson/hudson-slave/workspace/Lucene-Solr-Tests-4.x-java7/solr/build/solr-core/test/J0/./solrtest-SoftAutoCommitTest-1364019288036
[junit4:junit4]   2> 804 T568 oasc.SolrCore.getNewIndexDir New index directory detected: old=null new=/usr/home/hudson/hudson-slave/workspace/Lucene-Solr-Tests-4.x-java7/solr/build/solr-core/test/J0/./solrtest-SoftAutoCommitTest-1364019288036/index/
[junit4:junit4]   2> 804 T568 oasc.SolrCore.initIndex WARNING [collection1] Solr index directory '/usr/home/hudson/hudson-slave/workspace/Lucene-Solr-Tests-4.x-java7/solr/build/solr-core/test/J0/./solrtest-SoftAutoCommitTest-1364019288036/index' doesn't exist. Creating new index...
[junit4:junit4]   2> 805 T568 oasc.CachingDirectoryFactory.get return new directory for /usr/home/hudson/hudson-slave/workspace/Lucene-Solr-Tests-4.x-java7/solr/build/solr-core/test/J0/./solrtest-SoftAutoCommitTest-1364019288036/index
[junit4:junit4]   2> 806 T568 oasc.SolrDeletionPolicy.onCommit SolrDeletionPolicy.onCommit: commits:num=1
[junit4:junit4]   2> 		commit{dir=RateLimitedDirectoryWrapper(MockDirWrapper(org.apache.lucene.store.RAMDirectory@1bba1616 lockFactory=org.apache.lucene.store.NativeFSLockFactory@2640dab3)),segFN=segments_1,generation=1,filenames=[segments_1]
[junit4:junit4]   2> 807 T568 oasc.SolrDeletionPolicy.updateCommits newest commit = 1[segments_1]
[junit4:junit4]   2> 807 T568 oasc.SolrCore.initWriters created xml: solr.XMLResponseWriter
[junit4:junit4]   2> 809 T568 oasup.UpdateRequestProcessorChain.init inserting DistributedUpdateProcessorFactory into updateRequestProcessorChain "dedupe"
[junit4:junit4]   2> 809 T568 oasup.UpdateRequestProcessorChain.init inserting DistributedUpdateProcessorFactory into updateRequestProcessorChain "dedupe-allfields"
[junit4:junit4]   2> 810 T568 oasup.UpdateRequestProcessorChain.init inserting DistributedUpdateProcessorFactory into updateRequestProcessorChain "stored_sig"
[junit4:junit4]   2> 810 T568 oasup.UpdateRequestProcessorChain.init inserting DistributedUpdateProcessorFactory into updateRequestProcessorChain "uniq-fields"
[junit4:junit4]   2> 811 T568 oasup.UpdateRequestProcessorChain.init inserting DistributedUpdateProcessorFactory into updateRequestProcessorChain "distrib-dup-test-chain-implicit"
[junit4:junit4]   2> 811 T568 oasc.RequestHandlers.initHandlersFromConfig adding lazy requestHandler: solr.ReplicationHandler
[junit4:junit4]   2> 811 T568 oasc.RequestHandlers.initHandlersFromConfig created /replication: solr.ReplicationHandler
[junit4:junit4]   2> 812 T568 oasc.RequestHandlers.initHandlersFromConfig created standard: solr.StandardRequestHandler
[junit4:junit4]   2> 812 T568 oasc.RequestHandlers.initHandlersFromConfig created /get: solr.RealTimeGetHandler
[junit4:junit4]   2> 813 T568 oasc.RequestHandlers.initHandlersFromConfig created dismax: solr.SearchHandler
[junit4:junit4]   2> 813 T568 oasc.RequestHandlers.initHandlersFromConfig created mock: org.apache.solr.core.MockQuerySenderListenerReqHandler
[junit4:junit4]   2> 813 T568 oasc.RequestHandlers.initHandlersFromConfig created /admin/: org.apache.solr.handler.admin.AdminHandlers
[junit4:junit4]   2> 814 T568 oasc.RequestHandlers.initHandlersFromConfig created defaults: solr.StandardRequestHandler
[junit4:junit4]   2> 814 T568 oasc.RequestHandlers.initHandlersFromConfig adding lazy requestHandler: solr.StandardRequestHandler
[junit4:junit4]   2> 814 T568 oasc.RequestHandlers.initHandlersFromConfig created lazy: solr.StandardRequestHandler
[junit4:junit4]   2> 815 T568 oasc.RequestHandlers.initHandlersFromConfig created /update: solr.UpdateRequestHandler
[junit4:junit4]   2> 815 T568 oasc.RequestHandlers.initHandlersFromConfig created /terms: org.apache.solr.handler.component.SearchHandler
[junit4:junit4]   2> 815 T568 oasc.RequestHandlers.initHandlersFromConfig created spellCheckCompRH: org.apache.solr.handler.component.SearchHandler
[junit4:junit4]   2> 816 T568 oasc.RequestHandlers.initHandlersFromConfig created spellCheckCompRH_Direct: org.apache.solr.handler.component.SearchHandler
[junit4:junit4]   2> 816 T568 oasc.RequestHandlers.initHandlersFromConfig created spellCheckWithWordbreak: org.apache.solr.handler.component.SearchHandler
[junit4:junit4]   2> 817 T568 oasc.RequestHandlers.initHandlersFromConfig created spellCheckWithWordbreak_Direct: org.apache.solr.handler.component.SearchHandler
[junit4:junit4]   2> 817 T568 oasc.RequestHandlers.initHandlersFromConfig created spellCheckCompRH1: org.apache.solr.handler.component.SearchHandler
[junit4:junit4]   2> 817 T568 oasc.RequestHandlers.initHandlersFromConfig created mltrh: org.apache.solr.handler.component.SearchHandler
[junit4:junit4]   2> 818 T568 oasc.RequestHandlers.initHandlersFromConfig created tvrh: org.apache.solr.handler.component.SearchHandler
[junit4:junit4]   2> 818 T568 oasc.RequestHandlers.initHandlersFromConfig created /mlt: solr.MoreLikeThisHandler
[junit4:junit4]   2> 819 T568 oasc.RequestHandlers.initHandlersFromConfig created /debug/dump: solr.DumpRequestHandler
[junit4:junit4]   2> 827 T568 oashl.XMLLoader.init xsltCacheLifetimeSeconds=60
[junit4:junit4]   2> 831 T568 oasc.SolrCore.initDeprecatedSupport WARNING solrconfig.xml uses deprecated <admin/gettableFiles>, Please update your config to use the ShowFileRequestHandler.
[junit4:junit4]   2> 832 T568 oasc.SolrCore.initDeprecatedSupport WARNING adding ShowFileRequestHandler with hidden files: [THROW.ERROR.ON.ADD.UPDATEPROCESSOR.JS, SOLRCONFIG-HIGHLIGHT.XML, SCHEMA-REQUIRED-FIELDS.XML, SCHEMA-REPLICATION2.XML, TRIVIAL.UPDATEPROCESSOR1.JS, BAD-SCHEMA-DUP-DYNAMICFIELD.XML, BAD-SCHEMA-DOCVALUES-NOT-REQUIRED-NO-DEFAULT.XML, SCHEMA-MINIMAL.XML, SOLRCONFIG-CACHING.XML, SCHEMA-POSTINGSHIGHLIGHT.XML, SOLRCONFIG-REPEATER.XML, REGEX-BOOST-PROCESSOR-TEST.TXT, BAD-SCHEMA-CURRENCY-FT-BOGUS-CODE-IN-XML.XML, CURRENCY.XML, SOLRCONFIG-MERGEPOLICY.XML, BAD-SCHEMA-NONTEXT-ANALYZER.XML, SOLRCONFIG-TLOG.XML, SOLRCONFIG-MASTER.XML, SOLRCONFIG-COMPONENTS-NAME.XML, BAD-SCHEMA-UNIQUEKEY-MULTIVALUED.XML, SCHEMA11.XML, SOLRCONFIG-BASIC.XML, DA_COMPOUNDDICTIONARY.TXT, MISSLEADING.EXTENSION.UPDATEPROCESSOR.JS.TXT, SCHEMA-COPYFIELD-TEST.XML, SOLRCONFIG-SLAVE.XML, SOLRCONFIG-PROPINJECT-INDEXDEFAULT.XML, ELEVATE.XML, TRIVIAL.UPDATEPROCESSOR0.JS, SCHEMA-SWEETSPOT.XML, BAD-SOLRCONFIG-BOGUS-SCRIPTENGINE-NAME.XML, SCHEMA-IB.XML, SCHEMA-CHARFILTERS.XML, SOLRCONFIG-QUERYSENDER.XML, DA_UTF8.XML, SCHEMA-REPLICATION1.XML, SOLRCONFIG-SNIPPET-PROCESSOR.XML, CONDITIONAL.UPDATEPROCESSOR.JS, SCHEMA-TINY.XML, MISSING.FUNCTIONS.UPDATEPROCESSOR.JS, SOLRCONFIG-ENABLEPLUGIN.XML, HYPHENATION.DTD, STEMDICT.TXT, SCHEMA-PHRASESUGGEST.XML, HUNSPELL-TEST.AFF, BAD-SCHEMA-CURRENCY-FT-OER-NORATES.XML, SCHEMA-SNIPPET-TYPE.XML, STOPTYPES-1.TXT, STOPWORDSWRONGENCODING.TXT, SCHEMA-NUMERIC.XML, SOLRCONFIG-TRANSFORMERS.XML, SOLRCONFIG-PROPINJECT.XML, BAD-SCHEMA-NOT-INDEXED-BUT-TF.XML, SOLRCONFIG-SIMPLELOCK.XML, SCHEMA-DOCVALUES.XML, WDFTYPES.TXT, SCHEMA-REVERSED.XML, STOPTYPES-2.TXT, BAD-SCHEMA-CURRENCY-FT-MULTIVALUED.XML, SOLRCONFIG-SPELLCHECKCOMPONENT.XML, BAD-SCHEMA-CURRENCY-MULTIVALUED.XML, SCHEMA-DFR.XML, SOLRCONFIG-PHRASESUGGEST.XML, BAD-SCHEMA-NOT-INDEXED-BUT-POS.XML, KEEP-1.TXT, OPEN-EXCHANGE-RATES.JSON, SCHEMA-SPATIAL.XML, STOPWITHBOM.TXT, SOLRCONFIG-SPELLCHECKER.XML, SOLRCONFIG-POSTINGSHIGHLIGHT.XML, SCHEMA-BINARYFIELD.XML, SOLRCONFIG-UPDATE-PROCESSOR-CHAINS.XML, BAD-SCHEMA-OMIT-TF-BUT-NOT-POS.XML, BAD-SCHEMA-DUP-FIELDTYPE.XML, SCHEMA-XINCLUDE.XML, SOLRCONFIG-MASTER1.XML, SCHEMA-BEHAVIOR.XML, SYNONYMS.TXT, SOLRCONFIG-MINIMAL.XML, SCHEMA-DOCVALUESMULTI.XML, BAD-SCHEMA-CURRENCY-DYNAMIC-MULTIVALUED.XML, BAD-SCHEMA-UNSUPPORTED-DOCVALUES.XML, SCHEMA_CODEC.XML, BAD-SCHEMA-SWEETSPOT-PARTIAL-HYPERBOLIC.XML, SOLRCONFIG-SOLR-749.XML, SOLRCONFIG-MASTER1-KEEPONEBACKUP.XML, SCHEMA-EFF.XML, STOP-2.TXT, SOLRCONFIG-FUNCTIONQUERY.XML, SCHEMA-LMDIRICHLET.XML, SOLRCONFIG-TERMINDEX.XML, BAD-SCHEMA-SWEETSPOT-PARTIAL-NORMS.XML, SOLRCONFIG-ELEVATE.XML, BAD-SCHEMA-SWEETSPOT-PARTIAL-BASELINE.XML, STOPWORDS.TXT, SCHEMA-FOLDING.XML, SCHEMA-STOP-KEEP.XML, FUZZYSUGGEST.TXT, BAD-SCHEMA-NOT-INDEXED-BUT-NORMS.XML, SCHEMA-REST.XML, SOLRCONFIG-SOLCOREPROPERTIES.XML, STOP-1.TXT, SOLRCONFIG-MASTER2.XML, SCHEMA-SPELLCHECKER.XML, SOLRCONFIG-RESPONSE-LOG-COMPONENT.XML, SOLRCONFIG-LAZYWRITER.XML, SCHEMA-LUCENEMATCHVERSION.XML, BAD-MP-SOLRCONFIG.XML, FRENCHARTICLES.TXT, SCHEMA15.XML, SOLRCONFIG-REQHANDLER.INCL, SCHEMASURROUND.XML, SCHEMA-COLLATEFILTER.XML, SOLRCONFIG-MASTER3.XML, HUNSPELL-TEST.DIC, BAD-SCHEMA-CODEC-GLOBAL-VS-FT-MISMATCH.XML, SOLRCONFIG-XINCLUDE.XML, SOLRCONFIG-SLAVE1.XML, SOLRCONFIG-DELPOLICY1.XML, SCHEMA-SIM.XML, SCHEMA-SNIPPET-FIELD.XML, SCHEMA-COLLATE.XML, STOP-SNOWBALL.TXT, BAD-SCHEMA-SIM-GLOBAL-VS-FT-MISMATCH.XML, PROTWORDS.TXT, SCHEMA-TRIE.XML, SOLRCONFIG_CODEC.XML, SCHEMA-SYNONYM-TOKENIZER.XML, BAD-SOLRCONFIG-INVALID-SCRIPTFILE.XML, JASUGGEST.TXT, SCHEMA-DOCVALUESFACETING.XML, SCHEMA-TFIDF.XML, SOLRCONFIG-SCRIPT-UPDATEPROCESSOR.XML, SCHEMA-LMJELINEKMERCER.XML, PHRASESUGGEST.TXT, BAD-SOLRCONFIG-MISSING-SCRIPTFILE.XML, SOLRCONFIG-BASIC-LUCENEVERSION31.XML, BAD-SCHEMA-UNIQUEKEY-USES-DEFAULT.XML, OLD_SYNONYMS.TXT, SOLRCONFIG-DELPOLICY2.XML, SOLRCONFIG-NATIVELOCK.XML, XSLT, BAD-SCHEMA-DUP-FIELD.XML, SOLRCONFIG-NOCACHE.XML, SCHEMA-BM25.XML, BAD-SCHEMA-SWEETSPOT-BOTH-TF.XML, ADDFIELDS.UPDATEPROCESSOR.JS, SOLRCONFIG-ALTDIRECTORY.XML, SOLRCONFIG-QUERYSENDER-NOQUERY.XML, COMPOUNDDICTIONARY.TXT, BAD-SCHEMA-CURRENCY-FT-BOGUS-DEFAULT-CODE.XML, BAD-CURRENCY.XML, SOLRCONFIG-INDEXCONFIG.XML, SOLRCONFIG_PERF.XML, SCHEMA-NOT-REQUIRED-UNIQUE-KEY.XML, BAD-SCHEMA-ANALYZER-CLASS-AND-NESTED.XML, KEEP-2.TXT, SCHEMA12.XML, BAD-SCHEMA-UNIQUEKEY-IS-COPYFIELD-DEST.XML, MAPPING-ISOLATIN1ACCENT.TXT, BAD_SOLRCONFIG.XML, BAD-SCHEMA-EXTERNAL-FILEFIELD.XML]
[junit4:junit4]   2> 835 T568 oass.SolrIndexSearcher.<init> Opening Searcher@4e7ae3d main
[junit4:junit4]   2> 835 T568 oasu.CommitTracker.<init> Hard AutoCommit: disabled
[junit4:junit4]   2> 836 T568 oasu.CommitTracker.<init> Soft AutoCommit: disabled
[junit4:junit4]   2> 836 T568 oashc.SpellCheckComponent.inform Initializing spell checkers
[junit4:junit4]   2> 842 T568 oass.DirectSolrSpellChecker.init init: {name=direct,classname=DirectSolrSpellChecker,field=lowerfilt,minQueryLength=3}
[junit4:junit4]   2> 901 T569 oasc.SolrCore.registerSearcher [collection1] Registered new searcher Searcher@4e7ae3d main{StandardDirectoryReader(segments_1:1)}
[junit4:junit4]   2> 905 T568 oasc.CoreContainer.registerCore registering core: collection1
[junit4:junit4]   2> 913 T568 oas.SolrTestCaseJ4.initCore ####initCore end
[junit4:junit4]   2> 917 T568 oas.SolrTestCaseJ4.setUp ###Starting testSoftAndHardCommitMaxTimeMixedAdds
[junit4:junit4]   2> 917 T568 oasc.CoreContainer.reload Reloading SolrCore 'collection1' using instanceDir: /usr/home/hudson/hudson-slave/workspace/Lucene-Solr-Tests-4.x-java7/solr/build/solr-core/test-files/solr/collection1
[junit4:junit4]   2> 918 T568 oasc.SolrResourceLoader.<init> new SolrResourceLoader for directory: '/usr/home/hudson/hudson-slave/workspace/Lucene-Solr-Tests-4.x-java7/solr/build/solr-core/test-files/solr/collection1/'
[junit4:junit4]   2> 918 T568 oasc.SolrResourceLoader.replaceClassLoader Adding 'file:/usr/home/hudson/hudson-slave/workspace/Lucene-Solr-Tests-4.x-java7/solr/build/solr-core/test-files/solr/collection1/lib/README' to classloader
[junit4:junit4]   2> 919 T568 oasc.SolrResourceLoader.replaceClassLoader Adding 'file:/usr/home/hudson/hudson-slave/workspace/Lucene-Solr-Tests-4.x-java7/solr/build/solr-core/test-files/solr/collection1/lib/classes/' to classloader
[junit4:junit4]   2> 976 T568 oasc.SolrConfig.<init> Using Lucene MatchVersion: LUCENE_43
[junit4:junit4]   2> 1026 T568 oasc.SolrConfig.<init> Loaded SolrConfig: solrconfig.xml
[junit4:junit4]   2> 1027 T568 oass.IndexSchema.readSchema Reading Solr Schema
[junit4:junit4]   2> 1032 T568 oass.IndexSchema.readSchema Schema name=test
[junit4:junit4]   2> 1551 T568 oass.OpenExchangeRatesOrgProvider.init Initialized with rates=open-exchange-rates.json, refreshInterval=1440.
[junit4:junit4]   2> 1560 T568 oass.IndexSchema.readSchema default search field in schema is text
[junit4:junit4]   2> 1563 T568 oass.IndexSchema.readSchema unique key field: id
[junit4:junit4]   2> 1571 T568 oass.FileExchangeRateProvider.reload Reloading exchange rates from file currency.xml
[junit4:junit4]   2> 1575 T568 oass.FileExchangeRateProvider.reload Reloading exchange rates from file currency.xml
[junit4:junit4]   2> 1578 T568 oass.OpenExchangeRatesOrgProvider.reload Reloading exchange rates from open-exchange-rates.json
[junit4:junit4]   2> 1579 T568 oass.OpenExchangeRatesOrgProvider$OpenExchangeRates.<init> WARNING Unknown key IMPORTANT NOTE
[junit4:junit4]   2> 1579 T568 oass.OpenExchangeRatesOrgProvider$OpenExchangeRates.<init> WARNING Expected key, got STRING
[junit4:junit4]   2> 1579 T568 oass.OpenExchangeRatesOrgProvider.reload Reloading exchange rates from open-exchange-rates.json
[junit4:junit4]   2> 1580 T568 oass.OpenExchangeRatesOrgProvider$OpenExchangeRates.<init> WARNING Unknown key IMPORTANT NOTE
[junit4:junit4]   2> 1580 T568 oass.OpenExchangeRatesOrgProvider$OpenExchangeRates.<init> WARNING Expected key, got STRING
[junit4:junit4]   2> 1580 T568 oasc.SolrCore.<init> [collection1] Opening new SolrCore at /usr/home/hudson/hudson-slave/workspace/Lucene-Solr-Tests-4.x-java7/solr/build/solr-core/test-files/solr/collection1/, dataDir=/usr/home/hudson/hudson-slave/workspace/Lucene-Solr-Tests-4.x-java7/solr/build/solr-core/test/J0/./solrtest-SoftAutoCommitTest-1364019288036/
[junit4:junit4]   2> 1581 T568 oasc.JmxMonitoredMap.<init> JMX monitoring is enabled. Adding Solr mbeans to JMX Server: com.sun.jmx.mbeanserver.JmxMBeanServer@3d0360b8
[junit4:junit4]   2> 1581 T568 oasc.SolrCore.getNewIndexDir New index directory detected: old=null new=/usr/home/hudson/hudson-slave/workspace/Lucene-Solr-Tests-4.x-java7/solr/build/solr-core/test/J0/./solrtest-SoftAutoCommitTest-1364019288036/index/
[junit4:junit4]   2> 1582 T568 oasc.SolrCore.initWriters created xml: solr.XMLResponseWriter
[junit4:junit4]   2> 1583 T568 oasup.UpdateRequestProcessorChain.init inserting DistributedUpdateProcessorFactory into updateRequestProcessorChain "dedupe"
[junit4:junit4]   2> 1584 T568 oasup.UpdateRequestProcessorChain.init inserting DistributedUpdateProcessorFactory into updateRequestProcessorChain "dedupe-allfields"
[junit4:junit4]   2> 1584 T568 oasup.UpdateRequestProcessorChain.init inserting DistributedUpdateProcessorFactory into updateRequestProcessorChain "stored_sig"
[junit4:junit4]   2> 1584 T568 oasup.UpdateRequestProcessorChain.init inserting DistributedUpdateProcessorFactory into updateRequestProcessorChain "uniq-fields"
[junit4:junit4]   2> 1585 T568 oasup.UpdateRequestProcessorChain.init inserting DistributedUpdateProcessorFactory into updateRequestProcessorChain "distrib-dup-test-chain-implicit"
[junit4:junit4]   2> 1585 T568 oasc.RequestHandlers.initHandlersFromConfig adding lazy requestHandler: solr.ReplicationHandler
[junit4:junit4]   2> 1585 T568 oasc.RequestHandlers.initHandlersFromConfig created /replication: solr.ReplicationHandler
[junit4:junit4]   2> 1586 T568 oasc.RequestHandlers.initHandlersFromConfig created standard: solr.StandardRequestHandler
[junit4:junit4]   2> 1586 T568 oasc.RequestHandlers.initHandlersFromConfig created /get: solr.RealTimeGetHandler
[junit4:junit4]   2> 1587 T568 oasc.RequestHandlers.initHandlersFromConfig created dismax: solr.SearchHandler
[junit4:junit4]   2> 1588 T568 oasc.RequestHandlers.initHandlersFromConfig created mock: org.apache.solr.core.MockQuerySenderListenerReqHandler
[junit4:junit4]   2> 1588 T568 oasc.RequestHandlers.initHandlersFromConfig created /admin/: org.apache.solr.handler.admin.AdminHandlers
[junit4:junit4]   2> 1588 T568 oasc.RequestHandlers.initHandlersFromConfig created defaults: solr.StandardRequestHandler
[junit4:junit4]   2> 1589 T568 oasc.RequestHandlers.initHandlersFromConfig adding lazy requestHandler: solr.StandardRequestHandler
[junit4:junit4]   2> 1589 T568 oasc.RequestHandlers.initHandlersFromConfig created lazy: solr.StandardRequestHandler
[junit4:junit4]   2> 1589 T568 oasc.RequestHandlers.initHandlersFromConfig created /update: solr.UpdateRequestHandler
[junit4:junit4]   2> 1590 T568 oasc.RequestHandlers.initHandlersFromConfig created /terms: org.apache.solr.handler.component.SearchHandler
[junit4:junit4]   2> 1590 T568 oasc.RequestHandlers.initHandlersFromConfig created spellCheckCompRH: org.apache.solr.handler.component.SearchHandler
[junit4:junit4]   2> 1591 T568 oasc.RequestHandlers.initHandlersFromConfig created spellCheckCompRH_Direct: org.apache.solr.handler.component.SearchHandler
[junit4:junit4]   2> 1591 T568 oasc.RequestHandlers.initHandlersFromConfig created spellCheckWithWordbreak: org.apache.solr.handler.component.SearchHandler
[junit4:junit4]   2> 1592 T568 oasc.RequestHandlers.initHandlersFromConfig created spellCheckWithWordbreak_Direct: org.apache.solr.handler.component.SearchHandler
[junit4:junit4]   2> 1592 T568 oasc.RequestHandlers.initHandlersFromConfig created spellCheckCompRH1: org.apache.solr.handler.component.SearchHandler
[junit4:junit4]   2> 1593 T568 oasc.RequestHandlers.initHandlersFromConfig created mltrh: org.apache.solr.handler.component.SearchHandler
[junit4:junit4]   2> 1593 T568 oasc.RequestHandlers.initHandlersFromConfig created tvrh: org.apache.solr.handler.component.SearchHandler
[junit4:junit4]   2> 1594 T568 oasc.RequestHandlers.initHandlersFromConfig created /mlt: solr.MoreLikeThisHandler
[junit4:junit4]   2> 1594 T568 oasc.RequestHandlers.initHandlersFromConfig created /debug/dump: solr.DumpRequestHandler
[junit4:junit4]   2> 1596 T568 oashl.XMLLoader.init xsltCacheLifetimeSeconds=60
[junit4:junit4]   2> 1598 T568 oasc.SolrCore.initDeprecatedSupport WARNING solrconfig.xml uses deprecated <admin/gettableFiles>, Please update your config to use the ShowFileRequestHandler.
[junit4:junit4]   2> 1599 T568 oasc.SolrCore.initDeprecatedSupport WARNING adding ShowFileRequestHandler with hidden files: [THROW.ERROR.ON.ADD.UPDATEPROCESSOR.JS, SOLRCONFIG-HIGHLIGHT.XML, SCHEMA-REQUIRED-FIELDS.XML, SCHEMA-REPLICATION2.XML, TRIVIAL.UPDATEPROCESSOR1.JS, BAD-SCHEMA-DUP-DYNAMICFIELD.XML, BAD-SCHEMA-DOCVALUES-NOT-REQUIRED-NO-DEFAULT.XML, SCHEMA-MINIMAL.XML, SOLRCONFIG-CACHING.XML, SCHEMA-POSTINGSHIGHLIGHT.XML, SOLRCONFIG-REPEATER.XML, REGEX-BOOST-PROCESSOR-TEST.TXT, BAD-SCHEMA-CURRENCY-FT-BOGUS-CODE-IN-XML.XML, CURRENCY.XML, SOLRCONFIG-MERGEPOLICY.XML, BAD-SCHEMA-NONTEXT-ANALYZER.XML, SOLRCONFIG-TLOG.XML, SOLRCONFIG-MASTER.XML, SOLRCONFIG-COMPONENTS-NAME.XML, BAD-SCHEMA-UNIQUEKEY-MULTIVALUED.XML, SCHEMA11.XML, SOLRCONFIG-BASIC.XML, DA_COMPOUNDDICTIONARY.TXT, MISSLEADING.EXTENSION.UPDATEPROCESSOR.JS.TXT, SCHEMA-COPYFIELD-TEST.XML, SOLRCONFIG-SLAVE.XML, SOLRCONFIG-PROPINJECT-INDEXDEFAULT.XML, ELEVATE.XML, TRIVIAL.UPDATEPROCESSOR0.JS, SCHEMA-SWEETSPOT.XML, BAD-SOLRCONFIG-BOGUS-SCRIPTENGINE-NAME.XML, SCHEMA-IB.XML, SCHEMA-CHARFILTERS.XML, SOLRCONFIG-QUERYSENDER.XML, DA_UTF8.XML, SCHEMA-REPLICATION1.XML, SOLRCONFIG-SNIPPET-PROCESSOR.XML, CONDITIONAL.UPDATEPROCESSOR.JS, SCHEMA-TINY.XML, MISSING.FUNCTIONS.UPDATEPROCESSOR.JS, SOLRCONFIG-ENABLEPLUGIN.XML, HYPHENATION.DTD, STEMDICT.TXT, SCHEMA-PHRASESUGGEST.XML, HUNSPELL-TEST.AFF, BAD-SCHEMA-CURRENCY-FT-OER-NORATES.XML, SCHEMA-SNIPPET-TYPE.XML, STOPTYPES-1.TXT, STOPWORDSWRONGENCODING.TXT, SCHEMA-NUMERIC.XML, SOLRCONFIG-TRANSFORMERS.XML, SOLRCONFIG-PROPINJECT.XML, BAD-SCHEMA-NOT-INDEXED-BUT-TF.XML, SOLRCONFIG-SIMPLELOCK.XML, SCHEMA-DOCVALUES.XML, WDFTYPES.TXT, SCHEMA-REVERSED.XML, STOPTYPES-2.TXT, BAD-SCHEMA-CURRENCY-FT-MULTIVALUED.XML, SOLRCONFIG-SPELLCHECKCOMPONENT.XML, BAD-SCHEMA-CURRENCY-MULTIVALUED.XML, SCHEMA-DFR.XML, SOLRCONFIG-PHRASESUGGEST.XML, BAD-SCHEMA-NOT-INDEXED-BUT-POS.XML, KEEP-1.TXT, OPEN-EXCHANGE-RATES.JSON, SCHEMA-SPATIAL.XML, STOPWITHBOM.TXT, SOLRCONFIG-SPELLCHECKER.XML, SOLRCONFIG-POSTINGSHIGHLIGHT.XML, SCHEMA-BINARYFIELD.XML, SOLRCONFIG-UPDATE-PROCESSOR-CHAINS.XML, BAD-SCHEMA-OMIT-TF-BUT-NOT-POS.XML, BAD-SCHEMA-DUP-FIELDTYPE.XML, SCHEMA-XINCLUDE.XML, SOLRCONFIG-MASTER1.XML, SCHEMA-BEHAVIOR.XML, SYNONYMS.TXT, SOLRCONFIG-MINIMAL.XML, SCHEMA-DOCVALUESMULTI.XML, BAD-SCHEMA-CURRENCY-DYNAMIC-MULTIVALUED.XML, BAD-SCHEMA-UNSUPPORTED-DOCVALUES.XML, SCHEMA_CODEC.XML, BAD-SCHEMA-SWEETSPOT-PARTIAL-HYPERBOLIC.XML, SOLRCONFIG-SOLR-749.XML, SOLRCONFIG-MASTER1-KEEPONEBACKUP.XML, SCHEMA-EFF.XML, STOP-2.TXT, SOLRCONFIG-FUNCTIONQUERY.XML, SCHEMA-LMDIRICHLET.XML, SOLRCONFIG-TERMINDEX.XML, BAD-SCHEMA-SWEETSPOT-PARTIAL-NORMS.XML, SOLRCONFIG-ELEVATE.XML, BAD-SCHEMA-SWEETSPOT-PARTIAL-BASELINE.XML, STOPWORDS.TXT, SCHEMA-FOLDING.XML, SCHEMA-STOP-KEEP.XML, FUZZYSUGGEST.TXT, BAD-SCHEMA-NOT-INDEXED-BUT-NORMS.XML, SCHEMA-REST.XML, SOLRCONFIG-SOLCOREPROPERTIES.XML, STOP-1.TXT, SOLRCONFIG-MASTER2.XML, SCHEMA-SPELLCHECKER.XML, SOLRCONFIG-RESPONSE-LOG-COMPONENT.XML, SOLRCONFIG-LAZYWRITER.XML, SCHEMA-LUCENEMATCHVERSION.XML, BAD-MP-SOLRCONFIG.XML, FRENCHARTICLES.TXT, SCHEMA15.XML, SOLRCONFIG-REQHANDLER.INCL, SCHEMASURROUND.XML, SCHEMA-COLLATEFILTER.XML, SOLRCONFIG-MASTER3.XML, HUNSPELL-TEST.DIC, BAD-SCHEMA-CODEC-GLOBAL-VS-FT-MISMATCH.XML, SOLRCONFIG-XINCLUDE.XML, SOLRCONFIG-SLAVE1.XML, SOLRCONFIG-DELPOLICY1.XML, SCHEMA-SIM.XML, SCHEMA-SNIPPET-FIELD.XML, SCHEMA-COLLATE.XML, STOP-SNOWBALL.TXT, BAD-SCHEMA-SIM-GLOBAL-VS-FT-MISMATCH.XML, PROTWORDS.TXT, SCHEMA-TRIE.XML, SOLRCONFIG_CODEC.XML, SCHEMA-SYNONYM-TOKENIZER.XML, BAD-SOLRCONFIG-INVALID-SCRIPTFILE.XML, JASUGGEST.TXT, SCHEMA-DOCVALUESFACETING.XML, SCHEMA-TFIDF.XML, SOLRCONFIG-SCRIPT-UPDATEPROCESSOR.XML, SCHEMA-LMJELINEKMERCER.XML, PHRASESUGGEST.TXT, BAD-SOLRCONFIG-MISSING-SCRIPTFILE.XML, SOLRCONFIG-BASIC-LUCENEVERSION31.XML, BAD-SCHEMA-UNIQUEKEY-USES-DEFAULT.XML, OLD_SYNONYMS.TXT, SOLRCONFIG-DELPOLICY2.XML, SOLRCONFIG-NATIVELOCK.XML, XSLT, BAD-SCHEMA-DUP-FIELD.XML, SOLRCONFIG-NOCACHE.XML, SCHEMA-BM25.XML, BAD-SCHEMA-SWEETSPOT-BOTH-TF.XML, ADDFIELDS.UPDATEPROCESSOR.JS, SOLRCONFIG-ALTDIRECTORY.XML, SOLRCONFIG-QUERYSENDER-NOQUERY.XML, COMPOUNDDICTIONARY.TXT, BAD-SCHEMA-CURRENCY-FT-BOGUS-DEFAULT-CODE.XML, BAD-CURRENCY.XML, SOLRCONFIG-INDEXCONFIG.XML, SOLRCONFIG_PERF.XML, SCHEMA-NOT-REQUIRED-UNIQUE-KEY.XML, BAD-SCHEMA-ANALYZER-CLASS-AND-NESTED.XML, KEEP-2.TXT, SCHEMA12.XML, BAD-SCHEMA-UNIQUEKEY-IS-COPYFIELD-DEST.XML, MAPPING-ISOLATIN1ACCENT.TXT, BAD_SOLRCONFIG.XML, BAD-SCHEMA-EXTERNAL-FILEFIELD.XML]
[junit4:junit4]   2> 1602 T568 oass.SolrIndexSearcher.<init> Opening Searcher@49b56a0f main
[junit4:junit4]   2> 1602 T568 oasu.CommitTracker.<init> Hard AutoCommit: disabled
[junit4:junit4]   2> 1603 T568 oasu.CommitTracker.<init> Soft AutoCommit: disabled
[junit4:junit4]   2> 1603 T568 oashc.SpellCheckComponent.inform Initializing spell checkers
[junit4:junit4]   2> 1605 T568 oass.DirectSolrSpellChecker.init init: {name=direct,classname=DirectSolrSpellChecker,field=lowerfilt,minQueryLength=3}
[junit4:junit4]   2> 1616 T570 oasc.SolrCore.registerSearcher [collection1] Registered new searcher Searcher@49b56a0f main{StandardDirectoryReader(segments_1:1)}
[junit4:junit4]   2> 1621 T568 oasu.DefaultSolrCoreState.newIndexWriter Creating new IndexWriter...
[junit4:junit4]   2> 1621 T568 oasu.DefaultSolrCoreState.newIndexWriter Waiting until IndexWriter is unused... core=collection1
[junit4:junit4]   2> 1623 T568 oasc.SolrDeletionPolicy.onInit SolrDeletionPolicy.onInit: commits:num=1
[junit4:junit4]   2> 		commit{dir=RateLimitedDirectoryWrapper(MockDirWrapper(org.apache.lucene.store.RAMDirectory@1bba1616 lockFactory=org.apache.lucene.store.NativeFSLockFactory@2640dab3)),segFN=segments_1,generation=1,filenames=[segments_1]
[junit4:junit4]   2> 1623 T568 oasc.SolrDeletionPolicy.updateCommits newest commit = 1[segments_1]
[junit4:junit4]   2> 1624 T568 oasu.DefaultSolrCoreState.newIndexWriter New IndexWriter is ready to be used.
[junit4:junit4]   2> 1624 T568 oass.SolrIndexSearcher.<init> Opening Searcher@4dfa1077 main
[junit4:junit4]   2> 1624 T568 oasc.CoreContainer.registerCore replacing core: collection1
[junit4:junit4]   2> 1625 T568 oasc.SolrCore.close [collection1]  CLOSING SolrCore org.apache.solr.core.SolrCore@3d533f87
[junit4:junit4]   2> 1625 T570 oasc.SolrCore.registerSearcher [collection1] Registered new searcher Searcher@4dfa1077 main{StandardDirectoryReader(segments_1:1:nrt)}
[junit4:junit4]   2> 1629 T568 oasu.DirectUpdateHandler2.close closing DirectUpdateHandler2{commits=0,autocommits=0,soft autocommits=0,optimizes=0,rollbacks=0,expungeDeletes=0,docsPending=0,adds=0,deletesById=0,deletesByQuery=0,errors=0,cumulative_adds=0,cumulative_deletesById=0,cumulative_deletesByQuery=0,cumulative_errors=0}
[junit4:junit4]   2> 1629 T568 oasc.SolrCore.closeSearcher [collection1] Closing main searcher on request.
[junit4:junit4]   2> ASYNC  NEW_CORE C27 name=collection1 org.apache.solr.core.SolrCore@7b8ee7ea
[junit4:junit4]   2> 1636 T568 C27 UPDATE [collection1] webapp=null path=null params={} {add=[529]} 0 1
[junit4:junit4]   2> 2137 T572 oasu.DirectUpdateHandler2.commit start commit{,optimize=false,openSearcher=true,waitSearcher=true,expungeDeletes=false,softCommit=true,prepareCommit=false}
[junit4:junit4]   2> 2140 T572 oass.SolrIndexSearcher.<init> Opening Searcher@17310a43 main
[junit4:junit4]   2> 2141 T572 oasu.DirectUpdateHandler2.commit end_commit_flush
[junit4:junit4]   2> 2142 T570 oasc.SolrCore.registerSearcher [collection1] Registered new searcher Searcher@17310a43 main{StandardDirectoryReader(segments_1:3:nrt _0(4.3):C1)}
[junit4:junit4]   2> 2146 T568 C27 UPDATE [collection1] webapp=null path=null params={} {add=[530]} 0 1
[junit4:junit4]   2> 2647 T572 oasu.DirectUpdateHandler2.commit start commit{,optimize=false,openSearcher=true,waitSearcher=true,expungeDeletes=false,softCommit=true,prepareCommit=false}
[junit4:junit4]   2> 2649 T572 oass.SolrIndexSearcher.<init> Opening Searcher@6549297d main
[junit4:junit4]   2> 2649 T572 oasu.DirectUpdateHandler2.commit end_commit_flush
[junit4:junit4]   2> 2650 T570 oasc.SolrCore.registerSearcher [collection1] Registered new searcher Searcher@6549297d main{StandardDirectoryReader(segments_1:5:nrt _0(4.3):C1 _1(4.3):C1)}
[junit4:junit4]   2> 2837 T571 oasu.DirectUpdateHandler2.commit start commit{,optimize=false,openSearcher=true,waitSearcher=true,expungeDeletes=false,softCommit=false,prepareCommit=false}
[junit4:junit4]   2> 2838 T571 oasc.SolrDeletionPolicy.onCommit SolrDeletionPolicy.onCommit: commits:num=2
[junit4:junit4]   2> 		commit{dir=RateLimitedDirectoryWrapper(MockDirWrapper(org.apache.lucene.store.RAMDirectory@1bba1616 lockFactory=org.apache.lucene.store.NativeFSLockFactory@2640dab3)),segFN=segments_1,generation=1,filenames=[segments_1]
[junit4:junit4]   2> 		commit{dir=RateLimitedDirectoryWrapper(MockDirWrapper(org.apache.lucene.store.RAMDirectory@1bba1616 lockFactory=org.apache.lucene.store.NativeFSLockFactory@2640dab3)),segFN=segments_2,generation=2,filenames=[_0.nrm, _0.tis, _1.tis, _0.fnm, _1.frq, _1.fnm, _1.prx, _1.fdx, _0.tii, _1.fdt, _1.si, _0.frq, segments_2, _1.tii, _0.fdx, _0.si, _0.prx, _1.nrm, _0.fdt]
[junit4:junit4]   2> 2839 T571 oasc.SolrDeletionPolicy.updateCommits newest commit = 2[_0.nrm, _0.tis, _1.tis, _0.fnm, _1.frq, _1.fnm, _1.prx, _1.fdx, _0.tii, _1.fdt, _1.si, _0.frq, segments_2, _1.tii, _0.fdx, _0.si, _0.prx, _1.nrm, _0.fdt]
[junit4:junit4]   2> 2839 T571 oass.SolrIndexSearcher.<init> Opening Searcher@709ff3b2 main
[junit4:junit4]   2> 2839 T571 oasu.DirectUpdateHandler2.commit end_commit_flush
[junit4:junit4]   2> 2840 T570 oasc.SolrCore.registerSearcher [collection1] Registered new searcher Searcher@709ff3b2 main{StandardDirectoryReader(segments_1:5:nrt _0(4.3):C1 _1(4.3):C1)}
[junit4:junit4]   2> 6041 T568 oas.SolrTestCaseJ4.tearDown ###Ending testSoftAndHardCommitMaxTimeMixedAdds
[junit4:junit4]   2> 6046 T568 oas.SolrTestCaseJ4.setUp ###Starting testSoftAndHardCommitMaxTimeDelete
[junit4:junit4]   2> 6046 T568 oasc.CoreContainer.reload Reloading SolrCore 'collection1' using instanceDir: /usr/home/hudson/hudson-slave/workspace/Lucene-Solr-Tests-4.x-java7/solr/build/solr-core/test-files/solr/collection1
[junit4:junit4]   2> 6046 T568 oasc.SolrResourceLoader.<init> new SolrResourceLoader for directory: '/usr/home/hudson/hudson-slave/workspace/Lucene-Solr-Tests-4.x-java7/solr/build/solr-core/test-files/solr/collection1/'
[junit4:junit4]   2> 6047 T568 oasc.SolrResourceLoader.replaceClassLoader Adding 'file:/usr/home/hudson/hudson-slave/workspace/Lucene-Solr-Tests-4.x-java7/solr/build/solr-core/test-files/solr/collection1/lib/README' to classloader
[junit4:junit4]   2> 6047 T568 oasc.SolrResourceLoader.replaceClassLoader Adding 'file:/usr/home/hudson/hudson-slave/workspace/Lucene-Solr-Tests-4.x-java7/solr/build/solr-core/test-files/solr/collection1/lib/classes/' to classloader
[junit4:junit4]   2> 6088 T568 oasc.SolrConfig.<init> Using Lucene MatchVersion: LUCENE_43
[junit4:junit4]   2> 6139 T568 oasc.SolrConfig.<init> Loaded SolrConfig: solrconfig.xml
[junit4:junit4]   2> 6139 T568 oass.IndexSchema.readSchema Reading Solr Schema
[junit4:junit4]   2> 6145 T568 oass.IndexSchema.readSchema Schema name=test
[junit4:junit4]   2> 6811 T568 oass.OpenExchangeRatesOrgProvider.init Initialized with rates=open-exchange-rates.json, refreshInterval=1440.
[junit4:junit4]   2> 6834 T568 oass.IndexSchema.readSchema default search field in schema is text
[junit4:junit4]   2> 6839 T568 oass.IndexSchema.readSchema unique key field: id
[junit4:junit4]   2> 6850 T568 oass.FileExchangeRateProvider.reload Reloading exchange rates from file currency.xml
[junit4:junit4]   2> 6856 T568 oass.FileExchangeRateProvider.reload Reloading exchange rates from file currency.xml
[junit4:junit4]   2> 6861 T568 oass.OpenExchangeRatesOrgProvider.reload Reloading exchange rates from open-exchange-rates.json
[junit4:junit4]   2> 6862 T568 oass.OpenExchangeRatesOrgProvider$OpenExchangeRates.<init> WARNING Unknown key IMPORTANT NOTE
[junit4:junit4]   2> 6863 T568 oass.OpenExchangeRatesOrgProvider$OpenExchangeRates.<init> WARNING Expected key, got STRING
[junit4:junit4]   2> 6863 T568 oass.OpenExchangeRatesOrgProvider.reload Reloading exchange rates from open-exchange-rates.json
[junit4:junit4]   2> 6864 T568 oass.OpenExchangeRatesOrgProvider$OpenExchangeRates.<init> WARNING Unknown key IMPORTANT NOTE
[junit4:junit4]   2> 6864 T568 oass.OpenExchangeRatesOrgProvider$OpenExchangeRates.<init> WARNING Expected key, got STRING
[junit4:junit4]   2> 6865 T568 oasc.SolrCore.<init> [collection1] Opening new SolrCore at /usr/home/hudson/hudson-slave/workspace/Lucene-Solr-Tests-4.x-java7/solr/build/solr-core/test-files/solr/collection1/, dataDir=/usr/home/hudson/hudson-slave/workspace/Lucene-Solr-Tests-4.x-java7/solr/build/solr-core/test/J0/./solrtest-SoftAutoCommitTest-1364019288036/
[junit4:junit4]   2> 6865 T568 oasc.JmxMonitoredMap.<init> JMX monitoring is enabled. Adding Solr mbeans to JMX Server: com.sun.jmx.mbeanserver.JmxMBeanServer@3d0360b8
[junit4:junit4]   2> 6866 T568 oasc.SolrCore.getNewIndexDir New index directory detected: old=null new=/usr/home/hudson/hudson-slave/workspace/Lucene-Solr-Tests-4.x-java7/solr/build/solr-core/test/J0/./solrtest-SoftAutoCommitTest-1364019288036/index/
[junit4:junit4]   2> 6866 T568 oasc.SolrCore.initWriters created xml: solr.XMLResponseWriter
[junit4:junit4]   2> 6869 T568 oasup.UpdateRequestProcessorChain.init inserting DistributedUpdateProcessorFactory into updateRequestProcessorChain "dedupe"
[junit4:junit4]   2> 6869 T568 oasup.UpdateRequestProcessorChain.init inserting DistributedUpdateProcessorFactory into updateRequestProcessorChain "dedupe-allfields"
[junit4:junit4]   2> 6870 T568 oasup.UpdateRequestProcessorChain.init inserting DistributedUpdateProcessorFactory into updateRequestProcessorChain "stored_sig"
[junit4:junit4]   2> 6870 T568 oasup.UpdateRequestProcessorChain.init inserting DistributedUpdateProcessorFactory into updateRequestProcessorChain "uniq-fields"
[junit4:junit4]   2> 6871 T568 oasup.UpdateRequestProcessorChain.init inserting DistributedUpdateProcessorFactory into updateRequestProcessorChain "distrib-dup-test-chain-implicit"
[junit4:junit4]   2> 6872 T568 oasc.RequestHandlers.initHandlersFromConfig adding lazy requestHandler: solr.ReplicationHandler
[junit4:junit4]   2> 6872 T568 oasc.RequestHandlers.initHandlersFromConfig created /replication: solr.ReplicationHandler
[junit4:junit4]   2> 6873 T568 oasc.RequestHandlers.initHandlersFromConfig created standard: solr.StandardRequestHandler
[junit4:junit4]   2> 6874 T568 oasc.RequestHandlers.initHandlersFromConfig created /get: solr.RealTimeGetHandler
[junit4:junit4]   2> 6874 T568 oasc.RequestHandlers.initHandlersFromConfig created dismax: solr.SearchHandler
[junit4:junit4]   2> 6875 T568 oasc.RequestHandlers.initHandlersFromConfig created mock: org.apache.solr.core.MockQuerySenderListenerReqHandler
[junit4:junit4]   2> 6876 T568 oasc.RequestHandlers.initHandlersFromConfig created /admin/: org.apache.solr.handler.admin.AdminHandlers
[junit4:junit4]   2> 6876 T568 oasc.RequestHandlers.initHandlersFromConfig created defaults: solr.StandardRequestHandler
[junit4:junit4]   2> 6877 T568 oasc.RequestHandlers.initHandlersFromConfig adding lazy requestHandler: solr.StandardRequestHandler
[junit4:junit4]   2> 6877 T568 oasc.RequestHandlers.initHandlersFromConfig created lazy: solr.StandardRequestHandler
[junit4:junit4]   2> 6878 T568 oasc.RequestHandlers.initHandlersFromConfig created /update: solr.UpdateRequestHandler
[junit4:junit4]   2> 6879 T568 oasc.RequestHandlers.initHandlersFromConfig created /terms: org.apache.solr.handler.component.SearchHandler
[junit4:junit4]   2> 6880 T568 oasc.RequestHandlers.initHandlersFromConfig created spellCheckCompRH: org.apache.solr.handler.component.SearchHandler
[junit4:junit4]   2> 6880 T568 oasc.RequestHandlers.initHandlersFromConfig created spellCheckCompRH_Direct: org.apache.solr.handler.component.SearchHandler
[junit4:junit4]   2> 6881 T568 oasc.RequestHandlers.initHandlersFromConfig created spellCheckWithWordbreak: org.apache.solr.handler.component.SearchHandler
[junit4:junit4]   2> 6882 T568 oasc.RequestHandlers.initHandlersFromConfig created spellCheckWithWordbreak_Direct: org.apache.solr.handler.component.SearchHandler
[junit4:junit4]   2> 6882 T568 oasc.RequestHandlers.initHandlersFromConfig created spellCheckCompRH1: org.apache.solr.handler.component.SearchHandler
[junit4:junit4]   2> 6883 T568 oasc.RequestHandlers.initHandlersFromConfig created mltrh: org.apache.solr.handler.component.SearchHandler
[junit4:junit4]   2> 6884 T568 oasc.RequestHandlers.initHandlersFromConfig created tvrh: org.apache.solr.handler.component.SearchHandler
[junit4:junit4]   2> 6885 T568 oasc.RequestHandlers.initHandlersFromConfig created /mlt: solr.MoreLikeThisHandler
[junit4:junit4]   2> 6886 T568 oasc.RequestHandlers.initHandlersFromConfig created /debug/dump: solr.DumpRequestHandler
[junit4:junit4]   2> 6888 T568 oashl.XMLLoader.init xsltCacheLifetimeSeconds=60
[junit4:junit4]   2> 6890 T568 oasc.SolrCore.initDeprecatedSupport WARNING solrconfig.xml uses deprecated <admin/gettableFiles>, Please update your config to use the ShowFileRequestHandler.
[junit4:junit4]   2> 6892 T568 oasc.SolrCore.initDeprecatedSupport WARNING adding ShowFileRequestHandler with hidden files: [THROW.ERROR.ON.ADD.UPDATEPROCESSOR.JS, SOLRCONFIG-HIGHLIGHT.XML, SCHEMA-REQUIRED-FIELDS.XML, SCHEMA-REPLICATION2.XML, TRIVIAL.UPDATEPROCESSOR1.JS, BAD-SCHEMA-DUP-DYNAMICFIELD.XML, BAD-SCHEMA-DOCVALUES-NOT-REQUIRED-NO-DEFAULT.XML, SCHEMA-MINIMAL.XML, SOLRCONFIG-CACHING.XML, SCHEMA-POSTINGSHIGHLIGHT.XML, SOLRCONFIG-REPEATER.XML, REGEX-BOOST-PROCESSOR-TEST.TXT, BAD-SCHEMA-CURRENCY-FT-BOGUS-CODE-IN-XML.XML, CURRENCY.XML, SOLRCONFIG-MERGEPOLICY.XML, BAD-SCHEMA-NONTEXT-ANALYZER.XML, SOLRCONFIG-TLOG.XML, SOLRCONFIG-MASTER.XML, SOLRCONFIG-COMPONENTS-NAME.XML, BAD-SCHEMA-UNIQUEKEY-MULTIVALUED.XML, SCHEMA11.XML, SOLRCONFIG-BASIC.XML, DA_COMPOUNDDICTIONARY.TXT, MISSLEADING.EXTENSION.UPDATEPROCESSOR.JS.TXT, SCHEMA-COPYFIELD-TEST.XML, SOLRCONFIG-SLAVE.XML, SOLRCONFIG-PROPINJECT-INDEXDEFAULT.XML, ELEVATE.XML, TRIVIAL.UPDATEPROCESSOR0.JS, SCHEMA-SWEETSPOT.XML, BAD-SOLRCONFIG-BOGUS-SCRIPTENGINE-NAME.XML, SCHEMA-IB.XML, SCHEMA-CHARFILTERS.XML, SOLRCONFIG-QUERYSENDER.XML, DA_UTF8.XML, SCHEMA-REPLICATION1.XML, SOLRCONFIG-SNIPPET-PROCESSOR.XML, CONDITIONAL.UPDATEPROCESSOR.JS, SCHEMA-TINY.XML, MISSING.FUNCTIONS.UPDATEPROCESSOR.JS, SOLRCONFIG-ENABLEPLUGIN.XML, HYPHENATION.DTD, STEMDICT.TXT, SCHEMA-PHRASESUGGEST.XML, HUNSPELL-TEST.AFF, BAD-SCHEMA-CURRENCY-FT-OER-NORATES.XML, SCHEMA-SNIPPET-TYPE.XML, STOPTYPES-1.TXT, STOPWORDSWRONGENCODING.TXT, SCHEMA-NUMERIC.XML, SOLRCONFIG-TRANSFORMERS.XML, SOLRCONFIG-PROPINJECT.XML, BAD-SCHEMA-NOT-INDEXED-BUT-TF.XML, SOLRCONFIG-SIMPLELOCK.XML, SCHEMA-DOCVALUES.XML, WDFTYPES.TXT, SCHEMA-REVERSED.XML, STOPTYPES-2.TXT, BAD-SCHEMA-CURRENCY-FT-MULTIVALUED.XML, SOLRCONFIG-SPELLCHECKCOMPONENT.XML, BAD-SCHEMA-CURRENCY-MULTIVALUED.XML, SCHEMA-DFR.XML, SOLRCONFIG-PHRASESUGGEST.XML, BAD-SCHEMA-NOT-INDEXED-BUT-POS.XML, KEEP-1.TXT, OPEN-EXCHANGE-RATES.JSON, SCHEMA-SPATIAL.XML, STOPWITHBOM.TXT, SOLRCONFIG-SPELLCHECKER.XML, SOLRCONFIG-POSTINGSHIGHLIGHT.XML, SCHEMA-BINARYFIELD.XML, SOLRCONFIG-UPDATE-PROCESSOR-CHAINS.XML, BAD-SCHEMA-OMIT-TF-BUT-NOT-POS.XML, BAD-SCHEMA-DUP-FIELDTYPE.XML, SCHEMA-XINCLUDE.XML, SOLRCONFIG-MASTER1.XML, SCHEMA-BEHAVIOR.XML, SYNONYMS.TXT, SOLRCONFIG-MINIMAL.XML, SCHEMA-DOCVALUESMULTI.XML, BAD-SCHEMA-CURRENCY-DYNAMIC-MULTIVALUED.XML, BAD-SCHEMA-UNSUPPORTED-DOCVALUES.XML, SCHEMA_CODEC.XML, BAD-SCHEMA-SWEETSPOT-PARTIAL-HYPERBOLIC.XML, SOLRCONFIG-SOLR-749.XML, SOLRCONFIG-MASTER1-KEEPONEBACKUP.XML, SCHEMA-EFF.XML, STOP-2.TXT, SOLRCONFIG-FUNCTIONQUERY.XML, SCHEMA-LMDIRICHLET.XML, SOLRCONFIG-TERMINDEX.XML, BAD-SCHEMA-SWEETSPOT-PARTIAL-NORMS.XML, SOLRCONFIG-ELEVATE.XML, BAD-SCHEMA-SWEETSPOT-PARTIAL-BASELINE.XML, STOPWORDS.TXT, SCHEMA-FOLDING.XML, SCHEMA-STOP-KEEP.XML, FUZZYSUGGEST.TXT, BAD-SCHEMA-NOT-INDEXED-BUT-NORMS.XML, SCHEMA-REST.XML, SOLRCONFIG-SOLCOREPROPERTIES.XML, STOP-1.TXT, SOLRCONFIG-MASTER2.XML, SCHEMA-SPELLCHECKER.XML, SOLRCONFIG-RESPONSE-LOG-COMPONENT.XML, SOLRCONFIG-LAZYWRITER.XML, SCHEMA-LUCENEMATCHVERSION.XML, BAD-MP-SOLRCONFIG.XML, FRENCHARTICLES.TXT, SCHEMA15.XML, SOLRCONFIG-REQHANDLER.INCL, SCHEMASURROUND.XML, SCHEMA-COLLATEFILTER.XML, SOLRCONFIG-MASTER3.XML, HUNSPELL-TEST.DIC, BAD-SCHEMA-CODEC-GLOBAL-VS-FT-MISMATCH.XML, SOLRCONFIG-XINCLUDE.XML, SOLRCONFIG-SLAVE1.XML, SOLRCONFIG-DELPOLICY1.XML, SCHEMA-SIM.XML, SCHEMA-SNIPPET-FIELD.XML, SCHEMA-COLLATE.XML, STOP-SNOWBALL.TXT, BAD-SCHEMA-SIM-GLOBAL-VS-FT-MISMATCH.XML, PROTWORDS.TXT, SCHEMA-TRIE.XML, SOLRCONFIG_CODEC.XML, SCHEMA-SYNONYM-TOKENIZER.XML, BAD-SOLRCONFIG-INVALID-SCRIPTFILE.XML, JASUGGEST.TXT, SCHEMA-DOCVALUESFACETING.XML, SCHEMA-TFIDF.XML, SOLRCONFIG-SCRIPT-UPDATEPROCESSOR.XML, SCHEMA-LMJELINEKMERCER.XML, PHRASESUGGEST.TXT, BAD-SOLRCONFIG-MISSING-SCRIPTFILE.XML, SOLRCONFIG-BASIC-LUCENEVERSION31.XML, BAD-SCHEMA-UNIQUEKEY-USES-DEFAULT.XML, OLD_SYNONYMS.TXT, SOLRCONFIG-DELPOLICY2.XML, SOLRCONFIG-NATIVELOCK.XML, XSLT, BAD-SCHEMA-DUP-FIELD.XML, SOLRCONFIG-NOCACHE.XML, SCHEMA-BM25.XML, BAD-SCHEMA-SWEETSPOT-BOTH-TF.XML, ADDFIELDS.UPDATEPROCESSOR.JS, SOLRCONFIG-ALTDIRECTORY.XML, SOLRCONFIG-QUERYSENDER-NOQUERY.XML, COMPOUNDDICTIONARY.TXT, BAD-SCHEMA-CURRENCY-FT-BOGUS-DEFAULT-CODE.XML, BAD-CURRENCY.XML, SOLRCONFIG-INDEXCONFIG.XML, SOLRCONFIG_PERF.XML, SCHEMA-NOT-REQUIRED-UNIQUE-KEY.XML, BAD-SCHEMA-ANALYZER-CLASS-AND-NESTED.XML, KEEP-2.TXT, SCHEMA12.XML, BAD-SCHEMA-UNIQUEKEY-IS-COPYFIELD-DEST.XML, MAPPING-ISOLATIN1ACCENT.TXT, BAD_SOLRCONFIG.XML, BAD-SCHEMA-EXTERNAL-FILEFIELD.XML]
[junit4:junit4]   2> 6900 T568 oass.SolrIndexSearcher.<init> Opening Searcher@4002474b main
[junit4:junit4]   2> 6901 T568 oasu.CommitTracker.<init> Hard AutoCommit: disabled
[junit4:junit4]   2> 6902 T568 oasu.CommitTracker.<init> Soft AutoCommit: disabled
[junit4:junit4]   2> 6902 T568 oashc.SpellCheckComponent.inform Initializing spell checkers
[junit4:junit4]   2> 6905 T568 oass.DirectSolrSpellChecker.init init: {name=direct,classname=DirectSolrSpellChecker,field=lowerfilt,minQueryLength=3}
[junit4:junit4]   2> 6918 T573 oasc.SolrCore.registerSearcher [collection1] Registered new searcher Searcher@4002474b main{StandardDirectoryReader(segments_2:5:nrt _0(4.3):C1 _1(4.3):C1)}
[junit4:junit4]   2> 6925 T568 oasu.DefaultSolrCoreState.newIndexWriter Creating new IndexWriter...
[junit4:junit4]   2> 6926 T568 oasu.DefaultSolrCoreState.newIndexWriter Waiting until IndexWriter is unused... core=collection1
[junit4:junit4]   2> 6926 T568 oasu.DefaultSolrCoreState.newIndexWriter Closing old IndexWriter... core=collection1
[junit4:junit4]   2> 6930 T568 oasc.SolrDeletionPolicy.onInit SolrDeletionPolicy.onInit: commits:num=1
[junit4:junit4]   2> 		commit{dir=RateLimitedDirectoryWrapper(MockDirWrapper(org.apache.lucene.store.RAMDirectory@1bba1616 lockFactory=org.apache.lucene.store.NativeFSLockFactory@2640dab3)),segFN=segments_2,generation=2,filenames=[_0.tis, _0.nrm, _1.tis, _0.fnm, _1.frq, _1.fnm, _1.fdx, _1.prx, _0.tii, _1.fdt, _1.si, _0.frq, segments_2, _1.tii, _0.fdx, _0.si, _0.prx, _1.nrm, _0.fdt]
[junit4:junit4]   2> 6930 T568 oasc.SolrDeletionPolicy.updateCommits newest commit = 2[_0.tis, _0.nrm, _1.tis, _0.fnm, _1.frq, _1.fnm, _1.fdx, _1.prx, _0.tii, _1.fdt, _1.si, _0.frq, segments_2, _1.tii, _0.fdx, _0.si, _0.prx, _1.nrm, _0.fdt]
[junit4:junit4]   2> 6931 T568 oasu.DefaultSolrCoreState.newIndexWriter New IndexWriter is ready to be used.
[junit4:junit4]   2> 6932 T568 oass.SolrIndexSearcher.<init> Opening Searcher@5715e129 main
[junit4:junit4]   2> 6933 T568 oasc.CoreContainer.registerCore replacing core: collection1
[junit4:junit4]   2> 6933 T568 oasc.SolrCore.close [collection1]  CLOSING SolrCore org.apache.solr.core.SolrCore@7b8ee7ea
[junit4:junit4]   2> 6933 T573 oasc.SolrCore.registerSearcher [collection1] Registered new searcher Searcher@5715e129 main{StandardDirectoryReader(segments_2:5:nrt _0(4.3):C1 _1(4.3):C1)}
[junit4:junit4]   2> 6939 T568 oasu.DirectUpdateHandler2.close closing DirectUpdateHandler2{commits=3,autocommit maxTime=1200ms,autocommits=1,soft autocommit maxTime=500ms,soft autocommits=2,optimizes=0,rollbacks=0,expungeDeletes=0,docsPending=0,adds=0,deletesById=0,deletesByQuery=0,errors=0,cumulative_adds=2,cumulative_deletesById=0,cumulative_deletesByQuery=0,cumulative_errors=0}
[junit4:junit4]   2> 6939 T568 oasc.SolrCore.closeSearcher [collection1] Closing main searcher on request.
[junit4:junit4]   2> ASYNC  NEW_CORE C28 name=collection1 org.apache.solr.core.SolrCore@3df1671d
[junit4:junit4]   2> 6951 T568 C28 UPDATE [collection1] webapp=null path=null params={} {add=[529]} 0 1
[junit4:junit4]   2> 6961 T568 C28 oasu.DirectUpdateHandler2.commit start commit{,optimize=false,openSearcher=true,waitSearcher=true,expungeDeletes=false,softCommit=false,prepareCommit=false}
[junit4:junit4]   2> 6964 T568 C28 oasc.SolrDeletionPolicy.onCommit SolrDeletionPolicy.onCommit: commits:num=2
[junit4:junit4]   2> 		commit{dir=RateLimitedDirectoryWrapper(MockDirWrapper(org.apache.lucene.store.RAMDirectory@1bba1616 lockFactory=org.apache.lucene.store.NativeFSLockFactory@2640dab3)),segFN=segments_2,generation=2,filenames=[_0.tis, _0.nrm, _1.tis, _0.fnm, _1.frq, _1.fnm, _1.fdx, _1.prx, _0.tii, _1.fdt, _1.si, _0.frq, segments_2, _1.tii, _0.fdx, _0.si, _0.prx, _1.nrm, _0.fdt]
[junit4:junit4]   2> 		commit{dir=RateLimitedDirectoryWrapper(MockDirWrapper(org.apache.lucene.store.RAMDirectory@1bba1616 lockFactory=org.apache.lucene.store.NativeFSLockFactory@2640dab3)),segFN=segments_3,generation=3,filenames=[_2.si, _1.tis, _2.prx, _1.frq, _2.fdt, _2.frq, _2.tii, _2.fdx, _1.fnm, _2.fnm, _1.fdx, _1.prx, _2.tis, _1.fdt, _1.si, _1.tii, _2.nrm, segments_3, _1.nrm]
[junit4:junit4]   2> 6965 T568 C28 oasc.SolrDeletionPolicy.updateCommits newest commit = 3[_2.si, _1.tis, _2.prx, _1.frq, _2.fdt, _2.frq, _2.tii, _2.fdx, _1.fnm, _2.fnm, _1.fdx, _1.prx, _2.tis, _1.fdt, _1.si, _1.tii, _2.nrm, segments_3, _1.nrm]
[junit4:junit4]   2> 6966 T568 C28 oass.SolrIndexSearcher.<init> Opening Searcher@11beddbb main
[junit4:junit4]   2> 6967 T568 C28 oasu.DirectUpdateHandler2.commit end_commit_flush
[junit4:junit4]   2> 6968 T573 oasc.SolrCore.registerSearcher [collection1] Registered new searcher Searcher@11beddbb main{StandardDirectoryReader(segments_3:9:nrt _1(4.3):C1 _2(4.3):C1)}
[junit4:junit4]   2> 6969 T568 C28 UPDATE [collection1] webapp=null path=null params={} {commit=} 0 8
[junit4:junit4]   2> 6978 T568 C28 UPDATE [collection1] webapp=null path=null params={} {delete=[529]} 0 0
[junit4:junit4]   2> 8249 T575 oasu.DirectUpdateHandler2.commit start commit{,optimize=false,openSearcher=true,waitSearcher=true,expungeDeletes=false,softCommit=true,prepareCommit=false}
[junit4:junit4]   2> 8249 T574 oasu.DirectUpdateHandler2.commit start commit{,optimize=false,openSearcher=true,waitSearcher=true,expungeDeletes=false,softCommit=false,prepareCommit=false}
[junit4:junit4]   2> 8252 T575 oass.SolrIndexSearcher.<init> Opening Searcher@4e1ae48d main
[junit4:junit4]   2> 8253 T575 oasu.DirectUpdateHandler2.commit end_commit_flush
[junit4:junit4]   2> 8255 T573 oasc.SolrCore.registerSearcher [collection1] Registered new searcher Searcher@4e1ae48d main{StandardDirectoryReader(segments_3:11:nrt _1(4.3):C1)}
[junit4:junit4]   2> 8255 T574 oasc.SolrDeletionPolicy.onCommit SolrDeletionPolicy.onCommit: commits:num=2
[junit4:junit4]   2> 		commit{dir=RateLimitedDirectoryWrapper(MockDirWrapper(org.apache.lucene.store.RAMDirectory@1bba1616 lockFactory=org.apache.lucene.store.NativeFSLockFactory@2640dab3)),segFN=segments_3,generation=3,filenames=[_2.si, _1.tis, _2.prx, _1.frq, _2.fdt, _2.frq, _2.tii, _2.fdx, _1.fnm, _2.fnm, _1.fdx, _1.prx, _2.tis, _1.fdt, _1.si, _1.tii, _2.nrm, segments_3, _1.nrm]
[junit4:junit4]   2> 		commit{dir=RateLimitedDirectoryWrapper(MockDirWrapper(org.apache.lucene.store.RAMDirectory@1bba1616 lockFactory=org.apache.lucene.store.NativeFSLockFactory@2640dab3)),segFN=segments_4,generation=4,filenames=[_1.prx, _1.fdx, _1.tis, _1.frq, _1.fdt, _1.si, _1.tii, _1.fnm, _1.nrm, segments_4]
[junit4:junit4]   2> 8256 T574 oasc.SolrDeletionPolicy.updateCommits newest commit = 4[_1.prx, _1.fdx, _1.tis, _1.frq, _1.fdt, _1.si, _1.tii, _1.fnm, _1.nrm, segments_4]
[junit4:junit4]   2> 8257 T574 oass.SolrIndexSearcher.<init> Opening Searcher@65e5295a main
[junit4:junit4]   2> 8257 T574 oasu.DirectUpdateHandler2.commit end_commit_flush
[junit4:junit4]   2> 8258 T573 oasc.SolrCore.registerSearcher [collection1] Registered new searcher Searcher@65e5295a main{StandardDirectoryReader(segments_3:11:nrt _1(4.3):C1)}
[junit4:junit4]   2> 8261 T568 C28 UPDATE [collection1] webapp=null path=null params={} {add=[550]} 0 1
[junit4:junit4]   2> 8762 T575 oasu.DirectUpdateHandler2.commit start commit{,optimize=false,openSearcher=true,waitSearcher=true,expungeDeletes=false,softCommit=true,prepareCommit=false}
[junit4:junit4]   2> 8765 T575 oass.SolrIndexSearcher.<init> Opening Searcher@3eb4ec6d main
[junit4:junit4]   2> 8765 T575 oasu.DirectUpdateHandler2.commit end_commit_flush
[junit4:junit4]   2> 8767 T573 oasc.SolrCore.registerSearcher [collection1] Registered new searcher Searcher@3eb4ec6d main{StandardDirectoryReader(segments_4:13:nrt _1(4.3):C1 _3(4.3):C1)}
[junit4:junit4]   2> 9462 T574 oasu.DirectUpdateHandler2.commit start commit{,optimize=false,openSearcher=true,waitSearcher=true,expungeDeletes=false,softCommit=false,prepareCommit=false}
[junit4:junit4]   2> 9463 T574 oasc.SolrDeletionPolicy.onCommit SolrDeletionPolicy.onCommit: commits:num=2
[junit4:junit4]   2> 		commit{dir=RateLimitedDirectoryWrapper(MockDirWrapper(org.apache.lucene.store.RAMDirectory@1bba1616 lockFactory=org.apache.lucene.store.NativeFSLockFactory@2640dab3)),segFN=segments_4,generation=4,filenames=[_1.prx, _1.fdx, _1.tis, _1.frq, _1.fdt, _1.si, _1.tii, _1.fnm, _1.nrm, segments_4]
[junit4:junit4]   2> 		commit{dir=RateLimitedDirectoryWrapper(MockDirWrapper(org.apache.lucene.store.RAMDirectory@1bba1616 lockFactory=org.apache.lucene.store.NativeFSLockFactory@2640dab3)),segFN=segments_5,generation=5,filenames=[_3.nrm, _3.tii, _3.frq, _1.tis, _1.frq, _3.fdt, _3.prx, _3.fnm, _1.fnm, _3.fdx, _1.fdx, _1.prx, _1.fdt, _1.si, _3.si, _1.tii, segments_5, _1.nrm, _3.tis]
[junit4:junit4]   2> 9463 T574 oasc.SolrDeletionPolicy.updateCommits newest commit = 5[_3.nrm, _3.tii, _3.frq, _1.tis, _1.frq, _3.fdt, _3.prx, _3.fnm, _1.fnm, _3.fdx, _1.fdx, _1.prx, _1.fdt, _1.si, _3.si, _1.tii, segments_5, _1.nrm, _3.tis]
[junit4:junit4]   2> 9464 T574 oass.SolrIndexSearcher.<init> Opening Searcher@3c9792cf main
[junit4:junit4]   2> 9464 T568 oas.SolrTestCaseJ4.tearDown ###Ending testSoftAndHardCommitMaxTimeDelete
[junit4:junit4]   2> 9464 T574 oasu.DirectUpdateHandler2.commit end_commit_flush
[junit4:junit4]   2> 9466 T573 oasc.SolrCore.registerSearcher [collection1] Registered new searcher Searcher@3c9792cf main{StandardDirectoryReader(segments_4:13:nrt _1(4.3):C1 _3(4.3):C1)}
[junit4:junit4]   2> NOTE: reproduce with: ant test  -Dtestcase=SoftAutoCommitTest -Dtests.method=testSoftAndHardCommitMaxTimeDelete -Dtests.seed=172D0E63F7D8C007 -Dtests.multiplier=3 -Dtests.slow=true -Dtests.locale=es_PY -Dtests.timezone=CST6CDT -Dtests.file.encoding=US-ASCII
[junit4:junit4] FAILURE 3.56s J0 | SoftAutoCommitTest.testSoftAndHardCommitMaxTimeDelete <<<
[junit4:junit4]    > Throwable #1: java.lang.AssertionError: Got a hard commit we weren't expecting
[junit4:junit4]    > 	at __randomizedtesting.SeedInfo.seed([172D0E63F7D8C007:D061B6FEEC700DB7]:0)
[junit4:junit4]    > 	at org.junit.Assert.fail(Assert.java:93)
[junit4:junit4]    > 	at org.junit.Assert.assertTrue(Assert.java:43)
[junit4:junit4]    > 	at org.junit.Assert.assertNull(Assert.java:551)
[junit4:junit4]    > 	at org.apache.solr.update.SoftAutoCommitTest.testSoftAndHardCommitMaxTimeDelete(SoftAutoCommitTest.java:279)
[junit4:junit4]    > 	at sun.reflect.NativeMethodAccessorImpl.invoke0(Native Method)
[junit4:junit4]    > 	at sun.reflect.NativeMethodAccessorImpl.invoke(NativeMethodAccessorImpl.java:57)
[junit4:junit4]    > 	at sun.reflect.DelegatingMethodAccessorImpl.invoke(DelegatingMethodAccessorImpl.java:43)
[junit4:junit4]    > 	at java.lang.reflect.Method.invoke(Method.java:601)
[junit4:junit4]    > 	at com.carrotsearch.randomizedtesting.RandomizedRunner.invoke(RandomizedRunner.java:1559)
[junit4:junit4]    > 	at com.carrotsearch.randomizedtesting.RandomizedRunner.access$600(RandomizedRunner.java:79)
[junit4:junit4]    > 	at com.carrotsearch.randomizedtesting.RandomizedRunner$6.evaluate(RandomizedRunner.java:737)
[junit4:junit4]    > 	at com.carrotsearch.randomizedtesting.RandomizedRunner$7.evaluate(RandomizedRunner.java:773)
[junit4:junit4]    > 	at com.carrotsearch.randomizedtesting.RandomizedRunner$8.evaluate(RandomizedRunner.java:787)
[junit4:junit4]    > 	at com.carrotsearch.randomizedtesting.rules.SystemPropertiesRestoreRule$1.evaluate(SystemPropertiesRestoreRule.java:53)
[junit4:junit4]    > 	at org.apache.lucene.util.TestRuleSetupTeardownChained$1.evaluate(TestRuleSetupTeardownChained.java:50)
[junit4:junit4]    > 	at org.apache.lucene.util.TestRuleFieldCacheSanity$1.evaluate(TestRuleFieldCacheSanity.java:51)
[junit4:junit4]    > 	at org.apache.lucene.util.AbstractBeforeAfterRule$1.evaluate(AbstractBeforeAfterRule.java:46)
[junit4:junit4]    > 	at com.carrotsearch.randomizedtesting.rules.SystemPropertiesInvariantRule$1.evaluate(SystemPropertiesInvariantRule.java:55)
[junit4:junit4]    > 	at org.apache.lucene.util.TestRuleThreadAndTestName$1.evaluate(TestRuleThreadAndTestName.java:49)
[junit4:junit4]    > 	at org.apache.lucene.util.TestRuleIgnoreAfterMaxFailures$1.evaluate(TestRuleIgnoreAfterMaxFailures.java:70)
[junit4:junit4]    > 	at org.apache.lucene.util.TestRuleMarkFailure$1.evaluate(TestRuleMarkFailure.java:48)
[junit4:junit4]    > 	at com.carrotsearch.randomizedtesting.rules.StatementAdapter.evaluate(StatementAdapter.java:36)
[junit4:junit4]    > 	at com.carrotsearch.randomizedtesting.ThreadLeakControl$StatementRunner.run(ThreadLeakControl.java:358)
[junit4:junit4]    > 	at com.carrotsearch.randomizedtesting.ThreadLeakControl.forkTimeoutingTask(ThreadLeakControl.java:782)
[junit4:junit4]    > 	at com.carrotsearch.randomizedtesting.ThreadLeakControl$3.evaluate(ThreadLeakControl.java:442)
[junit4:junit4]    > 	at com.carrotsearch.randomizedtesting.RandomizedRunner.runSingleTest(RandomizedRunner.java:746)
[junit4:junit4]    > 	at com.carrotsearch.randomizedtesting.RandomizedRunner$3.evaluate(RandomizedRunner.java:648)
[junit4:junit4]    > 	at com.carrotsearch.randomizedtesting.RandomizedRunner$4.evaluate(RandomizedRunner.java:682)
[junit4:junit4]    > 	at com.carrotsearch.randomizedtesting.RandomizedRunner$5.evaluate(RandomizedRunner.java:693)
[junit4:junit4]    > 	at com.carrotsearch.randomizedtesting.rules.StatementAdapter.evaluate(StatementAdapter.java:36)
[junit4:junit4]    > 	at com.carrotsearch.randomizedtesting.rules.SystemPropertiesRestoreRule$1.evaluate(SystemPropertiesRestoreRule.java:53)
[junit4:junit4]    > 	at org.apache.lucene.util.AbstractBeforeAfterRule$1.evaluate(AbstractBeforeAfterRule.java:46)
[junit4:junit4]    > 	at org.apache.lucene.util.TestRuleStoreClassName$1.evaluate(TestRuleStoreClassName.java:42)
[junit4:junit4]    > 	at com.carrotsearch.randomizedtesting.rules.SystemPropertiesInvariantRule$1.evaluate(SystemPropertiesInvariantRule.java:55)
[junit4:junit4]    > 	at com.carrotsearch.randomizedtesting.rules.NoShadowingOrOverridesOnMethodsRule$1.evaluate(NoShadowingOrOverridesOnMethodsRule.java:39)
[junit4:junit4]    > 	at com.carrotsearch.randomizedtesting.rules.NoShadowingOrOverridesOnMethodsRule$1.evaluate(NoShadowingOrOverridesOnMethodsRule.java:39)
[junit4:junit4]    > 	at com.carrotsearch.randomizedtesting.rules.StatementAdapter.evaluate(StatementAdapter.java:36)
[junit4:junit4]    > 	at org.apache.lucene.util.TestRuleAssertionsRequired$1.evaluate(TestRuleAssertionsRequired.java:43)
[junit4:junit4]    > 	at org.apache.lucene.util.TestRuleMarkFailure$1.evaluate(TestRuleMarkFailure.java:48)
[junit4:junit4]    > 	at org.apache.lucene.util.TestRuleIgnoreAfterMaxFailures$1.evaluate(TestRuleIgnoreAfterMaxFailures.java:70)
[junit4:junit4]    > 	at org.apache.lucene.util.TestRuleIgnoreTestSuites$1.evaluate(TestRuleIgnoreTestSuites.java:55)
[junit4:junit4]    > 	at com.carrotsearch.randomizedtesting.rules.StatementAdapter.evaluate(StatementAdapter.java:36)
[junit4:junit4]    > 	at com.carrotsearch.randomizedtesting.ThreadLeakControl$StatementRunner.run(ThreadLeakControl.java:358)
[junit4:junit4]    > 	at java.lang.Thread.run(Thread.java:722)
[junit4:junit4]   2> 9608 T568 oas.SolrTestCaseJ4.setUp ###Starting testSoftAndHardCommitMaxTimeRapidAdds
[junit4:junit4]   2> 9609 T568 oasc.CoreContainer.reload Reloading SolrCore 'collection1' using instanceDir: /usr/home/hudson/hudson-slave/workspace/Lucene-Solr-Tests-4.x-java7/solr/build/solr-core/test-files/solr/collection1
[junit4:junit4]   2> 9609 T568 oasc.SolrResourceLoader.<init> new SolrResourceLoader for directory: '/usr/home/hudson/hudson-slave/workspace/Lucene-Solr-Tests-4.x-java7/solr/build/solr-core/test-files/solr/collection1/'
[junit4:junit4]   2> 9610 T568 oasc.SolrResourceLoader.replaceClassLoader Adding 'file:/usr/home/hudson/hudson-slave/workspace/Lucene-Solr-Tests-4.x-java7/solr/build/solr-core/test-files/solr/collection1/lib/README' to classloader
[junit4:junit4]   2> 9611 T568 oasc.SolrResourceLoader.replaceClassLoader Adding 'file:/usr/home/hudson/hudson-slave/workspace/Lucene-Solr-Tests-4.x-java7/solr/build/solr-core/test-files/solr/collection1/lib/classes/' to classloader
[junit4:junit4]   2> 9668 T568 oasc.SolrConfig.<init> Using Lucene MatchVersion: LUCENE_43
[junit4:junit4]   2> 9722 T568 oasc.SolrConfig.<init> Loaded SolrConfig: solrconfig.xml
[junit4:junit4]   2> 9723 T568 oass.IndexSchema.readSchema Reading Solr Schema
[junit4:junit4]   2> 9728 T568 oass.IndexSchema.readSchema Schema name=test
[junit4:junit4]   2> 10199 T568 oass.OpenExchangeRatesOrgProvider.init Initialized with rates=open-exchange-rates.json, refreshInterval=1440.
[junit4:junit4]   2> 10208 T568 oass.IndexSchema.readSchema default search field in schema is text
[junit4:junit4]   2> 10212 T568 oass.IndexSchema.readSchema unique key field: id
[junit4:junit4]   2> 10220 T568 oass.FileExchangeRateProvider.reload Reloading exchange rates from file currency.xml
[junit4:junit4]   2> 10224 T568 oass.FileExchangeRateProvider.reload Reloading exchange rates from file currency.xml
[junit4:junit4]   2> 10228 T568 oass.OpenExchangeRatesOrgProvider.reload Reloading exchange rates from open-exchange-rates.json
[junit4:junit4]   2> 10229 T568 oass.OpenExchangeRatesOrgProvider$OpenExchangeRates.<init> WARNING Unknown key IMPORTANT NOTE
[junit4:junit4]   2> 10229 T568 oass.OpenExchangeRatesOrgProvider$OpenExchangeRates.<init> WARNING Expected key, got STRING
[junit4:junit4]   2> 10229 T568 oass.OpenExchangeRatesOrgProvider.reload Reloading exchange rates from open-exchange-rates.json
[junit4:junit4]   2> 10230 T568 oass.OpenExchangeRatesOrgProvider$OpenExchangeRates.<init> WARNING Unknown key IMPORTANT NOTE
[junit4:junit4]   2> 10230 T568 oass.OpenExchangeRatesOrgProvider$OpenExchangeRates.<init> WARNING Expected key, got STRING
[junit4:junit4]   2> 10230 T568 oasc.SolrCore.<init> [collection1] Opening new SolrCore at /usr/home/hudson/hudson-slave/workspace/Lucene-Solr-Tests-4.x-java7/solr/build/solr-core/test-files/solr/collection1/, dataDir=/usr/home/hudson/hudson-slave/workspace/Lucene-Solr-Tests-4.x-java7/solr/build/solr-core/test/J0/./solrtest-SoftAutoCommitTest-1364019288036/
[junit4:junit4]   2> 10231 T568 oasc.JmxMonitoredMap.<init> JMX monitoring is enabled. Adding Solr mbeans to JMX Server: com.sun.jmx.mbeanserver.JmxMBeanServer@3d0360b8
[junit4:junit4]   2> 10231 T568 oasc.SolrCore.getNewIndexDir New index directory detected: old=null new=/usr/home/hudson/hudson-slave/workspace/Lucene-Solr-Tests-4.x-java7/solr/build/solr-core/test/J0/./solrtest-SoftAutoCommitTest-1364019288036/index/
[junit4:junit4]   2> 10232 T568 oasc.SolrCore.initWriters created xml: solr.XMLResponseWriter
[junit4:junit4]   2> 10233 T568 oasup.UpdateRequestProcessorChain.init inserting DistributedUpdateProcessorFactory into updateRequestProcessorChain "dedupe"
[junit4:junit4]   2> 10234 T568 oasup.UpdateRequestProcessorChain.init inserting DistributedUpdateProcessorFactory into updateRequestProcessorChain "dedupe-allfields"
[junit4:junit4]   2> 10234 T568 oasup.UpdateRequestProcessorChain.init inserting DistributedUpdateProcessorFactory into updateRequestProcessorChain "stored_sig"
[junit4:junit4]   2> 10235 T568 oasup.UpdateRequestProcessorChain.init inserting DistributedUpdateProcessorFactory into updateRequestProcessorChain "uniq-fields"
[junit4:junit4]   2> 10235 T568 oasup.UpdateRequestProcessorChain.init inserting DistributedUpdateProcessorFactory into updateRequestProcessorChain "distrib-dup-test-chain-implicit"
[junit4:junit4]   2> 10235 T568 oasc.RequestHandlers.initHandlersFromConfig adding lazy requestHandler: solr.ReplicationHandler
[junit4:junit4]   2> 10236 T568 oasc.RequestHandlers.initHandlersFromConfig created /replication: solr.ReplicationHandler
[junit4:junit4]   2> 10236 T568 oasc.RequestHandlers.initHandlersFromConfig created standard: solr.StandardRequestHandler
[junit4:junit4]   2> 10237 T568 oasc.RequestHandlers.initHandlersFromConfig created /get: solr.RealTimeGetHandler
[junit4:junit4]   2> 10237 T568 oasc.RequestHandlers.initHandlersFromConfig created dismax: solr.SearchHandler
[junit4:junit4]   2> 10238 T568 oasc.RequestHandlers.initHandlersFromConfig created mock: org.apache.solr.core.MockQuerySenderListenerReqHandler
[junit4:junit4]   2> 10238 T568 oasc.RequestHandlers.initHandlersFromConfig created /admin/: org.apache.solr.handler.admin.AdminHandlers
[junit4:junit4]   2> 10239 T568 oasc.RequestHandlers.initHandlersFromConfig created defaults: solr.StandardRequestHandler
[junit4:junit4]   2> 10239 T568 oasc.RequestHandlers.initHandlersFromConfig adding lazy requestHandler: solr.StandardRequestHandler
[junit4:junit4]   2> 10240 T568 oasc.RequestHandlers.initHandlersFromConfig created lazy: solr.StandardRequestHandler
[junit4:junit4]   2> 10240 T568 oasc.RequestHandlers.initHandlersFromConfig created /update: solr.UpdateRequestHandler
[junit4:junit4]   2> 10241 T568 oasc.RequestHandlers.initHandlersFromConfig created /terms: org.apache.solr.handler.component.SearchHandler
[junit4:junit4]   2> 10241 T568 oasc.RequestHandlers.initHandlersFromConfig created spellCheckCompRH: org.apache.solr.handler.component.SearchHandler
[junit4:junit4]   2> 10242 T568 oasc.RequestHandlers.initHandlersFromConfig created spellCheckCompRH_Direct: org.apache.solr.handler.component.SearchHandler
[junit4:junit4]   2> 10242 T568 oasc.RequestHandlers.initHandlersFromConfig created spellCheckWithWordbreak: org.apache.solr.handler.component.SearchHandler
[junit4:junit4]   2> 10243 T568 oasc.RequestHandlers.initHandlersFromConfig created spellCheckWithWordbreak_Direct: org.apache.solr.handler.component.SearchHandler
[junit4:junit4]   2> 10243 T568 oasc.RequestHandlers.initHandlersFromConfig created spellCheckCompRH1: org.apache.solr.handler.component.SearchHandler
[junit4:junit4]   2> 10244 T568 oasc.RequestHandlers.initHandlersFromConfig created mltrh: org.apache.solr.handler.component.SearchHandler
[junit4:junit4]   2> 10244 T568 oasc.RequestHandlers.initHandlersFromConfig created tvrh: org.apache.solr.handler.component.SearchHandler
[junit4:junit4]   2> 10245 T568 oasc.RequestHandlers.initHandlersFromConfig created /mlt: solr.MoreLikeThisHandler
[junit4:junit4]   2> 10245 T568 oasc.RequestHandlers.initHandlersFromConfig created /debug/dump: solr.DumpRequestHandler
[junit4:junit4]   2> 10256 T568 oashl.XMLLoader.init xsltCacheLifetimeSeconds=60
[junit4:junit4]   2> 10260 T568 oasc.SolrCore.initDeprecatedSupport WARNING solrconfig.xml uses deprecated <admin/gettableFiles>, Please update your config to use the ShowFileRequestHandler.
[junit4:junit4]   2> 10262 T568 oasc.SolrCore.initDeprecatedSupport WARNING adding ShowFileRequestHandler with hidden files: [THROW.ERROR.ON.ADD.UPDATEPROCESSOR.JS, SOLRCONFIG-HIGHLIGHT.XML, SCHEMA-REQUIRED-FIELDS.XML, SCHEMA-REPLICATION2.XML, TRIVIAL.UPDATEPROCESSOR1.JS, BAD-SCHEMA-DUP-DYNAMICFIELD.XML, BAD-SCHEMA-DOCVALUES-NOT-REQUIRED-NO-DEFAULT.XML, SCHEMA-MINIMAL.XML, SOLRCONFIG-CACHING.XML, SCHEMA-POSTINGSHIGHLIGHT.XML, SOLRCONFIG-REPEATER.XML, REGEX-BOOST-PROCESSOR-TEST.TXT, BAD-SCHEMA-CURRENCY-FT-BOGUS-CODE-IN-XML.XML, CURRENCY.XML, SOLRCONFIG-MERGEPOLICY.XML, BAD-SCHEMA-NONTEXT-ANALYZER.XML, SOLRCONFIG-TLOG.XML, SOLRCONFIG-MASTER.XML, SOLRCONFIG-COMPONENTS-NAME.XML, BAD-SCHEMA-UNIQUEKEY-MULTIVALUED.XML, SCHEMA11.XML, SOLRCONFIG-BASIC.XML, DA_COMPOUNDDICTIONARY.TXT, MISSLEADING.EXTENSION.UPDATEPROCESSOR.JS.TXT, SCHEMA-COPYFIELD-TEST.XML, SOLRCONFIG-SLAVE.XML, SOLRCONFIG-PROPINJECT-INDEXDEFAULT.XML, ELEVATE.XML, TRIVIAL.UPDATEPROCESSOR0.JS, SCHEMA-SWEETSPOT.XML, BAD-SOLRCONFIG-BOGUS-SCRIPTENGINE-NAME.XML, SCHEMA-IB.XML, SCHEMA-CHARFILTERS.XML, SOLRCONFIG-QUERYSENDER.XML, DA_UTF8.XML, SCHEMA-REPLICATION1.XML, SOLRCONFIG-SNIPPET-PROCESSOR.XML, CONDITIONAL.UPDATEPROCESSOR.JS, SCHEMA-TINY.XML, MISSING.FUNCTIONS.UPDATEPROCESSOR.JS, SOLRCONFIG-ENABLEPLUGIN.XML, HYPHENATION.DTD, STEMDICT.TXT, SCHEMA-PHRASESUGGEST.XML, HUNSPELL-TEST.AFF, BAD-SCHEMA-CURRENCY-FT-OER-NORATES.XML, SCHEMA-SNIPPET-TYPE.XML, STOPTYPES-1.TXT, STOPWORDSWRONGENCODING.TXT, SCHEMA-NUMERIC.XML, SOLRCONFIG-TRANSFORMERS.XML, SOLRCONFIG-PROPINJECT.XML, BAD-SCHEMA-NOT-INDEXED-BUT-TF.XML, SOLRCONFIG-SIMPLELOCK.XML, SCHEMA-DOCVALUES.XML, WDFTYPES.TXT, SCHEMA-REVERSED.XML, STOPTYPES-2.TXT, BAD-SCHEMA-CURRENCY-FT-MULTIVALUED.XML, SOLRCONFIG-SPELLCHECKCOMPONENT.XML, BAD-SCHEMA-CURRENCY-MULTIVALUED.XML, SCHEMA-DFR.XML, SOLRCONFIG-PHRASESUGGEST.XML, BAD-SCHEMA-NOT-INDEXED-BUT-POS.XML, KEEP-1.TXT, OPEN-EXCHANGE-RATES.JSON, SCHEMA-SPATIAL.XML, STOPWITHBOM.TXT, SOLRCONFIG-SPELLCHECKER.XML, SOLRCONFIG-POSTINGSHIGHLIGHT.XML, SCHEMA-BINARYFIELD.XML, SOLRCONFIG-UPDATE-PROCESSOR-CHAINS.XML, BAD-SCHEMA-OMIT-TF-BUT-NOT-POS.XML, BAD-SCHEMA-DUP-FIELDTYPE.XML, SCHEMA-XINCLUDE.XML, SOLRCONFIG-MASTER1.XML, SCHEMA-BEHAVIOR.XML, SYNONYMS.TXT, SOLRCONFIG-MINIMAL.XML, SCHEMA-DOCVALUESMULTI.XML, BAD-SCHEMA-CURRENCY-DYNAMIC-MULTIVALUED.XML, BAD-SCHEMA-UNSUPPORTED-DOCVALUES.XML, SCHEMA_CODEC.XML, BAD-SCHEMA-SWEETSPOT-PARTIAL-HYPERBOLIC.XML, SOLRCONFIG-SOLR-749.XML, SOLRCONFIG-MASTER1-KEEPONEBACKUP.XML, SCHEMA-EFF.XML, STOP-2.TXT, SOLRCONFIG-FUNCTIONQUERY.XML, SCHEMA-LMDIRICHLET.XML, SOLRCONFIG-TERMINDEX.XML, BAD-SCHEMA-SWEETSPOT-PARTIAL-NORMS.XML, SOLRCONFIG-ELEVATE.XML, BAD-SCHEMA-SWEETSPOT-PARTIAL-BASELINE.XML, STOPWORDS.TXT, SCHEMA-FOLDING.XML, SCHEMA-STOP-KEEP.XML, FUZZYSUGGEST.TXT, BAD-SCHEMA-NOT-INDEXED-BUT-NORMS.XML, SCHEMA-REST.XML, SOLRCONFIG-SOLCOREPROPERTIES.XML, STOP-1.TXT, SOLRCONFIG-MASTER2.XML, SCHEMA-SPELLCHECKER.XML, SOLRCONFIG-RESPONSE-LOG-COMPONENT.XML, SOLRCONFIG-LAZYWRITER.XML, SCHEMA-LUCENEMATCHVERSION.XML, BAD-MP-SOLRCONFIG.XML, FRENCHARTICLES.TXT, SCHEMA15.XML, SOLRCONFIG-REQHANDLER.INCL, SCHEMASURROUND.XML, SCHEMA-COLLATEFILTER.XML, SOLRCONFIG-MASTER3.XML, HUNSPELL-TEST.DIC, BAD-SCHEMA-CODEC-GLOBAL-VS-FT-MISMATCH.XML, SOLRCONFIG-XINCLUDE.XML, SOLRCONFIG-SLAVE1.XML, SOLRCONFIG-DELPOLICY1.XML, SCHEMA-SIM.XML, SCHEMA-SNIPPET-FIELD.XML, SCHEMA-COLLATE.XML, STOP-SNOWBALL.TXT, BAD-SCHEMA-SIM-GLOBAL-VS-FT-MISMATCH.XML, PROTWORDS.TXT, SCHEMA-TRIE.XML, SOLRCONFIG_CODEC.XML, SCHEMA-SYNONYM-TOKENIZER.XML, BAD-SOLRCONFIG-INVALID-SCRIPTFILE.XML, JASUGGEST.TXT, SCHEMA-DOCVALUESFACETING.XML, SCHEMA-TFIDF.XML, SOLRCONFIG-SCRIPT-UPDATEPROCESSOR.XML, SCHEMA-LMJELINEKMERCER.XML, PHRASESUGGEST.TXT, BAD-SOLRCONFIG-MISSING-SCRIPTFILE.XML, SOLRCONFIG-BASIC-LUCENEVERSION31.XML, BAD-SCHEMA-UNIQUEKEY-USES-DEFAULT.XML, OLD_SYNONYMS.TXT, SOLRCONFIG-DELPOLICY2.XML, SOLRCONFIG-NATIVELOCK.XML, XSLT, BAD-SCHEMA-DUP-FIELD.XML, SOLRCONFIG-NOCACHE.XML, SCHEMA-BM25.XML, BAD-SCHEMA-SWEETSPOT-BOTH-TF.XML, ADDFIELDS.UPDATEPROCESSOR.JS, SOLRCONFIG-ALTDIRECTORY.XML, SOLRCONFIG-QUERYSENDER-NOQUERY.XML, COMPOUNDDICTIONARY.TXT, BAD-SCHEMA-CURRENCY-FT-BOGUS-DEFAULT-CODE.XML, BAD-CURRENCY.XML, SOLRCONFIG-INDEXCONFIG.XML, SOLRCONFIG_PERF.XML, SCHEMA-NOT-REQUIRED-UNIQUE-KEY.XML, BAD-SCHEMA-ANALYZER-CLASS-AND-NESTED.XML, KEEP-2.TXT, SCHEMA12.XML, BAD-SCHEMA-UNIQUEKEY-IS-COPYFIELD-DEST.XML, MAPPING-ISOLATIN1ACCENT.TXT, BAD_SOLRCONFIG.XML, BAD-SCHEMA-EXTERNAL-FILEFIELD.XML]
[junit4:junit4]   2> 10265 T568 oass.SolrIndexSearcher.<init> Opening Searcher@177d31a7 main
[junit4:junit4]   2> 10265 T568 oasu.CommitTracker.<init> Hard AutoCommit: disabled
[junit4:junit4]   2> 10266 T568 oasu.CommitTracker.<init> Soft AutoCommit: disabled
[junit4:junit4]   2> 10266 T568 oashc.SpellCheckComponent.inform Initializing spell checkers
[junit4:junit4]   2> 10268 T568 oass.DirectSolrSpellChecker.init init: {name=direct,classname=DirectSolrSpellChecker,field=lowerfilt,minQueryLength=3}
[junit4:junit4]   2> 10281 T576 oasc.SolrCore.registerSearcher [collection1] Registered new searcher Searcher@177d31a7 main{StandardDirectoryReader(segments_5:13:nrt _1(4.3):C1 _3(4.3):C1)}
[junit4:junit4]   2> 10287 T568 oasu.DefaultSolrCoreState.newIndexWriter Creating new IndexWriter...
[junit4:junit4]   2> 10287 T568 oasu.DefaultSolrCoreState.newIndexWriter Waiting until IndexWriter is unused... core=collection1
[junit4:junit4]   2> 10287 T568 oasu.DefaultSolrCoreState.newIndexWriter Closing old IndexWriter... core=collection1
[junit4:junit4]   2> 10290 T568 oasc.SolrDeletionPolicy.onInit SolrDeletionPolicy.onInit: commits:num=1
[junit4:junit4]   2> 		commit{dir=RateLimitedDirectoryWrapper(MockDirWrapper(org.apache.lucene.store.RAMDirectory@1bba1616 lockFactory=org.apache.lucene.store.NativeFSLockFactory@2640dab3)),segFN=segments_5,generation=5,filenames=[_3.nrm, _3.frq, _3.tii, _1.tis, _1.frq, _3.fnm, _3.prx, _3.fdt, _1.fnm, _3.fdx, _1.fdx, _1.prx, _1.fdt, _1.si, _3.si, _1.tii, segments_5, _1.nrm, _3.tis]
[junit4:junit4]   2> 10290 T568 oasc.SolrDeletionPolicy.updateCommits newest commit = 5[_3.nrm, _3.frq, _3.tii, _1.tis, _1.frq, _3.fnm, _3.prx, _3.fdt, _1.fnm, _3.fdx, _1.fdx, _1.prx, _1.fdt, _1.si, _3.si, _1.tii, segments_5, _1.nrm, _3.tis]
[junit4:junit4]   2> 10290 T568 oasu.DefaultSolrCoreState.newIndexWriter New IndexWriter is ready to be used.
[junit4:junit4]   2> 10291 T568 oass.SolrIndexSearcher.<init> Opening Searcher@78b12643 main
[junit4:junit4]   2> 10292 T568 oasc.CoreContainer.registerCore replacing core: collection1
[junit4:junit4]   2> 10292 T568 oasc.SolrCore.close [collection1]  CLOSING SolrCore org.apache.solr.core.SolrCore@3df1671d
[junit4:junit4]   2> 10293 T576 oasc.SolrCore.registerSearcher [collection1] Registered new searcher Searcher@78b12643 main{StandardDirectoryReader(segments_5:13:nrt _1(4.3):C1 _3(4.3):C1)}
[junit4:junit4]   2> 10296 T568 oasu.DirectUpdateHandler2.close closing DirectUpdateHandler2{commits=5,autocommit maxTime=1200ms,autocommits=2,soft autocommit maxTime=500ms,soft autocommits=2,optimizes=0,rollbacks=0,expungeDeletes=0,docsPending=0,adds=0,deletesById=0,deletesByQuery=0,errors=0,cumulative_adds=2,cumulative_deletesById=1,cumulative_deletesByQuery=0,cumulative_errors=0}
[junit4:junit4]   2> 10297 T568 oasc.SolrCore.closeSearcher [collection1] Closing main searcher on request.
[junit4:junit4]   2> ASYNC  NEW_CORE C29 name=collection1 org.apache.solr.core.SolrCore@2bc9877a
[junit4:junit4]   2> 10306 T568 C29 UPDATE [collection1] webapp=null path=null params={} {add=[5000]} 0 2
[junit4:junit4]   2> 10313 T568 C29 UPDATE [collection1] webapp=null path=null params={} {add=[5001]} 0 0
[junit4:junit4]   2> 10320 T568 C29 UPDATE [collection1] webapp=null path=null params={} {add=[5002]} 0 0
[junit4:junit4]   2> 10327 T568 C29 UPDATE [collection1] webapp=null path=null params={} {add=[5003]} 0 0
[junit4:junit4]   2> 10334 T568 C29 UPDATE [collection1] webapp=null path=null params={} {add=[5004]} 0 1
[junit4:junit4]   2> 10335 T568 oas.SolrTestCaseJ4.tearDown ###Ending testSoftAndHardCommitMaxTimeRapidAdds
[junit4:junit4]   2> 10336 T568 oas.SolrTestCaseJ4.deleteCore ###deleteCore
[junit4:junit4]   2> 10337 T568 oasc.CoreContainer.shutdown Shutting down CoreContainer instance=297261607
[junit4:junit4]   2> 10337 T568 oasc.SolrCore.close [collection1]  CLOSING SolrCore org.apache.solr.core.SolrCore@2bc9877a
[junit4:junit4]   2> 10344 T568 oasu.DirectUpdateHandler2.close closing DirectUpdateHandler2{commits=0,autocommit maxTime=1200ms,autocommits=0,soft autocommit maxTime=500ms,soft autocommits=0,optimizes=0,rollbacks=0,expungeDeletes=0,docsPending=5,adds=5,deletesById=0,deletesByQuery=0,errors=0,cumulative_adds=5,cumulative_deletesById=0,cumulative_deletesByQuery=0,cumulative_errors=0}
[junit4:junit4]   2> 10344 T568 oasu.SolrCoreState.decrefSolrCoreState Closing SolrCoreState
[junit4:junit4]   2> 10345 T568 oasu.DefaultSolrCoreState.closeIndexWriter SolrCoreState ref count has reached 0 - closing IndexWriter
[junit4:junit4]   2> 10345 T568 oasu.DefaultSolrCoreState.closeIndexWriter closing IndexWriter with IndexWriterCloser
[junit4:junit4]   2> 10347 T568 C29 oasc.SolrDeletionPolicy.onCommit SolrDeletionPolicy.onCommit: commits:num=2
[junit4:junit4]   2> 		commit{dir=RateLimitedDirectoryWrapper(MockDirWrapper(org.apache.lucene.store.RAMDirectory@1bba1616 lockFactory=org.apache.lucene.store.NativeFSLockFactory@2640dab3)),segFN=segments_5,generation=5,filenames=[_3.nrm, _3.frq, _3.tii, _1.tis, _1.frq, _3.fnm, _3.prx, _3.fdt, _1.fnm, _3.fdx, _1.fdx, _1.prx, _1.fdt, _1.si, _3.si, _1.tii, segments_5, _1.nrm, _3.tis]
[junit4:junit4]   2> 		commit{dir=RateLimitedDirectoryWrapper(MockDirWrapper(org.apache.lucene.store.RAMDirectory@1bba1616 lockFactory=org.apache.lucene.store.NativeFSLockFactory@2640dab3)),segFN=segments_6,generation=6,filenames=[_3.tii, _3.frq, _1.frq, _4.prx, _4.fnm, _3.fdt, _3.fnm, _1.fnm, _4.fdx, _4.frq, _1.tii, _4.tis, _3.nrm, _4.tii, _1.tis, _4.nrm, _4.si, _4.fdt, _3.prx, _3.fdx, _1.prx, _1.fdx, _1.fdt, _1.si, _3.si, segments_6, _1.nrm, _3.tis]
[junit4:junit4]   2> 10347 T568 C29 oasc.SolrDeletionPolicy.updateCommits newest commit = 6[_3.tii, _3.frq, _1.frq, _4.prx, _4.fnm, _3.fdt, _3.fnm, _1.fnm, _4.fdx, _4.frq, _1.tii, _4.tis, _3.nrm, _4.tii, _1.tis, _4.nrm, _4.si, _4.fdt, _3.prx, _3.fdx, _1.prx, _1.fdx, _1.fdt, _1.si, _3.si, segments_6, _1.nrm, _3.tis]
[junit4:junit4]   2> 10348 T568 oasc.SolrCore.closeSearcher [collection1] Closing main searcher on request.
[junit4:junit4]   2> 10349 T568 oasc.CachingDirectoryFactory.close Closing directory when closing factory: /usr/home/hudson/hudson-slave/workspace/Lucene-Solr-Tests-4.x-java7/solr/build/solr-core/test/J0/./solrtest-SoftAutoCommitTest-1364019288036/index
[junit4:junit4]   2> 10349 T568 oasc.CachingDirectoryFactory.closeDirectory Closing directory: /usr/home/hudson/hudson-slave/workspace/Lucene-Solr-Tests-4.x-java7/solr/build/solr-core/test/J0/./solrtest-SoftAutoCommitTest-1364019288036/index
[junit4:junit4]   2> 10349 T568 oasc.CachingDirectoryFactory.close Closing directory when closing factory: /usr/home/hudson/hudson-slave/workspace/Lucene-Solr-Tests-4.x-java7/solr/build/solr-core/test/J0/./solrtest-SoftAutoCommitTest-1364019288036
[junit4:junit4]   2> 10349 T568 oasc.CachingDirectoryFactory.closeDirectory Closing directory: /usr/home/hudson/hudson-slave/workspace/Lucene-Solr-Tests-4.x-java7/solr/build/solr-core/test/J0/./solrtest-SoftAutoCommitTest-1364019288036
[junit4:junit4]   2> NOTE: test params are: codec=Lucene3x, sim=DefaultSimilarity, locale=es_PY, timezone=CST6CDT
[junit4:junit4]   2> NOTE: FreeBSD 9.0-RELEASE amd64/Oracle Corporation 1.7.0_17 (64-bit)/cpus=16,threads=1,free=132410192,total=519045120
[junit4:junit4]   2> NOTE: All tests run in this JVM: [TestJoin, TestPerFieldSimilarity, TestArbitraryIndexDir, FastVectorHighlighterTest, XmlUpdateRequestHandlerTest, AlternateDirectoryTest, SolrInfoMBeanTest, TestSweetSpotSimilarityFactory, IndexBasedSpellCheckerTest, DateFieldTest, TestBinaryField, TestStressRecovery, TestDefaultSimilarityFactory, PeerSyncTest, XsltUpdateRequestHandlerTest, QueryParsingTest, SpellCheckCollatorTest, TestRemoteStreaming, FileBasedSpellCheckerTest, LeaderElectionIntegrationTest, TestDistributedGrouping, RegexBoostProcessorTest, SuggesterTSTTest, SolrTestCaseJ4Test, TestQuerySenderListener, TestRealTimeGet, SoftAutoCommitTest]
[junit4:junit4] Completed on J0 in 10.40s, 3 tests, 1 failure <<< FAILURES!

[...truncated 687 lines...]
BUILD FAILED
/usr/home/hudson/hudson-slave/workspace/Lucene-Solr-Tests-4.x-java7/build.xml:381: The following error occurred while executing this line:
/usr/home/hudson/hudson-slave/workspace/Lucene-Solr-Tests-4.x-java7/build.xml:361: The following error occurred while executing this line:
/usr/home/hudson/hudson-slave/workspace/Lucene-Solr-Tests-4.x-java7/build.xml:39: The following error occurred while executing this line:
/usr/home/hudson/hudson-slave/workspace/Lucene-Solr-Tests-4.x-java7/solr/build.xml:183: The following error occurred while executing this line:
/usr/home/hudson/hudson-slave/workspace/Lucene-Solr-Tests-4.x-java7/solr/common-build.xml:449: The following error occurred while executing this line:
/usr/home/hudson/hudson-slave/workspace/Lucene-Solr-Tests-4.x-java7/lucene/common-build.xml:1212: The following error occurred while executing this line:
/usr/home/hudson/hudson-slave/workspace/Lucene-Solr-Tests-4.x-java7/lucene/common-build.xml:876: There were test failures: 273 suites, 1149 tests, 1 failure, 27 ignored (8 assumptions)

Total time: 53 minutes 29 seconds
Build step 'Invoke Ant' marked build as failure
Archiving artifacts
Recording test results
Email was triggered for: Failure
Sending email for trigger: Failure



Mime
View raw message