lucene-dev mailing list archives

Site index · List index
Message view « Date » · « Thread »
Top « Date » · « Thread »
From Policeman Jenkins Server <jenk...@thetaphi.de>
Subject [JENKINS] Lucene-Solr-4.x-MacOSX (64bit/jdk1.7.0) - Build # 329 - Failure!
Date Thu, 21 Mar 2013 14:14:29 GMT
Build: http://jenkins.thetaphi.de/job/Lucene-Solr-4.x-MacOSX/329/
Java: 64bit/jdk1.7.0 -XX:+UseSerialGC

1 tests failed.
REGRESSION:  org.apache.solr.client.solrj.TestBatchUpdate.testWithXml

Error Message:
IOException occured when talking to server at: https://127.0.0.1:53887/solr

Stack Trace:
org.apache.solr.client.solrj.SolrServerException: IOException occured when talking to server
at: https://127.0.0.1:53887/solr
	at __randomizedtesting.SeedInfo.seed([E71E5142A7DA82C5:4CFCE8B425DC9BA8]:0)
	at org.apache.solr.client.solrj.impl.HttpSolrServer.request(HttpSolrServer.java:416)
	at org.apache.solr.client.solrj.impl.HttpSolrServer.request(HttpSolrServer.java:181)
	at org.apache.solr.client.solrj.request.AbstractUpdateRequest.process(AbstractUpdateRequest.java:117)
	at org.apache.solr.client.solrj.SolrServer.commit(SolrServer.java:168)
	at org.apache.solr.client.solrj.SolrServer.commit(SolrServer.java:146)
	at org.apache.solr.client.solrj.TestBatchUpdate.doIt(TestBatchUpdate.java:130)
	at org.apache.solr.client.solrj.TestBatchUpdate.testWithXml(TestBatchUpdate.java:54)
	at sun.reflect.NativeMethodAccessorImpl.invoke0(Native Method)
	at sun.reflect.NativeMethodAccessorImpl.invoke(NativeMethodAccessorImpl.java:57)
	at sun.reflect.DelegatingMethodAccessorImpl.invoke(DelegatingMethodAccessorImpl.java:43)
	at java.lang.reflect.Method.invoke(Method.java:601)
	at com.carrotsearch.randomizedtesting.RandomizedRunner.invoke(RandomizedRunner.java:1559)
	at com.carrotsearch.randomizedtesting.RandomizedRunner.access$600(RandomizedRunner.java:79)
	at com.carrotsearch.randomizedtesting.RandomizedRunner$6.evaluate(RandomizedRunner.java:737)
	at com.carrotsearch.randomizedtesting.RandomizedRunner$7.evaluate(RandomizedRunner.java:773)
	at com.carrotsearch.randomizedtesting.RandomizedRunner$8.evaluate(RandomizedRunner.java:787)
	at com.carrotsearch.randomizedtesting.rules.SystemPropertiesRestoreRule$1.evaluate(SystemPropertiesRestoreRule.java:53)
	at org.apache.lucene.util.TestRuleSetupTeardownChained$1.evaluate(TestRuleSetupTeardownChained.java:50)
	at org.apache.lucene.util.TestRuleFieldCacheSanity$1.evaluate(TestRuleFieldCacheSanity.java:51)
	at org.apache.lucene.util.AbstractBeforeAfterRule$1.evaluate(AbstractBeforeAfterRule.java:46)
	at com.carrotsearch.randomizedtesting.rules.SystemPropertiesInvariantRule$1.evaluate(SystemPropertiesInvariantRule.java:55)
	at org.apache.lucene.util.TestRuleThreadAndTestName$1.evaluate(TestRuleThreadAndTestName.java:49)
	at org.apache.lucene.util.TestRuleIgnoreAfterMaxFailures$1.evaluate(TestRuleIgnoreAfterMaxFailures.java:70)
	at org.apache.lucene.util.TestRuleMarkFailure$1.evaluate(TestRuleMarkFailure.java:48)
	at com.carrotsearch.randomizedtesting.rules.StatementAdapter.evaluate(StatementAdapter.java:36)
	at com.carrotsearch.randomizedtesting.ThreadLeakControl$StatementRunner.run(ThreadLeakControl.java:358)
	at com.carrotsearch.randomizedtesting.ThreadLeakControl.forkTimeoutingTask(ThreadLeakControl.java:782)
	at com.carrotsearch.randomizedtesting.ThreadLeakControl$3.evaluate(ThreadLeakControl.java:442)
	at com.carrotsearch.randomizedtesting.RandomizedRunner.runSingleTest(RandomizedRunner.java:746)
	at com.carrotsearch.randomizedtesting.RandomizedRunner$3.evaluate(RandomizedRunner.java:648)
	at com.carrotsearch.randomizedtesting.RandomizedRunner$4.evaluate(RandomizedRunner.java:682)
	at com.carrotsearch.randomizedtesting.RandomizedRunner$5.evaluate(RandomizedRunner.java:693)
	at com.carrotsearch.randomizedtesting.rules.StatementAdapter.evaluate(StatementAdapter.java:36)
	at com.carrotsearch.randomizedtesting.rules.SystemPropertiesRestoreRule$1.evaluate(SystemPropertiesRestoreRule.java:53)
	at org.apache.lucene.util.AbstractBeforeAfterRule$1.evaluate(AbstractBeforeAfterRule.java:46)
	at org.apache.lucene.util.TestRuleStoreClassName$1.evaluate(TestRuleStoreClassName.java:42)
	at com.carrotsearch.randomizedtesting.rules.SystemPropertiesInvariantRule$1.evaluate(SystemPropertiesInvariantRule.java:55)
	at com.carrotsearch.randomizedtesting.rules.NoShadowingOrOverridesOnMethodsRule$1.evaluate(NoShadowingOrOverridesOnMethodsRule.java:39)
	at com.carrotsearch.randomizedtesting.rules.NoShadowingOrOverridesOnMethodsRule$1.evaluate(NoShadowingOrOverridesOnMethodsRule.java:39)
	at com.carrotsearch.randomizedtesting.rules.StatementAdapter.evaluate(StatementAdapter.java:36)
	at org.apache.lucene.util.TestRuleAssertionsRequired$1.evaluate(TestRuleAssertionsRequired.java:43)
	at org.apache.lucene.util.TestRuleMarkFailure$1.evaluate(TestRuleMarkFailure.java:48)
	at org.apache.lucene.util.TestRuleIgnoreAfterMaxFailures$1.evaluate(TestRuleIgnoreAfterMaxFailures.java:70)
	at org.apache.lucene.util.TestRuleIgnoreTestSuites$1.evaluate(TestRuleIgnoreTestSuites.java:55)
	at com.carrotsearch.randomizedtesting.rules.StatementAdapter.evaluate(StatementAdapter.java:36)
	at com.carrotsearch.randomizedtesting.ThreadLeakControl$StatementRunner.run(ThreadLeakControl.java:358)
	at java.lang.Thread.run(Thread.java:722)
Caused by: org.apache.http.NoHttpResponseException: The target server failed to respond
	at org.apache.http.impl.conn.DefaultHttpResponseParser.parseHead(DefaultHttpResponseParser.java:95)
	at org.apache.http.impl.conn.DefaultHttpResponseParser.parseHead(DefaultHttpResponseParser.java:62)
	at org.apache.http.impl.io.AbstractMessageParser.parse(AbstractMessageParser.java:254)
	at org.apache.http.impl.AbstractHttpClientConnection.receiveResponseHeader(AbstractHttpClientConnection.java:289)
	at org.apache.http.impl.conn.DefaultClientConnection.receiveResponseHeader(DefaultClientConnection.java:252)
	at org.apache.http.impl.conn.ManagedClientConnectionImpl.receiveResponseHeader(ManagedClientConnectionImpl.java:191)
	at org.apache.http.protocol.HttpRequestExecutor.doReceiveResponse(HttpRequestExecutor.java:300)
	at org.apache.http.protocol.HttpRequestExecutor.execute(HttpRequestExecutor.java:127)
	at org.apache.http.impl.client.DefaultRequestDirector.tryExecute(DefaultRequestDirector.java:717)
	at org.apache.http.impl.client.DefaultRequestDirector.execute(DefaultRequestDirector.java:522)
	at org.apache.http.impl.client.AbstractHttpClient.execute(AbstractHttpClient.java:906)
	at org.apache.http.impl.client.AbstractHttpClient.execute(AbstractHttpClient.java:805)
	at org.apache.http.impl.client.AbstractHttpClient.execute(AbstractHttpClient.java:784)
	at org.apache.solr.client.solrj.impl.HttpSolrServer.request(HttpSolrServer.java:353)
	... 46 more




Build Log:
[...truncated 10246 lines...]
[junit4:junit4] Suite: org.apache.solr.client.solrj.TestBatchUpdate
[junit4:junit4]   2> 0 T333 oas.SolrJettyTestBase.beforeSolrJettyTestBase Randomized ssl
(true) and clientAuth (false)
[junit4:junit4]   2> 1 T333 oas.SolrTestCaseJ4.initCore ####initCore
[junit4:junit4]   2> Creating dataDir: /Users/jenkins/jenkins-slave/workspace/Lucene-Solr-4.x-MacOSX/solr/build/solr-solrj/test/J0/./solrtest-TestBatchUpdate-1363874949561
[junit4:junit4]   2> 2 T333 oas.SolrTestCaseJ4.initCore ####initCore end
[junit4:junit4]   2> 3 T333 oejs.Server.doStart jetty-8.1.8.v20121106
[junit4:junit4]   2> 11 T333 oejus.SslContextFactory.doStart Enabled Protocols [SSLv2Hello,
SSLv3, TLSv1, TLSv1.1, TLSv1.2] of [SSLv2Hello, SSLv3, TLSv1, TLSv1.1, TLSv1.2]
[junit4:junit4]   2> 18 T333 oejs.AbstractConnector.doStart Started SslSelectChannelConnector@127.0.0.1:53887
[junit4:junit4]   2> 18 T333 oass.SolrDispatchFilter.init SolrDispatchFilter.init()
[junit4:junit4]   2> 19 T333 oasc.SolrResourceLoader.locateSolrHome JNDI not configured
for solr (NoInitialContextEx)
[junit4:junit4]   2> 19 T333 oasc.SolrResourceLoader.locateSolrHome using system property
solr.solr.home: /Users/jenkins/jenkins-slave/workspace/Lucene-Solr-4.x-MacOSX/solr/example/solr
[junit4:junit4]   2> 19 T333 oasc.CoreContainer$Initializer.initialize looking for solr
config file: /Users/jenkins/jenkins-slave/workspace/Lucene-Solr-4.x-MacOSX/solr/example/solr/solr.xml
[junit4:junit4]   2> 20 T333 oasc.CoreContainer.<init> New CoreContainer 1553685509
[junit4:junit4]   2> 21 T333 oasc.CoreContainer.load Loading CoreContainer using Solr Home:
'/Users/jenkins/jenkins-slave/workspace/Lucene-Solr-4.x-MacOSX/solr/example/solr/'
[junit4:junit4]   2> 21 T333 oasc.SolrResourceLoader.<init> new SolrResourceLoader
for directory: '/Users/jenkins/jenkins-slave/workspace/Lucene-Solr-4.x-MacOSX/solr/example/solr/'
[junit4:junit4]   2> 70 T333 oashc.HttpShardHandlerFactory.getParameter Setting socketTimeout
to: 0
[junit4:junit4]   2> 71 T333 oashc.HttpShardHandlerFactory.getParameter Setting urlScheme
to: http://
[junit4:junit4]   2> 72 T333 oashc.HttpShardHandlerFactory.getParameter Setting connTimeout
to: 0
[junit4:junit4]   2> 72 T333 oashc.HttpShardHandlerFactory.getParameter Setting maxConnectionsPerHost
to: 20
[junit4:junit4]   2> 73 T333 oashc.HttpShardHandlerFactory.getParameter Setting corePoolSize
to: 0
[junit4:junit4]   2> 73 T333 oashc.HttpShardHandlerFactory.getParameter Setting maximumPoolSize
to: 2147483647
[junit4:junit4]   2> 74 T333 oashc.HttpShardHandlerFactory.getParameter Setting maxThreadIdleTime
to: 5
[junit4:junit4]   2> 74 T333 oashc.HttpShardHandlerFactory.getParameter Setting sizeOfQueue
to: -1
[junit4:junit4]   2> 75 T333 oashc.HttpShardHandlerFactory.getParameter Setting fairnessPolicy
to: false
[junit4:junit4]   2> 75 T333 oascsi.HttpClientUtil.createClient Creating new http client,
config:maxConnectionsPerHost=20&maxConnections=10000&socketTimeout=0&connTimeout=0&retry=false
[junit4:junit4]   2> 87 T333 oasc.CoreContainer.load Registering Log Listener
[junit4:junit4]   2> 121 T343 oasc.CoreContainer.create Creating SolrCore 'collection1'
using instanceDir: /Users/jenkins/jenkins-slave/workspace/Lucene-Solr-4.x-MacOSX/solr/example/solr/collection1
[junit4:junit4]   2> 122 T343 oasc.SolrResourceLoader.<init> new SolrResourceLoader
for directory: '/Users/jenkins/jenkins-slave/workspace/Lucene-Solr-4.x-MacOSX/solr/example/solr/collection1/'
[junit4:junit4]   2> 180 T343 oasc.SolrConfig.initLibs Adding specified lib dirs to ClassLoader
[junit4:junit4]   2> 310 T343 oasc.SolrConfig.<init> Using Lucene MatchVersion: LUCENE_43
[junit4:junit4]   2> 435 T343 oasc.SolrConfig.<init> Loaded SolrConfig: solrconfig.xml
[junit4:junit4]   2> 436 T343 oass.IndexSchema.readSchema Reading Solr Schema
[junit4:junit4]   2> 466 T343 oass.IndexSchema.readSchema Schema name=example
[junit4:junit4]   2> 1378 T343 oass.IndexSchema.readSchema unique key field: id
[junit4:junit4]   2> 1412 T343 oass.FileExchangeRateProvider.reload Reloading exchange
rates from file currency.xml
[junit4:junit4]   2> 1420 T343 oass.FileExchangeRateProvider.reload Reloading exchange
rates from file currency.xml
[junit4:junit4]   2> 1451 T343 oasc.SolrCore.initDirectoryFactory org.apache.solr.core.MockDirectoryFactory
[junit4:junit4]   2> 1452 T343 oasc.SolrCore.<init> [collection1] Opening new SolrCore
at /Users/jenkins/jenkins-slave/workspace/Lucene-Solr-4.x-MacOSX/solr/example/solr/collection1/,
dataDir=/Users/jenkins/jenkins-slave/workspace/Lucene-Solr-4.x-MacOSX/solr/build/solr-solrj/test/J0/solrtest-TestBatchUpdate-1363874949561/
[junit4:junit4]   2> 1452 T343 oasc.JmxMonitoredMap.<init> JMX monitoring is enabled.
Adding Solr mbeans to JMX Server: com.sun.jmx.mbeanserver.JmxMBeanServer@4086c53b
[junit4:junit4]   2> 1453 T343 oasc.SolrCore.initListeners [collection1] Added SolrEventListener
for newSearcher: org.apache.solr.core.QuerySenderListener{queries=[]}
[junit4:junit4]   2> 1453 T343 oasc.SolrCore.initListeners [collection1] Added SolrEventListener
for firstSearcher: org.apache.solr.core.QuerySenderListener{queries=[{q=static firstSearcher
warming in solrconfig.xml}]}
[junit4:junit4]   2> 1454 T343 oasc.SolrCore.initDirectoryFactory org.apache.solr.core.MockDirectoryFactory
[junit4:junit4]   2> 1455 T343 oasc.CachingDirectoryFactory.get return new directory for
/Users/jenkins/jenkins-slave/workspace/Lucene-Solr-4.x-MacOSX/solr/build/solr-solrj/test/J0/solrtest-TestBatchUpdate-1363874949561
forceNew: false
[junit4:junit4]   2> 1455 T343 oasc.SolrCore.getNewIndexDir New index directory detected:
old=null new=/Users/jenkins/jenkins-slave/workspace/Lucene-Solr-4.x-MacOSX/solr/build/solr-solrj/test/J0/solrtest-TestBatchUpdate-1363874949561/index/
[junit4:junit4]   2> 1455 T343 oasc.SolrCore.initIndex WARNING [collection1] Solr index
directory '/Users/jenkins/jenkins-slave/workspace/Lucene-Solr-4.x-MacOSX/solr/build/solr-solrj/test/J0/solrtest-TestBatchUpdate-1363874949561/index'
doesn't exist. Creating new index...
[junit4:junit4]   2> 1456 T343 oasc.CachingDirectoryFactory.get return new directory for
/Users/jenkins/jenkins-slave/workspace/Lucene-Solr-4.x-MacOSX/solr/build/solr-solrj/test/J0/solrtest-TestBatchUpdate-1363874949561/index
forceNew: false
[junit4:junit4]   2> 1459 T343 oasc.SolrDeletionPolicy.onCommit SolrDeletionPolicy.onCommit:
commits:num=1
[junit4:junit4]   2> 		commit{dir=MockDirWrapper(org.apache.lucene.store.RAMDirectory@38ff639e
lockFactory=org.apache.lucene.store.NativeFSLockFactory@86cedbd),segFN=segments_1,generation=1,filenames=[segments_1]
[junit4:junit4]   2> 1459 T343 oasc.SolrDeletionPolicy.updateCommits newest commit = 1[segments_1]
[junit4:junit4]   2> 1460 T343 oasc.SolrCore.initWriters created json: solr.JSONResponseWriter
[junit4:junit4]   2> 1460 T343 oasc.SolrCore.initWriters adding lazy queryResponseWriter:
solr.VelocityResponseWriter
[junit4:junit4]   2> 1461 T343 oasc.SolrCore.initWriters created velocity: solr.VelocityResponseWriter
[junit4:junit4]   2> 1461 T343 oasc.SolrCore.initWriters created xslt: solr.XSLTResponseWriter
[junit4:junit4]   2> 1461 T343 oasr.XSLTResponseWriter.init xsltCacheLifetimeSeconds=5
[junit4:junit4]   2> 1463 T343 oasc.RequestHandlers.initHandlersFromConfig created /select:
solr.SearchHandler
[junit4:junit4]   2> 1463 T343 oasc.RequestHandlers.initHandlersFromConfig created /query:
solr.SearchHandler
[junit4:junit4]   2> 1465 T343 oasc.RequestHandlers.initHandlersFromConfig created /get:
solr.RealTimeGetHandler
[junit4:junit4]   2> 1465 T343 oasc.RequestHandlers.initHandlersFromConfig created /browse:
solr.SearchHandler
[junit4:junit4]   2> 1466 T343 oasc.RequestHandlers.initHandlersFromConfig created /update:
solr.UpdateRequestHandler
[junit4:junit4]   2> 1466 T343 oasc.RequestHandlers.initHandlersFromConfig created /update/json:
solr.JsonUpdateRequestHandler
[junit4:junit4]   2> 1467 T343 oasc.RequestHandlers.initHandlersFromConfig created /update/csv:
solr.CSVRequestHandler
[junit4:junit4]   2> 1467 T343 oasc.RequestHandlers.initHandlersFromConfig adding lazy
requestHandler: solr.extraction.ExtractingRequestHandler
[junit4:junit4]   2> 1468 T343 oasc.RequestHandlers.initHandlersFromConfig created /update/extract:
solr.extraction.ExtractingRequestHandler
[junit4:junit4]   2> 1468 T343 oasc.RequestHandlers.initHandlersFromConfig adding lazy
requestHandler: solr.FieldAnalysisRequestHandler
[junit4:junit4]   2> 1468 T343 oasc.RequestHandlers.initHandlersFromConfig created /analysis/field:
solr.FieldAnalysisRequestHandler
[junit4:junit4]   2> 1468 T343 oasc.RequestHandlers.initHandlersFromConfig adding lazy
requestHandler: solr.DocumentAnalysisRequestHandler
[junit4:junit4]   2> 1469 T343 oasc.RequestHandlers.initHandlersFromConfig created /analysis/document:
solr.DocumentAnalysisRequestHandler
[junit4:junit4]   2> 1469 T343 oasc.RequestHandlers.initHandlersFromConfig created /admin/:
solr.admin.AdminHandlers
[junit4:junit4]   2> 1470 T343 oasc.RequestHandlers.initHandlersFromConfig created /admin/ping:
solr.PingRequestHandler
[junit4:junit4]   2> 1471 T343 oasc.RequestHandlers.initHandlersFromConfig created /debug/dump:
solr.DumpRequestHandler
[junit4:junit4]   2> 1472 T343 oasc.RequestHandlers.initHandlersFromConfig created /replication:
solr.ReplicationHandler
[junit4:junit4]   2> 1472 T343 oasc.RequestHandlers.initHandlersFromConfig adding lazy
requestHandler: solr.SearchHandler
[junit4:junit4]   2> 1472 T343 oasc.RequestHandlers.initHandlersFromConfig created /spell:
solr.SearchHandler
[junit4:junit4]   2> 1473 T343 oasc.RequestHandlers.initHandlersFromConfig adding lazy
requestHandler: solr.SearchHandler
[junit4:junit4]   2> 1473 T343 oasc.RequestHandlers.initHandlersFromConfig created /tvrh:
solr.SearchHandler
[junit4:junit4]   2> 1473 T343 oasc.RequestHandlers.initHandlersFromConfig adding lazy
requestHandler: solr.SearchHandler
[junit4:junit4]   2> 1474 T343 oasc.RequestHandlers.initHandlersFromConfig created /terms:
solr.SearchHandler
[junit4:junit4]   2> 1474 T343 oasc.RequestHandlers.initHandlersFromConfig adding lazy
requestHandler: solr.SearchHandler
[junit4:junit4]   2> 1474 T343 oasc.RequestHandlers.initHandlersFromConfig created /elevate:
solr.SearchHandler
[junit4:junit4]   2> 1481 T343 oashl.XMLLoader.init xsltCacheLifetimeSeconds=60
[junit4:junit4]   2> 1482 T343 oashl.XMLLoader.init xsltCacheLifetimeSeconds=60
[junit4:junit4]   2> 1483 T343 oashl.XMLLoader.init xsltCacheLifetimeSeconds=60
[junit4:junit4]   2> 1488 T343 oass.SolrIndexSearcher.<init> Opening Searcher@327b29a8
main
[junit4:junit4]   2> 1489 T343 oasu.UpdateHandler.clearLog Clearing tlog files, tlogDir=/Users/jenkins/jenkins-slave/workspace/Lucene-Solr-4.x-MacOSX/solr/build/solr-solrj/test/J0/solrtest-TestBatchUpdate-1363874949561/tlog
[junit4:junit4]   2> 1490 T343 oasu.CommitTracker.<init> Hard AutoCommit: if uncommited
for 15000ms; 
[junit4:junit4]   2> 1490 T343 oasu.CommitTracker.<init> Soft AutoCommit: disabled
[junit4:junit4]   2> 1491 T343 oashc.SpellCheckComponent.inform Initializing spell checkers
[junit4:junit4]   2> 1491 T343 oass.DirectSolrSpellChecker.init init: {name=default,field=name,classname=solr.DirectSolrSpellChecker,distanceMeasure=internal,accuracy=0.5,maxEdits=2,minPrefix=1,maxInspections=5,minQueryLength=4,maxQueryFrequency=0.01}
[junit4:junit4]   2> 1491 T343 oashc.SpellCheckComponent.inform No queryConverter defined,
using default converter
[junit4:junit4]   2> 1492 T343 oashc.QueryElevationComponent.inform Loading QueryElevation
from: /Users/jenkins/jenkins-slave/workspace/Lucene-Solr-4.x-MacOSX/solr/example/solr/collection1/conf/elevate.xml
[junit4:junit4]   2> 1507 T343 oash.ReplicationHandler.inform Commits will be reserved
for  10000
[junit4:junit4]   2> 1508 T344 oasc.QuerySenderListener.newSearcher QuerySenderListener
sending requests to Searcher@327b29a8 main{StandardDirectoryReader(segments_1:1)}
[junit4:junit4]   2> ASYNC  NEW_CORE C23 name=collection1 org.apache.solr.core.SolrCore@331d39f5
[junit4:junit4]   2> 1511 T344 C23 REQ [collection1] webapp=null path=null params={event=firstSearcher&q=static+firstSearcher+warming+in+solrconfig.xml&distrib=false}
hits=0 status=0 QTime=2 
[junit4:junit4]   2> 1512 T344 oasc.QuerySenderListener.newSearcher QuerySenderListener
done.
[junit4:junit4]   2> 1512 T344 oashc.SpellCheckComponent$SpellCheckerListener.newSearcher
Loading spell index for spellchecker: default
[junit4:junit4]   2> 1513 T344 oashc.SpellCheckComponent$SpellCheckerListener.newSearcher
Loading spell index for spellchecker: wordbreak
[junit4:junit4]   2> 1515 T344 oasc.SolrCore.registerSearcher [collection1] Registered
new searcher Searcher@327b29a8 main{StandardDirectoryReader(segments_1:1)}
[junit4:junit4]   2> 1518 T343 oasc.CoreContainer.registerCore registering core: collection1
[junit4:junit4]   2> 1520 T333 oass.SolrDispatchFilter.init user.dir=/Users/jenkins/jenkins-slave/workspace/Lucene-Solr-4.x-MacOSX/solr/build/solr-solrj/test/J0
[junit4:junit4]   2> 1521 T333 oass.SolrDispatchFilter.init SolrDispatchFilter.init() done
[junit4:junit4]   2> 1522 T333 oas.SolrJettyTestBase.createJetty Jetty Assigned Port#53887
[junit4:junit4]   2> 1537 T333 oas.SolrTestCaseJ4.setUp ###Starting testWithBinaryBean
[junit4:junit4]   2> 1537 T333 oascsi.HttpClientUtil.createClient Creating new http client,
config:maxConnections=128&maxConnectionsPerHost=32&followRedirects=false
[junit4:junit4]   2> 1603 T342 C23 oasc.SolrDeletionPolicy.onInit SolrDeletionPolicy.onInit:
commits:num=1
[junit4:junit4]   2> 		commit{dir=MockDirWrapper(org.apache.lucene.store.RAMDirectory@38ff639e
lockFactory=org.apache.lucene.store.NativeFSLockFactory@86cedbd),segFN=segments_1,generation=1,filenames=[segments_1]
[junit4:junit4]   2> 1605 T342 C23 oasc.SolrDeletionPolicy.updateCommits newest commit
= 1[segments_1]
[junit4:junit4]   2> 1607 T342 C23 oass.SolrIndexSearcher.<init> Opening Searcher@665e415a
realtime
[junit4:junit4]   2> 1609 T342 C23 UPDATE [collection1] webapp=/solr path=/update params={wt=javabin&version=2}
{deleteByQuery=*:* (-1430126540787548160)} 0 9
[junit4:junit4]   2> 2250 T337 C23 UPDATE [collection1] webapp=/solr path=/update params={wt=javabin&version=2}
{add=[1 (1430126540834734080), 2 (1430126540835782656), 3 (1430126540836831232), 4 (1430126540836831233),
5 (1430126540837879808), 6 (1430126540837879809), 7 (1430126540838928384), 8 (1430126540838928385),
9 (1430126540839976960), 10 (1430126540839976961), ... (1000 adds)]} 0 606
[junit4:junit4]   2> 2263 T340 C23 oasu.DirectUpdateHandler2.commit start commit{,optimize=false,openSearcher=true,waitSearcher=true,expungeDeletes=false,softCommit=false,prepareCommit=false}
[junit4:junit4]   2> 2349 T340 C23 oasc.SolrDeletionPolicy.onCommit SolrDeletionPolicy.onCommit:
commits:num=2
[junit4:junit4]   2> 		commit{dir=MockDirWrapper(org.apache.lucene.store.RAMDirectory@38ff639e
lockFactory=org.apache.lucene.store.NativeFSLockFactory@86cedbd),segFN=segments_1,generation=1,filenames=[segments_1]
[junit4:junit4]   2> 		commit{dir=MockDirWrapper(org.apache.lucene.store.RAMDirectory@38ff639e
lockFactory=org.apache.lucene.store.NativeFSLockFactory@86cedbd),segFN=segments_2,generation=2,filenames=[_0.fnm,
_0_Lucene41_0.doc, _0_Lucene41_0.pos, _0.nvd, segments_2, _0.fdx, _0.si, _0.nvm, _0_Lucene41_0.tim,
_0.fdt, _0_Lucene41_0.tip]
[junit4:junit4]   2> 2350 T340 C23 oasc.SolrDeletionPolicy.updateCommits newest commit
= 2[_0.fnm, _0_Lucene41_0.doc, _0_Lucene41_0.pos, _0.nvd, segments_2, _0.fdx, _0.si, _0.nvm,
_0_Lucene41_0.tim, _0.fdt, _0_Lucene41_0.tip]
[junit4:junit4]   2> 2360 T340 C23 oass.SolrIndexSearcher.<init> Opening Searcher@4af9c50f
main
[junit4:junit4]   2> 2362 T344 oasc.QuerySenderListener.newSearcher QuerySenderListener
sending requests to Searcher@4af9c50f main{StandardDirectoryReader(segments_2:3:nrt _0(4.3):C1000)}
[junit4:junit4]   2> 2362 T344 oasc.QuerySenderListener.newSearcher QuerySenderListener
done.
[junit4:junit4]   2> 2364 T344 oasc.SolrCore.registerSearcher [collection1] Registered
new searcher Searcher@4af9c50f main{StandardDirectoryReader(segments_2:3:nrt _0(4.3):C1000)}
[junit4:junit4]   2> 2365 T340 C23 oasu.DirectUpdateHandler2.commit end_commit_flush
[junit4:junit4]   2> 2366 T340 C23 UPDATE [collection1] webapp=/solr path=/update params={waitSearcher=true&commit=true&wt=javabin&version=2&softCommit=false}
{commit=} 0 104
[junit4:junit4]   2> 2372 T341 C23 REQ [collection1] webapp=/solr path=/select params={q=*:*&wt=javabin&version=2}
hits=1000 status=0 QTime=1 
[junit4:junit4]   2> 2393 T333 oas.SolrTestCaseJ4.tearDown ###Ending testWithBinaryBean
[junit4:junit4]   2> 2448 T333 oas.SolrTestCaseJ4.setUp ###Starting testWithBinary
[junit4:junit4]   2> 2482 T342 C23 oass.SolrIndexSearcher.<init> Opening Searcher@162100f3
realtime
[junit4:junit4]   2> 2483 T342 C23 UPDATE [collection1] webapp=/solr path=/update params={wt=javabin&version=2}
{deleteByQuery=*:* (-1430126541689323520)} 0 23
[junit4:junit4]   2> 3228 T339 C23 UPDATE [collection1] webapp=/solr path=/update params={wt=javabin&version=2}
{add=[1 (1430126541736509440), 2 (1430126541755383808), 3 (1430126541756432384), 4 (1430126541756432385),
5 (1430126541757480960), 6 (1430126541757480961), 7 (1430126541757480962), 8 (1430126541758529536),
9 (1430126541758529537), 10 (1430126541759578112), ... (1000 adds)]} 0 724
[junit4:junit4]   2> 3234 T340 C23 oasu.DirectUpdateHandler2.commit start commit{,optimize=false,openSearcher=true,waitSearcher=true,expungeDeletes=false,softCommit=false,prepareCommit=false}
[junit4:junit4]   2> 3275 T340 C23 oasc.SolrDeletionPolicy.onCommit SolrDeletionPolicy.onCommit:
commits:num=2
[junit4:junit4]   2> 		commit{dir=MockDirWrapper(org.apache.lucene.store.RAMDirectory@38ff639e
lockFactory=org.apache.lucene.store.NativeFSLockFactory@86cedbd),segFN=segments_2,generation=2,filenames=[_0.fnm,
_0_Lucene41_0.doc, _0_Lucene41_0.pos, _0.nvd, segments_2, _0.fdx, _0.si, _0.nvm, _0_Lucene41_0.tim,
_0.fdt, _0_Lucene41_0.tip]
[junit4:junit4]   2> 		commit{dir=MockDirWrapper(org.apache.lucene.store.RAMDirectory@38ff639e
lockFactory=org.apache.lucene.store.NativeFSLockFactory@86cedbd),segFN=segments_3,generation=3,filenames=[_1.fdx,
_1_Lucene41_0.pos, _1.nvm, _1_Lucene41_0.doc, _1.fdt, _1.si, _1_Lucene41_0.tim, _1.nvd, _1_Lucene41_0.tip,
_1.fnm, segments_3]
[junit4:junit4]   2> 3275 T340 C23 oasc.SolrDeletionPolicy.updateCommits newest commit
= 3[_1.fdx, _1_Lucene41_0.pos, _1.nvm, _1_Lucene41_0.doc, _1.fdt, _1.si, _1_Lucene41_0.tim,
_1.nvd, _1_Lucene41_0.tip, _1.fnm, segments_3]
[junit4:junit4]   2> 3278 T340 C23 oass.SolrIndexSearcher.<init> Opening Searcher@116d4d6c
main
[junit4:junit4]   2> 3279 T344 oasc.QuerySenderListener.newSearcher QuerySenderListener
sending requests to Searcher@116d4d6c main{StandardDirectoryReader(segments_3:7:nrt _1(4.3):C1000)}
[junit4:junit4]   2> 3280 T344 oasc.QuerySenderListener.newSearcher QuerySenderListener
done.
[junit4:junit4]   2> 3283 T344 oasc.SolrCore.registerSearcher [collection1] Registered
new searcher Searcher@116d4d6c main{StandardDirectoryReader(segments_3:7:nrt _1(4.3):C1000)}
[junit4:junit4]   2> 3285 T340 C23 oasu.DirectUpdateHandler2.commit end_commit_flush
[junit4:junit4]   2> 3286 T340 C23 UPDATE [collection1] webapp=/solr path=/update params={waitSearcher=true&commit=true&wt=javabin&version=2&softCommit=false}
{commit=} 0 52
[junit4:junit4]   2> 3298 T341 C23 REQ [collection1] webapp=/solr path=/select params={q=*:*&wt=javabin&version=2}
hits=1000 status=0 QTime=1 
[junit4:junit4]   2> 3305 T333 oas.SolrTestCaseJ4.tearDown ###Ending testWithBinary
[junit4:junit4]   2> 3319 T333 oas.SolrTestCaseJ4.setUp ###Starting testWithXml
[junit4:junit4]   2> 3361 T342 C23 oass.SolrIndexSearcher.<init> Opening Searcher@1da9d40f
realtime
[junit4:junit4]   2> 3362 T342 C23 UPDATE [collection1] webapp=/solr path=/update params={wt=javabin&version=2}
{deleteByQuery=*:* (-1430126542594244608)} 0 40
[junit4:junit4]   2> 4044 T337 C23 UPDATE [collection1] webapp=/solr path=/update params={wt=javabin&version=2}
{add=[1 (1430126542725316608), 2 (1430126542734753792), 3 (1430126542735802368), 4 (1430126542735802369),
5 (1430126542736850944), 6 (1430126542736850945), 7 (1430126542736850946), 8 (1430126542737899520),
9 (1430126542738948096), 10 (1430126542739996672), ... (1000 adds)]} 0 597
[junit4:junit4]   2> 18366 T346 oasu.DirectUpdateHandler2.commit start commit{,optimize=false,openSearcher=false,waitSearcher=true,expungeDeletes=false,softCommit=false,prepareCommit=false}
[junit4:junit4]   2> 18398 T346 oasc.SolrDeletionPolicy.onCommit SolrDeletionPolicy.onCommit:
commits:num=2
[junit4:junit4]   2> 		commit{dir=MockDirWrapper(org.apache.lucene.store.RAMDirectory@38ff639e
lockFactory=org.apache.lucene.store.NativeFSLockFactory@86cedbd),segFN=segments_3,generation=3,filenames=[_1.fdx,
_1_Lucene41_0.pos, _1.nvm, _1_Lucene41_0.doc, _1.fdt, _1.si, _1_Lucene41_0.tim, _1.nvd, _1_Lucene41_0.tip,
_1.fnm, segments_3]
[junit4:junit4]   2> 		commit{dir=MockDirWrapper(org.apache.lucene.store.RAMDirectory@38ff639e
lockFactory=org.apache.lucene.store.NativeFSLockFactory@86cedbd),segFN=segments_4,generation=4,filenames=[_2.si,
_2_Lucene41_0.pos, _2_Lucene41_0.tim, _2.nvm, _2.nvd, _2.fdt, _2_Lucene41_0.doc, _2_Lucene41_0.tip,
_2.fdx, _2.fnm, segments_4]
[junit4:junit4]   2> 18399 T346 oasc.SolrDeletionPolicy.updateCommits newest commit = 4[_2.si,
_2_Lucene41_0.pos, _2_Lucene41_0.tim, _2.nvm, _2.nvd, _2.fdt, _2_Lucene41_0.doc, _2_Lucene41_0.tip,
_2.fdx, _2.fnm, segments_4]
[junit4:junit4]   2> 18401 T346 oass.SolrIndexSearcher.<init> Opening Searcher@3d736df4
realtime
[junit4:junit4]   2> 18403 T346 oasu.DirectUpdateHandler2.commit end_commit_flush
[junit4:junit4]   2> 204058 T333 oas.SolrTestCaseJ4.tearDown ###Ending testWithXml
[junit4:junit4]   2> 204058 T340 C23 oasu.DirectUpdateHandler2.commit start commit{,optimize=false,openSearcher=true,waitSearcher=true,expungeDeletes=false,softCommit=false,prepareCommit=false}
[junit4:junit4]   2> 204060 T340 C23 oasc.SolrDeletionPolicy.onCommit SolrDeletionPolicy.onCommit:
commits:num=2
[junit4:junit4]   2> 		commit{dir=MockDirWrapper(org.apache.lucene.store.RAMDirectory@38ff639e
lockFactory=org.apache.lucene.store.NativeFSLockFactory@86cedbd),segFN=segments_4,generation=4,filenames=[_2.si,
_2_Lucene41_0.pos, _2_Lucene41_0.tim, _2.nvm, _2.nvd, _2.fdt, _2_Lucene41_0.doc, _2_Lucene41_0.tip,
_2.fdx, _2.fnm, segments_4]
[junit4:junit4]   2> 		commit{dir=MockDirWrapper(org.apache.lucene.store.RAMDirectory@38ff639e
lockFactory=org.apache.lucene.store.NativeFSLockFactory@86cedbd),segFN=segments_5,generation=5,filenames=[_2.si,
_2_Lucene41_0.pos, _2_Lucene41_0.tim, _2.nvm, _2.nvd, _2.fdt, _2_Lucene41_0.doc, _2_Lucene41_0.tip,
segments_5, _2.fdx, _2.fnm]
[junit4:junit4]   2> 204060 T340 C23 oasc.SolrDeletionPolicy.updateCommits newest commit
= 5[_2.si, _2_Lucene41_0.pos, _2_Lucene41_0.tim, _2.nvm, _2.nvd, _2.fdt, _2_Lucene41_0.doc,
_2_Lucene41_0.tip, segments_5, _2.fdx, _2.fnm]
[junit4:junit4]   2> 204061 T340 C23 oass.SolrIndexSearcher.<init> Opening Searcher@3f33db7f
main
[junit4:junit4]   2> 204061 T340 C23 oasu.DirectUpdateHandler2.commit end_commit_flush
[junit4:junit4]   2> 204062 T344 oasc.QuerySenderListener.newSearcher QuerySenderListener
sending requests to Searcher@3f33db7f main{StandardDirectoryReader(segments_4:11:nrt _2(4.3):C1000)}
[junit4:junit4]   2> 204063 T344 oasc.QuerySenderListener.newSearcher QuerySenderListener
done.
[junit4:junit4]   2> 204064 T344 oasc.SolrCore.registerSearcher [collection1] Registered
new searcher Searcher@3f33db7f main{StandardDirectoryReader(segments_4:11:nrt _2(4.3):C1000)}
[junit4:junit4]   2> 204065 T340 C23 UPDATE [collection1] webapp=/solr path=/update params={waitSearcher=true&commit=true&wt=javabin&version=2&softCommit=false}
{commit=} 0 7
[junit4:junit4]   2> NOTE: reproduce with: ant test  -Dtestcase=TestBatchUpdate -Dtests.method=testWithXml
-Dtests.seed=E71E5142A7DA82C5 -Dtests.slow=true -Dtests.locale=ar_TN -Dtests.timezone=Europe/Vaduz
-Dtests.file.encoding=US-ASCII
[junit4:junit4] ERROR    201s | TestBatchUpdate.testWithXml <<<
[junit4:junit4]    > Throwable #1: org.apache.solr.client.solrj.SolrServerException: IOException
occured when talking to server at: https://127.0.0.1:53887/solr
[junit4:junit4]    > 	at __randomizedtesting.SeedInfo.seed([E71E5142A7DA82C5:4CFCE8B425DC9BA8]:0)
[junit4:junit4]    > 	at org.apache.solr.client.solrj.impl.HttpSolrServer.request(HttpSolrServer.java:416)
[junit4:junit4]    > 	at org.apache.solr.client.solrj.impl.HttpSolrServer.request(HttpSolrServer.java:181)
[junit4:junit4]    > 	at org.apache.solr.client.solrj.request.AbstractUpdateRequest.process(AbstractUpdateRequest.java:117)
[junit4:junit4]    > 	at org.apache.solr.client.solrj.SolrServer.commit(SolrServer.java:168)
[junit4:junit4]    > 	at org.apache.solr.client.solrj.SolrServer.commit(SolrServer.java:146)
[junit4:junit4]    > 	at org.apache.solr.client.solrj.TestBatchUpdate.doIt(TestBatchUpdate.java:130)
[junit4:junit4]    > 	at org.apache.solr.client.solrj.TestBatchUpdate.testWithXml(TestBatchUpdate.java:54)
[junit4:junit4]    > 	at sun.reflect.NativeMethodAccessorImpl.invoke0(Native Method)
[junit4:junit4]    > 	at sun.reflect.NativeMethodAccessorImpl.invoke(NativeMethodAccessorImpl.java:57)
[junit4:junit4]    > 	at sun.reflect.DelegatingMethodAccessorImpl.invoke(DelegatingMethodAccessorImpl.java:43)
[junit4:junit4]    > 	at java.lang.reflect.Method.invoke(Method.java:601)
[junit4:junit4]    > 	at com.carrotsearch.randomizedtesting.RandomizedRunner.invoke(RandomizedRunner.java:1559)
[junit4:junit4]    > 	at com.carrotsearch.randomizedtesting.RandomizedRunner.access$600(RandomizedRunner.java:79)
[junit4:junit4]    > 	at com.carrotsearch.randomizedtesting.RandomizedRunner$6.evaluate(RandomizedRunner.java:737)
[junit4:junit4]    > 	at com.carrotsearch.randomizedtesting.RandomizedRunner$7.evaluate(RandomizedRunner.java:773)
[junit4:junit4]    > 	at com.carrotsearch.randomizedtesting.RandomizedRunner$8.evaluate(RandomizedRunner.java:787)
[junit4:junit4]    > 	at com.carrotsearch.randomizedtesting.rules.SystemPropertiesRestoreRule$1.evaluate(SystemPropertiesRestoreRule.java:53)
[junit4:junit4]    > 	at org.apache.lucene.util.TestRuleSetupTeardownChained$1.evaluate(TestRuleSetupTeardownChained.java:50)
[junit4:junit4]    > 	at org.apache.lucene.util.TestRuleFieldCacheSanity$1.evaluate(TestRuleFieldCacheSanity.java:51)
[junit4:junit4]    > 	at org.apache.lucene.util.AbstractBeforeAfterRule$1.evaluate(AbstractBeforeAfterRule.java:46)
[junit4:junit4]    > 	at com.carrotsearch.randomizedtesting.rules.SystemPropertiesInvariantRule$1.evaluate(SystemPropertiesInvariantRule.java:55)
[junit4:junit4]    > 	at org.apache.lucene.util.TestRuleThreadAndTestName$1.evaluate(TestRuleThreadAndTestName.java:49)
[junit4:junit4]    > 	at org.apache.lucene.util.TestRuleIgnoreAfterMaxFailures$1.evaluate(TestRuleIgnoreAfterMaxFailures.java:70)
[junit4:junit4]    > 	at org.apache.lucene.util.TestRuleMarkFailure$1.evaluate(TestRuleMarkFailure.java:48)
[junit4:junit4]    > 	at com.carrotsearch.randomizedtesting.rules.StatementAdapter.evaluate(StatementAdapter.java:36)
[junit4:junit4]    > 	at com.carrotsearch.randomizedtesting.ThreadLeakControl$StatementRunner.run(ThreadLeakControl.java:358)
[junit4:junit4]    > 	at com.carrotsearch.randomizedtesting.ThreadLeakControl.forkTimeoutingTask(ThreadLeakControl.java:782)
[junit4:junit4]    > 	at com.carrotsearch.randomizedtesting.ThreadLeakControl$3.evaluate(ThreadLeakControl.java:442)
[junit4:junit4]    > 	at com.carrotsearch.randomizedtesting.RandomizedRunner.runSingleTest(RandomizedRunner.java:746)
[junit4:junit4]    > 	at com.carrotsearch.randomizedtesting.RandomizedRunner$3.evaluate(RandomizedRunner.java:648)
[junit4:junit4]    > 	at com.carrotsearch.randomizedtesting.RandomizedRunner$4.evaluate(RandomizedRunner.java:682)
[junit4:junit4]    > 	at com.carrotsearch.randomizedtesting.RandomizedRunner$5.evaluate(RandomizedRunner.java:693)
[junit4:junit4]    > 	at com.carrotsearch.randomizedtesting.rules.StatementAdapter.evaluate(StatementAdapter.java:36)
[junit4:junit4]    > 	at com.carrotsearch.randomizedtesting.rules.SystemPropertiesRestoreRule$1.evaluate(SystemPropertiesRestoreRule.java:53)
[junit4:junit4]    > 	at org.apache.lucene.util.AbstractBeforeAfterRule$1.evaluate(AbstractBeforeAfterRule.java:46)
[junit4:junit4]    > 	at org.apache.lucene.util.TestRuleStoreClassName$1.evaluate(TestRuleStoreClassName.java:42)
[junit4:junit4]    > 	at com.carrotsearch.randomizedtesting.rules.SystemPropertiesInvariantRule$1.evaluate(SystemPropertiesInvariantRule.java:55)
[junit4:junit4]    > 	at com.carrotsearch.randomizedtesting.rules.NoShadowingOrOverridesOnMethodsRule$1.evaluate(NoShadowingOrOverridesOnMethodsRule.java:39)
[junit4:junit4]    > 	at com.carrotsearch.randomizedtesting.rules.NoShadowingOrOverridesOnMethodsRule$1.evaluate(NoShadowingOrOverridesOnMethodsRule.java:39)
[junit4:junit4]    > 	at com.carrotsearch.randomizedtesting.rules.StatementAdapter.evaluate(StatementAdapter.java:36)
[junit4:junit4]    > 	at org.apache.lucene.util.TestRuleAssertionsRequired$1.evaluate(TestRuleAssertionsRequired.java:43)
[junit4:junit4]    > 	at org.apache.lucene.util.TestRuleMarkFailure$1.evaluate(TestRuleMarkFailure.java:48)
[junit4:junit4]    > 	at org.apache.lucene.util.TestRuleIgnoreAfterMaxFailures$1.evaluate(TestRuleIgnoreAfterMaxFailures.java:70)
[junit4:junit4]    > 	at org.apache.lucene.util.TestRuleIgnoreTestSuites$1.evaluate(TestRuleIgnoreTestSuites.java:55)
[junit4:junit4]    > 	at com.carrotsearch.randomizedtesting.rules.StatementAdapter.evaluate(StatementAdapter.java:36)
[junit4:junit4]    > 	at com.carrotsearch.randomizedtesting.ThreadLeakControl$StatementRunner.run(ThreadLeakControl.java:358)
[junit4:junit4]    > 	at java.lang.Thread.run(Thread.java:722)
[junit4:junit4]    > Caused by: org.apache.http.NoHttpResponseException: The target server
failed to respond
[junit4:junit4]    > 	at org.apache.http.impl.conn.DefaultHttpResponseParser.parseHead(DefaultHttpResponseParser.java:95)
[junit4:junit4]    > 	at org.apache.http.impl.conn.DefaultHttpResponseParser.parseHead(DefaultHttpResponseParser.java:62)
[junit4:junit4]    > 	at org.apache.http.impl.io.AbstractMessageParser.parse(AbstractMessageParser.java:254)
[junit4:junit4]    > 	at org.apache.http.impl.AbstractHttpClientConnection.receiveResponseHeader(AbstractHttpClientConnection.java:289)
[junit4:junit4]    > 	at org.apache.http.impl.conn.DefaultClientConnection.receiveResponseHeader(DefaultClientConnection.java:252)
[junit4:junit4]    > 	at org.apache.http.impl.conn.ManagedClientConnectionImpl.receiveResponseHeader(ManagedClientConnectionImpl.java:191)
[junit4:junit4]    > 	at org.apache.http.protocol.HttpRequestExecutor.doReceiveResponse(HttpRequestExecutor.java:300)
[junit4:junit4]    > 	at org.apache.http.protocol.HttpRequestExecutor.execute(HttpRequestExecutor.java:127)
[junit4:junit4]    > 	at org.apache.http.impl.client.DefaultRequestDirector.tryExecute(DefaultRequestDirector.java:717)
[junit4:junit4]    > 	at org.apache.http.impl.client.DefaultRequestDirector.execute(DefaultRequestDirector.java:522)
[junit4:junit4]    > 	at org.apache.http.impl.client.AbstractHttpClient.execute(AbstractHttpClient.java:906)
[junit4:junit4]    > 	at org.apache.http.impl.client.AbstractHttpClient.execute(AbstractHttpClient.java:805)
[junit4:junit4]    > 	at org.apache.http.impl.client.AbstractHttpClient.execute(AbstractHttpClient.java:784)
[junit4:junit4]    > 	at org.apache.solr.client.solrj.impl.HttpSolrServer.request(HttpSolrServer.java:353)
[junit4:junit4]    > 	... 46 more
[junit4:junit4]   2> 204180 T333 oasc.CoreContainer.shutdown Shutting down CoreContainer
instance=1553685509
[junit4:junit4]   2> 204185 T333 oasc.SolrCore.close [collection1]  CLOSING SolrCore org.apache.solr.core.SolrCore@331d39f5
[junit4:junit4]   2> 204207 T333 oasu.DirectUpdateHandler2.close closing DirectUpdateHandler2{commits=4,autocommit
maxTime=15000ms,autocommits=1,soft autocommits=0,optimizes=0,rollbacks=0,expungeDeletes=0,docsPending=0,adds=0,deletesById=0,deletesByQuery=0,errors=0,cumulative_adds=3000,cumulative_deletesById=0,cumulative_deletesByQuery=3,cumulative_errors=0}
[junit4:junit4]   2> 204208 T333 oasu.SolrCoreState.decrefSolrCoreState Closing SolrCoreState
[junit4:junit4]   2> 204209 T333 oasu.DefaultSolrCoreState.closeIndexWriter SolrCoreState
ref count has reached 0 - closing IndexWriter
[junit4:junit4]   2> 204209 T333 oasu.DefaultSolrCoreState.closeIndexWriter closing IndexWriter
with IndexWriterCloser
[junit4:junit4]   2> 204212 T333 oasc.SolrCore.closeSearcher [collection1] Closing main
searcher on request.
[junit4:junit4]   2> 204212 T333 oasc.CachingDirectoryFactory.close Closing directory when
closing factory: /Users/jenkins/jenkins-slave/workspace/Lucene-Solr-4.x-MacOSX/solr/build/solr-solrj/test/J0/solrtest-TestBatchUpdate-1363874949561
[junit4:junit4]   2> 204213 T333 oasc.CachingDirectoryFactory.closeDirectory Closing directory:
/Users/jenkins/jenkins-slave/workspace/Lucene-Solr-4.x-MacOSX/solr/build/solr-solrj/test/J0/solrtest-TestBatchUpdate-1363874949561
[junit4:junit4]   2> 204214 T333 oasc.CachingDirectoryFactory.close Closing directory when
closing factory: /Users/jenkins/jenkins-slave/workspace/Lucene-Solr-4.x-MacOSX/solr/build/solr-solrj/test/J0/solrtest-TestBatchUpdate-1363874949561/index
[junit4:junit4]   2> 204221 T333 oasc.CachingDirectoryFactory.closeDirectory Closing directory:
/Users/jenkins/jenkins-slave/workspace/Lucene-Solr-4.x-MacOSX/solr/build/solr-solrj/test/J0/solrtest-TestBatchUpdate-1363874949561/index
[junit4:junit4]   2> 204223 T333 oejsh.ContextHandler.doStop stopped o.e.j.s.ServletContextHandler{/solr,null}
[junit4:junit4]   2> 204275 T333 oas.SolrTestCaseJ4.deleteCore ###deleteCore
[junit4:junit4]   2> NOTE: test params are: codec=Lucene42: {}, docValues:{}, sim=RandomSimilarityProvider(queryNorm=true,coord=yes):
{}, locale=ar_TN, timezone=Europe/Vaduz
[junit4:junit4]   2> NOTE: Mac OS X 10.8.2 x86_64/Oracle Corporation 1.7.0_15 (64-bit)/cpus=2,threads=1,free=34312864,total=93257728
[junit4:junit4]   2> NOTE: All tests run in this JVM: [TestLBHttpSolrServer, TestDocumentObjectBinder,
TestNamedListCodec, SolrExampleBinaryTest, LargeVolumeEmbeddedTest, LargeVolumeBinaryJettyTest,
QueryResponseTest, TestUpdateRequestCodec, ClientUtilsTest, BasicHttpSolrServerTest, MultiCoreExampleJettyTest,
ContentStreamTest, SolrExampleStreamingBinaryTest, SolrExampleStreamingTest, SolrDocumentTest,
TestBatchUpdate]
[junit4:junit4] Completed in 204.32s, 3 tests, 1 error <<< FAILURES!

[...truncated 93 lines...]
BUILD FAILED
/Users/jenkins/jenkins-slave/workspace/Lucene-Solr-4.x-MacOSX/build.xml:381: The following
error occurred while executing this line:
/Users/jenkins/jenkins-slave/workspace/Lucene-Solr-4.x-MacOSX/build.xml:361: The following
error occurred while executing this line:
/Users/jenkins/jenkins-slave/workspace/Lucene-Solr-4.x-MacOSX/build.xml:39: The following
error occurred while executing this line:
/Users/jenkins/jenkins-slave/workspace/Lucene-Solr-4.x-MacOSX/solr/build.xml:196: The following
error occurred while executing this line:
/Users/jenkins/jenkins-slave/workspace/Lucene-Solr-4.x-MacOSX/solr/common-build.xml:449: The
following error occurred while executing this line:
/Users/jenkins/jenkins-slave/workspace/Lucene-Solr-4.x-MacOSX/lucene/common-build.xml:1213:
The following error occurred while executing this line:
/Users/jenkins/jenkins-slave/workspace/Lucene-Solr-4.x-MacOSX/lucene/common-build.xml:877:
There were test failures: 45 suites, 266 tests, 1 error

Total time: 84 minutes 13 seconds
Build step 'Invoke Ant' marked build as failure
Archiving artifacts
Recording test results
Description set: Java: 64bit/jdk1.7.0 -XX:+UseSerialGC
Email was triggered for: Failure
Sending email for trigger: Failure



Mime
View raw message