lucene-dev mailing list archives

Site index · List index
Message view « Date » · « Thread »
Top « Date » · « Thread »
From Policeman Jenkins Server <jenk...@thetaphi.de>
Subject [JENKINS] Lucene-Solr-trunk-Linux (64bit/jdk1.6.0_41) - Build # 4604 - Failure!
Date Thu, 07 Mar 2013 05:02:37 GMT
Build: http://jenkins.thetaphi.de/job/Lucene-Solr-trunk-Linux/4604/
Java: 64bit/jdk1.6.0_41 -XX:+UseConcMarkSweepGC

2 tests failed.
FAILED:  junit.framework.TestSuite.org.apache.solr.cloud.RecoveryZkTest

Error Message:
Resource in scope SUITE failed to close. Resource was registered from thread Thread[id=2685, name=coreLoadExecutor-2110-thread-1, state=RUNNABLE, group=TGRP-RecoveryZkTest], registration stack trace below.

Stack Trace:
com.carrotsearch.randomizedtesting.ResourceDisposalError: Resource in scope SUITE failed to close. Resource was registered from thread Thread[id=2685, name=coreLoadExecutor-2110-thread-1, state=RUNNABLE, group=TGRP-RecoveryZkTest], registration stack trace below.
	at java.lang.Thread.getStackTrace(Thread.java:1479)
	at com.carrotsearch.randomizedtesting.RandomizedContext.closeAtEnd(RandomizedContext.java:150)
	at org.apache.lucene.util.LuceneTestCase.closeAfterSuite(LuceneTestCase.java:520)
	at org.apache.lucene.util.LuceneTestCase.wrapDirectory(LuceneTestCase.java:986)
	at org.apache.lucene.util.LuceneTestCase.newDirectory(LuceneTestCase.java:878)
	at org.apache.lucene.util.LuceneTestCase.newDirectory(LuceneTestCase.java:870)
	at org.apache.solr.core.MockDirectoryFactory.create(MockDirectoryFactory.java:33)
	at org.apache.solr.core.CachingDirectoryFactory.get(CachingDirectoryFactory.java:266)
	at org.apache.solr.core.CachingDirectoryFactory.get(CachingDirectoryFactory.java:222)
	at org.apache.solr.core.SolrCore.getNewIndexDir(SolrCore.java:244)
	at org.apache.solr.core.SolrCore.initIndex(SolrCore.java:458)
	at org.apache.solr.core.SolrCore.<init>(SolrCore.java:733)
	at org.apache.solr.core.SolrCore.<init>(SolrCore.java:619)
	at org.apache.solr.core.CoreContainer.createFromZk(CoreContainer.java:874)
	at org.apache.solr.core.CoreContainer.create(CoreContainer.java:957)
	at org.apache.solr.core.CoreContainer$2.call(CoreContainer.java:580)
	at org.apache.solr.core.CoreContainer$2.call(CoreContainer.java:575)
	at java.util.concurrent.FutureTask$Sync.innerRun(FutureTask.java:303)
	at java.util.concurrent.FutureTask.run(FutureTask.java:138)
	at java.util.concurrent.Executors$RunnableAdapter.call(Executors.java:439)
	at java.util.concurrent.FutureTask$Sync.innerRun(FutureTask.java:303)
	at java.util.concurrent.FutureTask.run(FutureTask.java:138)
	at java.util.concurrent.ThreadPoolExecutor$Worker.runTask(ThreadPoolExecutor.java:895)
	at java.util.concurrent.ThreadPoolExecutor$Worker.run(ThreadPoolExecutor.java:918)
	at java.lang.Thread.run(Thread.java:662)
Caused by: java.lang.AssertionError: Directory not closed: MockDirWrapper(org.apache.lucene.store.SimpleFSDirectory@/mnt/ssd/jenkins/workspace/Lucene-Solr-trunk-Linux/solr/build/solr-core/test/J1/index3416734185tmp lockFactory=org.apache.lucene.store.NativeFSLockFactory@6d74f3d4)
	at org.junit.Assert.fail(Assert.java:93)
	at org.apache.lucene.util.CloseableDirectory.close(CloseableDirectory.java:47)
	at com.carrotsearch.randomizedtesting.RandomizedRunner$2$1.apply(RandomizedRunner.java:602)
	at com.carrotsearch.randomizedtesting.RandomizedRunner$2$1.apply(RandomizedRunner.java:599)
	at com.carrotsearch.randomizedtesting.RandomizedContext.closeResources(RandomizedContext.java:167)
	at com.carrotsearch.randomizedtesting.RandomizedRunner$2.afterAlways(RandomizedRunner.java:615)
	at com.carrotsearch.randomizedtesting.rules.StatementAdapter.evaluate(StatementAdapter.java:43)
	at com.carrotsearch.randomizedtesting.ThreadLeakControl$StatementRunner.run(ThreadLeakControl.java:358)
	... 1 more


FAILED:  junit.framework.TestSuite.org.apache.solr.cloud.RecoveryZkTest

Error Message:
Resource in scope SUITE failed to close. Resource was registered from thread Thread[id=2687, name=RecoveryThread, state=RUNNABLE, group=TGRP-RecoveryZkTest], registration stack trace below.

Stack Trace:
com.carrotsearch.randomizedtesting.ResourceDisposalError: Resource in scope SUITE failed to close. Resource was registered from thread Thread[id=2687, name=RecoveryThread, state=RUNNABLE, group=TGRP-RecoveryZkTest], registration stack trace below.
	at java.lang.Thread.getStackTrace(Thread.java:1479)
	at com.carrotsearch.randomizedtesting.RandomizedContext.closeAtEnd(RandomizedContext.java:150)
	at org.apache.lucene.util.LuceneTestCase.closeAfterSuite(LuceneTestCase.java:520)
	at org.apache.lucene.util.LuceneTestCase.wrapDirectory(LuceneTestCase.java:986)
	at org.apache.lucene.util.LuceneTestCase.newDirectory(LuceneTestCase.java:878)
	at org.apache.lucene.util.LuceneTestCase.newDirectory(LuceneTestCase.java:870)
	at org.apache.solr.core.MockDirectoryFactory.create(MockDirectoryFactory.java:33)
	at org.apache.solr.core.CachingDirectoryFactory.get(CachingDirectoryFactory.java:266)
	at org.apache.solr.core.CachingDirectoryFactory.get(CachingDirectoryFactory.java:222)
	at org.apache.solr.handler.SnapPuller.fetchLatestIndex(SnapPuller.java:383)
	at org.apache.solr.handler.ReplicationHandler.doFetch(ReplicationHandler.java:281)
	at org.apache.solr.cloud.RecoveryStrategy.replicate(RecoveryStrategy.java:153)
	at org.apache.solr.cloud.RecoveryStrategy.doRecovery(RecoveryStrategy.java:409)
	at org.apache.solr.cloud.RecoveryStrategy.run(RecoveryStrategy.java:223)
Caused by: java.lang.AssertionError: Directory not closed: MockDirWrapper(org.apache.lucene.store.SimpleFSDirectory@/mnt/ssd/jenkins/workspace/Lucene-Solr-trunk-Linux/solr/build/solr-core/test/J1/index3416734186tmp lockFactory=org.apache.lucene.store.NativeFSLockFactory@26eab82c)
	at org.junit.Assert.fail(Assert.java:93)
	at org.apache.lucene.util.CloseableDirectory.close(CloseableDirectory.java:47)
	at com.carrotsearch.randomizedtesting.RandomizedRunner$2$1.apply(RandomizedRunner.java:602)
	at com.carrotsearch.randomizedtesting.RandomizedRunner$2$1.apply(RandomizedRunner.java:599)
	at com.carrotsearch.randomizedtesting.RandomizedContext.closeResources(RandomizedContext.java:167)
	at com.carrotsearch.randomizedtesting.RandomizedRunner$2.afterAlways(RandomizedRunner.java:615)
	at com.carrotsearch.randomizedtesting.rules.StatementAdapter.evaluate(StatementAdapter.java:43)
	at com.carrotsearch.randomizedtesting.ThreadLeakControl$StatementRunner.run(ThreadLeakControl.java:358)
	at java.lang.Thread.run(Thread.java:662)




Build Log:
[...truncated 8666 lines...]
[junit4:junit4] Suite: org.apache.solr.cloud.RecoveryZkTest
[junit4:junit4]   2> 0 T2626 oas.BaseDistributedSearchTestCase.initHostContext Setting hostContext system property: /
[junit4:junit4]   2> 4 T2626 oas.SolrTestCaseJ4.setUp ###Starting testDistribSearch
[junit4:junit4]   2> Creating dataDir: /mnt/ssd/jenkins/workspace/Lucene-Solr-trunk-Linux/solr/build/solr-core/test/J1/./solrtest-RecoveryZkTest-1362632277302
[junit4:junit4]   2> 4 T2626 oasc.ZkTestServer.run STARTING ZK TEST SERVER
[junit4:junit4]   2> 5 T2627 oasc.ZkTestServer$ZKServerMain.runFromConfig Starting server
[junit4:junit4]   2> 5 T2627 oazs.ZooKeeperServer.setTickTime tickTime set to 1000
[junit4:junit4]   2> 6 T2627 oazs.ZooKeeperServer.setMinSessionTimeout minSessionTimeout set to -1
[junit4:junit4]   2> 6 T2627 oazs.ZooKeeperServer.setMaxSessionTimeout maxSessionTimeout set to -1
[junit4:junit4]   2> 6 T2627 oazs.NIOServerCnxnFactory.configure binding to port 0.0.0.0/0.0.0.0:0
[junit4:junit4]   2> 6 T2627 oazsp.FileTxnSnapLog.save Snapshotting: 0x0 to /mnt/ssd/jenkins/workspace/Lucene-Solr-trunk-Linux/solr/build/solr-core/test/J1/./org.apache.solr.cloud.RecoveryZkTest-1362632277302/zookeeper/server1/data/version-2/snapshot.0
[junit4:junit4]   2> 105 T2626 oasc.ZkTestServer.run start zk server on port:56165
[junit4:junit4]   2> 105 T2626 oaz.ZooKeeper.<init> Initiating client connection, connectString=127.0.0.1:56165 sessionTimeout=10000 watcher=org.apache.solr.common.cloud.ConnectionManager@1c0745fe
[junit4:junit4]   2> 106 T2626 oascc.ConnectionManager.waitForConnected Waiting for client to connect to ZooKeeper
[junit4:junit4]   2> 106 T2632 oaz.ClientCnxn$SendThread.logStartConnect Opening socket connection to server localhost.localdomain/127.0.0.1:56165. Will not attempt to authenticate using SASL (access denied (javax.security.auth.AuthPermission getLoginConfiguration))
[junit4:junit4]   2> 107 T2632 oaz.ClientCnxn$SendThread.primeConnection Socket connection established to localhost.localdomain/127.0.0.1:56165, initiating session
[junit4:junit4]   2> 107 T2628 oazs.NIOServerCnxnFactory.run Accepted socket connection from /127.0.0.1:36352
[junit4:junit4]   2> 107 T2628 oazs.ZooKeeperServer.processConnectRequest Client attempting to establish new session at /127.0.0.1:36352
[junit4:junit4]   2> 107 T2630 oazsp.FileTxnLog.append Creating new log file: log.1
[junit4:junit4]   2> 313 T2630 oazs.ZooKeeperServer.finishSessionInit Established session 0x13d43367d390000 with negotiated timeout 10000 for client /127.0.0.1:36352
[junit4:junit4]   2> 314 T2632 oaz.ClientCnxn$SendThread.onConnected Session establishment complete on server localhost.localdomain/127.0.0.1:56165, sessionid = 0x13d43367d390000, negotiated timeout = 10000
[junit4:junit4]   2> 314 T2633 oascc.ConnectionManager.process Watcher org.apache.solr.common.cloud.ConnectionManager@1c0745fe name:ZooKeeperConnection Watcher:127.0.0.1:56165 got event WatchedEvent state:SyncConnected type:None path:null path:null type:None
[junit4:junit4]   2> 314 T2626 oascc.ConnectionManager.waitForConnected Client is connected to ZooKeeper
[junit4:junit4]   2> 315 T2626 oascc.SolrZkClient.makePath makePath: /solr
[junit4:junit4]   2> 318 T2631 oazs.PrepRequestProcessor.pRequest2Txn Processed session termination for sessionid: 0x13d43367d390000
[junit4:junit4]   2> 318 T2633 oaz.ClientCnxn$EventThread.run EventThread shut down
[junit4:junit4]   2> 319 T2628 oazs.NIOServerCnxn.closeSock Closed socket connection for client /127.0.0.1:36352 which had sessionid 0x13d43367d390000
[junit4:junit4]   2> 318 T2626 oaz.ZooKeeper.close Session: 0x13d43367d390000 closed
[junit4:junit4]   2> 319 T2626 oaz.ZooKeeper.<init> Initiating client connection, connectString=127.0.0.1:56165/solr sessionTimeout=10000 watcher=org.apache.solr.common.cloud.ConnectionManager@93b2584
[junit4:junit4]   2> 320 T2626 oascc.ConnectionManager.waitForConnected Waiting for client to connect to ZooKeeper
[junit4:junit4]   2> 320 T2634 oaz.ClientCnxn$SendThread.logStartConnect Opening socket connection to server localhost.localdomain/127.0.0.1:56165. Will not attempt to authenticate using SASL (access denied (javax.security.auth.AuthPermission getLoginConfiguration))
[junit4:junit4]   2> 320 T2634 oaz.ClientCnxn$SendThread.primeConnection Socket connection established to localhost.localdomain/127.0.0.1:56165, initiating session
[junit4:junit4]   2> 320 T2628 oazs.NIOServerCnxnFactory.run Accepted socket connection from /127.0.0.1:36354
[junit4:junit4]   2> 321 T2628 oazs.ZooKeeperServer.processConnectRequest Client attempting to establish new session at /127.0.0.1:36354
[junit4:junit4]   2> 321 T2630 oazs.ZooKeeperServer.finishSessionInit Established session 0x13d43367d390001 with negotiated timeout 10000 for client /127.0.0.1:36354
[junit4:junit4]   2> 321 T2634 oaz.ClientCnxn$SendThread.onConnected Session establishment complete on server localhost.localdomain/127.0.0.1:56165, sessionid = 0x13d43367d390001, negotiated timeout = 10000
[junit4:junit4]   2> 322 T2635 oascc.ConnectionManager.process Watcher org.apache.solr.common.cloud.ConnectionManager@93b2584 name:ZooKeeperConnection Watcher:127.0.0.1:56165/solr got event WatchedEvent state:SyncConnected type:None path:null path:null type:None
[junit4:junit4]   2> 322 T2626 oascc.ConnectionManager.waitForConnected Client is connected to ZooKeeper
[junit4:junit4]   2> 322 T2626 oascc.SolrZkClient.makePath makePath: /collections/collection1
[junit4:junit4]   2> 325 T2626 oascc.SolrZkClient.makePath makePath: /collections/collection1/shards
[junit4:junit4]   2> 326 T2626 oascc.SolrZkClient.makePath makePath: /collections/control_collection
[junit4:junit4]   2> 328 T2626 oascc.SolrZkClient.makePath makePath: /collections/control_collection/shards
[junit4:junit4]   2> 329 T2626 oasc.AbstractZkTestCase.putConfig put /mnt/ssd/jenkins/workspace/Lucene-Solr-trunk-Linux/solr/build/solr-core/test-files/solr/collection1/conf/solrconfig-tlog.xml to /configs/conf1/solrconfig.xml
[junit4:junit4]   2> 330 T2626 oascc.SolrZkClient.makePath makePath: /configs/conf1/solrconfig.xml
[junit4:junit4]   2> 333 T2626 oasc.AbstractZkTestCase.putConfig put /mnt/ssd/jenkins/workspace/Lucene-Solr-trunk-Linux/solr/build/solr-core/test-files/solr/collection1/conf/schema.xml to /configs/conf1/schema.xml
[junit4:junit4]   2> 333 T2626 oascc.SolrZkClient.makePath makePath: /configs/conf1/schema.xml
[junit4:junit4]   2> 336 T2626 oasc.AbstractZkTestCase.putConfig put /mnt/ssd/jenkins/workspace/Lucene-Solr-trunk-Linux/solr/build/solr-core/test-files/solr/collection1/conf/stopwords.txt to /configs/conf1/stopwords.txt
[junit4:junit4]   2> 336 T2626 oascc.SolrZkClient.makePath makePath: /configs/conf1/stopwords.txt
[junit4:junit4]   2> 338 T2626 oasc.AbstractZkTestCase.putConfig put /mnt/ssd/jenkins/workspace/Lucene-Solr-trunk-Linux/solr/build/solr-core/test-files/solr/collection1/conf/protwords.txt to /configs/conf1/protwords.txt
[junit4:junit4]   2> 338 T2626 oascc.SolrZkClient.makePath makePath: /configs/conf1/protwords.txt
[junit4:junit4]   2> 340 T2626 oasc.AbstractZkTestCase.putConfig put /mnt/ssd/jenkins/workspace/Lucene-Solr-trunk-Linux/solr/build/solr-core/test-files/solr/collection1/conf/currency.xml to /configs/conf1/currency.xml
[junit4:junit4]   2> 341 T2626 oascc.SolrZkClient.makePath makePath: /configs/conf1/currency.xml
[junit4:junit4]   2> 344 T2626 oasc.AbstractZkTestCase.putConfig put /mnt/ssd/jenkins/workspace/Lucene-Solr-trunk-Linux/solr/build/solr-core/test-files/solr/collection1/conf/open-exchange-rates.json to /configs/conf1/open-exchange-rates.json
[junit4:junit4]   2> 344 T2626 oascc.SolrZkClient.makePath makePath: /configs/conf1/open-exchange-rates.json
[junit4:junit4]   2> 346 T2626 oasc.AbstractZkTestCase.putConfig put /mnt/ssd/jenkins/workspace/Lucene-Solr-trunk-Linux/solr/build/solr-core/test-files/solr/collection1/conf/mapping-ISOLatin1Accent.txt to /configs/conf1/mapping-ISOLatin1Accent.txt
[junit4:junit4]   2> 346 T2626 oascc.SolrZkClient.makePath makePath: /configs/conf1/mapping-ISOLatin1Accent.txt
[junit4:junit4]   2> 348 T2626 oasc.AbstractZkTestCase.putConfig put /mnt/ssd/jenkins/workspace/Lucene-Solr-trunk-Linux/solr/build/solr-core/test-files/solr/collection1/conf/old_synonyms.txt to /configs/conf1/old_synonyms.txt
[junit4:junit4]   2> 349 T2626 oascc.SolrZkClient.makePath makePath: /configs/conf1/old_synonyms.txt
[junit4:junit4]   2> 351 T2626 oasc.AbstractZkTestCase.putConfig put /mnt/ssd/jenkins/workspace/Lucene-Solr-trunk-Linux/solr/build/solr-core/test-files/solr/collection1/conf/synonyms.txt to /configs/conf1/synonyms.txt
[junit4:junit4]   2> 351 T2626 oascc.SolrZkClient.makePath makePath: /configs/conf1/synonyms.txt
[junit4:junit4]   2> 353 T2631 oazs.PrepRequestProcessor.pRequest2Txn Processed session termination for sessionid: 0x13d43367d390001
[junit4:junit4]   2> 353 T2628 oazs.NIOServerCnxn.closeSock Closed socket connection for client /127.0.0.1:36354 which had sessionid 0x13d43367d390001
[junit4:junit4]   2> 353 T2626 oaz.ZooKeeper.close Session: 0x13d43367d390001 closed
[junit4:junit4]   2> 356 T2635 oaz.ClientCnxn$EventThread.run EventThread shut down
[junit4:junit4]   2> 408 T2626 oejs.Server.doStart jetty-8.1.8.v20121106
[junit4:junit4]   2> 412 T2626 oejs.AbstractConnector.doStart Started SelectChannelConnector@127.0.0.1:46877
[junit4:junit4]   2> 412 T2626 oass.SolrDispatchFilter.init SolrDispatchFilter.init()
[junit4:junit4]   2> 413 T2626 oasc.SolrResourceLoader.locateSolrHome JNDI not configured for solr (NoInitialContextEx)
[junit4:junit4]   2> 413 T2626 oasc.SolrResourceLoader.locateSolrHome using system property solr.solr.home: /mnt/ssd/jenkins/workspace/Lucene-Solr-trunk-Linux/solr/build/solr-core/test/J1/./org.apache.solr.cloud.RecoveryZkTest-controljetty-1362632277651
[junit4:junit4]   2> 413 T2626 oasc.CoreContainer$Initializer.initialize looking for solr config file: /mnt/ssd/jenkins/workspace/Lucene-Solr-trunk-Linux/solr/build/solr-core/test/J1/./org.apache.solr.cloud.RecoveryZkTest-controljetty-1362632277651/solr.xml
[junit4:junit4]   2> 414 T2626 oasc.CoreContainer.<init> New CoreContainer 1962685593
[junit4:junit4]   2> 414 T2626 oasc.CoreContainer.load Loading CoreContainer using Solr Home: '/mnt/ssd/jenkins/workspace/Lucene-Solr-trunk-Linux/solr/build/solr-core/test/J1/./org.apache.solr.cloud.RecoveryZkTest-controljetty-1362632277651/'
[junit4:junit4]   2> 414 T2626 oasc.SolrResourceLoader.<init> new SolrResourceLoader for directory: '/mnt/ssd/jenkins/workspace/Lucene-Solr-trunk-Linux/solr/build/solr-core/test/J1/./org.apache.solr.cloud.RecoveryZkTest-controljetty-1362632277651/'
[junit4:junit4]   2> 432 T2626 oashc.HttpShardHandlerFactory.getParameter Setting socketTimeout to: 120000
[junit4:junit4]   2> 432 T2626 oashc.HttpShardHandlerFactory.getParameter Setting urlScheme to: http://
[junit4:junit4]   2> 432 T2626 oashc.HttpShardHandlerFactory.getParameter Setting connTimeout to: 15000
[junit4:junit4]   2> 433 T2626 oashc.HttpShardHandlerFactory.getParameter Setting maxConnectionsPerHost to: 20
[junit4:junit4]   2> 433 T2626 oashc.HttpShardHandlerFactory.getParameter Setting corePoolSize to: 0
[junit4:junit4]   2> 433 T2626 oashc.HttpShardHandlerFactory.getParameter Setting maximumPoolSize to: 2147483647
[junit4:junit4]   2> 434 T2626 oashc.HttpShardHandlerFactory.getParameter Setting maxThreadIdleTime to: 5
[junit4:junit4]   2> 434 T2626 oashc.HttpShardHandlerFactory.getParameter Setting sizeOfQueue to: -1
[junit4:junit4]   2> 434 T2626 oashc.HttpShardHandlerFactory.getParameter Setting fairnessPolicy to: false
[junit4:junit4]   2> 435 T2626 oascsi.HttpClientUtil.createClient Creating new http client, config:maxConnectionsPerHost=20&maxConnections=10000&socketTimeout=120000&connTimeout=15000&retry=false
[junit4:junit4]   2> 448 T2626 oasc.CoreContainer.load Registering Log Listener
[junit4:junit4]   2> 459 T2626 oasc.CoreContainer.initZooKeeper Zookeeper client=127.0.0.1:56165/solr
[junit4:junit4]   2> 459 T2626 oasc.ZkController.checkChrootPath zkHost includes chroot
[junit4:junit4]   2> 460 T2626 oaz.ZooKeeper.<init> Initiating client connection, connectString=127.0.0.1:56165 sessionTimeout=60000 watcher=org.apache.solr.common.cloud.ConnectionManager@5f0a95fd
[junit4:junit4]   2> 460 T2626 oascc.ConnectionManager.waitForConnected Waiting for client to connect to ZooKeeper
[junit4:junit4]   2> 461 T2645 oaz.ClientCnxn$SendThread.logStartConnect Opening socket connection to server localhost.localdomain/127.0.0.1:56165. Will not attempt to authenticate using SASL (access denied (javax.security.auth.AuthPermission getLoginConfiguration))
[junit4:junit4]   2> 461 T2645 oaz.ClientCnxn$SendThread.primeConnection Socket connection established to localhost.localdomain/127.0.0.1:56165, initiating session
[junit4:junit4]   2> 462 T2628 oazs.NIOServerCnxnFactory.run Accepted socket connection from /127.0.0.1:36355
[junit4:junit4]   2> 462 T2628 oazs.ZooKeeperServer.processConnectRequest Client attempting to establish new session at /127.0.0.1:36355
[junit4:junit4]   2> 463 T2630 oazs.ZooKeeperServer.finishSessionInit Established session 0x13d43367d390002 with negotiated timeout 20000 for client /127.0.0.1:36355
[junit4:junit4]   2> 463 T2645 oaz.ClientCnxn$SendThread.onConnected Session establishment complete on server localhost.localdomain/127.0.0.1:56165, sessionid = 0x13d43367d390002, negotiated timeout = 20000
[junit4:junit4]   2> 463 T2646 oascc.ConnectionManager.process Watcher org.apache.solr.common.cloud.ConnectionManager@5f0a95fd name:ZooKeeperConnection Watcher:127.0.0.1:56165 got event WatchedEvent state:SyncConnected type:None path:null path:null type:None
[junit4:junit4]   2> 463 T2626 oascc.ConnectionManager.waitForConnected Client is connected to ZooKeeper
[junit4:junit4]   2> 464 T2631 oazs.PrepRequestProcessor.pRequest2Txn Processed session termination for sessionid: 0x13d43367d390002
[junit4:junit4]   2> 465 T2646 oaz.ClientCnxn$EventThread.run EventThread shut down
[junit4:junit4]   2> 465 T2628 oazs.NIOServerCnxn.closeSock Closed socket connection for client /127.0.0.1:36355 which had sessionid 0x13d43367d390002
[junit4:junit4]   2> 465 T2626 oaz.ZooKeeper.close Session: 0x13d43367d390002 closed
[junit4:junit4]   2> 466 T2626 oascsi.HttpClientUtil.createClient Creating new http client, config:maxConnections=500&maxConnectionsPerHost=16&socketTimeout=120000&connTimeout=15000
[junit4:junit4]   2> 468 T2626 oaz.ZooKeeper.<init> Initiating client connection, connectString=127.0.0.1:56165/solr sessionTimeout=30000 watcher=org.apache.solr.common.cloud.ConnectionManager@33ad013c
[junit4:junit4]   2> 469 T2626 oascc.ConnectionManager.waitForConnected Waiting for client to connect to ZooKeeper
[junit4:junit4]   2> 469 T2647 oaz.ClientCnxn$SendThread.logStartConnect Opening socket connection to server localhost.localdomain/127.0.0.1:56165. Will not attempt to authenticate using SASL (access denied (javax.security.auth.AuthPermission getLoginConfiguration))
[junit4:junit4]   2> 469 T2647 oaz.ClientCnxn$SendThread.primeConnection Socket connection established to localhost.localdomain/127.0.0.1:56165, initiating session
[junit4:junit4]   2> 469 T2628 oazs.NIOServerCnxnFactory.run Accepted socket connection from /127.0.0.1:36356
[junit4:junit4]   2> 469 T2628 oazs.ZooKeeperServer.processConnectRequest Client attempting to establish new session at /127.0.0.1:36356
[junit4:junit4]   2> 470 T2630 oazs.ZooKeeperServer.finishSessionInit Established session 0x13d43367d390003 with negotiated timeout 20000 for client /127.0.0.1:36356
[junit4:junit4]   2> 470 T2647 oaz.ClientCnxn$SendThread.onConnected Session establishment complete on server localhost.localdomain/127.0.0.1:56165, sessionid = 0x13d43367d390003, negotiated timeout = 20000
[junit4:junit4]   2> 470 T2648 oascc.ConnectionManager.process Watcher org.apache.solr.common.cloud.ConnectionManager@33ad013c name:ZooKeeperConnection Watcher:127.0.0.1:56165/solr got event WatchedEvent state:SyncConnected type:None path:null path:null type:None
[junit4:junit4]   2> 471 T2626 oascc.ConnectionManager.waitForConnected Client is connected to ZooKeeper
[junit4:junit4]   2> 472 T2631 oazs.PrepRequestProcessor.pRequest Got user-level KeeperException when processing sessionid:0x13d43367d390003 type:create cxid:0x2 zxid:0x1a txntype:-1 reqpath:n/a Error Path:/solr/overseer Error:KeeperErrorCode = NodeExists for /solr/overseer
[junit4:junit4]   2> 473 T2626 oascc.SolrZkClient.makePath makePath: /live_nodes
[junit4:junit4]   2> 474 T2626 oasc.ZkController.createEphemeralLiveNode Register node as live in ZooKeeper:/live_nodes/127.0.0.1:46877_
[junit4:junit4]   2> 475 T2631 oazs.PrepRequestProcessor.pRequest Got user-level KeeperException when processing sessionid:0x13d43367d390003 type:delete cxid:0x8 zxid:0x1c txntype:-1 reqpath:n/a Error Path:/solr/live_nodes/127.0.0.1:46877_ Error:KeeperErrorCode = NoNode for /solr/live_nodes/127.0.0.1:46877_
[junit4:junit4]   2> 475 T2626 oascc.SolrZkClient.makePath makePath: /live_nodes/127.0.0.1:46877_
[junit4:junit4]   2> 477 T2626 oascc.SolrZkClient.makePath makePath: /overseer_elect/election
[junit4:junit4]   2> 480 T2631 oazs.PrepRequestProcessor.pRequest Got user-level KeeperException when processing sessionid:0x13d43367d390003 type:delete cxid:0x16 zxid:0x21 txntype:-1 reqpath:n/a Error Path:/solr/overseer_elect/leader Error:KeeperErrorCode = NoNode for /solr/overseer_elect/leader
[junit4:junit4]   2> 480 T2626 oascc.SolrZkClient.makePath makePath: /overseer_elect/leader
[junit4:junit4]   2> 483 T2626 oasc.Overseer.start Overseer (id=89301468925460483-127.0.0.1:46877_-n_0000000000) starting
[junit4:junit4]   2> 483 T2631 oazs.PrepRequestProcessor.pRequest Got user-level KeeperException when processing sessionid:0x13d43367d390003 type:create cxid:0x1b zxid:0x23 txntype:-1 reqpath:n/a Error Path:/solr/overseer Error:KeeperErrorCode = NodeExists for /solr/overseer
[junit4:junit4]   2> 484 T2631 oazs.PrepRequestProcessor.pRequest Got user-level KeeperException when processing sessionid:0x13d43367d390003 type:create cxid:0x1c zxid:0x24 txntype:-1 reqpath:n/a Error Path:/solr/overseer Error:KeeperErrorCode = NodeExists for /solr/overseer
[junit4:junit4]   2> 484 T2631 oazs.PrepRequestProcessor.pRequest Got user-level KeeperException when processing sessionid:0x13d43367d390003 type:create cxid:0x1d zxid:0x25 txntype:-1 reqpath:n/a Error Path:/solr/overseer Error:KeeperErrorCode = NodeExists for /solr/overseer
[junit4:junit4]   2> 485 T2631 oazs.PrepRequestProcessor.pRequest Got user-level KeeperException when processing sessionid:0x13d43367d390003 type:create cxid:0x1e zxid:0x26 txntype:-1 reqpath:n/a Error Path:/solr/overseer Error:KeeperErrorCode = NodeExists for /solr/overseer
[junit4:junit4]   2> 485 T2650 oasc.OverseerCollectionProcessor.run Process current queue of collection creations
[junit4:junit4]   2> 486 T2626 oascc.SolrZkClient.makePath makePath: /clusterstate.json
[junit4:junit4]   2> 487 T2626 oascc.ZkStateReader.createClusterStateWatchersAndUpdate Updating cluster state from ZooKeeper... 
[junit4:junit4]   2> 489 T2649 oasc.Overseer$ClusterStateUpdater.run Starting to work on the main queue
[junit4:junit4]   2> 491 T2651 oasc.CoreContainer.create Creating SolrCore 'collection1' using instanceDir: /mnt/ssd/jenkins/workspace/Lucene-Solr-trunk-Linux/solr/build/solr-core/test/J1/./org.apache.solr.cloud.RecoveryZkTest-controljetty-1362632277651/collection1
[junit4:junit4]   2> 491 T2651 oasc.ZkController.createCollectionZkNode Check for collection zkNode:control_collection
[junit4:junit4]   2> 491 T2651 oasc.ZkController.createCollectionZkNode Collection zkNode exists
[junit4:junit4]   2> 491 T2651 oasc.ZkController.readConfigName Load collection config from:/collections/control_collection
[junit4:junit4]   2> 492 T2651 oasc.SolrResourceLoader.<init> new SolrResourceLoader for directory: '/mnt/ssd/jenkins/workspace/Lucene-Solr-trunk-Linux/solr/build/solr-core/test/J1/./org.apache.solr.cloud.RecoveryZkTest-controljetty-1362632277651/collection1/'
[junit4:junit4]   2> 493 T2651 oasc.SolrResourceLoader.replaceClassLoader Adding 'file:/mnt/ssd/jenkins/workspace/Lucene-Solr-trunk-Linux/solr/build/solr-core/test/J1/org.apache.solr.cloud.RecoveryZkTest-controljetty-1362632277651/collection1/lib/README' to classloader
[junit4:junit4]   2> 493 T2651 oasc.SolrResourceLoader.replaceClassLoader Adding 'file:/mnt/ssd/jenkins/workspace/Lucene-Solr-trunk-Linux/solr/build/solr-core/test/J1/org.apache.solr.cloud.RecoveryZkTest-controljetty-1362632277651/collection1/lib/classes/' to classloader
[junit4:junit4]   2> 526 T2651 oasc.SolrConfig.<init> Using Lucene MatchVersion: LUCENE_50
[junit4:junit4]   2> 564 T2651 oasc.SolrConfig.<init> Loaded SolrConfig: solrconfig.xml
[junit4:junit4]   2> 565 T2651 oass.IndexSchema.readSchema Reading Solr Schema
[junit4:junit4]   2> 569 T2651 oass.IndexSchema.readSchema Schema name=test
[junit4:junit4]   2> 995 T2651 oass.OpenExchangeRatesOrgProvider.init Initialized with rates=open-exchange-rates.json, refreshInterval=1440.
[junit4:junit4]   2> 1001 T2651 oass.IndexSchema.readSchema default search field in schema is text
[junit4:junit4]   2> 1003 T2651 oass.IndexSchema.readSchema unique key field: id
[junit4:junit4]   2> 1013 T2651 oass.FileExchangeRateProvider.reload Reloading exchange rates from file currency.xml
[junit4:junit4]   2> 1016 T2651 oass.FileExchangeRateProvider.reload Reloading exchange rates from file currency.xml
[junit4:junit4]   2> 1019 T2651 oass.OpenExchangeRatesOrgProvider.reload Reloading exchange rates from open-exchange-rates.json
[junit4:junit4]   2> 1020 T2651 oass.OpenExchangeRatesOrgProvider$OpenExchangeRates.<init> WARNING Unknown key IMPORTANT NOTE
[junit4:junit4]   2> 1020 T2651 oass.OpenExchangeRatesOrgProvider$OpenExchangeRates.<init> WARNING Expected key, got STRING
[junit4:junit4]   2> 1020 T2651 oass.OpenExchangeRatesOrgProvider.reload Reloading exchange rates from open-exchange-rates.json
[junit4:junit4]   2> 1021 T2651 oass.OpenExchangeRatesOrgProvider$OpenExchangeRates.<init> WARNING Unknown key IMPORTANT NOTE
[junit4:junit4]   2> 1021 T2651 oass.OpenExchangeRatesOrgProvider$OpenExchangeRates.<init> WARNING Expected key, got STRING
[junit4:junit4]   2> 1021 T2651 oasc.SolrCore.<init> [collection1] Opening new SolrCore at /mnt/ssd/jenkins/workspace/Lucene-Solr-trunk-Linux/solr/build/solr-core/test/J1/./org.apache.solr.cloud.RecoveryZkTest-controljetty-1362632277651/collection1/, dataDir=./org.apache.solr.cloud.RecoveryZkTest-1362632277302/control/data/
[junit4:junit4]   2> 1022 T2651 oasc.JmxMonitoredMap.<init> JMX monitoring is enabled. Adding Solr mbeans to JMX Server: com.sun.jmx.mbeanserver.JmxMBeanServer@4fef3a22
[junit4:junit4]   2> 1022 T2651 oasc.SolrCore.initDirectoryFactory org.apache.solr.core.MockDirectoryFactory
[junit4:junit4]   2> 1023 T2651 oasc.CachingDirectoryFactory.get return new directory for /mnt/ssd/jenkins/workspace/Lucene-Solr-trunk-Linux/solr/build/solr-core/test/J1/./org.apache.solr.cloud.RecoveryZkTest-1362632277302/control/data forceNew: false
[junit4:junit4]   2> 1023 T2651 oasc.SolrCore.getNewIndexDir New index directory detected: old=null new=./org.apache.solr.cloud.RecoveryZkTest-1362632277302/control/data/index/
[junit4:junit4]   2> 1024 T2651 oasc.SolrCore.initIndex WARNING [collection1] Solr index directory './org.apache.solr.cloud.RecoveryZkTest-1362632277302/control/data/index' doesn't exist. Creating new index...
[junit4:junit4]   2> 1024 T2651 oasc.CachingDirectoryFactory.get return new directory for /mnt/ssd/jenkins/workspace/Lucene-Solr-trunk-Linux/solr/build/solr-core/test/J1/./org.apache.solr.cloud.RecoveryZkTest-1362632277302/control/data/index forceNew: false
[junit4:junit4]   2> 1025 T2651 oasc.SolrDeletionPolicy.onCommit SolrDeletionPolicy.onCommit: commits:num=1
[junit4:junit4]   2> 		commit{dir=MockDirWrapper(org.apache.lucene.store.RAMDirectory@3644a606 lockFactory=org.apache.lucene.store.NativeFSLockFactory@54651029),segFN=segments_1,generation=1,filenames=[segments_1]
[junit4:junit4]   2> 1025 T2651 oasc.SolrDeletionPolicy.updateCommits newest commit = 1[segments_1]
[junit4:junit4]   2> 1027 T2651 oasup.UpdateRequestProcessorChain.init inserting DistributedUpdateProcessorFactory into updateRequestProcessorChain "dedupe"
[junit4:junit4]   2> 1027 T2651 oasup.UpdateRequestProcessorChain.init inserting DistributedUpdateProcessorFactory into updateRequestProcessorChain "stored_sig"
[junit4:junit4]   2> 1027 T2651 oasup.UpdateRequestProcessorChain.init inserting DistributedUpdateProcessorFactory into updateRequestProcessorChain "distrib-dup-test-chain-implicit"
[junit4:junit4]   2> 1028 T2651 oasc.RequestHandlers.initHandlersFromConfig created standard: solr.StandardRequestHandler
[junit4:junit4]   2> 1028 T2651 oasc.RequestHandlers.initHandlersFromConfig created /get: solr.RealTimeGetHandler
[junit4:junit4]   2> 1028 T2651 oasc.RequestHandlers.initHandlersFromConfig adding lazy requestHandler: solr.ReplicationHandler
[junit4:junit4]   2> 1028 T2651 oasc.RequestHandlers.initHandlersFromConfig created /replication: solr.ReplicationHandler
[junit4:junit4]   2> 1029 T2651 oasc.RequestHandlers.initHandlersFromConfig created /update: solr.UpdateRequestHandler
[junit4:junit4]   2> 1029 T2651 oasc.RequestHandlers.initHandlersFromConfig created /admin/: org.apache.solr.handler.admin.AdminHandlers
[junit4:junit4]   2> 1031 T2651 oashl.XMLLoader.init xsltCacheLifetimeSeconds=60
[junit4:junit4]   2> 1033 T2651 oass.SolrIndexSearcher.<init> Opening Searcher@40fe4b6b main
[junit4:junit4]   2> 1034 T2651 oasu.UpdateHandler.clearLog Clearing tlog files, tlogDir=./org.apache.solr.cloud.RecoveryZkTest-1362632277302/control/data/tlog
[junit4:junit4]   2> 1034 T2651 oasu.CommitTracker.<init> Hard AutoCommit: disabled
[junit4:junit4]   2> 1034 T2651 oasu.CommitTracker.<init> Soft AutoCommit: disabled
[junit4:junit4]   2> 1038 T2652 oasc.SolrCore.registerSearcher [collection1] Registered new searcher Searcher@40fe4b6b main{StandardDirectoryReader(segments_1:1)}
[junit4:junit4]   2> 1039 T2651 oasc.ZkController.publish publishing core=collection1 state=down
[junit4:junit4]   2> 1039 T2651 oasc.ZkController.publish numShards not found on descriptor - reading it from system property
[junit4:junit4]   2> 1039 T2631 oazs.PrepRequestProcessor.pRequest Got user-level KeeperException when processing sessionid:0x13d43367d390003 type:create cxid:0x50 zxid:0x29 txntype:-1 reqpath:n/a Error Path:/solr/overseer/queue Error:KeeperErrorCode = NoNode for /solr/overseer/queue
[junit4:junit4]   2> 1992 T2649 oascc.ZkStateReader.updateClusterState Updating cloud state from ZooKeeper... 
[junit4:junit4]   2> 1992 T2649 oasc.Overseer$ClusterStateUpdater.updateState Update state numShards=1 message={
[junit4:junit4]   2> 	  "operation":"state",
[junit4:junit4]   2> 	  "core_node_name":"1",
[junit4:junit4]   2> 	  "numShards":"1",
[junit4:junit4]   2> 	  "shard":null,
[junit4:junit4]   2> 	  "roles":null,
[junit4:junit4]   2> 	  "state":"down",
[junit4:junit4]   2> 	  "core":"collection1",
[junit4:junit4]   2> 	  "collection":"control_collection",
[junit4:junit4]   2> 	  "node_name":"127.0.0.1:46877_",
[junit4:junit4]   2> 	  "base_url":"http://127.0.0.1:46877"}
[junit4:junit4]   2> 1992 T2649 oasc.Overseer$ClusterStateUpdater.createCollection Create collection control_collection with numShards 1
[junit4:junit4]   2> 1993 T2649 oasc.Overseer$ClusterStateUpdater.updateState Assigning new node to shard shard=shard1
[junit4:junit4]   2> 1993 T2631 oazs.PrepRequestProcessor.pRequest Got user-level KeeperException when processing sessionid:0x13d43367d390003 type:create cxid:0x58 zxid:0x2c txntype:-1 reqpath:n/a Error Path:/solr/overseer/queue-work Error:KeeperErrorCode = NoNode for /solr/overseer/queue-work
[junit4:junit4]   2> 1997 T2648 oascc.ZkStateReader$2.process A cluster state change: WatchedEvent state:SyncConnected type:NodeDataChanged path:/clusterstate.json, has occurred - updating... (live nodes size: 1)
[junit4:junit4]   2> 2041 T2651 oasc.CoreContainer.registerCore registering core: collection1
[junit4:junit4]   2> 2041 T2651 oasc.ZkController.register Register replica - core:collection1 address:http://127.0.0.1:46877 collection:control_collection shard:shard1
[junit4:junit4]   2> 2050 T2651 oascc.SolrZkClient.makePath makePath: /collections/control_collection/leader_elect/shard1/election
[junit4:junit4]   2> 2056 T2631 oazs.PrepRequestProcessor.pRequest Got user-level KeeperException when processing sessionid:0x13d43367d390003 type:delete cxid:0x72 zxid:0x36 txntype:-1 reqpath:n/a Error Path:/solr/collections/control_collection/leaders Error:KeeperErrorCode = NoNode for /solr/collections/control_collection/leaders
[junit4:junit4]   2> 2056 T2651 oasc.ShardLeaderElectionContext.runLeaderProcess Running the leader process.
[junit4:junit4]   2> 2056 T2631 oazs.PrepRequestProcessor.pRequest Got user-level KeeperException when processing sessionid:0x13d43367d390003 type:create cxid:0x73 zxid:0x37 txntype:-1 reqpath:n/a Error Path:/solr/overseer Error:KeeperErrorCode = NodeExists for /solr/overseer
[junit4:junit4]   2> 2057 T2651 oasc.ShardLeaderElectionContext.waitForReplicasToComeUp Enough replicas found to continue.
[junit4:junit4]   2> 2058 T2651 oasc.ShardLeaderElectionContext.runLeaderProcess I may be the new leader - try and sync
[junit4:junit4]   2> 2058 T2651 oasc.SyncStrategy.sync Sync replicas to http://127.0.0.1:46877/collection1/
[junit4:junit4]   2> 2058 T2651 oasc.SyncStrategy.syncReplicas Sync Success - now sync replicas to me
[junit4:junit4]   2> 2058 T2651 oasc.SyncStrategy.syncToMe http://127.0.0.1:46877/collection1/ has no replicas
[junit4:junit4]   2> 2058 T2651 oasc.ShardLeaderElectionContext.runLeaderProcess I am the new leader: http://127.0.0.1:46877/collection1/
[junit4:junit4]   2> 2058 T2651 oascc.SolrZkClient.makePath makePath: /collections/control_collection/leaders/shard1
[junit4:junit4]   2> 2061 T2631 oazs.PrepRequestProcessor.pRequest Got user-level KeeperException when processing sessionid:0x13d43367d390003 type:create cxid:0x7d zxid:0x3b txntype:-1 reqpath:n/a Error Path:/solr/overseer Error:KeeperErrorCode = NodeExists for /solr/overseer
[junit4:junit4]   2> 3501 T2649 oascc.ZkStateReader.updateClusterState Updating cloud state from ZooKeeper... 
[junit4:junit4]   2> 3512 T2648 oascc.ZkStateReader$2.process A cluster state change: WatchedEvent state:SyncConnected type:NodeDataChanged path:/clusterstate.json, has occurred - updating... (live nodes size: 1)
[junit4:junit4]   2> 3565 T2651 oasc.ZkController.register We are http://127.0.0.1:46877/collection1/ and leader is http://127.0.0.1:46877/collection1/
[junit4:junit4]   2> 3565 T2651 oasc.ZkController.register No LogReplay needed for core=collection1 baseURL=http://127.0.0.1:46877
[junit4:junit4]   2> 3565 T2651 oasc.ZkController.checkRecovery I am the leader, no recovery necessary
[junit4:junit4]   2> 3565 T2651 oasc.ZkController.publish publishing core=collection1 state=active
[junit4:junit4]   2> 3565 T2651 oasc.ZkController.publish numShards not found on descriptor - reading it from system property
[junit4:junit4]   2> 3567 T2651 oascc.ZkStateReader.updateClusterState Updating cloud state from ZooKeeper... 
[junit4:junit4]   2> 3568 T2626 oass.SolrDispatchFilter.init user.dir=/mnt/ssd/jenkins/workspace/Lucene-Solr-trunk-Linux/solr/build/solr-core/test/J1
[junit4:junit4]   2> 3568 T2626 oass.SolrDispatchFilter.init SolrDispatchFilter.init() done
[junit4:junit4]   2> 3569 T2626 oascsi.HttpClientUtil.createClient Creating new http client, config:maxConnections=128&maxConnectionsPerHost=32&followRedirects=false
[junit4:junit4]   2> 3571 T2626 oascsi.HttpClientUtil.createClient Creating new http client, config:
[junit4:junit4]   2> 3572 T2626 oaz.ZooKeeper.<init> Initiating client connection, connectString=127.0.0.1:56165/solr sessionTimeout=10000 watcher=org.apache.solr.common.cloud.ConnectionManager@22e32197
[junit4:junit4]   2> 3572 T2626 oascc.ConnectionManager.waitForConnected Waiting for client to connect to ZooKeeper
[junit4:junit4]   2> 3573 T2654 oaz.ClientCnxn$SendThread.logStartConnect Opening socket connection to server localhost.localdomain/127.0.0.1:56165. Will not attempt to authenticate using SASL (access denied (javax.security.auth.AuthPermission getLoginConfiguration))
[junit4:junit4]   2> 3573 T2654 oaz.ClientCnxn$SendThread.primeConnection Socket connection established to localhost.localdomain/127.0.0.1:56165, initiating session
[junit4:junit4]   2> 3573 T2628 oazs.NIOServerCnxnFactory.run Accepted socket connection from /127.0.0.1:36358
[junit4:junit4]   2> 3573 T2628 oazs.ZooKeeperServer.processConnectRequest Client attempting to establish new session at /127.0.0.1:36358
[junit4:junit4]   2> 3574 T2630 oazs.ZooKeeperServer.finishSessionInit Established session 0x13d43367d390004 with negotiated timeout 10000 for client /127.0.0.1:36358
[junit4:junit4]   2> 3574 T2654 oaz.ClientCnxn$SendThread.onConnected Session establishment complete on server localhost.localdomain/127.0.0.1:56165, sessionid = 0x13d43367d390004, negotiated timeout = 10000
[junit4:junit4]   2> 3574 T2655 oascc.ConnectionManager.process Watcher org.apache.solr.common.cloud.ConnectionManager@22e32197 name:ZooKeeperConnection Watcher:127.0.0.1:56165/solr got event WatchedEvent state:SyncConnected type:None path:null path:null type:None
[junit4:junit4]   2> 3574 T2626 oascc.ConnectionManager.waitForConnected Client is connected to ZooKeeper
[junit4:junit4]   2> 3576 T2626 oascc.ZkStateReader.createClusterStateWatchersAndUpdate Updating cluster state from ZooKeeper... 
[junit4:junit4]   2> 3577 T2626 oasc.ChaosMonkey.monkeyLog monkey: init - expire sessions:true cause connection loss:true
[junit4:junit4]   2> 3632 T2626 oejs.Server.doStart jetty-8.1.8.v20121106
[junit4:junit4]   2> 3633 T2626 oejs.AbstractConnector.doStart Started SelectChannelConnector@127.0.0.1:53884
[junit4:junit4]   2> 3634 T2626 oass.SolrDispatchFilter.init SolrDispatchFilter.init()
[junit4:junit4]   2> 3634 T2626 oasc.SolrResourceLoader.locateSolrHome JNDI not configured for solr (NoInitialContextEx)
[junit4:junit4]   2> 3634 T2626 oasc.SolrResourceLoader.locateSolrHome using system property solr.solr.home: /mnt/ssd/jenkins/workspace/Lucene-Solr-trunk-Linux/solr/build/solr-core/test/J1/./org.apache.solr.cloud.RecoveryZkTest-jetty1-1362632280875
[junit4:junit4]   2> 3635 T2626 oasc.CoreContainer$Initializer.initialize looking for solr config file: /mnt/ssd/jenkins/workspace/Lucene-Solr-trunk-Linux/solr/build/solr-core/test/J1/./org.apache.solr.cloud.RecoveryZkTest-jetty1-1362632280875/solr.xml
[junit4:junit4]   2> 3635 T2626 oasc.CoreContainer.<init> New CoreContainer 1868652913
[junit4:junit4]   2> 3635 T2626 oasc.CoreContainer.load Loading CoreContainer using Solr Home: '/mnt/ssd/jenkins/workspace/Lucene-Solr-trunk-Linux/solr/build/solr-core/test/J1/./org.apache.solr.cloud.RecoveryZkTest-jetty1-1362632280875/'
[junit4:junit4]   2> 3636 T2626 oasc.SolrResourceLoader.<init> new SolrResourceLoader for directory: '/mnt/ssd/jenkins/workspace/Lucene-Solr-trunk-Linux/solr/build/solr-core/test/J1/./org.apache.solr.cloud.RecoveryZkTest-jetty1-1362632280875/'
[junit4:junit4]   2> 3653 T2626 oashc.HttpShardHandlerFactory.getParameter Setting socketTimeout to: 120000
[junit4:junit4]   2> 3654 T2626 oashc.HttpShardHandlerFactory.getParameter Setting urlScheme to: http://
[junit4:junit4]   2> 3654 T2626 oashc.HttpShardHandlerFactory.getParameter Setting connTimeout to: 15000
[junit4:junit4]   2> 3654 T2626 oashc.HttpShardHandlerFactory.getParameter Setting maxConnectionsPerHost to: 20
[junit4:junit4]   2> 3655 T2626 oashc.HttpShardHandlerFactory.getParameter Setting corePoolSize to: 0
[junit4:junit4]   2> 3655 T2626 oashc.HttpShardHandlerFactory.getParameter Setting maximumPoolSize to: 2147483647
[junit4:junit4]   2> 3655 T2626 oashc.HttpShardHandlerFactory.getParameter Setting maxThreadIdleTime to: 5
[junit4:junit4]   2> 3655 T2626 oashc.HttpShardHandlerFactory.getParameter Setting sizeOfQueue to: -1
[junit4:junit4]   2> 3656 T2626 oashc.HttpShardHandlerFactory.getParameter Setting fairnessPolicy to: false
[junit4:junit4]   2> 3656 T2626 oascsi.HttpClientUtil.createClient Creating new http client, config:maxConnectionsPerHost=20&maxConnections=10000&socketTimeout=120000&connTimeout=15000&retry=false
[junit4:junit4]   2> 3662 T2626 oasc.CoreContainer.load Registering Log Listener
[junit4:junit4]   2> 3679 T2626 oasc.CoreContainer.initZooKeeper Zookeeper client=127.0.0.1:56165/solr
[junit4:junit4]   2> 3680 T2626 oasc.ZkController.checkChrootPath zkHost includes chroot
[junit4:junit4]   2> 3680 T2626 oaz.ZooKeeper.<init> Initiating client connection, connectString=127.0.0.1:56165 sessionTimeout=60000 watcher=org.apache.solr.common.cloud.ConnectionManager@885f2fb
[junit4:junit4]   2> 3681 T2626 oascc.ConnectionManager.waitForConnected Waiting for client to connect to ZooKeeper
[junit4:junit4]   2> 3681 T2665 oaz.ClientCnxn$SendThread.logStartConnect Opening socket connection to server localhost.localdomain/127.0.0.1:56165. Will not attempt to authenticate using SASL (access denied (javax.security.auth.AuthPermission getLoginConfiguration))
[junit4:junit4]   2> 3682 T2665 oaz.ClientCnxn$SendThread.primeConnection Socket connection established to localhost.localdomain/127.0.0.1:56165, initiating session
[junit4:junit4]   2> 3682 T2628 oazs.NIOServerCnxnFactory.run Accepted socket connection from /127.0.0.1:36359
[junit4:junit4]   2> 3682 T2628 oazs.ZooKeeperServer.processConnectRequest Client attempting to establish new session at /127.0.0.1:36359
[junit4:junit4]   2> 3683 T2630 oazs.ZooKeeperServer.finishSessionInit Established session 0x13d43367d390005 with negotiated timeout 20000 for client /127.0.0.1:36359
[junit4:junit4]   2> 3683 T2665 oaz.ClientCnxn$SendThread.onConnected Session establishment complete on server localhost.localdomain/127.0.0.1:56165, sessionid = 0x13d43367d390005, negotiated timeout = 20000
[junit4:junit4]   2> 3683 T2666 oascc.ConnectionManager.process Watcher org.apache.solr.common.cloud.ConnectionManager@885f2fb name:ZooKeeperConnection Watcher:127.0.0.1:56165 got event WatchedEvent state:SyncConnected type:None path:null path:null type:None
[junit4:junit4]   2> 3683 T2626 oascc.ConnectionManager.waitForConnected Client is connected to ZooKeeper
[junit4:junit4]   2> 3684 T2631 oazs.PrepRequestProcessor.pRequest2Txn Processed session termination for sessionid: 0x13d43367d390005
[junit4:junit4]   2> 3685 T2666 oaz.ClientCnxn$EventThread.run EventThread shut down
[junit4:junit4]   2> 3685 T2628 oazs.NIOServerCnxn.closeSock Closed socket connection for client /127.0.0.1:36359 which had sessionid 0x13d43367d390005
[junit4:junit4]   2> 3685 T2626 oaz.ZooKeeper.close Session: 0x13d43367d390005 closed
[junit4:junit4]   2> 3686 T2626 oascsi.HttpClientUtil.createClient Creating new http client, config:maxConnections=500&maxConnectionsPerHost=16&socketTimeout=120000&connTimeout=15000
[junit4:junit4]   2> 3688 T2626 oaz.ZooKeeper.<init> Initiating client connection, connectString=127.0.0.1:56165/solr sessionTimeout=30000 watcher=org.apache.solr.common.cloud.ConnectionManager@4e9aa70a
[junit4:junit4]   2> 3689 T2667 oaz.ClientCnxn$SendThread.logStartConnect Opening socket connection to server localhost.localdomain/127.0.0.1:56165. Will not attempt to authenticate using SASL (access denied (javax.security.auth.AuthPermission getLoginConfiguration))
[junit4:junit4]   2> 3689 T2626 oascc.ConnectionManager.waitForConnected Waiting for client to connect to ZooKeeper
[junit4:junit4]   2> 3690 T2667 oaz.ClientCnxn$SendThread.primeConnection Socket connection established to localhost.localdomain/127.0.0.1:56165, initiating session
[junit4:junit4]   2> 3690 T2628 oazs.NIOServerCnxnFactory.run Accepted socket connection from /127.0.0.1:36360
[junit4:junit4]   2> 3690 T2628 oazs.ZooKeeperServer.processConnectRequest Client attempting to establish new session at /127.0.0.1:36360
[junit4:junit4]   2> 3691 T2630 oazs.ZooKeeperServer.finishSessionInit Established session 0x13d43367d390006 with negotiated timeout 20000 for client /127.0.0.1:36360
[junit4:junit4]   2> 3691 T2667 oaz.ClientCnxn$SendThread.onConnected Session establishment complete on server localhost.localdomain/127.0.0.1:56165, sessionid = 0x13d43367d390006, negotiated timeout = 20000
[junit4:junit4]   2> 3691 T2668 oascc.ConnectionManager.process Watcher org.apache.solr.common.cloud.ConnectionManager@4e9aa70a name:ZooKeeperConnection Watcher:127.0.0.1:56165/solr got event WatchedEvent state:SyncConnected type:None path:null path:null type:None
[junit4:junit4]   2> 3691 T2626 oascc.ConnectionManager.waitForConnected Client is connected to ZooKeeper
[junit4:junit4]   2> 3692 T2631 oazs.PrepRequestProcessor.pRequest Got user-level KeeperException when processing sessionid:0x13d43367d390006 type:create cxid:0x1 zxid:0x49 txntype:-1 reqpath:n/a Error Path:/solr/overseer Error:KeeperErrorCode = NodeExists for /solr/overseer
[junit4:junit4]   2> 3693 T2631 oazs.PrepRequestProcessor.pRequest Got user-level KeeperException when processing sessionid:0x13d43367d390006 type:create cxid:0x2 zxid:0x4a txntype:-1 reqpath:n/a Error Path:/solr/overseer Error:KeeperErrorCode = NodeExists for /solr/overseer
[junit4:junit4]   2> 3695 T2626 oascc.ZkStateReader.createClusterStateWatchersAndUpdate Updating cluster state from ZooKeeper... 
[junit4:junit4]   2> 4698 T2626 oasc.ZkController.createEphemeralLiveNode Register node as live in ZooKeeper:/live_nodes/127.0.0.1:53884_
[junit4:junit4]   2> 4698 T2631 oazs.PrepRequestProcessor.pRequest Got user-level KeeperException when processing sessionid:0x13d43367d390006 type:delete cxid:0x9 zxid:0x4b txntype:-1 reqpath:n/a Error Path:/solr/live_nodes/127.0.0.1:53884_ Error:KeeperErrorCode = NoNode for /solr/live_nodes/127.0.0.1:53884_
[junit4:junit4]   2> 4699 T2626 oascc.SolrZkClient.makePath makePath: /live_nodes/127.0.0.1:53884_
[junit4:junit4]   2> 4701 T2648 oascc.ZkStateReader$2.process A cluster state change: WatchedEvent state:SyncConnected type:NodeChildrenChanged path:/live_nodes, has occurred - updating... (live nodes size: 1)
[junit4:junit4]   2> 4702 T2655 oascc.ZkStateReader$3.process Updating live nodes... (2)
[junit4:junit4]   2> 4702 T2668 oascc.ZkStateReader$3.process Updating live nodes... (2)
[junit4:junit4]   2> 4703 T2648 oascc.ZkStateReader$3.process Updating live nodes... (2)
[junit4:junit4]   2> 4707 T2669 oasc.CoreContainer.create Creating SolrCore 'collection1' using instanceDir: /mnt/ssd/jenkins/workspace/Lucene-Solr-trunk-Linux/solr/build/solr-core/test/J1/./org.apache.solr.cloud.RecoveryZkTest-jetty1-1362632280875/collection1
[junit4:junit4]   2> 4707 T2669 oasc.ZkController.createCollectionZkNode Check for collection zkNode:collection1
[junit4:junit4]   2> 4708 T2669 oasc.ZkController.createCollectionZkNode Collection zkNode exists
[junit4:junit4]   2> 4708 T2669 oasc.ZkController.readConfigName Load collection config from:/collections/collection1
[junit4:junit4]   2> 4709 T2669 oasc.SolrResourceLoader.<init> new SolrResourceLoader for directory: '/mnt/ssd/jenkins/workspace/Lucene-Solr-trunk-Linux/solr/build/solr-core/test/J1/./org.apache.solr.cloud.RecoveryZkTest-jetty1-1362632280875/collection1/'
[junit4:junit4]   2> 4709 T2669 oasc.SolrResourceLoader.replaceClassLoader Adding 'file:/mnt/ssd/jenkins/workspace/Lucene-Solr-trunk-Linux/solr/build/solr-core/test/J1/org.apache.solr.cloud.RecoveryZkTest-jetty1-1362632280875/collection1/lib/README' to classloader
[junit4:junit4]   2> 4710 T2669 oasc.SolrResourceLoader.replaceClassLoader Adding 'file:/mnt/ssd/jenkins/workspace/Lucene-Solr-trunk-Linux/solr/build/solr-core/test/J1/org.apache.solr.cloud.RecoveryZkTest-jetty1-1362632280875/collection1/lib/classes/' to classloader
[junit4:junit4]   2> 4746 T2669 oasc.SolrConfig.<init> Using Lucene MatchVersion: LUCENE_50
[junit4:junit4]   2> 4782 T2669 oasc.SolrConfig.<init> Loaded SolrConfig: solrconfig.xml
[junit4:junit4]   2> 4783 T2669 oass.IndexSchema.readSchema Reading Solr Schema
[junit4:junit4]   2> 4787 T2669 oass.IndexSchema.readSchema Schema name=test
[junit4:junit4]   2> 5016 T2649 oascc.ZkStateReader.updateClusterState Updating cloud state from ZooKeeper... 
[junit4:junit4]   2> 5017 T2649 oasc.Overseer$ClusterStateUpdater.updateState Update state numShards=1 message={
[junit4:junit4]   2> 	  "operation":"state",
[junit4:junit4]   2> 	  "core_node_name":"1",
[junit4:junit4]   2> 	  "numShards":"1",
[junit4:junit4]   2> 	  "shard":"shard1",
[junit4:junit4]   2> 	  "roles":null,
[junit4:junit4]   2> 	  "state":"active",
[junit4:junit4]   2> 	  "core":"collection1",
[junit4:junit4]   2> 	  "collection":"control_collection",
[junit4:junit4]   2> 	  "node_name":"127.0.0.1:46877_",
[junit4:junit4]   2> 	  "base_url":"http://127.0.0.1:46877"}
[junit4:junit4]   2> 5020 T2655 oascc.ZkStateReader$2.process A cluster state change: WatchedEvent state:SyncConnected type:NodeDataChanged path:/clusterstate.json, has occurred - updating... (live nodes size: 2)
[junit4:junit4]   2> 5020 T2668 oascc.ZkStateReader$2.process A cluster state change: WatchedEvent state:SyncConnected type:NodeDataChanged path:/clusterstate.json, has occurred - updating... (live nodes size: 2)
[junit4:junit4]   2> 5020 T2648 oascc.ZkStateReader$2.process A cluster state change: WatchedEvent state:SyncConnected type:NodeDataChanged path:/clusterstate.json, has occurred - updating... (live nodes size: 2)
[junit4:junit4]   2> 5211 T2669 oass.OpenExchangeRatesOrgProvider.init Initialized with rates=open-exchange-rates.json, refreshInterval=1440.
[junit4:junit4]   2> 5216 T2669 oass.IndexSchema.readSchema default search field in schema is text
[junit4:junit4]   2> 5219 T2669 oass.IndexSchema.readSchema unique key field: id
[junit4:junit4]   2> 5228 T2669 oass.FileExchangeRateProvider.reload Reloading exchange rates from file currency.xml
[junit4:junit4]   2> 5231 T2669 oass.FileExchangeRateProvider.reload Reloading exchange rates from file currency.xml
[junit4:junit4]   2> 5234 T2669 oass.OpenExchangeRatesOrgProvider.reload Reloading exchange rates from open-exchange-rates.json
[junit4:junit4]   2> 5235 T2669 oass.OpenExchangeRatesOrgProvider$OpenExchangeRates.<init> WARNING Unknown key IMPORTANT NOTE
[junit4:junit4]   2> 5236 T2669 oass.OpenExchangeRatesOrgProvider$OpenExchangeRates.<init> WARNING Expected key, got STRING
[junit4:junit4]   2> 5236 T2669 oass.OpenExchangeRatesOrgProvider.reload Reloading exchange rates from open-exchange-rates.json
[junit4:junit4]   2> 5237 T2669 oass.OpenExchangeRatesOrgProvider$OpenExchangeRates.<init> WARNING Unknown key IMPORTANT NOTE
[junit4:junit4]   2> 5237 T2669 oass.OpenExchangeRatesOrgProvider$OpenExchangeRates.<init> WARNING Expected key, got STRING
[junit4:junit4]   2> 5237 T2669 oasc.SolrCore.<init> [collection1] Opening new SolrCore at /mnt/ssd/jenkins/workspace/Lucene-Solr-trunk-Linux/solr/build/solr-core/test/J1/./org.apache.solr.cloud.RecoveryZkTest-jetty1-1362632280875/collection1/, dataDir=./org.apache.solr.cloud.RecoveryZkTest-1362632277302/jetty1/
[junit4:junit4]   2> 5238 T2669 oasc.JmxMonitoredMap.<init> JMX monitoring is enabled. Adding Solr mbeans to JMX Server: com.sun.jmx.mbeanserver.JmxMBeanServer@4fef3a22
[junit4:junit4]   2> 5238 T2669 oasc.SolrCore.initDirectoryFactory org.apache.solr.core.MockDirectoryFactory
[junit4:junit4]   2> 5239 T2669 oasc.CachingDirectoryFactory.get return new directory for /mnt/ssd/jenkins/workspace/Lucene-Solr-trunk-Linux/solr/build/solr-core/test/J1/./org.apache.solr.cloud.RecoveryZkTest-1362632277302/jetty1 forceNew: false
[junit4:junit4]   2> 5239 T2669 oasc.SolrCore.getNewIndexDir New index directory detected: old=null new=./org.apache.solr.cloud.RecoveryZkTest-1362632277302/jetty1/index/
[junit4:junit4]   2> 5239 T2669 oasc.SolrCore.initIndex WARNING [collection1] Solr index directory './org.apache.solr.cloud.RecoveryZkTest-1362632277302/jetty1/index' doesn't exist. Creating new index...
[junit4:junit4]   2> 5240 T2669 oasc.CachingDirectoryFactory.get return new directory for /mnt/ssd/jenkins/workspace/Lucene-Solr-trunk-Linux/solr/build/solr-core/test/J1/./org.apache.solr.cloud.RecoveryZkTest-1362632277302/jetty1/index forceNew: false
[junit4:junit4]   2> 5241 T2669 oasc.SolrDeletionPolicy.onCommit SolrDeletionPolicy.onCommit: commits:num=1
[junit4:junit4]   2> 		commit{dir=MockDirWrapper(org.apache.lucene.store.RAMDirectory@6408e5ae lockFactory=org.apache.lucene.store.NativeFSLockFactory@1d062e74),segFN=segments_1,generation=1,filenames=[segments_1]
[junit4:junit4]   2> 5241 T2669 oasc.SolrDeletionPolicy.updateCommits newest commit = 1[segments_1]
[junit4:junit4]   2> 5243 T2669 oasup.UpdateRequestProcessorChain.init inserting DistributedUpdateProcessorFactory into updateRequestProcessorChain "dedupe"
[junit4:junit4]   2> 5243 T2669 oasup.UpdateRequestProcessorChain.init inserting DistributedUpdateProcessorFactory into updateRequestProcessorChain "stored_sig"
[junit4:junit4]   2> 5243 T2669 oasup.UpdateRequestProcessorChain.init inserting DistributedUpdateProcessorFactory into updateRequestProcessorChain "distrib-dup-test-chain-implicit"
[junit4:junit4]   2> 5244 T2669 oasc.RequestHandlers.initHandlersFromConfig created standard: solr.StandardRequestHandler
[junit4:junit4]   2> 5244 T2669 oasc.RequestHandlers.initHandlersFromConfig created /get: solr.RealTimeGetHandler
[junit4:junit4]   2> 5244 T2669 oasc.RequestHandlers.initHandlersFromConfig adding lazy requestHandler: solr.ReplicationHandler
[junit4:junit4]   2> 5244 T2669 oasc.RequestHandlers.initHandlersFromConfig created /replication: solr.ReplicationHandler
[junit4:junit4]   2> 5245 T2669 oasc.RequestHandlers.initHandlersFromConfig created /update: solr.UpdateRequestHandler
[junit4:junit4]   2> 5245 T2669 oasc.RequestHandlers.initHandlersFromConfig created /admin/: org.apache.solr.handler.admin.AdminHandlers
[junit4:junit4]   2> 5247 T2669 oashl.XMLLoader.init xsltCacheLifetimeSeconds=60
[junit4:junit4]   2> 5249 T2669 oass.SolrIndexSearcher.<init> Opening Searcher@26c3c5e6 main
[junit4:junit4]   2> 5249 T2669 oasu.UpdateHandler.clearLog Clearing tlog files, tlogDir=./org.apache.solr.cloud.RecoveryZkTest-1362632277302/jetty1/tlog
[junit4:junit4]   2> 5250 T2669 oasu.CommitTracker.<init> Hard AutoCommit: disabled
[junit4:junit4]   2> 5250 T2669 oasu.CommitTracker.<init> Soft AutoCommit: disabled
[junit4:junit4]   2> 5253 T2670 oasc.SolrCore.registerSearcher [collection1] Registered new searcher Searcher@26c3c5e6 main{StandardDirectoryReader(segments_1:1)}
[junit4:junit4]   2> 5254 T2669 oasc.ZkController.publish publishing core=collection1 state=down
[junit4:junit4]   2> 5254 T2669 oasc.ZkController.publish numShards not found on descriptor - reading it from system property
[junit4:junit4]   2> 6524 T2649 oascc.ZkStateReader.updateClusterState Updating cloud state from ZooKeeper... 
[junit4:junit4]   2> 6526 T2649 oasc.Overseer$ClusterStateUpdater.updateState Update state numShards=1 message={
[junit4:junit4]   2> 	  "operation":"state",
[junit4:junit4]   2> 	  "core_node_name":"2",
[junit4:junit4]   2> 	  "numShards":"1",
[junit4:junit4]   2> 	  "shard":null,
[junit4:junit4]   2> 	  "roles":null,
[junit4:junit4]   2> 	  "state":"down",
[junit4:junit4]   2> 	  "core":"collection1",
[junit4:junit4]   2> 	  "collection":"collection1",
[junit4:junit4]   2> 	  "node_name":"127.0.0.1:53884_",
[junit4:junit4]   2> 	  "base_url":"http://127.0.0.1:53884"}
[junit4:junit4]   2> 6526 T2649 oasc.Overseer$ClusterStateUpdater.createCollection Create collection collection1 with numShards 1
[junit4:junit4]   2> 6526 T2649 oasc.Overseer$ClusterStateUpdater.updateState Assigning new node to shard shard=shard1
[junit4:junit4]   2> 6533 T2648 oascc.ZkStateReader$2.process A cluster state change: WatchedEvent state:SyncConnected type:NodeDataChanged path:/clusterstate.json, has occurred - updating... (live nodes size: 2)
[junit4:junit4]   2> 6533 T2668 oascc.ZkStateReader$2.process A cluster state change: WatchedEvent state:SyncConnected type:NodeDataChanged path:/clusterstate.json, has occurred - updating... (live nodes size: 2)
[junit4:junit4]   2> 6533 T2655 oascc.ZkStateReader$2.process A cluster state change: WatchedEvent state:SyncConnected type:NodeDataChanged path:/clusterstate.json, has occurred - updating... (live nodes size: 2)
[junit4:junit4]   2> 7256 T2669 oasc.CoreContainer.registerCore registering core: collection1
[junit4:junit4]   2> 7256 T2669 oasc.ZkController.register Register replica - core:collection1 address:http://127.0.0.1:53884 collection:collection1 shard:shard1
[junit4:junit4]   2> 7257 T2669 oascc.SolrZkClient.makePath makePath: /collections/collection1/leader_elect/shard1/election
[junit4:junit4]   2> 7263 T2631 oazs.PrepRequestProcessor.pRequest Got user-level KeeperException when processing sessionid:0x13d43367d390006 type:delete cxid:0x46 zxid:0x5b txntype:-1 reqpath:n/a Error Path:/solr/collections/collection1/leaders Error:KeeperErrorCode = NoNode for /solr/collections/collection1/leaders
[junit4:junit4]   2> 7264 T2669 oasc.ShardLeaderElectionContext.runLeaderProcess Running the leader process.
[junit4:junit4]   2> 7264 T2631 oazs.PrepRequestProcessor.pRequest Got user-level KeeperException when processing sessionid:0x13d43367d390006 type:create cxid:0x47 zxid:0x5c txntype:-1 reqpath:n/a Error Path:/solr/overseer Error:KeeperErrorCode = NodeExists for /solr/overseer
[junit4:junit4]   2> 7266 T2669 oasc.ShardLeaderElectionContext.waitForReplicasToComeUp Enough replicas found to continue.
[junit4:junit4]   2> 7266 T2669 oasc.ShardLeaderElectionContext.runLeaderProcess I may be the new leader - try and sync
[junit4:junit4]   2> 7266 T2669 oasc.SyncStrategy.sync Sync replicas to http://127.0.0.1:53884/collection1/
[junit4:junit4]   2> 7266 T2669 oasc.SyncStrategy.syncReplicas Sync Success - now sync replicas to me
[junit4:junit4]   2> 7266 T2669 oasc.SyncStrategy.syncToMe http://127.0.0.1:53884/collection1/ has no replicas
[junit4:junit4]   2> 7267 T2669 oasc.ShardLeaderElectionContext.runLeaderProcess I am the new leader: http://127.0.0.1:53884/collection1/
[junit4:junit4]   2> 7267 T2669 oascc.SolrZkClient.makePath makePath: /collections/collection1/leaders/shard1
[junit4:junit4]   2> 7270 T2631 oazs.PrepRequestProcessor.pRequest Got user-level KeeperException when processing sessionid:0x13d43367d390006 type:create cxid:0x51 zxid:0x60 txntype:-1 reqpath:n/a Error Path:/solr/overseer Error:KeeperErrorCode = NodeExists for /solr/overseer
[junit4:junit4]   2> 8037 T2649 oascc.ZkStateReader.updateClusterState Updating cloud state from ZooKeeper... 
[junit4:junit4]   2> 8043 T2668 oascc.ZkStateReader$2.process A cluster state change: WatchedEvent state:SyncConnected type:NodeDataChanged path:/clusterstate.json, has occurred - updating... (live nodes size: 2)
[junit4:junit4]   2> 8043 T2648 oascc.ZkStateReader$2.process A cluster state change: WatchedEvent state:SyncConnected type:NodeDataChanged path:/clusterstate.json, has occurred - updating... (live nodes size: 2)
[junit4:junit4]   2> 8043 T2655 oascc.ZkStateReader$2.process A cluster state change: WatchedEvent state:SyncConnected type:NodeDataChanged path:/clusterstate.json, has occurred - updating... (live nodes size: 2)
[junit4:junit4]   2> 8074 T2669 oasc.ZkController.register We are http://127.0.0.1:53884/collection1/ and leader is http://127.0.0.1:53884/collection1/
[junit4:junit4]   2> 8074 T2669 oasc.ZkController.register No LogReplay needed for core=collection1 baseURL=http://127.0.0.1:53884
[junit4:junit4]   2> 8074 T2669 oasc.ZkController.checkRecovery I am the leader, no recovery necessary
[junit4:junit4]   2> 8074 T2669 oasc.ZkController.publish publishing core=collection1 state=active
[junit4:junit4]   2> 8074 T2669 oasc.ZkController.publish numShards not found on descriptor - reading it from system property
[junit4:junit4]   2> 8076 T2669 oascc.ZkStateReader.updateClusterState Updating cloud state from ZooKeeper... 
[junit4:junit4]   2> 8077 T2626 oass.SolrDispatchFilter.init user.dir=/mnt/ssd/jenkins/workspace/Lucene-Solr-trunk-Linux/solr/build/solr-core/test/J1
[junit4:junit4]   2> 8078 T2626 oass.SolrDispatchFilter.init SolrDispatchFilter.init() done
[junit4:junit4]   2> 8078 T2626 oascsi.HttpClientUtil.createClient Creating new http client, config:maxConnections=128&maxConnectionsPerHost=32&followRedirects=false
[junit4:junit4]   2> 8145 T2626 oejs.Server.doStart jetty-8.1.8.v20121106
[junit4:junit4]   2> 8147 T2626 oejs.AbstractConnector.doStart Started SelectChannelConnector@127.0.0.1:41872
[junit4:junit4]   2> 8148 T2626 oass.SolrDispatchFilter.init SolrDispatchFilter.init()
[junit4:junit4]   2> 8148 T2626 oasc.SolrResourceLoader.locateSolrHome JNDI not configured for solr (NoInitialContextEx)
[junit4:junit4]   2> 8148 T2626 oasc.SolrResourceLoader.locateSolrHome using system property solr.solr.home: /mnt/ssd/jenkins/workspace/Lucene-Solr-trunk-Linux/solr/build/solr-core/test/J1/./org.apache.solr.cloud.RecoveryZkTest-jetty2-1362632285379
[junit4:junit4]   2> 8149 T2626 oasc.CoreContainer$Initializer.initialize looking for solr config file: /mnt/ssd/jenkins/workspace/Lucene-Solr-trunk-Linux/solr/build/solr-core/test/J1/./org.apache.solr.cloud.RecoveryZkTest-jetty2-1362632285379/solr.xml
[junit4:junit4]   2> 8149 T2626 oasc.CoreContainer.<init> New CoreContainer 703082569
[junit4:junit4]   2> 8149 T2626 oasc.CoreContainer.load Loading CoreContainer using Solr Home: '/mnt/ssd/jenkins/workspace/Lucene-Solr-trunk-Linux/solr/build/solr-core/test/J1/./org.apache.solr.cloud.RecoveryZkTest-jetty2-1362632285379/'
[junit4:junit4]   2> 8150 T2626 oasc.SolrResourceLoader.<init> new SolrResourceLoader for directory: '/mnt/ssd/jenkins/workspace/Lucene-Solr-trunk-Linux/solr/build/solr-core/test/J1/./org.apache.solr.cloud.RecoveryZkTest-jetty2-1362632285379/'
[junit4:junit4]   2> 8167 T2626 oashc.HttpShardHandlerFactory.getParameter Setting socketTimeout to: 120000
[junit4:junit4]   2> 8167 T2626 oashc.HttpShardHandlerFactory.getParameter Setting urlScheme to: http://
[junit4:junit4]   2> 8168 T2626 oashc.HttpShardHandlerFactory.getParameter Setting connTimeout to: 15000
[junit4:junit4]   2> 8168 T2626 oashc.HttpShardHandlerFactory.getParameter Setting maxConnectionsPerHost to: 20
[junit4:junit4]   2> 8168 T2626 oashc.HttpShardHandlerFactory.getParameter Setting corePoolSize to: 0
[junit4:junit4]   2> 8169 T2626 oashc.HttpShardHandlerFactory.getParameter Setting maximumPoolSize to: 2147483647
[junit4:junit4]   2> 8169 T2626 oashc.HttpShardHandlerFactory.getParameter Setting maxThreadIdleTime to: 5
[junit4:junit4]   2> 8169 T2626 oashc.HttpShardHandlerFactory.getParameter Setting sizeOfQueue to: -1
[junit4:junit4]   2> 8170 T2626 oashc.HttpShardHandlerFactory.getParameter Setting fairnessPolicy to: false
[junit4:junit4]   2> 8170 T2626 oascsi.HttpClientUtil.createClient Creating new http client, config:maxConnectionsPerHost=20&maxConnections=10000&socketTimeout=120000&connTimeout=15000&retry=false
[junit4:junit4]   2> 8176 T2626 oasc.CoreContainer.load Registering Log Listener
[junit4:junit4]   2> 8186 T2626 oasc.CoreContainer.initZooKeeper Zookeeper client=127.0.0.1:56165/solr
[junit4:junit4]   2> 8186 T2626 oasc.ZkController.checkChrootPath zkHost includes chroot
[junit4:junit4]   2> 8187 T2626 oaz.ZooKeeper.<init> Initiating client connection, connectString=127.0.0.1:56165 sessionTimeout=60000 watcher=org.apache.solr.common.cloud.ConnectionManager@10f283f
[junit4:junit4]   2> 8188 T2626 oascc.ConnectionManager.waitForConnected Waiting for client to connect to ZooKeeper
[junit4:junit4]   2> 8188 T2681 oaz.ClientCnxn$SendThread.logStartConnect Opening socket connection to server localhost.localdomain/127.0.0.1:56165. Will not attempt to authenticate using SASL (access denied (javax.security.auth.AuthPermission getLoginConfiguration))
[junit4:junit4]   2> 8189 T2681 oaz.ClientCnxn$SendThread.primeConnection Socket connection established to localhost.localdomain/127.0.0.1:56165, initiating session
[junit4:junit4]   2> 8189 T2628 oazs.NIOServerCnxnFactory.run Accepted socket connection from /127.0.0.1:36365
[junit4:junit4]   2> 8189 T2628 oazs.ZooKeeperServer.processConnectRequest Client attempting to establish new session at /127.0.0.1:36365
[junit4:junit4]   2> 8190 T2630 oazs.ZooKeeperServer.finishSessionInit Established session 0x13d43367d390007 with negotiated timeout 20000 for client /127.0.0.1:36365
[junit4:junit4]   2> 8190 T2681 oaz.ClientCnxn$SendThread.onConnected Session establishment complete on server localhost.localdomain/127.0.0.1:56165, sessionid = 0x13d43367d390007, negotiated timeout = 20000
[junit4:junit4]   2> 8190 T2682 oascc.ConnectionManager.process Watcher org.apache.solr.common.cloud.ConnectionManager@10f283f name:ZooKeeperConnection Watcher:127.0.0.1:56165 got event WatchedEvent state:SyncConnected type:None path:null path:null type:None
[junit4:junit4]   2> 8190 T2626 oascc.ConnectionManager.waitForConnected Client is connected to ZooKeeper
[junit4:junit4]   2> 8192 T2631 oazs.PrepRequestProcessor.pRequest2Txn Processed session termination for sessionid: 0x13d43367d390007
[junit4:junit4]   2> 8192 T2682 oaz.ClientCnxn$EventThread.run EventThread shut down
[junit4:junit4]   2> 8192 T2628 oazs.NIOServerCnxn.closeSock Closed socket connection for client /127.0.0.1:36365 which had sessionid 0x13d43367d390007
[junit4:junit4]   2> 8192 T2626 oaz.ZooKeeper.close Session: 0x13d43367d390007 closed
[junit4:junit4]   2> 8193 T2626 oascsi.HttpClientUtil.createClient Creating new http client, config:maxConnections=500&maxConnectionsPerHost=16&socketTimeout=120000&connTimeout=15000
[junit4:junit4]   2> 8197 T2626 oaz.ZooKeeper.<init> Initiating client connection, connectString=127.0.0.1:56165/solr sessionTimeout=30000 watcher=org.apache.solr.common.cloud.ConnectionManager@5ae2c2f2
[junit4:junit4]   2> 8198 T2683 oaz.ClientCnxn$SendThread.logStartConnect Opening socket connection to server localhost.localdomain/127.0.0.1:56165. Will not attempt to authenticate using SASL (access denied (javax.security.auth.AuthPermission getLoginConfiguration))
[junit4:junit4]   2> 8198 T2626 oascc.ConnectionManager.waitForConnected Waiting for client to connect to ZooKeeper
[junit4:junit4]   2> 8198 T2683 oaz.ClientCnxn$SendThread.primeConnection Socket connection established to localhost.localdomain/127.0.0.1:56165, initiating session
[junit4:junit4]   2> 8199 T2628 oazs.NIOServerCnxnFactory.run Accepted socket connection from /127.0.0.1:36366
[junit4:junit4]   2> 8199 T2628 oazs.ZooKeeperServer.processConnectRequest Client attempting to establish new session at /127.0.0.1:36366
[junit4:junit4]   2> 8200 T2630 oazs.ZooKeeperServer.finishSessionInit Established session 0x13d43367d390008 with negotiated timeout 20000 for client /127.0.0.1:36366
[junit4:junit4]   2> 8200 T2683 oaz.ClientCnxn$SendThread.onConnected Session establishment complete on server localhost.localdomain/127.0.0.1:56165, sessionid = 0x13d43367d390008, negotiated timeout = 20000
[junit4:junit4]   2> 8200 T2684 oascc.ConnectionManager.process Watcher org.apache.solr.common.cloud.ConnectionManager@5ae2c2f2 name:ZooKeeperConnection Watcher:127.0.0.1:56165/solr got event WatchedEvent state:SyncConnected type:None path:null path:null type:None
[junit4:junit4]   2> 8200 T2626 oascc.ConnectionManager.waitForConnected Client is connected to ZooKeeper
[junit4:junit4]   2> 8209 T2631 oazs.PrepRequestProcessor.pRequest Got user-level KeeperException when processing sessionid:0x13d43367d390008 type:create cxid:0x1 zxid:0x6d txntype:-1 reqpath:n/a Error Path:/solr/overseer Error:KeeperErrorCode = NodeExists for /solr/overseer
[junit4:junit4]   2> 8210 T2631 oazs.PrepRequestProcessor.pRequest Got user-level KeeperException when processing sessionid:0x13d43367d390008 type:create cxid:0x2 zxid:0x6e txntype:-1 reqpath:n/a Error Path:/solr/overseer Error:KeeperErrorCode = NodeExists for /solr/overseer
[junit4:junit4]   2> 8212 T2626 oascc.ZkStateReader.createClusterStateWatchersAndUpdate Updating cluster state from ZooKeeper... 
[junit4:junit4]   2> 9214 T2626 oasc.ZkController.createEphemeralLiveNode Register node as live in ZooKeeper:/live_nodes/127.0.0.1:41872_
[junit4:junit4]   2> 9215 T2631 oazs.PrepRequestProcessor.pRequest Got user-level KeeperException when processing sessionid:0x13d43367d390008 type:delete cxid:0x9 zxid:0x6f txntype:-1 reqpath:n/a Error Path:/solr/live_nodes/127.0.0.1:41872_ Error:KeeperErrorCode = NoNode for /solr/live_nodes/127.0.0.1:41872_
[junit4:junit4]   2> 9215 T2626 oascc.SolrZkClient.makePath makePath: /live_nodes/127.0.0.1:41872_
[junit4:junit4]   2> 9218 T2668 oascc.ZkStateReader$2.process A cluster state change: WatchedEvent state:SyncConnected type:NodeChildrenChanged path:/live_nodes, has occurred - updating... (live nodes size: 2)
[junit4:junit4]   2> 9218 T2648 oascc.ZkStateReader$2.process A cluster state change: WatchedEvent state:SyncConnected type:NodeChildrenChanged path:/live_nodes, has occurred - updating... (live nodes size: 2)
[junit4:junit4]   2> 9220 T2655 oascc.ZkStateReader$3.process Updating live nodes... (3)
[junit4:junit4]   2> 9220 T2655 oascc.ZkStateReader$2.process A cluster state change: WatchedEvent state:SyncConnected type:NodeChildrenChanged path:/live_nodes, has occurred - updating... (live nodes size: 3)
[junit4:junit4]   2> 9220 T2684 oascc.ZkStateReader$3.process Updating live nodes... (3)
[junit4:junit4]   2> 9221 T2648 oascc.ZkStateReader$3.process Updating live nodes... (3)
[junit4:junit4]   2> 9221 T2668 oascc.ZkStateReader$3.process Updating live nodes... (3)
[junit4:junit4]   2> 9226 T2685 oasc.CoreContainer.create Creating SolrCore 'collection1' using instanceDir: /mnt/ssd/jenkins/workspace/Lucene-Solr-trunk-Linux/solr/build/solr-core/test/J1/./org.apache.solr.cloud.RecoveryZkTest-jetty2-1362632285379/collection1
[junit4:junit4]   2> 9226 T2685 oasc.ZkController.createCollectionZkNode Check for collection zkNode:collection1
[junit4:junit4]   2> 9227 T2685 oasc.ZkController.createCollectionZkNode Collection zkNode exists
[junit4:junit4]   2> 9227 T2685 oasc.ZkController.readConfigName Load collection config from:/collections/collection1
[junit4:junit4]   2> 9229 T2685 oasc.SolrResourceLoader.<init> new SolrResourceLoader for directory: '/mnt/ssd/jenkins/workspace/Lucene-Solr-trunk-Linux/solr/build/solr-core/test/J1/./org.apache.solr.cloud.RecoveryZkTest-jetty2-1362632285379/collection1/'
[junit4:junit4]   2> 9229 T2685 oasc.SolrResourceLoader.replaceClassLoader Adding 'file:/mnt/ssd/jenkins/workspace/Lucene-Solr-trunk-Linux/solr/build/solr-core/test/J1/org.apache.solr.cloud.RecoveryZkTest-jetty2-1362632285379/collection1/lib/README' to classloader
[junit4:junit4]   2> 9229 T2685 oasc.SolrResourceLoader.replaceClassLoader Adding 'file:/mnt/ssd/jenkins/workspace/Lucene-Solr-trunk-Linux/solr/build/solr-core/test/J1/org.apache.solr.cloud.RecoveryZkTest-jetty2-1362632285379/collection1/lib/classes/' to classloader
[junit4:junit4]   2> 9255 T2685 oasc.SolrConfig.<init> Using Lucene MatchVersion: LUCENE_50
[junit4:junit4]   2> 9302 T2685 oasc.SolrConfig.<init> Loaded SolrConfig: solrconfig.xml
[junit4:junit4]   2> 9303 T2685 oass.IndexSchema.readSchema Reading Solr Schema
[junit4:junit4]   2> 9306 T2685 oass.IndexSchema.readSchema Schema name=test
[junit4:junit4]   2> 9555 T2649 oascc.ZkStateReader.updateClusterState Updating cloud state from ZooKeeper... 
[junit4:junit4]   2> 9556 T2649 oasc.Overseer$ClusterStateUpdater.updateState Update state numShards=1 message={
[junit4:junit4]   2> 	  "operation":"state",
[junit4:junit4]   2> 	  "core_node_name":"2",
[junit4:junit4]   2> 	  "numShards":"1",
[junit4:junit4]   2> 	  "shard":"shard1",
[junit4:junit4]   2> 	  "roles":null,
[junit4:junit4]   2> 	  "state":"active",
[junit4:junit4]   2> 	  "core":"collection1",
[junit4:junit4]   2> 	  "collection":"collection1",
[junit4:junit4]   2> 	  "node_name":"127.0.0.1:53884_",
[junit4:junit4]   2> 	  "base_url":"http://127.0.0.1:53884"}
[junit4:junit4]   2> 9559 T2668 oascc.ZkStateReader$2.process A cluster state change: WatchedEvent state:SyncConnected type:NodeDataChanged path:/clusterstate.json, has occurred - updating... (live nodes size: 3)
[junit4:junit4]   2> 9559 T2655 oascc.ZkStateReader$2.process A cluster state change: WatchedEvent state:SyncConnected type:NodeDataChanged path:/clusterstate.json, has occurred - updating... (live nodes size: 3)
[junit4:junit4]   2> 9559 T2684 oascc.ZkStateReader$2.process A cluster state change: WatchedEvent state:SyncConnected type:NodeDataChanged path:/clusterstate.json, has occurred - updating... (live nodes size: 3)
[junit4:junit4]   2> 9559 T2648 oascc.ZkStateReader$2.process A cluster state change: WatchedEvent state:SyncConnected type:NodeDataChanged path:/clusterstate.json, has occurred - updating... (live nodes size: 3)
[junit4:junit4]   2> 9740 T2685 oass.OpenExchangeRatesOrgProvider.init Initialized with rates=open-exchange-rates.json, refreshInterval=1440.
[junit4:junit4]   2> 9745 T2685 oass.IndexSchema.readSchema default search field in schema is text
[junit4:junit4]   2> 9748 T2685 oass.IndexSchema.readSchema unique key field: id
[junit4:junit4]   2> 9775 T2685 oass.FileExchangeRateProvider.reload Reloading exchange rates from file currency.xml
[junit4:junit4]   2> 9778 T2685 oass.FileExchangeRateProvider.reload Reloading exchange rates from file currency.xml
[junit4:junit4]   2> 9780 T2685 oass.OpenExchangeRatesOrgProvider.reload Reloading exchange rates from open-exchange-rates.json
[junit4:junit4]   2> 9781 T2685 oass.OpenExchangeRatesOrgProvider$OpenExchangeRates.<init> WARNING Unknown key IMPORTANT NOTE
[junit4:junit4]   2> 9782 T2685 oass.OpenExchangeRatesOrgProvider$OpenExchangeRates.<init> WARNING Expected key, got STRING
[junit4:junit4]   2> 9782 T2685 oass.OpenExchangeRatesOrgProvider.reload Reloading exchange rates from open-exchange-rates.json
[junit4:junit4]   2> 9783 T2685 oass.OpenExchangeRatesOrgProvider$OpenExchangeRates.<init> WARNING Unknown key IMPORTANT NOTE
[junit4:junit4]   2> 9783 T2685 oass.OpenExchangeRatesOrgProvider$OpenExchangeRates.<init> WARNING Expected key, got STRING
[junit4:junit4]   2> 9783 T2685 oasc.SolrCore.<init> [collection1] Opening new SolrCore at /mnt/ssd/jenkins/workspace/Lucene-Solr-trunk-Linux/solr/build/solr-core/test/J1/./org.apache.solr.cloud.RecoveryZkTest-jetty2-1362632285379/collection1/, dataDir=./org.apache.solr.cloud.RecoveryZkTest-1362632277302/jetty2/
[junit4:junit4]   2> 9783 T2685 oasc.JmxMonitoredMap.<init> JMX monitoring is enabled. Adding Solr mbeans to JMX Server: com.sun.jmx.mbeanserver.JmxMBeanServer@4fef3a22
[junit4:junit4]   2> 9784 T2685 oasc.SolrCore.initDirectoryFactory org.apache.solr.core.MockDirectoryFactory
[junit4:junit4]   2> 9785 T2685 oasc.CachingDirectoryFactory.get return new directory for /mnt/ssd/jenkins/workspace/Lucene-Solr-trunk-Linux/solr/build/solr-core/test/J1/./org.apache.solr.cloud.RecoveryZkTest-1362632277302/jetty2 forceNew: false
[junit4:junit4]   2> 9785 T2685 oasc.SolrCore.getNewIndexDir New index directory detected: old=null new=./org.apache.solr.cloud.RecoveryZkTest-1362632277302/jetty2/index/
[junit4:junit4]   2> 9785 T2685 oasc.SolrCore.initIndex WARNING [collection1] Solr index directory './org.apache.solr.cloud.RecoveryZkTest-1362632277302/jetty2/index' doesn't exist. Creating new index...
[junit4:junit4]   2> 9785 T2685 oasc.CachingDirectoryFactory.get return new directory for /mnt/ssd/jenkins/workspace/Lucene-Solr-trunk-Linux/solr/build/solr-core/test/J1/./org.apache.solr.cloud.RecoveryZkTest-1362632277302/jetty2/index forceNew: false
[junit4:junit4]   2> 9786 T2685 oasc.SolrDeletionPolicy.onCommit SolrDeletionPolicy.onCommit: commits:num=1
[junit4:junit4]   2> 		commit{dir=MockDirWrapper(org.apache.lucene.store.RAMDirectory@760ae648 lockFactory=org.apache.lucene.store.NativeFSLockFactory@28260725),segFN=segments_1,generation=1,filenames=[segments_1]
[junit4:junit4]   2> 9787 T2685 oasc.SolrDeletionPolicy.updateCommits newest commit = 1[segments_1]
[junit4:junit4]   2> 9788 T2685 oasup.UpdateRequestProcessorChain.init inserting DistributedUpdateProcessorFactory into updateRequestProcessorChain "dedupe"
[junit4:junit4]   2> 9788 T2685 oasup.UpdateRequestProcessorChain.init inserting DistributedUpdateProcessorFactory into updateRequestProcessorChain "stored_sig"
[junit4:junit4]   2> 9789 T2685 oasup.UpdateRequestProcessorChain.init inserting DistributedUpdateProcessorFactory into updateRequestProcessorChain "distrib-dup-test-chain-implicit"
[junit4:junit4]   2> 9789 T2685 oasc.RequestHandlers.initHandlersFromConfig created standard: solr.StandardRequestHandler
[junit4:junit4]   2> 9790 T2685 oasc.RequestHandlers.initHandlersFromConfig created /get: solr.RealTimeGetHandler
[junit4:junit4]   2> 9790 T2685 oasc.RequestHandlers.initHandlersFromConfig adding lazy requestHandler: solr.ReplicationHandler
[junit4:junit4]   2> 9790 T2685 oasc.RequestHandlers.initHandlersFromConfig created /replication: solr.ReplicationHandler
[junit4:junit4]   2> 9791 T2685 oasc.RequestHandlers.initHandlersFromConfig created /update: solr.UpdateRequestHandler
[junit4:junit4]   2> 9791 T2685 oasc.RequestHandlers.initHandlersFromConfig created /admin/: org.apache.solr.handler.admin.AdminHandlers
[junit4:junit4]   2> 9793 T2685 oashl.XMLLoader.init xsltCacheLifetimeSeconds=60
[junit4:junit4]   2> 9795 T2685 oass.SolrIndexSearcher.<init> Opening Searcher@70ba1dcb main
[junit4:junit4]   2> 9795 T2685 oasu.UpdateHandler.clearLog Clearing tlog files, tlogDir=./org.apache.solr.cloud.RecoveryZkTest-1362632277302/jetty2/tlog
[junit4:junit4]   2> 9796 T2685 oasu.CommitTracker.<init> Hard AutoCommit: disabled
[junit4:junit4]   2> 9796 T2685 oasu.CommitTracker.<init> Soft AutoCommit: disabled
[junit4:junit4]   2> 9802 T2686 oasc.SolrCore.registerSearcher [collection1] Registered new searcher Searcher@70ba1dcb main{StandardDirectoryReader(segments_1:1)}
[junit4:junit4]   2> 9803 T2685 oasc.ZkController.publish publishing core=collection1 state=down
[junit4:junit4]   2> 9803 T2685 oasc.ZkController.publish numShards not found on descriptor - reading it from system property
[junit4:junit4]   2> 11063 T2649 oascc.ZkStateReader.updateClusterState Updating cloud state from ZooKeeper... 
[junit4:junit4]   2> 11064 T2649 oasc.Overseer$ClusterStateUpdater.updateState Update state numShards=1 message={
[junit4:junit4]   2> 	  "operation":"state",
[junit4:junit4]   2> 	  "core_node_name":"3",
[junit4:junit4]   2> 	  "numShards":"1",
[junit4:junit4]   2> 	  "shard":null,
[junit4:junit4]   2> 	  "roles":null,
[junit4:junit4]   2> 	  "state":"down",
[junit4:junit4]   2> 	  "core":"collection1",
[junit4:junit4]   2> 	  "collection":"collection1",
[junit4:junit4]   2> 	  "node_name":"127.0.0.1:41872_",
[junit4:junit4]   2> 	  "base_url":"http://127.0.0.1:41872"}
[junit4:junit4]   2> 11064 T2649 oasc.Overseer$ClusterStateUpdater.updateState Collection already exists with numShards=1
[junit4:junit4]   2> 11064 T2649 oasc.Overseer$ClusterStateUpdater.updateState Assigning new node to shard shard=shard1
[junit4:junit4]   2> 11069 T2668 oascc.ZkStateReader$2.process A cluster state change: WatchedEvent state:SyncConnected type:NodeDataChanged path:/clusterstate.json, has occurred - updating... (live nodes size: 3)
[junit4:junit4]   2> 11069 T2655 oascc.ZkStateReader$2.process A cluster state change: WatchedEvent state:SyncConnected type:NodeDataChanged path:/clusterstate.json, has occurred - updating... (live nodes size: 3)
[junit4:junit4]   2> 11069 T2648 oascc.ZkStateReader$2.process A cluster state change: WatchedEvent state:SyncConnected type:NodeDataChanged path:/clusterstate.json, has occurred - updating... (live nodes size: 3)
[junit4:junit4]   2> 11069 T2684 oascc.ZkStateReader$2.process A cluster state change: WatchedEvent state:SyncConnected type:NodeDataChanged path:/clusterstate.json, has occurred - updating... (live nodes size: 3)
[junit4:junit4]   2> 11804 T2685 oasc.CoreContainer.registerCore registering core: collection1
[junit4:junit4]   2> 11805 T2685 oasc.ZkController.register Register replica - core:collection1 address:http://127.0.0.1:41872 collection:collection1 shard:shard1
[junit4:junit4]   2> 11810 T2685 oasc.ZkController.register We are http://127.0.0.1:41872/collection1/ and leader is http://127.0.0.1:53884/collection1/
[junit4:junit4]   2> 11810 T2685 oasc.ZkController.register No LogReplay needed for core=collection1 baseURL=http://127.0.0.1:41872
[junit4:junit4]   2> 11810 T2685 oasc.ZkController.checkRecovery Core needs to recover:collection1
[junit4:junit4]   2> 11811 T2685 oasu.DefaultSolrCoreState.doRecovery Running recovery - first canceling any ongoing recovery
[junit4:junit4]   2> ASYNC  NEW_CORE C429 name=collection1 org.apache.solr.core.SolrCore@325358f5 url=http://127.0.0.1:41872/collection1 node=127.0.0.1:41872_ C429_STATE=coll:collection1 core:collection1 props:{state=down, core=collection1, collection=collection1, node_name=127.0.0.1:41872_, base_url=http://127.0.0.1:41872}
[junit4:junit4]   2> 11811 T2687 C429 P41872 oasc.RecoveryStrategy.run Starting recovery process.  core=collection1 recoveringAfterStartup=true
[junit4:junit4]   2> 11813 T2687 C429 P41872 oasc.RecoveryStrategy.doRecovery ###### startupVersions=[]
[junit4:junit4]   2> 11814 T2685 oascc.ZkStateReader.updateClusterState Updating cloud state from ZooKeeper... 
[junit4:junit4]   2> 11814 T2687 C429 P41872 oasc.ZkController.publish publishing core=collection1 state=recovering
[junit4:junit4]   2> 11814 T2687 C429 P41872 oasc.ZkController.publish numShards not found on descriptor - reading it from system property
[junit4:junit4]   2> 11815 T2626 oass.SolrDispatchFilter.init user.dir=/mnt/ssd/jenkins/workspace/Lucene-Solr-trunk-Linux/solr/build/solr-core/test/J1
[junit4:junit4]   2> 11816 T2687 C429 P41872 oascsi.HttpClientUtil.createClient Creating new http client, config:maxConnections=128&maxConnectionsPerHost=32&followRedirects=false
[junit4:junit4]   2> 11816 T2626 oass.SolrDispatchFilter.init SolrDispatchFilter.init() done
[junit4:junit4]   2> 11817 T2626 oascsi.HttpClientUtil.createClient Creating new http client, config:maxConnections=128&maxConnectionsPerHost=32&followRedirects=false
[junit4:junit4]   2> 11822 T2626 oascc.ZkStateReader.updateClusterState Updating cloud state from ZooKeeper... 
[junit4:junit4]   2> ASYNC  NEW_CORE C430 name=collection1 org.apache.solr.core.SolrCore@1d244cfb url=http://127.0.0.1:46877/collection1 node=127.0.0.1:46877_ C430_STATE=coll:control_collection core:collection1 props:{shard=shard1, state=active, core=collection1, collection=control_collection, node_name=127.0.0.1:46877_, base_url=http://127.0.0.1:46877, leader=true}
[junit4:junit4]   2> 11838 T2641 C430 P46877 oasc.SolrDeletionPolicy.onInit SolrDeletionPolicy.onInit: commits:num=1
[junit4:junit4]   2> 		commit{dir=MockDirWrapper(org.apache.lucene.store.RAMDirectory@3644a606 lockFactory=org.apache.lucene.store.NativeFSLockFactory@54651029),segFN=segments_1,generation=1,filenames=[segments_1]
[junit4:junit4]   2> 11838 T2641 C430 P46877 oasc.SolrDeletionPolicy.updateCommits newest commit = 1[segments_1]
[junit4:junit4]   2> 11840 T2642 C430 P46877 /update {wt=javabin&version=2} {add=[10001 (1428823515210973185)]} 0 4
[junit4:junit4]   2> 11840 T2641 C430 P46877 /update {wt=javabin&version=2} {add=[1 (1428823515210973184)]} 0 4
[junit4:junit4]   2> ASYNC  NEW_CORE C431 name=collection1 org.apache.solr.core.SolrCore@17444a19 url=http://127.0.0.1:53884/collection1 node=127.0.0.1:53884_ C431_STATE=coll:collection1 core:collection1 props:{shard=shard1, state=active, core=collection1, collection=collection1, node_name=127.0.0.1:53884_, base_url=http://127.0.0.1:53884, leader=true}
[junit4:junit4]   2> 11856 T2662 C431 P53884 oasc.SolrDeletionPolicy.onInit SolrDeletionPolicy.onInit: commits:num=1
[junit4:junit4]   2> 		commit{dir=MockDirWrapper(org.apache.lucene.store.RAMDirectory@6408e5ae lockFactory=org.apache.lucene.store.NativeFSLockFactory@1d062e74),segFN=segments_1,generation=1,filenames=[segments_1]
[junit4:junit4]   2> 11857 T2662 C431 P53884 oasc.SolrDeletionPolicy.updateCommits newest commit = 1[segments_1]
[junit4:junit4]   2> 11859 T2662 C431 P53884 /update {wt=javabin&version=2} {add=[1 (1428823515230896129)]} 0 4
[junit4:junit4]   2> 11859 T2663 C431 P53884 /update {wt=javabin&version=2} {add=[10001 (1428823515230896128)]} 0 4
[junit4:junit4]   2> 11925 T2643 C430 P46877 /update {wt=javabin&version=2} {add=[2 (1428823515303247872)]} 0 1
[junit4:junit4]   2> 11925 T2644 C430 P46877 /update {wt=javabin&version=2} {add=[10002 (1428823515303247873)]} 0 1
[junit4:junit4]   2> 11928 T2661 C431 P53884 /update {wt=javabin&version=2} {add=[2 (1428823515306393600)]} 0 1
[junit4:junit4]   2> 11928 T2662 C431 P53884 /update {wt=javabin&version=2} {add=[10002 (1428823515307442176)]} 0 1
[junit4:junit4]   2> 11930 T2641 C430 P46877 /update {wt=javabin&version=2} {add=[3 (1428823515309539328)]} 0 0
[junit4:junit4]   2> 11930 T2642 C430 P46877 /update {wt=javabin&version=2} {add=[10003 (1428823515309539329)]} 0 0
[junit4:junit4]   2> 11933 T2663 C431 P53884 /update {wt=javabin&version=2} {add=[3 (1428823515311636480)]} 0 1
[junit4:junit4]   2> 11933 T2661 C431 P53884 /update {wt=javabin&version=2} {add=[10003 (1428823515311636481)]} 0 1
[junit4:junit4]   2> 11935 T2643 C430 P46877 /update {wt=javabin&version=2} {add=[4 (1428823515314782208)]} 0 0
[junit4:junit4]   2> 11935 T2644 C430 P46877 /update {wt=javabin&version=2} {add=[10004 (1428823515314782209)]} 0 0
[junit4:junit4]   2> 11937 T2662 C431 P53884 /update {wt=javabin&version=2} {add=[4 (1428823515316879360)]} 0 0
[junit4:junit4]   2> 11938 T2663 C431 P53884 /update {wt=javabin&version=2} {add=[10004 (1428823515317927936)]} 0 1
[junit4:junit4]   2> 12012 T2641 C430 P46877 /update {wt=javabin&version=2} {add=[5 (1428823515395522560)]} 0 1
[junit4:junit4]   2> 12012 T2642 C430 P46877 /update {wt=javabin&version=2} {add=[10005 (1428823515395522561)]} 0 0
[junit4:junit4]   2> 12014 T2661 C431 P53884 /update {wt=javabin&version=2} {add=[5 (1428823515397619712)]} 0 0
[junit4:junit4]   2> 12015 T2662 C431 P53884 /update {wt=javabin&version=2} {add=[10005 (1428823515397619713)]} 0 1
[junit4:junit4]   2> 12067 T2643 C430 P46877 /update {wt=javabin&version=2} {add=[6 (1428823515452145664)]} 0 1
[junit4:junit4]   2> 12068 T2644 C430 P46877 /update {wt=javabin&version=2} {add=[10006 (1428823515453194240)]} 0 1
[junit4:junit4]   2> 12069 T2663 C431 P53884 /update {wt=javabin&version=2} {add=[6 (1428823515455291392)]} 0 0
[junit4:junit4]   2> 12070 T2662 C431 P53884 /update {wt=javabin&version=2} {add=[10006 (1428823515456339968)]} 0 1
[junit4:junit4]   2> 12082 T2641 C430 P46877 /update {wt=javabin&version=2} {delete=[5 (-1428823515467874304)]} 0 1
[junit4:junit4]   2> 12082 T2642 C430 P46877 /update {wt=javabin&version=2} {delete=[10005 (-1428823515468922880)]} 0 0
[junit4:junit4]   2> 12084 T2661 C431 P53884 /update {wt=javabin&version=2} {delete=[5 (-1428823515469971456)]} 0 1
[junit4:junit4]   2> 12084 T2663 C431 P53884 /update {wt=javabin&version=2} {delete=[10005 (-1428823515471020032)]} 0 0
[junit4:junit4]   2> 12086 T2643 C430 P46877 /update {wt=javabin&version=2} {add=[7 (1428823515473117184)]} 0 1
[junit4:junit4]   2> 12087 T2644 C430 P46877 /update {wt=javabin&version=2} {add=[10007 (1428823515473117185)]} 0 1
[junit4:junit4]   2> 12088 T2662 C431 P53884 /update {wt=javabin&version=2} {add=[7 (1428823515475214336)]} 0 0
[junit4:junit4]   2> 12089 T2661 C431 P53884 /update {wt=javabin&version=2} {add=[10007 (1428823515476262912)]} 0 0
[junit4:junit4]   2> 12091 T2641 C430 P46877 /update {wt=javabin&version=2} {add=[8 (1428823515477311488)]} 0 1
[junit4:junit4]   2> 12091 T2642 C430 P46877 /update {wt=javabin&version=2} {add=[10008 (1428823515478360064)]} 0 0
[junit4:junit4]   2> 12093 T2663 C431 P53884 /update {wt=javabin&version=2} {add=[8 (1428823515480457216)]} 0 0
[junit4:junit4]   2> 12094 T2662 C431 P53884 /update {wt=javabin&version=2} {add=[10008 (1428823515480457217)]} 0 1
[junit4:junit4]   2> 12135 T2643 C430 P46877 /update {wt=javabin&version=2} {delete=[8 (-1428823515524497408)]} 0 0
[junit4:junit4]   2> 12136 T2644 C430 P46877 /update {wt=javabin&version=2} {delete=[10008 (-1428823515525545984)]} 0 0
[junit4:junit4]   2> 12137 T2661 C431 P53884 /update {wt=javabin&version=2} {delete=[8 (-1428823515526594560)]} 0 0
[junit4:junit4]   2> 12138 T2663 C431 P53884 /update {wt=javabin&version=2} {delete=[10008 (-1428823515527643136)]} 0 0
[junit4:junit4]   2> 12139 T2641 C430 P46877 /update {wt=javabin&version=2} {add=[9 (1428823515528691712)]} 0 0
[junit4:junit4]   2> 12140 T2642 C430 P46877 /update {wt=javabin&version=2} {add=[10009 (1428823515529740288)]} 0 0
[junit4:junit4]   2> 12142 T2662 C431 P53884 /update {wt=javabin&version=2} {add=[9 (1428823515530788864)]} 0 1
[junit4:junit4]   2> 12143 T2661 C431 P53884 /update {wt=javabin&version=2} {add=[10009 (1428823515531837440)]} 0 1
[junit4:junit4]   2> 12185 T2643 C430 P46877 /update {wt=javabin&version=2} {add=[10 (1428823515576926208)]} 0 0
[junit4:junit4]   2> 12186 T2644 C430 P46877 /update {wt=javabin&version=2} {add=[10010 (1428823515577974784)]} 0 0
[junit4:junit4]   2> 12188 T2663 C431 P53884 /update {wt=javabin&version=2} {add=[10 (1428823515579023360)]} 0 1
[junit4:junit4]   2> 12189 T2662 C431 P53884 /update {wt=javabin&version=2} {add=[10010 (1428823515580071936)]} 0 1
[junit4:junit4]   2> 12218 T2641 C430 P46877 /update {wt=javabin&version=2} {add=[11 (1428823515611529216)]} 0 0
[junit4:junit4]   2> 12219 T2642 C430 P46877 /update {wt=javabin&version=2} {add=[10011 (1428823515612577792)]} 0 1
[junit4:junit4]   2> 12220 T2661 C431 P53884 /update {wt=javabin&version=2} {add=[11 (1428823515613626368)]} 0 0
[junit4:junit4]   2> 12221 T2663 C431 P53884 /update {wt=javabin&version=2} {add=[10011 (1428823515614674944)]} 0 0
[junit4:junit4]   2> 12244 T2643 C430 P46877 /update {wt=javabin&version=2} {add=[12 (1428823515637743616)]} 0 1
[junit4:junit4]   2> 12245 T2641 C430 P46877 /update {wt=javabin&version=2} {add=[10012 (1428823515638792192)]} 0 1
[junit4:junit4]   2> 12246 T2662 C431 P53884 /update {wt=javabin&version=2} {add=[12 (1428823515640889344)]} 0 0
[junit4:junit4]   2> 12247 T2661 C431 P53884 /update {wt=javabin&version=2} {add=[10012 (1428823515641937920)]} 0 0
[junit4:junit4]   2> 12257 T2644 C430 P46877 /update {wt=javabin&version=2} {delete=[11 (-1428823515652423680)]} 0 0
[junit4:junit4]   2> 12258 T2643 C430 P46877 /update {wt=javabin&version=2} {delete=[10011 (-1428823515653472256)]} 0 0
[junit4:junit4]   2> 12259 T2662 C431 P53884 /update {wt=javabin&version=2} {delete=[11 (-1428823515654520832)]} 0 0
[junit4:junit4]   2> 12260 T2663 C431 P53884 /update {wt=javabin&version=2} {delete=[10011 (-1428823515655569408)]} 0 0
[junit4:junit4]   2> 12262 T2642 C430 P46877 /update {wt=javabin&version=2} {add=[13 (1428823515656617984)]} 0 1
[junit4:junit4]   2> 12262 T2641 C430 P46877 /update {wt=javabin&version=2} {add=[10013 (1428823515657666560)]} 0 0
[junit4:junit4]   2> 12264 T2661 C431 P53884 /update {wt=javabin&version=2} {add=[13 (1428823515659763712)]} 0 0
[junit4:junit4]   2> 12265 T2662 C431 P53884 /update {wt=javabin&version=2} {add=[10013 (1428823515659763713)]} 0 1
[junit4:junit4]   2> 12268 T2644 C430 P46877 /update {wt=javabin&version=2} {delete=[12 (-1428823515663958016)]} 0 0
[junit4:junit4]   2> 12269 T2643 C430 P46877 /update {wt=javabin&version=2} {delete=[10012 (-1428823515665006592)]} 0 0
[junit4:junit4]   2> 12270 T2663 C431 P53884 /update {wt=javabin&version=2} {delete=[12 (-1428823515666055168)]} 0 0
[junit4:junit4]   2> 12271 T2661 C431 P53884 /update {wt=javabin&version=2} {delete=[10012 (-1428823515667103744)]} 0 0
[junit4:junit4]   2> 12273 T2642 C430 P46877 /update {wt=javabin&version=2} {add=[14 (1428823515668152320)]} 0 1
[junit4:junit4]   2> 12273 T2641 C430 P46877 /update {wt=javabin&version=2} {add=[10014 (1428823515669200896)]} 0 1
[junit4:junit4]   2> 12275 T2662 C431 P53884 /update {wt=javabin&version=2} {add=[14 (1428823515671298048)]} 0 0
[junit4:junit4]   2> 12275 T2663 C431 P53884 /update {wt=javabin&version=2} {add=[10014 (1428823515671298049)]} 0 0
[junit4:junit4]   2> 12356 T2644 C430 P46877 /update {wt=javabin&version=2} {add=[15 (1428823515756232704)]} 0 0
[junit4:junit4]   2> 12357 T2643 C430 P46877 /update {wt=javabin&version=2} {add=[10015 (1428823515756232705)]} 0 1
[junit4:junit4]   2> 12359 T2661 C431 P53884 /update {wt=javabin&version=2} {add=[15 (1428823515759378432)]} 0 0
[junit4:junit4]   2> 12359 T2662 C431 P53884 /update {wt=javabin&version=2} {add=[10015 (1428823515759378433)]} 0 0
[junit4:junit4]   2> 12369 T2641 C430 P46877 /update {wt=javabin&version=2} {add=[10016 (1428823515769864193)]} 0 0
[junit4:junit4]   2> 12369 T2642 C430 P46877 /update {wt=javabin&version=2} {add=[16 (1428823515769864192)]} 0 0
[junit4:junit4]   2> 12372 T2663 C431 P53884 /update {wt=javabin&version=2} {add=[10016 (1428823515771961344)]} 0 1
[junit4:junit4]   2> 12372 T2661 C431 P53884 /update {wt=javabin&version=2} {add=[16 (1428823515771961345)]} 0 1
[junit4:junit4]   2> 12416 T2644 C430 P46877 /update {wt=javabin&version=2} {add=[10017 (1428823515819147264)]} 0 0
[junit4:junit4]   2> 12416 T2643 C430 P46877 /update {wt=javabin&version=2} {add=[17 (1428823515819147265)]} 0 0
[junit4:junit4]   2> 12419 T2662 C431 P53884 /update {wt=javabin&version=2} {add=[10017 (1428823515821244416)]} 0 1
[junit4:junit4]   2> 12419 T2663 C431 P53884 /update {wt=javabin&version=2} {add=[17 (1428823515821244417)]} 0 1
[junit4:junit4]   2> 12441 T2641 C430 P46877 /update {wt=javabin&version=2} {add=[10018 (1428823515845361664)]} 0 0
[junit4:junit4]   2> 12441 T2642 C430 P46877 /update {wt=javabin&version=2} {add=[18 (1428823515845361665)]} 0 0
[junit4:junit4]   2> 12443 T2661 C431 P53884 /update {wt=javabin&version=2} {add=[10018 (1428823515847458816)]} 0 0
[junit4:junit4]   2> 12444 T2662 C431 P53884 /update {wt=javabin&version=2} {add=[18 (1428823515847458817)]} 0 1
[junit4:junit4]   2> 12504 T2644 C430 P46877 /update {wt=javabin&version=2} {delete=[10015 (-1428823515910373376)]} 0 1
[junit4:junit4]   2> 12504 T2643 C430 P46877 /update {wt=javabin&version=2} {delete=[15 (-1428823515911421952)]} 0 1
[junit4:junit4]   2> 12506 T2663 C431 P53884 /update {wt=javabin&version=2} {delete=[10015 (-1428823515913519104)]} 0 0
[junit4:junit4]   2> 12506 T2661 C431 P53884 /update {wt=javabin&version=2} {delete=[15 (-1428823515913519105)]} 0 0
[junit4:junit4]   2> 12508 T2641 C430 P46877 /update {wt=javabin&version=2} {add=[10019 (1428823515915616256)]} 0 0
[junit4:junit4]   2> 12508 T2642 C430 P46877 /update {wt=javabin&version=2} {add=[19 (1428823515915616257)]} 0 0
[junit4:junit4]   2> 12510 T2662 C431 P53884 /update {wt=javabin&version=2} {add=[10019 (1428823515917713408)]} 0 0
[junit4:junit4]   2> 12511 T2663 C431 P53884 /update {wt=javabin&version=2} {add=[19 (1428823515917713409)]} 0 1
[junit4:junit4]   2> 12570 T2644 C430 P46877 /update {wt=javabin&version=2} {delete=[10016 (-1428823515980627968)]} 0 0
[junit4:junit4]   2> 12571 T2643 C430 P46877 /update {wt=javabin&version=2} {delete=[16 (-1428823515981676544)]} 0 0
[junit4:junit4]   2> 12572 T2649 oascc.ZkStateReader.updateClusterState Updating cloud state from ZooKeeper... 
[junit4:junit4]   2> 12572 T2649 oasc.Overseer$ClusterStateUpdater.updateState Update state numShards=1 message={
[junit4:junit4]   2> 	  "operation":"state",
[junit4:junit4]   2> 	  "core_node_name":"3",
[junit4:junit4]   2> 	  "numShards":"1",
[junit4:junit4]   2> 	  "shard":"shard1",
[junit4:junit4]   2> 	  "roles":null,
[junit4:junit4]   2> 	  "state":"recovering",
[junit4:junit4]   2> 	  "core":"collection1",
[junit4:junit4]   2> 	  "collection":"collection1",
[junit4:junit4]   2> 	  "node_name":"127.0.0.1:41872_",
[junit4:junit4]   2> 	  "base_url":"http://127.0.0.1:41872"}
[junit4:junit4]   2> 12572 T2661 C431 P53884 /update {wt=javabin&version=2} {delete=[10016 (-1428823515982725120)]} 0 0
[junit4:junit4]   2> 12573 T2662 C431 P53884 /update {wt=javabin&version=2} {delete=[16 (-1428823515983773696)]} 0 0
[junit4:junit4]   2> 12575 T2641 C430 P46877 /update {wt=javabin&version=2} {add=[10020 (1428823515984822272)]} 0 1
[junit4:junit4]   2> 12575 T2668 oascc.ZkStateReader$2.process A cluster state change: WatchedEvent state:SyncConnected type:NodeDataChanged path:/clusterstate.json, has occurred - updating... (live nodes size: 3)
[junit4:junit4]   2> 12575 T2684 oascc.ZkStateReader$2.process A cluster state change: WatchedEvent state:SyncConnected type:NodeDataChanged path:/clusterstate.json, has occurred - updating... (live nodes size: 3)
[junit4:junit4]   2> 12575 T2655 oascc.ZkStateReader$2.process A cluster state change: WatchedEvent state:SyncConnected type:NodeDataChanged path:/clusterstate.json, has occurred - updating... (live nodes size: 3)
[junit4:junit4]   2> 12575 T2648 oascc.ZkStateReader$2.process A cluster state change: WatchedEvent state:SyncConnected type:NodeDataChanged path:/clusterstate.json, has occurred - updating... (live nodes size: 3)
[junit4:junit4]   2> 12575 T2642 C430 P46877 /update {wt=javabin&version=2} {add=[20 (1428823515985870848)]} 0 0
[junit4:junit4]   2>  C429_STATE=coll:collection1 core:collection1 props:{shard=shard1, state=recovering, core=collection1, collection=collection1, node_name=127.0.0.1:41872_, base_url=http://127.0.0.1:41872}
[junit4:junit4]   2> 12583 T2677 C429 P41872 oasc.SolrDeletionPolicy.onInit SolrDeletionPolicy.onInit: commits:num=1
[junit4:junit4]   2> 		commit{dir=MockDirWrapper(org.apache.lucene.store.RAMDirectory@760ae648 lockFactory=org.apache.lucene.store.NativeFSLockFactory@28260725),segFN=segments_1,generation=1,filenames=[segments_1]
[junit4:junit4]   2> 12584 T2677 C429 P41872 oasc.SolrDeletionPolicy.updateCommits newest commit = 1[segments_1]
[junit4:junit4]   2> 12585 T2677 C429 P41872 /update {distrib.from=http://127.0.0.1:53884/collection1/&update.distrib=FROMLEADER&wt=javabin&version=2} {add=[20 (1428823515989016576)]} 0 3
[junit4:junit4]   2> 12585 T2680 C429 P41872 /update {distrib.from=http://127.0.0.1:53884/collection1/&update.distrib=FROMLEADER&wt=javabin&version=2} {add=[10020 (1428823515987968000)]} 0 1
[junit4:junit4]   2> 12586 T2661 C431 P53884 /update {wt=javabin&version=2} {add=[20 (1428823515989016576)]} 0 9
[junit4:junit4]   2> 12586 T2663 C431 P53884 /update {wt=javabin&version=2} {add=[10020 (1428823515987968000)]} 0 9
[junit4:junit4]   2> 12592 T2643 C430 P46877 /update {wt=javabin&version=2} {add=[10021 (1428823516003696640)]} 0 0
[junit4:junit4]   2> 12592 T2644 C430 P46877 /update {wt=javabin&version=2} {add=[21 (1428823516003696641)]} 0 0
[junit4:junit4]   2> 12606 T2678 C429 P41872 /update {distrib.from=http://127.0.0.1:53884/collection1/&update.distrib=FROMLEADER&wt=javabin&version=2} {add=[10021 (1428823516005793792)]} 0 1
[junit4:junit4]   2> 12607 T2679 C429 P41872 /update {distrib.from=http://127.0.0.1:53884/collection1/&update.distrib=FROMLEADER&wt=javabin&version=2} {add=[21 (1428823516005793793)]} 0 2
[junit4:junit4]   2> 12607 T2662 C431 P53884 /update {wt=javabin&version=2} {add=[10021 (1428823516005793792)]} 0 13
[junit4:junit4]   2> 12607 T2661 C431 P53884 /update {wt=javabin&version=2} {add=[21 (1428823516005793793)]} 0 13
[junit4:junit4]   2> 12646 T2641 C430 P46877 /update {wt=javabin&version=2} {delete=[10018 (-1428823516060319744)]} 0 0
[junit4:junit4]   2> 12646 T2642 C430 P46877 /update {wt=javabin&version=2} {delete=[18 (-1428823516060319745)]} 0 0
[junit4:junit4]   2> 12650 T2677 C429 P41872 /update {distrib.from=http://127.0.0.1:53884/collection1/&update.distrib=FROMLEADER&wt=javabin&version=2} {delete=[18 (-1428823516062416897)]} 0 0
[junit4:junit4]   2> 12650 T2680 C429 P41872 /update {distrib.from=http://127.0.0.1:53884/collection1/&update.distrib=FROMLEADER&wt=javabin&version=2} {delete=[10018 (-1428823516062416896)]} 0 0
[junit4:junit4]   2> 12651 T2661 C431 P53884 /update {wt=javabin&version=2} {delete=[18 (-1428823516062416897)]} 0 3
[junit4:junit4]   2> 12651 T2663 C431 P53884 /update {wt=javabin&version=2} {delete=[10018 (-1428823516062416896)]} 0 3
[junit4:junit4]   2> 12653 T2643 C430 P46877 /update {wt=javabin&version=2} {add=[22 (1428823516066611200)]} 0 1
[junit4:junit4]   2> 12653 T2644 C430 P46877 /update {wt=javabin&version=2} {add=[10022 (1428823516067659776)]} 0 0
[junit4:junit4]   2> 12657 T2678 C429 P41872 /update {distrib.from=http://127.0.0.1:53884/collection1/&update.distrib=FROMLEADER&wt=javabin&version=2} {add=[22 (1428823516069756928)]} 0 0
[junit4:junit4]   2> 12657 T2679 C429 P41872 /update {distrib.from=http://127.0.0.1:53884/collection1/&update.distrib=FROMLEADER&wt=javabin&version=2} {add=[10022 (1428823516069756929)]} 0 0
[junit4:junit4]   2> 12658 T2662 C431 P53884 /update {wt=javabin&version=2} {add=[22 (1428823516069756928)]} 0 3
[junit4:junit4]   2> 12658 T2661 C431 P53884 /update {wt=javabin&version=2} {add=[10022 (1428823516069756929)]} 0 3
[junit4:junit4]   2> 12753 T2641 C430 P46877 /update {wt=javabin&version=2} {add=[23 (1428823516171468801)]} 0 1
[junit4:junit4]   2> 12753 T2642 C430 P46877 /update {wt=javabin&version=2} {add=[10023 (1428823516171468800)]} 0 1
[junit4:junit4]   2> 12757 T2677 C429 P41872 /update {distrib.from=http://127.0.0.1:53884/collection1/&update.distrib=FROMLEADER&wt=javabin&version=2} {add=[10023 (1428823516174614528)]} 0 0
[junit4:junit4]   2> 12757 T2680 C429 P41872 /update {distrib.from=http://127.0.0.1:53884/collection1/&update.distrib=FROMLEADER&wt=javabin&version=2} {add=[23 (1428823516174614529)]} 0 0
[junit4:junit4]   2> 12758 T2663 C431 P53884 /update {wt=javabin&version=2} {add=[10023 (1428823516174614528)]} 0 3
[junit4:junit4]   2> 12758 T2662 C431 P53884 /update {wt=javabin&version=2} {add=[23 (1428823516174614529)]} 0 3
[junit4:junit4]   2> 12796 T2643 C430 P46877 /update {wt=javabin&version=2} {delete=[10021 (-1428823516217606144)]} 0 0
[junit4:junit4]   2> 12796 T2644 C430 P46877 /update {wt=javabin&version=2} {delete=[21 (-1428823516217606145)]} 0 0
[junit4:junit4]   2> 12800 T2678 C429 P41872 /update {distrib.from=http://127.0.0.1:53884/collection1/&update.distrib=FROMLEADER&wt=javabin&version=2} {delete=[21 (-1428823516219703297)]} 0 1
[junit4:junit4]   2> 12800 T2679 C429 P41872 /update {distrib.from=http://127.0.0.1:53884/collection1/&update.distrib=FROMLEADER&wt=javabin&version=2} {delete=[10021 (-1428823516219703296)]} 0 0
[junit4:junit4]   2> 12800 T2663 C431 P53884 /update {wt=javabin&version=2} {delete=[21 (-1428823516219703297)]} 0 2
[junit4:junit4]   2> 12800 T2661 C431 P53884 /update {wt=javabin&version=2} {delete=[10021 (-1428823516219703296)]} 0 2
[junit4:junit4]   2> 12802 T2641 C430 P46877 /update {wt=javabin&version=2} {add=[24 (1428823516223897600)]} 0 0
[junit4:junit4]   2> 12802 T2642 C430 P46877 /update {wt=javabin&version=2} {add=[10024 (1428823516223897601)]} 0 0
[junit4:junit4]   2> 12807 T2677 C429 P41872 /update {distrib.from=http://127.0.0.1:53884/collection1/&update.distrib=FROMLEADER&wt=javabin&version=2} {add=[24 (1428823516225994752)]} 0 1
[junit4:junit4]   2> 12807 T2680 C429 P41872 /update {distrib.from=http://127.0.0.1:53884/collection1/&update.distrib=FROMLEADER&wt=javabin&version=2} {add=[10024 (1428823516225994753)]} 0 1
[junit4:junit4]   2> 12807 T2662 C431 P53884 /update {wt=javabin&version=2} {add=[24 (1428823516225994752)]} 0 3
[junit4:junit4]   2> 12807 T2663 C431 P53884 /update {wt=javabin&version=2} {add=[10024 (1428823516225994753)]} 0 3
[junit4:junit4]   2> 12823 T2664 oass.SolrDispatchFilter.handleAdminRequest /admin/cores {coreNodeName=3&state=recovering&nodeName=127.0.0.1:41872_&action=PREPRECOVERY&checkLive=true&core=collection1&wt=javabin&onlyIfLeader=true&version=2} status=0 QTime=1000 
[junit4:junit4]   2> 12863 T2644 C430 P46877 /update {wt=javabin&version=2} {delete=[22 (-1428823516287860736)]} 0 0
[junit4:junit4]   2> 12863 T2643 C430 P46877 /update {wt=javabin&version=2} {delete=[10022 (-1428823516287860737)]} 0 0
[junit4:junit4]   2> 12867 T2678 C429 P41872 /update {distrib.from=http://127.0.0.1:53884/collection1/&update.distrib=FROMLEADER&wt=javabin&version=2} {delete=[22 (-1428823516289957888)]} 0 0
[junit4:junit4]   2> 12867 T2679 C429 P41872 /update {distrib.from=http://127.0.0.1:53884/collection1/&update.distrib=FROMLEADER&wt=javabin&version=2} {delete=[10022 (-1428823516291006464)]} 0 0
[junit4:junit4]   2> 12868 T2662 C431 P53884 /update {wt=javabin&version=2} {delete=[22 (-1428823516289957888)]} 0 3
[junit4:junit4]   2> 12868 T2663 C431 P53884 /update {wt=javabin&version=2} {delete=[10022 (-1428823516291006464)]} 0 3
[junit4:junit4]   2> 12870 T2641 C430 P46877 /update {wt=javabin&version=2} {add=[25 (1428823516295200768)]} 0 0
[junit4:junit4]   2> 12870 T2642 C430 P46877 /update {wt=javabin&version=2} {add=[10025 (1428823516295200769)]} 0 0
[junit4:junit4]   2> 12875 T2677 C429 P41872 /update {distrib.from=http://127.0.0.1:53884/collection1/&update.distrib=FROMLEADER&wt=javabin&version=2} {add=[25 (1428823516297297920)]} 0 1
[junit4:junit4]   2> 12875 T2680 C429 P41872 /update {distrib.from=http://127.0.0.1:53884/collection1/&update.distrib=FROMLEADER&wt=javabin&version=2} {add=[10025 (1428823516297297921)]} 0 1
[junit4:junit4]   2> 12875 T2664 C431 P53884 /update {wt=javabin&version=2} {add=[25 (1428823516297297920)]} 0 3
[junit4:junit4]   2> 12875 T2661 C431 P53884 /update {wt=javabin&version=2} {add=[10025 (1428823516297297921)]} 0 3
[junit4:junit4]   2> 12973 T2643 C430 P46877 /update {wt=javabin&version=2} {add=[10026 (1428823516403204096)]} 0 1
[junit4:junit4]   2> 12973 T2644 C430 P46877 /update {wt=javabin&version=2} {add=[26 (1428823516403204097)]} 0 1
[junit4:junit4]   2> 12978 T2678 C429 P41872 /update {distrib.from=http://127.0.0.1:53884/collection1/&update.distrib=FROMLEADER&wt=javabin&version=2} {add=[26 (1428823516405301249)]} 0 1
[junit4:junit4]   2> 12978 T2679 C429 P41872 /update {distrib.from=http://127.0.0.1:53884/collection1/&update.distrib=FROMLEADER&wt=javabin&version=2} {add=[10026 (1428823516405301248)]} 0 1
[junit4:junit4]   2> 12978 T2663 C431 P53884 /update {wt=javabin&version=2} {add=[26 (1428823516405301249)]} 0 3
[junit4:junit4]   2> 12978 T2662 C431 P53884 /update {wt=javabin&version=2} {add=[10026 (1428823516405301248)]} 0 3
[junit4:junit4]   2> 13036 T2642 C430 P46877 /update {wt=javabin&version=2} {add=[10027 (1428823516468215809)]} 0 1
[junit4:junit4]   2> 13036 T2641 C430 P46877 /update {wt=javabin&version=2} {add=[27 (1428823516468215808)]} 0 1
[junit4:junit4]   2> 13041 T2678 C429 P41872 /update {distrib.from=http://127.0.0.1:53884/collection1/&update.distrib=FROMLEADER&wt=javabin&version=2} {add=[10027 (1428823516471361537)]} 0 1
[junit4:junit4]   2> 13041 T2680 C429 P41872 /update {distrib.from=http://127.0.0.1:53884/collection1/&update.distrib=FROMLEADER&wt=javabin&version=2} {add=[27 (1428823516471361536)]} 0 1
[junit4:junit4]   2> 13041 T2664 C431 P53884 /update {wt=javabin&version=2} {add=[10027 (1428823516471361537)]} 0 3
[junit4:junit4]   2> 13041 T2661 C431 P53884 /update {wt=javabin&version=2} {add=[27 (1428823516471361536)]} 0 3
[junit4:junit4]   2> 13127 T2643 C430 P46877 /update {wt=javabin&version=2} {delete=[10024 (-1428823516564684801)]} 0 0
[junit4:junit4]   2> 13127 T2644 C430 P46877 /update {wt=javabin&version=2} {delete=[24 (-1428823516564684800)]} 0 0
[junit4:junit4]   2> 13131 T2677 C429 P41872 /update {distrib.from=http://127.0.0.1:53884/collection1/&update.distrib=FROMLEADER&wt=javabin&version=2} {delete=[10024 (-1428823516566781952)]} 0 0
[junit4:junit4]   2> 13131 T2679 C429 P41872 /update {distrib.from=http://127.0.0.1:53884/collection1/&update.distrib=FROMLEADER&wt=javabin&version=2} {delete=[24 (-1428823516566781953)]} 0 0
[junit4:junit4]   2> 13132 T2662 C431 P53884 /update {wt=javabin&version=2} {delete=[24 (-1428823516566781953)]} 0 3
[junit4:junit4]   2> 13132 T2663 C431 P53884 /update {wt=javabin&version=2} {delete=[10024 (-1428823516566781952)]} 0 3
[junit4:junit4]   2> 13134 T2641 C430 P46877 /update {wt=javabin&version=2} {add=[10028 (1428823516572024832)]} 0 0
[junit4:junit4]   2> 13134 T2642 C430 P46877 /update {wt=javabin&version=2} {add=[28 (1428823516572024833)]} 0 0
[junit4:junit4]   2> 13139 T2678 C429 P41872 /update {distrib.from=http://127.0.0.1:53884/collection1/&update.distrib=FROMLEADER&wt=javabin&version=2} {add=[28 (1428823516574121984)]} 0 0
[junit4:junit4]   2> 13139 T2680 C429 P41872 /update {distrib.from=http://127.0.0.1:53884/collection1/&update.distrib=FROMLEADER&wt=javabin&version=2} {add=[10028 (1428823516574121985)]} 0 0
[junit4:junit4]   2> 13140 T2661 C431 P53884 /update {wt=javabin&version=2} {add=[28 (1428823516574121984)]} 0 4
[junit4:junit4]   2> 13140 T2664 C431 P53884 /update {wt=javabin&version=2} {add=[10028 (1428823516574121985)]} 0 4
[junit4:junit4]   2> 13192 T2643 C430 P46877 /update {wt=javabin&version=2} {delete=[10027 (-1428823516632842241)]} 0 1
[junit4:junit4]   2> 13192 T2644 C430 P46877 /update {wt=javabin&version=2} {delete=[27 (-1428823516632842240)]} 0 1
[junit4:junit4]   2> 13196 T2677 C429 P41872 /update {distrib.from=http://127.0.0.1:53884/collection1/&update.distrib=FROMLEADER&wt=javabin&version=2} {delete=[27 (-1428823516634939392)]} 0 0
[junit4:junit4]   2> 13196 T2679 C429 P41872 /update {distrib.from=http://127.0.0.1:53884/collection1/&update.distrib=FROMLEADER&wt=javabin&version=2} {delete=[10027 (-1428823516634939393)]} 0 0
[junit4:junit4]   2> 13197 T2663 C431 P53884 /update {wt=javabin&version=2} {delete=[27 (-1428823516634939392)]} 0 3
[junit4:junit4]   2> 13197 T2662 C431 P53884 /update {wt=javabin&version=2} {delete=[10027 (-1428823516634939393)]} 0 3
[junit4:junit4]   2> 13200 T2642 C430 P46877 /update {wt=javabin&version=2} {add=[29 (1428823516640182273)]} 0 1
[junit4:junit4]   2> 13200 T2641 C430 P46877 /update {wt=javabin&version=2} {add=[10029 (1428823516640182272)]} 0 1
[junit4:junit4]   2> 13204 T2678 C429 P41872 /update {distrib.from=http://127.0.0.1:53884/collection1/&update.distrib=FROMLEADER&wt=javabin&version=2} {add=[10029 (1428823516643328000)]} 0 0
[junit4:junit4]   2> 13205 T2680 C429 P41872 /update {distrib.from=http://127.0.0.1:53884/collection1/&update.distrib=FROMLEADER&wt=javabin&version=2} {add=[29 (1428823516643328001)]} 0 1
[junit4:junit4]   2> 13205 T2661 C431 P53884 /update {wt=javabin&version=2} {add=[10029 (1428823516643328000)]} 0 3
[junit4:junit4]   2> 13205 T2664 C431 P53884 /update {wt=javabin&version=2} {add=[29 (1428823516643328001)]} 0 3
[junit4:junit4]   2> 13302 T2643 C430 P46877 /update {wt=javabin&version=2} {add=[30 (1428823516748185601)]} 0 0
[junit4:junit4]   2> 13302 T2644 C430 P46877 /update {wt=javabin&version=2} {add=[10030 (1428823516748185600)]} 0 0
[junit4:junit4]   2> 13307 T2677 C429 P41872 /update {distrib.from=http://127.0.0.1:53884/collection1/&update.distrib=FROMLEADER&wt=javabin&version=2} {add=[30 (1428823516750282752)]} 0 1
[junit4:junit4]   2> 13307 T2679 C429 P41872 /update {distrib.from=http://127.0.0.1:53884/collection1/&update.distrib=FROMLEADER&wt=javabin&version=2} {add=[10030 (1428823516751331328)]} 0 1
[junit4:junit4]   2> 13307 T2662 C431 P53884 /update {wt=javabin&version=2} {add=[30 (1428823516750282752)]} 0 3
[junit4:junit4]   2> 13308 T2663 C431 P53884 /update {wt=javabin&version=2} {add=[10030 (1428823516751331328)]} 0 4
[junit4:junit4]   2> 13346 T2641 C430 P46877 /update {wt=javabin&version=2} {delete=[10028 (-1428823516794322945)]} 0 0
[junit4:junit4]   2> 13346 T2642 C430 P46877 /update {wt=javabin&version=2} {delete=[28 (-1428823516794322944)]} 0 0
[junit4:junit4]   2> 13351 T2678 C429 P41872 /update {distrib.from=http://127.0.0.1:53884/collection1/&update.distrib=FROMLEADER&wt=javabin&version=2} {delete=[28 (-1428823516797468673)]} 0 0
[junit4:junit4]   2> 13351 T2680 C429 P41872 /update {distrib.from=http://127.0.0.1:53884/collection1/&update.distrib=FROMLEADER&wt=javabin&version=2} {delete=[10028 (-1428823516797468672)]} 0 0
[junit4:junit4]   2> 13352 T2664 C431 P53884 /update {wt=javabin&version=2} {delete=[28 (-1428823516797468673)]} 0 3
[junit4:junit4]   2> 13352 T2661 C431 P53884 /update {wt=javabin&version=2} {delete=[10028 (-1428823516797468672)]} 0 3
[junit4:junit4]   2> 13354 T2644 C430 P46877 /update {wt=javabin&version=2} {add=[31 (1428823516802711553)]} 0 0
[junit4:junit4]   2> 13355 T2643 C430 P46877 /update {wt=javabin&version=2} {add=[10031 (1428823516802711552)]} 0 1
[junit4:junit4]   2> 13359 T2677 C429 P41872 /update {distrib.from=http://127.0.0.1:53884/collection1/&update.distrib=FROMLEADER&wt=javabin&version=2} {add=[10031 (1428823516805857280)]} 0 0
[junit4:junit4]   2> 13359 T2679 C429 P41872 /update {distrib.from=http://127.0.0.1:53884/collection1/&update.distrib=FROMLEADER&wt=javabin&version=2} {add=[31 (1428823516805857281)]} 0 0
[junit4:junit4]   2> 13360 T2662 C431 P53884 /update {wt=javabin&version=2} {add=[10031 (1428823516805857280)]} 0 3
[junit4:junit4]   2> 13360 T2663 C431 P53884 /update {wt=javabin&version=2} {add=[31 (1428823516805857281)]} 0 3
[junit4:junit4]   2> 13393 T2641 C430 P46877 /update {wt=javabin&version=2} {delete=[30 (-1428823516843606017)]} 0 0
[junit4:junit4]   2> 13393 T2642 C430 P46877 /update {wt=javabin&version=2} {delete=[10030 (-1428823516843606016)]} 0 0
[junit4:junit4]   2> 13397 T2680 C429 P41872 /update {distrib.from=http://127.0.0.1:53884/collection1/&update.distrib=FROMLEADER&wt=javabin&version=2} {delete=[10030 (-1428823516845703168)]} 0 0
[junit4:junit4]   2> 13397 T2678 C429 P41872 /update {distrib.from=http://127.0.0.1:53884/collection1/&update.distrib=FROMLEADER&wt=javabin&version=2} {delete=[30 (-1428823516845703169)]} 0 0
[junit4:junit4]   2> 13398 T2664 C431 P53884 /update {wt=javabin&version=2} {delete=[10030 (-1428823516845703168)]} 0 3
[junit4:junit4]   2> 13398 T2661 C431 P53884 /update {wt=javabin&version=2} {delete=[30 (-1428823516845703169)]} 0 3
[junit4:junit4]   2> 13400 T2644 C430 P46877 /update {wt=javabin&version=2} {add=[32 (1428823516850946049)]} 0 0
[junit4:junit4]   2> 13401 T2643 C430 P46877 /update {wt=javabin&version=2} {add=[10032 (1428823516850946048)]} 0 1
[junit4:junit4]   2> 13405 T2679 C429 P41872 /update {distrib.from=http://127.0.0.1:53884/collection1/&update.distrib=FROMLEADER&wt=javabin&version=2} {add=[32 (1428823516854091776)]} 0 0
[junit4:junit4]   2> 13406 T2663 C431 P53884 /update {wt=javabin&version=2} {add=[32 (1428823516854091776)]} 0 4
[junit4:junit4]   2> 13407 T2677 C429 P41872 /update {distrib.from=http://127.0.0.1:53884/collection1/&update.distrib=FROMLEADER&wt=javabin&version=2} {add=[10032 (1428823516854091777)]} 0 1
[junit4:junit4]   2> 13407 T2662 C431 P53884 /update {wt=javabin&version=2} {add=[10032 (1428823516854091777)]} 0 4
[junit4:junit4]   2> 13462 T2642 C430 P46877 /update {wt=javabin&version=2} {add=[33 (1428823516914909184)]} 0 1
[junit4:junit4]   2> 13462 T2641 C430 P46877 /update {wt=javabin&version=2} {add=[10033 (1428823516915957760)]} 0 1
[junit4:junit4]   2> 13467 T2678 C429 P41872 /update {distrib.from=http://127.0.0.1:53884/collection1/&update.distrib=FROMLEADER&wt=javabin&version=2} {add=[33 (1428823516918054912)]} 0 1
[junit4:junit4]   2> 13467 T2679 C429 P41872 /update {distrib.from=http://127.0.0.1:53884/collection1/&update.distrib=FROMLEADER&wt=javabin&version=2} {add=[10033 (1428823516918054913)]} 0 0
[junit4:junit4]   2> 13468 T2661 C431 P53884 /update {wt=javabin&version=2} {add=[33 (1428823516918054912)]} 0 4
[junit4:junit4]   2> 13468 T2664 C431 P53884 /update {wt=javabin&version=2} {add=[10033 (1428823516918054913)]} 0 4
[junit4:junit4]   2> 13567 T2643 C430 P46877 /update {wt=javabin&version=2} {delete=[32 (-1428823517025009665)]} 0 1
[junit4:junit4]   2> 13567 T2644 C430 P46877 /update {wt=javabin&version=2} {delete=[10032 (-1428823517025009664)]} 0 1
[junit4:junit4]   2> 13571 T2677 C429 P41872 /update {distrib.from=http://127.0.0.1:53884/collection1/&update.distrib=FROMLEADER&wt=javabin&version=2} {delete=[10032 (-1428823517028155392)]} 0 0
[junit4:junit4]   2> 13571 T2680 C429 P41872 /update {distrib.from=http://127.0.0.1:53884/collection1/&update.distrib=FROMLEADER&wt=javabin&version=2} {delete=[32 (-1428823517028155393)]} 0 0
[junit4:junit4]   2> 13572 T2663 C431 P53884 /update {wt=javabin&version=2} {delete=[10032 (-1428823517028155392)]} 0 3
[junit4:junit4]   2> 13572 T2662 C431 P53884 /update {wt=javabin&version=2} {delete=[32 (-1428823517028155393)]} 0 3
[junit4:junit4]   2> 13574 T2642 C430 P46877 /update {wt=javabin&version=2} {add=[10034 (1428823517033398272)]} 0 0
[junit4:junit4]   2> 13574 T2641 C430 P46877 /update {wt=javabin&version=2} {add=[34 (1428823517033398273)]} 0 0
[junit4:junit4]   2> 13579 T2678 C429 P41872 /update {distrib.from=http://127.0.0.1:53884/collection1/&update.distrib=FROMLEADER&wt=javabin&version=2} {add=[10034 (1428823517035495424)]} 0 1
[junit4:junit4]   2> 13579 T2679 C429 P41872 /update {distrib.from=http://127.0.0.1:53884/collection1/&update.distrib=FROMLEADER&wt=javabin&version=2} {add=[34 (1428823517035495425)]} 0 0
[junit4:junit4]   2> 13579 T2664 C431 P53884 /update {wt=javabin&version=2} {add=[10034 (1428823517035495424)]} 0 3
[junit4:junit4]   2> 13580 T2661 C431 P53884 /update {wt=javabin&version=2} {add=[34 (1428823517035495425)]} 0 4
[junit4:junit4]   2> 13647 T2643 C430 P46877 /update {wt=javabin&version=2} {delete=[10033 (-1428823517109944321)]} 0 0
[junit4:junit4]   2> 13647 T2644 C430 P46877 /update {wt=javabin&version=2} {delete=[33 (-1428823517109944320)]} 0 0
[junit4:junit4]   2> 13651 T2680 C429 P41872 /update {distrib.from=http://127.0.0.1:53884/collection1/&update.distrib=FROMLEADER&wt=javabin&version=2} {delete=[33 (-1428823517112041473)]} 0 0
[junit4:junit4]   2> 13651 T2677 C429 P41872 /update {distrib.from=http://127.0.0.1:53884/collection1/&update.distrib=FROMLEADER&wt=javabin&version=2} {delete=[10033 (-1428823517112041472)]} 0 0
[junit4:junit4]   2> 13652 T2662 C431 P53884 /update {wt=javabin&version=2} {delete=[10033 (-1428823517112041472)]} 0 3
[junit4:junit4]   2> 13652 T2663 C431 P53884 /update {wt=javabin&version=2} {delete=[33 (-1428823517112041473)]} 0 3
[junit4:junit4]   2> 13655 T2642 C430 P46877 /update {wt=javabin&version=2} {add=[35 (1428823517117284352)]} 0 1
[junit4:junit4]   2> 13655 T2641 C430 P46877 /update {wt=javabin&version=2} {add=[10035 (1428823517117284353)]} 0 1
[junit4:junit4]   2> 13660 T2678 C429 P41872 /update {distrib.from=http://127.0.0.1:53884/collection1/&update.distrib=FROMLEADER&wt=javabin&version=2} {add=[10035 (1428823517120430081)]} 0 1
[junit4:junit4]   2> 13660 T2679 C429 P41872 /update {distrib.from=http://127.0.0.1:53884/collection1/&update.distrib=FROMLEADER&wt=javabin&version=2} {add=[35 (1428823517120430080)]} 0 1
[junit4:junit4]   2> 13660 T2661 C431 P53884 /update {wt=javabin&version=2} {add=[10035 (1428823517120430081)]} 0 3
[junit4:junit4]   2> 13660 T2664 C431 P53884 /update {wt=javabin&version=2} {add=[35 (1428823517120430080)]} 0 3
[junit4:junit4]   2> 13666 T2643 C430 P46877 /update {wt=javabin&version=2} {delete=[34 (-1428823517129867265)]} 0 1
[junit4:junit4]   2> 13666 T2644 C430 P46877 /update {wt=javabin&version=2} {delete=[10034 (-1428823517129867264)]} 0 1
[junit4:junit4]   2> 13670 T2677 C429 P41872 /update {distrib.from=http://127.0.0.1:53884/collection1/&update.distrib=FROMLEADER&wt=javabin&version=2} {delete=[34 (-1428823517131964416)]} 0 0
[junit4:junit4]   2> 13670 T2680 C429 P41872 /update {distrib.from=http://127.0.0.1:53884/collection1/&update.distrib=FROMLEADER&wt=javabin&version=2} {delete=[10034 (-1428823517131964417)]} 0 0
[junit4:junit4]   2> 13670 T2663 C431 P53884 /update {wt=javabin&version=2} {delete=[10034 (-1428823517131964417)]} 0 2
[junit4:junit4]   2> 13670 T2662 C431 P53884 /update {wt=javabin&version=2} {delete=[34 (-1428823517131964416)]} 0 2
[junit4:junit4]   2> 13673 T2642 C430 P46877 /update {wt=javabin&version=2} {add=[10036 (1428823517136158720)]} 0 1
[junit4:junit4]   2> 13673 T2641 C430 P46877 /update {wt=javabin&version=2} {add=[36 (1428823517137207296)]} 0 1
[junit4:junit4]   2> 13678 T2678 C429 P41872 /update {distrib.from=http://127.0.0.1:53884/collection1/&update.distrib=FROMLEADER&wt=javabin&version=2} {add=[10036 (1428823517139304448)]} 0 1
[junit4:junit4]   2> 13678 T2679 C429 P41872 /update {distrib.from=http://127.0.0.1:53884/collection1/&update.distrib=FROMLEADER&wt=javabin&version=2} {add=[36 (1428823517139304449)]} 0 1
[junit4:junit4]   2> 13678 T2661 C431 P53884 /update {wt=javabin&version=2} {add=[10036 (1428823517139304448)]} 0 3
[junit4:junit4]   2> 13678 T2664 C431 P53884 /update {wt=javabin&version=2} {add=[36 (1428823517139304449)]} 0 3
[junit4:junit4]   2> 13713 T2643 C430 P46877 /update {wt=javabin&version=2} {delete=[35 (-1428823517179150336)]} 0 0
[junit4:junit4]   2> 13713 T2644 C430 P46877 /update {wt=javabin&version=2} {delete=[10035 (-1428823517179150337)]} 0 0
[junit4:junit4]   2> 13717 T2677 C429 P41872 /update {distrib.from=http://127.0.0.1:53884/collection1/&update.distrib=FROMLEADER&wt=javabin&version=2} {delete=[10035 (-1428823517181247488)]} 0 0
[junit4:junit4]   2> 13717 T2680 C429 P41872 /update {distrib.from=http://127.0.0.1:53884/collection1/&update.distrib=FROMLEADER&wt=javabin&version=2} {delete=[35 (-1428823517182296064)]} 0 0
[junit4:junit4]   2> 13718 T2663 C431 P53884 /update {wt=javabin&version=2} {delete=[10035 (-1428823517181247488)]} 0 3
[junit4:junit4]   2> 13718 T2662 C431 P53884 /update {wt=javabin&version=2} {delete=[35 (-1428823517182296064)]} 0 3
[junit4:junit4]   2> 13721 T2641 C430 P46877 /update {wt=javabin&version=2} {add=[37 (1428823517186490369)]} 0 1
[junit4:junit4]   2> 13721 T2642 C430 P46877 /update {wt=javabin&version=2} {add=[10037 (1428823517186490368)]} 0 1
[junit4:junit4]   2> 13727 T2679 C429 P41872 /update {distrib.from=http://127.0.0.1:53884/collection1/&update.distrib=FROMLEADER&wt=javabin&version=2} {add=[37 (1428823517189636096)]} 0 1
[junit4:junit4]   2> 13727 T2678 C429 P41872 /update {distrib.from=http://127.0.0.1:53884/collection1/&update.distrib=FROMLEADER&wt=javabin&version=2} {add=[10037 (1428823517189636097)]} 0 1
[junit4:junit4]   2> 13728 T2661 C431 P53884 /update {wt=javabin&version=2} {add=[10037 (1428823517189636097)]} 0 5
[junit4:junit4]   2> 13728 T2664 C431 P53884 /update {wt=javabin&version=2} {add=[37 (1428823517189636096)]} 0 5
[junit4:junit4]   2> 13817 T2644 C430 P46877 /update {wt=javabin&version=2} {add=[10038 (1428823517287153665)]} 0 1
[junit4:junit4]   2> 13817 T2643 C430 P46877 /update {wt=javabin&version=2} {add=[38 (1428823517287153664)]} 0 1
[junit4:junit4]   2> 13822 T2677 C429 P41872 /update {distrib.from=http://127.0.0.1:53884/collection1/&update.distrib=FROMLEADER&wt=javabin&version=2} {add=[10038 (1428823517291347969)]} 0 0
[junit4:junit4]   2> 13822 T2680 C429 P41872 /update {distrib.from=http://127.0.0.1:53884/collection1/&update.distrib=FROMLEADER&wt=javabin&version=2} {add=[38 (1428823517291347968)]} 0 0
[junit4:junit4]   2> 13823 T2662 C431 P53884 /update {wt=javabin&version=2} {add=[10038 (1428823517291347969)]} 0 4
[junit4:junit4]   2> 13823 T2663 C431 P53884 /update {wt=javabin&version=2} {add=[38 (1428823517291347968)]} 0 4
[junit4:junit4]   2> 13825 T2626 oasc.ChaosMonkey.monkeyLog monkey: stop shard! 41872
[junit4:junit4]   2> 13826 T2626 oasc.CoreContainer.shutdown Shutting down CoreContainer instance=703082569
[junit4:junit4]   2> 13907 T2641 C430 P46877 /update {wt=javabin&version=2} {delete=[10036 (-1428823517382574081)]} 0 0
[junit4:junit4]   2> 13907 T2642 C430 P46877 /update {wt=javabin&version=2} {delete=[36 (-1428823517382574080)]} 0 0
[junit4:junit4]   2> 13912 T2678 C429 P41872 /update {distrib.from=http://127.0.0.1:53884/collection1/&update.distrib=FROMLEADER&wt=javabin&version=2} {delete=[36 (-1428823517385719809)]} 0 0
[junit4:junit4]   2> 13912 T2679 C429 P41872 /update {distrib.from=http://127.0.0.1:53884/collection1/&update.distrib=FROMLEADER&wt=javabin&version=2} {delete=[10036 (-1428823517385719808)]} 0 0
[junit4:junit4]   2> 13913 T2664 C431 P53884 /update {wt=javabin&version=2} {delete=[36 (-1428823517385719809)]} 0 3
[junit4:junit4]   2> 13913 T2661 C431 P53884 /update {wt=javabin&version=2} {delete=[10036 (-1428823517385719808)]} 0 3
[junit4:junit4]   2> 13915 T2643 C430 P46877 /update {wt=javabin&version=2} {add=[10039 (1428823517390962688)]} 0 0
[junit4:junit4]   2> 13916 T2644 C430 P46877 /update {wt=javabin&version=2} {add=[39 (1428823517390962689)]} 0 1
[junit4:junit4]   2> 13920 T2677 C429 P41872 /update {distrib.from=http://127.0.0.1:53884/collection1/&update.distrib=FROMLEADER&wt=javabin&version=2} {add=[39 (1428823517394108416)]} 0 0
[junit4:junit4]   2> 13920 T2680 C429 P41872 /update {distrib.from=http://127.0.0.1:53884/collection1/&update.distrib=FROMLEADER&wt=javabin&version=2} {add=[10039 (1428823517393059840)]} 0 0
[junit4:junit4]   2> 13921 T2663 C431 P53884 /update {wt=javabin&version=2} {add=[39 (1428823517394108416)]} 0 4
[junit4:junit4]   2> 13921 T2662 C431 P53884 /update {wt=javabin&version=2} {add=[10039 (1428823517393059840)]} 0 4
[junit4:junit4]   2> 14030 T2642 C430 P46877 /update {wt=javabin&version=2} {delete=[10037 (-1428823517511548928)]} 0 0
[junit4:junit4]   2> 14030 T2641 C430 P46877 /update {wt=javabin&version=2} {delete=[37 (-1428823517511548929)]} 0 0
[junit4:junit4]   2> 14034 T2679 C429 P41872 /update {distrib.from=http://127.0.0.1:53884/collection1/&update.distrib=FROMLEADER&wt=javabin&version=2} {delete=[10037 (-1428823517513646080)]} 0 0
[junit4:junit4]   2> 14034 T2678 C429 P41872 /update {distrib.from=http://127.0.0.1:53884/collection1/&update.distrib=FROMLEADER&wt=javabin&version=2} {delete=[37 (-1428823517513646081)]} 0 0
[junit4:junit4]   2> 14035 T2664 C431 P53884 /update {wt=javabin&version=2} {delete=[10037 (-1428823517513646080)]} 0 3
[junit4:junit4]   2> 14035 T2661 C431 P53884 /update {wt=javabin&version=2} {delete=[37 (-1428823517513646081)]} 0 3
[junit4:junit4]   2> 14038 T2643 C430 P46877 /update {wt=javabin&version=2} {add=[40 (1428823517518888960)]} 0 1
[junit4:junit4]   2> 14038 T2644 C430 P46877 /update {wt=javabin&version=2} {add=[10040 (1428823517518888961)]} 0 1
[junit4:junit4]   2> 14042 T2677 C429 P41872 /update {distrib.from=http://127.0.0.1:53884/collection1/&update.distrib=FROMLEADER&wt=javabin&version=2} {add=[40 (1428823517522034688)]} 0 0
[junit4:junit4]   2> 14043 T2680 C429 P41872 /update {distrib.from=http://127.0.0.1:53884/collection1/&update.distrib=FROMLEADER&wt=javabin&version=2} {add=[10040 (1428823517522034689)]} 0 1
[junit4:junit4]   2> 14043 T2662 C431 P53884 /update {wt=javabin&version=2} {add=[40 (1428823517522034688)]} 0 3
[junit4:junit4]   2> 14043 T2663 C431 P53884 /update {wt=javabin&version=2} {add=[10040 (1428823517522034689)]} 0 3
[junit4:junit4]   2> 14079 T2649 oascc.ZkStateReader.updateClusterState Updating cloud state from ZooKeeper... 
[junit4:junit4]   2> 14079 T2649 oasc.Overseer$ClusterStateUpdater.updateState Update state numShards=null message={
[junit4:junit4]   2> 	  "operation":"state",
[junit4:junit4]   2> 	  "core_node_name":"3",
[junit4:junit4]   2> 	  "shard":"shard1",
[junit4:junit4]   2> 	  "roles":null,
[junit4:junit4]   2> 	  "state":"down",
[junit4:junit4]   2> 	  "core":"collection1",
[junit4:junit4]   2> 	  "collection":"collection1",
[junit4:junit4]   2> 	  "node_name":"127.0.0.1:41872_",
[junit4:junit4]   2> 	  "base_url":"http://127.0.0.1:41872"}
[junit4:junit4]   2> 14083 T2668 oascc.ZkStateReader$2.process A cluster state change: WatchedEvent state:SyncConnected type:NodeDataChanged path:/clusterstate.json, has occurred - updating... (live nodes size: 3)
[junit4:junit4]   2> 14083 T2655 oascc.ZkStateReader$2.process A cluster state change: WatchedEvent state:SyncConnected type:NodeDataChanged path:/clusterstate.json, has occurred - updating... (live nodes size: 3)
[junit4:junit4]   2> 14083 T2648 oascc.ZkStateReader$2.process A cluster state change: WatchedEvent state:SyncConnected type:NodeDataChanged path:/clusterstate.json, has occurred - updating... (live nodes size: 3)
[junit4:junit4]   2> 14083 T2684 oascc.ZkStateReader$2.process A cluster state change: WatchedEvent state:SyncConnected type:NodeDataChanged path:/clusterstate.json, has occurred - updating... (live nodes size: 3)
[junit4:junit4]   2> 14109 T2641 C430 P46877 /update {wt=javabin&version=2} {delete=[38 (-1428823517593337857)]} 0 0
[junit4:junit4]   2> 14108 T2642 C430 P46877 /update {wt=javabin&version=2} {delete=[10038 (-1428823517593337856)]} 0 0
[junit4:junit4]   2> 14111 T2664 C431 P53884 /update {wt=javabin&version=2} {delete=[10038 (-1428823517596483585)]} 0 0
[junit4:junit4]   2> 14111 T2661 C431 P53884 /update {wt=javabin&version=2} {delete=[38 (-1428823517596483584)]} 0 0
[junit4:junit4]   2> 14114 T2644 C430 P46877 /update {wt=javabin&version=2} {add=[10041 (1428823517599629313)]} 0 0
[junit4:junit4]   2> 14114 T2643 C430 P46877 /update {wt=javabin&version=2} {add=[41 (1428823517599629312)]} 0 0
[junit4:junit4]   2> 14117 T2662 C431 P53884 /update {wt=javabin&version=2} {add=[10041 (1428823517601726465)]} 0 1
[junit4:junit4]   2> 14117 T2663 C431 P53884 /update {wt=javabin&version=2} {add=[41 (1428823517601726464)]} 0 1
[junit4:junit4]   2> 14126 T2641 C430 P46877 /update {wt=javabin&version=2} {delete=[10039 (-1428823517612212225)]} 0 0
[junit4:junit4]   2> 14126 T2642 C430 P46877 /update {wt=javabin&version=2} {delete=[39 (-1428823517612212224)]} 0 0
[junit4:junit4]   2> 14129 T2664 C431 P53884 /update {wt=javabin&version=2} {delete=[39 (-1428823517615357952)]} 0 0
[junit4:junit4]   2> 14129 T2661 C431 P53884 /update {wt=javabin&version=2} {delete=[10039 (-1428823517615357953)]} 0 0
[junit4:junit4]   2> 14132 T2644 C430 P46877 /update {wt=javabin&version=2} {add=[42 (1428823517617455105)]} 0 1
[junit4:junit4]   2> 14132 T2643 C430 P46877 /update {wt=javabin&version=2} {add=[10042 (1428823517617455104)]} 0 1
[junit4:junit4]   2> 14134 T2662 C431 P53884 /update {wt=javabin&version=2} {add=[10042 (1428823517620600833)]} 0 0
[junit4:junit4]   2> 14134 T2663 C431 P53884 /update {wt=javabin&version=2} {add=[42 (1428823517620600832)]} 0 0
[junit4:junit4]   2> 14154 T2642 C430 P46877 /update {wt=javabin&version=2} {add=[43 (1428823517640523776)]} 0 1
[junit4:junit4]   2> 14154 T2641 C430 P46877 /update {wt=javabin&version=2} {add=[10043 (1428823517640523777)]} 0 1
[junit4:junit4]   2> 14156 T2661 C431 P53884 /update {wt=javabin&version=2} {add=[43 (1428823517643669504)]} 0 0
[junit4:junit4]   2> 14156 T2664 C431 P53884 /update {wt=javabin&version=2} {add=[10043 (1428823517643669505)]} 0 0
[junit4:junit4]   2> 14212 T2643 C430 P46877 /update {wt=javabin&version=2} {delete=[10041 (-1428823517702389760)]} 0 0
[junit4:junit4]   2> 14212 T2644 C430 P46877 /update {wt=javabin&version=2} {delete=[41 (-1428823517702389761)]} 0 0
[junit4:junit4]   2> 14214 T2662 C431 P53884 /update {wt=javabin&version=2} {delete=[41 (-1428823517704486913)]} 0 0
[junit4:junit4]   2> 14214 T2663 C431 P53884 /update {wt=javabin&version=2} {delete=[10041 (-1428823517704486912)]} 0 0
[junit4:junit4]   2> 14217 T2642 C430 P46877 /update {wt=javabin&version=2} {add=[10044 (1428823517707632640)]} 0 0
[junit4:junit4]   2> 14217 T2641 C430 P46877 /update {wt=javabin&version=2} {add=[44 (1428823517707632641)]} 0 0
[junit4:junit4]   2> 14220 T2661 C431 P53884 /update {wt=javabin&version=2} {add=[10044 (1428823517710778368)]} 0 0
[junit4:junit4]   2> 14220 T2664 C431 P53884 /update {wt=javabin&version=2} {add=[44 (1428823517710778369)]} 0 0
[junit4:junit4]   2> 14302 T2644 C430 P46877 /update {wt=javabin&version=2} {add=[10045 (1428823517796761600)]} 0 0
[junit4:junit4]   2> 14303 T2643 C430 P46877 /update {wt=javabin&version=2} {add=[45 (1428823517796761601)]} 0 1
[junit4:junit4]   2> 14305 T2662 C431 P53884 /update {wt=javabin&version=2} {add=[10045 (1428823517799907328)]} 0 1
[junit4:junit4]   2> 14305 T2661 C431 P53884 /update {wt=javabin&version=2} {add=[45 (1428823517799907329)]} 0 0
[junit4:junit4]   2> 14389 T2642 C430 P46877 /update {wt=javabin&version=2} {delete=[10042 (-1428823517886939136)]} 0 1
[junit4:junit4]   2> 14389 T2641 C430 P46877 /update {wt=javabin&version=2} {delete=[42 (-1428823517886939137)]} 0 1
[junit4:junit4]   2> 14391 T2664 C431 P53884 /update {wt=javabin&version=2} {delete=[10042 (-1428823517890084865)]} 0 0
[junit4:junit4]   2> 14391 T2663 C431 P53884 /update {wt=javabin&version=2} {delete=[42 (-1428823517890084864)]} 0 0
[junit4:junit4]   2> 14394 T2644 C430 P46877 /update {wt=javabin&version=2} {add=[10046 (1428823517892182016)]} 0 1
[junit4:junit4]   2> 14394 T2643 C430 P46877 /update {wt=javabin&version=2} {add=[46 (1428823517892182017)]} 0 1
[junit4:junit4]   2> 14396 T2662 C431 P53884 /update {wt=javabin&version=2} {add=[10046 (1428823517895327744)]} 0 0
[junit4:junit4]   2> 14396 T2661 C431 P53884 /update {wt=javabin&version=2} {add=[46 (1428823517895327745)]} 0 0
[junit4:junit4]   2> 14407 T2641 C430 P46877 /update {wt=javabin&version=2} {delete=[45 (-1428823517906862081)]} 0 0
[junit4:junit4]   2> 14407 T2642 C430 P46877 /update {wt=javabin&version=2} {delete=[10045 (-1428823517906862080)]} 0 0
[junit4:junit4]   2> 14409 T2664 C431 P53884 /update {wt=javabin&version=2} {delete=[10045 (-1428823517908959233)]} 0 0
[junit4:junit4]   2> 14409 T2663 C431 P53884 /update {wt=javabin&version=2} {delete=[45 (-1428823517908959232)]} 0 0
[junit4:junit4]   2> 14412 T2644 C430 P46877 /update {wt=javabin&version=2} {add=[10047 (1428823517911056384)]} 0 1
[junit4:junit4]   2> 14412 T2643 C430 P46877 /update {wt=javabin&version=2} {add=[47 (1428823517911056385)]} 0 1
[junit4:junit4]   2> 14414 T2662 C431 P53884 /update {wt=javabin&version=2} {add=[10047 (1428823517914202112)]} 0 1
[junit4:junit4]   2> 14414 T2661 C431 P53884 /update {wt=javabin&version=2} {add=[47 (1428823517914202113)]} 0 0
[junit4:junit4]   2> 14419 T2642 C430 P46877 /update {wt=javabin&version=2} {delete=[10046 (-1428823517919444992)]} 0 0
[junit4:junit4]   2> 14419 T2644 C430 P46877 /update {wt=javabin&version=2} {delete=[46 (-1428823517919444993)]} 0 0
[junit4:junit4]   2> 14421 T2663 C431 P53884 /update {wt=javabin&version=2} {delete=[10046 (-1428823517921542144)]} 0 0
[junit4:junit4]   2> 14421 T2664 C431 P53884 /update {wt=javabin&version=2} {delete=[46 (-1428823517921542145)]} 0 0
[junit4:junit4]   2> 14424 T2641 C430 P46877 /update {wt=javabin&version=2} {add=[10048 (1428823517923639296)]} 0 1
[junit4:junit4]   2> 14424 T2643 C430 P46877 /update {wt=javabin&version=2} {add=[48 (1428823517923639297)]} 0 1
[junit4:junit4]   2> 14426 T2662 C431 P53884 /update {wt=javabin&version=2} {add=[10048 (1428823517926785024)]} 0 0
[junit4:junit4]   2> 14426 T2661 C431 P53884 /update {wt=javabin&version=2} {add=[48 (1428823517926785025)]} 0 0
[junit4:junit4]   2> 14505 T2642 C430 P46877 /update {wt=javabin&version=2} {add=[10049 (1428823518009622528)]} 0 0
[junit4:junit4]   2> 14505 T2644 C430 P46877 /update {wt=javabin&version=2} {add=[49 (1428823518009622529)]} 0 0
[junit4:junit4]   2> 14508 T2663 C431 P53884 /update {wt=javabin&version=2} {add=[10049 (1428823518012768256)]} 0 0
[junit4:junit4]   2> 14508 T2664 C431 P53884 /update {wt=javabin&version=2} {add=[49 (1428823518012768257)]} 0 0
[junit4:junit4]   2> 14522 T2641 C430 P46877 /update {wt=javabin&version=2} {add=[10050 (1428823518027448321)]} 0 0
[junit4:junit4]   2> 14523 T2643 C430 P46877 /update {wt=javabin&version=2} {add=[50 (1428823518027448320)]} 0 1
[junit4:junit4]   2> 14525 T2662 C431 P53884 /update {wt=javabin&version=2} {add=[50 (1428823518030594048)]} 0 0
[junit4:junit4]   2> 14525 T2661 C431 P53884 /update {wt=javabin&version=2} {add=[10050 (1428823518030594049)]} 0 0
[junit4:junit4]   2> 14540 T2644 C430 P46877 /update {wt=javabin&version=2} {add=[10051 (1428823518046322689)]} 0 0
[junit4:junit4]   2> 14540 T2642 C430 P46877 /update {wt=javabin&version=2} {add=[51 (1428823518046322688)]} 0 0
[junit4:junit4]   2> 14543 T2663 C431 P53884 /update {wt=javabin&version=2} {add=[51 (1428823518048419841)]} 0 1
[junit4:junit4]   2> 14543 T2664 C431 P53884 /update {wt=javabin&version=2} {add=[10051 (1428823518048419840)]} 0 1
[junit4:junit4]   2> 14557 T2643 C430 P46877 /update {wt=javabin&version=2} {add=[10052 (1428823518063099904)]} 0 1
[junit4:junit4]   2> 14557 T2641 C430 P46877 /update {wt=javabin&version=2} {add=[52 (1428823518063099905)]} 0 1
[junit4:junit4]   2> 14560 T2662 C431 P53884 /update {wt=javabin&version=2} {add=[10052 (1428823518066245632)]} 0 1
[junit4:junit4]   2> 14560 T2661 C431 P53884 /update {wt=javabin&version=2} {add=[52 (1428823518066245633)]} 0 1
[junit4:junit4]   2> 14633 T2642 C430 P46877 /update {wt=javabin&version=2} {add=[53 (1428823518142791680)]} 0 1
[junit4:junit4]   2> 14633 T2644 C430 P46877 /update {wt=javabin&version=2} {add=[10053 (1428823518142791681)]} 0 1
[junit4:junit4]   2> 14636 T2663 C431 P53884 /update {wt=javabin&version=2} {add=[53 (1428823518145937408)]} 0 1
[junit4:junit4]   2> 14636 T2664 C431 P53884 /update {wt=javabin&version=2} {add=[10053 (1428823518146985984)]} 0 1
[junit4:junit4]   2> 14673 T2643 C430 P46877 /update {wt=javabin&version=2} {add=[54 (1428823518185783296)]} 0 0
[junit4:junit4]   2> 14674 T2641 C430 P46877 /update {wt=javabin&version=2} {add=[10054 (1428823518185783297)]} 0 1
[junit4:junit4]   2> 14676 T2661 C431 P53884 /update {wt=javabin&version=2} {add=[54 (1428823518187880448)]} 0 1
[junit4:junit4]   2> 14676 T2662 C431 P53884 /update {wt=javabin&version=2} {add=[10054 (1428823518188929024)]} 0 1
[junit4:junit4]   2> 14752 T2642 C430 P46877 /update {wt=javabin&version=2} {add=[55 (1428823518267572225)]} 0 1
[junit4:junit4]   2> 14752 T2644 C430 P46877 /update {wt=javabin&version=2} {add=[10055 (1428823518267572224)]} 0 1
[junit4:junit4]   2> 14755 T2663 C431 P53884 /update {wt=javabin&version=2} {add=[55 (1428823518271766529)]} 0 0
[junit4:junit4]   2> 14755 T2664 C431 P53884 /update {wt=javabin&version=2} {add=[10055 (1428823518271766528)]} 0 0
[junit4:junit4]   2> 14768 T2643 C430 P46877 /update {wt=javabin&version=2} {add=[10056 (1428823518285398016)]} 0 0
[junit4:junit4]   2> 14768 T2641 C430 P46877 /update {wt=javabin&version=2} {add=[56 (1428823518285398017)]} 0 0
[junit4:junit4]   2> 14771 T2662 C431 P53884 /update {wt=javabin&version=2} {add=[56 (1428823518288543745)]} 0 0
[junit4:junit4]   2> 14771 T2661 C431 P53884 /update {wt=javabin&version=2} {add=[10056 (1428823518288543744)]} 0 1
[junit4:junit4]   2> 14813 T2644 C430 P46877 /update {wt=javabin&version=2} {add=[10057 (1428823518331535360)]} 0 2
[junit4:junit4]   2> 14813 T2642 C430 P46877 /update {wt=javabin&version=2} {add=[57 (1428823518331535361)]} 0 2
[junit4:junit4]   2> 14817 T2663 C431 P53884 /update {wt=javabin&version=2} {add=[57 (1428823518335729664)]} 0 1
[junit4:junit4]   2> 14817 T2664 C431 P53884 /update {wt=javabin&version=2} {add=[10057 (1428823518335729665)]} 0 1
[junit4:junit4]   2>  C429_STATE=coll:collection1 core:collection1 props:{shard=shard1, state=down, core=collection1, collection=collection1, node_name=127.0.0.1:41872_, base_url=http://127.0.0.1:41872}
[junit4:junit4]   2> 14824 T2687 C429 P41872 oasc.RecoveryStrategy.doRecovery Attempting to PeerSync from http://127.0.0.1:53884/collection1/ core=collection1 - recoveringAfterStartup=true
[junit4:junit4]   2> 14824 T2687 C429 P41872 oasu.PeerSync.sync PeerSync: core=collection1 url=http://127.0.0.1:41872 START replicas=[http://127.0.0.1:53884/collection1/] nUpdates=100
[junit4:junit4]   2> 14825 T2687 C429 P41872 oasu.PeerSync.sync WARNING no frame of reference to tell of we've missed updates
[junit4:junit4]   2> 14827 T2687 C429 P41872 oasc.RecoveryStrategy.doRecovery PeerSync Recovery was not successful - trying replication. core=collection1
[junit4:junit4]   2> 14827 T2687 C429 P41872 oasc.RecoveryStrategy.doRecovery Starting Replication Recovery. core=collection1
[junit4:junit4]   2> 14827 T2687 C429 P41872 oasc.RecoveryStrategy.doRecovery Begin buffering updates. core=collection1
[junit4:junit4]   2> 14828 T2687 C429 P41872 oasu.UpdateLog.bufferUpdates Starting to buffer updates. FSUpdateLog{state=ACTIVE, tlog=tlog{file=./org.apache.solr.cloud.RecoveryZkTest-1362632277302/jetty2/tlog/tlog.0000000000000000000 refcount=1}}
[junit4:junit4]   2> 14828 T2687 C429 P41872 oasc.RecoveryStrategy.replicate Attempting to replicate from http://127.0.0.1:53884/collection1/. core=collection1
[junit4:junit4]   2> 14828 T2687 C429 P41872 oascsi.HttpClientUtil.createClient Creating new http client, config:maxConnections=128&maxConnectionsPerHost=32&followRedirects=false
[junit4:junit4]   2> 14828 T2662 C431 P53884 REQ /get {getVersions=100&distrib=false&wt=javabin&qt=/get&version=2} status=0 QTime=1 
[junit4:junit4]   2> 14829 T2643 C430 P46877 /update {wt=javabin&version=2} {add=[58 (1428823518348312576)]} 0 1
[junit4:junit4]   2> 14830 T2644 C430 P46877 /update {wt=javabin&version=2} {add=[10058 (1428823518349361152)]} 0 1
[junit4:junit4]   2> 14832 T2661 C431 P53884 /update {wt=javabin&version=2} {add=[58 (1428823518352506880)]} 0 1
[junit4:junit4]   2> 14833 T2663 C431 P53884 /update {wt=javabin&version=2} {add=[10058 (1428823518353555456)]} 0 1
[junit4:junit4]   2> 14833 T2664 C431 P53884 oasu.DirectUpdateHandler2.commit start commit{,optimize=false,openSearcher=false,waitSearcher=true,expungeDeletes=false,softCommit=false,prepareCommit=false}
[junit4:junit4]   2> 14852 T2664 C431 P53884 oasc.SolrDeletionPolicy.onCommit SolrDeletionPolicy.onCommit: commits:num=2
[junit4:junit4]   2> 		commit{dir=MockDirWrapper(org.apache.lucene.store.RAMDirectory@6408e5ae lockFactory=org.apache.lucene.store.NativeFSLockFactory@1d062e74),segFN=segments_1,generation=1,filenames=[segments_1]
[junit4:junit4]   2> 		commit{dir=MockDirWrapper(org.apache.lucene.store.RAMDirectory@6408e5ae lockFactory=org.apache.lucene.store.NativeFSLockFactory@1d062e74),segFN=segments_2,generation=2,filenames=[_1.doc, _0.dvd, _0.dvm, _1.fnm, _1.pos, _0.nvd, _0.si, _1.tip, _0.doc, _1.tim, _1.nvm, _0.fnm, _1.nvd, _0_1.del, _0.nvm, _1_1.del, _1.fdx, _1.dvm, _0.pos, _1.fdt, _1.si, _0.tim, segments_2, _0.fdx, _1.dvd, _0.tip, _0.fdt]
[junit4:junit4]   2> 14852 T2664 C431 P53884 oasc.SolrDeletionPolicy.updateCommits newest commit = 2[_1.doc, _0.dvd, _0.dvm, _1.fnm, _1.pos, _0.nvd, _0.si, _1.tip, _0.doc, _1.tim, _1.nvm, _0.fnm, _1.nvd, _0_1.del, _0.nvm, _1_1.del, _1.fdx, _1.dvm, _0.pos, _1.fdt, _1.si, _0.tim, segments_2, _0.fdx, _1.dvd, _0.tip, _0.fdt]
[junit4:junit4]   2> 14854 T2664 C431 P53884 oass.SolrIndexSearcher.<init> Opening Searcher@5a4b9092 realtime
[junit4:junit4]   2> 14854 T2664 C431 P53884 oasu.DirectUpdateHandler2.commit end_commit_flush
[junit4:junit4]   2> 14854 T2664 C431 P53884 /update {waitSearcher=true&openSearcher=false&commit=true&wt=javabin&commit_end_point=true&version=2&softCommit=false} {commit=} 0 21
[junit4:junit4]   2> 14855 T2687 C429 P41872 oash.ReplicationHandler.inform Commits will be reserved for  10000
[junit4:junit4]   2> 14855 T2687 C429 P41872 oash.SnapPuller.<init>  No value set for 'pollInterval'. Timer Task not started.
[junit4:junit4]   2> 14857 T2661 C431 P53884 oash.ReplicationHandler.inform Commits will be reserved for  10000
[junit4:junit4]   2> 14857 T2661 C431 P53884 REQ /replication {command=indexversion&qt=/replication&wt=javabin&version=2} status=0 QTime=1 
[junit4:junit4]   2> 14858 T2687 C429 P41872 oash.SnapPuller.fetchLatestIndex Master's generation: 2
[junit4:junit4]   2> 14858 T2687 C429 P41872 oash.SnapPuller.fetchLatestIndex Slave's generation: 1
[junit4:junit4]   2> 14858 T2687 C429 P41872 oash.SnapPuller.fetchLatestIndex Starting replication process
[junit4:junit4]   2> 14860 T2663 C431 P53884 REQ /replication {command=filelist&qt=/replication&wt=javabin&generation=2&version=2} status=0 QTime=0 
[junit4:junit4]   2> 14860 T2687 C429 P41872 oash.SnapPuller.fetchLatestIndex Number of files in latest index in master: 27
[junit4:junit4]   2> 14862 T2687 C429 P41872 oasc.CachingDirectoryFactory.get return new directory for /mnt/ssd/jenkins/workspace/Lucene-Solr-trunk-Linux/solr/build/solr-core/test/J1/./org.apache.solr.cloud.RecoveryZkTest-1362632277302/jetty2/index.20130306205812159 forceNew: false
[junit4:junit4]   2> 14862 T2687 C429 P41872 oash.SnapPuller.fetchLatestIndex Starting download to MockDirWrapper(org.apache.lucene.store.SimpleFSDirectory@/mnt/ssd/jenkins/workspace/Lucene-Solr-trunk-Linux/solr/build/solr-core/test/J1/index3416734186tmp lockFactory=org.apache.lucene.store.NativeFSLockFactory@26eab82c) fullCopy=true
[junit4:junit4]   2> 14872 T2664 C431 P53884 REQ /replication {file=_1.doc&command=filecontent&checksum=true&wt=filestream&qt=/replication&generation=2} status=0 QTime=0 
[junit4:junit4]   2> 14875 T2662 C431 P53884 REQ /replication {file=_0.dvd&command=filecontent&checksum=true&wt=filestream&qt=/replication&generation=2} status=0 QTime=0 
[junit4:junit4]   2> 14878 T2661 C431 P53884 REQ /replication {file=_0.dvm&command=filecontent&checksum=true&wt=filestream&qt=/replication&generation=2} status=0 QTime=0 
[junit4:junit4]   2> 14881 T2663 C431 P53884 REQ /replication {file=_1.fnm&command=filecontent&checksum=true&wt=filestream&qt=/replication&generation=2} status=0 QTime=0 
[junit4:junit4]   2> 14884 T2664 C431 P53884 REQ /replication {file=_1.pos&command=filecontent&checksum=true&wt=filestream&qt=/replication&generation=2} status=0 QTime=0 
[junit4:junit4]   2> 14887 T2662 C431 P53884 REQ /replication {file=_0.nvd&command=filecontent&checksum=true&wt=filestream&qt=/replication&generation=2} status=0 QTime=0 
[junit4:junit4]   2> 14890 T2661 C431 P53884 REQ /replication {file=_0.si&command=filecontent&checksum=true&wt=filestream&qt=/replication&generation=2} status=0 QTime=0 
[junit4:junit4]   2> 14892 T2641 C430 P46877 /update {wt=javabin&version=2} {delete=[54 (-1428823518415421440)]} 0 1
[junit4:junit4]   2> 14892 T2642 C430 P46877 /update {wt=javabin&version=2} {delete=[10054 (-1428823518415421441)]} 0 0
[junit4:junit4]   2> 14892 T2663 C431 P53884 REQ /replication {file=_0.doc&command=filecontent&checksum=true&wt=filestream&qt=/replication&generation=2} status=0 QTime=0 
[junit4:junit4]   2> 14903 T2664 C431 P53884 /update {wt=javabin&version=2} {delete=[54 (-1428823518425907200)]} 0 1
[junit4:junit4]   2> 14903 T2662 C431 P53884 /update {wt=javabin&version=2} {delete=[10054 (-1428823518426955776)]} 0 0
[junit4:junit4]   2> 14905 T2661 C431 P53884 REQ /replication {file=_1.tip&command=filecontent&checksum=true&wt=filestream&qt=/replication&generation=2} status=0 QTime=0 
[junit4:junit4]   2> 14906 T2643 C430 P46877 /update {wt=javabin&version=2} {add=[59 (1428823518429052928)]} 0 1
[junit4:junit4]   2> 14906 T2644 C430 P46877 /update {wt=javabin&version=2} {add=[10059 (1428823518429052929)]} 0 1
[junit4:junit4]   2> 14909 T2663 C431 P53884 /update {wt=javabin&version=2} {add=[59 (1428823518432198656)]} 0 1
[junit4:junit4]   2> 14910 T2662 C431 P53884 /update {wt=javabin&version=2} {add=[10059 (1428823518433247232)]} 0 2
[junit4:junit4]   2> 14911 T2663 C431 P53884 REQ /replication {file=_1.tim&command=filecontent&checksum=true&wt=filestream&qt=/replication&generation=2} status=0 QTime=0 
[junit4:junit4]   2> 14914 T2664 C431 P53884 REQ /replication {file=_1.nvm&command=filecontent&checksum=true&wt=filestream&qt=/replication&generation=2} status=0 QTime=0 
[junit4:junit4]   2> 14918 T2661 C431 P53884 REQ /replication {file=_0.fnm&command=filecontent&checksum=true&wt=filestream&qt=/replication&generation=2} status=0 QTime=0 
[junit4:junit4]   2> 14919 T2641 C430 P46877 /update {wt=javabin&version=2} {add=[60 (1428823518442684416)]} 0 1
[junit4:junit4]   2> 14919 T2642 C430 P46877 /update {wt=javabin&version=2} {add=[10060 (1428823518442684417)]} 0 1
[junit4:junit4]   2> 14921 T2663 C431 P53884 REQ /replication {file=_1.nvd&command=filecontent&checksum=true&wt=filestream&qt=/replication&generation=2} status=0 QTime=0 
[junit4:junit4]   2> 14921 T2662 C431 P53884 /update {wt=javabin&version=2} {add=[60 (1428823518445830144)]} 0 0
[junit4:junit4]   2> 14922 T2664 C431 P53884 /update {wt=javabin&version=2} {add=[10060 (1428823518445830145)]} 0 1
[junit4:junit4]   2> 14925 T2661 C431 P53884 REQ /replication {file=_0_1.del&command=filecontent&checksum=true&wt=filestream&qt=/replication&generation=2} status=0 QTime=0 
[junit4:junit4]   2> 14928 T2662 C431 P53884 REQ /replication {file=_1_1.del&command=filecontent&checksum=true&wt=filestream&qt=/replication&generation=2} status=0 QTime=0 
[junit4:junit4]   2> 14944 T2644 C430 P46877 /update {wt=javabin&version=2} {add=[10061 (1428823518468898816)]} 0 1
[junit4:junit4]   2> 14944 T2643 C430 P46877 /update {wt=javabin&version=2} {add=[61 (1428823518468898817)]} 0 1
[junit4:junit4]   2> 14944 T2663 C431 P53884 REQ /replication {file=_0.nvm&command=filecontent&checksum=true&wt=filestream&qt=/replication&generation=2} status=0 QTime=0 
[junit4:junit4]   2> 14947 T2661 C431 P53884 /update {wt=javabin&version=2} {add=[61 (1428823518472044544)]} 0 1
[junit4:junit4]   2> 14947 T2664 C431 P53884 /update {wt=javabin&version=2} {add=[10061 (1428823518472044545)]} 0 1
[junit4:junit4]   2> 14948 T2662 C431 P53884 REQ /replication {file=_1.fdx&command=filecontent&checksum=true&wt=filestream&qt=/replication&generation=2} status=0 QTime=0 
[junit4:junit4]   2> 14952 T2663 C431 P53884 REQ /replication {file=_1.dvm&command=filecontent&checksum=true&wt=filestream&qt=/replication&generation=2} status=0 QTime=0 
[junit4:junit4]   2> 14955 T2661 C431 P53884 REQ /replication {file=_1.fdt&command=filecontent&checksum=true&wt=filestream&qt=/replication&generation=2} status=0 QTime=0 
[junit4:junit4]   2> 14959 T2664 C431 P53884 REQ /replication {file=_0.pos&command=filecontent&checksum=true&wt=filestream&qt=/replication&generation=2} status=0 QTime=1 
[junit4:junit4]   2> 14962 T2662 C431 P53884 REQ /replication {file=_1.si&command=filecontent&checksum=true&wt=filestream&qt=/replication&generation=2} status=0 QTime=0 
[junit4:junit4]   2> 14965 T2663 C431 P53884 REQ /replication {file=_0.tim&command=filecontent&checksum=true&wt=filestream&qt=/replication&generation=2} status=0 QTime=0 
[junit4:junit4]   2> 14993 T2661 C431 P53884 REQ /replication {file=segments_2&command=filecontent&checksum=true&wt=filestream&qt=/replication&generation=2} status=0 QTime=0 
[junit4:junit4]   2> 14997 T2664 C431 P53884 REQ /replication {file=_1.dvd&command=filecontent&checksum=true&wt=filestream&qt=/replication&generation=2} status=0 QTime=0 
[junit4:junit4]   2> 15000 T2662 C431 P53884 REQ /replication {file=_0.fdx&command=filecontent&checksum=true&wt=filestream&qt=/replication&generation=2} status=0 QTime=0 
[junit4:junit4]   2> 15001 T2641 C430 P46877 /update {wt=javabin&version=2} {add=[62 (1428823518529716224)]} 0 1
[junit4:junit4]   2> 15001 T2642 C430 P46877 /update {wt=javabin&version=2} {add=[10062 (1428823518529716225)]} 0 0
[junit4:junit4]   2> 15003 T2663 C431 P53884 REQ /replication {file=_0.tip&command=filecontent&checksum=true&wt=filestream&qt=/replication&generation=2} status=0 QTime=0 
[junit4:junit4]   2> 15004 T2661 C431 P53884 /update {wt=javabin&version=2} {add=[62 (1428823518532861952)]} 0 0
[junit4:junit4]   2> 15005 T2663 C431 P53884 /update {wt=javabin&version=2} {add=[10062 (1428823518533910528)]} 0 1
[junit4:junit4]   2> 15006 T2662 C431 P53884 REQ /replication {file=_0.fdt&command=filecontent&checksum=true&wt=filestream&qt=/replication&generation=2} status=0 QTime=0 
[junit4:junit4]   2> 15007 T2687 C429 P41872 oash.SnapPuller.fetchLatestIndex Total time taken for download : 0 secs
[junit4:junit4]   2> 15008 T2687 C429 P41872 oash.SnapPuller.modifyIndexProps New index installed. Updating index properties... index=index.20130306205812159
[junit4:junit4]   2> 15009 T2687 C429 P41872 oasu.DefaultSolrCoreState.newIndexWriter Creating new IndexWriter...
[junit4:junit4]   2> 15009 T2687 C429 P41872 oasu.DefaultSolrCoreState.newIndexWriter Waiting until IndexWriter is unused... core=collection1
[junit4:junit4]   2> 15009 T2687 C429 P41872 oasu.DefaultSolrCoreState.newIndexWriter Rollback old IndexWriter... core=collection1
[junit4:junit4]   2> 15010 T2687 C429 P41872 oasc.SolrCore.getNewIndexDir New index directory detected: old=./org.apache.solr.cloud.RecoveryZkTest-1362632277302/jetty2/index/ new=./org.apache.solr.cloud.RecoveryZkTest-1362632277302/jetty2/index.20130306205812159
[junit4:junit4]   2> 15015 T2687 C429 P41872 oasc.SolrDeletionPolicy.onInit SolrDeletionPolicy.onInit: commits:num=1
[junit4:junit4]   2> 		commit{dir=MockDirWrapper(org.apache.lucene.store.SimpleFSDirectory@/mnt/ssd/jenkins/workspace/Lucene-Solr-trunk-Linux/solr/build/solr-core/test/J1/index3416734186tmp lockFactory=org.apache.lucene.store.NativeFSLockFactory@26eab82c),segFN=segments_2,generation=2,filenames=[_1.doc, _0.dvd, _0.dvm, _1.fnm, _1.pos, _0.nvd, _0.si, _1.tip, _0.doc, _1.tim, _1.nvm, _0.fnm, _1.nvd, _0_1.del, _0.nvm, _1_1.del, _1.fdx, _1.dvm, _0.pos, _1.fdt, _1.si, _0.tim, segments_2, _0.fdx, _1.dvd, _0.tip, _0.fdt]
[junit4:junit4]   2> 15016 T2687 C429 P41872 oasc.SolrDeletionPolicy.updateCommits newest commit = 2[_1.doc, _0.dvd, _0.dvm, _1.fnm, _1.pos, _0.nvd, _0.si, _1.tip, _0.doc, _1.tim, _1.nvm, _0.fnm, _1.nvd, _0_1.del, _0.nvm, _1_1.del, _1.fdx, _1.dvm, _0.pos, _1.fdt, _1.si, _0.tim, segments_2, _0.fdx, _1.dvd, _0.tip, _0.fdt]
[junit4:junit4]   2> 15016 T2687 C429 P41872 oasu.DefaultSolrCoreState.newIndexWriter New IndexWriter is ready to be used.
[junit4:junit4]   2> 15020 T2687 C429 P41872 oass.SolrIndexSearcher.<init> Opening Searcher@696a4c24 main
[junit4:junit4]   2> 15021 T2686 oasc.SolrCore.registerSearcher [collection1] Registered new searcher Searcher@696a4c24 main{StandardDirectoryReader(segments_2:5:nrt _0(5.0):C79/34 _1(5.0):C37/16)}
[junit4:junit4]   2> 15021 T2687 C429 P41872 oash.SnapPuller$2.preClose removing old index files MockDirWrapper(org.apache.lucene.store.RAMDirectory@760ae648 lockFactory=org.apache.lucene.store.NativeFSLockFactory@28260725)
[junit4:junit4]   2> 15022 T2687 C429 P41872 oasc.CachingDirectoryFactory.closeDirectory Closing directory: /mnt/ssd/jenkins/workspace/Lucene-Solr-trunk-Linux/solr/build/solr-core/test/J1/./org.apache.solr.cloud.RecoveryZkTest-1362632277302/jetty2/index
[junit4:junit4]   2> 15022 T2687 C429 P41872 oash.SnapPuller$2.postClose removing old index directory MockDirWrapper(org.apache.lucene.store.RAMDirectory@760ae648 lockFactory=org.apache.lucene.store.NativeFSLockFactory@28260725)
[junit4:junit4]   2> 15022 T2687 C429 P41872 oasc.RecoveryStrategy.replay Replaying buffered documents. core=collection1
[junit4:junit4]   2> 15022 T2695 C429 P41872 oasu.UpdateLog$LogReplayer.doReplay WARNING Starting log replay tlog{file=./org.apache.solr.cloud.RecoveryZkTest-1362632277302/jetty2/tlog/tlog.0000000000000000000 refcount=2} active=true starting pos=4926
[junit4:junit4]   2> 15022 T2695 C429 P41872 oasu.DirectUpdateHandler2.commit start commit{flags=2,optimize=false,openSearcher=true,waitSearcher=true,expungeDeletes=false,softCommit=false,prepareCommit=false}
[junit4:junit4]   2> 15025 T2695 C429 P41872 oasc.SolrDeletionPolicy.onCommit SolrDeletionPolicy.onCommit: commits:num=2
[junit4:junit4]   2> 		commit{dir=MockDirWrapper(org.apache.lucene.store.SimpleFSDirectory@/mnt/ssd/jenkins/workspace/Lucene-Solr-trunk-Linux/solr/build/solr-core/test/J1/index3416734186tmp lockFactory=org.apache.lucene.store.NativeFSLockFactory@26eab82c),segFN=segments_2,generation=2,filenames=[_1.doc, _0.dvd, _0.dvm, _1.fnm, _1.pos, _0.nvd, _0.si, _1.tip, _0.doc, _1.tim, _1.nvm, _0.fnm, _1.nvd, _0_1.del, _0.nvm, _1_1.del, _1.fdx, _1.dvm, _0.pos, _1.fdt, _1.si, _0.tim, segments_2, _0.fdx, _1.dvd, _0.tip, _0.fdt]
[junit4:junit4]   2> 		commit{dir=MockDirWrapper(org.apache.lucene.store.SimpleFSDirectory@/mnt/ssd/jenkins/workspace/Lucene-Solr-trunk-Linux/solr/build/solr-core/test/J1/index3416734186tmp lockFactory=org.apache.lucene.store.NativeFSLockFactory@26eab82c),segFN=segments_3,generation=3,filenames=[_1.doc, _0.dvd, _0.dvm, _1.fnm, _1.pos, _0.nvd, _0.si, _1.tip, _0.doc, _1.tim, _1.nvm, _0.fnm, _1.nvd, _0_1.del, _0.nvm, _1_1.del, _1.fdx, _1.dvm, _0.pos, _1.fdt, _1.si, _0.tim, _0.fdx, _1.dvd, _0.tip, segments_3, _0.fdt]
[junit4:junit4]   2> 15025 T2695 C429 P41872 oasc.SolrDeletionPolicy.updateCommits newest commit = 3[_1.doc, _0.dvd, _0.dvm, _1.fnm, _1.pos, _0.nvd, _0.si, _1.tip, _0.doc, _1.tim, _1.nvm, _0.fnm, _1.nvd, _0_1.del, _0.nvm, _1_1.del, _1.fdx, _1.dvm, _0.pos, _1.fdt, _1.si, _0.tim, _0.fdx, _1.dvd, _0.tip, segments_3, _0.fdt]
[junit4:junit4]   2> 15026 T2695 C429 P41872 oass.SolrIndexSearcher.<init> Opening Searcher@4195c5bc main
[junit4:junit4]   2> 15026 T2695 C429 P41872 oasu.DirectUpdateHandler2.commit end_commit_flush
[junit4:junit4]   2> 15027 T2644 C430 P46877 /update {wt=javabin&version=2} {add=[63 (1428823518555930624)]} 0 1
[junit4:junit4]   2> 15027 T2643 C430 P46877 /update {wt=javabin&version=2} {add=[10063 (1428823518555930625)]} 0 1
[junit4:junit4]   2> 15027 T2686 oasc.SolrCore.registerSearcher [collection1] Registered new searcher Searcher@4195c5bc main{StandardDirectoryReader(segments_2:5:nrt _0(5.0):C79/34 _1(5.0):C37/16)}
[junit4:junit4]   2> 15028 T2695 C429 P41872 oasu.UpdateLog$LogReplayer.run WARNING Log replay finished. recoveryInfo=RecoveryInfo{adds=0 deletes=0 deleteByQuery=0 errors=0 positionOfStart=4926}
[junit4:junit4]   2> 15028 T2687 C429 P41872 oasc.RecoveryStrategy.doRecovery Replication Recovery was successful - registering as Active. core=collection1
[junit4:junit4]   2> 15028 T2687 C429 P41872 oasc.ZkController.publish publishing core=collection1 state=active
[junit4:junit4]   2> 15028 T2687 C429 P41872 oasc.ZkController.publish numShards not found on descriptor - reading it from system property
[junit4:junit4]   2> 15029 T2687 C429 P41872 oasc.RecoveryStrategy.doRecovery Finished recovery process. core=collection1
[junit4:junit4]   2> 15030 T2664 C431 P53884 /update {wt=javabin&version=2} {add=[63 (1428823518559076352)]} 0 1
[junit4:junit4]   2> 15030 T2661 C431 P53884 /update {wt=javabin&version=2} {add=[10063 (1428823518559076353)]} 0 1
[junit4:junit4]   2> 15091 T2641 C430 P46877 /update {wt=javabin&version=2} {add=[10064 (1428823518624088064)]} 0 1
[junit4:junit4]   2> 15091 T2642 C430 P46877 /update {wt=javabin&version=2} {add=[64 (1428823518624088065)]} 0 1
[junit4:junit4]   2> 15094 T2663 C431 P53884 /update {wt=javabin&version=2} {add=[10064 (1428823518626185216)]} 0 1
[junit4:junit4]   2> 15094 T2662 C431 P53884 /update {wt=javabin&version=2} {add=[64 (1428823518626185217)]} 0 1
[junit4:junit4]   2> 15162 T2644 C430 P46877 /update {wt=javabin&version=2} {delete=[57 (-1428823518697488384)]} 0 1
[junit4:junit4]   2> 15162 T2643 C430 P46877 /update {wt=javabin&version=2} {delete=[10057 (-1428823518697488385)]} 0 1
[junit4:junit4]   2> 15164 T2664 C431 P53884 /update {wt=javabin&version=2} {delete=[57 (-1428823518700634113)]} 0 0
[junit4:junit4]   2> 15164 T2661 C431 P53884 /update {wt=javabin&version=2} {delete=[10057 (-1428823518700634112)]} 0 0
[junit4:junit4]   2> 15166 T2641 C430 P46877 /update {wt=javabin&version=2} {add=[65 (1428823518702731265)]} 0 0
[junit4:junit4]   2> 15166 T2642 C430 P46877 /update {wt=javabin&version=2} {add=[10065 (1428823518702731264)]} 0 0
[junit4:junit4]   2> 15169 T2663 C431 P53884 /update {wt=javabin&version=2} {add=[10065 (1428823518705876992)]} 0 1
[junit4:junit4]   2> 15169 T2662 C431 P53884 /update {wt=javabin&version=2} {add=[65 (1428823518705876993)]} 0 1
[junit4:junit4]   2> 15236 T2643 C430 P46877 /update {wt=javabin&version=2} {add=[66 (1428823518776131584)]} 0 1
[junit4:junit4]   2> 15236 T2644 C430 P46877 /update {wt=javabin&version=2} {add=[10066 (1428823518776131585)]} 0 1
[junit4:junit4]   2> 15239 T2664 C431 P53884 /update {wt=javabin&version=2} {add=[66 (1428823518779277312)]} 0 1
[junit4:junit4]   2> 15239 T2661 C431 P53884 /update {wt=javabin&version=2} {add=[10066 (1428823518779277313)]} 0 1
[junit4:junit4]   2> 15246 T2642 C430 P46877 /update {wt=javabin&version=2} {add=[10067 (1428823518785568769)]} 0 1
[junit4:junit4]   2> 15246 T2641 C430 P46877 /update {wt=javabin&version=2} {add=[67 (1428823518785568768)]} 0 1
[junit4:junit4]   2> 15249 T2663 C431 P53884 /update {wt=javabin&version=2} {add=[10067 (1428823518788714496)]} 0 1
[junit4:junit4]   2> 15249 T2662 C431 P53884 /update {wt=javabin&version=2} {add=[67 (1428823518788714497)]} 0 1
[junit4:junit4]   2> 15259 T2643 C430 P46877 /update {wt=javabin&version=2} {add=[10068 (1428823518799200256)]} 0 1
[junit4:junit4]   2> 15259 T2644 C430 P46877 /update {wt=javabin&version=2} {add=[68 (1428823518799200257)]} 0 1
[junit4:junit4]   2> 15262 T2661 C431 P53884 /update {wt=javabin&version=2} {add=[68 (1428823518802345984)]} 0 1
[junit4:junit4]   2> 15262 T2664 C431 P53884 /update {wt=javabin&version=2} {add=[10068 (1428823518802345985)]} 0 1
[junit4:junit4]   2> 15356 T2642 C430 P46877 /update {wt=javabin&version=2} {delete=[60 (-1428823518901960704)]} 0 0
[junit4:junit4]   2> 15356 T2641 C430 P46877 /update {wt=javabin&version=2} {delete=[10060 (-1428823518901960705)]} 0 0
[junit4:junit4]   2> 15359 T2663 C431 P53884 /update {wt=javabin&version=2} {delete=[60 (-1428823518905106432)]} 0 0
[junit4:junit4]   2> 15359 T2661 C431 P53884 /update {wt=javabin&version=2} {delete=[10060 (-1428823518905106433)]} 0 0
[junit4:junit4]   2> 15370 T2643 C430 P46877 /update {wt=javabin&version=2} {add=[10069 (1428823518916640769)]} 0 0
[junit4:junit4]   2> 15370 T2644 C430 P46877 /update {wt=javabin&version=2} {add=[69 (1428823518916640768)]} 0 0
[junit4:junit4]   2> 15373 T2664 C431 P53884 /update {wt=javabin&version=2} {add=[10069 (1428823518918737920)]} 0 1
[junit4:junit4]   2> 15373 T2662 C431 P53884 /update {wt=javabin&version=2} {add=[69 (1428823518918737921)]} 0 1
[junit4:junit4]   2> 15426 T2642 C430 P46877 /update {wt=javabin&version=2} {delete=[62 (-1428823518975361024)]} 0 0
[junit4:junit4]   2> 15426 T2641 C430 P46877 /update {wt=javabin&version=2} {delete=[10062 (-1428823518975361025)]} 0 0
[junit4:junit4]   2> 15429 T2663 C431 P53884 /update {wt=javabin&version=2} {delete=[62 (-1428823518978506752)]} 0 0
[junit4:junit4]   2> 15429 T2661 C431 P53884 /update {wt=javabin&version=2} {delete=[10062 (-1428823518978506753)]} 0 0
[junit4:junit4]   2> 15432 T2643 C430 P46877 /update {wt=javabin&version=2} {add=[70 (1428823518980603904)]} 0 1
[junit4:junit4]   2> 15432 T2644 C430 P46877 /update {wt=javabin&version=2} {add=[10070 (1428823518980603905)]} 0 1
[junit4:junit4]   2> 15434 T2664 C431 P53884 /update {wt=javabin&version=2} {add=[70 (1428823518983749632)]} 0 1
[junit4:junit4]   2> 15435 T2662 C431 P53884 /update {wt=javabin&version=2} {add=[10070 (1428823518983749633)]} 0 1
[junit4:junit4]   2> 15498 T2642 C430 P46877 /update {wt=javabin&version=2} {delete=[64 (-1428823519049809920)]} 0 1
[junit4:junit4]   2> 15498 T2641 C430 P46877 /update {wt=javabin&version=2} {delete=[10064 (-1428823519050858496)]} 0 0
[junit4:junit4]   2> 15500 T2663 C431 P53884 /update {wt=javabin&version=2} {delete=[64 (-1428823519052955648)]} 0 0
[junit4:junit4]   2> 15500 T2661 C431 P53884 /update {wt=javabin&version=2} {delete=[10064 (-1428823519052955649)]} 0 0
[junit4:junit4]   2> 15502 T2643 C430 P46877 /update {wt=javabin&version=2} {add=[71 (1428823519055052800)]} 0 0
[junit4:junit4]   2> 15503 T2644 C430 P46877 /update {wt=javabin&version=2} {add=[10071 (1428823519055052801)]} 0 1
[junit4:junit4]   2> 15505 T2664 C431 P53884 /update {wt=javabin&version=2} {add=[10071 (1428823519058198529)]} 0 1
[junit4:junit4]   2> 15505 T2662 C431 P53884 /update {wt=javabin&version=2} {add=[71 (1428823519058198528)]} 0 1
[junit4:junit4]   2> 15514 T2642 C430 P46877 /update {wt=javabin&version=2} {add=[10072 (1428823519067635713)]} 0 1
[junit4:junit4]   2> 15514 T2641 C430 P46877 /update {wt=javabin&version=2} {add=[72 (1428823519067635712)]} 0 1
[junit4:junit4]   2> 15518 T2663 C431 P53884 /update {wt=javabin&version=2} {add=[10072 (1428823519070781440)]} 0 1
[junit4:junit4]   2> 15518 T2661 C431 P53884 /update {wt=javabin&version=2} {add=[72 (1428823519070781441)]} 0 1
[junit4:junit4]   2> 15588 T2649 oascc.ZkStateReader.updateClusterState Updating cloud state from ZooKeeper... 
[junit4:junit4]   2> 15589 T2649 oasc.Overseer$ClusterStateUpdater.updateState Update state numShards=1 message={
[junit4:junit4]   2> 	  "operation":"state",
[junit4:junit4]   2> 	  "core_node_name":"3",
[junit4:junit4]   2> 	  "numShards":"1",
[junit4:junit4]   2> 	  "shard":"shard1",
[junit4:junit4]   2> 	  "roles":null,
[junit4:junit4]   2> 	  "state":"active",
[junit4:junit4]   2> 	  "core":"collection1",
[junit4:junit4]   2> 	  "collection":"collection1",
[junit4:junit4]   2> 	  "node_name":"127.0.0.1:41872_",
[junit4:junit4]   2> 	  "base_url":"http://127.0.0.1:41872"}
[junit4:junit4]   2> 15593 T2644 C430 P46877 /update {wt=javabin&version=2} {delete=[70 (-1428823519150473217)]} 0 1
[junit4:junit4]   2> 15593 T2643 C430 P46877 /update {wt=javabin&version=2} {delete=[10070 (-1428823519150473216)]} 0 1
[junit4:junit4]   2> 15594 T2668 oascc.ZkStateReader$2.process A cluster state change: WatchedEvent state:SyncConnected type:NodeDataChanged path:/clusterstate.json, has occurred - updating... (live nodes size: 3)
[junit4:junit4]   2> 15594 T2648 oascc.ZkStateReader$2.process A cluster state change: WatchedEvent state:SyncConnected type:NodeDataChanged path:/clusterstate.json, has occurred - updating... (live nodes size: 3)
[junit4:junit4]   2> 15594 T2684 oascc.ZkStateReader$2.process A cluster state change: WatchedEvent state:SyncConnected type:NodeDataChanged path:/clusterstate.json, has occurred - updating... (live nodes size: 3)
[junit4:junit4]   2> 15594 T2655 oascc.ZkStateReader$2.process A cluster state change: WatchedEvent state:SyncConnected type:NodeDataChanged path:/clusterstate.json, has occurred - updating... (live nodes size: 3)
[junit4:junit4]   2>  C429_STATE=coll:collection1 core:collection1 props:{shard=shard1, state=active, core=collection1, collection=collection1, node_name=127.0.0.1:41872_, base_url=http://127.0.0.1:41872}
[junit4:junit4]   2> 15597 T2679 C429 P41872 /update {distrib.from=http://127.0.0.1:53884/collection1/&update.distrib=FROMLEADER&wt=javabin&version=2} {delete=[70 (-1428823519152570368)]} 0 0
[junit4:junit4]   2> 15597 T2678 C429 P41872 /update {distrib.from=http://127.0.0.1:53884/collection1/&update.distrib=FROMLEADER&wt=javabin&version=2} {delete=[10070 (-1428823519152570369)]} 0 0
[junit4:junit4]   2> 15598 T2662 C431 P53884 /update {wt=javabin&version=2} {delete=[10070 (-1428823519152570369)]} 0 3
[junit4:junit4]   2> 15598 T2664 C431 P53884 /update {wt=javabin&version=2} {delete=[70 (-1428823519152570368)]} 0 3
[junit4:junit4]   2> 15601 T2642 C430 P46877 /update {wt=javabin&version=2} {add=[10073 (1428823519157813248)]} 0 1
[junit4:junit4]   2> 15601 T2641 C430 P46877 /update {wt=javabin&version=2} {add=[73 (1428823519157813249)]} 0 1
[junit4:junit4]   2> 15606 T2680 C429 P41872 /update {distrib.from=http://127.0.0.1:53884/collection1/&update.distrib=FROMLEADER&wt=javabin&version=2} {add=[10073 (1428823519160958976)]} 0 1
[junit4:junit4]   2> 15606 T2677 C429 P41872 /update {distrib.from=http://127.0.0.1:53884/collection1/&update.distrib=FROMLEADER&wt=javabin&version=2} {add=[73 (1428823519160958977)]} 0 1
[junit4:junit4]   2> 15606 T2663 C431 P53884 /update {wt=javabin&version=2} {add=[10073 (1428823519160958976)]} 0 3
[junit4:junit4]   2> 15607 T2661 C431 P53884 /update {wt=javabin&version=2} {add=[73 (1428823519160958977)]} 0 4
[junit4:junit4]   2> 15642 T2644 C430 P46877 /update {wt=javabin&version=2} {add=[74 (1428823519200804864)]} 0 1
[junit4:junit4]   2> 15642 T2643 C430 P46877 /update {wt=javabin&version=2} {add=[10074 (1428823519200804865)]} 0 1
[junit4:junit4]   2> 15646 T2678 C429 P41872 /update {distrib.from=http://127.0.0.1:53884/collection1/&update.distrib=FROMLEADER&wt=javabin&version=2} {add=[10074 (1428823519203950592)]} 0 0
[junit4:junit4]   2> 15647 T2679 C429 P41872 /update {distrib.from=http://127.0.0.1:53884/collection1/&update.distrib=FROMLEADER&wt=javabin&version=2} {add=[74 (1428823519203950593)]} 0 1
[junit4:junit4]   2> 15647 T2662 C431 P53884 /update {wt=javabin&version=2} {add=[10074 (1428823519203950592)]} 0 3
[junit4:junit4]   2> 15647 T2664 C431 P53884 /update {wt=javabin&version=2} {add=[74 (1428823519203950593)]} 0 3
[junit4:junit4]   2> 15680 T2642 C430 P46877 /update {wt=javabin&version=2} {add=[10075 (1428823519241699328)]} 0 1
[junit4:junit4]   2> 15680 T2641 C430 P46877 /update {wt=javabin&version=2} {add=[75 (1428823519241699329)]} 0 1
[junit4:junit4]   2> 15685 T2680 C429 P41872 /update {distrib.from=http://127.0.0.1:53884/collection1/&update.distrib=FROMLEADER&wt=javabin&version=2} {add=[75 (1428823519243796481)]} 0 1
[junit4:junit4]   2> 15685 T2677 C429 P41872 /update {distrib.from=http://127.0.0.1:53884/collection1/&update.distrib=FROMLEADER&wt=javabin&version=2} {add=[10075 (1428823519243796480)]} 0 1
[junit4:junit4]   2> 15685 T2661 C431 P53884 /update {wt=javabin&version=2} {add=[75 (1428823519243796481)]} 0 3
[junit4:junit4]   2> 15686 T2663 C431 P53884 /update {wt=javabin&version=2} {add=[10075 (1428823519243796480)]} 0 4
[junit4:junit4]   2> 15726 T2643 C430 P46877 /update {wt=javabin&version=2} {delete=[73 (-1428823519289933825)]} 0 0
[junit4:junit4]   2> 15726 T2644 C430 P46877 /update {wt=javabin&version=2} {delete=[10073 (-1428823519289933824)]} 0 0
[junit4:junit4]   2> 15730 T2678 C429 P41872 /update {distrib.from=http://127.0.0.1:53884/collection1/&update.distrib=FROMLEADER&wt=javabin&version=2} {delete=[73 (-1428823519292030976)]} 0 0
[junit4:junit4]   2> 15731 T2679 C429 P41872 /update {distrib.from=http://127.0.0.1:53884/collection1/&update.distrib=FROMLEADER&wt=javabin&version=2} {delete=[10073 (-1428823519293079552)]} 0 1
[junit4:junit4]   2> 15731 T2662 C431 P53884 /update {wt=javabin&version=2} {delete=[73 (-1428823519292030976)]} 0 3
[junit4:junit4]   2> 15731 T2664 C431 P53884 /update {wt=javabin&version=2} {delete=[10073 (-1428823519293079552)]} 0 3
[junit4:junit4]   2> 15733 T2642 C430 P46877 /update {wt=javabin&version=2} {add=[76 (1428823519297273856)]} 0 0
[junit4:junit4]   2> 15734 T2641 C430 P46877 /update {wt=javabin&version=2} {add=[10076 (1428823519297273857)]} 0 1
[junit4:junit4]   2> 15738 T2680 C429 P41872 /update {distrib.from=http://127.0.0.1:53884/collection1/&update.distrib=FROMLEADER&wt=javabin&version=2} {add=[76 (1428823519300419584)]} 0 0
[junit4:junit4]   2> 15739 T2677 C429 P41872 /update {distrib.from=http://127.0.0.1:53884/collection1/&update.distrib=FROMLEADER&wt=javabin&version=2} {add=[10076 (1428823519300419585)]} 0 1
[junit4:junit4]   2> 15739 T2661 C431 P53884 /update {wt=javabin&version=2} {add=[76 (1428823519300419584)]} 0 4
[junit4:junit4]   2> 15739 T2663 C431 P53884 /update {wt=javabin&version=2} {add=[10076 (1428823519300419585)]} 0 3
[junit4:junit4]   2> 15745 T2643 C430 P46877 /update {wt=javabin&version=2} {add=[10077 (1428823519309856769)]} 0 1
[junit4:junit4]   2> 15745 T2644 C430 P46877 /update {wt=javabin&version=2} {add=[77 (1428823519309856768)]} 0 1
[junit4:junit4]   2> 15750 T2678 C429 P41872 /update {distrib.from=http://127.0.0.1:53884/collection1/&update.distrib=FROMLEADER&wt=javabin&version=2} {add=[77 (1428823519311953920)]} 0 1
[junit4:junit4]   2> 15750 T2679 C429 P41872 /update {distrib.from=http://127.0.0.1:53884/collection1/&update.distrib=FROMLEADER&wt=javabin&version=2} {add=[10077 (1428823519311953921)]} 0 1
[junit4:junit4]   2> 15750 T2662 C431 P53884 /update {wt=javabin&version=2} {add=[77 (1428823519311953920)]} 0 3
[junit4:junit4]   2> 15750 T2664 C431 P53884 /update {wt=javabin&version=2} {add=[10077 (1428823519311953921)]} 0 3
[junit4:junit4]   2> 15801 T2642 C430 P46877 /update {wt=javabin&version=2} {delete=[75 (-1428823519368577024)]} 0 0
[junit4:junit4]   2> 15801 T2641 C430 P46877 /update {wt=javabin&version=2} {delete=[10075 (-1428823519368577025)]} 0 0
[junit4:junit4]   2> 15805 T2680 C429 P41872 /update {distrib.from=http://127.0.0.1:53884/collection1/&update.distrib=FROMLEADER&wt=javabin&version=2} {delete=[10075 (-1428823519370674177)]} 0 0
[junit4:junit4]   2> 15805 T2677 C429 P41872 /update {distrib.from=http://127.0.0.1:53884/collection1/&update.distrib=FROMLEADER&wt=javabin&version=2} {delete=[75 (-1428823519370674176)]} 0 0
[junit4:junit4]   2> 15806 T2663 C431 P53884 /update {wt=javabin&version=2} {delete=[10075 (-1428823519370674177)]} 0 3
[junit4:junit4]   2> 15806 T2661 C431 P53884 /update {wt=javabin&version=2} {delete=[75 (-1428823519370674176)]} 0 3
[junit4:junit4]   2> 15808 T2643 C430 P46877 /update {wt=javabin&version=2} {add=[10078 (1428823519375917056)]} 0 0
[junit4:junit4]   2> 15809 T2644 C430 P46877 /update {wt=javabin&version=2} {add=[78 (1428823519375917057)]} 0 1
[junit4:junit4]   2> 15813 T2678 C429 P41872 /update {distrib.from=http://127.0.0.1:53884/collection1/&update.distrib=FROMLEADER&wt=javabin&version=2} {add=[78 (1428823519379062784)]} 0 0
[junit4:junit4]   2> 15813 T2679 C429 P41872 /update {distrib.from=http://127.0.0.1:53884/collection1/&update.distrib=FROMLEADER&wt=javabin&version=2} {add=[10078 (1428823519378014208)]} 0 0
[junit4:junit4]   2> 15814 T2662 C431 P53884 /update {wt=javabin&version=2} {add=[78 (1428823519379062784)]} 0 3
[junit4:junit4]   2> 15814 T2664 C431 P53884 /update {wt=javabin&version=2} {add=[10078 (1428823519378014208)]} 0 4
[junit4:junit4]   2> 15828 T2626 oasc.ZkController.publish publishing core=collection1 state=down
[junit4:junit4]   2> 15828 T2626 oasc.ZkController.publish numShards not found on descriptor - reading it from system property
[junit4:junit4]   2> 15832 T2626 oasc.SolrCore.close [collection1]  CLOSING SolrCore org.apache.solr.core.SolrCore@325358f5
[junit4:junit4]   2> 15839 T2641 C430 P46877 /update {wt=javabin&version=2} {add=[79 (1428823519407374337)]} 0 1
[junit4:junit4]   2> 15839 T2642 C430 P46877 /update {wt=javabin&version=2} {add=[10079 (1428823519407374336)]} 0 1
[junit4:junit4]   2> 15844 T2680 C429 P41872 /update {distrib.from=http://127.0.0.1:53884/collection1/&update.distrib=FROMLEADER&wt=javabin&version=2} {add=[10079 (1428823519410520064)]} 0 0
[junit4:junit4]   2> 15844 T2677 C429 P41872 /update {distrib.from=http://127.0.0.1:53884/collection1/&update.distrib=FROMLEADER&wt=javabin&version=2} {add=[79 (1428823519410520065)]} 0 0
[junit4:junit4]   2> 15845 T2661 C431 P53884 /update {wt=javabin&version=2} {add=[10079 (1428823519410520064)]} 0 4
[junit4:junit4]   2> 15845 T2677 C429 P41872 oasc.SolrCore.close [collection1]  CLOSING SolrCore org.apache.solr.core.SolrCore@325358f5
[junit4:junit4]   2> 15846 T2677 C429 P41872 oasc.SolrException.log SEVERE org.apache.solr.common.SolrException: Failed to unregister info bean: /get
[junit4:junit4]   2> 		at org.apache.solr.core.JmxMonitoredMap.unregister(JmxMonitoredMap.java:178)
[junit4:junit4]   2> 		at org.apache.solr.core.JmxMonitoredMap.clear(JmxMonitoredMap.java:116)
[junit4:junit4]   2> 		at org.apache.solr.core.SolrCore.close(SolrCore.java:959)
[junit4:junit4]   2> 		at org.apache.solr.servlet.SolrDispatchFilter.doFilter(SolrDispatchFilter.java:334)
[junit4:junit4]   2> 		at org.eclipse.jetty.servlet.ServletHandler$CachedChain.doFilter(ServletHandler.java:1307)
[junit4:junit4]   2> 		at org.apache.solr.client.solrj.embedded.JettySolrRunner$DebugFilter.doFilter(JettySolrRunner.java:135)
[junit4:junit4]   2> 		at org.eclipse.jetty.servlet.ServletHandler$CachedChain.doFilter(ServletHandler.java:1307)
[junit4:junit4]   2> 		at org.eclipse.jetty.servlet.ServletHandler.doHandle(ServletHandler.java:453)
[junit4:junit4]   2> 		at org.eclipse.jetty.server.session.SessionHandler.doHandle(SessionHandler.java:229)
[junit4:junit4]   2> 		at org.eclipse.jetty.server.handler.ScopedHandler.handle(ScopedHandler.java:137)
[junit4:junit4]   2> 		at org.eclipse.jetty.server.handler.GzipHandler.handle(GzipHandler.java:275)
[junit4:junit4]   2> 		at org.eclipse.jetty.server.handler.ContextHandler.doHandle(ContextHandler.java:1074)
[junit4:junit4]   2> 		at org.eclipse.jetty.servlet.ServletHandler.doScope(ServletHandler.java:382)
[junit4:junit4]   2> 		at org.eclipse.jetty.server.session.SessionHandler.doScope(SessionHandler.java:193)
[junit4:junit4]   2> 		at org.eclipse.jetty.server.handler.ContextHandler.doScope(ContextHandler.java:1006)
[junit4:junit4]   2> 		at org.eclipse.jetty.server.handler.ScopedHandler.handle(ScopedHandler.java:135)
[junit4:junit4]   2> 		at org.eclipse.jetty.server.handler.HandlerWrapper.handle(HandlerWrapper.java:116)
[junit4:junit4]   2> 		at org.eclipse.jetty.server.Server.handle(Server.java:365)
[junit4:junit4]   2> 		at org.eclipse.jetty.server.AbstractHttpConnection.handleRequest(AbstractHttpConnection.java:485)
[junit4:junit4]   2> 		at org.eclipse.jetty.server.AbstractHttpConnection.content(AbstractHttpConnection.java:937)
[junit4:junit4]   2> 		at org.eclipse.jetty.server.AbstractHttpConnection$RequestHandler.content(AbstractHttpConnection.java:998)
[junit4:junit4]   2> 		at org.eclipse.jetty.http.HttpParser.parseNext(HttpParser.java:948)
[junit4:junit4]   2> 		at org.eclipse.jetty.http.HttpParser.parseAvailable(HttpParser.java:240)
[junit4:junit4]   2> 		at org.eclipse.jetty.server.AsyncHttpConnection.handle(AsyncHttpConnection.java:82)
[junit4:junit4]   2> 		at org.eclipse.jetty.io.nio.SelectChannelEndPoint.handle(SelectChannelEndPoint.java:628)
[junit4:junit4]   2> 		at org.eclipse.jetty.io.nio.SelectChannelEndPoint$1.run(SelectChannelEndPoint.java:52)
[junit4:junit4]   2> 		at org.eclipse.jetty.util.thread.QueuedThreadPool.runJob(QueuedThreadPool.java:608)
[junit4:junit4]   2> 		at org.eclipse.jetty.util.thread.QueuedThreadPool$3.run(QueuedThreadPool.java:543)
[junit4:junit4]   2> 		at java.lang.Thread.run(Thread.java:662)
[junit4:junit4]   2> 	Caused by: javax.management.InstanceNotFoundException: solr/collection1:type=/get,id=org.apache.solr.handler.RealTimeGetHandler
[junit4:junit4]   2> 		at com.sun.jmx.interceptor.DefaultMBeanServerInterceptor.getMBean(DefaultMBeanServerInterceptor.java:1094)
[junit4:junit4]   2> 		at com.sun.jmx.interceptor.DefaultMBeanServerInterceptor.exclusiveUnregisterMBean(DefaultMBeanServerInterceptor.java:415)
[junit4:junit4]   2> 		at com.sun.jmx.interceptor.DefaultMBeanServerInterceptor.unregisterMBean(DefaultMBeanServerInterceptor.java:403)
[junit4:junit4]   2> 		at com.sun.jmx.mbeanserver.JmxMBeanServer.unregisterMBean(JmxMBeanServer.java:507)
[junit4:junit4]   2> 		at org.apache.solr.core.JmxMonitoredMap.unregister(JmxMonitoredMap.java:175)
[junit4:junit4]   2> 		... 28 more
[junit4:junit4]   2> 	
[junit4:junit4]   2> 15846 T2677 C429 P41872 oasu.DirectUpdateHandler2.close closing DirectUpdateHandler2{commits=1,autocommits=0,soft autocommits=0,optimizes=0,rollbacks=0,expungeDeletes=0,docsPending=14,adds=14,deletesById=6,deletesByQuery=0,errors=0,cumulative_adds=56,cumulative_deletesById=32,cumulative_deletesByQuery=0,cumulative_errors=0}
[junit4:junit4]   2> 15847 T2677 C429 P41872 oasu.SolrCoreState.decrefSolrCoreState Closing SolrCoreState
[junit4:junit4]   2> 15847 T2626 oasu.DirectUpdateHandler2.close closing DirectUpdateHandler2{commits=1,autocommits=0,soft autocommits=0,optimizes=0,rollbacks=0,expungeDeletes=0,docsPending=14,adds=14,deletesById=6,deletesByQuery=0,errors=0,cumulative_adds=56,cumulative_deletesById=32,cumulative_deletesByQuery=0,cumulative_errors=0}
[junit4:junit4]   2> 15847 T2677 C429 P41872 oasu.DefaultSolrCoreState.closeIndexWriter SolrCoreState ref count has reached 0 - closing IndexWriter
[junit4:junit4]   2> 15848 T2677 C429 P41872 oasu.DefaultSolrCoreState.closeIndexWriter closing IndexWriter with IndexWriterCloser
[junit4:junit4]   2> 15872 T2677 C429 P41872 oasc.SolrDeletionPolicy.onCommit SolrDeletionPolicy.onCommit: commits:num=2
[junit4:junit4]   2> 		commit{dir=MockDirWrapper(org.apache.lucene.store.SimpleFSDirectory@/mnt/ssd/jenkins/workspace/Lucene-Solr-trunk-Linux/solr/build/solr-core/test/J1/index3416734186tmp lockFactory=org.apache.lucene.store.NativeFSLockFactory@26eab82c),segFN=segments_3,generation=3,filenames=[_1.doc, _0.dvd, _0.dvm, _1.fnm, _1.pos, _0.nvd, _0.si, _1.tip, _0.doc, _1.tim, _1.nvm, _0.fnm, _1.nvd, _0_1.del, _0.nvm, _1_1.del, _1.fdx, _1.dvm, _0.pos, _1.fdt, _1.si, _0.tim, _0.fdx, _1.dvd, _0.tip, segments_3, _0.fdt]
[junit4:junit4]   2> 		commit{dir=MockDirWrapper(org.apache.lucene.store.SimpleFSDirectory@/mnt/ssd/jenkins/workspace/Lucene-Solr-trunk-Linux/solr/build/solr-core/test/J1/index3416734186tmp lockFactory=org.apache.lucene.store.NativeFSLockFactory@26eab82c),segFN=segments_4,generation=4,filenames=[_2.si, _2.dvm, _2.pos, _1.doc, _0.dvd, _0.dvm, _1.fnm, _2.doc, _2.tim, _1.pos, _0.nvd, _0.si, _2_1.del, _1.tip, _0.doc, _1.tim, _1.nvm, _0.fnm, _1.nvd, _2.fdt, _0_1.del, _0.nvm, _1_1.del, _2.fdx, _2.fnm, _2.tip, _1.fdx, _2.nvm, _1.dvm, _2.dvd, _0.pos, _1.fdt, _1.si, _2.nvd, _0.tim, _0.fdx, _1.dvd, _0.tip, _0.fdt, segments_4]
[junit4:junit4]   2> 15873 T2677 C429 P41872 oasc.SolrDeletionPolicy.updateCommits newest commit = 4[_2.si, _2.dvm, _2.pos, _1.doc, _0.dvd, _0.dvm, _1.fnm, _2.doc, _2.tim, _1.pos, _0.nvd, _0.si, _2_1.del, _1.tip, _0.doc, _1.tim, _1.nvm, _0.fnm, _1.nvd, _2.fdt, _0_1.del, _0.nvm, _1_1.del, _2.fdx, _2.fnm, _2.tip, _1.fdx, _2.nvm, _1.dvm, _2.dvd, _0.pos, _1.fdt, _1.si, _2.nvd, _0.tim, _0.fdx, _1.dvd, _0.tip, _0.fdt, segments_4]
[junit4:junit4]   2> 15874 T2677 C429 P41872 oasc.SolrCore.closeSearcher [collection1] Closing main searcher on request.
[junit4:junit4]   2> 15874 T2626 oasc.SolrCore.closeSearcher [collection1] Closing main searcher on request.
[junit4:junit4]   2> 15875 T2663 C431 P53884 /update {wt=javabin&version=2} {add=[79 (1428823519410520065)]} 0 34
[junit4:junit4]   2> 15875 T2631 oazs.PrepRequestProcessor.pRequest2Txn Processed session termination for sessionid: 0x13d43367d390008
[junit4:junit4]   2> 15876 T2668 oascc.ZkStateReader$2.process A cluster state change: WatchedEvent state:SyncConnected type:NodeChildrenChanged path:/live_nodes, has occurred - updating... (live nodes size: 3)
[junit4:junit4]   2> 15876 T2648 oascc.ZkStateReader$2.process A cluster state change: WatchedEvent state:SyncConnected type:NodeChildrenChanged path:/live_nodes, has occurred - updating... (live nodes size: 3)
[junit4:junit4]   2> 15877 T2628 oazs.NIOServerCnxn.closeSock Closed socket connection for client /127.0.0.1:36366 which had sessionid 0x13d43367d390008
[junit4:junit4]   2> 15877 T2626 oaz.ZooKeeper.close Session: 0x13d43367d390008 closed
[junit4:junit4]   2> 15877 T2655 oascc.ZkStateReader$3.process Updating live nodes... (2)
[junit4:junit4]   2> 15877 T2655 oascc.ZkStateReader$2.process A cluster state change: WatchedEvent state:SyncConnected type:NodeChildrenChanged path:/live_nodes, has occurred - updating... (live nodes size: 2)
[junit4:junit4]   2> 15878 T2648 oascc.ZkStateReader$3.process Updating live nodes... (2)
[junit4:junit4]   2> 15878 T2668 oascc.ZkStateReader$3.process Updating live nodes... (2)
[junit4:junit4]   2> 15888 T2643 C430 P46877 /update {wt=javabin&version=2} {delete=[10076 (-1428823519459803136)]} 0 0
[junit4:junit4]   2> 15891 T2662 C431 P53884 /update {wt=javabin&version=2} {delete=[10076 (-1428823519462948864)]} 0 1
[junit4:junit4]   2> 15893 T2644 C430 P46877 /update {wt=javabin&version=2} {add=[10080 (1428823519465046016)]} 0 1
[junit4:junit4]   2> 15896 T2664 C431 P53884 /update {wt=javabin&version=2} {add=[10080 (1428823519467143168)]} 0 1
[junit4:junit4]   2> 15922 T2626 oejsh.ContextHandler.doStop stopped o.e.j.s.ServletContextHandler{/,null}
[junit4:junit4]   2> 15924 T2641 C430 P46877 /update {wt=javabin&version=2} {delete=[76 (-1428823519497551872)]} 0 0
[junit4:junit4]   2> 15926 T2661 C431 P53884 /update {wt=javabin&version=2} {delete=[76 (-1428823519499649024)]} 0 0
[junit4:junit4]   2> 15928 T2642 C430 P46877 /update {wt=javabin&version=2} {add=[80 (1428823519501746176)]} 0 0
[junit4:junit4]   2> 15931 T2663 C431 P53884 /update {wt=javabin&version=2} {add=[80 (1428823519504891904)]} 0 0
[junit4:junit4]   2> 15959 T2643 C430 P46877 /update {wt=javabin&version=2} {add=[10081 (1428823519534252032)]} 0 0
[junit4:junit4]   2> 15962 T2662 C431 P53884 /update {wt=javabin&version=2} {add=[10081 (1428823519537397760)]} 0 0
[junit4:junit4]   2> 15995 T2644 C430 P46877 /update {wt=javabin&version=2} {add=[81 (1428823519572000768)]} 0 1
[junit4:junit4]   2> 15998 T2664 C431 P53884 /update {wt=javabin&version=2} {add=[81 (1428823519574097920)]} 0 1
[junit4:junit4]   2> 16030 T2641 C430 P46877 /update {wt=javabin&version=2} {delete=[10077 (-1428823519608700928)]} 0 1
[junit4:junit4]   2> 16032 T2661 C431 P53884 /update {wt=javabin&version=2} {delete=[10077 (-1428823519610798080)]} 0 0
[junit4:junit4]   2> 16034 T2642 C430 P46877 /update {wt=javabin&version=2} {add=[10082 (1428823519612895232)]} 0 0
[junit4:junit4]   2> 16037 T2663 C431 P53884 /update {wt=javabin&version=2} {add=[10082 (1428823519616040960)]} 0 1
[junit4:junit4]   2> 16065 T2643 C430 P46877 /update {wt=javabin&version=2} {delete=[77 (-1428823519645401088)]} 0 0
[junit4:junit4]   2> 16076 T2662 C431 P53884 /update {wt=javabin&version=2} {delete=[77 (-1428823519656935424)]} 0 0
[junit4:junit4]   2> 16079 T2641 C430 P46877 /update {wt=javabin&version=2} {add=[82 (1428823519660081152)]} 0 0
[junit4:junit4]   2> 16082 T2664 C431 P53884 /update {wt=javabin&version=2} {add=[82 (1428823519662178304)]} 0 1
[junit4:junit4]   2> 16119 T2642 C430 P46877 /update {wt=javabin&version=2} {delete=[10080 (-1428823519702024192)]} 0 0
[junit4:junit4]   2> 16122 T2661 C431 P53884 /update {wt=javabin&version=2} {delete=[10080 (-1428823519705169920)]} 0 0
[junit4:junit4]   2> 16124 T2644 C430 P46877 /update {wt=javabin&version=2} {add=[10083 (1428823519707267072)]} 0 0
[junit4:junit4]   2> 16127 T2663 C431 P53884 /update {wt=javabin&version=2} {add=[10083 (1428823519710412800)]} 0 1
[junit4:junit4]   2> 16164 T2643 C430 P46877 /update {wt=javabin&version=2} {delete=[80 (-1428823519749210112)]} 0 0
[junit4:junit4]   2> 16167 T2662 C431 P53884 /update {wt=javabin&version=2} {delete=[80 (-1428823519751307264)]} 0 1
[junit4:junit4]   2> 16169 T2641 C430 P46877 /update {wt=javabin&version=2} {add=[83 (1428823519754452992)]} 0 1
[junit4:junit4]   2> 16172 T2664 C431 P53884 /update {wt=javabin&version=2} {add=[83 (1428823519756550144)]} 0 1
[junit4:junit4]   2> 16175 T2626 oejs.Server.doStart jetty-8.1.8.v20121106
[junit4:junit4]   2> 16177 T2626 oejs.AbstractConnector.doStart Started SelectChannelConnector@127.0.0.1:41872
[junit4:junit4]   2> 16178 T2626 oass.SolrDispatchFilter.init SolrDispatchFilter.init()
[junit4:junit4]   2> 16178 T2626 oasc.SolrResourceLoader.locateSolrHome JNDI not configured for solr (NoInitialContextEx)
[junit4:junit4]   2> 16179 T2626 oasc.SolrResourceLoader.locateSolrHome using system property solr.solr.home: /mnt/ssd/jenkins/workspace/Lucene-Solr-trunk-Linux/solr/build/solr-core/test/J1/./org.apache.solr.cloud.RecoveryZkTest-jetty2-1362632285379
[junit4:junit4]   2> 16179 T2626 oasc.CoreContainer$Initializer.initialize looking for solr config file: /mnt/ssd/jenkins/workspace/Lucene-Solr-trunk-Linux/solr/build/solr-core/test/J1/./org.apache.solr.cloud.RecoveryZkTest-jetty2-1362632

[...truncated too long message...]

c. 1.6.0_41 (64-bit)/cpus=8,threads=3,free=30356288,total=142868480
[junit4:junit4]   2> NOTE: All tests run in this JVM: [TestFieldResource, TestRecovery, TestWordDelimiterFilterFactory, TestArbitraryIndexDir, TestBinaryField, DirectUpdateHandlerTest, SortByFunctionTest, SolrRequestParserTest, IndexReaderFactoryTest, TestCodecSupport, TestLuceneMatchVersion, DOMUtilTest, TestPropInject, TestHashPartitioner, TestMergePolicyConfig, EchoParamsTest, JSONWriterTest, TestCSVLoader, LeaderElectionIntegrationTest, TestIndexingPerformance, TestUpdate, HighlighterTest, TestFieldCollectionResource, IndexSchemaRuntimeFieldTest, DebugComponentTest, TestBM25SimilarityFactory, ConvertedLegacyTest, TestStressReorder, TestSolrDiscoveryProperties, FileUtilsTest, TestIndexSearcher, TimeZoneUtilsTest, OpenExchangeRatesOrgProviderTest, TestNumberUtils, NotRequiredUniqueKeyTest, UniqFieldsUpdateProcessorFactoryTest, DefaultValueUpdateProcessorTest, SolrIndexConfigTest, TestAtomicUpdateErrorCases, TestReload, IndexBasedSpellCheckerTest, UpdateParamsTest, TestFastOutputStream, SignatureUpdateProcessorFactoryTest, TestDistributedSearch, DistanceFunctionTest, DocValuesMultiTest, CurrencyFieldOpenExchangeTest, HardAutoCommitTest, SimplePostToolTest, TestZkChroot, OutputWriterTest, BasicDistributedZk2Test, FieldAnalysisRequestHandlerTest, FullSolrCloudDistribCmdsTest, OpenCloseCoreStressTest, TestPostingsSolrHighlighter, TestStressLucene, RequiredFieldsTest, TestDistributedGrouping, RequestHandlersTest, TermVectorComponentDistributedTest, BasicDistributedZkTest, SyncSliceTest, RecoveryZkTest]
[junit4:junit4]   2> NOTE: reproduce with: ant test  -Dtestcase=RecoveryZkTest -Dtests.seed=BF2EF6B2A3E4E73D -Dtests.multiplier=3 -Dtests.slow=true -Dtests.locale=zh_SG -Dtests.timezone=US/Pacific-New -Dtests.file.encoding=UTF-8
[junit4:junit4] ERROR   0.00s J1 | RecoveryZkTest (suite) <<<
[junit4:junit4]    > Throwable #1: com.carrotsearch.randomizedtesting.ResourceDisposalError: Resource in scope SUITE failed to close. Resource was registered from thread Thread[id=2685, name=coreLoadExecutor-2110-thread-1, state=RUNNABLE, group=TGRP-RecoveryZkTest], registration stack trace below.
[junit4:junit4]    > 	at java.lang.Thread.getStackTrace(Thread.java:1479)
[junit4:junit4]    > 	at com.carrotsearch.randomizedtesting.RandomizedContext.closeAtEnd(RandomizedContext.java:150)
[junit4:junit4]    > 	at org.apache.lucene.util.LuceneTestCase.closeAfterSuite(LuceneTestCase.java:520)
[junit4:junit4]    > 	at org.apache.lucene.util.LuceneTestCase.wrapDirectory(LuceneTestCase.java:986)
[junit4:junit4]    > 	at org.apache.lucene.util.LuceneTestCase.newDirectory(LuceneTestCase.java:878)
[junit4:junit4]    > 	at org.apache.lucene.util.LuceneTestCase.newDirectory(LuceneTestCase.java:870)
[junit4:junit4]    > 	at org.apache.solr.core.MockDirectoryFactory.create(MockDirectoryFactory.java:33)
[junit4:junit4]    > 	at org.apache.solr.core.CachingDirectoryFactory.get(CachingDirectoryFactory.java:266)
[junit4:junit4]    > 	at org.apache.solr.core.CachingDirectoryFactory.get(CachingDirectoryFactory.java:222)
[junit4:junit4]    > 	at org.apache.solr.core.SolrCore.getNewIndexDir(SolrCore.java:244)
[junit4:junit4]    > 	at org.apache.solr.core.SolrCore.initIndex(SolrCore.java:458)
[junit4:junit4]    > 	at org.apache.solr.core.SolrCore.<init>(SolrCore.java:733)
[junit4:junit4]    > 	at org.apache.solr.core.SolrCore.<init>(SolrCore.java:619)
[junit4:junit4]    > 	at org.apache.solr.core.CoreContainer.createFromZk(CoreContainer.java:874)
[junit4:junit4]    > 	at org.apache.solr.core.CoreContainer.create(CoreContainer.java:957)
[junit4:junit4]    > 	at org.apache.solr.core.CoreContainer$2.call(CoreContainer.java:580)
[junit4:junit4]    > 	at org.apache.solr.core.CoreContainer$2.call(CoreContainer.java:575)
[junit4:junit4]    > 	at java.util.concurrent.FutureTask$Sync.innerRun(FutureTask.java:303)
[junit4:junit4]    > 	at java.util.concurrent.FutureTask.run(FutureTask.java:138)
[junit4:junit4]    > 	at java.util.concurrent.Executors$RunnableAdapter.call(Executors.java:439)
[junit4:junit4]    > 	at java.util.concurrent.FutureTask$Sync.innerRun(FutureTask.java:303)
[junit4:junit4]    > 	at java.util.concurrent.FutureTask.run(FutureTask.java:138)
[junit4:junit4]    > 	at java.util.concurrent.ThreadPoolExecutor$Worker.runTask(ThreadPoolExecutor.java:895)
[junit4:junit4]    > 	at java.util.concurrent.ThreadPoolExecutor$Worker.run(ThreadPoolExecutor.java:918)
[junit4:junit4]    > 	at java.lang.Thread.run(Thread.java:662)
[junit4:junit4]    > Caused by: java.lang.AssertionError: Directory not closed: MockDirWrapper(org.apache.lucene.store.SimpleFSDirectory@/mnt/ssd/jenkins/workspace/Lucene-Solr-trunk-Linux/solr/build/solr-core/test/J1/index3416734185tmp lockFactory=org.apache.lucene.store.NativeFSLockFactory@6d74f3d4)
[junit4:junit4]    > 	at org.junit.Assert.fail(Assert.java:93)
[junit4:junit4]    > 	at org.apache.lucene.util.CloseableDirectory.close(CloseableDirectory.java:47)
[junit4:junit4]    > 	at com.carrotsearch.randomizedtesting.RandomizedRunner$2$1.apply(RandomizedRunner.java:602)
[junit4:junit4]    > 	at com.carrotsearch.randomizedtesting.RandomizedRunner$2$1.apply(RandomizedRunner.java:599)
[junit4:junit4]    > 	at com.carrotsearch.randomizedtesting.RandomizedContext.closeResources(RandomizedContext.java:167)
[junit4:junit4]    > 	at com.carrotsearch.randomizedtesting.RandomizedRunner$2.afterAlways(RandomizedRunner.java:615)
[junit4:junit4]    > 	at com.carrotsearch.randomizedtesting.rules.StatementAdapter.evaluate(StatementAdapter.java:43)
[junit4:junit4]    > 	at com.carrotsearch.randomizedtesting.ThreadLeakControl$StatementRunner.run(ThreadLeakControl.java:358)
[junit4:junit4]    > 	... 1 more
[junit4:junit4]    > Throwable #2: com.carrotsearch.randomizedtesting.ResourceDisposalError: Resource in scope SUITE failed to close. Resource was registered from thread Thread[id=2687, name=RecoveryThread, state=RUNNABLE, group=TGRP-RecoveryZkTest], registration stack trace below.
[junit4:junit4]    > 	at java.lang.Thread.getStackTrace(Thread.java:1479)
[junit4:junit4]    > 	at com.carrotsearch.randomizedtesting.RandomizedContext.closeAtEnd(RandomizedContext.java:150)
[junit4:junit4]    > 	at org.apache.lucene.util.LuceneTestCase.closeAfterSuite(LuceneTestCase.java:520)
[junit4:junit4]    > 	at org.apache.lucene.util.LuceneTestCase.wrapDirectory(LuceneTestCase.java:986)
[junit4:junit4]    > 	at org.apache.lucene.util.LuceneTestCase.newDirectory(LuceneTestCase.java:878)
[junit4:junit4]    > 	at org.apache.lucene.util.LuceneTestCase.newDirectory(LuceneTestCase.java:870)
[junit4:junit4]    > 	at org.apache.solr.core.MockDirectoryFactory.create(MockDirectoryFactory.java:33)
[junit4:junit4]    > 	at org.apache.solr.core.CachingDirectoryFactory.get(CachingDirectoryFactory.java:266)
[junit4:junit4]    > 	at org.apache.solr.core.CachingDirectoryFactory.get(CachingDirectoryFactory.java:222)
[junit4:junit4]    > 	at org.apache.solr.handler.SnapPuller.fetchLatestIndex(SnapPuller.java:383)
[junit4:junit4]    > 	at org.apache.solr.handler.ReplicationHandler.doFetch(ReplicationHandler.java:281)
[junit4:junit4]    > 	at org.apache.solr.cloud.RecoveryStrategy.replicate(RecoveryStrategy.java:153)
[junit4:junit4]    > 	at org.apache.solr.cloud.RecoveryStrategy.doRecovery(RecoveryStrategy.java:409)
[junit4:junit4]    > 	at org.apache.solr.cloud.RecoveryStrategy.run(RecoveryStrategy.java:223)
[junit4:junit4]    > Caused by: java.lang.AssertionError: Directory not closed: MockDirWrapper(org.apache.lucene.store.SimpleFSDirectory@/mnt/ssd/jenkins/workspace/Lucene-Solr-trunk-Linux/solr/build/solr-core/test/J1/index3416734186tmp lockFactory=org.apache.lucene.store.NativeFSLockFactory@26eab82c)
[junit4:junit4]    > 	at org.junit.Assert.fail(Assert.java:93)
[junit4:junit4]    > 	at org.apache.lucene.util.CloseableDirectory.close(CloseableDirectory.java:47)
[junit4:junit4]    > 	at com.carrotsearch.randomizedtesting.RandomizedRunner$2$1.apply(RandomizedRunner.java:602)
[junit4:junit4]    > 	at com.carrotsearch.randomizedtesting.RandomizedRunner$2$1.apply(RandomizedRunner.java:599)
[junit4:junit4]    > 	at com.carrotsearch.randomizedtesting.RandomizedContext.closeResources(RandomizedContext.java:167)
[junit4:junit4]    > 	at com.carrotsearch.randomizedtesting.RandomizedRunner$2.afterAlways(RandomizedRunner.java:615)
[junit4:junit4]    > 	at com.carrotsearch.randomizedtesting.rules.StatementAdapter.evaluate(StatementAdapter.java:43)
[junit4:junit4]    > 	at com.carrotsearch.randomizedtesting.ThreadLeakControl$StatementRunner.run(ThreadLeakControl.java:358)
[junit4:junit4]    > 	at java.lang.Thread.run(Thread.java:662)
[junit4:junit4] Completed on J1 in 37.23s, 1 test, 2 errors <<< FAILURES!

[...truncated 402 lines...]
BUILD FAILED
/mnt/ssd/jenkins/workspace/Lucene-Solr-trunk-Linux/build.xml:381: The following error occurred while executing this line:
/mnt/ssd/jenkins/workspace/Lucene-Solr-trunk-Linux/build.xml:361: The following error occurred while executing this line:
/mnt/ssd/jenkins/workspace/Lucene-Solr-trunk-Linux/build.xml:39: The following error occurred while executing this line:
/mnt/ssd/jenkins/workspace/Lucene-Solr-trunk-Linux/solr/build.xml:183: The following error occurred while executing this line:
/mnt/ssd/jenkins/workspace/Lucene-Solr-trunk-Linux/solr/common-build.xml:449: The following error occurred while executing this line:
/mnt/ssd/jenkins/workspace/Lucene-Solr-trunk-Linux/lucene/common-build.xml:1213: The following error occurred while executing this line:
/mnt/ssd/jenkins/workspace/Lucene-Solr-trunk-Linux/lucene/common-build.xml:877: There were test failures: 268 suites, 1134 tests, 2 suite-level errors, 13 ignored (7 assumptions)

Total time: 41 minutes 34 seconds
Build step 'Invoke Ant' marked build as failure
Archiving artifacts
Recording test results
Description set: Java: 64bit/jdk1.6.0_41 -XX:+UseConcMarkSweepGC
Email was triggered for: Failure
Sending email for trigger: Failure



Mime
View raw message