lucene-dev mailing list archives

Site index · List index
Message view « Date » · « Thread »
Top « Date » · « Thread »
From Policeman Jenkins Server <jenk...@thetaphi.de>
Subject [JENKINS] Lucene-Solr-4.x-Linux (32bit/jdk1.8.0-ea-b79) - Build # 4574 - Still Failing!
Date Thu, 07 Mar 2013 07:16:38 GMT
Build: http://jenkins.thetaphi.de/job/Lucene-Solr-4.x-Linux/4574/
Java: 32bit/jdk1.8.0-ea-b79 -client -XX:+UseSerialGC

3 tests failed.
FAILED:  org.apache.solr.cloud.UnloadDistributedZkTest.testDistribSearch

Error Message:
Still found shard

Stack Trace:
java.lang.AssertionError: Still found shard
	at __randomizedtesting.SeedInfo.seed([E966CB0630F145B1:6880451E47AE258D]:0)
	at org.junit.Assert.fail(Assert.java:93)
	at org.apache.solr.cloud.UnloadDistributedZkTest.testUnloadShardAndCollection(UnloadDistributedZkTest.java:124)
	at org.apache.solr.cloud.UnloadDistributedZkTest.doTest(UnloadDistributedZkTest.java:77)
	at org.apache.solr.BaseDistributedSearchTestCase.testDistribSearch(BaseDistributedSearchTestCase.java:806)
	at sun.reflect.NativeMethodAccessorImpl.invoke0(Native Method)
	at sun.reflect.NativeMethodAccessorImpl.invoke(NativeMethodAccessorImpl.java:57)
	at sun.reflect.DelegatingMethodAccessorImpl.invoke(DelegatingMethodAccessorImpl.java:43)
	at java.lang.reflect.Method.invoke(Method.java:487)
	at com.carrotsearch.randomizedtesting.RandomizedRunner.invoke(RandomizedRunner.java:1559)
	at com.carrotsearch.randomizedtesting.RandomizedRunner.access$600(RandomizedRunner.java:79)
	at com.carrotsearch.randomizedtesting.RandomizedRunner$6.evaluate(RandomizedRunner.java:737)
	at com.carrotsearch.randomizedtesting.RandomizedRunner$7.evaluate(RandomizedRunner.java:773)
	at com.carrotsearch.randomizedtesting.RandomizedRunner$8.evaluate(RandomizedRunner.java:787)
	at com.carrotsearch.randomizedtesting.rules.SystemPropertiesRestoreRule$1.evaluate(SystemPropertiesRestoreRule.java:53)
	at org.apache.lucene.util.TestRuleSetupTeardownChained$1.evaluate(TestRuleSetupTeardownChained.java:50)
	at org.apache.lucene.util.TestRuleFieldCacheSanity$1.evaluate(TestRuleFieldCacheSanity.java:51)
	at org.apache.lucene.util.AbstractBeforeAfterRule$1.evaluate(AbstractBeforeAfterRule.java:46)
	at com.carrotsearch.randomizedtesting.rules.SystemPropertiesInvariantRule$1.evaluate(SystemPropertiesInvariantRule.java:55)
	at org.apache.lucene.util.TestRuleThreadAndTestName$1.evaluate(TestRuleThreadAndTestName.java:49)
	at org.apache.lucene.util.TestRuleIgnoreAfterMaxFailures$1.evaluate(TestRuleIgnoreAfterMaxFailures.java:70)
	at org.apache.lucene.util.TestRuleMarkFailure$1.evaluate(TestRuleMarkFailure.java:48)
	at com.carrotsearch.randomizedtesting.rules.StatementAdapter.evaluate(StatementAdapter.java:36)
	at com.carrotsearch.randomizedtesting.ThreadLeakControl$StatementRunner.run(ThreadLeakControl.java:358)
	at com.carrotsearch.randomizedtesting.ThreadLeakControl.forkTimeoutingTask(ThreadLeakControl.java:782)
	at com.carrotsearch.randomizedtesting.ThreadLeakControl$3.evaluate(ThreadLeakControl.java:442)
	at com.carrotsearch.randomizedtesting.RandomizedRunner.runSingleTest(RandomizedRunner.java:746)
	at com.carrotsearch.randomizedtesting.RandomizedRunner$3.evaluate(RandomizedRunner.java:648)
	at com.carrotsearch.randomizedtesting.RandomizedRunner$4.evaluate(RandomizedRunner.java:682)
	at com.carrotsearch.randomizedtesting.RandomizedRunner$5.evaluate(RandomizedRunner.java:693)
	at com.carrotsearch.randomizedtesting.rules.StatementAdapter.evaluate(StatementAdapter.java:36)
	at com.carrotsearch.randomizedtesting.rules.SystemPropertiesRestoreRule$1.evaluate(SystemPropertiesRestoreRule.java:53)
	at org.apache.lucene.util.AbstractBeforeAfterRule$1.evaluate(AbstractBeforeAfterRule.java:46)
	at org.apache.lucene.util.TestRuleStoreClassName$1.evaluate(TestRuleStoreClassName.java:42)
	at com.carrotsearch.randomizedtesting.rules.SystemPropertiesInvariantRule$1.evaluate(SystemPropertiesInvariantRule.java:55)
	at com.carrotsearch.randomizedtesting.rules.NoShadowingOrOverridesOnMethodsRule$1.evaluate(NoShadowingOrOverridesOnMethodsRule.java:39)
	at com.carrotsearch.randomizedtesting.rules.NoShadowingOrOverridesOnMethodsRule$1.evaluate(NoShadowingOrOverridesOnMethodsRule.java:39)
	at com.carrotsearch.randomizedtesting.rules.StatementAdapter.evaluate(StatementAdapter.java:36)
	at org.apache.lucene.util.TestRuleAssertionsRequired$1.evaluate(TestRuleAssertionsRequired.java:43)
	at org.apache.lucene.util.TestRuleMarkFailure$1.evaluate(TestRuleMarkFailure.java:48)
	at org.apache.lucene.util.TestRuleIgnoreAfterMaxFailures$1.evaluate(TestRuleIgnoreAfterMaxFailures.java:70)
	at org.apache.lucene.util.TestRuleIgnoreTestSuites$1.evaluate(TestRuleIgnoreTestSuites.java:55)
	at com.carrotsearch.randomizedtesting.rules.StatementAdapter.evaluate(StatementAdapter.java:36)
	at com.carrotsearch.randomizedtesting.ThreadLeakControl$StatementRunner.run(ThreadLeakControl.java:358)
	at java.lang.Thread.run(Thread.java:722)


FAILED:  org.apache.solr.rest.TestFieldCollectionResource.testJsonGetAllFields

Error Message:
mismatch: 'custstopfilt'!='dedup' @ fields/[0]/name

Stack Trace:
java.lang.RuntimeException: mismatch: 'custstopfilt'!='dedup' @ fields/[0]/name
	at __randomizedtesting.SeedInfo.seed([E966CB0630F145B1:6066B98A90420997]:0)
	at org.apache.solr.util.RestTestBase.assertJQ(RestTestBase.java:242)
	at org.apache.solr.util.RestTestBase.assertJQ(RestTestBase.java:186)
	at org.apache.solr.rest.TestFieldCollectionResource.testJsonGetAllFields(TestFieldCollectionResource.java:50)
	at sun.reflect.NativeMethodAccessorImpl.invoke0(Native Method)
	at sun.reflect.NativeMethodAccessorImpl.invoke(NativeMethodAccessorImpl.java:57)
	at sun.reflect.DelegatingMethodAccessorImpl.invoke(DelegatingMethodAccessorImpl.java:43)
	at java.lang.reflect.Method.invoke(Method.java:487)
	at com.carrotsearch.randomizedtesting.RandomizedRunner.invoke(RandomizedRunner.java:1559)
	at com.carrotsearch.randomizedtesting.RandomizedRunner.access$600(RandomizedRunner.java:79)
	at com.carrotsearch.randomizedtesting.RandomizedRunner$6.evaluate(RandomizedRunner.java:737)
	at com.carrotsearch.randomizedtesting.RandomizedRunner$7.evaluate(RandomizedRunner.java:773)
	at com.carrotsearch.randomizedtesting.RandomizedRunner$8.evaluate(RandomizedRunner.java:787)
	at com.carrotsearch.randomizedtesting.rules.SystemPropertiesRestoreRule$1.evaluate(SystemPropertiesRestoreRule.java:53)
	at org.apache.lucene.util.TestRuleSetupTeardownChained$1.evaluate(TestRuleSetupTeardownChained.java:50)
	at org.apache.lucene.util.TestRuleFieldCacheSanity$1.evaluate(TestRuleFieldCacheSanity.java:51)
	at org.apache.lucene.util.AbstractBeforeAfterRule$1.evaluate(AbstractBeforeAfterRule.java:46)
	at com.carrotsearch.randomizedtesting.rules.SystemPropertiesInvariantRule$1.evaluate(SystemPropertiesInvariantRule.java:55)
	at org.apache.lucene.util.TestRuleThreadAndTestName$1.evaluate(TestRuleThreadAndTestName.java:49)
	at org.apache.lucene.util.TestRuleIgnoreAfterMaxFailures$1.evaluate(TestRuleIgnoreAfterMaxFailures.java:70)
	at org.apache.lucene.util.TestRuleMarkFailure$1.evaluate(TestRuleMarkFailure.java:48)
	at com.carrotsearch.randomizedtesting.rules.StatementAdapter.evaluate(StatementAdapter.java:36)
	at com.carrotsearch.randomizedtesting.ThreadLeakControl$StatementRunner.run(ThreadLeakControl.java:358)
	at com.carrotsearch.randomizedtesting.ThreadLeakControl.forkTimeoutingTask(ThreadLeakControl.java:782)
	at com.carrotsearch.randomizedtesting.ThreadLeakControl$3.evaluate(ThreadLeakControl.java:442)
	at com.carrotsearch.randomizedtesting.RandomizedRunner.runSingleTest(RandomizedRunner.java:746)
	at com.carrotsearch.randomizedtesting.RandomizedRunner$3.evaluate(RandomizedRunner.java:648)
	at com.carrotsearch.randomizedtesting.RandomizedRunner$4.evaluate(RandomizedRunner.java:682)
	at com.carrotsearch.randomizedtesting.RandomizedRunner$5.evaluate(RandomizedRunner.java:693)
	at com.carrotsearch.randomizedtesting.rules.StatementAdapter.evaluate(StatementAdapter.java:36)
	at com.carrotsearch.randomizedtesting.rules.SystemPropertiesRestoreRule$1.evaluate(SystemPropertiesRestoreRule.java:53)
	at org.apache.lucene.util.AbstractBeforeAfterRule$1.evaluate(AbstractBeforeAfterRule.java:46)
	at org.apache.lucene.util.TestRuleStoreClassName$1.evaluate(TestRuleStoreClassName.java:42)
	at com.carrotsearch.randomizedtesting.rules.SystemPropertiesInvariantRule$1.evaluate(SystemPropertiesInvariantRule.java:55)
	at com.carrotsearch.randomizedtesting.rules.NoShadowingOrOverridesOnMethodsRule$1.evaluate(NoShadowingOrOverridesOnMethodsRule.java:39)
	at com.carrotsearch.randomizedtesting.rules.NoShadowingOrOverridesOnMethodsRule$1.evaluate(NoShadowingOrOverridesOnMethodsRule.java:39)
	at com.carrotsearch.randomizedtesting.rules.StatementAdapter.evaluate(StatementAdapter.java:36)
	at org.apache.lucene.util.TestRuleAssertionsRequired$1.evaluate(TestRuleAssertionsRequired.java:43)
	at org.apache.lucene.util.TestRuleMarkFailure$1.evaluate(TestRuleMarkFailure.java:48)
	at org.apache.lucene.util.TestRuleIgnoreAfterMaxFailures$1.evaluate(TestRuleIgnoreAfterMaxFailures.java:70)
	at org.apache.lucene.util.TestRuleIgnoreTestSuites$1.evaluate(TestRuleIgnoreTestSuites.java:55)
	at com.carrotsearch.randomizedtesting.rules.StatementAdapter.evaluate(StatementAdapter.java:36)
	at com.carrotsearch.randomizedtesting.ThreadLeakControl$StatementRunner.run(ThreadLeakControl.java:358)
	at java.lang.Thread.run(Thread.java:722)


FAILED:  org.apache.solr.rest.TestFieldCollectionResource.testGetAllFields

Error Message:
Exception during query

Stack Trace:
java.lang.RuntimeException: Exception during query
	at __randomizedtesting.SeedInfo.seed([E966CB0630F145B1:5C881C2CA02BC29]:0)
	at org.apache.solr.util.RestTestBase.assertQ(RestTestBase.java:143)
	at org.apache.solr.rest.TestFieldCollectionResource.testGetAllFields(TestFieldCollectionResource.java:26)
	at sun.reflect.NativeMethodAccessorImpl.invoke0(Native Method)
	at sun.reflect.NativeMethodAccessorImpl.invoke(NativeMethodAccessorImpl.java:57)
	at sun.reflect.DelegatingMethodAccessorImpl.invoke(DelegatingMethodAccessorImpl.java:43)
	at java.lang.reflect.Method.invoke(Method.java:487)
	at com.carrotsearch.randomizedtesting.RandomizedRunner.invoke(RandomizedRunner.java:1559)
	at com.carrotsearch.randomizedtesting.RandomizedRunner.access$600(RandomizedRunner.java:79)
	at com.carrotsearch.randomizedtesting.RandomizedRunner$6.evaluate(RandomizedRunner.java:737)
	at com.carrotsearch.randomizedtesting.RandomizedRunner$7.evaluate(RandomizedRunner.java:773)
	at com.carrotsearch.randomizedtesting.RandomizedRunner$8.evaluate(RandomizedRunner.java:787)
	at com.carrotsearch.randomizedtesting.rules.SystemPropertiesRestoreRule$1.evaluate(SystemPropertiesRestoreRule.java:53)
	at org.apache.lucene.util.TestRuleSetupTeardownChained$1.evaluate(TestRuleSetupTeardownChained.java:50)
	at org.apache.lucene.util.TestRuleFieldCacheSanity$1.evaluate(TestRuleFieldCacheSanity.java:51)
	at org.apache.lucene.util.AbstractBeforeAfterRule$1.evaluate(AbstractBeforeAfterRule.java:46)
	at com.carrotsearch.randomizedtesting.rules.SystemPropertiesInvariantRule$1.evaluate(SystemPropertiesInvariantRule.java:55)
	at org.apache.lucene.util.TestRuleThreadAndTestName$1.evaluate(TestRuleThreadAndTestName.java:49)
	at org.apache.lucene.util.TestRuleIgnoreAfterMaxFailures$1.evaluate(TestRuleIgnoreAfterMaxFailures.java:70)
	at org.apache.lucene.util.TestRuleMarkFailure$1.evaluate(TestRuleMarkFailure.java:48)
	at com.carrotsearch.randomizedtesting.rules.StatementAdapter.evaluate(StatementAdapter.java:36)
	at com.carrotsearch.randomizedtesting.ThreadLeakControl$StatementRunner.run(ThreadLeakControl.java:358)
	at com.carrotsearch.randomizedtesting.ThreadLeakControl.forkTimeoutingTask(ThreadLeakControl.java:782)
	at com.carrotsearch.randomizedtesting.ThreadLeakControl$3.evaluate(ThreadLeakControl.java:442)
	at com.carrotsearch.randomizedtesting.RandomizedRunner.runSingleTest(RandomizedRunner.java:746)
	at com.carrotsearch.randomizedtesting.RandomizedRunner$3.evaluate(RandomizedRunner.java:648)
	at com.carrotsearch.randomizedtesting.RandomizedRunner$4.evaluate(RandomizedRunner.java:682)
	at com.carrotsearch.randomizedtesting.RandomizedRunner$5.evaluate(RandomizedRunner.java:693)
	at com.carrotsearch.randomizedtesting.rules.StatementAdapter.evaluate(StatementAdapter.java:36)
	at com.carrotsearch.randomizedtesting.rules.SystemPropertiesRestoreRule$1.evaluate(SystemPropertiesRestoreRule.java:53)
	at org.apache.lucene.util.AbstractBeforeAfterRule$1.evaluate(AbstractBeforeAfterRule.java:46)
	at org.apache.lucene.util.TestRuleStoreClassName$1.evaluate(TestRuleStoreClassName.java:42)
	at com.carrotsearch.randomizedtesting.rules.SystemPropertiesInvariantRule$1.evaluate(SystemPropertiesInvariantRule.java:55)
	at com.carrotsearch.randomizedtesting.rules.NoShadowingOrOverridesOnMethodsRule$1.evaluate(NoShadowingOrOverridesOnMethodsRule.java:39)
	at com.carrotsearch.randomizedtesting.rules.NoShadowingOrOverridesOnMethodsRule$1.evaluate(NoShadowingOrOverridesOnMethodsRule.java:39)
	at com.carrotsearch.randomizedtesting.rules.StatementAdapter.evaluate(StatementAdapter.java:36)
	at org.apache.lucene.util.TestRuleAssertionsRequired$1.evaluate(TestRuleAssertionsRequired.java:43)
	at org.apache.lucene.util.TestRuleMarkFailure$1.evaluate(TestRuleMarkFailure.java:48)
	at org.apache.lucene.util.TestRuleIgnoreAfterMaxFailures$1.evaluate(TestRuleIgnoreAfterMaxFailures.java:70)
	at org.apache.lucene.util.TestRuleIgnoreTestSuites$1.evaluate(TestRuleIgnoreTestSuites.java:55)
	at com.carrotsearch.randomizedtesting.rules.StatementAdapter.evaluate(StatementAdapter.java:36)
	at com.carrotsearch.randomizedtesting.ThreadLeakControl$StatementRunner.run(ThreadLeakControl.java:358)
	at java.lang.Thread.run(Thread.java:722)
Caused by: java.lang.RuntimeException: REQUEST FAILED: xpath=(/response/arr[@name='fields']/lst/str[@name='name'])[1] = 'custstopfilt'
	xml response was: <?xml version="1.0" encoding="UTF-8"?>
<response>

<lst name="responseHeader">
  <int name="status">0</int>
  <int name="QTime">1</int>
</lst>
<arr name="fields">
  <lst>
    <str name="name">dedup</str>
    <str name="type">dedup</str>
    <bool name="indexed">true</bool>
    <bool name="stored">true</bool>
  </lst>
  <lst>
    <str name="name">title_lettertok</str>
    <str name="type">lettertok</str>
    <bool name="indexed">true</bool>
    <bool name="stored">false</bool>
  </lst>
  <lst>
    <str name="name">protectedsubword</str>
    <str name="type">protectedsubword</str>
    <bool name="indexed">true</bool>
    <bool name="stored">true</bool>
  </lst>
  <lst>
    <str name="name">subword</str>
    <str name="type">subword</str>
    <bool name="indexed">true</bool>
    <bool name="stored">true</bool>
  </lst>
  <lst>
    <str name="name">sku1</str>
    <str name="type">skutype1</str>
    <bool name="indexed">true</bool>
    <bool name="stored">true</bool>
  </lst>
  <lst>
    <str name="name">title_stemmed</str>
    <str name="type">text</str>
    <bool name="indexed">true</bool>
    <bool name="stored">false</bool>
  </lst>
  <lst>
    <str name="name">textgap</str>
    <str name="type">textgap</str>
    <bool name="indexed">true</bool>
    <bool name="stored">true</bool>
  </lst>
  <lst>
    <str name="name">wdf_preserve</str>
    <str name="type">wdf_preserve</str>
    <bool name="indexed">true</bool>
    <bool name="stored">true</bool>
  </lst>
  <lst>
    <str name="name">nouniq</str>
    <str name="type">string</str>
    <bool name="multiValued">true</bool>
    <bool name="indexed">true</bool>
    <bool name="stored">true</bool>
  </lst>
  <lst>
    <str name="name">test_hlt</str>
    <str name="type">highlittext</str>
    <bool name="indexed">true</bool>
    <bool name="compressed">true</bool>
  </lst>
  <lst>
    <str name="name">test_hlt_off</str>
    <str name="type">highlittext</str>
    <bool name="indexed">true</bool>
    <bool name="compressed">false</bool>
  </lst>
  <lst>
    <str name="name">porterfilt</str>
    <str name="type">porterfilt</str>
    <bool name="indexed">true</bool>
    <bool name="stored">true</bool>
  </lst>
  <lst>
    <str name="name">test_offtv</str>
    <str name="type">text</str>
    <bool name="termOffsets">true</bool>
    <bool name="termVectors">true</bool>
  </lst>
  <lst>
    <str name="name">iind</str>
    <str name="type">int</str>
    <bool name="indexed">true</bool>
    <bool name="stored">false</bool>
  </lst>
  <lst>
    <str name="name">teststop</str>
    <str name="type">teststop</str>
    <bool name="indexed">true</bool>
    <bool name="stored">true</bool>
  </lst>
  <lst>
    <str name="name">text_np</str>
    <str name="type">text_np</str>
    <bool name="indexed">true</bool>
    <bool name="stored">false</bool>
  </lst>
  <lst>
    <str name="name">sku2</str>
    <str name="type">skutype2</str>
    <bool name="indexed">true</bool>
    <bool name="stored">true</bool>
  </lst>
  <lst>
    <str name="name">HTMLstandardtok</str>
    <str name="type">HTMLstandardtok</str>
    <bool name="indexed">true</bool>
    <bool name="stored">true</bool>
  </lst>
  <lst>
    <str name="name">engporterfilt</str>
    <str name="type">engporterfilt</str>
    <bool name="indexed">true</bool>
    <bool name="stored">true</bool>
  </lst>
  <lst>
    <str name="name">lengthfilt</str>
    <str name="type">lengthfilt</str>
    <bool name="indexed">true</bool>
    <bool name="stored">true</bool>
  </lst>
  <lst>
    <str name="name">sind</str>
    <str name="type">string</str>
    <bool name="indexed">true</bool>
    <bool name="stored">false</bool>
  </lst>
  <lst>
    <str name="name">lettertok</str>
    <str name="type">lettertok</str>
    <bool name="indexed">true</bool>
    <bool name="stored">true</bool>
  </lst>
  <lst>
    <str name="name">bsto</str>
    <str name="type">boolean</str>
    <bool name="indexed">false</bool>
    <bool name="stored">true</bool>
  </lst>
  <lst>
    <str name="name">lowerfilt</str>
    <str name="type">lowerfilt</str>
    <bool name="indexed">true</bool>
    <bool name="stored">true</bool>
  </lst>
  <lst>
    <str name="name">test_notv</str>
    <str name="type">text</str>
    <bool name="termVectors">false</bool>
  </lst>
  <lst>
    <str name="name">lowertok</str>
    <str name="type">lowertok</str>
    <bool name="indexed">true</bool>
    <bool name="stored">true</bool>
  </lst>
  <lst>
    <str name="name">custstopfilt</str>
    <str name="type">custstopfilt</str>
    <bool name="indexed">true</bool>
    <bool name="stored">true</bool>
  </lst>
  <lst>
    <str name="name">ssto</str>
    <str name="type">string</str>
    <bool name="indexed">false</bool>
    <bool name="stored">true</bool>
  </lst>
  <lst>
    <str name="name">uniq2</str>
    <str name="type">string</str>
    <bool name="multiValued">true</bool>
    <bool name="indexed">true</bool>
    <bool name="stored">true</bool>
  </lst>
  <lst>
    <str name="name">sindsto</str>
    <str name="type">string</str>
    <bool name="indexed">true</bool>
    <bool name="stored">true</bool>
  </lst>
  <lst>
    <str name="name">test_posofftv</str>
    <str name="type">text</str>
    <bool name="termOffsets">true</bool>
    <bool name="termVectors">true</bool>
    <bool name="termPositions">true</bool>
  </lst>
  <lst>
    <str name="name">test_basictv</str>
    <str name="type">text</str>
    <bool name="termVectors">true</bool>
  </lst>
  <lst>
    <str name="name">pointD</str>
    <str name="type">xyd</str>
    <bool name="multiValued">false</bool>
    <bool name="indexed">true</bool>
    <bool name="stored">true</bool>
  </lst>
  <lst>
    <str name="name">shouldbeunindexed</str>
    <str name="type">unstored</str>
    <bool name="indexed">false</bool>
    <bool name="stored">true</bool>
  </lst>
  <lst>
    <str name="name">id</str>
    <str name="type">string</str>
    <bool name="multiValued">false</bool>
    <bool name="required">true</bool>
    <bool name="indexed">true</bool>
    <bool name="stored">true</bool>
    <bool name="uniqueKey">true</bool>
  </lst>
  <lst>
    <str name="name">text</str>
    <str name="type">text</str>
    <bool name="multiValued">true</bool>
    <bool name="indexed">true</bool>
    <bool name="stored">false</bool>
  </lst>
  <lst>
    <str name="name">numericsubword</str>
    <str name="type">numericsubword</str>
    <bool name="indexed">true</bool>
    <bool name="stored">true</bool>
  </lst>
  <lst>
    <str name="name">numberpartfail</str>
    <str name="type">failtype1</str>
    <bool name="indexed">true</bool>
    <bool name="stored">true</bool>
  </lst>
  <lst>
    <str name="name">bindsto</str>
    <str name="type">boolean</str>
    <bool name="indexed">true</bool>
    <bool name="stored">true</bool>
  </lst>
  <lst>
    <str name="name">uniq</str>
    <str name="type">string</str>
    <bool name="multiValued">true</bool>
    <bool name="indexed">true</bool>
    <bool name="stored">true</bool>
  </lst>
  <lst>
    <str name="name">store</str>
    <str name="type">location</str>
    <bool name="indexed">true</bool>
    <bool name="stored">true</bool>
  </lst>
  <lst>
    <str name="name">keywordtok</str>
    <str name="type">keywordtok</str>
    <bool name="indexed">true</bool>
    <bool name="stored">true</bool>
  </lst>
  <lst>
    <str name="name">point_hash</str>
    <str name="type">geohash</str>
    <bool name="multiValued">false</bool>
    <bool name="indexed">true</bool>
    <bool name="stored">true</bool>
  </lst>
  <lst>
    <str name="name">weight</str>
    <str name="type">float</str>
    <bool name="indexed">true</bool>
    <bool name="stored">true</bool>
  </lst>
  <lst>
    <str name="name">syn</str>
    <str name="type">syn</str>
    <bool name="indexed">true</bool>
    <bool name="stored">true</bool>
  </lst>
  <lst>
    <str name="name">HTMLwhitetok</str>
    <str name="type">HTMLwhitetok</str>
    <bool name="indexed">true</bool>
    <bool name="stored">true</bool>
  </lst>
  <lst>
    <str name="name">whitetok</str>
    <str name="type">whitetok</str>
    <bool name="indexed">true</bool>
    <bool name="stored">true</bool>
  </lst>
  <lst>
    <str name="name">nullfirst</str>
    <str name="type">string</str>
    <bool name="sortMissingFirst">true</bool>
    <bool name="indexed">true</bool>
    <bool name="stored">true</bool>
  </lst>
  <lst>
    <str name="name">bind</str>
    <str name="type">boolean</str>
    <bool name="indexed">true</bool>
    <bool name="stored">false</bool>
  </lst>
  <lst>
    <str name="name">test_postv</str>
    <str name="type">text</str>
    <bool name="termVectors">true</bool>
    <bool name="termPositions">true</bool>
  </lst>
  <lst>
    <str name="name">standardfilt</str>
    <str name="type">standardfilt</str>
    <bool name="indexed">true</bool>
    <bool name="stored">true</bool>
  </lst>
  <lst>
    <str name="name">standardtokfilt</str>
    <str name="type">standardtokfilt</str>
    <bool name="indexed">true</bool>
    <bool name="stored">true</bool>
  </lst>
  <lst>
    <str name="name">subject</str>
    <str name="type">text</str>
    <bool name="indexed">true</bool>
    <bool name="stored">true</bool>
  </lst>
  <lst>
    <str name="name">standardtok</str>
    <str name="type">standardtok</str>
    <bool name="indexed">true</bool>
    <bool name="stored">true</bool>
  </lst>
  <lst>
    <str name="name">title</str>
    <str name="type">nametext</str>
    <bool name="indexed">true</bool>
    <bool name="stored">true</bool>
  </lst>
  <lst>
    <str name="name">patternreplacefilt</str>
    <str name="type">patternreplacefilt</str>
    <bool name="indexed">true</bool>
    <bool name="stored">true</bool>
  </lst>
  <lst>
    <str name="name">name</str>
    <str name="type">nametext</str>
    <bool name="indexed">true</bool>
    <bool name="stored">true</bool>
  </lst>
  <lst>
    <str name="name">point</str>
    <str name="type">xy</str>
    <bool name="multiValued">false</bool>
    <bool name="indexed">true</bool>
    <bool name="stored">true</bool>
  </lst>
  <lst>
    <str name="name">copyfield_source</str>
    <str name="type">string</str>
    <bool name="multiValued">true</bool>
    <bool name="indexed">true</bool>
    <bool name="stored">true</bool>
  </lst>
  <lst>
    <str name="name">stopfilt</str>
    <str name="type">stopfilt</str>
    <bool name="indexed">true</bool>
    <bool name="stored">true</bool>
  </lst>
  <lst>
    <str name="name">shouldbestored</str>
    <str name="type">unstored</str>
    <bool name="stored">true</bool>
  </lst>
  <lst>
    <str name="name">shouldbeunstored</str>
    <str name="type">unstored</str>
  </lst>
  <lst>
    <str name="name">uniq3</str>
    <str name="type">string</str>
    <bool name="indexed">true</bool>
    <bool name="stored">true</bool>
  </lst>
  <lst>
    <str name="name">timestamp</str>
    <str name="type">date</str>
    <bool name="indexed">true</bool>
    <bool name="stored">true</bool>
  </lst>
  <lst>
    <str name="name">_version_</str>
    <str name="type">long</str>
    <bool name="indexed">true</bool>
    <bool name="stored">true</bool>
  </lst>
  <lst>
    <str name="name">wdf_nocase</str>
    <str name="type">wdf_nocase</str>
    <bool name="indexed">true</bool>
    <bool name="stored">true</bool>
  </lst>
  <lst>
    <str name="name">uuid</str>
    <str name="type">uuid</str>
    <bool name="stored">true</bool>
  </lst>
  <lst>
    <str name="name">signatureField</str>
    <str name="type">string</str>
    <bool name="indexed">true</bool>
    <bool name="stored">false</bool>
  </lst>
  <lst>
    <str name="name">isto</str>
    <str name="type">int</str>
    <bool name="indexed">false</bool>
    <bool name="stored">true</bool>
  </lst>
  <lst>
    <str name="name">bday</str>
    <str name="type">date</str>
    <bool name="indexed">true</bool>
    <bool name="stored">true</bool>
  </lst>
  <lst>
    <str name="name">custengporterfilt</str>
    <str name="type">custengporterfilt</str>
    <bool name="indexed">true</bool>
    <bool name="stored">true</bool>
  </lst>
</arr>
</response>

	request was:/schema/fields?indent=on&wt=xml
	at org.apache.solr.util.RestTestBase.assertQ(RestTestBase.java:136)
	... 41 more




Build Log:
[...truncated 9155 lines...]
[junit4:junit4] Suite: org.apache.solr.rest.TestFieldCollectionResource
[junit4:junit4]   2> 0 T1096 oas.SolrJettyTestBase.beforeSolrJettyTestBase Randomized ssl (true) and clientAuth (true)
[junit4:junit4]   2> 2 T1096 oas.SolrTestCaseJ4.initCore ####initCore
[junit4:junit4]   2> Creating dataDir: /mnt/ssd/jenkins/workspace/Lucene-Solr-4.x-Linux/solr/build/solr-core/test/J1/./solrtest-TestFieldCollectionResource-1362639814458
[junit4:junit4]   2> 3 T1096 oas.SolrTestCaseJ4.initCore ####initCore end
[junit4:junit4]   2> 9 T1096 oejs.Server.doStart jetty-8.1.8.v20121106
[junit4:junit4]   2> 313 T1096 oejus.SslContextFactory.doStart Enabled Protocols [SSLv2Hello, SSLv3, TLSv1, TLSv1.1, TLSv1.2] of [SSLv2Hello, SSLv3, TLSv1, TLSv1.1, TLSv1.2]
[junit4:junit4]   2> 317 T1096 oejs.AbstractConnector.doStart Started SslSelectChannelConnector@127.0.0.1:33108
[junit4:junit4]   2> 317 T1096 oass.SolrDispatchFilter.init SolrDispatchFilter.init()
[junit4:junit4]   2> 318 T1096 oasc.SolrResourceLoader.locateSolrHome JNDI not configured for solr (NoInitialContextEx)
[junit4:junit4]   2> 318 T1096 oasc.SolrResourceLoader.locateSolrHome using system property solr.solr.home: /mnt/ssd/jenkins/workspace/Lucene-Solr-4.x-Linux/solr/build/solr-core/test-files/solr
[junit4:junit4]   2> 318 T1096 oasc.CoreContainer$Initializer.initialize looking for solr.xml: /mnt/ssd/jenkins/workspace/Lucene-Solr-4.x-Linux/solr/build/solr-core/test-files/solr/solr.xml
[junit4:junit4]   2> 318 T1096 oasc.CoreContainer.<init> New CoreContainer 26781998
[junit4:junit4]   2> 319 T1096 oasc.CoreContainer.load Loading CoreContainer using Solr Home: '/mnt/ssd/jenkins/workspace/Lucene-Solr-4.x-Linux/solr/build/solr-core/test-files/solr/'
[junit4:junit4]   2> 319 T1096 oasc.SolrResourceLoader.<init> new SolrResourceLoader for directory: '/mnt/ssd/jenkins/workspace/Lucene-Solr-4.x-Linux/solr/build/solr-core/test-files/solr/'
[junit4:junit4]   2> 335 T1096 oashc.HttpShardHandlerFactory.getParameter Setting socketTimeout to: 120000
[junit4:junit4]   2> 335 T1096 oashc.HttpShardHandlerFactory.getParameter Setting urlScheme to: http://
[junit4:junit4]   2> 336 T1096 oashc.HttpShardHandlerFactory.getParameter Setting connTimeout to: 15000
[junit4:junit4]   2> 336 T1096 oashc.HttpShardHandlerFactory.getParameter Setting maxConnectionsPerHost to: 20
[junit4:junit4]   2> 336 T1096 oashc.HttpShardHandlerFactory.getParameter Setting corePoolSize to: 0
[junit4:junit4]   2> 336 T1096 oashc.HttpShardHandlerFactory.getParameter Setting maximumPoolSize to: 2147483647
[junit4:junit4]   2> 337 T1096 oashc.HttpShardHandlerFactory.getParameter Setting maxThreadIdleTime to: 5
[junit4:junit4]   2> 337 T1096 oashc.HttpShardHandlerFactory.getParameter Setting sizeOfQueue to: -1
[junit4:junit4]   2> 337 T1096 oashc.HttpShardHandlerFactory.getParameter Setting fairnessPolicy to: false
[junit4:junit4]   2> 337 T1096 oascsi.HttpClientUtil.createClient Creating new http client, config:maxConnectionsPerHost=20&maxConnections=10000&socketTimeout=120000&connTimeout=15000&retry=false
[junit4:junit4]   2> 343 T1096 oasc.CoreContainer.load Registering Log Listener
[junit4:junit4]   2> 357 T1106 oasc.CoreContainer.create Creating SolrCore 'collection1' using instanceDir: /mnt/ssd/jenkins/workspace/Lucene-Solr-4.x-Linux/solr/build/solr-core/test-files/solr/collection1
[junit4:junit4]   2> 358 T1106 oasc.SolrResourceLoader.<init> new SolrResourceLoader for directory: '/mnt/ssd/jenkins/workspace/Lucene-Solr-4.x-Linux/solr/build/solr-core/test-files/solr/collection1/'
[junit4:junit4]   2> 359 T1106 oasc.SolrResourceLoader.replaceClassLoader Adding 'file:/mnt/ssd/jenkins/workspace/Lucene-Solr-4.x-Linux/solr/build/solr-core/test-files/solr/collection1/lib/README' to classloader
[junit4:junit4]   2> 359 T1106 oasc.SolrResourceLoader.replaceClassLoader Adding 'file:/mnt/ssd/jenkins/workspace/Lucene-Solr-4.x-Linux/solr/build/solr-core/test-files/solr/collection1/lib/classes/' to classloader
[junit4:junit4]   2> 414 T1106 oasc.SolrConfig.<init> Using Lucene MatchVersion: LUCENE_42
[junit4:junit4]   2> 479 T1106 oasc.SolrConfig.<init> Loaded SolrConfig: solrconfig.xml
[junit4:junit4]   2> 479 T1106 oass.IndexSchema.readSchema Reading Solr Schema
[junit4:junit4]   2> 483 T1106 oass.IndexSchema.readSchema Schema name=test-rest
[junit4:junit4]   2> 879 T1106 oass.IndexSchema.readSchema default search field in schema is text
[junit4:junit4]   2> 881 T1106 oass.IndexSchema.readSchema unique key field: id
[junit4:junit4]   2> 883 T1106 oass.IndexSchema.readSchema WARNING Field title is not multivalued and destination for multiple copyFields (3)
[junit4:junit4]   2> 888 T1106 oasc.SolrCore.<init> [collection1] Opening new SolrCore at /mnt/ssd/jenkins/workspace/Lucene-Solr-4.x-Linux/solr/build/solr-core/test-files/solr/collection1/, dataDir=/mnt/ssd/jenkins/workspace/Lucene-Solr-4.x-Linux/solr/build/solr-core/test/J1/solrtest-TestFieldCollectionResource-1362639814458/
[junit4:junit4]   2> 888 T1106 oasc.JmxMonitoredMap.<init> JMX monitoring is enabled. Adding Solr mbeans to JMX Server: com.sun.jmx.mbeanserver.JmxMBeanServer@b3d49e
[junit4:junit4]   2> 888 T1106 oasc.SolrCore.initDirectoryFactory org.apache.solr.core.MockDirectoryFactory
[junit4:junit4]   2> 889 T1106 oasc.CachingDirectoryFactory.get return new directory for /mnt/ssd/jenkins/workspace/Lucene-Solr-4.x-Linux/solr/build/solr-core/test/J1/solrtest-TestFieldCollectionResource-1362639814458 forceNew: false
[junit4:junit4]   2> 889 T1106 oasc.SolrCore.getNewIndexDir New index directory detected: old=null new=/mnt/ssd/jenkins/workspace/Lucene-Solr-4.x-Linux/solr/build/solr-core/test/J1/solrtest-TestFieldCollectionResource-1362639814458/index/
[junit4:junit4]   2> 889 T1106 oasc.SolrCore.initIndex WARNING [collection1] Solr index directory '/mnt/ssd/jenkins/workspace/Lucene-Solr-4.x-Linux/solr/build/solr-core/test/J1/solrtest-TestFieldCollectionResource-1362639814458/index' doesn't exist. Creating new index...
[junit4:junit4]   2> 889 T1106 oasc.CachingDirectoryFactory.get return new directory for /mnt/ssd/jenkins/workspace/Lucene-Solr-4.x-Linux/solr/build/solr-core/test/J1/solrtest-TestFieldCollectionResource-1362639814458/index forceNew: false
[junit4:junit4]   2> 890 T1106 oasc.SolrDeletionPolicy.onCommit SolrDeletionPolicy.onCommit: commits:num=1
[junit4:junit4]   2> 		commit{dir=RateLimitedDirectoryWrapper(MockDirWrapper(org.apache.lucene.store.RAMDirectory@e87524 lockFactory=org.apache.lucene.store.NativeFSLockFactory@1c540d1)),segFN=segments_1,generation=1,filenames=[segments_1]
[junit4:junit4]   2> 891 T1106 oasc.SolrDeletionPolicy.updateCommits newest commit = 1[segments_1]
[junit4:junit4]   2> 891 T1106 oasc.SolrCore.initWriters created xml: solr.XMLResponseWriter
[junit4:junit4]   2> 892 T1106 oasup.UpdateRequestProcessorChain.init inserting DistributedUpdateProcessorFactory into updateRequestProcessorChain "dedupe"
[junit4:junit4]   2> 900 T1106 oasup.UpdateRequestProcessorChain.init inserting DistributedUpdateProcessorFactory into updateRequestProcessorChain "dedupe-allfields"
[junit4:junit4]   2> 900 T1106 oasup.UpdateRequestProcessorChain.init inserting DistributedUpdateProcessorFactory into updateRequestProcessorChain "stored_sig"
[junit4:junit4]   2> 901 T1106 oasup.UpdateRequestProcessorChain.init inserting DistributedUpdateProcessorFactory into updateRequestProcessorChain "uniq-fields"
[junit4:junit4]   2> 901 T1106 oasup.UpdateRequestProcessorChain.init inserting DistributedUpdateProcessorFactory into updateRequestProcessorChain "distrib-dup-test-chain-implicit"
[junit4:junit4]   2> 901 T1106 oasc.RequestHandlers.initHandlersFromConfig adding lazy requestHandler: solr.ReplicationHandler
[junit4:junit4]   2> 902 T1106 oasc.RequestHandlers.initHandlersFromConfig created /replication: solr.ReplicationHandler
[junit4:junit4]   2> 902 T1106 oasc.RequestHandlers.initHandlersFromConfig created standard: solr.StandardRequestHandler
[junit4:junit4]   2> 902 T1106 oasc.RequestHandlers.initHandlersFromConfig created /get: solr.RealTimeGetHandler
[junit4:junit4]   2> 903 T1106 oasc.RequestHandlers.initHandlersFromConfig created dismax: solr.SearchHandler
[junit4:junit4]   2> 903 T1106 oasc.RequestHandlers.initHandlersFromConfig created mock: org.apache.solr.core.MockQuerySenderListenerReqHandler
[junit4:junit4]   2> 904 T1106 oasc.RequestHandlers.initHandlersFromConfig created /admin/: org.apache.solr.handler.admin.AdminHandlers
[junit4:junit4]   2> 904 T1106 oasc.RequestHandlers.initHandlersFromConfig created defaults: solr.StandardRequestHandler
[junit4:junit4]   2> 904 T1106 oasc.RequestHandlers.initHandlersFromConfig adding lazy requestHandler: solr.StandardRequestHandler
[junit4:junit4]   2> 904 T1106 oasc.RequestHandlers.initHandlersFromConfig created lazy: solr.StandardRequestHandler
[junit4:junit4]   2> 905 T1106 oasc.RequestHandlers.initHandlersFromConfig created /update: solr.UpdateRequestHandler
[junit4:junit4]   2> 905 T1106 oasc.RequestHandlers.initHandlersFromConfig created /terms: org.apache.solr.handler.component.SearchHandler
[junit4:junit4]   2> 905 T1106 oasc.RequestHandlers.initHandlersFromConfig created spellCheckCompRH: org.apache.solr.handler.component.SearchHandler
[junit4:junit4]   2> 906 T1106 oasc.RequestHandlers.initHandlersFromConfig created spellCheckCompRH_Direct: org.apache.solr.handler.component.SearchHandler
[junit4:junit4]   2> 906 T1106 oasc.RequestHandlers.initHandlersFromConfig created spellCheckWithWordbreak: org.apache.solr.handler.component.SearchHandler
[junit4:junit4]   2> 907 T1106 oasc.RequestHandlers.initHandlersFromConfig created spellCheckWithWordbreak_Direct: org.apache.solr.handler.component.SearchHandler
[junit4:junit4]   2> 907 T1106 oasc.RequestHandlers.initHandlersFromConfig created spellCheckCompRH1: org.apache.solr.handler.component.SearchHandler
[junit4:junit4]   2> 907 T1106 oasc.RequestHandlers.initHandlersFromConfig created mltrh: org.apache.solr.handler.component.SearchHandler
[junit4:junit4]   2> 908 T1106 oasc.RequestHandlers.initHandlersFromConfig created tvrh: org.apache.solr.handler.component.SearchHandler
[junit4:junit4]   2> 908 T1106 oasc.RequestHandlers.initHandlersFromConfig created /mlt: solr.MoreLikeThisHandler
[junit4:junit4]   2> 909 T1106 oasc.RequestHandlers.initHandlersFromConfig created /debug/dump: solr.DumpRequestHandler
[junit4:junit4]   2> 911 T1106 oashl.XMLLoader.init xsltCacheLifetimeSeconds=60
[junit4:junit4]   2> 913 T1106 oasc.SolrCore.initDeprecatedSupport WARNING solrconfig.xml uses deprecated <admin/gettableFiles>, Please update your config to use the ShowFileRequestHandler.
[junit4:junit4]   2> 914 T1106 oasc.SolrCore.initDeprecatedSupport WARNING adding ShowFileRequestHandler with hidden files: [BAD-SCHEMA-SIM-GLOBAL-VS-FT-MISMATCH.XML, SCHEMA-DOCVALUESFACETING.XML, SCHEMA-LMDIRICHLET.XML, BAD-SCHEMA-OMIT-TF-BUT-NOT-POS.XML, BAD-SCHEMA-UNIQUEKEY-IS-COPYFIELD-DEST.XML, BAD-SCHEMA-SWEETSPOT-PARTIAL-NORMS.XML, SOLRCONFIG-CACHING.XML, SCHEMA-IB.XML, STOPWORDSWRONGENCODING.TXT, SOLRCONFIG-PROPINJECT.XML, SCHEMA-REQUIRED-FIELDS.XML, SOLRCONFIG-NOCACHE.XML, SCHEMA-SNIPPET-FIELD.XML, SOLRCONFIG-ALTDIRECTORY.XML, SCHEMA-REPLICATION2.XML, SOLRCONFIG-PROPINJECT-INDEXDEFAULT.XML, STOP-SNOWBALL.TXT, SOLRCONFIG-SCRIPT-UPDATEPROCESSOR.XML, SOLRCONFIG-QUERYSENDER-NOQUERY.XML, SOLRCONFIG-SNIPPET-PROCESSOR.XML, SCHEMA-REVERSED.XML, SCHEMA-STOP-KEEP.XML, BAD-SCHEMA-DOCVALUES-NOT-REQUIRED-NO-DEFAULT.XML, SOLRCONFIG-ELEVATE.XML, BAD-SCHEMA-UNIQUEKEY-MULTIVALUED.XML, BAD-SOLRCONFIG-BOGUS-SCRIPTENGINE-NAME.XML, BAD-SCHEMA-EXTERNAL-FILEFIELD.XML, STOP-2.TXT, STOPWITHBOM.TXT, BAD-SCHEMA-UNSUPPORTED-DOCVALUES.XML, SOLRCONFIG-SLAVE1.XML, SOLRCONFIG-MASTER1-KEEPONEBACKUP.XML, BAD-SCHEMA-NOT-INDEXED-BUT-TF.XML, BAD-SCHEMA-SWEETSPOT-BOTH-TF.XML, SCHEMA12.XML, SOLRCONFIG-REQHANDLER.INCL, KEEP-1.TXT, STOP-1.TXT, SOLRCONFIG-UPDATE-PROCESSOR-CHAINS.XML, SCHEMASURROUND.XML, SOLRCONFIG-TLOG.XML, SCHEMA-EFF.XML, OPEN-EXCHANGE-RATES.JSON, SCHEMA15.XML, BAD-SCHEMA-UNIQUEKEY-USES-DEFAULT.XML, KEEP-2.TXT, CURRENCY.XML, STOPWORDS.TXT, BAD-SCHEMA-DUP-FIELDTYPE.XML, SCHEMA-POSTINGSHIGHLIGHT.XML, SOLRCONFIG-MERGEPOLICY.XML, SOLRCONFIG-QUERYSENDER.XML, MAPPING-ISOLATIN1ACCENT.TXT, STOPTYPES-1.TXT, SCHEMA-REPLICATION1.XML, SCHEMA-COLLATE.XML, SCHEMA-COPYFIELD-TEST.XML, SOLRCONFIG_PERF.XML, SCHEMA-NOT-REQUIRED-UNIQUE-KEY.XML, SOLRCONFIG-TRANSFORMERS.XML, FUZZYSUGGEST.TXT, STOPTYPES-2.TXT, SCHEMA-FOLDING.XML, JASUGGEST.TXT, HUNSPELL-TEST.DIC, BAD-SOLRCONFIG-INVALID-SCRIPTFILE.XML, HYPHENATION.DTD, SCHEMA-DOCVALUESMULTI.XML, DA_UTF8.XML, SCHEMA-BM25.XML, SOLRCONFIG-MASTER1.XML, SOLRCONFIG-XINCLUDE.XML, BAD-SOLRCONFIG-MISSING-SCRIPTFILE.XML, BAD-SCHEMA-CURRENCY-FT-OER-NORATES.XML, SOLRCONFIG-RESPONSE-LOG-COMPONENT.XML, BAD-SCHEMA-SWEETSPOT-PARTIAL-BASELINE.XML, CONDITIONAL.UPDATEPROCESSOR.JS, SCHEMA-REST.XML, BAD-SCHEMA-DUP-DYNAMICFIELD.XML, BAD-SCHEMA-CURRENCY-FT-BOGUS-DEFAULT-CODE.XML, SOLRCONFIG-REPEATER.XML, SOLRCONFIG-ENABLEPLUGIN.XML, SOLRCONFIG-PHRASESUGGEST.XML, XSLT, THROW.ERROR.ON.ADD.UPDATEPROCESSOR.JS, SCHEMA-CHARFILTERS.XML, TRIVIAL.UPDATEPROCESSOR0.JS, DA_COMPOUNDDICTIONARY.TXT, SCHEMA-NUMERIC.XML, BAD-SCHEMA-CURRENCY-MULTIVALUED.XML, OLD_SYNONYMS.TXT, FRENCHARTICLES.TXT, SCHEMA-TRIE.XML, SOLRCONFIG-SLAVE.XML, BAD-CURRENCY.XML, SCHEMA-SNIPPET-TYPE.XML, SOLRCONFIG-INDEXCONFIG.XML, SOLRCONFIG-NATIVELOCK.XML, SCHEMA-COLLATEFILTER.XML, SCHEMA-BINARYFIELD.XML, SOLRCONFIG-TERMINDEX.XML, STEMDICT.TXT, BAD-SCHEMA-CURRENCY-FT-MULTIVALUED.XML, WDFTYPES.TXT, BAD_SOLRCONFIG.XML, SOLRCONFIG-LAZYWRITER.XML, BAD-SCHEMA-NOT-INDEXED-BUT-NORMS.XML, BAD-SCHEMA-CURRENCY-FT-BOGUS-CODE-IN-XML.XML, ELEVATE.XML, SOLRCONFIG-SIMPLELOCK.XML, SOLRCONFIG-SOLCOREPROPERTIES.XML, SCHEMA-LUCENEMATCHVERSION.XML, BAD-SCHEMA-CURRENCY-DYNAMIC-MULTIVALUED.XML, SCHEMA-MINIMAL.XML, SOLRCONFIG-MASTER.XML, SCHEMA-XINCLUDE.XML, SCHEMA-DFR.XML, SCHEMA-SPELLCHECKER.XML, SCHEMA-SPATIAL.XML, BAD-SCHEMA-ANALYZER-CLASS-AND-NESTED.XML, SOLRCONFIG-SOLR-749.XML, BAD-SCHEMA-SWEETSPOT-PARTIAL-HYPERBOLIC.XML, SOLRCONFIG-SPELLCHECKER.XML, PHRASESUGGEST.TXT, SOLRCONFIG-MASTER3.XML, SCHEMA-PHRASESUGGEST.XML, TRIVIAL.UPDATEPROCESSOR1.JS, MISSLEADING.EXTENSION.UPDATEPROCESSOR.JS.TXT, SCHEMA-DOCVALUES.XML, HUNSPELL-TEST.AFF, COMPOUNDDICTIONARY.TXT, SOLRCONFIG-BASIC.XML, BAD-SCHEMA-NOT-INDEXED-BUT-POS.XML, BAD-SCHEMA-NONTEXT-ANALYZER.XML, SCHEMA-SWEETSPOT.XML, SOLRCONFIG-HIGHLIGHT.XML, SOLRCONFIG-SPELLCHECKCOMPONENT.XML, SOLRCONFIG_CODEC.XML, BAD-MP-SOLRCONFIG.XML, SCHEMA11.XML, BAD-SCHEMA-CODEC-GLOBAL-VS-FT-MISMATCH.XML, SCHEMA_CODEC.XML, SCHEMA-SYNONYM-TOKENIZER.XML, SCHEMA-BEHAVIOR.XML, ADDFIELDS.UPDATEPROCESSOR.JS, SOLRCONFIG-DELPOLICY1.XML, REGEX-BOOST-PROCESSOR-TEST.TXT, SYNONYMS.TXT, SCHEMA-SIM.XML, SOLRCONFIG-BASIC-LUCENEVERSION31.XML, MISSING.FUNCTIONS.UPDATEPROCESSOR.JS, PROTWORDS.TXT, SOLRCONFIG-DELPOLICY2.XML, SOLRCONFIG-COMPONENTS-NAME.XML, SCHEMA-LMJELINEKMERCER.XML, SOLRCONFIG-MASTER2.XML, BAD-SCHEMA-DUP-FIELD.XML, SCHEMA-TFIDF.XML, SOLRCONFIG-FUNCTIONQUERY.XML, SOLRCONFIG-POSTINGSHIGHLIGHT.XML]
[junit4:junit4]   2> 917 T1106 oass.SolrIndexSearcher.<init> Opening Searcher@109e1ee main
[junit4:junit4]   2> 917 T1106 oasu.CommitTracker.<init> Hard AutoCommit: disabled
[junit4:junit4]   2> 917 T1106 oasu.CommitTracker.<init> Soft AutoCommit: disabled
[junit4:junit4]   2> 918 T1106 oashc.SpellCheckComponent.inform Initializing spell checkers
[junit4:junit4]   2> 1032 T1106 oass.DirectSolrSpellChecker.init init: {name=direct,classname=DirectSolrSpellChecker,field=lowerfilt,minQueryLength=3}
[junit4:junit4]   2> 1064 T1107 oasc.SolrCore.registerSearcher [collection1] Registered new searcher Searcher@109e1ee main{StandardDirectoryReader(segments_1:1)}
[junit4:junit4]   2> 1072 T1106 oasc.CoreContainer.registerCore registering core: collection1
[junit4:junit4]   2> 1072 T1096 oass.SolrDispatchFilter.init user.dir=/mnt/ssd/jenkins/workspace/Lucene-Solr-4.x-Linux/solr/build/solr-core/test/J1
[junit4:junit4]   2> 1073 T1096 oass.SolrDispatchFilter.init SolrDispatchFilter.init() done
[junit4:junit4]   2> 1074 T1096 oas.SolrJettyTestBase.createJetty Jetty Assigned Port#33108
[junit4:junit4]   2> 1084 T1096 oas.SolrTestCaseJ4.setUp ###Starting testGetTwoFields
[junit4:junit4]   2> ASYNC  NEW_CORE C31 name=collection1 org.apache.solr.core.SolrCore@6aa4da
[junit4:junit4]   2> 1537 T1102 C31 oejsh.ContextHandler$Context.log SchemaRestApi: [Restlet] Attaching application: org.apache.solr.rest.SchemaRestApi@1e7414e to URI: /solr/schema
[junit4:junit4]   2> 1576 T1102 C31 oasr.SchemaRestApi.createInboundRoot createInboundRoot started
[junit4:junit4]   2> 1589 T1102 C31 oasr.SchemaRestApi.createInboundRoot createInboundRoot complete
[junit4:junit4]   2> 1601 T1102 C31 oasr.BaseSchemaResource.handlePostExecution [collection1] webapp=/solr path=/schema/fields params={fl=id,_version_&wt=xml&indent=on} status=0 QTime=270 
[junit4:junit4]   2> 1607 T1102 C31 orel.LogFilter.afterHandle 2013-03-07	12:03:36	127.0.0.1	-	127.0.0.1	33108	GET	/solr/schema/fields	indent=on&wt=xml&fl=id,_version_	200	-	0	36	https://127.0.0.1:33108	Java/1.8.0-ea	-
[junit4:junit4]   2> 1643 T1096 oas.SolrTestCaseJ4.tearDown ###Ending testGetTwoFields
[junit4:junit4]   2> 1649 T1096 oas.SolrTestCaseJ4.setUp ###Starting testJsonGetTwoFields
[junit4:junit4]   2> 1656 T1103 C31 oasr.BaseSchemaResource.handlePostExecution [collection1] webapp=/solr path=/schema/fields params={fl=id,_version_&wt=json&indent=on} status=0 QTime=5 
[junit4:junit4]   2> 1657 T1103 C31 orel.LogFilter.afterHandle 2013-03-07	12:03:36	127.0.0.1	-	127.0.0.1	33108	GET	/solr/schema/fields	fl=id,_version_&indent=on&wt=json	200	-	0	2	https://127.0.0.1:33108	Java/1.8.0-ea	-
[junit4:junit4]   2> 1661 T1096 oas.SolrTestCaseJ4.tearDown ###Ending testJsonGetTwoFields
[junit4:junit4]   2> 1670 T1096 oas.SolrTestCaseJ4.setUp ###Starting testNotFoundFields
[junit4:junit4]   2> 1672 T1104 C31 oasr.BaseSchemaResource.handlePostExecution [collection1] webapp=/solr path=/schema/fields params={fl=not_in_there,this_one_either&wt=xml&indent=on} status=0 QTime=1 
[junit4:junit4]   2> 1673 T1104 C31 orel.LogFilter.afterHandle 2013-03-07	12:03:36	127.0.0.1	-	127.0.0.1	33108	GET	/solr/schema/fields	indent=on&wt=xml&fl=not_in_there,this_one_either	200	-	0	1	https://127.0.0.1:33108	Java/1.8.0-ea	-
[junit4:junit4]   2> 1680 T1096 oas.SolrTestCaseJ4.tearDown ###Ending testNotFoundFields
[junit4:junit4]   2> 1692 T1096 oas.SolrTestCaseJ4.setUp ###Starting testJsonGetAllFields
[junit4:junit4]   2> 1695 T1102 C31 oasr.BaseSchemaResource.handlePostExecution [collection1] webapp=/solr path=/schema/fields params={wt=json&indent=on} status=0 QTime=1 
[junit4:junit4]   2> 1696 T1102 C31 orel.LogFilter.afterHandle 2013-03-07	12:03:36	127.0.0.1	-	127.0.0.1	33108	GET	/solr/schema/fields	indent=on&wt=json	200	-	0	2	https://127.0.0.1:33108	Java/1.8.0-ea	-
[junit4:junit4]   2> 1719 T1096 oasu.RestTestBase.assertJQ SEVERE query failed JSON validation. error=mismatch: 'custstopfilt'!='dedup' @ fields/[0]/name
[junit4:junit4]   2> 	 expected =/fields/[0]/name=="custstopfilt"
[junit4:junit4]   2> 	 response = {
[junit4:junit4]   2> 	  "responseHeader":{
[junit4:junit4]   2> 	    "status":0,
[junit4:junit4]   2> 	    "QTime":1},
[junit4:junit4]   2> 	  "fields":[{
[junit4:junit4]   2> 	      "name":"dedup",
[junit4:junit4]   2> 	      "type":"dedup",
[junit4:junit4]   2> 	      "indexed":true,
[junit4:junit4]   2> 	      "stored":true},
[junit4:junit4]   2> 	    {
[junit4:junit4]   2> 	      "name":"title_lettertok",
[junit4:junit4]   2> 	      "type":"lettertok",
[junit4:junit4]   2> 	      "indexed":true,
[junit4:junit4]   2> 	      "stored":false},
[junit4:junit4]   2> 	    {
[junit4:junit4]   2> 	      "name":"protectedsubword",
[junit4:junit4]   2> 	      "type":"protectedsubword",
[junit4:junit4]   2> 	      "indexed":true,
[junit4:junit4]   2> 	      "stored":true},
[junit4:junit4]   2> 	    {
[junit4:junit4]   2> 	      "name":"subword",
[junit4:junit4]   2> 	      "type":"subword",
[junit4:junit4]   2> 	      "indexed":true,
[junit4:junit4]   2> 	      "stored":true},
[junit4:junit4]   2> 	    {
[junit4:junit4]   2> 	      "name":"sku1",
[junit4:junit4]   2> 	      "type":"skutype1",
[junit4:junit4]   2> 	      "indexed":true,
[junit4:junit4]   2> 	      "stored":true},
[junit4:junit4]   2> 	    {
[junit4:junit4]   2> 	      "name":"title_stemmed",
[junit4:junit4]   2> 	      "type":"text",
[junit4:junit4]   2> 	      "indexed":true,
[junit4:junit4]   2> 	      "stored":false},
[junit4:junit4]   2> 	    {
[junit4:junit4]   2> 	      "name":"textgap",
[junit4:junit4]   2> 	      "type":"textgap",
[junit4:junit4]   2> 	      "indexed":true,
[junit4:junit4]   2> 	      "stored":true},
[junit4:junit4]   2> 	    {
[junit4:junit4]   2> 	      "name":"wdf_preserve",
[junit4:junit4]   2> 	      "type":"wdf_preserve",
[junit4:junit4]   2> 	      "indexed":true,
[junit4:junit4]   2> 	      "stored":true},
[junit4:junit4]   2> 	    {
[junit4:junit4]   2> 	      "name":"nouniq",
[junit4:junit4]   2> 	      "type":"string",
[junit4:junit4]   2> 	      "multiValued":true,
[junit4:junit4]   2> 	      "indexed":true,
[junit4:junit4]   2> 	      "stored":true},
[junit4:junit4]   2> 	    {
[junit4:junit4]   2> 	      "name":"test_hlt",
[junit4:junit4]   2> 	      "type":"highlittext",
[junit4:junit4]   2> 	      "indexed":true,
[junit4:junit4]   2> 	      "compressed":true},
[junit4:junit4]   2> 	    {
[junit4:junit4]   2> 	      "name":"test_hlt_off",
[junit4:junit4]   2> 	      "type":"highlittext",
[junit4:junit4]   2> 	      "indexed":true,
[junit4:junit4]   2> 	      "compressed":false},
[junit4:junit4]   2> 	    {
[junit4:junit4]   2> 	      "name":"porterfilt",
[junit4:junit4]   2> 	      "type":"porterfilt",
[junit4:junit4]   2> 	      "indexed":true,
[junit4:junit4]   2> 	      "stored":true},
[junit4:junit4]   2> 	    {
[junit4:junit4]   2> 	      "name":"test_offtv",
[junit4:junit4]   2> 	      "type":"text",
[junit4:junit4]   2> 	      "termOffsets":true,
[junit4:junit4]   2> 	      "termVectors":true},
[junit4:junit4]   2> 	    {
[junit4:junit4]   2> 	      "name":"iind",
[junit4:junit4]   2> 	      "type":"int",
[junit4:junit4]   2> 	      "indexed":true,
[junit4:junit4]   2> 	      "stored":false},
[junit4:junit4]   2> 	    {
[junit4:junit4]   2> 	      "name":"teststop",
[junit4:junit4]   2> 	      "type":"teststop",
[junit4:junit4]   2> 	      "indexed":true,
[junit4:junit4]   2> 	      "stored":true},
[junit4:junit4]   2> 	    {
[junit4:junit4]   2> 	      "name":"text_np",
[junit4:junit4]   2> 	      "type":"text_np",
[junit4:junit4]   2> 	      "indexed":true,
[junit4:junit4]   2> 	      "stored":false},
[junit4:junit4]   2> 	    {
[junit4:junit4]   2> 	      "name":"sku2",
[junit4:junit4]   2> 	      "type":"skutype2",
[junit4:junit4]   2> 	      "indexed":true,
[junit4:junit4]   2> 	      "stored":true},
[junit4:junit4]   2> 	    {
[junit4:junit4]   2> 	      "name":"HTMLstandardtok",
[junit4:junit4]   2> 	      "type":"HTMLstandardtok",
[junit4:junit4]   2> 	      "indexed":true,
[junit4:junit4]   2> 	      "stored":true},
[junit4:junit4]   2> 	    {
[junit4:junit4]   2> 	      "name":"engporterfilt",
[junit4:junit4]   2> 	      "type":"engporterfilt",
[junit4:junit4]   2> 	      "indexed":true,
[junit4:junit4]   2> 	      "stored":true},
[junit4:junit4]   2> 	    {
[junit4:junit4]   2> 	      "name":"lengthfilt",
[junit4:junit4]   2> 	      "type":"lengthfilt",
[junit4:junit4]   2> 	      "indexed":true,
[junit4:junit4]   2> 	      "stored":true},
[junit4:junit4]   2> 	    {
[junit4:junit4]   2> 	      "name":"sind",
[junit4:junit4]   2> 	      "type":"string",
[junit4:junit4]   2> 	      "indexed":true,
[junit4:junit4]   2> 	      "stored":false},
[junit4:junit4]   2> 	    {
[junit4:junit4]   2> 	      "name":"lettertok",
[junit4:junit4]   2> 	      "type":"lettertok",
[junit4:junit4]   2> 	      "indexed":true,
[junit4:junit4]   2> 	      "stored":true},
[junit4:junit4]   2> 	    {
[junit4:junit4]   2> 	      "name":"bsto",
[junit4:junit4]   2> 	      "type":"boolean",
[junit4:junit4]   2> 	      "indexed":false,
[junit4:junit4]   2> 	      "stored":true},
[junit4:junit4]   2> 	    {
[junit4:junit4]   2> 	      "name":"lowerfilt",
[junit4:junit4]   2> 	      "type":"lowerfilt",
[junit4:junit4]   2> 	      "indexed":true,
[junit4:junit4]   2> 	      "stored":true},
[junit4:junit4]   2> 	    {
[junit4:junit4]   2> 	      "name":"test_notv",
[junit4:junit4]   2> 	      "type":"text",
[junit4:junit4]   2> 	      "termVectors":false},
[junit4:junit4]   2> 	    {
[junit4:junit4]   2> 	      "name":"lowertok",
[junit4:junit4]   2> 	      "type":"lowertok",
[junit4:junit4]   2> 	      "indexed":true,
[junit4:junit4]   2> 	      "stored":true},
[junit4:junit4]   2> 	    {
[junit4:junit4]   2> 	      "name":"custstopfilt",
[junit4:junit4]   2> 	      "type":"custstopfilt",
[junit4:junit4]   2> 	      "indexed":true,
[junit4:junit4]   2> 	      "stored":true},
[junit4:junit4]   2> 	    {
[junit4:junit4]   2> 	      "name":"ssto",
[junit4:junit4]   2> 	      "type":"string",
[junit4:junit4]   2> 	      "indexed":false,
[junit4:junit4]   2> 	      "stored":true},
[junit4:junit4]   2> 	    {
[junit4:junit4]   2> 	      "name":"uniq2",
[junit4:junit4]   2> 	      "type":"string",
[junit4:junit4]   2> 	      "multiValued":true,
[junit4:junit4]   2> 	      "indexed":true,
[junit4:junit4]   2> 	      "stored":true},
[junit4:junit4]   2> 	    {
[junit4:junit4]   2> 	      "name":"sindsto",
[junit4:junit4]   2> 	      "type":"string",
[junit4:junit4]   2> 	      "indexed":true,
[junit4:junit4]   2> 	      "stored":true},
[junit4:junit4]   2> 	    {
[junit4:junit4]   2> 	      "name":"test_posofftv",
[junit4:junit4]   2> 	      "type":"text",
[junit4:junit4]   2> 	      "termOffsets":true,
[junit4:junit4]   2> 	      "termVectors":true,
[junit4:junit4]   2> 	      "termPositions":true},
[junit4:junit4]   2> 	    {
[junit4:junit4]   2> 	      "name":"test_basictv",
[junit4:junit4]   2> 	      "type":"text",
[junit4:junit4]   2> 	      "termVectors":true},
[junit4:junit4]   2> 	    {
[junit4:junit4]   2> 	      "name":"pointD",
[junit4:junit4]   2> 	      "type":"xyd",
[junit4:junit4]   2> 	      "multiValued":false,
[junit4:junit4]   2> 	      "indexed":true,
[junit4:junit4]   2> 	      "stored":true},
[junit4:junit4]   2> 	    {
[junit4:junit4]   2> 	      "name":"shouldbeunindexed",
[junit4:junit4]   2> 	      "type":"unstored",
[junit4:junit4]   2> 	      "indexed":false,
[junit4:junit4]   2> 	      "stored":true},
[junit4:junit4]   2> 	    {
[junit4:junit4]   2> 	      "name":"id",
[junit4:junit4]   2> 	      "type":"string",
[junit4:junit4]   2> 	      "multiValued":false,
[junit4:junit4]   2> 	      "required":true,
[junit4:junit4]   2> 	      "indexed":true,
[junit4:junit4]   2> 	      "stored":true,
[junit4:junit4]   2> 	      "uniqueKey":true},
[junit4:junit4]   2> 	    {
[junit4:junit4]   2> 	      "name":"text",
[junit4:junit4]   2> 	      "type":"text",
[junit4:junit4]   2> 	      "multiValued":true,
[junit4:junit4]   2> 	      "indexed":true,
[junit4:junit4]   2> 	      "stored":false},
[junit4:junit4]   2> 	    {
[junit4:junit4]   2> 	      "name":"numericsubword",
[junit4:junit4]   2> 	      "type":"numericsubword",
[junit4:junit4]   2> 	      "indexed":true,
[junit4:junit4]   2> 	      "stored":true},
[junit4:junit4]   2> 	    {
[junit4:junit4]   2> 	      "name":"numberpartfail",
[junit4:junit4]   2> 	      "type":"failtype1",
[junit4:junit4]   2> 	      "indexed":true,
[junit4:junit4]   2> 	      "stored":true},
[junit4:junit4]   2> 	    {
[junit4:junit4]   2> 	      "name":"bindsto",
[junit4:junit4]   2> 	      "type":"boolean",
[junit4:junit4]   2> 	      "indexed":true,
[junit4:junit4]   2> 	      "stored":true},
[junit4:junit4]   2> 	    {
[junit4:junit4]   2> 	      "name":"uniq",
[junit4:junit4]   2> 	      "type":"string",
[junit4:junit4]   2> 	      "multiValued":true,
[junit4:junit4]   2> 	      "indexed":true,
[junit4:junit4]   2> 	      "stored":true},
[junit4:junit4]   2> 	    {
[junit4:junit4]   2> 	      "name":"store",
[junit4:junit4]   2> 	      "type":"location",
[junit4:junit4]   2> 	      "indexed":true,
[junit4:junit4]   2> 	      "stored":true},
[junit4:junit4]   2> 	    {
[junit4:junit4]   2> 	      "name":"keywordtok",
[junit4:junit4]   2> 	      "type":"keywordtok",
[junit4:junit4]   2> 	      "indexed":true,
[junit4:junit4]   2> 	      "stored":true},
[junit4:junit4]   2> 	    {
[junit4:junit4]   2> 	      "name":"point_hash",
[junit4:junit4]   2> 	      "type":"geohash",
[junit4:junit4]   2> 	      "multiValued":false,
[junit4:junit4]   2> 	      "indexed":true,
[junit4:junit4]   2> 	      "stored":true},
[junit4:junit4]   2> 	    {
[junit4:junit4]   2> 	      "name":"weight",
[junit4:junit4]   2> 	      "type":"float",
[junit4:junit4]   2> 	      "indexed":true,
[junit4:junit4]   2> 	      "stored":true},
[junit4:junit4]   2> 	    {
[junit4:junit4]   2> 	      "name":"syn",
[junit4:junit4]   2> 	      "type":"syn",
[junit4:junit4]   2> 	      "indexed":true,
[junit4:junit4]   2> 	      "stored":true},
[junit4:junit4]   2> 	    {
[junit4:junit4]   2> 	      "name":"HTMLwhitetok",
[junit4:junit4]   2> 	      "type":"HTMLwhitetok",
[junit4:junit4]   2> 	      "indexed":true,
[junit4:junit4]   2> 	      "stored":true},
[junit4:junit4]   2> 	    {
[junit4:junit4]   2> 	      "name":"whitetok",
[junit4:junit4]   2> 	      "type":"whitetok",
[junit4:junit4]   2> 	      "indexed":true,
[junit4:junit4]   2> 	      "stored":true},
[junit4:junit4]   2> 	    {
[junit4:junit4]   2> 	      "name":"nullfirst",
[junit4:junit4]   2> 	      "type":"string",
[junit4:junit4]   2> 	      "sortMissingFirst":true,
[junit4:junit4]   2> 	      "indexed":true,
[junit4:junit4]   2> 	      "stored":true},
[junit4:junit4]   2> 	    {
[junit4:junit4]   2> 	      "name":"bind",
[junit4:junit4]   2> 	      "type":"boolean",
[junit4:junit4]   2> 	      "indexed":true,
[junit4:junit4]   2> 	      "stored":false},
[junit4:junit4]   2> 	    {
[junit4:junit4]   2> 	      "name":"test_postv",
[junit4:junit4]   2> 	      "type":"text",
[junit4:junit4]   2> 	      "termVectors":true,
[junit4:junit4]   2> 	      "termPositions":true},
[junit4:junit4]   2> 	    {
[junit4:junit4]   2> 	      "name":"standardfilt",
[junit4:junit4]   2> 	      "type":"standardfilt",
[junit4:junit4]   2> 	      "indexed":true,
[junit4:junit4]   2> 	      "stored":true},
[junit4:junit4]   2> 	    {
[junit4:junit4]   2> 	      "name":"standardtokfilt",
[junit4:junit4]   2> 	      "type":"standardtokfilt",
[junit4:junit4]   2> 	      "indexed":true,
[junit4:junit4]   2> 	      "stored":true},
[junit4:junit4]   2> 	    {
[junit4:junit4]   2> 	      "name":"subject",
[junit4:junit4]   2> 	      "type":"text",
[junit4:junit4]   2> 	      "indexed":true,
[junit4:junit4]   2> 	      "stored":true},
[junit4:junit4]   2> 	    {
[junit4:junit4]   2> 	      "name":"standardtok",
[junit4:junit4]   2> 	      "type":"standardtok",
[junit4:junit4]   2> 	      "indexed":true,
[junit4:junit4]   2> 	      "stored":true},
[junit4:junit4]   2> 	    {
[junit4:junit4]   2> 	      "name":"title",
[junit4:junit4]   2> 	      "type":"nametext",
[junit4:junit4]   2> 	      "indexed":true,
[junit4:junit4]   2> 	      "stored":true},
[junit4:junit4]   2> 	    {
[junit4:junit4]   2> 	      "name":"patternreplacefilt",
[junit4:junit4]   2> 	      "type":"patternreplacefilt",
[junit4:junit4]   2> 	      "indexed":true,
[junit4:junit4]   2> 	      "stored":true},
[junit4:junit4]   2> 	    {
[junit4:junit4]   2> 	      "name":"name",
[junit4:junit4]   2> 	      "type":"nametext",
[junit4:junit4]   2> 	      "indexed":true,
[junit4:junit4]   2> 	      "stored":true},
[junit4:junit4]   2> 	    {
[junit4:junit4]   2> 	      "name":"point",
[junit4:junit4]   2> 	      "type":"xy",
[junit4:junit4]   2> 	      "multiValued":false,
[junit4:junit4]   2> 	      "indexed":true,
[junit4:junit4]   2> 	      "stored":true},
[junit4:junit4]   2> 	    {
[junit4:junit4]   2> 	      "name":"copyfield_source",
[junit4:junit4]   2> 	      "type":"string",
[junit4:junit4]   2> 	      "multiValued":true,
[junit4:junit4]   2> 	      "indexed":true,
[junit4:junit4]   2> 	      "stored":true},
[junit4:junit4]   2> 	    {
[junit4:junit4]   2> 	      "name":"stopfilt",
[junit4:junit4]   2> 	      "type":"stopfilt",
[junit4:junit4]   2> 	      "indexed":true,
[junit4:junit4]   2> 	      "stored":true},
[junit4:junit4]   2> 	    {
[junit4:junit4]   2> 	      "name":"shouldbestored",
[junit4:junit4]   2> 	      "type":"unstored",
[junit4:junit4]   2> 	      "stored":true},
[junit4:junit4]   2> 	    {
[junit4:junit4]   2> 	      "name":"shouldbeunstored",
[junit4:junit4]   2> 	      "type":"unstored"},
[junit4:junit4]   2> 	    {
[junit4:junit4]   2> 	      "name":"uniq3",
[junit4:junit4]   2> 	      "type":"string",
[junit4:junit4]   2> 	      "indexed":true,
[junit4:junit4]   2> 	      "stored":true},
[junit4:junit4]   2> 	    {
[junit4:junit4]   2> 	      "name":"timestamp",
[junit4:junit4]   2> 	      "type":"date",
[junit4:junit4]   2> 	      "indexed":true,
[junit4:junit4]   2> 	      "stored":true},
[junit4:junit4]   2> 	    {
[junit4:junit4]   2> 	      "name":"_version_",
[junit4:junit4]   2> 	      "type":"long",
[junit4:junit4]   2> 	      "indexed":true,
[junit4:junit4]   2> 	      "stored":true},
[junit4:junit4]   2> 	    {
[junit4:junit4]   2> 	      "name":"wdf_nocase",
[junit4:junit4]   2> 	      "type":"wdf_nocase",
[junit4:junit4]   2> 	      "indexed":true,
[junit4:junit4]   2> 	      "stored":true},
[junit4:junit4]   2> 	    {
[junit4:junit4]   2> 	      "name":"uuid",
[junit4:junit4]   2> 	      "type":"uuid",
[junit4:junit4]   2> 	      "stored":true},
[junit4:junit4]   2> 	    {
[junit4:junit4]   2> 	      "name":"signatureField",
[junit4:junit4]   2> 	      "type":"string",
[junit4:junit4]   2> 	      "indexed":true,
[junit4:junit4]   2> 	      "stored":false},
[junit4:junit4]   2> 	    {
[junit4:junit4]   2> 	      "name":"isto",
[junit4:junit4]   2> 	      "type":"int",
[junit4:junit4]   2> 	      "indexed":false,
[junit4:junit4]   2> 	      "stored":true},
[junit4:junit4]   2> 	    {
[junit4:junit4]   2> 	      "name":"bday",
[junit4:junit4]   2> 	      "type":"date",
[junit4:junit4]   2> 	      "indexed":true,
[junit4:junit4]   2> 	      "stored":true},
[junit4:junit4]   2> 	    {
[junit4:junit4]   2> 	      "name":"custengporterfilt",
[junit4:junit4]   2> 	      "type":"custengporterfilt",
[junit4:junit4]   2> 	      "indexed":true,
[junit4:junit4]   2> 	      "stored":true}]}
[junit4:junit4]   2> 	
[junit4:junit4]   2> 	 request = /schema/fields?indent=on&wt=json
[junit4:junit4]   2> 	
[junit4:junit4]   2> 1724 T1096 oas.SolrTestCaseJ4.tearDown ###Ending testJsonGetAllFields
[junit4:junit4]   2> NOTE: reproduce with: ant test  -Dtestcase=TestFieldCollectionResource -Dtests.method=testJsonGetAllFields -Dtests.seed=E966CB0630F145B1 -Dtests.multiplier=3 -Dtests.slow=true -Dtests.locale=in -Dtests.timezone=Asia/Samarkand -Dtests.file.encoding=ISO-8859-1
[junit4:junit4] ERROR   0.05s J1 | TestFieldCollectionResource.testJsonGetAllFields <<<
[junit4:junit4]    > Throwable #1: java.lang.RuntimeException: mismatch: 'custstopfilt'!='dedup' @ fields/[0]/name
[junit4:junit4]    > 	at __randomizedtesting.SeedInfo.seed([E966CB0630F145B1:6066B98A90420997]:0)
[junit4:junit4]    > 	at org.apache.solr.util.RestTestBase.assertJQ(RestTestBase.java:242)
[junit4:junit4]    > 	at org.apache.solr.util.RestTestBase.assertJQ(RestTestBase.java:186)
[junit4:junit4]    > 	at org.apache.solr.rest.TestFieldCollectionResource.testJsonGetAllFields(TestFieldCollectionResource.java:50)
[junit4:junit4]    > 	at sun.reflect.NativeMethodAccessorImpl.invoke0(Native Method)
[junit4:junit4]    > 	at sun.reflect.NativeMethodAccessorImpl.invoke(NativeMethodAccessorImpl.java:57)
[junit4:junit4]    > 	at sun.reflect.DelegatingMethodAccessorImpl.invoke(DelegatingMethodAccessorImpl.java:43)
[junit4:junit4]    > 	at java.lang.reflect.Method.invoke(Method.java:487)
[junit4:junit4]    > 	at com.carrotsearch.randomizedtesting.RandomizedRunner.invoke(RandomizedRunner.java:1559)
[junit4:junit4]    > 	at com.carrotsearch.randomizedtesting.RandomizedRunner.access$600(RandomizedRunner.java:79)
[junit4:junit4]    > 	at com.carrotsearch.randomizedtesting.RandomizedRunner$6.evaluate(RandomizedRunner.java:737)
[junit4:junit4]    > 	at com.carrotsearch.randomizedtesting.RandomizedRunner$7.evaluate(RandomizedRunner.java:773)
[junit4:junit4]    > 	at com.carrotsearch.randomizedtesting.RandomizedRunner$8.evaluate(RandomizedRunner.java:787)
[junit4:junit4]    > 	at com.carrotsearch.randomizedtesting.rules.SystemPropertiesRestoreRule$1.evaluate(SystemPropertiesRestoreRule.java:53)
[junit4:junit4]    > 	at org.apache.lucene.util.TestRuleSetupTeardownChained$1.evaluate(TestRuleSetupTeardownChained.java:50)
[junit4:junit4]    > 	at org.apache.lucene.util.TestRuleFieldCacheSanity$1.evaluate(TestRuleFieldCacheSanity.java:51)
[junit4:junit4]    > 	at org.apache.lucene.util.AbstractBeforeAfterRule$1.evaluate(AbstractBeforeAfterRule.java:46)
[junit4:junit4]    > 	at com.carrotsearch.randomizedtesting.rules.SystemPropertiesInvariantRule$1.evaluate(SystemPropertiesInvariantRule.java:55)
[junit4:junit4]    > 	at org.apache.lucene.util.TestRuleThreadAndTestName$1.evaluate(TestRuleThreadAndTestName.java:49)
[junit4:junit4]    > 	at org.apache.lucene.util.TestRuleIgnoreAfterMaxFailures$1.evaluate(TestRuleIgnoreAfterMaxFailures.java:70)
[junit4:junit4]    > 	at org.apache.lucene.util.TestRuleMarkFailure$1.evaluate(TestRuleMarkFailure.java:48)
[junit4:junit4]    > 	at com.carrotsearch.randomizedtesting.rules.StatementAdapter.evaluate(StatementAdapter.java:36)
[junit4:junit4]    > 	at com.carrotsearch.randomizedtesting.ThreadLeakControl$StatementRunner.run(ThreadLeakControl.java:358)
[junit4:junit4]    > 	at com.carrotsearch.randomizedtesting.ThreadLeakControl.forkTimeoutingTask(ThreadLeakControl.java:782)
[junit4:junit4]    > 	at com.carrotsearch.randomizedtesting.ThreadLeakControl$3.evaluate(ThreadLeakControl.java:442)
[junit4:junit4]    > 	at com.carrotsearch.randomizedtesting.RandomizedRunner.runSingleTest(RandomizedRunner.java:746)
[junit4:junit4]    > 	at com.carrotsearch.randomizedtesting.RandomizedRunner$3.evaluate(RandomizedRunner.java:648)
[junit4:junit4]    > 	at com.carrotsearch.randomizedtesting.RandomizedRunner$4.evaluate(RandomizedRunner.java:682)
[junit4:junit4]    > 	at com.carrotsearch.randomizedtesting.RandomizedRunner$5.evaluate(RandomizedRunner.java:693)
[junit4:junit4]    > 	at com.carrotsearch.randomizedtesting.rules.StatementAdapter.evaluate(StatementAdapter.java:36)
[junit4:junit4]    > 	at com.carrotsearch.randomizedtesting.rules.SystemPropertiesRestoreRule$1.evaluate(SystemPropertiesRestoreRule.java:53)
[junit4:junit4]    > 	at org.apache.lucene.util.AbstractBeforeAfterRule$1.evaluate(AbstractBeforeAfterRule.java:46)
[junit4:junit4]    > 	at org.apache.lucene.util.TestRuleStoreClassName$1.evaluate(TestRuleStoreClassName.java:42)
[junit4:junit4]    > 	at com.carrotsearch.randomizedtesting.rules.SystemPropertiesInvariantRule$1.evaluate(SystemPropertiesInvariantRule.java:55)
[junit4:junit4]    > 	at com.carrotsearch.randomizedtesting.rules.NoShadowingOrOverridesOnMethodsRule$1.evaluate(NoShadowingOrOverridesOnMethodsRule.java:39)
[junit4:junit4]    > 	at com.carrotsearch.randomizedtesting.rules.NoShadowingOrOverridesOnMethodsRule$1.evaluate(NoShadowingOrOverridesOnMethodsRule.java:39)
[junit4:junit4]    > 	at com.carrotsearch.randomizedtesting.rules.StatementAdapter.evaluate(StatementAdapter.java:36)
[junit4:junit4]    > 	at org.apache.lucene.util.TestRuleAssertionsRequired$1.evaluate(TestRuleAssertionsRequired.java:43)
[junit4:junit4]    > 	at org.apache.lucene.util.TestRuleMarkFailure$1.evaluate(TestRuleMarkFailure.java:48)
[junit4:junit4]    > 	at org.apache.lucene.util.TestRuleIgnoreAfterMaxFailures$1.evaluate(TestRuleIgnoreAfterMaxFailures.java:70)
[junit4:junit4]    > 	at org.apache.lucene.util.TestRuleIgnoreTestSuites$1.evaluate(TestRuleIgnoreTestSuites.java:55)
[junit4:junit4]    > 	at com.carrotsearch.randomizedtesting.rules.StatementAdapter.evaluate(StatementAdapter.java:36)
[junit4:junit4]    > 	at com.carrotsearch.randomizedtesting.ThreadLeakControl$StatementRunner.run(ThreadLeakControl.java:358)
[junit4:junit4]    > 	at java.lang.Thread.run(Thread.java:722)
[junit4:junit4]   2> 1744 T1096 oas.SolrTestCaseJ4.setUp ###Starting testGetAllFields
[junit4:junit4]   2> 1747 T1105 C31 oasr.BaseSchemaResource.handlePostExecution [collection1] webapp=/solr path=/schema/fields params={wt=xml&indent=on} status=0 QTime=1 
[junit4:junit4]   2> 1748 T1105 C31 orel.LogFilter.afterHandle 2013-03-07	12:03:36	127.0.0.1	-	127.0.0.1	33108	GET	/solr/schema/fields	indent=on&wt=xml	200	-	0	2	https://127.0.0.1:33108	Java/1.8.0-ea	-
[junit4:junit4]   2> 1776 T1096 oasu.RestTestBase.assertQ SEVERE REQUEST FAILED: xpath=(/response/arr[@name='fields']/lst/str[@name='name'])[1] = 'custstopfilt'
[junit4:junit4]   2> 		xml response was: <?xml version="1.0" encoding="UTF-8"?>
[junit4:junit4]   2> 	<response>
[junit4:junit4]   2> 	
[junit4:junit4]   2> 	<lst name="responseHeader">
[junit4:junit4]   2> 	  <int name="status">0</int>
[junit4:junit4]   2> 	  <int name="QTime">1</int>
[junit4:junit4]   2> 	</lst>
[junit4:junit4]   2> 	<arr name="fields">
[junit4:junit4]   2> 	  <lst>
[junit4:junit4]   2> 	    <str name="name">dedup</str>
[junit4:junit4]   2> 	    <str name="type">dedup</str>
[junit4:junit4]   2> 	    <bool name="indexed">true</bool>
[junit4:junit4]   2> 	    <bool name="stored">true</bool>
[junit4:junit4]   2> 	  </lst>
[junit4:junit4]   2> 	  <lst>
[junit4:junit4]   2> 	    <str name="name">title_lettertok</str>
[junit4:junit4]   2> 	    <str name="type">lettertok</str>
[junit4:junit4]   2> 	    <bool name="indexed">true</bool>
[junit4:junit4]   2> 	    <bool name="stored">false</bool>
[junit4:junit4]   2> 	  </lst>
[junit4:junit4]   2> 	  <lst>
[junit4:junit4]   2> 	    <str name="name">protectedsubword</str>
[junit4:junit4]   2> 	    <str name="type">protectedsubword</str>
[junit4:junit4]   2> 	    <bool name="indexed">true</bool>
[junit4:junit4]   2> 	    <bool name="stored">true</bool>
[junit4:junit4]   2> 	  </lst>
[junit4:junit4]   2> 	  <lst>
[junit4:junit4]   2> 	    <str name="name">subword</str>
[junit4:junit4]   2> 	    <str name="type">subword</str>
[junit4:junit4]   2> 	    <bool name="indexed">true</bool>
[junit4:junit4]   2> 	    <bool name="stored">true</bool>
[junit4:junit4]   2> 	  </lst>
[junit4:junit4]   2> 	  <lst>
[junit4:junit4]   2> 	    <str name="name">sku1</str>
[junit4:junit4]   2> 	    <str name="type">skutype1</str>
[junit4:junit4]   2> 	    <bool name="indexed">true</bool>
[junit4:junit4]   2> 	    <bool name="stored">true</bool>
[junit4:junit4]   2> 	  </lst>
[junit4:junit4]   2> 	  <lst>
[junit4:junit4]   2> 	    <str name="name">title_stemmed</str>
[junit4:junit4]   2> 	    <str name="type">text</str>
[junit4:junit4]   2> 	    <bool name="indexed">true</bool>
[junit4:junit4]   2> 	    <bool name="stored">false</bool>
[junit4:junit4]   2> 	  </lst>
[junit4:junit4]   2> 	  <lst>
[junit4:junit4]   2> 	    <str name="name">textgap</str>
[junit4:junit4]   2> 	    <str name="type">textgap</str>
[junit4:junit4]   2> 	    <bool name="indexed">true</bool>
[junit4:junit4]   2> 	    <bool name="stored">true</bool>
[junit4:junit4]   2> 	  </lst>
[junit4:junit4]   2> 	  <lst>
[junit4:junit4]   2> 	    <str name="name">wdf_preserve</str>
[junit4:junit4]   2> 	    <str name="type">wdf_preserve</str>
[junit4:junit4]   2> 	    <bool name="indexed">true</bool>
[junit4:junit4]   2> 	    <bool name="stored">true</bool>
[junit4:junit4]   2> 	  </lst>
[junit4:junit4]   2> 	  <lst>
[junit4:junit4]   2> 	    <str name="name">nouniq</str>
[junit4:junit4]   2> 	    <str name="type">string</str>
[junit4:junit4]   2> 	    <bool name="multiValued">true</bool>
[junit4:junit4]   2> 	    <bool name="indexed">true</bool>
[junit4:junit4]   2> 	    <bool name="stored">true</bool>
[junit4:junit4]   2> 	  </lst>
[junit4:junit4]   2> 	  <lst>
[junit4:junit4]   2> 	    <str name="name">test_hlt</str>
[junit4:junit4]   2> 	    <str name="type">highlittext</str>
[junit4:junit4]   2> 	    <bool name="indexed">true</bool>
[junit4:junit4]   2> 	    <bool name="compressed">true</bool>
[junit4:junit4]   2> 	  </lst>
[junit4:junit4]   2> 	  <lst>
[junit4:junit4]   2> 	    <str name="name">test_hlt_off</str>
[junit4:junit4]   2> 	    <str name="type">highlittext</str>
[junit4:junit4]   2> 	    <bool name="indexed">true</bool>
[junit4:junit4]   2> 	    <bool name="compressed">false</bool>
[junit4:junit4]   2> 	  </lst>
[junit4:junit4]   2> 	  <lst>
[junit4:junit4]   2> 	    <str name="name">porterfilt</str>
[junit4:junit4]   2> 	    <str name="type">porterfilt</str>
[junit4:junit4]   2> 	    <bool name="indexed">true</bool>
[junit4:junit4]   2> 	    <bool name="stored">true</bool>
[junit4:junit4]   2> 	  </lst>
[junit4:junit4]   2> 	  <lst>
[junit4:junit4]   2> 	    <str name="name">test_offtv</str>
[junit4:junit4]   2> 	    <str name="type">text</str>
[junit4:junit4]   2> 	    <bool name="termOffsets">true</bool>
[junit4:junit4]   2> 	    <bool name="termVectors">true</bool>
[junit4:junit4]   2> 	  </lst>
[junit4:junit4]   2> 	  <lst>
[junit4:junit4]   2> 	    <str name="name">iind</str>
[junit4:junit4]   2> 	    <str name="type">int</str>
[junit4:junit4]   2> 	    <bool name="indexed">true</bool>
[junit4:junit4]   2> 	    <bool name="stored">false</bool>
[junit4:junit4]   2> 	  </lst>
[junit4:junit4]   2> 	  <lst>
[junit4:junit4]   2> 	    <str name="name">teststop</str>
[junit4:junit4]   2> 	    <str name="type">teststop</str>
[junit4:junit4]   2> 	    <bool name="indexed">true</bool>
[junit4:junit4]   2> 	    <bool name="stored">true</bool>
[junit4:junit4]   2> 	  </lst>
[junit4:junit4]   2> 	  <lst>
[junit4:junit4]   2> 	    <str name="name">text_np</str>
[junit4:junit4]   2> 	    <str name="type">text_np</str>
[junit4:junit4]   2> 	    <bool name="indexed">true</bool>
[junit4:junit4]   2> 	    <bool name="stored">false</bool>
[junit4:junit4]   2> 	  </lst>
[junit4:junit4]   2> 	  <lst>
[junit4:junit4]   2> 	    <str name="name">sku2</str>
[junit4:junit4]   2> 	    <str name="type">skutype2</str>
[junit4:junit4]   2> 	    <bool name="indexed">true</bool>
[junit4:junit4]   2> 	    <bool name="stored">true</bool>
[junit4:junit4]   2> 	  </lst>
[junit4:junit4]   2> 	  <lst>
[junit4:junit4]   2> 	    <str name="name">HTMLstandardtok</str>
[junit4:junit4]   2> 	    <str name="type">HTMLstandardtok</str>
[junit4:junit4]   2> 	    <bool name="indexed">true</bool>
[junit4:junit4]   2> 	    <bool name="stored">true</bool>
[junit4:junit4]   2> 	  </lst>
[junit4:junit4]   2> 	  <lst>
[junit4:junit4]   2> 	    <str name="name">engporterfilt</str>
[junit4:junit4]   2> 	    <str name="type">engporterfilt</str>
[junit4:junit4]   2> 	    <bool name="indexed">true</bool>
[junit4:junit4]   2> 	    <bool name="stored">true</bool>
[junit4:junit4]   2> 	  </lst>
[junit4:junit4]   2> 	  <lst>
[junit4:junit4]   2> 	    <str name="name">lengthfilt</str>
[junit4:junit4]   2> 	    <str name="type">lengthfilt</str>
[junit4:junit4]   2> 	    <bool name="indexed">true</bool>
[junit4:junit4]   2> 	    <bool name="stored">true</bool>
[junit4:junit4]   2> 	  </lst>
[junit4:junit4]   2> 	  <lst>
[junit4:junit4]   2> 	    <str name="name">sind</str>
[junit4:junit4]   2> 	    <str name="type">string</str>
[junit4:junit4]   2> 	    <bool name="indexed">true</bool>
[junit4:junit4]   2> 	    <bool name="stored">false</bool>
[junit4:junit4]   2> 	  </lst>
[junit4:junit4]   2> 	  <lst>
[junit4:junit4]   2> 	    <str name="name">lettertok</str>
[junit4:junit4]   2> 	    <str name="type">lettertok</str>
[junit4:junit4]   2> 	    <bool name="indexed">true</bool>
[junit4:junit4]   2> 	    <bool name="stored">true</bool>
[junit4:junit4]   2> 	  </lst>
[junit4:junit4]   2> 	  <lst>
[junit4:junit4]   2> 	    <str name="name">bsto</str>
[junit4:junit4]   2> 	    <str name="type">boolean</str>
[junit4:junit4]   2> 	    <bool name="indexed">false</bool>
[junit4:junit4]   2> 	    <bool name="stored">true</bool>
[junit4:junit4]   2> 	  </lst>
[junit4:junit4]   2> 	  <lst>
[junit4:junit4]   2> 	    <str name="name">lowerfilt</str>
[junit4:junit4]   2> 	    <str name="type">lowerfilt</str>
[junit4:junit4]   2> 	    <bool name="indexed">true</bool>
[junit4:junit4]   2> 	    <bool name="stored">true</bool>
[junit4:junit4]   2> 	  </lst>
[junit4:junit4]   2> 	  <lst>
[junit4:junit4]   2> 	    <str name="name">test_notv</str>
[junit4:junit4]   2> 	    <str name="type">text</str>
[junit4:junit4]   2> 	    <bool name="termVectors">false</bool>
[junit4:junit4]   2> 	  </lst>
[junit4:junit4]   2> 	  <lst>
[junit4:junit4]   2> 	    <str name="name">lowertok</str>
[junit4:junit4]   2> 	    <str name="type">lowertok</str>
[junit4:junit4]   2> 	    <bool name="indexed">true</bool>
[junit4:junit4]   2> 	    <bool name="stored">true</bool>
[junit4:junit4]   2> 	  </lst>
[junit4:junit4]   2> 	  <lst>
[junit4:junit4]   2> 	    <str name="name">custstopfilt</str>
[junit4:junit4]   2> 	    <str name="type">custstopfilt</str>
[junit4:junit4]   2> 	    <bool name="indexed">true</bool>
[junit4:junit4]   2> 	    <bool name="stored">true</bool>
[junit4:junit4]   2> 	  </lst>
[junit4:junit4]   2> 	  <lst>
[junit4:junit4]   2> 	    <str name="name">ssto</str>
[junit4:junit4]   2> 	    <str name="type">string</str>
[junit4:junit4]   2> 	    <bool name="indexed">false</bool>
[junit4:junit4]   2> 	    <bool name="stored">true</bool>
[junit4:junit4]   2> 	  </lst>
[junit4:junit4]   2> 	  <lst>
[junit4:junit4]   2> 	    <str name="name">uniq2</str>
[junit4:junit4]   2> 	    <str name="type">string</str>
[junit4:junit4]   2> 	    <bool name="multiValued">true</bool>
[junit4:junit4]   2> 	    <bool name="indexed">true</bool>
[junit4:junit4]   2> 	    <bool name="stored">true</bool>
[junit4:junit4]   2> 	  </lst>
[junit4:junit4]   2> 	  <lst>
[junit4:junit4]   2> 	    <str name="name">sindsto</str>
[junit4:junit4]   2> 	    <str name="type">string</str>
[junit4:junit4]   2> 	    <bool name="indexed">true</bool>
[junit4:junit4]   2> 	    <bool name="stored">true</bool>
[junit4:junit4]   2> 	  </lst>
[junit4:junit4]   2> 	  <lst>
[junit4:junit4]   2> 	    <str name="name">test_posofftv</str>
[junit4:junit4]   2> 	    <str name="type">text</str>
[junit4:junit4]   2> 	    <bool name="termOffsets">true</bool>
[junit4:junit4]   2> 	    <bool name="termVectors">true</bool>
[junit4:junit4]   2> 	    <bool name="termPositions">true</bool>
[junit4:junit4]   2> 	  </lst>
[junit4:junit4]   2> 	  <lst>
[junit4:junit4]   2> 	    <str name="name">test_basictv</str>
[junit4:junit4]   2> 	    <str name="type">text</str>
[junit4:junit4]   2> 	    <bool name="termVectors">true</bool>
[junit4:junit4]   2> 	  </lst>
[junit4:junit4]   2> 	  <lst>
[junit4:junit4]   2> 	    <str name="name">pointD</str>
[junit4:junit4]   2> 	    <str name="type">xyd</str>
[junit4:junit4]   2> 	    <bool name="multiValued">false</bool>
[junit4:junit4]   2> 	    <bool name="indexed">true</bool>
[junit4:junit4]   2> 	    <bool name="stored">true</bool>
[junit4:junit4]   2> 	  </lst>
[junit4:junit4]   2> 	  <lst>
[junit4:junit4]   2> 	    <str name="name">shouldbeunindexed</str>
[junit4:junit4]   2> 	    <str name="type">unstored</str>
[junit4:junit4]   2> 	    <bool name="indexed">false</bool>
[junit4:junit4]   2> 	    <bool name="stored">true</bool>
[junit4:junit4]   2> 	  </lst>
[junit4:junit4]   2> 	  <lst>
[junit4:junit4]   2> 	    <str name="name">id</str>
[junit4:junit4]   2> 	    <str name="type">string</str>
[junit4:junit4]   2> 	    <bool name="multiValued">false</bool>
[junit4:junit4]   2> 	    <bool name="required">true</bool>
[junit4:junit4]   2> 	    <bool name="indexed">true</bool>
[junit4:junit4]   2> 	    <bool name="stored">true</bool>
[junit4:junit4]   2> 	    <bool name="uniqueKey">true</bool>
[junit4:junit4]   2> 	  </lst>
[junit4:junit4]   2> 	  <lst>
[junit4:junit4]   2> 	    <str name="name">text</str>
[junit4:junit4]   2> 	    <str name="type">text</str>
[junit4:junit4]   2> 	    <bool name="multiValued">true</bool>
[junit4:junit4]   2> 	    <bool name="indexed">true</bool>
[junit4:junit4]   2> 	    <bool name="stored">false</bool>
[junit4:junit4]   2> 	  </lst>
[junit4:junit4]   2> 	  <lst>
[junit4:junit4]   2> 	    <str name="name">numericsubword</str>
[junit4:junit4]   2> 	    <str name="type">numericsubword</str>
[junit4:junit4]   2> 	    <bool name="indexed">true</bool>
[junit4:junit4]   2> 	    <bool name="stored">true</bool>
[junit4:junit4]   2> 	  </lst>
[junit4:junit4]   2> 	  <lst>
[junit4:junit4]   2> 	    <str name="name">numberpartfail</str>
[junit4:junit4]   2> 	    <str name="type">failtype1</str>
[junit4:junit4]   2> 	    <bool name="indexed">true</bool>
[junit4:junit4]   2> 	    <bool name="stored">true</bool>
[junit4:junit4]   2> 	  </lst>
[junit4:junit4]   2> 	  <lst>
[junit4:junit4]   2> 	    <str name="name">bindsto</str>
[junit4:junit4]   2> 	    <str name="type">boolean</str>
[junit4:junit4]   2> 	    <bool name="indexed">true</bool>
[junit4:junit4]   2> 	    <bool name="stored">true</bool>
[junit4:junit4]   2> 	  </lst>
[junit4:junit4]   2> 	  <lst>
[junit4:junit4]   2> 	    <str name="name">uniq</str>
[junit4:junit4]   2> 	    <str name="type">string</str>
[junit4:junit4]   2> 	    <bool name="multiValued">true</bool>
[junit4:junit4]   2> 	    <bool name="indexed">true</bool>
[junit4:junit4]   2> 	    <bool name="stored">true</bool>
[junit4:junit4]   2> 	  </lst>
[junit4:junit4]   2> 	  <lst>
[junit4:junit4]   2> 	    <str name="name">store</str>
[junit4:junit4]   2> 	    <str name="type">location</str>
[junit4:junit4]   2> 	    <bool name="indexed">true</bool>
[junit4:junit4]   2> 	    <bool name="stored">true</bool>
[junit4:junit4]   2> 	  </lst>
[junit4:junit4]   2> 	  <lst>
[junit4:junit4]   2> 	    <str name="name">keywordtok</str>
[junit4:junit4]   2> 	    <str name="type">keywordtok</str>
[junit4:junit4]   2> 	    <bool name="indexed">true</bool>
[junit4:junit4]   2> 	    <bool name="stored">true</bool>
[junit4:junit4]   2> 	  </lst>
[junit4:junit4]   2> 	  <lst>
[junit4:junit4]   2> 	    <str name="name">point_hash</str>
[junit4:junit4]   2> 	    <str name="type">geohash</str>
[junit4:junit4]   2> 	    <bool name="multiValued">false</bool>
[junit4:junit4]   2> 	    <bool name="indexed">true</bool>
[junit4:junit4]   2> 	    <bool name="stored">true</bool>
[junit4:junit4]   2> 	  </lst>
[junit4:junit4]   2> 	  <lst>
[junit4:junit4]   2> 	    <str name="name">weight</str>
[junit4:junit4]   2> 	    <str name="type">float</str>
[junit4:junit4]   2> 	    <bool name="indexed">true</bool>
[junit4:junit4]   2> 	    <bool name="stored">true</bool>
[junit4:junit4]   2> 	  </lst>
[junit4:junit4]   2> 	  <lst>
[junit4:junit4]   2> 	    <str name="name">syn</str>
[junit4:junit4]   2> 	    <str name="type">syn</str>
[junit4:junit4]   2> 	    <bool name="indexed">true</bool>
[junit4:junit4]   2> 	    <bool name="stored">true</bool>
[junit4:junit4]   2> 	  </lst>
[junit4:junit4]   2> 	  <lst>
[junit4:junit4]   2> 	    <str name="name">HTMLwhitetok</str>
[junit4:junit4]   2> 	    <str name="type">HTMLwhitetok</str>
[junit4:junit4]   2> 	    <bool name="indexed">true</bool>
[junit4:junit4]   2> 	    <bool name="stored">true</bool>
[junit4:junit4]   2> 	  </lst>
[junit4:junit4]   2> 	  <lst>
[junit4:junit4]   2> 	    <str name="name">whitetok</str>
[junit4:junit4]   2> 	    <str name="type">whitetok</str>
[junit4:junit4]   2> 	    <bool name="indexed">true</bool>
[junit4:junit4]   2> 	    <bool name="stored">true</bool>
[junit4:junit4]   2> 	  </lst>
[junit4:junit4]   2> 	  <lst>
[junit4:junit4]   2> 	    <str name="name">nullfirst</str>
[junit4:junit4]   2> 	    <str name="type">string</str>
[junit4:junit4]   2> 	    <bool name="sortMissingFirst">true</bool>
[junit4:junit4]   2> 	    <bool name="indexed">true</bool>
[junit4:junit4]   2> 	    <bool name="stored">true</bool>
[junit4:junit4]   2> 	  </lst>
[junit4:junit4]   2> 	  <lst>
[junit4:junit4]   2> 	    <str name="name">bind</str>
[junit4:junit4]   2> 	    <str name="type">boolean</str>
[junit4:junit4]   2> 	    <bool name="indexed">true</bool>
[junit4:junit4]   2> 	    <bool name="stored">false</bool>
[junit4:junit4]   2> 	  </lst>
[junit4:junit4]   2> 	  <lst>
[junit4:junit4]   2> 	    <str name="name">test_postv</str>
[junit4:junit4]   2> 	    <str name="type">text</str>
[junit4:junit4]   2> 	    <bool name="termVectors">true</bool>
[junit4:junit4]   2> 	    <bool name="termPositions">true</bool>
[junit4:junit4]   2> 	  </lst>
[junit4:junit4]   2> 	  <lst>
[junit4:junit4]   2> 	    <str name="name">standardfilt</str>
[junit4:junit4]   2> 	    <str name="type">standardfilt</str>
[junit4:junit4]   2> 	    <bool name="indexed">true</bool>
[junit4:junit4]   2> 	    <bool name="stored">true</bool>
[junit4:junit4]   2> 	  </lst>
[junit4:junit4]   2> 	  <lst>
[junit4:junit4]   2> 	    <str name="name">standardtokfilt</str>
[junit4:junit4]   2> 	    <str name="type">standardtokfilt</str>
[junit4:junit4]   2> 	    <bool name="indexed">true</bool>
[junit4:junit4]   2> 	    <bool name="stored">true</bool>
[junit4:junit4]   2> 	  </lst>
[junit4:junit4]   2> 	  <lst>
[junit4:junit4]   2> 	    <str name="name">subject</str>
[junit4:junit4]   2> 	    <str name="type">text</str>
[junit4:junit4]   2> 	    <bool name="indexed">true</bool>
[junit4:junit4]   2> 	    <bool name="stored">true</bool>
[junit4:junit4]   2> 	  </lst>
[junit4:junit4]   2> 	  <lst>
[junit4:junit4]   2> 	    <str name="name">standardtok</str>
[junit4:junit4]   2> 	    <str name="type">standardtok</str>
[junit4:junit4]   2> 	    <bool name="indexed">true</bool>
[junit4:junit4]   2> 	    <bool name="stored">true</bool>
[junit4:junit4]   2> 	  </lst>
[junit4:junit4]   2> 	  <lst>
[junit4:junit4]   2> 	    <str name="name">title</str>
[junit4:junit4]   2> 	    <str name="type">nametext</str>
[junit4:junit4]   2> 	    <bool name="indexed">true</bool>
[junit4:junit4]   2> 	    <bool name="stored">true</bool>
[junit4:junit4]   2> 	  </lst>
[junit4:junit4]   2> 	  <lst>
[junit4:junit4]   2> 	    <str name="name">patternreplacefilt</str>
[junit4:junit4]   2> 	    <str name="type">patternreplacefilt</str>
[junit4:junit4]   2> 	    <bool name="indexed">true</bool>
[junit4:junit4]   2> 	    <bool name="stored">true</bool>
[junit4:junit4]   2> 	  </lst>
[junit4:junit4]   2> 	  <lst>
[junit4:junit4]   2> 	    <str name="name">name</str>
[junit4:junit4]   2> 	    <str name="type">nametext</str>
[junit4:junit4]   2> 	    <bool name="indexed">true</bool>
[junit4:junit4]   2> 	    <bool name="stored">true</bool>
[junit4:junit4]   2> 	  </lst>
[junit4:junit4]   2> 	  <lst>
[junit4:junit4]   2> 	    <str name="name">point</str>
[junit4:junit4]   2> 	    <str name="type">xy</str>
[junit4:junit4]   2> 	    <bool name="multiValued">false</bool>
[junit4:junit4]   2> 	    <bool name="indexed">true</bool>
[junit4:junit4]   2> 	    <bool name="stored">true</bool>
[junit4:junit4]   2> 	  </lst>
[junit4:junit4]   2> 	  <lst>
[junit4:junit4]   2> 	    <str name="name">copyfield_source</str>
[junit4:junit4]   2> 	    <str name="type">string</str>
[junit4:junit4]   2> 	    <bool name="multiValued">true</bool>
[junit4:junit4]   2> 	    <bool name="indexed">true</bool>
[junit4:junit4]   2> 	    <bool name="stored">true</bool>
[junit4:junit4]   2> 	  </lst>
[junit4:junit4]   2> 	  <lst>
[junit4:junit4]   2> 	    <str name="name">stopfilt</str>
[junit4:junit4]   2> 	    <str name="type">stopfilt</str>
[junit4:junit4]   2> 	    <bool name="indexed">true</bool>
[junit4:junit4]   2> 	    <bool name="stored">true</bool>
[junit4:junit4]   2> 	  </lst>
[junit4:junit4]   2> 	  <lst>
[junit4:junit4]   2> 	    <str name="name">shouldbestored</str>
[junit4:junit4]   2> 	    <str name="type">unstored</str>
[junit4:junit4]   2> 	    <bool name="stored">true</bool>
[junit4:junit4]   2> 	  </lst>
[junit4:junit4]   2> 	  <lst>
[junit4:junit4]   2> 	    <str name="name">shouldbeunstored</str>
[junit4:junit4]   2> 	    <str name="type">unstored</str>
[junit4:junit4]   2> 	  </lst>
[junit4:junit4]   2> 	  <lst>
[junit4:junit4]   2> 	    <str name="name">uniq3</str>
[junit4:junit4]   2> 	    <str name="type">string</str>
[junit4:junit4]   2> 	    <bool name="indexed">true</bool>
[junit4:junit4]   2> 	    <bool name="stored">true</bool>
[junit4:junit4]   2> 	  </lst>
[junit4:junit4]   2> 	  <lst>
[junit4:junit4]   2> 	    <str name="name">timestamp</str>
[junit4:junit4]   2> 	    <str name="type">date</str>
[junit4:junit4]   2> 	    <bool name="indexed">true</bool>
[junit4:junit4]   2> 	    <bool name="stored">true</bool>
[junit4:junit4]   2> 	  </lst>
[junit4:junit4]   2> 	  <lst>
[junit4:junit4]   2> 	    <str name="name">_version_</str>
[junit4:junit4]   2> 	    <str name="type">long</str>
[junit4:junit4]   2> 	    <bool name="indexed">true</bool>
[junit4:junit4]   2> 	    <bool name="stored">true</bool>
[junit4:junit4]   2> 	  </lst>
[junit4:junit4]   2> 	  <lst>
[junit4:junit4]   2> 	    <str name="name">wdf_nocase</str>
[junit4:junit4]   2> 	    <str name="type">wdf_nocase</str>
[junit4:junit4]   2> 	    <bool name="indexed">true</bool>
[junit4:junit4]   2> 	    <bool name="stored">true</bool>
[junit4:junit4]   2> 	  </lst>
[junit4:junit4]   2> 	  <lst>
[junit4:junit4]   2> 	    <str name="name">uuid</str>
[junit4:junit4]   2> 	    <str name="type">uuid</str>
[junit4:junit4]   2> 	    <bool name="stored">true</bool>
[junit4:junit4]   2> 	  </lst>
[junit4:junit4]   2> 	  <lst>
[junit4:junit4]   2> 	    <str name="name">signatureField</str>
[junit4:junit4]   2> 	    <str name="type">string</str>
[junit4:junit4]   2> 	    <bool name="indexed">true</bool>
[junit4:junit4]   2> 	    <bool name="stored">false</bool>
[junit4:junit4]   2> 	  </lst>
[junit4:junit4]   2> 	  <lst>
[junit4:junit4]   2> 	    <str name="name">isto</str>
[junit4:junit4]   2> 	    <str name="type">int</str>
[junit4:junit4]   2> 	    <bool name="indexed">false</bool>
[junit4:junit4]   2> 	    <bool name="stored">true</bool>
[junit4:junit4]   2> 	  </lst>
[junit4:junit4]   2> 	  <lst>
[junit4:junit4]   2> 	    <str name="name">bday</str>
[junit4:junit4]   2> 	    <str name="type">date</str>
[junit4:junit4]   2> 	    <bool name="indexed">true</bool>
[junit4:junit4]   2> 	    <bool name="stored">true</bool>
[junit4:junit4]   2> 	  </lst>
[junit4:junit4]   2> 	  <lst>
[junit4:junit4]   2> 	    <str name="name">custengporterfilt</str>
[junit4:junit4]   2> 	    <str name="type">custengporterfilt</str>
[junit4:junit4]   2> 	    <bool name="indexed">true</bool>
[junit4:junit4]   2> 	    <bool name="stored">true</bool>
[junit4:junit4]   2> 	  </lst>
[junit4:junit4]   2> 	</arr>
[junit4:junit4]   2> 	</response>
[junit4:junit4]   2> 	
[junit4:junit4]   2> 		request was:/schema/fields?indent=on&wt=xml
[junit4:junit4]   2> 1778 T1096 oasc.SolrException.log SEVERE REQUEST FAILED: /schema/fields?indent=on&wt=xml:java.lang.RuntimeException: REQUEST FAILED: xpath=(/response/arr[@name='fields']/lst/str[@name='name'])[1] = 'custstopfilt'
[junit4:junit4]   2> 		xml response was: <?xml version="1.0" encoding="UTF-8"?>
[junit4:junit4]   2> 	<response>
[junit4:junit4]   2> 	
[junit4:junit4]   2> 	<lst name="responseHeader">
[junit4:junit4]   2> 	  <int name="status">0</int>
[junit4:junit4]   2> 	  <int name="QTime">1</int>
[junit4:junit4]   2> 	</lst>
[junit4:junit4]   2> 	<arr name="fields">
[junit4:junit4]   2> 	  <lst>
[junit4:junit4]   2> 	    <str name="name">dedup</str>
[junit4:junit4]   2> 	    <str name="type">dedup</str>
[junit4:junit4]   2> 	    <bool name="indexed">true</bool>
[junit4:junit4]   2> 	    <bool name="stored">true</bool>
[junit4:junit4]   2> 	  </lst>
[junit4:junit4]   2> 	  <lst>
[junit4:junit4]   2> 	    <str name="name">title_lettertok</str>
[junit4:junit4]   2> 	    <str name="type">lettertok</str>
[junit4:junit4]   2> 	    <bool name="indexed">true</bool>
[junit4:junit4]   2> 	    <bool name="stored">false</bool>
[junit4:junit4]   2> 	  </lst>
[junit4:junit4]   2> 	  <lst>
[junit4:junit4]   2> 	    <str name="name">protectedsubword</str>
[junit4:junit4]   2> 	    <str name="type">protectedsubword</str>
[junit4:junit4]   2> 	    <bool name="indexed">true</bool>
[junit4:junit4]   2> 	    <bool name="stored">true</bool>
[junit4:junit4]   2> 	  </lst>
[junit4:junit4]   2> 	  <lst>
[junit4:junit4]   2> 	    <str name="name">subword</str>
[junit4:junit4]   2> 	    <str name="type">subword</str>
[junit4:junit4]   2> 	    <bool name="indexed">true</bool>
[junit4:junit4]   2> 	    <bool name="stored">true</bool>
[junit4:junit4]   2> 	  </lst>
[junit4:junit4]   2> 	  <lst>
[junit4:junit4]   2> 	    <str name="name">sku1</str>
[junit4:junit4]   2> 	    <str name="type">skutype1</str>
[junit4:junit4]   2> 	    <bool name="indexed">true</bool>
[junit4:junit4]   2> 	    <bool name="stored">true</bool>
[junit4:junit4]   2> 	  </lst>
[junit4:junit4]   2> 	  <lst>
[junit4:junit4]   2> 	    <str name="name">title_stemmed</str>
[junit4:junit4]   2> 	    <str name="type">text</str>
[junit4:junit4]   2> 	    <bool name="indexed">true</bool>
[junit4:junit4]   2> 	    <bool name="stored">false</bool>
[junit4:junit4]   2> 	  </lst>
[junit4:junit4]   2> 	  <lst>
[junit4:junit4]   2> 	    <str name="name">textgap</str>
[junit4:junit4]   2> 	    <str name="type">textgap</str>
[junit4:junit4]   2> 	    <bool name="indexed">true</bool>
[junit4:junit4]   2> 	    <bool name="stored">true</bool>
[junit4:junit4]   2> 	  </lst>
[junit4:junit4]   2> 	  <lst>
[junit4:junit4]   2> 	    <str name="name">wdf_preserve</str>
[junit4:junit4]   2> 	    <str name="type">wdf_preserve</str>
[junit4:junit4]   2> 	    <bool name="indexed">true</bool>
[junit4:junit4]   2> 	    <bool name="stored">true</bool>
[junit4:junit4]   2> 	  </lst>
[junit4:junit4]   2> 	  <lst>
[junit4:junit4]   2> 	    <str name="name">nouniq</str>
[junit4:junit4]   2> 	    <str name="type">string</str>
[junit4:junit4]   2> 	    <bool name="multiValued">true</bool>
[junit4:junit4]   2> 	    <bool name="indexed">true</bool>
[junit4:junit4]   2> 	    <bool name="stored">true</bool>
[junit4:junit4]   2> 	  </lst>
[junit4:junit4]   2> 	  <lst>
[junit4:junit4]   2> 	    <str name="name">test_hlt</str>
[junit4:junit4]   2> 	    <str name="type">highlittext</str>
[junit4:junit4]   2> 	    <bool name="indexed">true</bool>
[junit4:junit4]   2> 	    <bool name="compressed">true</bool>
[junit4:junit4]   2> 	  </lst>
[junit4:junit4]   2> 	  <lst>
[junit4:junit4]   2> 	    <str name="name">test_hlt_off</str>
[junit4:junit4]   2> 	    <str name="type">highlittext</str>
[junit4:junit4]   2> 	    <bool name="indexed">true</bool>
[junit4:junit4]   2> 	    <bool name="compressed">false</bool>
[junit4:junit4]   2> 	  </lst>
[junit4:junit4]   2> 	  <lst>
[junit4:junit4]   2> 	    <str name="name">porterfilt</str>
[junit4:junit4]   2> 	    <str name="type">porterfilt</str>
[junit4:junit4]   2> 	    <bool name="indexed">true</bool>
[junit4:junit4]   2> 	    <bool name="stored">true</bool>
[junit4:junit4]   2> 	  </lst>
[junit4:junit4]   2> 	  <lst>
[junit4:junit4]   2> 	    <str name="name">test_offtv</str>
[junit4:junit4]   2> 	    <str name="type">text</str>
[junit4:junit4]   2> 	    <bool name="termOffsets">true</bool>
[junit4:junit4]   2> 	    <bool name="termVectors">true</bool>
[junit4:junit4]   2> 	  </lst>
[junit4:junit4]   2> 	  <lst>
[junit4:junit4]   2> 	    <str name="name">iind</str>
[junit4:junit4]   2> 	    <str name="type">int</str>
[junit4:junit4]   2> 	    <bool name="indexed">true</bool>
[junit4:junit4]   2> 	    <bool name="stored">false</bool>
[junit4:junit4]   2> 	  </lst>
[junit4:junit4]   2> 	  <lst>
[junit4:junit4]   2> 	    <str name="name">teststop</str>
[junit4:junit4]   2> 	    <str name="type">teststop</str>
[junit4:junit4]   2> 	    <bool name="indexed">true</bool>
[junit4:junit4]   2> 	    <bool name="stored">true</bool>
[junit4:junit4]   2> 	  </lst>
[junit4:junit4]   2> 	  <lst>
[junit4:junit4]   2> 	    <str name="name">text_np</str>
[junit4:junit4]   2> 	    <str name="type">text_np</str>
[junit4:junit4]   2> 	    <bool name="indexed">true</bool>
[junit4:junit4]   2> 	    <bool name="stored">false</bool>
[junit4:junit4]   2> 	  </lst>
[junit4:junit4]   2> 	  <lst>
[junit4:junit4]   2> 	    <str name="name">sku2</str>
[junit4:junit4]   2> 	    <str name="type">skutype2</str>
[junit4:junit4]   2> 	    <bool name="indexed">true</bool>
[junit4:junit4]   2> 	    <bool name="stored">true</bool>
[junit4:junit4]   2> 	  </lst>
[junit4:junit4]   2> 	  <lst>
[junit4:junit4]   2> 	    <str name="name">HTMLstandardtok</str>
[junit4:junit4]   2> 	    <str name="type">HTMLstandardtok</str>
[junit4:junit4]   2> 	    <bool name="indexed">true</bool>
[junit4:junit4]   2> 	    <bool name="stored">true</bool>
[junit4:junit4]   2> 	  </lst>
[junit4:junit4]   2> 	  <lst>
[junit4:junit4]   2> 	    <str name="name">engporterfilt</str>
[junit4:junit4]   2> 	    <str name="type">engporterfilt</str>
[junit4:junit4]   2> 	    <bool name="indexed">true</bool>
[junit4:junit4]   2> 	    <bool name="stored">true</bool>
[junit4:junit4]   2> 	  </lst>
[junit4:junit4]   2> 	  <lst>
[junit4:junit4]   2> 	    <str name="name">lengthfilt</str>
[junit4:junit4]   2> 	    <str name="type">lengthfilt</str>
[junit4:junit4]   2> 	    <bool name="indexed">true</bool>
[junit4:junit4]   2> 	    <bool name="stored">true</bool>
[junit4:junit4]   2> 	  </lst>
[junit4:junit4]   2> 	  <lst>
[junit4:junit4]   2> 	    <str name="name">sind</str>
[junit4:junit4]   2> 	    <str name="type">string</str>
[junit4:junit4]   2> 	    <bool name="indexed">true</bool>
[junit4:junit4]   2> 	    <bool name="stored">false</bool>
[junit4:junit4]   2> 	  </lst>
[junit4:junit4]   2> 	  <lst>
[junit4:junit4]   2> 	    <str name="name">lettertok</str>
[junit4:junit4]   2> 	    <str name="type">lettertok</str>
[junit4:junit4]   2> 	    <bool name="indexed">true</bool>
[junit4:junit4]   2> 	    <bool name="stored">true</bool>
[junit4:junit4]   2> 	  </lst>
[junit4:junit4]   2> 	  <lst>
[junit4:junit4]   2> 	    <str name="name">bsto</str>
[junit4:junit4]   2> 	    <str name="type">boolean</str>
[junit4:junit4]   2> 	    <bool name="indexed">false</bool>
[junit4:junit4]   2> 	    <bool name="stored">true</bool>
[junit4:junit4]   2> 	  </lst>
[junit4:junit4]   2> 	  <lst>
[junit4:junit4]   2> 	    <str name="name">lowerfilt</str>
[junit4:junit4]   2> 	    <str name="type">lowerfilt</str>
[junit4:junit4]   2> 	    <bool name="indexed">true</bool>
[junit4:junit4]   2> 	    <bool name="stored">true</bool>
[junit4:junit4]   2> 	  </lst>
[junit4:junit4]   2> 	  <lst>
[junit4:junit4]   2> 	    <str name="name">test_notv</str>
[junit4:junit4]   2> 	    <str name="type">text</str>
[junit4:junit4]   2> 	    <bool name="termVectors">false</bool>
[junit4:junit4]   2> 	  </lst>
[junit4:junit4]   2> 	  <lst>
[junit4:junit4]   2> 	    <str name="name">lowertok</str>
[junit4:junit4]   2> 	    <str name="type">lowertok</str>
[junit4:junit4]   2> 	    <bool name="indexed">true</bool>
[junit4:junit4]   2> 	    <bool name="stored">true</bool>
[junit4:junit4]   2> 	  </lst>
[junit4:junit4]   2> 	  <lst>
[junit4:junit4]   2> 	    <str name="name">custstopfilt</str>
[junit4:junit4]   2> 	    <str name="type">custstopfilt</str>
[junit4:junit4]   2> 	    <bool name="indexed">true</bool>
[junit4:junit4]   2> 	    <bool name="stored">true</bool>
[junit4:junit4]   2> 	  </lst>
[junit4:junit4]   2> 	  <lst>
[junit4:junit4]   2> 	    <str name="name">ssto</str>
[junit4:junit4]   2> 	    <str name="type">string</str>
[junit4:junit4]   2> 	    <bool name="indexed">false</bool>
[junit4:junit4]   2> 	    <bool name="stored">true</bool>
[junit4:junit4]   2> 	  </lst>
[junit4:junit4]   2> 	  <lst>
[junit4:junit4]   2> 	    <str name="name">uniq2</str>
[junit4:junit4]   2> 	    <str name="type">string</str>
[junit4:junit4]   2> 	    <bool name="multiValued">true</bool>
[junit4:junit4]   2> 	    <bool name="indexed">true</bool>
[junit4:junit4]   2> 	    <bool name="stored">true</bool>
[junit4:junit4]   2> 	  </lst>
[junit4:junit4]   2> 	  <lst>
[junit4:junit4]   2> 	    <str name="name">sindsto</str>
[junit4:junit4]   2> 	    <str name="type">string</str>
[junit4:junit4]   2> 	    <bool name="indexed">true</bool>
[junit4:junit4]   2> 	    <bool name="stored">true</bool>
[junit4:junit4]   2> 	  </lst>
[junit4:junit4]   2> 	  <lst>
[junit4:junit4]   2> 	    <str name="name">test_posofftv</str>
[junit4:junit4]   2> 	    <str name="type">text</str>
[junit4:junit4]   2> 	    <bool name="termOffsets">true</bool>
[junit4:junit4]   2> 	    <bool name="termVectors">true</bool>
[junit4:junit4]   2> 	    <bool name="termPositions">true</bool>
[junit4:junit4]   2> 	  </lst>
[junit4:junit4]   2> 	  <lst>
[junit4:junit4]   2> 	    <str name="name">test_basictv</str>
[junit4:junit4]   2> 	    <str name="type">text</str>
[junit4:junit4]   2> 	    <bool name="termVectors">true</bool>
[junit4:junit4]   2> 	  </lst>
[junit4:junit4]   2> 	  <lst>
[junit4:junit4]   2> 	    <str name="name">pointD</str>
[junit4:junit4]   2> 	    <str name="type">xyd</str>
[junit4:junit4]   2> 	    <bool name="multiValued">false</bool>
[junit4:junit4]   2> 	    <bool name="indexed">true</bool>
[junit4:junit4]   2> 	    <bool name="stored">true</bool>
[junit4:junit4]   2> 	  </lst>
[junit4:junit4]   2> 	  <lst>
[junit4:junit4]   2> 	    <str name="name">shouldbeunindexed</str>
[junit4:junit4]   2> 	    <str name="type">unstored</str>
[junit4:junit4]   2> 	    <bool name="indexed">false</bool>
[junit4:junit4]   2> 	    <bool name="stored">true</bool>
[junit4:junit4]   2> 	  </lst>
[junit4:junit4]   2> 	  <lst>
[junit4:junit4]   2> 	    <str name="name">id</str>
[junit4:junit4]   2> 	    <str name="type">string</str>
[junit4:junit4]   2> 	    <bool name="multiValued">false</bool>
[junit4:junit4]   2> 	    <bool name="required">true</bool>
[junit4:junit4]   2> 	    <bool name="indexed">true</bool>
[junit4:junit4]   2> 	    <bool name="stored">true</bool>
[junit4:junit4]   2> 	    <bool name="uniqueKey">true</bool>
[junit4:junit4]   2> 	  </lst>
[junit4:junit4]   2> 	  <lst>
[junit4:junit4]   2> 	    <str name="name">text</str>
[junit4:junit4]   2> 	    <str name="type">text</str>
[junit4:junit4]   2> 	    <bool name="multiValued">true</bool>
[junit4:junit4]   2> 	    <bool name="indexed">true</bool>
[junit4:junit4]   2> 	    <bool name="stored">false</bool>
[junit4:junit4]   2> 	  </lst>
[junit4:junit4]   2> 	  <lst>
[junit4:junit4]   2> 	    <str name="name">numericsubword</str>
[junit4:junit4]   2> 	    <str name="type">numericsubword</str>
[junit4:junit4]   2> 	    <bool name="indexed">true</bool>
[junit4:junit4]   2> 	    <bool name="stored">true</bool>
[junit4:junit4]   2> 	  </lst>
[junit4:junit4]   2> 	  <lst>
[junit4:junit4]   2> 	    <str name="name">numberpartfail</str>
[junit4:junit4]   2> 	    <str name="type">failtype1</str>
[junit4:junit4]   2> 	    <bool name="indexed">true</bool>
[junit4:junit4]   2> 	    <bool name="stored">true</bool>
[junit4:junit4]   2> 	  </lst>
[junit4:junit4]   2> 	  <lst>
[junit4:junit4]   2> 	    <str name="name">bindsto</str>
[junit4:junit4]   2> 	    <str name="type">boolean</str>
[junit4:junit4]   2> 	    <bool name="indexed">true</bool>
[junit4:junit4]   2> 	    <bool name="stored">true</bool>
[junit4:junit4]   2> 	  </lst>
[junit4:junit4]   2> 	  <lst>
[junit4:junit4]   2> 	    <str name="name">uniq</str>
[junit4:junit4]   2> 	    <str name="type">string</str>
[junit4:junit4]   2> 	    <bool name="multiValued">true</bool>
[junit4:junit4]   2> 	    <bool name="indexed">true</bool>
[junit4:junit4]   2> 	    <bool name="stored">true</bool>
[junit4:junit4]   2> 	  </lst>
[junit4:junit4]   2> 	  <lst>
[junit4:junit4]   2> 	    <str name="name">store</str>
[junit4:junit4]   2> 	    <str name="type">location</str>
[junit4:junit4]   2> 	    <bool name="indexed">true</bool>
[junit4:junit4]   2> 	    <bool name="stored">true</bool>
[junit4:junit4]   2> 	  </lst>
[junit4:junit4]   2> 	  <lst>
[junit4:junit4]   2> 	    <str name="name">keywordtok</str>
[junit4:junit4]   2> 	    <str name="type">keywordtok</str>
[junit4:junit4]   2> 	    <bool name="indexed">true</bool>
[junit4:junit4]   2> 	    <bool name="stored">true</bool>
[junit4:junit4]   2> 	  </lst>
[junit4:junit4]   2> 	  <lst>
[junit4:junit4]   2> 	    <str name="name">point_hash</str>
[junit4:junit4]   2> 	    <str name="type">geohash</str>
[junit4:junit4]   2> 	    <bool name="multiValued">false</bool>
[junit4:junit4]   2> 	    <bool name="indexed">true</bool>
[junit4:junit4]   2> 	    <bool name="stored">true</bool>
[junit4:junit4]   2> 	  </lst>
[junit4:junit4]   2> 	  <lst>
[junit4:junit4]   2> 	    <str name="name">weight</str>
[junit4:junit4]   2> 	    <str name="type">float</str>
[junit4:junit4]   2> 	    <bool name="indexed">true</bool>
[junit4:junit4]   2> 	    <bool name="stored">true</bool>
[junit4:junit4]   2> 	  </lst>
[junit4:junit4]   2> 	  <lst>
[junit4:junit4]   2> 	    <str name="name">syn</str>
[junit4:junit4]   2> 	    <str name="type">syn</str>
[junit4:junit4]   2> 	    <bool name="indexed">true</bool>
[junit4:junit4]   2> 	    <bool name="stored">true</bool>
[junit4:junit4]   2> 	  </lst>
[junit4:junit4]   2> 	  <lst>
[junit4:junit4]   2> 	    <str name="name">HTMLwhitetok</str>
[junit4:junit4]   2> 	    <str name="type">HTMLwhitetok</str>
[junit4:junit4]   2> 	    <bool name="indexed">true</bool>
[junit4:junit4]   2> 	    <bool name="stored">true</bool>
[junit4:junit4]   2> 	  </lst>
[junit4:junit4]   2> 	  <lst>
[junit4:junit4]   2> 	    <str name="name">whitetok</str>
[junit4:junit4]   2> 	    <str name="type">whitetok</str>
[junit4:junit4]   2> 	    <bool name="indexed">true</bool>
[junit4:junit4]   2> 	    <bool name="stored">true</bool>
[junit4:junit4]   2> 	  </lst>
[junit4:junit4]   2> 	  <lst>
[junit4:junit4]   2> 	    <str name="name">nullfirst</str>
[junit4:junit4]   2> 	    <str name="type">string</str>
[junit4:junit4]   2> 	    <bool name="sortMissingFirst">true</bool>
[junit4:junit4]   2> 	    <bool name="indexed">true</bool>
[junit4:junit4]   2> 	    <bool name="stored">true</bool>
[junit4:junit4]   2> 	  </lst>
[junit4:junit4]   2> 	  <lst>
[junit4:junit4]   2> 	    <str name="name">bind</str>
[junit4:junit4]   2> 	    <str name="type">boolean</str>
[junit4:junit4]   2> 	    <bool name="indexed">true</bool>
[junit4:junit4]   2> 	    <bool name="stored">false</bool>
[junit4:junit4]   2> 	  </lst>
[junit4:junit4]   2> 	  <lst>
[junit4:junit4]   2> 	    <str name="name">test_postv</str>
[junit4:junit4]   2> 	    <str name="type">text</str>
[junit4:junit4]   2> 	    <bool name="termVectors">true</bool>
[junit4:junit4]   2> 	    <bool name="termPositions">true</bool>
[junit4:junit4]   2> 	  </lst>
[junit4:junit4]   2> 	  <lst>
[junit4:junit4]   2> 	    <str name="name">standardfilt</str>
[junit4:junit4]   2> 	    <str name="type">standardfilt</str>
[junit4:junit4]   2> 	    <bool name="indexed">true</bool>
[junit4:junit4]   2> 	    <bool name="stored">true</bool>
[junit4:junit4]   2> 	  </lst>
[junit4:junit4]   2> 	  <lst>
[junit4:junit4]   2> 	    <str name="name">standardtokfilt</str>
[junit4:junit4]   2> 	    <str name="type">standardtokfilt</str>
[junit4:junit4]   2> 	    <bool name="indexed">true</bool>
[junit4:junit4]   2> 	    <bool name="stored">true</bool>
[junit4:junit4]   2> 	  </lst>
[junit4:junit4]   2> 	  <lst>
[junit4:junit4]   2> 	    <str name="name">subject</str>
[junit4:junit4]   2> 	    <str name="type">text</str>
[junit4:junit4]   2> 	    <bool name="indexed">true</bool>
[junit4:junit4]   2> 	    <bool name="stored">true</bool>
[junit4:junit4]   2> 	  </lst>
[junit4:junit4]   2> 	  <lst>
[junit4:junit4]   2> 	    <str name="name">standardtok</str>
[junit4:junit4]   2> 	    <str name="type">standardtok</str>
[junit4:junit4]   2> 	    <bool name="indexed">true</bool>
[junit4:junit4]   2> 	    <bool name="stored">true</bool>
[junit4:junit4]   2> 	  </lst>
[junit4:junit4]   2> 	  <lst>
[junit4:junit4]   2> 	    <str name="name">title</str>
[junit4:junit4]   2> 	    <str name="type">nametext</str>
[junit4:junit4]   2> 	    <bool name="indexed">true</bool>
[junit4:junit4]   2> 	    <bool name="stored">true</bool>
[junit4:junit4]   2> 	  </lst>
[junit4:junit4]   2> 	  <lst>
[junit4:junit4]   2> 	    <str name="name">patternreplacefilt</str>
[junit4:junit4]   2> 	    <str name="type">patternreplacefilt</str>
[junit4:junit4]   2> 	    <bool name="indexed">true</bool>
[junit4:junit4]   2> 	    <bool name="stored">true</bool>
[junit4:junit4]   2> 	  </lst>
[junit4:junit4]   2> 	  <lst>
[junit4:junit4]   2> 	    <str name="name">name</str>
[junit4:junit4]   2> 	    <str name="type">nametext</str>
[junit4:junit4]   2> 	    <bool name="indexed">true</bool>
[junit4:junit4]   2> 	    <bool name="stored">true</bool>
[junit4:junit4]   2> 	  </lst>
[junit4:junit4]   2> 	  <lst>
[junit4:junit4]   2> 	    <str name="name">point</str>
[junit4:junit4]   2> 	    <str name="type">xy</str>
[junit4:junit4]   2> 	    <bool name="multiValued">false</bool>
[junit4:junit4]   2> 	    <bool name="indexed">true</bool>
[junit4:junit4]   2> 	    <bool name="stored">true</bool>
[junit4:junit4]   2> 	  </lst>
[junit4:junit4]   2> 	  <lst>
[junit4:junit4]   2> 	    <str name="name">copyfield_source</str>
[junit4:junit4]   2> 	    <str name="type">string</str>
[junit4:junit4]   2> 	    <bool name="multiValued">true</bool>
[junit4:junit4]   2> 	    <bool name="indexed">true</bool>
[junit4:junit4]   2> 	    <bool name="stored">true</bool>
[junit4:junit4]   2> 	  </lst>
[junit4:junit4]   2> 	  <lst>
[junit4:junit4]   2> 	    <str name="name">stopfilt</str>
[junit4:junit4]   2> 	    <str name="type">stopfilt</str>
[junit4:junit4]   2> 	    <bool name="indexed">true</bool>
[junit4:junit4]   2> 	    <bool name="stored">true</bool>
[junit4:junit4]   2> 	  </lst>
[junit4:junit4]   2> 	  <lst>
[junit4:junit4]   2> 	    <str name="name">shouldbestored</str>
[junit4:junit4]   2> 	    <str name="type">unstored</str>
[junit4:junit4]   2> 	    <bool name="stored">true</bool>
[junit4:junit4]   2> 	  </lst>
[junit4:junit4]   2> 	  <lst>
[junit4:junit4]   2> 	    <str name="name">shouldbeunstored</str>
[junit4:junit4]   2> 	    <str name="type">unstored</str>
[junit4:junit4]   2> 	  </lst>
[junit4:junit4]   2> 	  <lst>
[junit4:junit4]   2> 	    <str name="name">uniq3</str>
[junit4:junit4]   2> 	    <str name="type">string</str>
[junit4:junit4]   2> 	    <bool name="indexed">true</bool>
[junit4:junit4]   2> 	    <bool name="stored">true</bool>
[junit4:junit4]   2> 	  </lst>
[junit4:junit4]   2> 	  <lst>
[junit4:junit4]   2> 	    <str name="name">timestamp</str>
[junit4:junit4]   2> 	    <str name="type">date</str>
[junit4:junit4]   2> 	    <bool name="indexed">true</bool>
[junit4:junit4]   2> 	    <bool name="stored">true</bool>
[junit4:junit4]   2> 	  </lst>
[junit4:junit4]   2> 	  <lst>
[junit4:junit4]   2> 	    <str name="name">_version_</str>
[junit4:junit4]   2> 	    <str name="type">long</str>
[junit4:junit4]   2> 	    <bool name="indexed">true</bool>
[junit4:junit4]   2> 	    <bool name="stored">true</bool>
[junit4:junit4]   2> 	  </lst>
[junit4:junit4]   2> 	  <lst>
[junit4:junit4]   2> 	    <str name="name">wdf_nocase</str>
[junit4:junit4]   2> 	    <str name="type">wdf_nocase</str>
[junit4:junit4]   2> 	    <bool name="indexed">true</bool>
[junit4:junit4]   2> 	    <bool name="stored">true</bool>
[junit4:junit4]   2> 	  </lst>
[junit4:junit4]   2> 	  <lst>
[junit4:junit4]   2> 	    <str name="name">uuid</str>
[junit4:junit4]   2> 	    <str name="type">uuid</str>
[junit4:junit4]   2> 	    <bool name="stored">true</bool>
[junit4:junit4]   2> 	  </lst>
[junit4:junit4]   2> 	  <lst>
[junit4:junit4]   2> 	    <str name="name">signatureField</str>
[junit4:junit4]   2> 	    <str name="type">string</str>
[junit4:junit4]   2> 	    <bool name="indexed">true</bool>
[junit4:junit4]   2> 	    <bool name="stored">false</bool>
[junit4:junit4]   2> 	  </lst>
[junit4:junit4]   2> 	  <lst>
[junit4:junit4]   2> 	    <str name="name">isto</str>
[junit4:junit4]   2> 	    <str name="type">int</str>
[junit4:junit4]   2> 	    <bool name="indexed">false</bool>
[junit4:junit4]   2> 	    <bool name="stored">true</bool>
[junit4:junit4]   2> 	  </lst>
[junit4:junit4]   2> 	  <lst>
[junit4:junit4]   2> 	    <str name="name">bday</str>
[junit4:junit4]   2> 	    <str name="type">date</str>
[junit4:junit4]   2> 	    <bool name="indexed">true</bool>
[junit4:junit4]   2> 	    <bool name="stored">true</bool>
[junit4:junit4]   2> 	  </lst>
[junit4:junit4]   2> 	  <lst>
[junit4:junit4]   2> 	    <str name="name">custengporterfilt</str>
[junit4:junit4]   2> 	    <str name="type">custengporterfilt</str>
[junit4:junit4]   2> 	    <bool name="indexed">true</bool>
[junit4:junit4]   2> 	    <bool name="stored">true</bool>
[junit4:junit4]   2> 	  </lst>
[junit4:junit4]   2> 	</arr>
[junit4:junit4]   2> 	</response>
[junit4:junit4]   2> 	
[junit4:junit4]   2> 		request was:/schema/fields?indent=on&wt=xml
[junit4:junit4]   2> 		at org.apache.solr.util.RestTestBase.assertQ(RestTestBase.java:136)
[junit4:junit4]   2> 		at org.apache.solr.rest.TestFieldCollectionResource.testGetAllFields(TestFieldCollectionResource.java:26)
[junit4:junit4]   2> 		at sun.reflect.NativeMethodAccessorImpl.invoke0(Native Method)
[junit4:junit4]   2> 		at sun.reflect.NativeMethodAccessorImpl.invoke(NativeMethodAccessorImpl.java:57)
[junit4:junit4]   2> 		at sun.reflect.DelegatingMethodAccessorImpl.invoke(DelegatingMethodAccessorImpl.java:43)
[junit4:junit4]   2> 		at java.lang.reflect.Method.invoke(Method.java:487)
[junit4:junit4]   2> 		at com.carrotsearch.randomizedtesting.RandomizedRunner.invoke(RandomizedRunner.java:1559)
[junit4:junit4]   2> 		at com.carrotsearch.randomizedtesting.RandomizedRunner.access$600(RandomizedRunner.java:79)
[junit4:junit4]   2> 		at com.carrotsearch.randomizedtesting.RandomizedRunner$6.evaluate(RandomizedRunner.java:737)
[junit4:junit4]   2> 		at com.carrotsearch.randomizedtesting.RandomizedRunner$7.evaluate(RandomizedRunner.java:773)
[junit4:junit4]   2> 		at com.carrotsearch.randomizedtesting.RandomizedRunner$8.evaluate(RandomizedRunner.java:787)
[junit4:junit4]   2> 		at com.carrotsearch.randomizedtesting.rules.SystemPropertiesRestoreRule$1.evaluate(SystemPropertiesRestoreRule.java:53)
[junit4:junit4]   2> 		at org.apache.lucene.util.TestRuleSetupTeardownChained$1.evaluate(TestRuleSetupTeardownChained.java:50)
[junit4:junit4]   2> 		at org.apache.lucene.util.TestRuleFieldCacheSanity$1.evaluate(TestRuleFieldCacheSanity.java:51)
[junit4:junit4]   2> 		at org.apache.lucene.util.AbstractBeforeAfterRule$1.evaluate(AbstractBeforeAfterRule.java:46)
[junit4:junit4]   2> 		at com.carrotsearch.randomizedtesting.rules.SystemPropertiesInvariantRule$1.evaluate(SystemPropertiesInvariantRule.java:55)
[junit4:junit4]   2> 		at org.apache.lucene.util.TestRuleThreadAndTestName$1.evaluate(TestRuleThreadAndTestName.java:49)
[junit4:junit4]   2> 		at org.apache.lucene.util.TestRuleIgnoreAfterMaxFailures$1.evaluate(TestRuleIgnoreAfterMaxFailures.java:70)
[junit4:junit4]   2> 		at org.apache.lucene.util.TestRuleMarkFailure$1.evaluate(TestRuleMarkFailure.java:48)
[junit4:junit4]   2> 		at com.carrotsearch.randomizedtesting.rules.StatementAdapter.evaluate(StatementAdapter.java:36)
[junit4:junit4]   2> 		at com.carrotsearch.randomizedtesting.ThreadLeakControl$StatementRunner.run(ThreadLeakControl.java:358)
[junit4:junit4]   2> 		at com.carrotsearch.randomizedtesting.ThreadLeakControl.forkTimeoutingTask(ThreadLeakControl.java:782)
[junit4:junit4]   2> 		at com.carrotsearch.randomizedtesting.ThreadLeakControl$3.evaluate(ThreadLeakControl.java:442)
[junit4:junit4]   2> 		at com.carrotsearch.randomizedtesting.RandomizedRunner.runSingleTest(RandomizedRunner.java:746)
[junit4:junit4]   2> 		at com.carrotsearch.randomizedtesting.RandomizedRunner$3.evaluate(RandomizedRunner.java:648)
[junit4:junit4]   2> 		at com.carrotsearch.randomizedtesting.RandomizedRunner$4.evaluate(RandomizedRunner.java:682)
[junit4:junit4]   2> 		at com.carrotsearch.randomizedtesting.RandomizedRunner$5.evaluate(RandomizedRunner.java:693)
[junit4:junit4]   2> 		at com.carrotsearch.randomizedtesting.rules.StatementAdapter.evaluate(StatementAdapter.java:36)
[junit4:junit4]   2> 		at com.carrotsearch.randomizedtesting.rules.SystemPropertiesRestoreRule$1.evaluate(SystemPropertiesRestoreRule.java:53)
[junit4:junit4]   2> 		at org.apache.lucene.util.AbstractBeforeAfterRule$1.evaluate(AbstractBeforeAfterRule.java:46)
[junit4:junit4]   2> 		at org.apache.lucene.util.TestRuleStoreClassName$1.evaluate(TestRuleStoreClassName.java:42)
[junit4:junit4]   2> 		at com.carrotsearch.randomizedtesting.rules.SystemPropertiesInvariantRule$1.evaluate(SystemPropertiesInvariantRule.java:55)
[junit4:junit4]   2> 		at com.carrotsearch.randomizedtesting.rules.NoShadowingOrOverridesOnMethodsRule$1.evaluate(NoShadowingOrOverridesOnMethodsRule.java:39)
[junit4:junit4]   2> 		at com.carrotsearch.randomizedtesting.rules.NoShadowingOrOverridesOnMethodsRule$1.evaluate(NoShadowingOrOverridesOnMethodsRule.java:39)
[junit4:junit4]   2> 		at com.carrotsearch.randomizedtesting.rules.StatementAdapter.evaluate(StatementAdapter.java:36)
[junit4:junit4]   2> 		at org.apache.lucene.util.TestRuleAssertionsRequired$1.evaluate(TestRuleAssertionsRequired.java:43)
[junit4:junit4]   2> 		at org.apache.lucene.util.TestRuleMarkFailure$1.evaluate(TestRuleMarkFailure.java:48)
[junit4:junit4]   2> 		at org.apache.lucene.util.TestRuleIgnoreAfterMaxFailures$1.evaluate(TestRuleIgnoreAfterMaxFailures.java:70)
[junit4:junit4]   2> 		at org.apache.lucene.util.TestRuleIgnoreTestSuites$1.evaluate(TestRuleIgnoreTestSuites.java:55)
[junit4:junit4]   2> 		at com.carrotsearch.randomizedtesting.rules.StatementAdapter.evaluate(StatementAdapter.java:36)
[junit4:junit4]   2> 		at com.carrotsearch.randomizedtesting.ThreadLeakControl$StatementRunner.run(ThreadLeakControl.java:358)
[junit4:junit4]   2> 		at java.lang.Thread.run(Thread.java:722)
[junit4:junit4]   2> 	
[junit4:junit4]   2> 1784 T1096 oas.SolrTestCaseJ4.tearDown ###Ending testGetAllFields
[junit4:junit4]   2> NOTE: reproduce with: ant test  -Dtestcase=TestFieldCollectionResource -Dtests.method=testGetAllFields -Dtests.seed=E966CB0630F145B1 -Dtests.multiplier=3 -Dtests.slow=true -Dtests.locale=in -Dtests.timezone=Asia/Samarkand -Dtests.file.encoding=ISO-8859-1
[junit4:junit4] ERROR   0.06s J1 | TestFieldCollectionResource.testGetAllFields <<<
[junit4:junit4]    > Throwable #1: java.lang.RuntimeException: Exception during query
[junit4:junit4]    > 	at __randomizedtesting.SeedInfo.seed([E966CB0630F145B1:5C881C2CA02BC29]:0)
[junit4:junit4]    > 	at org.apache.solr.util.RestTestBase.assertQ(RestTestBase.java:143)
[junit4:junit4]    > 	at org.apache.solr.rest.TestFieldCollectionResource.testGetAllFields(TestFieldCollectionResource.java:26)
[junit4:junit4]    > 	at sun.reflect.NativeMethodAccessorImpl.invoke0(Native Method)
[junit4:junit4]    > 	at sun.reflect.NativeMethodAccessorImpl.invoke(NativeMethodAccessorImpl.java:57)
[junit4:junit4]    > 	at sun.reflect.DelegatingMethodAccessorImpl.invoke(DelegatingMethodAccessorImpl.java:43)
[junit4:junit4]    > 	at java.lang.reflect.Method.invoke(Method.java:487)
[junit4:junit4]    > 	at com.carrotsearch.randomizedtesting.RandomizedRunner.invoke(RandomizedRunner.java:1559)
[junit4:junit4]    > 	at com.carrotsearch.randomizedtesting.RandomizedRunner.access$600(RandomizedRunner.java:79)
[junit4:junit4]    > 	at com.carrotsearch.randomizedtesting.RandomizedRunner$6.evaluate(RandomizedRunner.java:737)
[junit4:junit4]    > 	at com.carrotsearch.randomizedtesting.RandomizedRunner$7.evaluate(RandomizedRunner.java:773)
[junit4:junit4]    > 	at com.carrotsearch.randomizedtesting.RandomizedRunner$8.evaluate(RandomizedRunner.java:787)
[junit4:junit4]    > 	at com.carrotsearch.randomizedtesting.rules.SystemPropertiesRestoreRule$1.evaluate(SystemPropertiesRestoreRule.java:53)
[junit4:junit4]    > 	at org.apache.lucene.util.TestRuleSetupTeardownChained$1.evaluate(TestRuleSetupTeardownChained.java:50)
[junit4:junit4]    > 	at org.apache.lucene.util.TestRuleFieldCacheSanity$1.evaluate(TestRuleFieldCacheSanity.java:51)
[junit4:junit4]    > 	at org.apache.lucene.util.AbstractBeforeAfterRule$1.evaluate(AbstractBeforeAfterRule.java:46)
[junit4:junit4]    > 	at com.carrotsearch.randomizedtesting.rules.SystemPropertiesInvariantRule$1.evaluate(SystemPropertiesInvariantRule.java:55)
[junit4:junit4]    > 	at org.apache.lucene.util.TestRuleThreadAndTestName$1.evaluate(TestRuleThreadAndTestName.java:49)
[junit4:junit4]    > 	at org.apache.lucene.util.TestRuleIgnoreAfterMaxFailures$1.evaluate(TestRuleIgnoreAfterMaxFailures.java:70)
[junit4:junit4]    > 	at org.apache.lucene.util.TestRuleMarkFailure$1.evaluate(TestRuleMarkFailure.java:48)
[junit4:junit4]    > 	at com.carrotsearch.randomizedtesting.rules.StatementAdapter.evaluate(StatementAdapter.java:36)
[junit4:junit4]    > 	at com.carrotsearch.randomizedtesting.ThreadLeakControl$StatementRunner.run(ThreadLeakControl.java:358)
[junit4:junit4]    > 	at com.carrotsearch.randomizedtesting.ThreadLeakControl.forkTimeoutingTask(ThreadLeakControl.java:782)
[junit4:junit4]    > 	at com.carrotsearch.randomizedtesting.ThreadLeakControl$3.evaluate(ThreadLeakControl.java:442)
[junit4:junit4]    > 	at com.carrotsearch.randomizedtesting.RandomizedRunner.runSingleTest(RandomizedRunner.java:746)
[junit4:junit4]    > 	at com.carrotsearch.randomizedtesting.RandomizedRunner$3.evaluate(RandomizedRunner.java:648)
[junit4:junit4]    > 	at com.carrotsearch.randomizedtesting.RandomizedRunner$4.evaluate(RandomizedRunner.java:682)
[junit4:junit4]    > 	at com.carrotsearch.randomizedtesting.RandomizedRunner$5.evaluate(RandomizedRunner.java:693)
[junit4:junit4]    > 	at com.carrotsearch.randomizedtesting.rules.StatementAdapter.evaluate(StatementAdapter.java:36)
[junit4:junit4]    > 	at com.carrotsearch.randomizedtesting.rules.SystemPropertiesRestoreRule$1.evaluate(SystemPropertiesRestoreRule.java:53)
[junit4:junit4]    > 	at org.apache.lucene.util.AbstractBeforeAfterRule$1.evaluate(AbstractBeforeAfterRule.java:46)
[junit4:junit4]    > 	at org.apache.lucene.util.TestRuleStoreClassName$1.evaluate(TestRuleStoreClassName.java:42)
[junit4:junit4]    > 	at com.carrotsearch.randomizedtesting.rules.SystemPropertiesInvariantRule$1.evaluate(SystemPropertiesInvariantRule.java:55)
[junit4:junit4]    > 	at com.carrotsearch.randomizedtesting.rules.NoShadowingOrOverridesOnMethodsRule$1.evaluate(NoShadowingOrOverridesOnMethodsRule.java:39)
[junit4:junit4]    > 	at com.carrotsearch.randomizedtesting.rules.NoShadowingOrOverridesOnMethodsRule$1.evaluate(NoShadowingOrOverridesOnMethodsRule.java:39)
[junit4:junit4]    > 	at com.carrotsearch.randomizedtesting.rules.StatementAdapter.evaluate(StatementAdapter.java:36)
[junit4:junit4]    > 	at org.apache.lucene.util.TestRuleAssertionsRequired$1.evaluate(TestRuleAssertionsRequired.java:43)
[junit4:junit4]    > 	at org.apache.lucene.util.TestRuleMarkFailure$1.evaluate(TestRuleMarkFailure.java:48)
[junit4:junit4]    > 	at org.apache.lucene.util.TestRuleIgnoreAfterMaxFailures$1.evaluate(TestRuleIgnoreAfterMaxFailures.java:70)
[junit4:junit4]    > 	at org.apache.lucene.util.TestRuleIgnoreTestSuites$1.evaluate(TestRuleIgnoreTestSuites.java:55)
[junit4:junit4]    > 	at com.carrotsearch.randomizedtesting.rules.StatementAdapter.evaluate(StatementAdapter.java:36)
[junit4:junit4]    > 	at com.carrotsearch.randomizedtesting.ThreadLeakControl$StatementRunner.run(ThreadLeakControl.java:358)
[junit4:junit4]    > 	at java.lang.Thread.run(Thread.java:722)
[junit4:junit4]    > Caused by: java.lang.RuntimeException: REQUEST FAILED: xpath=(/response/arr[@name='fields']/lst/str[@name='name'])[1] = 'custstopfilt'
[junit4:junit4]    > 	xml response was: <?xml version="1.0" encoding="UTF-8"?>
[junit4:junit4]    > <response>
[junit4:junit4]    > 
[junit4:junit4]    > <lst name="responseHeader">
[junit4:junit4]    >   <int name="status">0</int>
[junit4:junit4]    >   <int name="QTime">1</int>
[junit4:junit4]    > </lst>
[junit4:junit4]    > <arr name="fields">
[junit4:junit4]    >   <lst>
[junit4:junit4]    >     <str name="name">dedup</str>
[junit4:junit4]    >     <str name="type">dedup</str>
[junit4:junit4]    >     <bool name="indexed">true</bool>
[junit4:junit4]    >     <bool name="stored">true</bool>
[junit4:junit4]    >   </lst>
[junit4:junit4]    >   <lst>
[junit4:junit4]    >     <str name="name">title_lettertok</str>
[junit4:junit4]    >     <str name="type">lettertok</str>
[junit4:junit4]    >     <bool name="indexed">true</bool>
[junit4:junit4]    >     <bool name="stored">false</bool>
[junit4:junit4]    >   </lst>
[junit4:junit4]    >   <lst>
[junit4:junit4]    >     <str name="name">protectedsubword</str>
[junit4:junit4]    >     <str name="type">protectedsubword</str>
[junit4:junit4]    >     <bool name="indexed">true</bool>
[junit4:junit4]    >     <bool name="stored">true</bool>
[junit4:junit4]    >   </lst>
[junit4:junit4]    >   <lst>
[junit4:junit4]    >     <str name="name">subword</str>
[junit4:junit4]    >     <str name="type">subword</str>
[junit4:junit4]    >     <bool name="indexed">true</bool>
[junit4:junit4]    >     <bool name="stored">true</bool>
[junit4:junit4]    >   </lst>
[junit4:junit4]    >   <lst>
[junit4:junit4]    >     <str name="name">sku1</str>
[junit4:junit4]    >     <str name="type">skutype1</str>
[junit4:junit4]    >     <bool name="indexed">true</bool>
[junit4:junit4]    >     <bool name="stored">true</bool>
[junit4:junit4]    >   </lst>
[junit4:junit4]    >   <lst>
[junit4:junit4]    >     <str name="name">title_stemmed</str>
[junit4:junit4]    >     <str name="type">text</str>
[junit4:junit4]    >     <bool name="indexed">true</bool>
[junit4:junit4]    >     <bool name="stored">false</bool>
[junit4:junit4]    >   </lst>
[junit4:junit4]    >   <lst>
[junit4:junit4]    >     <str name="name">textgap</str>
[junit4:junit4]    >     <str name="type">textgap</str>
[junit4:junit4]    >     <bool name="indexed">true</bool>
[junit4:junit4]    >     <bool name="stored">true</bool>
[junit4:junit4]    >   </lst>
[junit4:junit4]    >   <lst>
[junit4:junit4]    >     <str name="name">wdf_preserve</str>
[junit4:junit4]    >     <str name="type">wdf_preserve</str>
[junit4:junit4]    >     <bool name="indexed">true</bool>
[junit4:junit4]    >     <bool name="stored">true</bool>
[junit4:junit4]    >   </lst>
[junit4:junit4]    >   <lst>
[junit4:junit4]    >     <str name="name">nouniq</str>
[junit4:junit4]    >     <str name="type">string</str>
[junit4:junit4]    >     <bool name="multiValued">true</bool>
[junit4:junit4]    >     <bool name="indexed">true</bool>
[junit4:junit4]    >     <bool name="stored">true</bool>
[junit4:junit4]    >   </lst>
[junit4:junit4]    >   <lst>
[junit4:junit4]    >     <str name="name">test_hlt</str>
[junit4:junit4]    >     <str name="type">highlittext</str>
[junit4:junit4]    >     <bool name="indexed">true</bool>
[junit4:junit4]    >     <bool name="compressed">true</bool>
[junit4:junit4]    >   </lst>
[junit4:junit4]    >   <lst>
[junit4:junit4]    >     <str name="name">test_hlt_off</str>
[junit4:junit4]    >     <str name="type">highlittext</str>
[junit4:junit4]    >     <bool name="indexed">true</bool>
[junit4:junit4]    >     <bool name="compressed">false</bool>
[junit4:junit4]    >   </lst>
[junit4:junit4]    >   <lst>
[junit4:junit4]    >     <str name="name">porterfilt</str>
[junit4:junit4]    >     <str name="type">porterfilt</str>
[junit4:junit4]    >     <bool name="indexed">true</bool>
[junit4:junit4]    >     <bool name="stored">true</bool>
[junit4:junit4]    >   </lst>
[junit4:junit4]    >   <lst>
[junit4:junit4]    >     <str name="name">test_offtv</str>
[junit4:junit4]    >     <str name="type">text</str>
[junit4:junit4]    >     <bool name="termOffsets">true</bool>
[junit4:junit4]    >     <bool name="termVectors">true</bool>
[junit4:junit4]    >   </lst>
[junit4:junit4]    >   <lst>
[junit4:junit4]    >     <str name="name">iind</str>
[junit4:junit4]    >     <str name="type">int</str>
[junit4:junit4]    >     <bool name="indexed">true</bool>
[junit4:junit4]    >     <bool name="stored">false</bool>
[junit4:junit4]    >   </lst>
[junit4:junit4]    >   <lst>
[junit4:junit4]    >     <str name="name">teststop</str>
[junit4:junit4]    >     <str name="type">teststop</str>
[junit4:junit4]    >     <bool name="indexed">true</bool>
[junit4:junit4]    >     <bool name="stored">true</bool>
[junit4:junit4]    >   </lst>
[junit4:junit4]    >   <lst>
[junit4:junit4]    >     <str name="name">text_np</str>
[junit4:junit4]    >     <str name="type">text_np</str>
[junit4:junit4]    >     <bool name="indexed">true</bool>
[junit4:junit4]    >     <bool name="stored">false</bool>
[junit4:junit4]    >   </lst>
[junit4:junit4]    >   <lst>
[junit4:junit4]    >     <str name="name">sku2</str>
[junit4:junit4]    >     <str name="type">skutype2</str>
[junit4:junit4]    >     <bool name="indexed">true</bool>
[junit4:junit4]    >     <bool name="stored">true</bool>
[junit4:junit4]    >   </lst>
[junit4:junit4]    >   <lst>
[junit4:junit4]    >     <str name="name">HTMLstandardtok</str>
[junit4:junit4]    >     <str name="type">HTMLstandardtok</str>
[junit4:junit4]    >     <bool name="indexed">true</bool>
[junit4:junit4]    >     <bool name="stored">true</bool>
[junit4:junit4]    >   </lst>
[junit4:junit4]    >   <lst>
[junit4:junit4]    >     <str name="name">engporterfilt</str>
[junit4:junit4]    >     <str name="type">engporterfilt</str>
[junit4:junit4]    >     <bool name="indexed">true</bool>
[junit4:junit4]    >     <bool name="stored">true</bool>
[junit4:junit4]    >   </lst>
[junit4:junit4]    >   <lst>
[junit4:junit4]    >     <str name="name">lengthfilt</str>
[junit4:junit4]    >     <str name="type">lengthfilt</str>
[junit4:junit4]    >     <bool name="indexed">true</bool>
[junit4:junit4]    >     <bool name="stored">true</bool>
[junit4:junit4]    >   </lst>
[junit4:junit4]    >   <lst>
[junit4:junit4]    >     <str name="name">sind</str>
[junit4:junit4]    >     <str name="type">string</str>
[junit4:junit4]    >     <bool name="indexed">true</bool>
[junit4:junit4]    >     <bool name="stored">false</bool>
[junit4:junit4]    >   </lst>
[junit4:junit4]    >   <lst>
[junit4:junit4]    >     <str name="name">lettertok</str>
[junit4:junit4]    >     <str name="type">lettertok</str>
[junit4:junit4]    >     <bool name="indexed">true</bool>
[junit4:junit4]    >     <bool name="stored">true</bool>
[junit4:junit4]    >   </lst>
[junit4:junit4]    >   <lst>
[junit4:junit4]    >     <str name="name">bsto</str>
[junit4:junit4]    >     <str name="type">boolean</str>
[junit4:junit4]    >     <bool name="indexed">false</bool>
[junit4:junit4]    >     <bool name="stored">true</bool>
[junit4:junit4]    >   </lst>
[junit4:junit4]    >   <lst>
[junit4:junit4]    >     <str name="name">lowerfilt</str>
[junit4:junit4]    >     <str name="type">lowerfilt</str>
[junit4:junit4]    >     <bool name="indexed">true</bool>
[junit4:junit4]    >     <bool name="stored">true</bool>
[junit4:junit4]    >   </lst>
[junit4:junit4]    >   <lst>
[junit4:junit4]    >     <str name="name">test_notv</str>
[junit4:junit4]    >     <str name="type">text</str>
[junit4:junit4]    >     <bool name="termVectors">false</bool>
[junit4:junit4]    >   </lst>
[junit4:junit4]    >   <lst>
[junit4:junit4]    >     <str name="name">lowertok</str>
[junit4:junit4]    >     <str name="type">lowertok</str>
[junit4:junit4]    >     <bool name="indexed">true</bool>
[junit4:junit4]    >     <bool name="stored">true</bool>
[junit4:junit4]    >   </lst>
[junit4:junit4]    >   <lst>
[junit4:junit4]    >     <str name="name">custstopfilt</str>
[junit4:junit4]    >     <str name="type">custstopfilt</str>
[junit4:junit4]    >     <bool name="indexed">true</bool>
[junit4:junit4]    >     <bool name="stored">true</bool>
[junit4:junit4]    >   </lst>
[junit4:junit4]    >   <lst>
[junit4:junit4]    >     <str name="name">ssto</str>
[junit4:junit4]    >     <str name="type">string</str>
[junit4:junit4]    >     <bool name="indexed">false</bool>
[junit4:junit4]    >     <bool name="stored">true</bool>
[junit4:junit4]    >   </lst>
[junit4:junit4]    >   <lst>
[junit4:junit4]    >     <str name="name">uniq2</str>
[junit4:junit4]    >     <str name="type">string</str>
[junit4:junit4]    >     <bool name="multiValued">true</bool>
[junit4:junit4]    >     <bool name="indexed">true</bool>
[junit4:junit4]    >     <bool name="stored">true</bool>
[junit4:junit4]    >   </lst>
[junit4:junit4]    >   <lst>
[junit4:junit4]    >     <str name="name">sindsto</str>
[junit4:junit4]    >     <str name="type">string</str>
[junit4:junit4]    >     <bool name="indexed">true</bool>
[junit4:junit4]    >     <bool name="stored">true</bool>
[junit4:junit4]    >   </lst>
[junit4:junit4]    >   <lst>
[junit4:junit4]    >     <str name="name">test_posofftv</str>
[junit4:junit4]    >     <str name="type">text</str>
[junit4:junit4]    >     <bool name="termOffsets">true</bool>
[junit4:junit4]    >     <bool name="termVectors">true</bool>
[junit4:junit4]    >     <bool name="termPositions">true</bool>
[junit4:junit4]    >   </lst>
[junit4:junit4]    >   <lst>
[junit4:junit4]    >     <str name="name">test_basictv</str>
[junit4:junit4]    >     <str name="type">text</str>
[junit4:junit4]    >     <bool name="termVectors">true</bool>
[junit4:junit4]    >   </lst>
[junit4:junit4]    >   <lst>
[junit4:junit4]    >     <str name="name">pointD</str>
[junit4:junit4]    >     <str name="type">xyd</str>
[junit4:junit4]    >     <bool name="multiValued">false</bool>
[junit4:junit4]    >     <bool name="indexed">true</bool>
[junit4:junit4]    >     <bool name="stored">true</bool>
[junit4:junit4]    >   </lst>
[junit4:junit4]    >   <lst>
[junit4:junit4]    >     <str name="name">shouldbeunindexed</str>
[junit4:junit4]    >     <str name="type">unstored</str>
[junit4:junit4]    >     <bool name="indexed">false</bool>
[junit4:junit4]    >     <bool name="stored">true</bool>
[junit4:junit4]    >   </lst>
[junit4:junit4]    >   <lst>
[junit4:junit4]    >     <str name="name">id</str>
[junit4:junit4]    >     <str name="type">string</str>
[junit4:junit4]    >     <bool name="multiValued">false</bool>
[junit4:junit4]    >     <bool name="required">true</bool>
[junit4:junit4]    >     <bool name="indexed">true</bool>
[junit4:junit4]    >     <bool name="stored">true</bool>
[junit4:junit4]    >     <bool name="uniqueKey">true</bool>
[junit4:junit4]    >   </lst>
[junit4:junit4]    >   <lst>
[junit4:junit4]    >     <str name="name">text</str>
[junit4:junit4]    >     <str name="type">text</str>
[junit4:junit4]    >     <bool name="multiValued">true</bool>
[junit4:junit4]    >     <bool name="indexed">true</bool>
[junit4:junit4]    >     <bool name="stored">false</bool>
[junit4:junit4]    >   </lst>
[junit4:junit4]    >   <lst>
[junit4:junit4]    >     <str name="name">numericsubword</str>
[junit4:junit4]    >     <str name="type">numericsubword</str>
[junit4:junit4]    >     <bool name="indexed">true</bool>
[junit4:junit4]    >     <bool name="stored">true</bool>
[junit4:junit4]    >   </lst>
[junit4:junit4]    >   <lst>
[junit4:junit4]    >     <str name="name">numberpartfail</str>
[junit4:junit4]    >     <str name="type">failtype1</str>
[junit4:junit4]    >     <bool name="indexed">true</bool>
[junit4:junit4]    >     <bool name="stored">true</bool>
[junit4:junit4]    >   </lst>
[junit4:junit4]    >   <lst>
[junit4:junit4]    >     <str name="name">bindsto</str>
[junit4:junit4]    >     <str name="type">boolean</str>
[junit4:junit4]    >     <bool name="indexed">true</bool>
[junit4:junit4]    >     <bool name="stored">true</bool>
[junit4:junit4]    >   </lst>
[junit4:junit4]    >   <lst>
[junit4:junit4]    >     <str name="name">uniq</str>
[junit4:junit4]    >     <str name="type">string</str>
[junit4:junit4]    >     <bool name="multiValued">true</bool>
[junit4:junit4]    >     <bool name="indexed">true</bool>
[junit4:junit4]    >     <bool name="stored">true</bool>
[junit4:junit4]    >   </lst>
[junit4:junit4]    >   <lst>
[junit4:junit4]    >     <str name="name">store</str>
[junit4:junit4]    >     <str name="type">location</str>
[junit4:junit4]    >     <bool name="indexed">true</bool>
[junit4:junit4]    >     <bool name="stored">true</bool>
[junit4:junit4]    >   </lst>
[junit4:junit4]    >   <lst>
[junit4:junit4]    >     <str name="name">keywordtok</str>
[junit4:junit4]    >     <str name="type">keywordtok</str>
[junit4:junit4]    >     <bool name="indexed">true</bool>
[junit4:junit4]    >     <bool name="stored">true</bool>
[junit4:junit4]    >   </lst>
[junit4:junit4]    >   <lst>
[junit4:junit4]    >     <str name="name">point_hash</str>
[junit4:junit4]    >     <str name="type">geohash</str>
[junit4:junit4]    >     <bool name="multiValued">false</bool>
[junit4:junit4]    >     <bool name="indexed">true</bool>
[junit4:junit4]    >     <bool name="stored">true</bool>
[junit4:junit4]    >   </lst>
[junit4:junit4]    >   <lst>
[junit4:junit4]    >     <str name="name">weight</str>
[junit4:junit4]    >     <str name="type">float</str>
[junit4:junit4]    >     <bool name="indexed">true</bool>
[junit4:junit4]    >     <bool name="stored">true</bool>
[junit4:junit4]    >   </lst>
[junit4:junit4]    >   <lst>
[junit4:junit4]    >     <str name="name">syn</str>
[junit4:junit4]    >     <str name="type">syn</str>
[junit4:junit4]    >     <bool name="indexed">true</bool>
[junit4:junit4]    >     <bool name="stored">true</bool>
[junit4:junit4]    >   </lst>
[junit4:junit4]    >   <lst>
[junit4:junit4]    >     <str name="name">HTMLwhitetok</str>
[junit4:junit4]    >     <str name="type">HTMLwhitetok</str>
[junit4:junit4]    >     <bool name="indexed">true</bool>
[junit4:junit4]    >     <bool name="stored">true</bool>
[junit4:junit4]    >   </lst>
[junit4:junit4]    >   <lst>
[junit4:junit4]    >     <str name="name">whitetok</str>
[junit4:junit4]    >     <str name="type">whitetok</str>
[junit4:junit4]    >     <bool name="indexed">true</bool>
[junit4:junit4]    >     <bool name="stored">true</bool>
[junit4:junit4]    >   </lst>
[junit4:junit4]    >   <lst>
[junit4:junit4]    >     <str name="name">nullfirst</str>
[junit4:junit4]    >     <str name="type">string</str>
[junit4:junit4]    >     <bool name="sortMissingFirst">true</bool>
[junit4:junit4]    >     <bool name="indexed">true</bool>
[junit4:junit4]    >     <bool name="stored">true</bool>
[junit4:junit4]    >   </lst>
[junit4:junit4]    >   <lst>
[junit4:junit4]    >     <str name="name">bind</str>
[junit4:junit4]    >     <str name="type">boolean</str>
[junit4:junit4]    >     <bool name="indexed">true</bool>
[junit4:junit4]    >     <bool name="stored">false</bool>
[junit4:junit4]    >   </lst>
[junit4:junit4]    >   <lst>
[junit4:junit4]    >     <str name="name">test_postv</str>
[junit4:junit4]    >     <str name="type">text</str>
[junit4:junit4]    >     <bool name="termVectors">true</bool>
[junit4:junit4]    >     <bool name="termPositions">true</bool>
[junit4:junit4]    >   </lst>
[junit4:junit4]    >   <lst>
[junit4:junit4]    >     <str name="name">standardfilt</str>
[junit4:junit4]    >     <str name="type">standardfilt</str>
[junit4:junit4]    >     <bool name="indexed">true</bool>
[junit4:junit4]    >     <bool name="stored">true</bool>
[junit4:junit4]    >   </lst>
[junit4:junit4]    >   <lst>
[junit4:junit4]    >     <str name="name">standardtokfilt</str>
[junit4:junit4]    >     <str name="type">standardtokfilt</str>
[junit4:junit4]    >     <bool name="indexed">true</bool>
[junit4:junit4]    >     <bool name="stored">true</bool>
[junit4:junit4]    >   </lst>
[junit4:junit4]    >   <lst>
[junit4:junit4]    >     <str name="name">subject</str>
[junit4:junit4]    >     <str name="type">text</str>
[junit4:junit4]    >     <bool name="indexed">true</bool>
[junit4:junit4]    >     <bool name="stored">true</bool>
[junit4:junit4]    >   </lst>
[junit4:junit4]    >   <lst>
[junit4:junit4]    >     <str name="name">standardtok</str>
[junit4:junit4]    >     <str name="type">standardtok</str>
[junit4:junit4]    >     <bool name="indexed">true</bool>
[junit4:junit4]    >     <bool name="stored">true</bool>
[junit4:junit4]    >   </lst>
[junit4:junit4]    >   <lst>
[junit4:junit4]    >     <str name="name">title</str>
[junit4:junit4]    >     <str name="type">nametext</str>
[junit4:junit4]    >     <bool name="indexed">true</bool>
[junit4:junit4]    >     <bool name="stored">true</bool>
[junit4:junit4]    >   </lst>
[junit4:junit4]    >   <lst>
[junit4:junit4]    >     <str name="name">patternreplacefilt</str>
[junit4:junit4]    >     <str name="type">patternreplacefilt</str>
[junit4:junit4]    >     <bool name="indexed">true</bool>
[junit4:junit4]    >     <bool name="stored">true</bool>
[junit4:junit4]    >   </lst>
[junit4:junit4]    >   <lst>
[junit4:junit4]    >     <str name="name">name</str>
[junit4:junit4]    >     <str name="type">nametext</str>
[junit4:junit4]    >     <bool name="indexed">true</bool>
[junit4:junit4]    >     <bool name="stored">true</bool>
[junit4:junit4]    >   </lst>
[junit4:junit4]    >   <lst>
[junit4:junit4]    >     <str name="name">point</str>
[junit4:junit4]    >     <str name="type">xy</str>
[junit4:junit4]    >     <bool name="multiValued">false</bool>
[junit4:junit4]    >     <bool name="indexed">true</bool>
[junit4:junit4]    >     <bool name="stored">true</bool>
[junit4:junit4]    >   </lst>
[junit4:junit4]    >   <lst>
[junit4:junit4]    >     <str name="name">copyfield_source</str>
[junit4:junit4]    >     <str name="type">string</str>
[junit4:junit4]    >     <bool name="multiValued">true</bool>
[junit4:junit4]    >     <bool name="indexed">true</bool>
[junit4:junit4]    >     <bool name="stored">true</bool>
[junit4:junit4]    >   </lst>
[junit4:junit4]    >   <lst>
[junit4:junit4]    >     <str name="name">stopfilt</str>
[junit4:junit4]    >     <str name="type">stopfilt</str>
[junit4:junit4]    >     <bool name="indexed">true</bool>
[junit4:junit4]    >     <bool name="stored">true</bool>
[junit4:junit4]    >   </lst>
[junit4:junit4]    >   <lst>
[junit4:junit4]    >     <str name="name">shouldbestored</str>
[junit4:junit4]    >     <str name="type">unstored</str>
[junit4:junit4]    >     <bool name="stored">true</bool>
[junit4:junit4]    >   </lst>
[junit4:junit4]    >   <lst>
[junit4:junit4]    >     <str name="name">shouldbeunstored</str>
[junit4:junit4]    >     <str name="type">unstored</str>
[junit4:junit4]    >   </lst>
[junit4:junit4]    >   <lst>
[junit4:junit4]    >     <str name="name">uniq3</str>
[junit4:junit4]    >     <str name="type">string</str>
[junit4:junit4]    >     <bool name="indexed">true</bool>
[junit4:junit4]    >     <bool name="stored">true</bool>
[junit4:junit4]    >   </lst>
[junit4:junit4]    >   <lst>
[junit4:junit4]    >     <str name="name">timestamp</str>
[junit4:junit4]    >     <str name="type">date</str>
[junit4:junit4]    >     <bool name="indexed">true</bool>
[junit4:junit4]    >     <bool name="stored">true</bool>
[junit4:junit4]    >   </lst>
[junit4:junit4]    >   <lst>
[junit4:junit4]    >     <str name="name">_version_</str>
[junit4:junit4]    >     <str name="type">long</str>
[junit4:junit4]    >     <bool name="indexed">true</bool>
[junit4:junit4]    >     <bool name="stored">true</bool>
[junit4:junit4]    >   </lst>
[junit4:junit4]    >   <lst>
[junit4:junit4]    >     <str name="name">wdf_nocase</str>
[junit4:junit4]    >     <str name="type">wdf_nocase</str>
[junit4:junit4]    >     <bool name="indexed">true</bool>
[junit4:junit4]    >     <bool name="stored">true</bool>
[junit4:junit4]    >   </lst>
[junit4:junit4]    >   <lst>
[junit4:junit4]    >     <str name="name">uuid</str>
[junit4:junit4]    >     <str name="type">uuid</str>
[junit4:junit4]    >     <bool name="stored">true</bool>
[junit4:junit4]    >   </lst>
[junit4:junit4]    >   <lst>
[junit4:junit4]    >     <str name="name">signatureField</str>
[junit4:junit4]    >     <str name="type">string</str>
[junit4:junit4]    >     <bool name="indexed">true</bool>
[junit4:junit4]    >     <bool name="stored">false</bool>
[junit4:junit4]    >   </lst>
[junit4:junit4]    >   <lst>
[junit4:junit4]    >     <str name="name">isto</str>
[junit4:junit4]    >     <str name="type">int</str>
[junit4:junit4]    >     <bool name="indexed">false</bool>
[junit4:junit4]    >     <bool name="stored">true</bool>
[junit4:junit4]    >   </lst>
[junit4:junit4]    >   <lst>
[junit4:junit4]    >     <str name="name">bday</str>
[junit4:junit4]    >     <str name="type">date</str>
[junit4:junit4]    >     <bool name="indexed">true</bool>
[junit4:junit4]    >     <bool name="stored">true</bool>
[junit4:junit4]    >   </lst>
[junit4:junit4]    >   <lst>
[junit4:junit4]    >     <str name="name">custengporterfilt</str>
[junit4:junit4]    >     <str name="type">custengporterfilt</str>
[junit4:junit4]    >     <bool name="indexed">true</bool>
[junit4:junit4]    >     <bool name="stored">true</bool>
[junit4:junit4]    >   </lst>
[junit4:junit4]    > </arr>
[junit4:junit4]    > </response>
[junit4:junit4]    > 
[junit4:junit4]    > 	request was:/schema/fields?indent=on&wt=xml
[junit4:junit4]    > 	at org.apache.solr.util.RestTestBase.assertQ(RestTestBase.java:136)
[junit4:junit4]    > 	... 41 more
[junit4:junit4]   2> 1855 T1096 oasc.CoreContainer.shutdown Shutting down CoreContainer instance=26781998
[junit4:junit4]   2> 1855 T1096 oasc.SolrCore.close [collection1]  CLOSING SolrCore org.apache.solr.core.SolrCore@6aa4da
[junit4:junit4]   2> 1966 T1096 oasu.DirectUpdateHandler2.close closing DirectUpdateHandler2{commits=0,autocommits=0,soft autocommits=0,optimizes=0,rollbacks=0,expungeDeletes=0,docsPending=0,adds=0,deletesById=0,deletesByQuery=0,errors=0,cumulative_adds=0,cumulative_deletesById=0,cumulative_deletesByQuery=0,cumulative_errors=0}
[junit4:junit4]   2> 1967 T1096 oasu.SolrCoreState.decrefSolrCoreState Closing SolrCoreState
[junit4:junit4]   2> 1968 T1096 oasu.DefaultSolrCoreState.closeIndexWriter SolrCoreState ref count has reached 0 - closing IndexWriter
[junit4:junit4]   2> 1968 T1096 oasu.DefaultSolrCoreState.closeIndexWriter closing IndexWriter with IndexWriterCloser
[junit4:junit4]   2> 1969 T1096 oasc.SolrCore.closeSearcher [collection1] Closing main searcher on request.
[junit4:junit4]   2> 1970 T1096 oasc.CachingDirectoryFactory.close Closing directory when closing factory: /mnt/ssd/jenkins/workspace/Lucene-Solr-4.x-Linux/solr/build/solr-core/test/J1/solrtest-TestFieldCollectionResource-1362639814458
[junit4:junit4]   2> 1970 T1096 oasc.CachingDirectoryFactory.closeDirectory Closing directory: /mnt/ssd/jenkins/workspace/Lucene-Solr-4.x-Linux/solr/build/solr-core/test/J1/solrtest-TestFieldCollectionResource-1362639814458
[junit4:junit4]   2> 1971 T1096 oasc.CachingDirectoryFactory.close Closing directory when closing factory: /mnt/ssd/jenkins/workspace/Lucene-Solr-4.x-Linux/solr/build/solr-core/test/J1/solrtest-TestFieldCollectionResource-1362639814458/index
[junit4:junit4]   2> 1972 T1096 oasc.CachingDirectoryFactory.closeDirectory Closing directory: /mnt/ssd/jenkins/workspace/Lucene-Solr-4.x-Linux/solr/build/solr-core/test/J1/solrtest-TestFieldCollectionResource-1362639814458/index
[junit4:junit4]   2> 1973 T1096 oejsh.ContextHandler.doStop stopped o.e.j.s.ServletContextHandler{/solr,null}
[junit4:junit4]   2> 2024 T1096 oas.SolrTestCaseJ4.deleteCore ###deleteCore
[junit4:junit4]   2> NOTE: test params are: codec=Asserting, sim=RandomSimilarityProvider(queryNorm=true,coord=crazy): {}, locale=in, timezone=Asia/Samarkand
[junit4:junit4]   2> NOTE: Linux 3.2.0-38-generic i386/Oracle Corporation 1.8.0-ea (32-bit)/cpus=8,threads=1,free=64285264,total=89690112
[junit4:junit4]   2> NOTE: All tests run in this JVM: [TestValueSourceCache, SolrIndexConfigTest, TestRTGBase, ClusterStateTest, TestMergePolicyConfig, SuggesterFSTTest, SimpleFacetsTest, DOMUtilTest, OverseerTest, SimplePostToolTest, DocValuesMultiTest, ChaosMonkeySafeLeaderTest, MultiTermTest, NotRequiredUniqueKeyTest, OverseerCollectionProcessorTest, CopyFieldTest, TestBinaryResponseWriter, TestSolr4Spatial, TestLMJelinekMercerSimilarityFactory, RegexBoostProcessorTest, FileUtilsTest, TestCSVLoader, SolrCoreCheckLockOnStartupTest, NoCacheHeaderTest, TestSort, TestZkChroot, IndexReaderFactoryTest, TestWordDelimiterFilterFactory, TestUtils, MoreLikeThisHandlerTest, TestSuggestSpellingConverter, DirectSolrSpellCheckerTest, DocumentBuilderTest, TestFieldCollectionResource]
[junit4:junit4] Completed on J1 in 2.05s, 5 tests, 2 errors <<< FAILURES!

[...truncated 35 lines...]
[junit4:junit4] Suite: org.apache.solr.cloud.UnloadDistributedZkTest
[junit4:junit4]   2> 0 T709 oas.BaseDistributedSearchTestCase.initHostContext Setting hostContext system property: /_/pd
[junit4:junit4]   2> 3 T709 oas.SolrTestCaseJ4.setUp ###Starting testDistribSearch
[junit4:junit4]   2> Creating dataDir: /mnt/ssd/jenkins/workspace/Lucene-Solr-4.x-Linux/solr/build/solr-core/test/J0/./solrtest-UnloadDistributedZkTest-1362639730862
[junit4:junit4]   2> 4 T709 oasc.ZkTestServer.run STARTING ZK TEST SERVER
[junit4:junit4]   2> 4 T710 oasc.ZkTestServer$ZKServerMain.runFromConfig Starting server
[junit4:junit4]   2> 5 T710 oazs.ZooKeeperServer.setTickTime tickTime set to 1000
[junit4:junit4]   2> 6 T710 oazs.ZooKeeperServer.setMinSessionTimeout minSessionTimeout set to -1
[junit4:junit4]   2> 6 T710 oazs.ZooKeeperServer.setMaxSessionTimeout maxSessionTimeout set to -1
[junit4:junit4]   2> 7 T710 oazs.NIOServerCnxnFactory.configure binding to port 0.0.0.0/0.0.0.0:0
[junit4:junit4]   2> 7 T710 oazsp.FileTxnSnapLog.save Snapshotting: 0x0 to /mnt/ssd/jenkins/workspace/Lucene-Solr-4.x-Linux/solr/build/solr-core/test/J0/./org.apache.solr.cloud.UnloadDistributedZkTest-1362639730862/zookeeper/server1/data/version-2/snapshot.0
[junit4:junit4]   2> 104 T709 oasc.ZkTestServer.run start zk server on port:56129
[junit4:junit4]   2> 105 T709 oaz.ZooKeeper.<init> Initiating client connection, connectString=127.0.0.1:56129 sessionTimeout=10000 watcher=org.apache.solr.common.cloud.ConnectionManager@1fe2a54
[junit4:junit4]   2> 106 T709 oascc.ConnectionManager.waitForConnected Waiting for client to connect to ZooKeeper
[junit4:junit4]   2> 106 T715 oaz.ClientCnxn$SendThread.logStartConnect Opening socket connection to server localhost.localdomain/127.0.0.1:56129. Will not attempt to authenticate using SASL (access denied ("javax.security.auth.AuthPermission" "getLoginConfiguration"))
[junit4:junit4]   2> 106 T715 oaz.ClientCnxn$SendThread.primeConnection Socket connection established to localhost.localdomain/127.0.0.1:56129, initiating session
[junit4:junit4]   2> 106 T711 oazs.NIOServerCnxnFactory.run Accepted socket connection from /127.0.0.1:51434
[junit4:junit4]   2> 107 T711 oazs.ZooKeeperServer.processConnectRequest Client attempting to establish new session at /127.0.0.1:51434
[junit4:junit4]   2> 107 T713 oazsp.FileTxnLog.append Creating new log file: log.1
[junit4:junit4]   2> 217 T713 oazs.ZooKeeperServer.finishSessionInit Established session 0x13d43a838b20000 with negotiated timeout 10000 for client /127.0.0.1:51434
[junit4:junit4]   2> 217 T715 oaz.ClientCnxn$SendThread.onConnected Session establishment complete on server localhost.localdomain/127.0.0.1:56129, sessionid = 0x13d43a838b20000, negotiated timeout = 10000
[junit4:junit4]   2> 218 T716 oascc.ConnectionManager.process Watcher org.apache.solr.common.cloud.ConnectionManager@1fe2a54 name:ZooKeeperConnection Watcher:127.0.0.1:56129 got event WatchedEvent state:SyncConnected type:None path:null path:null type:None
[junit4:junit4]   2> 218 T709 oascc.ConnectionManager.waitForConnected Client is connected to ZooKeeper
[junit4:junit4]   2> 219 T709 oascc.SolrZkClient.makePath makePath: /solr
[junit4:junit4]   2> 221 T714 oazs.PrepRequestProcessor.pRequest2Txn Processed session termination for sessionid: 0x13d43a838b20000
[junit4:junit4]   2> 222 T716 oaz.ClientCnxn$EventThread.run EventThread shut down
[junit4:junit4]   2> 222 T711 oazs.NIOServerCnxn.closeSock Closed socket connection for client /127.0.0.1:51434 which had sessionid 0x13d43a838b20000
[junit4:junit4]   2> 222 T709 oaz.ZooKeeper.close Session: 0x13d43a838b20000 closed
[junit4:junit4]   2> 223 T709 oaz.ZooKeeper.<init> Initiating client connection, connectString=127.0.0.1:56129/solr sessionTimeout=10000 watcher=org.apache.solr.common.cloud.ConnectionManager@139c71b
[junit4:junit4]   2> 224 T709 oascc.ConnectionManager.waitForConnected Waiting for client to connect to ZooKeeper
[junit4:junit4]   2> 224 T717 oaz.ClientCnxn$SendThread.logStartConnect Opening socket connection to server localhost.localdomain/127.0.0.1:56129. Will not attempt to authenticate using SASL (access denied ("javax.security.auth.AuthPermission" "getLoginConfiguration"))
[junit4:junit4]   2> 224 T717 oaz.ClientCnxn$SendThread.primeConnection Socket connection established to localhost.localdomain/127.0.0.1:56129, initiating session
[junit4:junit4]   2> 224 T711 oazs.NIOServerCnxnFactory.run Accepted socket connection from /127.0.0.1:51435
[junit4:junit4]   2> 225 T711 oazs.ZooKeeperServer.processConnectRequest Client attempting to establish new session at /127.0.0.1:51435
[junit4:junit4]   2> 225 T713 oazs.ZooKeeperServer.finishSessionInit Established session 0x13d43a838b20001 with negotiated timeout 10000 for client /127.0.0.1:51435
[junit4:junit4]   2> 225 T717 oaz.ClientCnxn$SendThread.onConnected Session establishment complete on server localhost.localdomain/127.0.0.1:56129, sessionid = 0x13d43a838b20001, negotiated timeout = 10000
[junit4:junit4]   2> 225 T718 oascc.ConnectionManager.process Watcher org.apache.solr.common.cloud.ConnectionManager@139c71b name:ZooKeeperConnection Watcher:127.0.0.1:56129/solr got event WatchedEvent state:SyncConnected type:None path:null path:null type:None
[junit4:junit4]   2> 226 T709 oascc.ConnectionManager.waitForConnected Client is connected to ZooKeeper
[junit4:junit4]   2> 226 T709 oascc.SolrZkClient.makePath makePath: /collections/collection1
[junit4:junit4]   2> 228 T709 oascc.SolrZkClient.makePath makePath: /collections/collection1/shards
[junit4:junit4]   2> 230 T709 oascc.SolrZkClient.makePath makePath: /collections/control_collection
[junit4:junit4]   2> 232 T709 oascc.SolrZkClient.makePath makePath: /collections/control_collection/shards
[junit4:junit4]   2> 233 T709 oasc.AbstractZkTestCase.putConfig put /mnt/ssd/jenkins/workspace/Lucene-Solr-4.x-Linux/solr/build/solr-core/test-files/solr/collection1/conf/solrconfig-tlog.xml to /configs/conf1/solrconfig.xml
[junit4:junit4]   2> 234 T709 oascc.SolrZkClient.makePath makePath: /configs/conf1/solrconfig.xml
[junit4:junit4]   2> 237 T709 oasc.AbstractZkTestCase.putConfig put /mnt/ssd/jenkins/workspace/Lucene-Solr-4.x-Linux/solr/build/solr-core/test-files/solr/collection1/conf/schema.xml to /configs/conf1/schema.xml
[junit4:junit4]   2> 237 T709 oascc.SolrZkClient.makePath makePath: /configs/conf1/schema.xml
[junit4:junit4]   2> 240 T709 oasc.AbstractZkTestCase.putConfig put /mnt/ssd/jenkins/workspace/Lucene-Solr-4.x-Linux/solr/build/solr-core/test-files/solr/collection1/conf/stopwords.txt to /configs/conf1/stopwords.txt
[junit4:junit4]   2> 240 T709 oascc.SolrZkClient.makePath makePath: /configs/conf1/stopwords.txt
[junit4:junit4]   2> 243 T709 oasc.AbstractZkTestCase.putConfig put /mnt/ssd/jenkins/workspace/Lucene-Solr-4.x-Linux/solr/build/solr-core/test-files/solr/collection1/conf/protwords.txt to /configs/conf1/protwords.txt
[junit4:junit4]   2> 243 T709 oascc.SolrZkClient.makePath makePath: /configs/conf1/protwords.txt
[junit4:junit4]   2> 245 T709 oasc.AbstractZkTestCase.putConfig put /mnt/ssd/jenkins/workspace/Lucene-Solr-4.x-Linux/solr/build/solr-core/test-files/solr/collection1/conf/currency.xml to /configs/conf1/currency.xml
[junit4:junit4]   2> 245 T709 oascc.SolrZkClient.makePath makePath: /configs/conf1/currency.xml
[junit4:junit4]   2> 247 T709 oasc.AbstractZkTestCase.putConfig put /mnt/ssd/jenkins/workspace/Lucene-Solr-4.x-Linux/solr/build/solr-core/test-files/solr/collection1/conf/open-exchange-rates.json to /configs/conf1/open-exchange-rates.json
[junit4:junit4]   2> 248 T709 oascc.SolrZkClient.makePath makePath: /configs/conf1/open-exchange-rates.json
[junit4:junit4]   2> 249 T709 oasc.AbstractZkTestCase.putConfig put /mnt/ssd/jenkins/workspace/Lucene-Solr-4.x-Linux/solr/build/solr-core/test-files/solr/collection1/conf/mapping-ISOLatin1Accent.txt to /configs/conf1/mapping-ISOLatin1Accent.txt
[junit4:junit4]   2> 250 T709 oascc.SolrZkClient.makePath makePath: /configs/conf1/mapping-ISOLatin1Accent.txt
[junit4:junit4]   2> 252 T709 oasc.AbstractZkTestCase.putConfig put /mnt/ssd/jenkins/workspace/Lucene-Solr-4.x-Linux/solr/build/solr-core/test-files/solr/collection1/conf/old_synonyms.txt to /configs/conf1/old_synonyms.txt
[junit4:junit4]   2> 253 T709 oascc.SolrZkClient.makePath makePath: /configs/conf1/old_synonyms.txt
[junit4:junit4]   2> 254 T709 oasc.AbstractZkTestCase.putConfig put /mnt/ssd/jenkins/workspace/Lucene-Solr-4.x-Linux/solr/build/solr-core/test-files/solr/collection1/conf/synonyms.txt to /configs/conf1/synonyms.txt
[junit4:junit4]   2> 255 T709 oascc.SolrZkClient.makePath makePath: /configs/conf1/synonyms.txt
[junit4:junit4]   2> 256 T714 oazs.PrepRequestProcessor.pRequest2Txn Processed session termination for sessionid: 0x13d43a838b20001
[junit4:junit4]   2> 257 T718 oaz.ClientCnxn$EventThread.run EventThread shut down
[junit4:junit4]   2> 257 T709 oaz.ZooKeeper.close Session: 0x13d43a838b20001 closed
[junit4:junit4]   2> 257 T711 oazs.NIOServerCnxn.closeSock Closed socket connection for client /127.0.0.1:51435 which had sessionid 0x13d43a838b20001
[junit4:junit4]   2> 314 T709 oejs.Server.doStart jetty-8.1.8.v20121106
[junit4:junit4]   2> 343 T709 oejs.AbstractConnector.doStart Started SelectChannelConnector@127.0.0.1:52253
[junit4:junit4]   2> 344 T709 oass.SolrDispatchFilter.init SolrDispatchFilter.init()
[junit4:junit4]   2> 344 T709 oasc.SolrResourceLoader.locateSolrHome JNDI not configured for solr (NoInitialContextEx)
[junit4:junit4]   2> 345 T709 oasc.SolrResourceLoader.locateSolrHome using system property solr.solr.home: /mnt/ssd/jenkins/workspace/Lucene-Solr-4.x-Linux/solr/build/solr-core/test/J0/./org.apache.solr.cloud.UnloadDistributedZkTest-controljetty-1362639731116
[junit4:junit4]   2> 345 T709 oasc.CoreContainer$Initializer.initialize looking for solr.xml: /mnt/ssd/jenkins/workspace/Lucene-Solr-4.x-Linux/solr/build/solr-core/test/J0/./org.apache.solr.cloud.UnloadDistributedZkTest-controljetty-1362639731116/solr.xml
[junit4:junit4]   2> 345 T709 oasc.CoreContainer.<init> New CoreContainer 31194245
[junit4:junit4]   2> 346 T709 oasc.CoreContainer.load Loading CoreContainer using Solr Home: '/mnt/ssd/jenkins/workspace/Lucene-Solr-4.x-Linux/solr/build/solr-core/test/J0/./org.apache.solr.cloud.UnloadDistributedZkTest-controljetty-1362639731116/'
[junit4:junit4]   2> 346 T709 oasc.SolrResourceLoader.<init> new SolrResourceLoader for directory: '/mnt/ssd/jenkins/workspace/Lucene-Solr-4.x-Linux/solr/build/solr-core/test/J0/./org.apache.solr.cloud.UnloadDistributedZkTest-controljetty-1362639731116/'
[junit4:junit4]   2> 364 T709 oashc.HttpShardHandlerFactory.getParameter Setting socketTimeout to: 120000
[junit4:junit4]   2> 365 T709 oashc.HttpShardHandlerFactory.getParameter Setting urlScheme to: http://
[junit4:junit4]   2> 365 T709 oashc.HttpShardHandlerFactory.getParameter Setting connTimeout to: 15000
[junit4:junit4]   2> 365 T709 oashc.HttpShardHandlerFactory.getParameter Setting maxConnectionsPerHost to: 20
[junit4:junit4]   2> 366 T709 oashc.HttpShardHandlerFactory.getParameter Setting corePoolSize to: 0
[junit4:junit4]   2> 366 T709 oashc.HttpShardHandlerFactory.getParameter Setting maximumPoolSize to: 2147483647
[junit4:junit4]   2> 366 T709 oashc.HttpShardHandlerFactory.getParameter Setting maxThreadIdleTime to: 5
[junit4:junit4]   2> 367 T709 oashc.HttpShardHandlerFactory.getParameter Setting sizeOfQueue to: -1
[junit4:junit4]   2> 367 T709 oashc.HttpShardHandlerFactory.getParameter Setting fairnessPolicy to: false
[junit4:junit4]   2> 367 T709 oascsi.HttpClientUtil.createClient Creating new http client, config:maxConnectionsPerHost=20&maxConnections=10000&socketTimeout=120000&connTimeout=15000&retry=false
[junit4:junit4]   2> 374 T709 oasc.CoreContainer.load Registering Log Listener
[junit4:junit4]   2> 387 T709 oasc.CoreContainer.initZooKeeper Zookeeper client=127.0.0.1:56129/solr
[junit4:junit4]   2> 387 T709 oasc.ZkController.checkChrootPath zkHost includes chroot
[junit4:junit4]   2> 388 T709 oaz.ZooKeeper.<init> Initiating client connection, connectString=127.0.0.1:56129 sessionTimeout=60000 watcher=org.apache.solr.common.cloud.ConnectionManager@126a93a
[junit4:junit4]   2> 388 T709 oascc.ConnectionManager.waitForConnected Waiting for client to connect to ZooKeeper
[junit4:junit4]   2> 389 T728 oaz.ClientCnxn$SendThread.logStartConnect Opening socket connection to server localhost.localdomain/127.0.0.1:56129. Will not attempt to authenticate using SASL (access denied ("javax.security.auth.AuthPermission" "getLoginConfiguration"))
[junit4:junit4]   2> 389 T728 oaz.ClientCnxn$SendThread.primeConnection Socket connection established to localhost.localdomain/127.0.0.1:56129, initiating session
[junit4:junit4]   2> 389 T711 oazs.NIOServerCnxnFactory.run Accepted socket connection from /127.0.0.1:51436
[junit4:junit4]   2> 390 T711 oazs.ZooKeeperServer.processConnectRequest Client attempting to establish new session at /127.0.0.1:51436
[junit4:junit4]   2> 390 T713 oazs.ZooKeeperServer.finishSessionInit Established session 0x13d43a838b20002 with negotiated timeout 20000 for client /127.0.0.1:51436
[junit4:junit4]   2> 390 T728 oaz.ClientCnxn$SendThread.onConnected Session establishment complete on server localhost.localdomain/127.0.0.1:56129, sessionid = 0x13d43a838b20002, negotiated timeout = 20000
[junit4:junit4]   2> 391 T729 oascc.ConnectionManager.process Watcher org.apache.solr.common.cloud.ConnectionManager@126a93a name:ZooKeeperConnection Watcher:127.0.0.1:56129 got event WatchedEvent state:SyncConnected type:None path:null path:null type:None
[junit4:junit4]   2> 391 T709 oascc.ConnectionManager.waitForConnected Client is connected to ZooKeeper
[junit4:junit4]   2> 392 T714 oazs.PrepRequestProcessor.pRequest2Txn Processed session termination for sessionid: 0x13d43a838b20002
[junit4:junit4]   2> 392 T729 oaz.ClientCnxn$EventThread.run EventThread shut down
[junit4:junit4]   2> 392 T709 oaz.ZooKeeper.close Session: 0x13d43a838b20002 closed
[junit4:junit4]   2> 392 T711 oazs.NIOServerCnxn.closeSock Closed socket connection for client /127.0.0.1:51436 which had sessionid 0x13d43a838b20002
[junit4:junit4]   2> 393 T709 oascsi.HttpClientUtil.createClient Creating new http client, config:maxConnections=500&maxConnectionsPerHost=16&socketTimeout=120000&connTimeout=15000
[junit4:junit4]   2> 396 T709 oaz.ZooKeeper.<init> Initiating client connection, connectString=127.0.0.1:56129/solr sessionTimeout=30000 watcher=org.apache.solr.common.cloud.ConnectionManager@107356b
[junit4:junit4]   2> 396 T730 oaz.ClientCnxn$SendThread.logStartConnect Opening socket connection to server localhost.localdomain/127.0.0.1:56129. Will not attempt to authenticate using SASL (access denied ("javax.security.auth.AuthPermission" "getLoginConfiguration"))
[junit4:junit4]   2> 396 T709 oascc.ConnectionManager.waitForConnected Waiting for client to connect to ZooKeeper
[junit4:junit4]   2> 397 T730 oaz.ClientCnxn$SendThread.primeConnection Socket connection established to localhost.localdomain/127.0.0.1:56129, initiating session
[junit4:junit4]   2> 397 T711 oazs.NIOServerCnxnFactory.run Accepted socket connection from /127.0.0.1:51437
[junit4:junit4]   2> 397 T711 oazs.ZooKeeperServer.processConnectRequest Client attempting to establish new session at /127.0.0.1:51437
[junit4:junit4]   2> 398 T713 oazs.ZooKeeperServer.finishSessionInit Established session 0x13d43a838b20003 with negotiated timeout 20000 for client /127.0.0.1:51437
[junit4:junit4]   2> 398 T730 oaz.ClientCnxn$SendThread.onConnected Session establishment complete on server localhost.localdomain/127.0.0.1:56129, sessionid = 0x13d43a838b20003, negotiated timeout = 20000
[junit4:junit4]   2> 398 T731 oascc.ConnectionManager.process Watcher org.apache.solr.common.cloud.ConnectionManager@107356b name:ZooKeeperConnection Watcher:127.0.0.1:56129/solr got event WatchedEvent state:SyncConnected type:None path:null path:null type:None
[junit4:junit4]   2> 398 T709 oascc.ConnectionManager.waitForConnected Client is connected to ZooKeeper
[junit4:junit4]   2> 399 T714 oazs.PrepRequestProcessor.pRequest Got user-level KeeperException when processing sessionid:0x13d43a838b20003 type:create cxid:0x2 zxid:0x1a txntype:-1 reqpath:n/a Error Path:/solr/overseer Error:KeeperErrorCode = NodeExists for /solr/overseer
[junit4:junit4]   2> 400 T709 oascc.SolrZkClient.makePath makePath: /live_nodes
[junit4:junit4]   2> 402 T709 oasc.ZkController.createEphemeralLiveNode Register node as live in ZooKeeper:/live_nodes/127.0.0.1:52253__%2Fpd
[junit4:junit4]   2> 402 T714 oazs.PrepRequestProcessor.pRequest Got user-level KeeperException when processing sessionid:0x13d43a838b20003 type:delete cxid:0x8 zxid:0x1c txntype:-1 reqpath:n/a Error Path:/solr/live_nodes/127.0.0.1:52253__%2Fpd Error:KeeperErrorCode = NoNode for /solr/live_nodes/127.0.0.1:52253__%2Fpd
[junit4:junit4]   2> 410 T709 oascc.SolrZkClient.makePath makePath: /live_nodes/127.0.0.1:52253__%2Fpd
[junit4:junit4]   2> 412 T709 oascc.SolrZkClient.makePath makePath: /overseer_elect/election
[junit4:junit4]   2> 416 T714 oazs.PrepRequestProcessor.pRequest Got user-level KeeperException when processing sessionid:0x13d43a838b20003 type:delete cxid:0x16 zxid:0x21 txntype:-1 reqpath:n/a Error Path:/solr/overseer_elect/leader Error:KeeperErrorCode = NoNode for /solr/overseer_elect/leader
[junit4:junit4]   2> 416 T709 oascc.SolrZkClient.makePath makePath: /overseer_elect/leader
[junit4:junit4]   2> 418 T709 oasc.Overseer.start Overseer (id=89301957402034179-127.0.0.1:52253__%2Fpd-n_0000000000) starting
[junit4:junit4]   2> 418 T714 oazs.PrepRequestProcessor.pRequest Got user-level KeeperException when processing sessionid:0x13d43a838b20003 type:create cxid:0x1b zxid:0x23 txntype:-1 reqpath:n/a Error Path:/solr/overseer Error:KeeperErrorCode = NodeExists for /solr/overseer
[junit4:junit4]   2> 419 T714 oazs.PrepRequestProcessor.pRequest Got user-level KeeperException when processing sessionid:0x13d43a838b20003 type:create cxid:0x1c zxid:0x24 txntype:-1 reqpath:n/a Error Path:/solr/overseer Error:KeeperErrorCode = NodeExists for /solr/overseer
[junit4:junit4]   2> 419 T714 oazs.PrepRequestProcessor.pRequest Got user-level KeeperException when processing sessionid:0x13d43a838b20003 type:create cxid:0x1d zxid:0x25 txntype:-1 reqpath:n/a Error Path:/solr/overseer Error:KeeperErrorCode = NodeExists for /solr/overseer
[junit4:junit4]   2> 420 T714 oazs.PrepRequestProcessor.pRequest Got user-level KeeperException when processing sessionid:0x13d43a838b20003 type:create cxid:0x1e zxid:0x26 txntype:-1 reqpath:n/a Error Path:/solr/overseer Error:KeeperErrorCode = NodeExists for /solr/overseer
[junit4:junit4]   2> 420 T733 oasc.OverseerCollectionProcessor.run Process current queue of collection creations
[junit4:junit4]   2> 421 T709 oascc.SolrZkClient.makePath makePath: /clusterstate.json
[junit4:junit4]   2> 422 T709 oascc.SolrZkClient.makePath makePath: /aliases.json
[junit4:junit4]   2> 424 T709 oascc.ZkStateReader.createClusterStateWatchersAndUpdate Updating cluster state from ZooKeeper... 
[junit4:junit4]   2> 425 T732 oasc.Overseer$ClusterStateUpdater.run Starting to work on the main queue
[junit4:junit4]   2> 427 T709 oass.SolrDispatchFilter.init user.dir=/mnt/ssd/jenkins/workspace/Lucene-Solr-4.x-Linux/solr/build/solr-core/test/J0
[junit4:junit4]   2> 428 T709 oass.SolrDispatchFilter.init SolrDispatchFilter.init() done
[junit4:junit4]   2> 428 T709 oascsi.HttpClientUtil.createClient Creating new http client, config:maxConnections=128&maxConnectionsPerHost=32&followRedirects=false
[junit4:junit4]   2> 430 T709 oascsi.HttpClientUtil.createClient Creating new http client, config:
[junit4:junit4]   2> 431 T709 oaz.ZooKeeper.<init> Initiating client connection, connectString=127.0.0.1:56129/solr sessionTimeout=10000 watcher=org.apache.solr.common.cloud.ConnectionManager@198a990
[junit4:junit4]   2> 432 T709 oascc.ConnectionManager.waitForConnected Waiting for client to connect to ZooKeeper
[junit4:junit4]   2> 432 T734 oaz.ClientCnxn$SendThread.logStartConnect Opening socket connection to server localhost.localdomain/127.0.0.1:56129. Will not attempt to authenticate using SASL (access denied ("javax.security.auth.AuthPermission" "getLoginConfiguration"))
[junit4:junit4]   2> 432 T734 oaz.ClientCnxn$SendThread.primeConnection Socket connection established to localhost.localdomain/127.0.0.1:56129, initiating session
[junit4:junit4]   2> 432 T711 oazs.NIOServerCnxnFactory.run Accepted socket connection from /127.0.0.1:51438
[junit4:junit4]   2> 433 T711 oazs.ZooKeeperServer.processConnectRequest Client attempting to establish new session at /127.0.0.1:51438
[junit4:junit4]   2> 434 T713 oazs.ZooKeeperServer.finishSessionInit Established session 0x13d43a838b20004 with negotiated timeout 10000 for client /127.0.0.1:51438
[junit4:junit4]   2> 434 T734 oaz.ClientCnxn$SendThread.onConnected Session establishment complete on server localhost.localdomain/127.0.0.1:56129, sessionid = 0x13d43a838b20004, negotiated timeout = 10000
[junit4:junit4]   2> 435 T735 oascc.ConnectionManager.process Watcher org.apache.solr.common.cloud.ConnectionManager@198a990 name:ZooKeeperConnection Watcher:127.0.0.1:56129/solr got event WatchedEvent state:SyncConnected type:None path:null path:null type:None
[junit4:junit4]   2> 435 T709 oascc.ConnectionManager.waitForConnected Client is connected to ZooKeeper
[junit4:junit4]   2> 436 T709 oascc.ZkStateReader.createClusterStateWatchersAndUpdate Updating cluster state from ZooKeeper... 
[junit4:junit4]   2> 437 T709 oasc.ChaosMonkey.monkeyLog monkey: init - expire sessions:true cause connection loss:true
[junit4:junit4]   2> 498 T709 oejs.Server.doStart jetty-8.1.8.v20121106
[junit4:junit4]   2> 500 T709 oejs.AbstractConnector.doStart Started SelectChannelConnector@127.0.0.1:60627
[junit4:junit4]   2> 500 T709 oass.SolrDispatchFilter.init SolrDispatchFilter.init()
[junit4:junit4]   2> 500 T709 oasc.SolrResourceLoader.locateSolrHome JNDI not configured for solr (NoInitialContextEx)
[junit4:junit4]   2> 501 T709 oasc.SolrResourceLoader.locateSolrHome using system property solr.solr.home: /mnt/ssd/jenkins/workspace/Lucene-Solr-4.x-Linux/solr/build/solr-core/test/J0/./org.apache.solr.cloud.UnloadDistributedZkTest-jetty1-1362639731295
[junit4:junit4]   2> 501 T709 oasc.CoreContainer$Initializer.initialize looking for solr.xml: /mnt/ssd/jenkins/workspace/Lucene-Solr-4.x-Linux/solr/build/solr-core/test/J0/./org.apache.solr.cloud.UnloadDistributedZkTest-jetty1-1362639731295/solr.xml
[junit4:junit4]   2> 501 T709 oasc.CoreContainer.<init> New CoreContainer 3128635
[junit4:junit4]   2> 502 T709 oasc.CoreContainer.load Loading CoreContainer using Solr Home: '/mnt/ssd/jenkins/workspace/Lucene-Solr-4.x-Linux/solr/build/solr-core/test/J0/./org.apache.solr.cloud.UnloadDistributedZkTest-jetty1-1362639731295/'
[junit4:junit4]   2> 502 T709 oasc.SolrResourceLoader.<init> new SolrResourceLoader for directory: '/mnt/ssd/jenkins/workspace/Lucene-Solr-4.x-Linux/solr/build/solr-core/test/J0/./org.apache.solr.cloud.UnloadDistributedZkTest-jetty1-1362639731295/'
[junit4:junit4]   2> 520 T709 oashc.HttpShardHandlerFactory.getParameter Setting socketTimeout to: 120000
[junit4:junit4]   2> 520 T709 oashc.HttpShardHandlerFactory.getParameter Setting urlScheme to: http://
[junit4:junit4]   2> 521 T709 oashc.HttpShardHandlerFactory.getParameter Setting connTimeout to: 15000
[junit4:junit4]   2> 521 T709 oashc.HttpShardHandlerFactory.getParameter Setting maxConnectionsPerHost to: 20
[junit4:junit4]   2> 521 T709 oashc.HttpShardHandlerFactory.getParameter Setting corePoolSize to: 0
[junit4:junit4]   2> 522 T709 oashc.HttpShardHandlerFactory.getParameter Setting maximumPoolSize to: 2147483647
[junit4:junit4]   2> 522 T709 oashc.HttpShardHandlerFactory.getParameter Setting maxThreadIdleTime to: 5
[junit4:junit4]   2> 522 T709 oashc.HttpShardHandlerFactory.getParameter Setting sizeOfQueue to: -1
[junit4:junit4]   2> 523 T709 oashc.HttpShardHandlerFactory.getParameter Setting fairnessPolicy to: false
[junit4:junit4]   2> 523 T709 oascsi.HttpClientUtil.createClient Creating new http client, config:maxConnectionsPerHost=20&maxConnections=10000&socketTimeout=120000&connTimeout=15000&retry=false
[junit4:junit4]   2> 530 T709 oasc.CoreContainer.load Registering Log Listener
[junit4:junit4]   2> 542 T709 oasc.CoreContainer.initZooKeeper Zookeeper client=127.0.0.1:56129/solr
[junit4:junit4]   2> 542 T709 oasc.ZkController.checkChrootPath zkHost includes chroot
[junit4:junit4]   2> 543 T709 oaz.ZooKeeper.<init> Initiating client connection, connectString=127.0.0.1:56129 sessionTimeout=60000 watcher=org.apache.solr.common.cloud.ConnectionManager@1bcf855
[junit4:junit4]   2> 544 T709 oascc.ConnectionManager.waitForConnected Waiting for client to connect to ZooKeeper
[junit4:junit4]   2> 544 T745 oaz.ClientCnxn$SendThread.logStartConnect Opening socket connection to server localhost.localdomain/127.0.0.1:56129. Will not attempt to authenticate using SASL (access denied ("javax.security.auth.AuthPermission" "getLoginConfiguration"))
[junit4:junit4]   2> 545 T745 oaz.ClientCnxn$SendThread.primeConnection Socket connection established to localhost.localdomain/127.0.0.1:56129, initiating session
[junit4:junit4]   2> 545 T711 oazs.NIOServerCnxnFactory.run Accepted socket connection from /127.0.0.1:51439
[junit4:junit4]   2> 545 T711 oazs.ZooKeeperServer.processConnectRequest Client attempting to establish new session at /127.0.0.1:51439
[junit4:junit4]   2> 546 T713 oazs.ZooKeeperServer.finishSessionInit Established session 0x13d43a838b20005 with negotiated timeout 20000 for client /127.0.0.1:51439
[junit4:junit4]   2> 546 T745 oaz.ClientCnxn$SendThread.onConnected Session establishment complete on server localhost.localdomain/127.0.0.1:56129, sessionid = 0x13d43a838b20005, negotiated timeout = 20000
[junit4:junit4]   2> 546 T746 oascc.ConnectionManager.process Watcher org.apache.solr.common.cloud.ConnectionManager@1bcf855 name:ZooKeeperConnection Watcher:127.0.0.1:56129 got event WatchedEvent state:SyncConnected type:None path:null path:null type:None
[junit4:junit4]   2> 546 T709 oascc.ConnectionManager.waitForConnected Client is connected to ZooKeeper
[junit4:junit4]   2> 547 T714 oazs.PrepRequestProcessor.pRequest2Txn Processed session termination for sessionid: 0x13d43a838b20005
[junit4:junit4]   2> 548 T746 oaz.ClientCnxn$EventThread.run EventThread shut down
[junit4:junit4]   2> 548 T711 oazs.NIOServerCnxn.closeSock Closed socket connection for client /127.0.0.1:51439 which had sessionid 0x13d43a838b20005
[junit4:junit4]   2> 548 T709 oaz.ZooKeeper.close Session: 0x13d43a838b20005 closed
[junit4:junit4]   2> 548 T709 oascsi.HttpClientUtil.createClient Creating new http client, config:maxConnections=500&maxConnectionsPerHost=16&socketTimeout=120000&connTimeout=15000
[junit4:junit4]   2> 551 T709 oaz.ZooKeeper.<init> Initiating client connection, connectString=127.0.0.1:56129/solr sessionTimeout=30000 watcher=org.apache.solr.common.cloud.ConnectionManager@4568aa
[junit4:junit4]   2> 552 T747 oaz.ClientCnxn$SendThread.logStartConnect Opening socket connection to server localhost.localdomain/127.0.0.1:56129. Will not attempt to authenticate using SASL (access denied ("javax.security.auth.AuthPermission" "getLoginConfiguration"))
[junit4:junit4]   2> 552 T709 oascc.ConnectionManager.waitForConnected Waiting for client to connect to ZooKeeper
[junit4:junit4]   2> 552 T747 oaz.ClientCnxn$SendThread.primeConnection Socket connection established to localhost.localdomain/127.0.0.1:56129, initiating session
[junit4:junit4]   2> 552 T711 oazs.NIOServerCnxnFactory.run Accepted socket connection from /127.0.0.1:51440
[junit4:junit4]   2> 553 T711 oazs.ZooKeeperServer.processConnectRequest Client attempting to establish new session at /127.0.0.1:51440
[junit4:junit4]   2> 553 T713 oazs.ZooKeeperServer.finishSessionInit Established session 0x13d43a838b20006 with negotiated timeout 20000 for client /127.0.0.1:51440
[junit4:junit4]   2> 553 T747 oaz.ClientCnxn$SendThread.onConnected Session establishment complete on server localhost.localdomain/127.0.0.1:56129, sessionid = 0x13d43a838b20006, negotiated timeout = 20000
[junit4:junit4]   2> 554 T748 oascc.ConnectionManager.process Watcher org.apache.solr.common.cloud.ConnectionManager@4568aa name:ZooKeeperConnection Watcher:127.0.0.1:56129/solr got event WatchedEvent state:SyncConnected type:None path:null path:null type:None
[junit4:junit4]   2> 554 T709 oascc.ConnectionManager.waitForConnected Client is connected to ZooKeeper
[junit4:junit4]   2> 554 T714 oazs.PrepRequestProcessor.pRequest Got user-level KeeperException when processing sessionid:0x13d43a838b20006 type:create cxid:0x1 zxid:0x2e txntype:-1 reqpath:n/a Error Path:/solr/overseer Error:KeeperErrorCode = NodeExists for /solr/overseer
[junit4:junit4]   2> 555 T714 oazs.PrepRequestProcessor.pRequest Got user-level KeeperException when processing sessionid:0x13d43a838b20006 type:create cxid:0x2 zxid:0x2f txntype:-1 reqpath:n/a Error Path:/solr/overseer Error:KeeperErrorCode = NodeExists for /solr/overseer
[junit4:junit4]   2> 556 T709 oascc.ZkStateReader.createClusterStateWatchersAndUpdate Updating cluster state from ZooKeeper... 
[junit4:junit4]   2> 1558 T709 oasc.ZkController.createEphemeralLiveNode Register node as live in ZooKeeper:/live_nodes/127.0.0.1:60627__%2Fpd
[junit4:junit4]   2> 1560 T714 oazs.PrepRequestProcessor.pRequest Got user-level KeeperException when processing sessionid:0x13d43a838b20006 type:delete cxid:0xb zxid:0x30 txntype:-1 reqpath:n/a Error Path:/solr/live_nodes/127.0.0.1:60627__%2Fpd Error:KeeperErrorCode = NoNode for /solr/live_nodes/127.0.0.1:60627__%2Fpd
[junit4:junit4]   2> 1561 T709 oascc.SolrZkClient.makePath makePath: /live_nodes/127.0.0.1:60627__%2Fpd
[junit4:junit4]   2> 1565 T735 oascc.ZkStateReader$3.process Updating live nodes... (2)
[junit4:junit4]   2> 1566 T748 oascc.ZkStateReader$3.process Updating live nodes... (2)
[junit4:junit4]   2> 1566 T731 oascc.ZkStateReader$3.process Updating live nodes... (2)
[junit4:junit4]   2> 1574 T709 oass.SolrDispatchFilter.init user.dir=/mnt/ssd/jenkins/workspace/Lucene-Solr-4.x-Linux/solr/build/solr-core/test/J0
[junit4:junit4]   2> 1574 T709 oass.SolrDispatchFilter.init SolrDispatchFilter.init() done
[junit4:junit4]   2> 1574 T709 oascsi.HttpClientUtil.createClient Creating new http client, config:maxConnections=128&maxConnectionsPerHost=32&followRedirects=false
[junit4:junit4]   2> 1643 T709 oejs.Server.doStart jetty-8.1.8.v20121106
[junit4:junit4]   2> 1645 T709 oejs.AbstractConnector.doStart Started SelectChannelConnector@127.0.0.1:47942
[junit4:junit4]   2> 1645 T709 oass.SolrDispatchFilter.init SolrDispatchFilter.init()
[junit4:junit4]   2> 1646 T709 oasc.SolrResourceLoader.locateSolrHome JNDI not configured for solr (NoInitialContextEx)
[junit4:junit4]   2> 1646 T709 oasc.SolrResourceLoader.locateSolrHome using system property solr.solr.home: /mnt/ssd/jenkins/workspace/Lucene-Solr-4.x-Linux/solr/build/solr-core/test/J0/./org.apache.solr.cloud.UnloadDistributedZkTest-jetty2-1362639732443
[junit4:junit4]   2> 1646 T709 oasc.CoreContainer$Initializer.initialize looking for solr.xml: /mnt/ssd/jenkins/workspace/Lucene-Solr-4.x-Linux/solr/build/solr-core/test/J0/./org.apache.solr.cloud.UnloadDistributedZkTest-jetty2-1362639732443/solr.xml
[junit4:junit4]   2> 1647 T709 oasc.CoreContainer.<init> New CoreContainer 9909199
[junit4:junit4]   2> 1647 T709 oasc.CoreContainer.load Loading CoreContainer using Solr Home: '/mnt/ssd/jenkins/workspace/Lucene-Solr-4.x-Linux/solr/build/solr-core/test/J0/./org.apache.solr.cloud.UnloadDistributedZkTest-jetty2-1362639732443/'
[junit4:junit4]   2> 1647 T709 oasc.SolrResourceLoader.<init> new SolrResourceLoader for directory: '/mnt/ssd/jenkins/workspace/Lucene-Solr-4.x-Linux/solr/build/solr-core/test/J0/./org.apache.solr.cloud.UnloadDistributedZkTest-jetty2-1362639732443/'
[junit4:junit4]   2> 1664 T709 oashc.HttpShardHandlerFactory.getParameter Setting socketTimeout to: 120000
[junit4:junit4]   2> 1665 T709 oashc.HttpShardHandlerFactory.getParameter Setting urlScheme to: http://
[junit4:junit4]   2> 1665 T709 oashc.HttpShardHandlerFactory.getParameter Setting connTimeout to: 15000
[junit4:junit4]   2> 1665 T709 oashc.HttpShardHandlerFactory.getParameter Setting maxConnectionsPerHost to: 20
[junit4:junit4]   2> 1666 T709 oashc.HttpShardHandlerFactory.getParameter Setting corePoolSize to: 0
[junit4:junit4]   2> 1666 T709 oashc.HttpShardHandlerFactory.getParameter Setting maximumPoolSize to: 2147483647
[junit4:junit4]   2> 1666 T709 oashc.HttpShardHandlerFactory.getParameter Setting maxThreadIdleTime to: 5
[junit4:junit4]   2> 1667 T709 oashc.HttpShardHandlerFactory.getParameter Setting sizeOfQueue to: -1
[junit4:junit4]   2> 1667 T709 oashc.HttpShardHandlerFactory.getParameter Setting fairnessPolicy to: false
[junit4:junit4]   2> 1667 T709 oascsi.HttpClientUtil.createClient Creating new http client, config:maxConnectionsPerHost=20&maxConnections=10000&socketTimeout=120000&connTimeout=15000&retry=false
[junit4:junit4]   2> 1674 T709 oasc.CoreContainer.load Registering Log Listener
[junit4:junit4]   2> 1685 T709 oasc.CoreContainer.initZooKeeper Zookeeper client=127.0.0.1:56129/solr
[junit4:junit4]   2> 1686 T709 oasc.ZkController.checkChrootPath zkHost includes chroot
[junit4:junit4]   2> 1686 T709 oaz.ZooKeeper.<init> Initiating client connection, connectString=127.0.0.1:56129 sessionTimeout=60000 watcher=org.apache.solr.common.cloud.ConnectionManager@1df62fc
[junit4:junit4]   2> 1687 T709 oascc.ConnectionManager.waitForConnected Waiting for client to connect to ZooKeeper
[junit4:junit4]   2> 1687 T758 oaz.ClientCnxn$SendThread.logStartConnect Opening socket connection to server localhost.localdomain/127.0.0.1:56129. Will not attempt to authenticate using SASL (access denied ("javax.security.auth.AuthPermission" "getLoginConfiguration"))
[junit4:junit4]   2> 1688 T758 oaz.ClientCnxn$SendThread.primeConnection Socket connection established to localhost.localdomain/127.0.0.1:56129, initiating session
[junit4:junit4]   2> 1688 T711 oazs.NIOServerCnxnFactory.run Accepted socket connection from /127.0.0.1:51441
[junit4:junit4]   2> 1688 T711 oazs.ZooKeeperServer.processConnectRequest Client attempting to establish new session at /127.0.0.1:51441
[junit4:junit4]   2> 1689 T713 oazs.ZooKeeperServer.finishSessionInit Established session 0x13d43a838b20007 with negotiated timeout 20000 for client /127.0.0.1:51441
[junit4:junit4]   2> 1689 T758 oaz.ClientCnxn$SendThread.onConnected Session establishment complete on server localhost.localdomain/127.0.0.1:56129, sessionid = 0x13d43a838b20007, negotiated timeout = 20000
[junit4:junit4]   2> 1689 T759 oascc.ConnectionManager.process Watcher org.apache.solr.common.cloud.ConnectionManager@1df62fc name:ZooKeeperConnection Watcher:127.0.0.1:56129 got event WatchedEvent state:SyncConnected type:None path:null path:null type:None
[junit4:junit4]   2> 1690 T709 oascc.ConnectionManager.waitForConnected Client is connected to ZooKeeper
[junit4:junit4]   2> 1690 T714 oazs.PrepRequestProcessor.pRequest2Txn Processed session termination for sessionid: 0x13d43a838b20007
[junit4:junit4]   2> 1691 T759 oaz.ClientCnxn$EventThread.run EventThread shut down
[junit4:junit4]   2> 1691 T711 oazs.NIOServerCnxn.closeSock Closed socket connection for client /127.0.0.1:51441 which had sessionid 0x13d43a838b20007
[junit4:junit4]   2> 1691 T709 oaz.ZooKeeper.close Session: 0x13d43a838b20007 closed
[junit4:junit4]   2> 1691 T709 oascsi.HttpClientUtil.createClient Creating new http client, config:maxConnections=500&maxConnectionsPerHost=16&socketTimeout=120000&connTimeout=15000
[junit4:junit4]   2> 1694 T709 oaz.ZooKeeper.<init> Initiating client connection, connectString=127.0.0.1:56129/solr sessionTimeout=30000 watcher=org.apache.solr.common.cloud.ConnectionManager@1e98260
[junit4:junit4]   2> 1695 T760 oaz.ClientCnxn$SendThread.logStartConnect Opening socket connection to server localhost.localdomain/127.0.0.1:56129. Will not attempt to authenticate using SASL (access denied ("javax.security.auth.AuthPermission" "getLoginConfiguration"))
[junit4:junit4]   2> 1695 T709 oascc.ConnectionManager.waitForConnected Waiting for client to connect to ZooKeeper
[junit4:junit4]   2> 1695 T760 oaz.ClientCnxn$SendThread.primeConnection Socket connection established to localhost.localdomain/127.0.0.1:56129, initiating session
[junit4:junit4]   2> 1695 T711 oazs.NIOServerCnxnFactory.run Accepted socket connection from /127.0.0.1:51442
[junit4:junit4]   2> 1695 T711 oazs.ZooKeeperServer.processConnectRequest Client attempting to establish new session at /127.0.0.1:51442
[junit4:junit4]   2> 1696 T713 oazs.ZooKeeperServer.finishSessionInit Established session 0x13d43a838b20008 with negotiated timeout 20000 for client /127.0.0.1:51442
[junit4:junit4]   2> 1696 T760 oaz.ClientCnxn$SendThread.onConnected Session establishment complete on server localhost.localdomain/127.0.0.1:56129, sessionid = 0x13d43a838b20008, negotiated timeout = 20000
[junit4:junit4]   2> 1696 T761 oascc.ConnectionManager.process Watcher org.apache.solr.common.cloud.ConnectionManager@1e98260 name:ZooKeeperConnection Watcher:127.0.0.1:56129/solr got event WatchedEvent state:SyncConnected type:None path:null path:null type:None
[junit4:junit4]   2> 1696 T709 oascc.ConnectionManager.waitForConnected Client is connected to ZooKeeper
[junit4:junit4]   2> 1697 T714 oazs.PrepRequestProcessor.pRequest Got user-level KeeperException when processing sessionid:0x13d43a838b20008 type:create cxid:0x1 zxid:0x36 txntype:-1 reqpath:n/a Error Path:/solr/overseer Error:KeeperErrorCode = NodeExists for /solr/overseer
[junit4:junit4]   2> 1698 T714 oazs.PrepRequestProcessor.pRequest Got user-level KeeperException when processing sessionid:0x13d43a838b20008 type:create cxid:0x2 zxid:0x37 txntype:-1 reqpath:n/a Error Path:/solr/overseer Error:KeeperErrorCode = NodeExists for /solr/overseer
[junit4:junit4]   2> 1699 T709 oascc.ZkStateReader.createClusterStateWatchersAndUpdate Updating cluster state from ZooKeeper... 
[junit4:junit4]   2> 2701 T709 oasc.ZkController.createEphemeralLiveNode Register node as live in ZooKeeper:/live_nodes/127.0.0.1:47942__%2Fpd
[junit4:junit4]   2> 2702 T714 oazs.PrepRequestProcessor.pRequest Got user-level KeeperException when processing sessionid:0x13d43a838b20008 type:delete cxid:0xb zxid:0x38 txntype:-1 reqpath:n/a Error Path:/solr/live_nodes/127.0.0.1:47942__%2Fpd Error:KeeperErrorCode = NoNode for /solr/live_nodes/127.0.0.1:47942__%2Fpd
[junit4:junit4]   2> 2703 T709 oascc.SolrZkClient.makePath makePath: /live_nodes/127.0.0.1:47942__%2Fpd
[junit4:junit4]   2> 2708 T748 oascc.ZkStateReader$3.process Updating live nodes... (3)
[junit4:junit4]   2> 2708 T735 oascc.ZkStateReader$3.process Updating live nodes... (3)
[junit4:junit4]   2> 2708 T731 oascc.ZkStateReader$3.process Updating live nodes... (3)
[junit4:junit4]   2> 2708 T761 oascc.ZkStateReader$3.process Updating live nodes... (3)
[junit4:junit4]   2> 2717 T709 oass.SolrDispatchFilter.init user.dir=/mnt/ssd/jenkins/workspace/Lucene-Solr-4.x-Linux/solr/build/solr-core/test/J0
[junit4:junit4]   2> 2717 T709 oass.SolrDispatchFilter.init SolrDispatchFilter.init() done
[junit4:junit4]   2> 2718 T709 oascsi.HttpClientUtil.createClient Creating new http client, config:maxConnections=128&maxConnectionsPerHost=32&followRedirects=false
[junit4:junit4]   2> 2799 T709 oejs.Server.doStart jetty-8.1.8.v20121106
[junit4:junit4]   2> 2802 T709 oejs.AbstractConnector.doStart Started SelectChannelConnector@127.0.0.1:51197
[junit4:junit4]   2> 2802 T709 oass.SolrDispatchFilter.init SolrDispatchFilter.init()
[junit4:junit4]   2> 2803 T709 oasc.SolrResourceLoader.locateSolrHome JNDI not configured for solr (NoInitialContextEx)
[junit4:junit4]   2> 2803 T709 oasc.SolrResourceLoader.locateSolrHome using system property solr.solr.home: /mnt/ssd/jenkins/workspace/Lucene-Solr-4.x-Linux/solr/build/solr-core/test/J0/./org.apache.solr.cloud.UnloadDistributedZkTest-jetty3-1362639733581
[junit4:junit4]   2> 2804 T709 oasc.CoreContainer$Initializer.initialize looking for solr.xml: /mnt/ssd/jenkins/workspace/Lucene-Solr-4.x-Linux/solr/build/solr-core/test/J0/./org.apache.solr.cloud.UnloadDistributedZkTest-jetty3-1362639733581/solr.xml
[junit4:junit4]   2> 2804 T709 oasc.CoreContainer.<init> New CoreContainer 7921668
[junit4:junit4]   2> 2805 T709 oasc.CoreContainer.load Loading CoreContainer using Solr Home: '/mnt/ssd/jenkins/workspace/Lucene-Solr-4.x-Linux/solr/build/solr-core/test/J0/./org.apache.solr.cloud.UnloadDistributedZkTest-jetty3-1362639733581/'
[junit4:junit4]   2> 2805 T709 oasc.SolrResourceLoader.<init> new SolrResourceLoader for directory: '/mnt/ssd/jenkins/workspace/Lucene-Solr-4.x-Linux/solr/build/solr-core/test/J0/./org.apache.solr.cloud.UnloadDistributedZkTest-jetty3-1362639733581/'
[junit4:junit4]   2> 2833 T709 oashc.HttpShardHandlerFactory.getParameter Setting socketTimeout to: 120000
[junit4:junit4]   2> 2834 T709 oashc.HttpShardHandlerFactory.getParameter Setting urlScheme to: http://
[junit4:junit4]   2> 2834 T709 oashc.HttpShardHandlerFactory.getParameter Setting connTimeout to: 15000
[junit4:junit4]   2> 2834 T709 oashc.HttpShardHandlerFactory.getParameter Setting maxConnectionsPerHost to: 20
[junit4:junit4]   2> 2835 T709 oashc.HttpShardHandlerFactory.getParameter Setting corePoolSize to: 0
[junit4:junit4]   2> 2835 T709 oashc.HttpShardHandlerFactory.getParameter Setting maximumPoolSize to: 2147483647
[junit4:junit4]   2> 2835 T709 oashc.HttpShardHandlerFactory.getParameter Setting maxThreadIdleTime to: 5
[junit4:junit4]   2> 2836 T709 oashc.HttpShardHandlerFactory.getParameter Setting sizeOfQueue to: -1
[junit4:junit4]   2> 2836 T709 oashc.HttpShardHandlerFactory.getParameter Setting fairnessPolicy to: false
[junit4:junit4]   2> 2836 T709 oascsi.HttpClientUtil.createClient Creating new http client, config:maxConnectionsPerHost=20&maxConnections=10000&socketTimeout=120000&connTimeout=15000&retry=false
[junit4:junit4]   2> 2843 T709 oasc.CoreContainer.load Registering Log Listener
[junit4:junit4]   2> 2854 T709 oasc.CoreContainer.initZooKeeper Zookeeper client=127.0.0.1:56129/solr
[junit4:junit4]   2> 2854 T709 oasc.ZkController.checkChrootPath zkHost includes chroot
[junit4:junit4]   2> 2854 T709 oaz.ZooKeeper.<init> Initiating client connection, connectString=127.0.0.1:56129 sessionTimeout=60000 watcher=org.apache.solr.common.cloud.ConnectionManager@1e53cdd
[junit4:junit4]   2> 2855 T709 oascc.ConnectionManager.waitForConnected Waiting for client to connect to ZooKeeper
[junit4:junit4]   2> 2855 T771 oaz.ClientCnxn$SendThread.logStartConnect Opening socket connection to server localhost.localdomain/127.0.0.1:56129. Will not attempt to authenticate using SASL (access denied ("javax.security.auth.AuthPermission" "getLoginConfiguration"))
[junit4:junit4]   2> 2856

[...truncated too long message...]

 1>         
[junit4:junit4]   1>           "IMPORTANT NOTE": "In order for tests to work, this data must be kept in sync with ./currency.xml",
[junit4:junit4]   1>         
[junit4:junit4]   1>         
[junit4:junit4]   1>           "base": "USD",
[junit4:junit4]   1>           "rates": {
[junit4:junit4]   1>             "USD": 1,
[junit4:junit4]   1>             "JPY": 81.29,
[junit4:junit4]   1>             "EUR": 2.5,
[junit4:junit4]   1>             "GBP": 0.5,
[junit4:junit4]   1>             "MXN": 2.0
[junit4:junit4]   1>           }
[junit4:junit4]   1>         }
[junit4:junit4]   1>         
[junit4:junit4]   1>     /solr/configs/conf1/old_synonyms.txt (0)
[junit4:junit4]   1>     DATA: ...supressed...
[junit4:junit4]   1> 
[junit4:junit4]   2> NOTE: reproduce with: ant test  -Dtestcase=UnloadDistributedZkTest -Dtests.method=testDistribSearch -Dtests.seed=E966CB0630F145B1 -Dtests.multiplier=3 -Dtests.slow=true -Dtests.locale=in -Dtests.timezone=America/Cuiaba -Dtests.file.encoding=ISO-8859-1
[junit4:junit4] FAILURE  137s J0 | UnloadDistributedZkTest.testDistribSearch <<<
[junit4:junit4]    > Throwable #1: java.lang.AssertionError: Still found shard
[junit4:junit4]    > 	at __randomizedtesting.SeedInfo.seed([E966CB0630F145B1:6880451E47AE258D]:0)
[junit4:junit4]    > 	at org.junit.Assert.fail(Assert.java:93)
[junit4:junit4]    > 	at org.apache.solr.cloud.UnloadDistributedZkTest.testUnloadShardAndCollection(UnloadDistributedZkTest.java:124)
[junit4:junit4]    > 	at org.apache.solr.cloud.UnloadDistributedZkTest.doTest(UnloadDistributedZkTest.java:77)
[junit4:junit4]    > 	at org.apache.solr.BaseDistributedSearchTestCase.testDistribSearch(BaseDistributedSearchTestCase.java:806)
[junit4:junit4]    > 	at sun.reflect.NativeMethodAccessorImpl.invoke0(Native Method)
[junit4:junit4]    > 	at sun.reflect.NativeMethodAccessorImpl.invoke(NativeMethodAccessorImpl.java:57)
[junit4:junit4]    > 	at sun.reflect.DelegatingMethodAccessorImpl.invoke(DelegatingMethodAccessorImpl.java:43)
[junit4:junit4]    > 	at java.lang.reflect.Method.invoke(Method.java:487)
[junit4:junit4]    > 	at com.carrotsearch.randomizedtesting.RandomizedRunner.invoke(RandomizedRunner.java:1559)
[junit4:junit4]    > 	at com.carrotsearch.randomizedtesting.RandomizedRunner.access$600(RandomizedRunner.java:79)
[junit4:junit4]    > 	at com.carrotsearch.randomizedtesting.RandomizedRunner$6.evaluate(RandomizedRunner.java:737)
[junit4:junit4]    > 	at com.carrotsearch.randomizedtesting.RandomizedRunner$7.evaluate(RandomizedRunner.java:773)
[junit4:junit4]    > 	at com.carrotsearch.randomizedtesting.RandomizedRunner$8.evaluate(RandomizedRunner.java:787)
[junit4:junit4]    > 	at com.carrotsearch.randomizedtesting.rules.SystemPropertiesRestoreRule$1.evaluate(SystemPropertiesRestoreRule.java:53)
[junit4:junit4]    > 	at org.apache.lucene.util.TestRuleSetupTeardownChained$1.evaluate(TestRuleSetupTeardownChained.java:50)
[junit4:junit4]    > 	at org.apache.lucene.util.TestRuleFieldCacheSanity$1.evaluate(TestRuleFieldCacheSanity.java:51)
[junit4:junit4]    > 	at org.apache.lucene.util.AbstractBeforeAfterRule$1.evaluate(AbstractBeforeAfterRule.java:46)
[junit4:junit4]    > 	at com.carrotsearch.randomizedtesting.rules.SystemPropertiesInvariantRule$1.evaluate(SystemPropertiesInvariantRule.java:55)
[junit4:junit4]    > 	at org.apache.lucene.util.TestRuleThreadAndTestName$1.evaluate(TestRuleThreadAndTestName.java:49)
[junit4:junit4]    > 	at org.apache.lucene.util.TestRuleIgnoreAfterMaxFailures$1.evaluate(TestRuleIgnoreAfterMaxFailures.java:70)
[junit4:junit4]    > 	at org.apache.lucene.util.TestRuleMarkFailure$1.evaluate(TestRuleMarkFailure.java:48)
[junit4:junit4]    > 	at com.carrotsearch.randomizedtesting.rules.StatementAdapter.evaluate(StatementAdapter.java:36)
[junit4:junit4]    > 	at com.carrotsearch.randomizedtesting.ThreadLeakControl$StatementRunner.run(ThreadLeakControl.java:358)
[junit4:junit4]    > 	at com.carrotsearch.randomizedtesting.ThreadLeakControl.forkTimeoutingTask(ThreadLeakControl.java:782)
[junit4:junit4]    > 	at com.carrotsearch.randomizedtesting.ThreadLeakControl$3.evaluate(ThreadLeakControl.java:442)
[junit4:junit4]    > 	at com.carrotsearch.randomizedtesting.RandomizedRunner.runSingleTest(RandomizedRunner.java:746)
[junit4:junit4]    > 	at com.carrotsearch.randomizedtesting.RandomizedRunner$3.evaluate(RandomizedRunner.java:648)
[junit4:junit4]    > 	at com.carrotsearch.randomizedtesting.RandomizedRunner$4.evaluate(RandomizedRunner.java:682)
[junit4:junit4]    > 	at com.carrotsearch.randomizedtesting.RandomizedRunner$5.evaluate(RandomizedRunner.java:693)
[junit4:junit4]    > 	at com.carrotsearch.randomizedtesting.rules.StatementAdapter.evaluate(StatementAdapter.java:36)
[junit4:junit4]    > 	at com.carrotsearch.randomizedtesting.rules.SystemPropertiesRestoreRule$1.evaluate(SystemPropertiesRestoreRule.java:53)
[junit4:junit4]    > 	at org.apache.lucene.util.AbstractBeforeAfterRule$1.evaluate(AbstractBeforeAfterRule.java:46)
[junit4:junit4]    > 	at org.apache.lucene.util.TestRuleStoreClassName$1.evaluate(TestRuleStoreClassName.java:42)
[junit4:junit4]    > 	at com.carrotsearch.randomizedtesting.rules.SystemPropertiesInvariantRule$1.evaluate(SystemPropertiesInvariantRule.java:55)
[junit4:junit4]    > 	at com.carrotsearch.randomizedtesting.rules.NoShadowingOrOverridesOnMethodsRule$1.evaluate(NoShadowingOrOverridesOnMethodsRule.java:39)
[junit4:junit4]    > 	at com.carrotsearch.randomizedtesting.rules.NoShadowingOrOverridesOnMethodsRule$1.evaluate(NoShadowingOrOverridesOnMethodsRule.java:39)
[junit4:junit4]    > 	at com.carrotsearch.randomizedtesting.rules.StatementAdapter.evaluate(StatementAdapter.java:36)
[junit4:junit4]    > 	at org.apache.lucene.util.TestRuleAssertionsRequired$1.evaluate(TestRuleAssertionsRequired.java:43)
[junit4:junit4]    > 	at org.apache.lucene.util.TestRuleMarkFailure$1.evaluate(TestRuleMarkFailure.java:48)
[junit4:junit4]    > 	at org.apache.lucene.util.TestRuleIgnoreAfterMaxFailures$1.evaluate(TestRuleIgnoreAfterMaxFailures.java:70)
[junit4:junit4]    > 	at org.apache.lucene.util.TestRuleIgnoreTestSuites$1.evaluate(TestRuleIgnoreTestSuites.java:55)
[junit4:junit4]    > 	at com.carrotsearch.randomizedtesting.rules.StatementAdapter.evaluate(StatementAdapter.java:36)
[junit4:junit4]    > 	at com.carrotsearch.randomizedtesting.ThreadLeakControl$StatementRunner.run(ThreadLeakControl.java:358)
[junit4:junit4]    > 	at java.lang.Thread.run(Thread.java:722)
[junit4:junit4]   2> 136637 T709 oas.SolrTestCaseJ4.deleteCore ###deleteCore
[junit4:junit4]   2> 136647 T708 ccr.ThreadLeakControl.checkThreadLeaks WARNING Will linger awaiting termination of 2 leaked thread(s).
[junit4:junit4]   2> 137142 T712 oazs.SessionTrackerImpl.run SessionTrackerImpl exited loop!
[junit4:junit4]   2> NOTE: test params are: codec=Lucene42: {range_facet_l=PostingsFormat(name=MockRandom), intDefault=PostingsFormat(name=Memory doPackFST= true), id=MockFixedIntBlock(blockSize=1130), a_t=PostingsFormat(name=MockRandom), range_facet_sl=MockFixedIntBlock(blockSize=1130), _version_=PostingsFormat(name=Memory doPackFST= true), timestamp=PostingsFormat(name=MockRandom), text=PostingsFormat(name=Direct), multiDefault=PostingsFormat(name=MockRandom), range_facet_si=PostingsFormat(name=MockRandom), other_tl1=PostingsFormat(name=Memory doPackFST= true), a_si=PostingsFormat(name=Memory doPackFST= true)}, docValues:{}, sim=RandomSimilarityProvider(queryNorm=false,coord=crazy): {}, locale=in, timezone=America/Cuiaba
[junit4:junit4]   2> NOTE: Linux 3.2.0-38-generic i386/Oracle Corporation 1.8.0-ea (32-bit)/cpus=8,threads=1,free=33743320,total=115163136
[junit4:junit4]   2> NOTE: All tests run in this JVM: [JsonLoaderTest, QueryEqualityTest, DirectSolrConnectionTest, CurrencyFieldOpenExchangeTest, PathHierarchyTokenizerFactoryTest, ZkCLITest, TestSearchPerf, ShowFileRequestHandlerTest, SolrIndexSplitterTest, ChaosMonkeyNothingIsSafeTest, ScriptEngineTest, LegacyHTMLStripCharFilterTest, JSONWriterTest, TestRemoteStreaming, BasicZkTest, SearchHandlerTest, SystemInfoHandlerTest, CSVRequestHandlerTest, PreAnalyzedFieldTest, TestFoldingMultitermQuery, SuggesterTSTTest, FieldMutatingUpdateProcessorTest, ResourceLoaderTest, TestCoreContainer, TestHashPartitioner, TestIndexSearcher, SynonymTokenizerTest, RecoveryZkTest, SyncSliceTest, TestSolrCoreProperties, SolrPluginUtilsTest, XmlUpdateRequestHandlerTest, PluginInfoTest, TestQueryUtils, TestLFUCache, TestLMDirichletSimilarityFactory, DistributedTermsComponentTest, TestSolrIndexConfig, TestFunctionQuery, UUIDFieldTest, TestSolrDeletionPolicy1, PrimUtilsTest, TestFieldTypeCollectionResource, ConvertedLegacyTest, UnloadDistributedZkTest]
[junit4:junit4] Completed on J0 in 137.18s, 1 test, 1 failure <<< FAILURES!

[...truncated 538 lines...]
BUILD FAILED
/mnt/ssd/jenkins/workspace/Lucene-Solr-4.x-Linux/build.xml:381: The following error occurred while executing this line:
/mnt/ssd/jenkins/workspace/Lucene-Solr-4.x-Linux/build.xml:361: The following error occurred while executing this line:
/mnt/ssd/jenkins/workspace/Lucene-Solr-4.x-Linux/build.xml:39: The following error occurred while executing this line:
/mnt/ssd/jenkins/workspace/Lucene-Solr-4.x-Linux/solr/build.xml:183: The following error occurred while executing this line:
/mnt/ssd/jenkins/workspace/Lucene-Solr-4.x-Linux/solr/common-build.xml:449: The following error occurred while executing this line:
/mnt/ssd/jenkins/workspace/Lucene-Solr-4.x-Linux/lucene/common-build.xml:1213: The following error occurred while executing this line:
/mnt/ssd/jenkins/workspace/Lucene-Solr-4.x-Linux/lucene/common-build.xml:877: There were test failures: 268 suites, 1128 tests, 2 errors, 1 failure, 9 ignored (3 assumptions)

Total time: 54 minutes 28 seconds
Build step 'Invoke Ant' marked build as failure
Archiving artifacts
Recording test results
Description set: Java: 32bit/jdk1.8.0-ea-b79 -client -XX:+UseSerialGC
Email was triggered for: Failure
Sending email for trigger: Failure



Mime
View raw message