lucene-dev mailing list archives

Site index · List index
Message view « Date » · « Thread »
Top « Date » · « Thread »
From Apache Jenkins Server <jenk...@builds.apache.org>
Subject [JENKINS] Lucene-Solr-Tests-4.x-Java6 - Build # 1396 - Failure
Date Wed, 06 Mar 2013 12:40:13 GMT
Build: https://builds.apache.org/job/Lucene-Solr-Tests-4.x-Java6/1396/

1 tests failed.
REGRESSION:  org.apache.solr.cloud.SyncSliceTest.testDistribSearch

Error Message:
Test Setup Failure: shard1 should have just been set up to be inconsistent - but it's still consistent. Leader:http://127.0.0.1:15202/collection1skip list:[CloudJettyRunner [url=http://127.0.0.1:15210/collection1], CloudJettyRunner [url=http://127.0.0.1:15210/collection1]]

Stack Trace:
java.lang.AssertionError: Test Setup Failure: shard1 should have just been set up to be inconsistent - but it's still consistent. Leader:http://127.0.0.1:15202/collection1skip list:[CloudJettyRunner [url=http://127.0.0.1:15210/collection1], CloudJettyRunner [url=http://127.0.0.1:15210/collection1]]
	at __randomizedtesting.SeedInfo.seed([F18A5E475F35992:8EFE2BFC02AC39AE]:0)
	at org.junit.Assert.fail(Assert.java:93)
	at org.junit.Assert.assertTrue(Assert.java:43)
	at org.junit.Assert.assertNotNull(Assert.java:526)
	at org.apache.solr.cloud.SyncSliceTest.doTest(SyncSliceTest.java:212)
	at org.apache.solr.BaseDistributedSearchTestCase.testDistribSearch(BaseDistributedSearchTestCase.java:806)
	at sun.reflect.NativeMethodAccessorImpl.invoke0(Native Method)
	at sun.reflect.NativeMethodAccessorImpl.invoke(NativeMethodAccessorImpl.java:57)
	at sun.reflect.DelegatingMethodAccessorImpl.invoke(DelegatingMethodAccessorImpl.java:43)
	at java.lang.reflect.Method.invoke(Method.java:616)
	at com.carrotsearch.randomizedtesting.RandomizedRunner.invoke(RandomizedRunner.java:1559)
	at com.carrotsearch.randomizedtesting.RandomizedRunner.access$600(RandomizedRunner.java:79)
	at com.carrotsearch.randomizedtesting.RandomizedRunner$6.evaluate(RandomizedRunner.java:737)
	at com.carrotsearch.randomizedtesting.RandomizedRunner$7.evaluate(RandomizedRunner.java:773)
	at com.carrotsearch.randomizedtesting.RandomizedRunner$8.evaluate(RandomizedRunner.java:787)
	at com.carrotsearch.randomizedtesting.rules.SystemPropertiesRestoreRule$1.evaluate(SystemPropertiesRestoreRule.java:53)
	at org.apache.lucene.util.TestRuleSetupTeardownChained$1.evaluate(TestRuleSetupTeardownChained.java:50)
	at org.apache.lucene.util.TestRuleFieldCacheSanity$1.evaluate(TestRuleFieldCacheSanity.java:51)
	at org.apache.lucene.util.AbstractBeforeAfterRule$1.evaluate(AbstractBeforeAfterRule.java:46)
	at com.carrotsearch.randomizedtesting.rules.SystemPropertiesInvariantRule$1.evaluate(SystemPropertiesInvariantRule.java:55)
	at org.apache.lucene.util.TestRuleThreadAndTestName$1.evaluate(TestRuleThreadAndTestName.java:49)
	at org.apache.lucene.util.TestRuleIgnoreAfterMaxFailures$1.evaluate(TestRuleIgnoreAfterMaxFailures.java:70)
	at org.apache.lucene.util.TestRuleMarkFailure$1.evaluate(TestRuleMarkFailure.java:48)
	at com.carrotsearch.randomizedtesting.rules.StatementAdapter.evaluate(StatementAdapter.java:36)
	at com.carrotsearch.randomizedtesting.ThreadLeakControl$StatementRunner.run(ThreadLeakControl.java:358)
	at com.carrotsearch.randomizedtesting.ThreadLeakControl.forkTimeoutingTask(ThreadLeakControl.java:782)
	at com.carrotsearch.randomizedtesting.ThreadLeakControl$3.evaluate(ThreadLeakControl.java:442)
	at com.carrotsearch.randomizedtesting.RandomizedRunner.runSingleTest(RandomizedRunner.java:746)
	at com.carrotsearch.randomizedtesting.RandomizedRunner$3.evaluate(RandomizedRunner.java:648)
	at com.carrotsearch.randomizedtesting.RandomizedRunner$4.evaluate(RandomizedRunner.java:682)
	at com.carrotsearch.randomizedtesting.RandomizedRunner$5.evaluate(RandomizedRunner.java:693)
	at com.carrotsearch.randomizedtesting.rules.StatementAdapter.evaluate(StatementAdapter.java:36)
	at com.carrotsearch.randomizedtesting.rules.SystemPropertiesRestoreRule$1.evaluate(SystemPropertiesRestoreRule.java:53)
	at org.apache.lucene.util.AbstractBeforeAfterRule$1.evaluate(AbstractBeforeAfterRule.java:46)
	at org.apache.lucene.util.TestRuleStoreClassName$1.evaluate(TestRuleStoreClassName.java:42)
	at com.carrotsearch.randomizedtesting.rules.SystemPropertiesInvariantRule$1.evaluate(SystemPropertiesInvariantRule.java:55)
	at com.carrotsearch.randomizedtesting.rules.NoShadowingOrOverridesOnMethodsRule$1.evaluate(NoShadowingOrOverridesOnMethodsRule.java:39)
	at com.carrotsearch.randomizedtesting.rules.NoShadowingOrOverridesOnMethodsRule$1.evaluate(NoShadowingOrOverridesOnMethodsRule.java:39)
	at com.carrotsearch.randomizedtesting.rules.StatementAdapter.evaluate(StatementAdapter.java:36)
	at org.apache.lucene.util.TestRuleAssertionsRequired$1.evaluate(TestRuleAssertionsRequired.java:43)
	at org.apache.lucene.util.TestRuleMarkFailure$1.evaluate(TestRuleMarkFailure.java:48)
	at org.apache.lucene.util.TestRuleIgnoreAfterMaxFailures$1.evaluate(TestRuleIgnoreAfterMaxFailures.java:70)
	at org.apache.lucene.util.TestRuleIgnoreTestSuites$1.evaluate(TestRuleIgnoreTestSuites.java:55)
	at com.carrotsearch.randomizedtesting.rules.StatementAdapter.evaluate(StatementAdapter.java:36)
	at com.carrotsearch.randomizedtesting.ThreadLeakControl$StatementRunner.run(ThreadLeakControl.java:358)
	at java.lang.Thread.run(Thread.java:679)




Build Log:
[...truncated 8324 lines...]
[junit4:junit4] Suite: org.apache.solr.cloud.SyncSliceTest
[junit4:junit4]   2> 0 T68 oas.BaseDistributedSearchTestCase.initHostContext Setting hostContext system property: /
[junit4:junit4]   2> 9 T68 oas.SolrTestCaseJ4.setUp ###Starting testDistribSearch
[junit4:junit4]   2> Creating dataDir: /usr/home/hudson/hudson-slave/workspace/Lucene-Solr-Tests-4.x-Java6/solr/build/solr-core/test/J0/./solrtest-SyncSliceTest-1362572444027
[junit4:junit4]   2> 21 T68 oasc.ZkTestServer.run STARTING ZK TEST SERVER
[junit4:junit4]   2> 30 T69 oasc.ZkTestServer$ZKServerMain.runFromConfig Starting server
[junit4:junit4]   2> 117 T69 oaz.Environment.logEnv Server environment:zookeeper.version=3.4.5-1392090, built on 09/30/2012 17:52 GMT
[junit4:junit4]   2> 117 T69 oaz.Environment.logEnv Server environment:host.name=lucene.zones.apache.org
[junit4:junit4]   2> 118 T69 oaz.Environment.logEnv Server environment:java.version=1.6.0_32
[junit4:junit4]   2> 118 T69 oaz.Environment.logEnv Server environment:java.vendor=Sun Microsystems Inc.
[junit4:junit4]   2> 118 T69 oaz.Environment.logEnv Server environment:java.home=/usr/local/openjdk6/jre
[junit4:junit4]   2> 118 T69 oaz.Environment.logEnv Server environment:java.class.path=/usr/home/hudson/hudson-slave/workspace/Lucene-Solr-Tests-4.x-Java6/solr/build/solr-core/classes/test:/usr/home/hudson/hudson-slave/workspace/Lucene-Solr-Tests-4.x-Java6/solr/build/solr-test-framework/classes/java:/usr/home/hudson/hudson-slave/workspace/Lucene-Solr-Tests-4.x-Java6/solr/build/solr-core/test-files:/usr/home/hudson/hudson-slave/workspace/Lucene-Solr-Tests-4.x-Java6/lucene/build/test-framework/classes/java:/usr/home/hudson/hudson-slave/workspace/Lucene-Solr-Tests-4.x-Java6/lucene/build/codecs/classes/java:/usr/home/hudson/hudson-slave/workspace/Lucene-Solr-Tests-4.x-Java6/solr/build/solr-solrj/classes/java:/usr/home/hudson/hudson-slave/workspace/Lucene-Solr-Tests-4.x-Java6/solr/build/solr-core/classes/java:/usr/home/hudson/hudson-slave/workspace/Lucene-Solr-Tests-4.x-Java6/lucene/build/analysis/common/lucene-analyzers-common-4.2-SNAPSHOT.jar:/usr/home/hudson/hudson-slave/workspace/Lucene-Solr-Tests-4.x-Java6/lucene/build/analysis/kuromoji/lucene-analyzers-kuromoji-4.2-SNAPSHOT.jar:/usr/home/hudson/hudson-slave/workspace/Lucene-Solr-Tests-4.x-Java6/lucene/build/analysis/phonetic/lucene-analyzers-phonetic-4.2-SNAPSHOT.jar:/usr/home/hudson/hudson-slave/workspace/Lucene-Solr-Tests-4.x-Java6/lucene/build/codecs/lucene-codecs-4.2-SNAPSHOT.jar:/usr/home/hudson/hudson-slave/workspace/Lucene-Solr-Tests-4.x-Java6/lucene/build/highlighter/lucene-highlighter-4.2-SNAPSHOT.jar:/usr/home/hudson/hudson-slave/workspace/Lucene-Solr-Tests-4.x-Java6/lucene/build/memory/lucene-memory-4.2-SNAPSHOT.jar:/usr/home/hudson/hudson-slave/workspace/Lucene-Solr-Tests-4.x-Java6/lucene/build/misc/lucene-misc-4.2-SNAPSHOT.jar:/usr/home/hudson/hudson-slave/workspace/Lucene-Solr-Tests-4.x-Java6/lucene/build/spatial/lucene-spatial-4.2-SNAPSHOT.jar:/usr/home/hudson/hudson-slave/workspace/Lucene-Solr-Tests-4.x-Java6/lucene/build/suggest/lucene-suggest-4.2-SNAPSHOT.jar:/usr/home/hudson/hudson-slave/workspace/Lucene-Solr-Tests-4.x-Java6/lucene/build/grouping/lucene-grouping-4.2-SNAPSHOT.jar:/usr/home/hudson/hudson-slave/workspace/Lucene-Solr-Tests-4.x-Java6/lucene/build/queries/lucene-queries-4.2-SNAPSHOT.jar:/usr/home/hudson/hudson-slave/workspace/Lucene-Solr-Tests-4.x-Java6/lucene/build/queryparser/lucene-queryparser-4.2-SNAPSHOT.jar:/usr/home/hudson/hudson-slave/workspace/Lucene-Solr-Tests-4.x-Java6/solr/core/lib/cglib-nodep-2.2.jar:/usr/home/hudson/hudson-slave/workspace/Lucene-Solr-Tests-4.x-Java6/solr/core/lib/commons-cli-1.2.jar:/usr/home/hudson/hudson-slave/workspace/Lucene-Solr-Tests-4.x-Java6/solr/core/lib/commons-codec-1.7.jar:/usr/home/hudson/hudson-slave/workspace/Lucene-Solr-Tests-4.x-Java6/solr/core/lib/commons-fileupload-1.2.1.jar:/usr/home/hudson/hudson-slave/workspace/Lucene-Solr-Tests-4.x-Java6/solr/core/lib/commons-lang-2.6.jar:/usr/home/hudson/hudson-slave/workspace/Lucene-Solr-Tests-4.x-Java6/solr/core/lib/easymock-3.0.jar:/usr/home/hudson/hudson-slave/workspace/Lucene-Solr-Tests-4.x-Java6/solr/core/lib/guava-13.0.1.jar:/usr/home/hudson/hudson-slave/workspace/Lucene-Solr-Tests-4.x-Java6/solr/core/lib/javax.servlet-api-3.0.1.jar:/usr/home/hudson/hudson-slave/workspace/Lucene-Solr-Tests-4.x-Java6/solr/core/lib/objenesis-1.2.jar:/usr/home/hudson/hudson-slave/workspace/Lucene-Solr-Tests-4.x-Java6/solr/core/lib/org.restlet-2.1.1.jar:/usr/home/hudson/hudson-slave/workspace/Lucene-Solr-Tests-4.x-Java6/solr/core/lib/org.restlet.ext.servlet-2.1.1.jar:/usr/home/hudson/hudson-slave/workspace/Lucene-Solr-Tests-4.x-Java6/solr/core/lib/spatial4j-0.3.jar:/usr/home/hudson/hudson-slave/workspace/Lucene-Solr-Tests-4.x-Java6/solr/solrj/lib/commons-io-2.1.jar:/usr/home/hudson/hudson-slave/workspace/Lucene-Solr-Tests-4.x-Java6/solr/solrj/lib/httpclient-4.2.3.jar:/usr/home/hudson/hudson-slave/workspace/Lucene-Solr-Tests-4.x-Java6/solr/solrj/lib/httpcore-4.2.2.jar:/usr/home/hudson/hudson-slave/workspace/Lucene-Solr-Tests-4.x-Java6/solr/solrj/lib/httpmime-4.2.3.jar:/usr/home/hudson/hudson-slave/workspace/Lucene-Solr-Tests-4.x-Java6/solr/solrj/lib/jcl-over-slf4j-1.6.4.jar:/usr/home/hudson/hudson-slave/workspace/Lucene-Solr-Tests-4.x-Java6/solr/solrj/lib/slf4j-api-1.6.4.jar:/usr/home/hudson/hudson-slave/workspace/Lucene-Solr-Tests-4.x-Java6/solr/solrj/lib/slf4j-jdk14-1.6.4.jar:/usr/home/hudson/hudson-slave/workspace/Lucene-Solr-Tests-4.x-Java6/solr/solrj/lib/wstx-asl-3.2.7.jar:/usr/home/hudson/hudson-slave/workspace/Lucene-Solr-Tests-4.x-Java6/solr/solrj/lib/zookeeper-3.4.5.jar:/usr/home/hudson/hudson-slave/workspace/Lucene-Solr-Tests-4.x-Java6/solr/example/lib/jetty-continuation-8.1.8.v20121106.jar:/usr/home/hudson/hudson-slave/workspace/Lucene-Solr-Tests-4.x-Java6/solr/example/lib/jetty-deploy-8.1.8.v20121106.jar:/usr/home/hudson/hudson-slave/workspace/Lucene-Solr-Tests-4.x-Java6/solr/example/lib/jetty-http-8.1.8.v20121106.jar:/usr/home/hudson/hudson-slave/workspace/Lucene-Solr-Tests-4.x-Java6/solr/example/lib/jetty-io-8.1.8.v20121106.jar:/usr/home/hudson/hudson-slave/workspace/Lucene-Solr-Tests-4.x-Java6/solr/example/lib/jetty-jmx-8.1.8.v20121106.jar:/usr/home/hudson/hudson-slave/workspace/Lucene-Solr-Tests-4.x-Java6/solr/example/lib/jetty-security-8.1.8.v20121106.jar:/usr/home/hudson/hudson-slave/workspace/Lucene-Solr-Tests-4.x-Java6/solr/example/lib/jetty-server-8.1.8.v20121106.jar:/usr/home/hudson/hudson-slave/workspace/Lucene-Solr-Tests-4.x-Java6/solr/example/lib/jetty-servlet-8.1.8.v20121106.jar:/usr/home/hudson/hudson-slave/workspace/Lucene-Solr-Tests-4.x-Java6/solr/example/lib/jetty-util-8.1.8.v20121106.jar:/usr/home/hudson/hudson-slave/workspace/Lucene-Solr-Tests-4.x-Java6/solr/example/lib/jetty-webapp-8.1.8.v20121106.jar:/usr/home/hudson/hudson-slave/workspace/Lucene-Solr-Tests-4.x-Java6/solr/example/lib/jetty-xml-8.1.8.v20121106.jar:/usr/home/hudson/hudson-slave/workspace/Lucene-Solr-Tests-4.x-Java6/solr/example/lib/servlet-api-3.0.jar:/usr/home/hudson/hudson-slave/workspace/Lucene-Solr-Tests-4.x-Java6/solr/example/example-DIH/solr/db/lib/derby-10.9.1.0.jar:/usr/home/hudson/hudson-slave/workspace/Lucene-Solr-Tests-4.x-Java6/solr/example/example-DIH/solr/db/lib/hsqldb-1.8.0.10.jar:/usr/home/hudson/hudson-slave/workspace/Lucene-Solr-Tests-4.x-Java6/lucene/build/core/classes/java:/usr/home/hudson/hudson-slave/workspace/Lucene-Solr-Tests-4.x-Java6/lucene/test-framework/lib/junit-4.10.jar:/usr/home/hudson/hudson-slave/workspace/Lucene-Solr-Tests-4.x-Java6/lucene/test-framework/lib/randomizedtesting-runner-2.0.8.jar:/home/hudson/hudson-slave/tools/hudson.tasks.Ant_AntInstallation/ant-1.8.2/lib/ant-launcher.jar:/home/hudson/.ant/lib/ivy-2.2.0.jar:/home/hudson/hudson-slave/tools/hudson.tasks.Ant_AntInstallation/ant-1.8.2/lib/ant-commons-logging.jar:/home/hudson/hudson-slave/tools/hudson.tasks.Ant_AntInstallation/ant-1.8.2/lib/ant-apache-regexp.jar:/home/hudson/hudson-slave/tools/hudson.tasks.Ant_AntInstallation/ant-1.8.2/lib/ant-apache-oro.jar:/home/hudson/hudson-slave/tools/hudson.tasks.Ant_AntInstallation/ant-1.8.2/lib/ant-swing.jar:/home/hudson/hudson-slave/tools/hudson.tasks.Ant_AntInstallation/ant-1.8.2/lib/ant-jdepend.jar:/home/hudson/hudson-slave/tools/hudson.tasks.Ant_AntInstallation/ant-1.8.2/lib/ant-apache-xalan2.jar:/home/hudson/hudson-slave/tools/hudson.tasks.Ant_AntInstallation/ant-1.8.2/lib/ant-apache-bsf.jar:/home/hudson/hudson-slave/tools/hudson.tasks.Ant_AntInstallation/ant-1.8.2/lib/ant-junit4.jar:/home/hudson/hudson-slave/tools/hudson.tasks.Ant_AntInstallation/ant-1.8.2/lib/ant-commons-net.jar:/home/hudson/hudson-slave/tools/hudson.tasks.Ant_AntInstallation/ant-1.8.2/lib/ant-antlr.jar:/home/hudson/hudson-slave/tools/hudson.tasks.Ant_AntInstallation/ant-1.8.2/lib/ant-junit.jar:/home/hudson/hudson-slave/tools/hudson.tasks.Ant_AntInstallation/ant-1.8.2/lib/ant-jmf.jar:/home/hudson/hudson-slave/tools/hudson.tasks.Ant_AntInstallation/ant-1.8.2/lib/ant-netrexx.jar:/home/hudson/hudson-slave/tools/hudson.tasks.Ant_AntInstallation/ant-1.8.2/lib/ant-apache-log4j.jar:/home/hudson/hudson-slave/tools/hudson.tasks.Ant_AntInstallation/ant-1.8.2/lib/ant-apache-resolver.jar:/home/hudson/hudson-slave/tools/hudson.tasks.Ant_AntInstallation/ant-1.8.2/lib/ant.jar:/home/hudson/hudson-slave/tools/hudson.tasks.Ant_AntInstallation/ant-1.8.2/lib/ant-jsch.jar:/home/hudson/hudson-slave/tools/hudson.tasks.Ant_AntInstallation/ant-1.8.2/lib/ant-testutil.jar:/home/hudson/hudson-slave/tools/hudson.tasks.Ant_AntInstallation/ant-1.8.2/lib/ant-apache-bcel.jar:/home/hudson/hudson-slave/tools/hudson.tasks.Ant_AntInstallation/ant-1.8.2/lib/ant-jai.jar:/home/hudson/hudson-slave/tools/hudson.tasks.Ant_AntInstallation/ant-1.8.2/lib/ant-javamail.jar:/usr/local/openjdk6/lib/tools.jar:/home/hudson/.ivy2/cache/com.carrotsearch.randomizedtesting/junit4-ant/jars/junit4-ant-2.0.8.jar
[junit4:junit4]   2> 119 T69 oaz.Environment.logEnv Server environment:java.library.path=/usr/local/openjdk6/jre/lib/amd64/server:/usr/local/openjdk6/jre/lib/amd64:/usr/local/openjdk6/jre/../lib/amd64:/usr/java/packages/lib/amd64:/lib:/usr/lib:/usr/local/lib
[junit4:junit4]   2> 120 T69 oaz.Environment.logEnv Server environment:java.io.tmpdir=.
[junit4:junit4]   2> 120 T69 oaz.Environment.logEnv Server environment:java.compiler=<NA>
[junit4:junit4]   2> 120 T69 oaz.Environment.logEnv Server environment:os.name=FreeBSD
[junit4:junit4]   2> 120 T69 oaz.Environment.logEnv Server environment:os.arch=amd64
[junit4:junit4]   2> 120 T69 oaz.Environment.logEnv Server environment:os.version=9.0-RELEASE
[junit4:junit4]   2> 120 T69 oaz.Environment.logEnv Server environment:user.name=hudson
[junit4:junit4]   2> 121 T69 oaz.Environment.logEnv Server environment:user.home=/home/hudson
[junit4:junit4]   2> 121 T69 oaz.Environment.logEnv Server environment:user.dir=/usr/home/hudson/hudson-slave/workspace/Lucene-Solr-Tests-4.x-Java6/solr/build/solr-core/test/J0
[junit4:junit4]   2> 172 T69 oazs.ZooKeeperServer.setTickTime tickTime set to 1000
[junit4:junit4]   2> 172 T69 oazs.ZooKeeperServer.setMinSessionTimeout minSessionTimeout set to -1
[junit4:junit4]   2> 172 T69 oazs.ZooKeeperServer.setMaxSessionTimeout maxSessionTimeout set to -1
[junit4:junit4]   2> 180 T69 oazs.NIOServerCnxnFactory.configure binding to port 0.0.0.0/0.0.0.0:0
[junit4:junit4]   2> 231 T68 oasc.ZkTestServer.run start zk server on port:20857
[junit4:junit4]   2> 290 T69 oazsp.FileTxnSnapLog.save Snapshotting: 0x0 to /usr/home/hudson/hudson-slave/workspace/Lucene-Solr-Tests-4.x-Java6/solr/build/solr-core/test/J0/./org.apache.solr.cloud.SyncSliceTest-1362572444026/zookeeper/server1/data/version-2/snapshot.0
[junit4:junit4]   2> 385 T68 oaz.Environment.logEnv Client environment:zookeeper.version=3.4.5-1392090, built on 09/30/2012 17:52 GMT
[junit4:junit4]   2> 386 T68 oaz.Environment.logEnv Client environment:host.name=lucene.zones.apache.org
[junit4:junit4]   2> 386 T68 oaz.Environment.logEnv Client environment:java.version=1.6.0_32
[junit4:junit4]   2> 386 T68 oaz.Environment.logEnv Client environment:java.vendor=Sun Microsystems Inc.
[junit4:junit4]   2> 387 T68 oaz.Environment.logEnv Client environment:java.home=/usr/local/openjdk6/jre
[junit4:junit4]   2> 387 T68 oaz.Environment.logEnv Client environment:java.class.path=/usr/home/hudson/hudson-slave/workspace/Lucene-Solr-Tests-4.x-Java6/solr/build/solr-core/classes/test:/usr/home/hudson/hudson-slave/workspace/Lucene-Solr-Tests-4.x-Java6/solr/build/solr-test-framework/classes/java:/usr/home/hudson/hudson-slave/workspace/Lucene-Solr-Tests-4.x-Java6/solr/build/solr-core/test-files:/usr/home/hudson/hudson-slave/workspace/Lucene-Solr-Tests-4.x-Java6/lucene/build/test-framework/classes/java:/usr/home/hudson/hudson-slave/workspace/Lucene-Solr-Tests-4.x-Java6/lucene/build/codecs/classes/java:/usr/home/hudson/hudson-slave/workspace/Lucene-Solr-Tests-4.x-Java6/solr/build/solr-solrj/classes/java:/usr/home/hudson/hudson-slave/workspace/Lucene-Solr-Tests-4.x-Java6/solr/build/solr-core/classes/java:/usr/home/hudson/hudson-slave/workspace/Lucene-Solr-Tests-4.x-Java6/lucene/build/analysis/common/lucene-analyzers-common-4.2-SNAPSHOT.jar:/usr/home/hudson/hudson-slave/workspace/Lucene-Solr-Tests-4.x-Java6/lucene/build/analysis/kuromoji/lucene-analyzers-kuromoji-4.2-SNAPSHOT.jar:/usr/home/hudson/hudson-slave/workspace/Lucene-Solr-Tests-4.x-Java6/lucene/build/analysis/phonetic/lucene-analyzers-phonetic-4.2-SNAPSHOT.jar:/usr/home/hudson/hudson-slave/workspace/Lucene-Solr-Tests-4.x-Java6/lucene/build/codecs/lucene-codecs-4.2-SNAPSHOT.jar:/usr/home/hudson/hudson-slave/workspace/Lucene-Solr-Tests-4.x-Java6/lucene/build/highlighter/lucene-highlighter-4.2-SNAPSHOT.jar:/usr/home/hudson/hudson-slave/workspace/Lucene-Solr-Tests-4.x-Java6/lucene/build/memory/lucene-memory-4.2-SNAPSHOT.jar:/usr/home/hudson/hudson-slave/workspace/Lucene-Solr-Tests-4.x-Java6/lucene/build/misc/lucene-misc-4.2-SNAPSHOT.jar:/usr/home/hudson/hudson-slave/workspace/Lucene-Solr-Tests-4.x-Java6/lucene/build/spatial/lucene-spatial-4.2-SNAPSHOT.jar:/usr/home/hudson/hudson-slave/workspace/Lucene-Solr-Tests-4.x-Java6/lucene/build/suggest/lucene-suggest-4.2-SNAPSHOT.jar:/usr/home/hudson/hudson-slave/workspace/Lucene-Solr-Tests-4.x-Java6/lucene/build/grouping/lucene-grouping-4.2-SNAPSHOT.jar:/usr/home/hudson/hudson-slave/workspace/Lucene-Solr-Tests-4.x-Java6/lucene/build/queries/lucene-queries-4.2-SNAPSHOT.jar:/usr/home/hudson/hudson-slave/workspace/Lucene-Solr-Tests-4.x-Java6/lucene/build/queryparser/lucene-queryparser-4.2-SNAPSHOT.jar:/usr/home/hudson/hudson-slave/workspace/Lucene-Solr-Tests-4.x-Java6/solr/core/lib/cglib-nodep-2.2.jar:/usr/home/hudson/hudson-slave/workspace/Lucene-Solr-Tests-4.x-Java6/solr/core/lib/commons-cli-1.2.jar:/usr/home/hudson/hudson-slave/workspace/Lucene-Solr-Tests-4.x-Java6/solr/core/lib/commons-codec-1.7.jar:/usr/home/hudson/hudson-slave/workspace/Lucene-Solr-Tests-4.x-Java6/solr/core/lib/commons-fileupload-1.2.1.jar:/usr/home/hudson/hudson-slave/workspace/Lucene-Solr-Tests-4.x-Java6/solr/core/lib/commons-lang-2.6.jar:/usr/home/hudson/hudson-slave/workspace/Lucene-Solr-Tests-4.x-Java6/solr/core/lib/easymock-3.0.jar:/usr/home/hudson/hudson-slave/workspace/Lucene-Solr-Tests-4.x-Java6/solr/core/lib/guava-13.0.1.jar:/usr/home/hudson/hudson-slave/workspace/Lucene-Solr-Tests-4.x-Java6/solr/core/lib/javax.servlet-api-3.0.1.jar:/usr/home/hudson/hudson-slave/workspace/Lucene-Solr-Tests-4.x-Java6/solr/core/lib/objenesis-1.2.jar:/usr/home/hudson/hudson-slave/workspace/Lucene-Solr-Tests-4.x-Java6/solr/core/lib/org.restlet-2.1.1.jar:/usr/home/hudson/hudson-slave/workspace/Lucene-Solr-Tests-4.x-Java6/solr/core/lib/org.restlet.ext.servlet-2.1.1.jar:/usr/home/hudson/hudson-slave/workspace/Lucene-Solr-Tests-4.x-Java6/solr/core/lib/spatial4j-0.3.jar:/usr/home/hudson/hudson-slave/workspace/Lucene-Solr-Tests-4.x-Java6/solr/solrj/lib/commons-io-2.1.jar:/usr/home/hudson/hudson-slave/workspace/Lucene-Solr-Tests-4.x-Java6/solr/solrj/lib/httpclient-4.2.3.jar:/usr/home/hudson/hudson-slave/workspace/Lucene-Solr-Tests-4.x-Java6/solr/solrj/lib/httpcore-4.2.2.jar:/usr/home/hudson/hudson-slave/workspace/Lucene-Solr-Tests-4.x-Java6/solr/solrj/lib/httpmime-4.2.3.jar:/usr/home/hudson/hudson-slave/workspace/Lucene-Solr-Tests-4.x-Java6/solr/solrj/lib/jcl-over-slf4j-1.6.4.jar:/usr/home/hudson/hudson-slave/workspace/Lucene-Solr-Tests-4.x-Java6/solr/solrj/lib/slf4j-api-1.6.4.jar:/usr/home/hudson/hudson-slave/workspace/Lucene-Solr-Tests-4.x-Java6/solr/solrj/lib/slf4j-jdk14-1.6.4.jar:/usr/home/hudson/hudson-slave/workspace/Lucene-Solr-Tests-4.x-Java6/solr/solrj/lib/wstx-asl-3.2.7.jar:/usr/home/hudson/hudson-slave/workspace/Lucene-Solr-Tests-4.x-Java6/solr/solrj/lib/zookeeper-3.4.5.jar:/usr/home/hudson/hudson-slave/workspace/Lucene-Solr-Tests-4.x-Java6/solr/example/lib/jetty-continuation-8.1.8.v20121106.jar:/usr/home/hudson/hudson-slave/workspace/Lucene-Solr-Tests-4.x-Java6/solr/example/lib/jetty-deploy-8.1.8.v20121106.jar:/usr/home/hudson/hudson-slave/workspace/Lucene-Solr-Tests-4.x-Java6/solr/example/lib/jetty-http-8.1.8.v20121106.jar:/usr/home/hudson/hudson-slave/workspace/Lucene-Solr-Tests-4.x-Java6/solr/example/lib/jetty-io-8.1.8.v20121106.jar:/usr/home/hudson/hudson-slave/workspace/Lucene-Solr-Tests-4.x-Java6/solr/example/lib/jetty-jmx-8.1.8.v20121106.jar:/usr/home/hudson/hudson-slave/workspace/Lucene-Solr-Tests-4.x-Java6/solr/example/lib/jetty-security-8.1.8.v20121106.jar:/usr/home/hudson/hudson-slave/workspace/Lucene-Solr-Tests-4.x-Java6/solr/example/lib/jetty-server-8.1.8.v20121106.jar:/usr/home/hudson/hudson-slave/workspace/Lucene-Solr-Tests-4.x-Java6/solr/example/lib/jetty-servlet-8.1.8.v20121106.jar:/usr/home/hudson/hudson-slave/workspace/Lucene-Solr-Tests-4.x-Java6/solr/example/lib/jetty-util-8.1.8.v20121106.jar:/usr/home/hudson/hudson-slave/workspace/Lucene-Solr-Tests-4.x-Java6/solr/example/lib/jetty-webapp-8.1.8.v20121106.jar:/usr/home/hudson/hudson-slave/workspace/Lucene-Solr-Tests-4.x-Java6/solr/example/lib/jetty-xml-8.1.8.v20121106.jar:/usr/home/hudson/hudson-slave/workspace/Lucene-Solr-Tests-4.x-Java6/solr/example/lib/servlet-api-3.0.jar:/usr/home/hudson/hudson-slave/workspace/Lucene-Solr-Tests-4.x-Java6/solr/example/example-DIH/solr/db/lib/derby-10.9.1.0.jar:/usr/home/hudson/hudson-slave/workspace/Lucene-Solr-Tests-4.x-Java6/solr/example/example-DIH/solr/db/lib/hsqldb-1.8.0.10.jar:/usr/home/hudson/hudson-slave/workspace/Lucene-Solr-Tests-4.x-Java6/lucene/build/core/classes/java:/usr/home/hudson/hudson-slave/workspace/Lucene-Solr-Tests-4.x-Java6/lucene/test-framework/lib/junit-4.10.jar:/usr/home/hudson/hudson-slave/workspace/Lucene-Solr-Tests-4.x-Java6/lucene/test-framework/lib/randomizedtesting-runner-2.0.8.jar:/home/hudson/hudson-slave/tools/hudson.tasks.Ant_AntInstallation/ant-1.8.2/lib/ant-launcher.jar:/home/hudson/.ant/lib/ivy-2.2.0.jar:/home/hudson/hudson-slave/tools/hudson.tasks.Ant_AntInstallation/ant-1.8.2/lib/ant-commons-logging.jar:/home/hudson/hudson-slave/tools/hudson.tasks.Ant_AntInstallation/ant-1.8.2/lib/ant-apache-regexp.jar:/home/hudson/hudson-slave/tools/hudson.tasks.Ant_AntInstallation/ant-1.8.2/lib/ant-apache-oro.jar:/home/hudson/hudson-slave/tools/hudson.tasks.Ant_AntInstallation/ant-1.8.2/lib/ant-swing.jar:/home/hudson/hudson-slave/tools/hudson.tasks.Ant_AntInstallation/ant-1.8.2/lib/ant-jdepend.jar:/home/hudson/hudson-slave/tools/hudson.tasks.Ant_AntInstallation/ant-1.8.2/lib/ant-apache-xalan2.jar:/home/hudson/hudson-slave/tools/hudson.tasks.Ant_AntInstallation/ant-1.8.2/lib/ant-apache-bsf.jar:/home/hudson/hudson-slave/tools/hudson.tasks.Ant_AntInstallation/ant-1.8.2/lib/ant-junit4.jar:/home/hudson/hudson-slave/tools/hudson.tasks.Ant_AntInstallation/ant-1.8.2/lib/ant-commons-net.jar:/home/hudson/hudson-slave/tools/hudson.tasks.Ant_AntInstallation/ant-1.8.2/lib/ant-antlr.jar:/home/hudson/hudson-slave/tools/hudson.tasks.Ant_AntInstallation/ant-1.8.2/lib/ant-junit.jar:/home/hudson/hudson-slave/tools/hudson.tasks.Ant_AntInstallation/ant-1.8.2/lib/ant-jmf.jar:/home/hudson/hudson-slave/tools/hudson.tasks.Ant_AntInstallation/ant-1.8.2/lib/ant-netrexx.jar:/home/hudson/hudson-slave/tools/hudson.tasks.Ant_AntInstallation/ant-1.8.2/lib/ant-apache-log4j.jar:/home/hudson/hudson-slave/tools/hudson.tasks.Ant_AntInstallation/ant-1.8.2/lib/ant-apache-resolver.jar:/home/hudson/hudson-slave/tools/hudson.tasks.Ant_AntInstallation/ant-1.8.2/lib/ant.jar:/home/hudson/hudson-slave/tools/hudson.tasks.Ant_AntInstallation/ant-1.8.2/lib/ant-jsch.jar:/home/hudson/hudson-slave/tools/hudson.tasks.Ant_AntInstallation/ant-1.8.2/lib/ant-testutil.jar:/home/hudson/hudson-slave/tools/hudson.tasks.Ant_AntInstallation/ant-1.8.2/lib/ant-apache-bcel.jar:/home/hudson/hudson-slave/tools/hudson.tasks.Ant_AntInstallation/ant-1.8.2/lib/ant-jai.jar:/home/hudson/hudson-slave/tools/hudson.tasks.Ant_AntInstallation/ant-1.8.2/lib/ant-javamail.jar:/usr/local/openjdk6/lib/tools.jar:/home/hudson/.ivy2/cache/com.carrotsearch.randomizedtesting/junit4-ant/jars/junit4-ant-2.0.8.jar
[junit4:junit4]   2> 389 T68 oaz.Environment.logEnv Client environment:java.library.path=/usr/local/openjdk6/jre/lib/amd64/server:/usr/local/openjdk6/jre/lib/amd64:/usr/local/openjdk6/jre/../lib/amd64:/usr/java/packages/lib/amd64:/lib:/usr/lib:/usr/local/lib
[junit4:junit4]   2> 389 T68 oaz.Environment.logEnv Client environment:java.io.tmpdir=.
[junit4:junit4]   2> 389 T68 oaz.Environment.logEnv Client environment:java.compiler=<NA>
[junit4:junit4]   2> 390 T68 oaz.Environment.logEnv Client environment:os.name=FreeBSD
[junit4:junit4]   2> 390 T68 oaz.Environment.logEnv Client environment:os.arch=amd64
[junit4:junit4]   2> 391 T68 oaz.Environment.logEnv Client environment:os.version=9.0-RELEASE
[junit4:junit4]   2> 391 T68 oaz.Environment.logEnv Client environment:user.name=hudson
[junit4:junit4]   2> 391 T68 oaz.Environment.logEnv Client environment:user.home=/home/hudson
[junit4:junit4]   2> 392 T68 oaz.Environment.logEnv Client environment:user.dir=/usr/home/hudson/hudson-slave/workspace/Lucene-Solr-Tests-4.x-Java6/solr/build/solr-core/test/J0
[junit4:junit4]   2> 397 T68 oaz.ZooKeeper.<init> Initiating client connection, connectString=127.0.0.1:20857 sessionTimeout=10000 watcher=org.apache.solr.common.cloud.ConnectionManager@517a6426
[junit4:junit4]   2> 549 T68 oascc.ConnectionManager.waitForConnected Waiting for client to connect to ZooKeeper
[junit4:junit4]   2> 555 T74 oaz.ClientCnxn$SendThread.logStartConnect Opening socket connection to server localhost/127.0.0.1:20857. Will not attempt to authenticate using SASL (access denied (javax.security.auth.AuthPermission getLoginConfiguration))
[junit4:junit4]   2> 559 T74 oaz.ClientCnxn$SendThread.primeConnection Socket connection established to localhost/127.0.0.1:20857, initiating session
[junit4:junit4]   2> 560 T70 oazs.NIOServerCnxnFactory.run Accepted socket connection from /140.211.11.196:33724
[junit4:junit4]   2> 592 T70 oazs.ZooKeeperServer.processConnectRequest Client attempting to establish new session at /140.211.11.196:33724
[junit4:junit4]   2> 607 T72 oazsp.FileTxnLog.append Creating new log file: log.1
[junit4:junit4]   2> 646 T72 oazs.ZooKeeperServer.finishSessionInit Established session 0x13d3fa582da0000 with negotiated timeout 10000 for client /140.211.11.196:33724
[junit4:junit4]   2> 646 T74 oaz.ClientCnxn$SendThread.onConnected Session establishment complete on server localhost/127.0.0.1:20857, sessionid = 0x13d3fa582da0000, negotiated timeout = 10000
[junit4:junit4]   2> 653 T75 oascc.ConnectionManager.process Watcher org.apache.solr.common.cloud.ConnectionManager@517a6426 name:ZooKeeperConnection Watcher:127.0.0.1:20857 got event WatchedEvent state:SyncConnected type:None path:null path:null type:None
[junit4:junit4]   2> 654 T68 oascc.ConnectionManager.waitForConnected Client is connected to ZooKeeper
[junit4:junit4]   2> 658 T68 oascc.SolrZkClient.makePath makePath: /solr
[junit4:junit4]   2> 735 T73 oazs.PrepRequestProcessor.pRequest2Txn Processed session termination for sessionid: 0x13d3fa582da0000
[junit4:junit4]   2> 736 T75 oaz.ClientCnxn$EventThread.run EventThread shut down
[junit4:junit4]   2> 736 T68 oaz.ZooKeeper.close Session: 0x13d3fa582da0000 closed
[junit4:junit4]   2> 737 T70 oazs.NIOServerCnxn.doIO WARNING caught end of stream exception EndOfStreamException: Unable to read additional data from client sessionid 0x13d3fa582da0000, likely client has closed socket
[junit4:junit4]   2> 	at org.apache.zookeeper.server.NIOServerCnxn.doIO(NIOServerCnxn.java:220)
[junit4:junit4]   2> 	at org.apache.zookeeper.server.NIOServerCnxnFactory.run(NIOServerCnxnFactory.java:208)
[junit4:junit4]   2> 	at java.lang.Thread.run(Thread.java:679)
[junit4:junit4]   2> 
[junit4:junit4]   2> 737 T68 oaz.ZooKeeper.<init> Initiating client connection, connectString=127.0.0.1:20857/solr sessionTimeout=10000 watcher=org.apache.solr.common.cloud.ConnectionManager@16a6a919
[junit4:junit4]   2> 739 T70 oazs.NIOServerCnxn.closeSock Closed socket connection for client /140.211.11.196:33724 which had sessionid 0x13d3fa582da0000
[junit4:junit4]   2> 739 T68 oascc.ConnectionManager.waitForConnected Waiting for client to connect to ZooKeeper
[junit4:junit4]   2> 739 T76 oaz.ClientCnxn$SendThread.logStartConnect Opening socket connection to server localhost/127.0.0.1:20857. Will not attempt to authenticate using SASL (access denied (javax.security.auth.AuthPermission getLoginConfiguration))
[junit4:junit4]   2> 740 T76 oaz.ClientCnxn$SendThread.primeConnection Socket connection established to localhost/127.0.0.1:20857, initiating session
[junit4:junit4]   2> 740 T70 oazs.NIOServerCnxnFactory.run Accepted socket connection from /140.211.11.196:31435
[junit4:junit4]   2> 741 T70 oazs.ZooKeeperServer.processConnectRequest Client attempting to establish new session at /140.211.11.196:31435
[junit4:junit4]   2> 742 T72 oazs.ZooKeeperServer.finishSessionInit Established session 0x13d3fa582da0001 with negotiated timeout 10000 for client /140.211.11.196:31435
[junit4:junit4]   2> 742 T76 oaz.ClientCnxn$SendThread.onConnected Session establishment complete on server localhost/127.0.0.1:20857, sessionid = 0x13d3fa582da0001, negotiated timeout = 10000
[junit4:junit4]   2> 743 T77 oascc.ConnectionManager.process Watcher org.apache.solr.common.cloud.ConnectionManager@16a6a919 name:ZooKeeperConnection Watcher:127.0.0.1:20857/solr got event WatchedEvent state:SyncConnected type:None path:null path:null type:None
[junit4:junit4]   2> 743 T68 oascc.ConnectionManager.waitForConnected Client is connected to ZooKeeper
[junit4:junit4]   2> 752 T68 oascc.SolrZkClient.makePath makePath: /collections/collection1
[junit4:junit4]   2> 758 T68 oascc.SolrZkClient.makePath makePath: /collections/collection1/shards
[junit4:junit4]   2> 763 T68 oascc.SolrZkClient.makePath makePath: /collections/control_collection
[junit4:junit4]   2> 767 T68 oascc.SolrZkClient.makePath makePath: /collections/control_collection/shards
[junit4:junit4]   2> 772 T68 oasc.AbstractZkTestCase.putConfig put /usr/home/hudson/hudson-slave/workspace/Lucene-Solr-Tests-4.x-Java6/solr/build/solr-core/test-files/solr/collection1/conf/solrconfig-tlog.xml to /configs/conf1/solrconfig.xml
[junit4:junit4]   2> 798 T68 oascc.SolrZkClient.makePath makePath: /configs/conf1/solrconfig.xml
[junit4:junit4]   2> 814 T68 oasc.AbstractZkTestCase.putConfig put /usr/home/hudson/hudson-slave/workspace/Lucene-Solr-Tests-4.x-Java6/solr/build/solr-core/test-files/solr/collection1/conf/schema.xml to /configs/conf1/schema.xml
[junit4:junit4]   2> 815 T68 oascc.SolrZkClient.makePath makePath: /configs/conf1/schema.xml
[junit4:junit4]   2> 921 T68 oasc.AbstractZkTestCase.putConfig put /usr/home/hudson/hudson-slave/workspace/Lucene-Solr-Tests-4.x-Java6/solr/build/solr-core/test-files/solr/collection1/conf/stopwords.txt to /configs/conf1/stopwords.txt
[junit4:junit4]   2> 922 T68 oascc.SolrZkClient.makePath makePath: /configs/conf1/stopwords.txt
[junit4:junit4]   2> 927 T68 oasc.AbstractZkTestCase.putConfig put /usr/home/hudson/hudson-slave/workspace/Lucene-Solr-Tests-4.x-Java6/solr/build/solr-core/test-files/solr/collection1/conf/protwords.txt to /configs/conf1/protwords.txt
[junit4:junit4]   2> 928 T68 oascc.SolrZkClient.makePath makePath: /configs/conf1/protwords.txt
[junit4:junit4]   2> 933 T68 oasc.AbstractZkTestCase.putConfig put /usr/home/hudson/hudson-slave/workspace/Lucene-Solr-Tests-4.x-Java6/solr/build/solr-core/test-files/solr/collection1/conf/currency.xml to /configs/conf1/currency.xml
[junit4:junit4]   2> 933 T68 oascc.SolrZkClient.makePath makePath: /configs/conf1/currency.xml
[junit4:junit4]   2> 939 T68 oasc.AbstractZkTestCase.putConfig put /usr/home/hudson/hudson-slave/workspace/Lucene-Solr-Tests-4.x-Java6/solr/build/solr-core/test-files/solr/collection1/conf/open-exchange-rates.json to /configs/conf1/open-exchange-rates.json
[junit4:junit4]   2> 939 T68 oascc.SolrZkClient.makePath makePath: /configs/conf1/open-exchange-rates.json
[junit4:junit4]   2> 944 T68 oasc.AbstractZkTestCase.putConfig put /usr/home/hudson/hudson-slave/workspace/Lucene-Solr-Tests-4.x-Java6/solr/build/solr-core/test-files/solr/collection1/conf/mapping-ISOLatin1Accent.txt to /configs/conf1/mapping-ISOLatin1Accent.txt
[junit4:junit4]   2> 945 T68 oascc.SolrZkClient.makePath makePath: /configs/conf1/mapping-ISOLatin1Accent.txt
[junit4:junit4]   2> 951 T68 oasc.AbstractZkTestCase.putConfig put /usr/home/hudson/hudson-slave/workspace/Lucene-Solr-Tests-4.x-Java6/solr/build/solr-core/test-files/solr/collection1/conf/old_synonyms.txt to /configs/conf1/old_synonyms.txt
[junit4:junit4]   2> 951 T68 oascc.SolrZkClient.makePath makePath: /configs/conf1/old_synonyms.txt
[junit4:junit4]   2> 956 T68 oasc.AbstractZkTestCase.putConfig put /usr/home/hudson/hudson-slave/workspace/Lucene-Solr-Tests-4.x-Java6/solr/build/solr-core/test-files/solr/collection1/conf/synonyms.txt to /configs/conf1/synonyms.txt
[junit4:junit4]   2> 957 T68 oascc.SolrZkClient.makePath makePath: /configs/conf1/synonyms.txt
[junit4:junit4]   2> 962 T73 oazs.PrepRequestProcessor.pRequest2Txn Processed session termination for sessionid: 0x13d3fa582da0001
[junit4:junit4]   2> 963 T77 oaz.ClientCnxn$EventThread.run EventThread shut down
[junit4:junit4]   2> 963 T68 oaz.ZooKeeper.close Session: 0x13d3fa582da0001 closed
[junit4:junit4]   2> 964 T70 oazs.NIOServerCnxn.closeSock Closed socket connection for client /140.211.11.196:31435 which had sessionid 0x13d3fa582da0001
[junit4:junit4]   2> 1847 T68 oejs.Server.doStart jetty-8.1.8.v20121106
[junit4:junit4]   2> 2082 T68 oejs.AbstractConnector.doStart Started SocketConnector@127.0.0.1:26003
[junit4:junit4]   2> 2116 T68 oass.SolrDispatchFilter.init SolrDispatchFilter.init()
[junit4:junit4]   2> 2117 T68 oasc.SolrResourceLoader.locateSolrHome JNDI not configured for solr (NoInitialContextEx)
[junit4:junit4]   2> 2117 T68 oasc.SolrResourceLoader.locateSolrHome using system property solr.solr.home: /usr/home/hudson/hudson-slave/workspace/Lucene-Solr-Tests-4.x-Java6/solr/build/solr-core/test/J0/./org.apache.solr.cloud.SyncSliceTest-controljetty-1362572444981
[junit4:junit4]   2> 2118 T68 oasc.CoreContainer$Initializer.initialize looking for solr.xml: /usr/home/hudson/hudson-slave/workspace/Lucene-Solr-Tests-4.x-Java6/solr/build/solr-core/test/J0/./org.apache.solr.cloud.SyncSliceTest-controljetty-1362572444981/solr.xml
[junit4:junit4]   2> 2118 T68 oasc.CoreContainer.<init> New CoreContainer 425206657
[junit4:junit4]   2> 2119 T68 oasc.CoreContainer.load Loading CoreContainer using Solr Home: '/usr/home/hudson/hudson-slave/workspace/Lucene-Solr-Tests-4.x-Java6/solr/build/solr-core/test/J0/./org.apache.solr.cloud.SyncSliceTest-controljetty-1362572444981/'
[junit4:junit4]   2> 2119 T68 oasc.SolrResourceLoader.<init> new SolrResourceLoader for directory: '/usr/home/hudson/hudson-slave/workspace/Lucene-Solr-Tests-4.x-Java6/solr/build/solr-core/test/J0/./org.apache.solr.cloud.SyncSliceTest-controljetty-1362572444981/'
[junit4:junit4]   2> 2166 T68 oashc.HttpShardHandlerFactory.getParameter Setting socketTimeout to: 120000
[junit4:junit4]   2> 2167 T68 oashc.HttpShardHandlerFactory.getParameter Setting urlScheme to: http://
[junit4:junit4]   2> 2167 T68 oashc.HttpShardHandlerFactory.getParameter Setting connTimeout to: 15000
[junit4:junit4]   2> 2167 T68 oashc.HttpShardHandlerFactory.getParameter Setting maxConnectionsPerHost to: 20
[junit4:junit4]   2> 2168 T68 oashc.HttpShardHandlerFactory.getParameter Setting corePoolSize to: 0
[junit4:junit4]   2> 2168 T68 oashc.HttpShardHandlerFactory.getParameter Setting maximumPoolSize to: 2147483647
[junit4:junit4]   2> 2168 T68 oashc.HttpShardHandlerFactory.getParameter Setting maxThreadIdleTime to: 5
[junit4:junit4]   2> 2169 T68 oashc.HttpShardHandlerFactory.getParameter Setting sizeOfQueue to: -1
[junit4:junit4]   2> 2169 T68 oashc.HttpShardHandlerFactory.getParameter Setting fairnessPolicy to: false
[junit4:junit4]   2> 2203 T68 oascsi.HttpClientUtil.createClient Creating new http client, config:maxConnectionsPerHost=20&maxConnections=10000&socketTimeout=120000&connTimeout=15000&retry=false
[junit4:junit4]   2> 2612 T68 oasc.CoreContainer.load Registering Log Listener
[junit4:junit4]   2> 2626 T68 oasc.CoreContainer.initZooKeeper Zookeeper client=127.0.0.1:20857/solr
[junit4:junit4]   2> 2645 T68 oasc.ZkController.checkChrootPath zkHost includes chroot
[junit4:junit4]   2> 2645 T68 oaz.ZooKeeper.<init> Initiating client connection, connectString=127.0.0.1:20857 sessionTimeout=60000 watcher=org.apache.solr.common.cloud.ConnectionManager@21833d8a
[junit4:junit4]   2> 2646 T68 oascc.ConnectionManager.waitForConnected Waiting for client to connect to ZooKeeper
[junit4:junit4]   2> 2647 T88 oaz.ClientCnxn$SendThread.logStartConnect Opening socket connection to server localhost/127.0.0.1:20857. Will not attempt to authenticate using SASL (access denied (javax.security.auth.AuthPermission getLoginConfiguration))
[junit4:junit4]   2> 2648 T88 oaz.ClientCnxn$SendThread.primeConnection Socket connection established to localhost/127.0.0.1:20857, initiating session
[junit4:junit4]   2> 2648 T70 oazs.NIOServerCnxnFactory.run Accepted socket connection from /140.211.11.196:16427
[junit4:junit4]   2> 2648 T70 oazs.ZooKeeperServer.processConnectRequest Client attempting to establish new session at /140.211.11.196:16427
[junit4:junit4]   2> 2650 T72 oazs.ZooKeeperServer.finishSessionInit Established session 0x13d3fa582da0002 with negotiated timeout 20000 for client /140.211.11.196:16427
[junit4:junit4]   2> 2650 T88 oaz.ClientCnxn$SendThread.onConnected Session establishment complete on server localhost/127.0.0.1:20857, sessionid = 0x13d3fa582da0002, negotiated timeout = 20000
[junit4:junit4]   2> 2650 T89 oascc.ConnectionManager.process Watcher org.apache.solr.common.cloud.ConnectionManager@21833d8a name:ZooKeeperConnection Watcher:127.0.0.1:20857 got event WatchedEvent state:SyncConnected type:None path:null path:null type:None
[junit4:junit4]   2> 2650 T68 oascc.ConnectionManager.waitForConnected Client is connected to ZooKeeper
[junit4:junit4]   2> 2652 T73 oazs.PrepRequestProcessor.pRequest2Txn Processed session termination for sessionid: 0x13d3fa582da0002
[junit4:junit4]   2> 2653 T89 oaz.ClientCnxn$EventThread.run EventThread shut down
[junit4:junit4]   2> 2653 T68 oaz.ZooKeeper.close Session: 0x13d3fa582da0002 closed
[junit4:junit4]   2> 2653 T70 oazs.NIOServerCnxn.closeSock Closed socket connection for client /140.211.11.196:16427 which had sessionid 0x13d3fa582da0002
[junit4:junit4]   2> 2656 T68 oascsi.HttpClientUtil.createClient Creating new http client, config:maxConnections=500&maxConnectionsPerHost=16&socketTimeout=120000&connTimeout=15000
[junit4:junit4]   2> 2669 T68 oaz.ZooKeeper.<init> Initiating client connection, connectString=127.0.0.1:20857/solr sessionTimeout=30000 watcher=org.apache.solr.common.cloud.ConnectionManager@6065ffeb
[junit4:junit4]   2> 2670 T68 oascc.ConnectionManager.waitForConnected Waiting for client to connect to ZooKeeper
[junit4:junit4]   2> 2670 T90 oaz.ClientCnxn$SendThread.logStartConnect Opening socket connection to server localhost/127.0.0.1:20857. Will not attempt to authenticate using SASL (access denied (javax.security.auth.AuthPermission getLoginConfiguration))
[junit4:junit4]   2> 2670 T90 oaz.ClientCnxn$SendThread.primeConnection Socket connection established to localhost/127.0.0.1:20857, initiating session
[junit4:junit4]   2> 2671 T70 oazs.NIOServerCnxnFactory.run Accepted socket connection from /140.211.11.196:15041
[junit4:junit4]   2> 2671 T70 oazs.ZooKeeperServer.processConnectRequest Client attempting to establish new session at /140.211.11.196:15041
[junit4:junit4]   2> 2672 T72 oazs.ZooKeeperServer.finishSessionInit Established session 0x13d3fa582da0003 with negotiated timeout 20000 for client /140.211.11.196:15041
[junit4:junit4]   2> 2672 T90 oaz.ClientCnxn$SendThread.onConnected Session establishment complete on server localhost/127.0.0.1:20857, sessionid = 0x13d3fa582da0003, negotiated timeout = 20000
[junit4:junit4]   2> 2673 T91 oascc.ConnectionManager.process Watcher org.apache.solr.common.cloud.ConnectionManager@6065ffeb name:ZooKeeperConnection Watcher:127.0.0.1:20857/solr got event WatchedEvent state:SyncConnected type:None path:null path:null type:None
[junit4:junit4]   2> 2673 T68 oascc.ConnectionManager.waitForConnected Client is connected to ZooKeeper
[junit4:junit4]   2> 2687 T73 oazs.PrepRequestProcessor.pRequest Got user-level KeeperException when processing sessionid:0x13d3fa582da0003 type:create cxid:0x2 zxid:0x1a txntype:-1 reqpath:n/a Error Path:/solr/overseer Error:KeeperErrorCode = NodeExists for /solr/overseer
[junit4:junit4]   2> 2695 T68 oascc.SolrZkClient.makePath makePath: /live_nodes
[junit4:junit4]   2> 2698 T68 oasc.ZkController.createEphemeralLiveNode Register node as live in ZooKeeper:/live_nodes/127.0.0.1:26003_
[junit4:junit4]   2> 2702 T73 oazs.PrepRequestProcessor.pRequest Got user-level KeeperException when processing sessionid:0x13d3fa582da0003 type:delete cxid:0x8 zxid:0x1c txntype:-1 reqpath:n/a Error Path:/solr/live_nodes/127.0.0.1:26003_ Error:KeeperErrorCode = NoNode for /solr/live_nodes/127.0.0.1:26003_
[junit4:junit4]   2> 2703 T68 oascc.SolrZkClient.makePath makePath: /live_nodes/127.0.0.1:26003_
[junit4:junit4]   2> 2708 T68 oascc.SolrZkClient.makePath makePath: /overseer_elect/election
[junit4:junit4]   2> 2745 T73 oazs.PrepRequestProcessor.pRequest Got user-level KeeperException when processing sessionid:0x13d3fa582da0003 type:delete cxid:0x16 zxid:0x21 txntype:-1 reqpath:n/a Error Path:/solr/overseer_elect/leader Error:KeeperErrorCode = NoNode for /solr/overseer_elect/leader
[junit4:junit4]   2> 2750 T68 oascc.SolrZkClient.makePath makePath: /overseer_elect/leader
[junit4:junit4]   2> 2856 T68 oasc.Overseer.start Overseer (id=89297547714756611-127.0.0.1:26003_-n_0000000000) starting
[junit4:junit4]   2> 2857 T73 oazs.PrepRequestProcessor.pRequest Got user-level KeeperException when processing sessionid:0x13d3fa582da0003 type:create cxid:0x1b zxid:0x23 txntype:-1 reqpath:n/a Error Path:/solr/overseer Error:KeeperErrorCode = NodeExists for /solr/overseer
[junit4:junit4]   2> 3499 T73 oazs.PrepRequestProcessor.pRequest Got user-level KeeperException when processing sessionid:0x13d3fa582da0003 type:create cxid:0x1c zxid:0x24 txntype:-1 reqpath:n/a Error Path:/solr/overseer Error:KeeperErrorCode = NodeExists for /solr/overseer
[junit4:junit4]   2> 3555 T73 oazs.PrepRequestProcessor.pRequest Got user-level KeeperException when processing sessionid:0x13d3fa582da0003 type:create cxid:0x1d zxid:0x25 txntype:-1 reqpath:n/a Error Path:/solr/overseer Error:KeeperErrorCode = NodeExists for /solr/overseer
[junit4:junit4]   2> 3583 T73 oazs.PrepRequestProcessor.pRequest Got user-level KeeperException when processing sessionid:0x13d3fa582da0003 type:create cxid:0x1e zxid:0x26 txntype:-1 reqpath:n/a Error Path:/solr/overseer Error:KeeperErrorCode = NodeExists for /solr/overseer
[junit4:junit4]   2> 3585 T93 oasc.OverseerCollectionProcessor.run Process current queue of collection creations
[junit4:junit4]   2> 3585 T68 oascc.SolrZkClient.makePath makePath: /clusterstate.json
[junit4:junit4]   2> 3588 T68 oascc.ZkStateReader.createClusterStateWatchersAndUpdate Updating cluster state from ZooKeeper... 
[junit4:junit4]   2> 3611 T92 oasc.Overseer$ClusterStateUpdater.run Starting to work on the main queue
[junit4:junit4]   2> 3663 T94 oasc.CoreContainer.create Creating SolrCore 'collection1' using instanceDir: /usr/home/hudson/hudson-slave/workspace/Lucene-Solr-Tests-4.x-Java6/solr/build/solr-core/test/J0/./org.apache.solr.cloud.SyncSliceTest-controljetty-1362572444981/collection1
[junit4:junit4]   2> 3663 T94 oasc.ZkController.createCollectionZkNode Check for collection zkNode:control_collection
[junit4:junit4]   2> 3664 T94 oasc.ZkController.createCollectionZkNode Collection zkNode exists
[junit4:junit4]   2> 3664 T94 oasc.ZkController.readConfigName Load collection config from:/collections/control_collection
[junit4:junit4]   2> 3667 T94 oasc.SolrResourceLoader.<init> new SolrResourceLoader for directory: '/usr/home/hudson/hudson-slave/workspace/Lucene-Solr-Tests-4.x-Java6/solr/build/solr-core/test/J0/./org.apache.solr.cloud.SyncSliceTest-controljetty-1362572444981/collection1/'
[junit4:junit4]   2> 3668 T94 oasc.SolrResourceLoader.replaceClassLoader Adding 'file:/usr/home/hudson/hudson-slave/workspace/Lucene-Solr-Tests-4.x-Java6/solr/build/solr-core/test/J0/org.apache.solr.cloud.SyncSliceTest-controljetty-1362572444981/collection1/lib/README' to classloader
[junit4:junit4]   2> 3668 T94 oasc.SolrResourceLoader.replaceClassLoader Adding 'file:/usr/home/hudson/hudson-slave/workspace/Lucene-Solr-Tests-4.x-Java6/solr/build/solr-core/test/J0/org.apache.solr.cloud.SyncSliceTest-controljetty-1362572444981/collection1/lib/classes/' to classloader
[junit4:junit4]   2> 3727 T94 oasc.SolrConfig.<init> Using Lucene MatchVersion: LUCENE_42
[junit4:junit4]   2> 3789 T94 oasc.SolrConfig.<init> Loaded SolrConfig: solrconfig.xml
[junit4:junit4]   2> 3890 T94 oass.IndexSchema.readSchema Reading Solr Schema
[junit4:junit4]   2> 3922 T94 oass.IndexSchema.readSchema Schema name=test
[junit4:junit4]   2> 4372 T94 oass.OpenExchangeRatesOrgProvider.init Initialized with rates=open-exchange-rates.json, refreshInterval=1440.
[junit4:junit4]   2> 4385 T94 oass.IndexSchema.readSchema default search field in schema is text
[junit4:junit4]   2> 4388 T94 oass.IndexSchema.readSchema unique key field: id
[junit4:junit4]   2> 4415 T94 oass.FileExchangeRateProvider.reload Reloading exchange rates from file currency.xml
[junit4:junit4]   2> 4421 T94 oass.FileExchangeRateProvider.reload Reloading exchange rates from file currency.xml
[junit4:junit4]   2> 4425 T94 oass.OpenExchangeRatesOrgProvider.reload Reloading exchange rates from open-exchange-rates.json
[junit4:junit4]   2> 4427 T94 oass.OpenExchangeRatesOrgProvider$OpenExchangeRates.<init> WARNING Unknown key IMPORTANT NOTE
[junit4:junit4]   2> 4427 T94 oass.OpenExchangeRatesOrgProvider$OpenExchangeRates.<init> WARNING Expected key, got STRING
[junit4:junit4]   2> 4427 T94 oass.OpenExchangeRatesOrgProvider.reload Reloading exchange rates from open-exchange-rates.json
[junit4:junit4]   2> 4429 T94 oass.OpenExchangeRatesOrgProvider$OpenExchangeRates.<init> WARNING Unknown key IMPORTANT NOTE
[junit4:junit4]   2> 4429 T94 oass.OpenExchangeRatesOrgProvider$OpenExchangeRates.<init> WARNING Expected key, got STRING
[junit4:junit4]   2> 4429 T94 oasc.SolrCore.<init> [collection1] Opening new SolrCore at /usr/home/hudson/hudson-slave/workspace/Lucene-Solr-Tests-4.x-Java6/solr/build/solr-core/test/J0/./org.apache.solr.cloud.SyncSliceTest-controljetty-1362572444981/collection1/, dataDir=./org.apache.solr.cloud.SyncSliceTest-1362572444026/control/data/
[junit4:junit4]   2> 4433 T94 oasc.JmxMonitoredMap.<init> JMX monitoring is enabled. Adding Solr mbeans to JMX Server: com.sun.jmx.mbeanserver.JmxMBeanServer@66fdfc58
[junit4:junit4]   2> 4434 T94 oasc.SolrCore.initDirectoryFactory org.apache.solr.core.MockDirectoryFactory
[junit4:junit4]   2> 4435 T94 oasc.CachingDirectoryFactory.get return new directory for /usr/home/hudson/hudson-slave/workspace/Lucene-Solr-Tests-4.x-Java6/solr/build/solr-core/test/J0/./org.apache.solr.cloud.SyncSliceTest-1362572444026/control/data forceNew:false
[junit4:junit4]   2> 4436 T94 oasc.CachingDirectoryFactory.close Releasing directory:/usr/home/hudson/hudson-slave/workspace/Lucene-Solr-Tests-4.x-Java6/solr/build/solr-core/test/J0/./org.apache.solr.cloud.SyncSliceTest-1362572444026/control/data
[junit4:junit4]   2> 4436 T94 oasc.SolrCore.getNewIndexDir New index directory detected: old=null new=./org.apache.solr.cloud.SyncSliceTest-1362572444026/control/data/index/
[junit4:junit4]   2> 4436 T94 oasc.SolrCore.initIndex WARNING [collection1] Solr index directory './org.apache.solr.cloud.SyncSliceTest-1362572444026/control/data/index' doesn't exist. Creating new index...
[junit4:junit4]   2> 4437 T94 oasc.CachingDirectoryFactory.get return new directory for /usr/home/hudson/hudson-slave/workspace/Lucene-Solr-Tests-4.x-Java6/solr/build/solr-core/test/J0/./org.apache.solr.cloud.SyncSliceTest-1362572444026/control/data/index forceNew:false
[junit4:junit4]   2> 4439 T94 oasc.SolrDeletionPolicy.onCommit SolrDeletionPolicy.onCommit: commits:num=1
[junit4:junit4]   2> 		commit{dir=BaseDirectoryWrapper(org.apache.lucene.store.RAMDirectory@2bb0521c lockFactory=org.apache.lucene.store.NativeFSLockFactory@7cbecd86),segFN=segments_1,generation=1,filenames=[segments_1]
[junit4:junit4]   2> 4439 T94 oasc.SolrDeletionPolicy.updateCommits newest commit = 1[segments_1]
[junit4:junit4]   2> 4440 T94 oasc.CachingDirectoryFactory.close Releasing directory:/usr/home/hudson/hudson-slave/workspace/Lucene-Solr-Tests-4.x-Java6/solr/build/solr-core/test/J0/./org.apache.solr.cloud.SyncSliceTest-1362572444026/control/data/index
[junit4:junit4]   2> 4475 T94 oasup.UpdateRequestProcessorChain.init inserting DistributedUpdateProcessorFactory into updateRequestProcessorChain "dedupe"
[junit4:junit4]   2> 4476 T94 oasup.UpdateRequestProcessorChain.init inserting DistributedUpdateProcessorFactory into updateRequestProcessorChain "stored_sig"
[junit4:junit4]   2> 4477 T94 oasup.UpdateRequestProcessorChain.init inserting DistributedUpdateProcessorFactory into updateRequestProcessorChain "distrib-dup-test-chain-implicit"
[junit4:junit4]   2> 4477 T94 oasc.RequestHandlers.initHandlersFromConfig created standard: solr.StandardRequestHandler
[junit4:junit4]   2> 4478 T94 oasc.RequestHandlers.initHandlersFromConfig created /get: solr.RealTimeGetHandler
[junit4:junit4]   2> 4478 T94 oasc.RequestHandlers.initHandlersFromConfig adding lazy requestHandler: solr.ReplicationHandler
[junit4:junit4]   2> 4478 T94 oasc.RequestHandlers.initHandlersFromConfig created /replication: solr.ReplicationHandler
[junit4:junit4]   2> 4478 T94 oasc.RequestHandlers.initHandlersFromConfig created /update: solr.UpdateRequestHandler
[junit4:junit4]   2> 4479 T94 oasc.RequestHandlers.initHandlersFromConfig created /admin/: org.apache.solr.handler.admin.AdminHandlers
[junit4:junit4]   2> 4483 T94 oashl.XMLLoader.init xsltCacheLifetimeSeconds=60
[junit4:junit4]   2> 4488 T94 oasc.CachingDirectoryFactory.close Releasing directory:/usr/home/hudson/hudson-slave/workspace/Lucene-Solr-Tests-4.x-Java6/solr/build/solr-core/test/J0/./org.apache.solr.cloud.SyncSliceTest-1362572444026/control/data
[junit4:junit4]   2> 4488 T94 oass.SolrIndexSearcher.<init> Opening Searcher@41e57318 main
[junit4:junit4]   2> 4492 T94 oasu.UpdateHandler.clearLog Clearing tlog files, tlogDir=./org.apache.solr.cloud.SyncSliceTest-1362572444026/control/data/tlog
[junit4:junit4]   2> 4505 T94 oasu.CommitTracker.<init> Hard AutoCommit: disabled
[junit4:junit4]   2> 4505 T94 oasu.CommitTracker.<init> Soft AutoCommit: disabled
[junit4:junit4]   2> 4508 T94 oasc.CachingDirectoryFactory.close Releasing directory:/usr/home/hudson/hudson-slave/workspace/Lucene-Solr-Tests-4.x-Java6/solr/build/solr-core/test/J0/./org.apache.solr.cloud.SyncSliceTest-1362572444026/control/data
[junit4:junit4]   2> 4509 T95 oasc.SolrCore.registerSearcher [collection1] Registered new searcher Searcher@41e57318 main{StandardDirectoryReader(segments_1:1)}
[junit4:junit4]   2> 4509 T94 oasc.ZkController.publish publishing core=collection1 state=down
[junit4:junit4]   2> 4510 T94 oasc.ZkController.publish numShards not found on descriptor - reading it from system property
[junit4:junit4]   2> 4511 T73 oazs.PrepRequestProcessor.pRequest Got user-level KeeperException when processing sessionid:0x13d3fa582da0003 type:create cxid:0x50 zxid:0x29 txntype:-1 reqpath:n/a Error Path:/solr/overseer/queue Error:KeeperErrorCode = NoNode for /solr/overseer/queue
[junit4:junit4]   2> 5120 T92 oascc.ZkStateReader.updateClusterState Updating cloud state from ZooKeeper... 
[junit4:junit4]   2> 5121 T92 oasc.Overseer$ClusterStateUpdater.updateState Update state numShards=1 message={
[junit4:junit4]   2> 	  "operation":"state",
[junit4:junit4]   2> 	  "core_node_name":"1",
[junit4:junit4]   2> 	  "numShards":"1",
[junit4:junit4]   2> 	  "shard":null,
[junit4:junit4]   2> 	  "roles":null,
[junit4:junit4]   2> 	  "state":"down",
[junit4:junit4]   2> 	  "core":"collection1",
[junit4:junit4]   2> 	  "collection":"control_collection",
[junit4:junit4]   2> 	  "node_name":"127.0.0.1:26003_",
[junit4:junit4]   2> 	  "base_url":"http://127.0.0.1:26003"}
[junit4:junit4]   2> 5121 T92 oasc.Overseer$ClusterStateUpdater.createCollection Create collection control_collection with numShards 1
[junit4:junit4]   2> 5148 T92 oasc.Overseer$ClusterStateUpdater.updateState Assigning new node to shard shard=shard1
[junit4:junit4]   2> 5149 T73 oazs.PrepRequestProcessor.pRequest Got user-level KeeperException when processing sessionid:0x13d3fa582da0003 type:create cxid:0x58 zxid:0x2c txntype:-1 reqpath:n/a Error Path:/solr/overseer/queue-work Error:KeeperErrorCode = NoNode for /solr/overseer/queue-work
[junit4:junit4]   2> 5186 T91 oascc.ZkStateReader$2.process A cluster state change: WatchedEvent state:SyncConnected type:NodeDataChanged path:/clusterstate.json, has occurred - updating... (live nodes size: 1)
[junit4:junit4]   2> 5525 T94 oasc.CoreContainer.registerCore registering core: collection1
[junit4:junit4]   2> 5525 T94 oasc.ZkController.register Register replica - core:collection1 address:http://127.0.0.1:26003 collection:control_collection shard:shard1
[junit4:junit4]   2> 5534 T94 oascsi.HttpClientUtil.createClient Creating new http client, config:maxConnections=10000&maxConnectionsPerHost=20&connTimeout=30000&socketTimeout=30000&retry=false
[junit4:junit4]   2> 5547 T94 oascc.SolrZkClient.makePath makePath: /collections/control_collection/leader_elect/shard1/election
[junit4:junit4]   2> 5566 T73 oazs.PrepRequestProcessor.pRequest Got user-level KeeperException when processing sessionid:0x13d3fa582da0003 type:delete cxid:0x72 zxid:0x36 txntype:-1 reqpath:n/a Error Path:/solr/collections/control_collection/leaders Error:KeeperErrorCode = NoNode for /solr/collections/control_collection/leaders
[junit4:junit4]   2> 5567 T94 oasc.ShardLeaderElectionContext.runLeaderProcess Running the leader process.
[junit4:junit4]   2> 5568 T73 oazs.PrepRequestProcessor.pRequest Got user-level KeeperException when processing sessionid:0x13d3fa582da0003 type:create cxid:0x73 zxid:0x37 txntype:-1 reqpath:n/a Error Path:/solr/overseer Error:KeeperErrorCode = NodeExists for /solr/overseer
[junit4:junit4]   2> 5577 T94 oasc.ShardLeaderElectionContext.waitForReplicasToComeUp Enough replicas found to continue.
[junit4:junit4]   2> 5577 T94 oasc.ShardLeaderElectionContext.runLeaderProcess I may be the new leader - try and sync
[junit4:junit4]   2> 5580 T94 oasc.SyncStrategy.sync Sync replicas to http://127.0.0.1:26003/collection1/
[junit4:junit4]   2> 5580 T94 oasc.SyncStrategy.syncReplicas Sync Success - now sync replicas to me
[junit4:junit4]   2> 5581 T94 oasc.SyncStrategy.syncToMe http://127.0.0.1:26003/collection1/ has no replicas
[junit4:junit4]   2> 5581 T94 oasc.ShardLeaderElectionContext.runLeaderProcess I am the new leader: http://127.0.0.1:26003/collection1/
[junit4:junit4]   2> 5581 T94 oascc.SolrZkClient.makePath makePath: /collections/control_collection/leaders/shard1
[junit4:junit4]   2> 5588 T73 oazs.PrepRequestProcessor.pRequest Got user-level KeeperException when processing sessionid:0x13d3fa582da0003 type:create cxid:0x7d zxid:0x3b txntype:-1 reqpath:n/a Error Path:/solr/overseer Error:KeeperErrorCode = NodeExists for /solr/overseer
[junit4:junit4]   2> 6693 T92 oascc.ZkStateReader.updateClusterState Updating cloud state from ZooKeeper... 
[junit4:junit4]   2> 6721 T91 oascc.ZkStateReader$2.process A cluster state change: WatchedEvent state:SyncConnected type:NodeDataChanged path:/clusterstate.json, has occurred - updating... (live nodes size: 1)
[junit4:junit4]   2> 6770 T94 oasc.ZkController.register We are http://127.0.0.1:26003/collection1/ and leader is http://127.0.0.1:26003/collection1/
[junit4:junit4]   2> 6774 T94 oasc.ZkController.register No LogReplay needed for core=collection1 baseURL=http://127.0.0.1:26003
[junit4:junit4]   2> 6774 T94 oasc.ZkController.checkRecovery I am the leader, no recovery necessary
[junit4:junit4]   2> 6775 T94 oasc.ZkController.publish publishing core=collection1 state=active
[junit4:junit4]   2> 6775 T94 oasc.ZkController.publish numShards not found on descriptor - reading it from system property
[junit4:junit4]   2> 6778 T94 oascc.ZkStateReader.updateClusterState Updating cloud state from ZooKeeper... 
[junit4:junit4]   2> 6779 T68 oass.SolrDispatchFilter.init user.dir=/usr/home/hudson/hudson-slave/workspace/Lucene-Solr-Tests-4.x-Java6/solr/build/solr-core/test/J0
[junit4:junit4]   2> 6780 T68 oass.SolrDispatchFilter.init SolrDispatchFilter.init() done
[junit4:junit4]   2> 6871 T68 oascsi.HttpClientUtil.createClient Creating new http client, config:maxConnections=128&maxConnectionsPerHost=32&followRedirects=false
[junit4:junit4]   2> 6896 T68 oascsi.HttpClientUtil.createClient Creating new http client, config:
[junit4:junit4]   2> 6905 T68 oaz.ZooKeeper.<init> Initiating client connection, connectString=127.0.0.1:20857/solr sessionTimeout=10000 watcher=org.apache.solr.common.cloud.ConnectionManager@3ffed5aa
[junit4:junit4]   2> 6906 T68 oascc.ConnectionManager.waitForConnected Waiting for client to connect to ZooKeeper
[junit4:junit4]   2> 6907 T96 oaz.ClientCnxn$SendThread.logStartConnect Opening socket connection to server localhost/127.0.0.1:20857. Will not attempt to authenticate using SASL (access denied (javax.security.auth.AuthPermission getLoginConfiguration))
[junit4:junit4]   2> 6907 T96 oaz.ClientCnxn$SendThread.primeConnection Socket connection established to localhost/127.0.0.1:20857, initiating session
[junit4:junit4]   2> 6908 T70 oazs.NIOServerCnxnFactory.run Accepted socket connection from /140.211.11.196:54876
[junit4:junit4]   2> 6908 T70 oazs.ZooKeeperServer.processConnectRequest Client attempting to establish new session at /140.211.11.196:54876
[junit4:junit4]   2> 6910 T72 oazs.ZooKeeperServer.finishSessionInit Established session 0x13d3fa582da0004 with negotiated timeout 10000 for client /140.211.11.196:54876
[junit4:junit4]   2> 6910 T96 oaz.ClientCnxn$SendThread.onConnected Session establishment complete on server localhost/127.0.0.1:20857, sessionid = 0x13d3fa582da0004, negotiated timeout = 10000
[junit4:junit4]   2> 6910 T97 oascc.ConnectionManager.process Watcher org.apache.solr.common.cloud.ConnectionManager@3ffed5aa name:ZooKeeperConnection Watcher:127.0.0.1:20857/solr got event WatchedEvent state:SyncConnected type:None path:null path:null type:None
[junit4:junit4]   2> 6910 T68 oascc.ConnectionManager.waitForConnected Client is connected to ZooKeeper
[junit4:junit4]   2> 6912 T68 oascc.ZkStateReader.createClusterStateWatchersAndUpdate Updating cluster state from ZooKeeper... 
[junit4:junit4]   2> 6918 T68 oasc.ChaosMonkey.monkeyLog monkey: init - expire sessions:true cause connection loss:true
[junit4:junit4]   2> 7102 T68 oejs.Server.doStart jetty-8.1.8.v20121106
[junit4:junit4]   2> 7105 T68 oejs.AbstractConnector.doStart Started SocketConnector@127.0.0.1:31610
[junit4:junit4]   2> 7106 T68 oass.SolrDispatchFilter.init SolrDispatchFilter.init()
[junit4:junit4]   2> 7106 T68 oasc.SolrResourceLoader.locateSolrHome JNDI not configured for solr (NoInitialContextEx)
[junit4:junit4]   2> 7107 T68 oasc.SolrResourceLoader.locateSolrHome using system property solr.solr.home: /usr/home/hudson/hudson-slave/workspace/Lucene-Solr-Tests-4.x-Java6/solr/build/solr-core/test/J0/./org.apache.solr.cloud.SyncSliceTest-jetty1-1362572450936
[junit4:junit4]   2> 7107 T68 oasc.CoreContainer$Initializer.initialize looking for solr.xml: /usr/home/hudson/hudson-slave/workspace/Lucene-Solr-Tests-4.x-Java6/solr/build/solr-core/test/J0/./org.apache.solr.cloud.SyncSliceTest-jetty1-1362572450936/solr.xml
[junit4:junit4]   2> 7108 T68 oasc.CoreContainer.<init> New CoreContainer 1975970288
[junit4:junit4]   2> 7108 T68 oasc.CoreContainer.load Loading CoreContainer using Solr Home: '/usr/home/hudson/hudson-slave/workspace/Lucene-Solr-Tests-4.x-Java6/solr/build/solr-core/test/J0/./org.apache.solr.cloud.SyncSliceTest-jetty1-1362572450936/'
[junit4:junit4]   2> 7109 T68 oasc.SolrResourceLoader.<init> new SolrResourceLoader for directory: '/usr/home/hudson/hudson-slave/workspace/Lucene-Solr-Tests-4.x-Java6/solr/build/solr-core/test/J0/./org.apache.solr.cloud.SyncSliceTest-jetty1-1362572450936/'
[junit4:junit4]   2> 7157 T68 oashc.HttpShardHandlerFactory.getParameter Setting socketTimeout to: 120000
[junit4:junit4]   2> 7158 T68 oashc.HttpShardHandlerFactory.getParameter Setting urlScheme to: http://
[junit4:junit4]   2> 7158 T68 oashc.HttpShardHandlerFactory.getParameter Setting connTimeout to: 15000
[junit4:junit4]   2> 7159 T68 oashc.HttpShardHandlerFactory.getParameter Setting maxConnectionsPerHost to: 20
[junit4:junit4]   2> 7159 T68 oashc.HttpShardHandlerFactory.getParameter Setting corePoolSize to: 0
[junit4:junit4]   2> 7160 T68 oashc.HttpShardHandlerFactory.getParameter Setting maximumPoolSize to: 2147483647
[junit4:junit4]   2> 7160 T68 oashc.HttpShardHandlerFactory.getParameter Setting maxThreadIdleTime to: 5
[junit4:junit4]   2> 7161 T68 oashc.HttpShardHandlerFactory.getParameter Setting sizeOfQueue to: -1
[junit4:junit4]   2> 7161 T68 oashc.HttpShardHandlerFactory.getParameter Setting fairnessPolicy to: false
[junit4:junit4]   2> 7162 T68 oascsi.HttpClientUtil.createClient Creating new http client, config:maxConnectionsPerHost=20&maxConnections=10000&socketTimeout=120000&connTimeout=15000&retry=false
[junit4:junit4]   2> 7182 T68 oasc.CoreContainer.load Registering Log Listener
[junit4:junit4]   2> 7201 T68 oasc.CoreContainer.initZooKeeper Zookeeper client=127.0.0.1:20857/solr
[junit4:junit4]   2> 7202 T68 oasc.ZkController.checkChrootPath zkHost includes chroot
[junit4:junit4]   2> 7203 T68 oaz.ZooKeeper.<init> Initiating client connection, connectString=127.0.0.1:20857 sessionTimeout=60000 watcher=org.apache.solr.common.cloud.ConnectionManager@f6096f9
[junit4:junit4]   2> 7204 T68 oascc.ConnectionManager.waitForConnected Waiting for client to connect to ZooKeeper
[junit4:junit4]   2> 7208 T107 oaz.ClientCnxn$SendThread.logStartConnect Opening socket connection to server localhost/127.0.0.1:20857. Will not attempt to authenticate using SASL (access denied (javax.security.auth.AuthPermission getLoginConfiguration))
[junit4:junit4]   2> 7208 T107 oaz.ClientCnxn$SendThread.primeConnection Socket connection established to localhost/127.0.0.1:20857, initiating session
[junit4:junit4]   2> 7209 T70 oazs.NIOServerCnxnFactory.run Accepted socket connection from /140.211.11.196:64339
[junit4:junit4]   2> 7209 T70 oazs.ZooKeeperServer.processConnectRequest Client attempting to establish new session at /140.211.11.196:64339
[junit4:junit4]   2> 7211 T72 oazs.ZooKeeperServer.finishSessionInit Established session 0x13d3fa582da0005 with negotiated timeout 20000 for client /140.211.11.196:64339
[junit4:junit4]   2> 7211 T107 oaz.ClientCnxn$SendThread.onConnected Session establishment complete on server localhost/127.0.0.1:20857, sessionid = 0x13d3fa582da0005, negotiated timeout = 20000
[junit4:junit4]   2> 7212 T108 oascc.ConnectionManager.process Watcher org.apache.solr.common.cloud.ConnectionManager@f6096f9 name:ZooKeeperConnection Watcher:127.0.0.1:20857 got event WatchedEvent state:SyncConnected type:None path:null path:null type:None
[junit4:junit4]   2> 7212 T68 oascc.ConnectionManager.waitForConnected Client is connected to ZooKeeper
[junit4:junit4]   2> 7214 T73 oazs.PrepRequestProcessor.pRequest2Txn Processed session termination for sessionid: 0x13d3fa582da0005
[junit4:junit4]   2> 7222 T108 oaz.ClientCnxn$EventThread.run EventThread shut down
[junit4:junit4]   2> 7222 T68 oaz.ZooKeeper.close Session: 0x13d3fa582da0005 closed
[junit4:junit4]   2> 7222 T70 oazs.NIOServerCnxn.closeSock Closed socket connection for client /140.211.11.196:64339 which had sessionid 0x13d3fa582da0005
[junit4:junit4]   2> 7222 T68 oascsi.HttpClientUtil.createClient Creating new http client, config:maxConnections=500&maxConnectionsPerHost=16&socketTimeout=120000&connTimeout=15000
[junit4:junit4]   2> 7234 T68 oaz.ZooKeeper.<init> Initiating client connection, connectString=127.0.0.1:20857/solr sessionTimeout=30000 watcher=org.apache.solr.common.cloud.ConnectionManager@65852491
[junit4:junit4]   2> 7235 T68 oascc.ConnectionManager.waitForConnected Waiting for client to connect to ZooKeeper
[junit4:junit4]   2> 7235 T109 oaz.ClientCnxn$SendThread.logStartConnect Opening socket connection to server localhost/127.0.0.1:20857. Will not attempt to authenticate using SASL (access denied (javax.security.auth.AuthPermission getLoginConfiguration))
[junit4:junit4]   2> 7236 T109 oaz.ClientCnxn$SendThread.primeConnection Socket connection established to localhost/127.0.0.1:20857, initiating session
[junit4:junit4]   2> 7236 T70 oazs.NIOServerCnxnFactory.run Accepted socket connection from /140.211.11.196:15197
[junit4:junit4]   2> 7236 T70 oazs.ZooKeeperServer.processConnectRequest Client attempting to establish new session at /140.211.11.196:15197
[junit4:junit4]   2> 7238 T72 oazs.ZooKeeperServer.finishSessionInit Established session 0x13d3fa582da0006 with negotiated timeout 20000 for client /140.211.11.196:15197
[junit4:junit4]   2> 7238 T109 oaz.ClientCnxn$SendThread.onConnected Session establishment complete on server localhost/127.0.0.1:20857, sessionid = 0x13d3fa582da0006, negotiated timeout = 20000
[junit4:junit4]   2> 7238 T110 oascc.ConnectionManager.process Watcher org.apache.solr.common.cloud.ConnectionManager@65852491 name:ZooKeeperConnection Watcher:127.0.0.1:20857/solr got event WatchedEvent state:SyncConnected type:None path:null path:null type:None
[junit4:junit4]   2> 7239 T68 oascc.ConnectionManager.waitForConnected Client is connected to ZooKeeper
[junit4:junit4]   2> 7240 T73 oazs.PrepRequestProcessor.pRequest Got user-level KeeperException when processing sessionid:0x13d3fa582da0006 type:create cxid:0x1 zxid:0x49 txntype:-1 reqpath:n/a Error Path:/solr/overseer Error:KeeperErrorCode = NodeExists for /solr/overseer
[junit4:junit4]   2> 7242 T73 oazs.PrepRequestProcessor.pRequest Got user-level KeeperException when processing sessionid:0x13d3fa582da0006 type:create cxid:0x2 zxid:0x4a txntype:-1 reqpath:n/a Error Path:/solr/overseer Error:KeeperErrorCode = NodeExists for /solr/overseer
[junit4:junit4]   2> 7250 T68 oascc.ZkStateReader.createClusterStateWatchersAndUpdate Updating cluster state from ZooKeeper... 
[junit4:junit4]   2> 8234 T92 oascc.ZkStateReader.updateClusterState Updating cloud state from ZooKeeper... 
[junit4:junit4]   2> 8235 T92 oasc.Overseer$ClusterStateUpdater.updateState Update state numShards=1 message={
[junit4:junit4]   2> 	  "operation":"state",
[junit4:junit4]   2> 	  "core_node_name":"1",
[junit4:junit4]   2> 	  "numShards":"1",
[junit4:junit4]   2> 	  "shard":"shard1",
[junit4:junit4]   2> 	  "roles":null,
[junit4:junit4]   2> 	  "state":"active",
[junit4:junit4]   2> 	  "core":"collection1",
[junit4:junit4]   2> 	  "collection":"control_collection",
[junit4:junit4]   2> 	  "node_name":"127.0.0.1:26003_",
[junit4:junit4]   2> 	  "base_url":"http://127.0.0.1:26003"}
[junit4:junit4]   2> 8242 T110 oascc.ZkStateReader$2.process A cluster state change: WatchedEvent state:SyncConnected type:NodeDataChanged path:/clusterstate.json, has occurred - updating... (live nodes size: 1)
[junit4:junit4]   2> 8242 T97 oascc.ZkStateReader$2.process A cluster state change: WatchedEvent state:SyncConnected type:NodeDataChanged path:/clusterstate.json, has occurred - updating... (live nodes size: 1)
[junit4:junit4]   2> 8242 T91 oascc.ZkStateReader$2.process A cluster state change: WatchedEvent state:SyncConnected type:NodeDataChanged path:/clusterstate.json, has occurred - updating... (live nodes size: 1)
[junit4:junit4]   2> 8255 T68 oasc.ZkController.createEphemeralLiveNode Register node as live in ZooKeeper:/live_nodes/127.0.0.1:31610_
[junit4:junit4]   2> 8256 T73 oazs.PrepRequestProcessor.pRequest Got user-level KeeperException when processing sessionid:0x13d3fa582da0006 type:delete cxid:0xb zxid:0x4f txntype:-1 reqpath:n/a Error Path:/solr/live_nodes/127.0.0.1:31610_ Error:KeeperErrorCode = NoNode for /solr/live_nodes/127.0.0.1:31610_
[junit4:junit4]   2> 8257 T68 oascc.SolrZkClient.makePath makePath: /live_nodes/127.0.0.1:31610_
[junit4:junit4]   2> 8264 T110 oascc.ZkStateReader$2.process A cluster state change: WatchedEvent state:SyncConnected type:NodeChildrenChanged path:/live_nodes, has occurred - updating... (live nodes size: 1)
[junit4:junit4]   2> 8265 T97 oascc.ZkStateReader$3.process Updating live nodes... (2)
[junit4:junit4]   2> 8265 T91 oascc.ZkStateReader$3.process Updating live nodes... (2)
[junit4:junit4]   2> 8265 T97 oascc.ZkStateReader$2.process A cluster state change: WatchedEvent state:SyncConnected type:NodeChildrenChanged path:/live_nodes, has occurred - updating... (live nodes size: 2)
[junit4:junit4]   2> 8265 T91 oascc.ZkStateReader$2.process A cluster state change: WatchedEvent state:SyncConnected type:NodeChildrenChanged path:/live_nodes, has occurred - updating... (live nodes size: 2)
[junit4:junit4]   2> 8267 T110 oascc.ZkStateReader$3.process Updating live nodes... (2)
[junit4:junit4]   2> 8281 T111 oasc.CoreContainer.create Creating SolrCore 'collection1' using instanceDir: /usr/home/hudson/hudson-slave/workspace/Lucene-Solr-Tests-4.x-Java6/solr/build/solr-core/test/J0/./org.apache.solr.cloud.SyncSliceTest-jetty1-1362572450936/collection1
[junit4:junit4]   2> 8281 T111 oasc.ZkController.createCollectionZkNode Check for collection zkNode:collection1
[junit4:junit4]   2> 8282 T111 oasc.ZkController.createCollectionZkNode Collection zkNode exists
[junit4:junit4]   2> 8282 T111 oasc.ZkController.readConfigName Load collection config from:/collections/collection1
[junit4:junit4]   2> 8284 T111 oasc.SolrResourceLoader.<init> new SolrResourceLoader for directory: '/usr/home/hudson/hudson-slave/workspace/Lucene-Solr-Tests-4.x-Java6/solr/build/solr-core/test/J0/./org.apache.solr.cloud.SyncSliceTest-jetty1-1362572450936/collection1/'
[junit4:junit4]   2> 8286 T111 oasc.SolrResourceLoader.replaceClassLoader Adding 'file:/usr/home/hudson/hudson-slave/workspace/Lucene-Solr-Tests-4.x-Java6/solr/build/solr-core/test/J0/org.apache.solr.cloud.SyncSliceTest-jetty1-1362572450936/collection1/lib/README' to classloader
[junit4:junit4]   2> 8286 T111 oasc.SolrResourceLoader.replaceClassLoader Adding 'file:/usr/home/hudson/hudson-slave/workspace/Lucene-Solr-Tests-4.x-Java6/solr/build/solr-core/test/J0/org.apache.solr.cloud.SyncSliceTest-jetty1-1362572450936/collection1/lib/classes/' to classloader
[junit4:junit4]   2> 8352 T111 oasc.SolrConfig.<init> Using Lucene MatchVersion: LUCENE_42
[junit4:junit4]   2> 8445 T111 oasc.SolrConfig.<init> Loaded SolrConfig: solrconfig.xml
[junit4:junit4]   2> 8546 T111 oass.IndexSchema.readSchema Reading Solr Schema
[junit4:junit4]   2> 8590 T111 oass.IndexSchema.readSchema Schema name=test
[junit4:junit4]   2> 9205 T111 oass.OpenExchangeRatesOrgProvider.init Initialized with rates=open-exchange-rates.json, refreshInterval=1440.
[junit4:junit4]   2> 9220 T111 oass.IndexSchema.readSchema default search field in schema is text
[junit4:junit4]   2> 9224 T111 oass.IndexSchema.readSchema unique key field: id
[junit4:junit4]   2> 9253 T111 oass.FileExchangeRateProvider.reload Reloading exchange rates from file currency.xml
[junit4:junit4]   2> 9259 T111 oass.FileExchangeRateProvider.reload Reloading exchange rates from file currency.xml
[junit4:junit4]   2> 9265 T111 oass.OpenExchangeRatesOrgProvider.reload Reloading exchange rates from open-exchange-rates.json
[junit4:junit4]   2> 9266 T111 oass.OpenExchangeRatesOrgProvider$OpenExchangeRates.<init> WARNING Unknown key IMPORTANT NOTE
[junit4:junit4]   2> 9267 T111 oass.OpenExchangeRatesOrgProvider$OpenExchangeRates.<init> WARNING Expected key, got STRING
[junit4:junit4]   2> 9267 T111 oass.OpenExchangeRatesOrgProvider.reload Reloading exchange rates from open-exchange-rates.json
[junit4:junit4]   2> 9269 T111 oass.OpenExchangeRatesOrgProvider$OpenExchangeRates.<init> WARNING Unknown key IMPORTANT NOTE
[junit4:junit4]   2> 9269 T111 oass.OpenExchangeRatesOrgProvider$OpenExchangeRates.<init> WARNING Expected key, got STRING
[junit4:junit4]   2> 9269 T111 oasc.SolrCore.<init> [collection1] Opening new SolrCore at /usr/home/hudson/hudson-slave/workspace/Lucene-Solr-Tests-4.x-Java6/solr/build/solr-core/test/J0/./org.apache.solr.cloud.SyncSliceTest-jetty1-1362572450936/collection1/, dataDir=./org.apache.solr.cloud.SyncSliceTest-1362572444026/jetty1/
[junit4:junit4]   2> 9270 T111 oasc.JmxMonitoredMap.<init> JMX monitoring is enabled. Adding Solr mbeans to JMX Server: com.sun.jmx.mbeanserver.JmxMBeanServer@66fdfc58
[junit4:junit4]   2> 9270 T111 oasc.SolrCore.initDirectoryFactory org.apache.solr.core.MockDirectoryFactory
[junit4:junit4]   2> 9272 T111 oasc.CachingDirectoryFactory.get return new directory for /usr/home/hudson/hudson-slave/workspace/Lucene-Solr-Tests-4.x-Java6/solr/build/solr-core/test/J0/./org.apache.solr.cloud.SyncSliceTest-1362572444026/jetty1 forceNew:false
[junit4:junit4]   2> 9272 T111 oasc.CachingDirectoryFactory.close Releasing directory:/usr/home/hudson/hudson-slave/workspace/Lucene-Solr-Tests-4.x-Java6/solr/build/solr-core/test/J0/./org.apache.solr.cloud.SyncSliceTest-1362572444026/jetty1
[junit4:junit4]   2> 9273 T111 oasc.SolrCore.getNewIndexDir New index directory detected: old=null new=./org.apache.solr.cloud.SyncSliceTest-1362572444026/jetty1/index/
[junit4:junit4]   2> 9273 T111 oasc.SolrCore.initIndex WARNING [collection1] Solr index directory './org.apache.solr.cloud.SyncSliceTest-1362572444026/jetty1/index' doesn't exist. Creating new index...
[junit4:junit4]   2> 9274 T111 oasc.CachingDirectoryFactory.get return new directory for /usr/home/hudson/hudson-slave/workspace/Lucene-Solr-Tests-4.x-Java6/solr/build/solr-core/test/J0/./org.apache.solr.cloud.SyncSliceTest-1362572444026/jetty1/index forceNew:false
[junit4:junit4]   2> 9276 T111 oasc.SolrDeletionPolicy.onCommit SolrDeletionPolicy.onCommit: commits:num=1
[junit4:junit4]   2> 		commit{dir=BaseDirectoryWrapper(org.apache.lucene.store.RAMDirectory@4e2a718 lockFactory=org.apache.lucene.store.NativeFSLockFactory@21ef3faa),segFN=segments_1,generation=1,filenames=[segments_1]
[junit4:junit4]   2> 9276 T111 oasc.SolrDeletionPolicy.updateCommits newest commit = 1[segments_1]
[junit4:junit4]   2> 9277 T111 oasc.CachingDirectoryFactory.close Releasing directory:/usr/home/hudson/hudson-slave/workspace/Lucene-Solr-Tests-4.x-Java6/solr/build/solr-core/test/J0/./org.apache.solr.cloud.SyncSliceTest-1362572444026/jetty1/index
[junit4:junit4]   2> 9279 T111 oasup.UpdateRequestProcessorChain.init inserting DistributedUpdateProcessorFactory into updateRequestProcessorChain "dedupe"
[junit4:junit4]   2> 9280 T111 oasup.UpdateRequestProcessorChain.init inserting DistributedUpdateProcessorFactory into updateRequestProcessorChain "stored_sig"
[junit4:junit4]   2> 9281 T111 oasup.UpdateRequestProcessorChain.init inserting DistributedUpdateProcessorFactory into updateRequestProcessorChain "distrib-dup-test-chain-implicit"
[junit4:junit4]   2> 9282 T111 oasc.RequestHandlers.initHandlersFromConfig created standard: solr.StandardRequestHandler
[junit4:junit4]   2> 9282 T111 oasc.RequestHandlers.initHandlersFromConfig created /get: solr.RealTimeGetHandler
[junit4:junit4]   2> 9283 T111 oasc.RequestHandlers.initHandlersFromConfig adding lazy requestHandler: solr.ReplicationHandler
[junit4:junit4]   2> 9283 T111 oasc.RequestHandlers.initHandlersFromConfig created /replication: solr.ReplicationHandler
[junit4:junit4]   2> 9284 T111 oasc.RequestHandlers.initHandlersFromConfig created /update: solr.UpdateRequestHandler
[junit4:junit4]   2> 9284 T111 oasc.RequestHandlers.initHandlersFromConfig created /admin/: org.apache.solr.handler.admin.AdminHandlers
[junit4:junit4]   2> 9290 T111 oashl.XMLLoader.init xsltCacheLifetimeSeconds=60
[junit4:junit4]   2> 9296 T111 oasc.CachingDirectoryFactory.close Releasing directory:/usr/home/hudson/hudson-slave/workspace/Lucene-Solr-Tests-4.x-Java6/solr/build/solr-core/test/J0/./org.apache.solr.cloud.SyncSliceTest-1362572444026/jetty1
[junit4:junit4]   2> 9297 T111 oass.SolrIndexSearcher.<init> Opening Searcher@2459270 main
[junit4:junit4]   2> 9297 T111 oasu.UpdateHandler.clearLog Clearing tlog files, tlogDir=./org.apache.solr.cloud.SyncSliceTest-1362572444026/jetty1/tlog
[junit4:junit4]   2> 9298 T111 oasu.CommitTracker.<init> Hard AutoCommit: disabled
[junit4:junit4]   2> 9298 T111 oasu.CommitTracker.<init> Soft AutoCommit: disabled
[junit4:junit4]   2> 9303 T112 oasc.SolrCore.registerSearcher [collection1] Registered new searcher Searcher@2459270 main{StandardDirectoryReader(segments_1:1)}
[junit4:junit4]   2> 9305 T111 oasc.ZkController.publish publishing core=collection1 state=down
[junit4:junit4]   2> 9306 T111 oasc.ZkController.publish numShards not found on descriptor - reading it from system property
[junit4:junit4]   2> 9757 T92 oascc.ZkStateReader.updateClusterState Updating cloud state from ZooKeeper... 
[junit4:junit4]   2> 9758 T92 oasc.Overseer$ClusterStateUpdater.updateState Update state numShards=1 message={
[junit4:junit4]   2> 	  "operation":"state",
[junit4:junit4]   2> 	  "core_node_name":"2",
[junit4:junit4]   2> 	  "numShards":"1",
[junit4:junit4]   2> 	  "shard":null,
[junit4:junit4]   2> 	  "roles":null,
[junit4:junit4]   2> 	  "state":"down",
[junit4:junit4]   2> 	  "core":"collection1",
[junit4:junit4]   2> 	  "collection":"collection1",
[junit4:junit4]   2> 	  "node_name":"127.0.0.1:31610_",
[junit4:junit4]   2> 	  "base_url":"http://127.0.0.1:31610"}
[junit4:junit4]   2> 9758 T92 oasc.Overseer$ClusterStateUpdater.createCollection Create collection collection1 with numShards 1
[junit4:junit4]   2> 9759 T92 oasc.Overseer$ClusterStateUpdater.updateState Assigning new node to shard shard=shard1
[junit4:junit4]   2> 9772 T91 oascc.ZkStateReader$2.process A cluster state change: WatchedEvent state:SyncConnected type:NodeDataChanged path:/clusterstate.json, has occurred - updating... (live nodes size: 2)
[junit4:junit4]   2> 9772 T97 oascc.ZkStateReader$2.process A cluster state change: WatchedEvent state:SyncConnected type:NodeDataChanged path:/clusterstate.json, has occurred - updating... (live nodes size: 2)
[junit4:junit4]   2> 9772 T110 oascc.ZkStateReader$2.process A cluster state change: WatchedEvent state:SyncConnected type:NodeDataChanged path:/clusterstate.json, has occurred - updating... (live nodes size: 2)
[junit4:junit4]   2> 10309 T111 oasc.CoreContainer.registerCore registering core: collection1
[junit4:junit4]   2> 10309 T111 oasc.ZkController.register Register replica - core:collection1 address:http://127.0.0.1:31610 collection:collection1 shard:shard1
[junit4:junit4]   2> 10310 T111 oascc.SolrZkClient.makePath makePath: /collections/collection1/leader_elect/shard1/election
[junit4:junit4]   2> 10340 T73 oazs.PrepRequestProcessor.pRequest Got user-level KeeperException when processing sessionid:0x13d3fa582da0006 type:delete cxid:0x48 zxid:0x5b txntype:-1 reqpath:n/a Error Path:/solr/collections/collection1/leaders Error:KeeperErrorCode = NoNode for /solr/collections/collection1/leaders
[junit4:junit4]   2> 10341 T111 oasc.ShardLeaderElectionContext.runLeaderProcess Running the leader process.
[junit4:junit4]   2> 10342 T73 oazs.PrepRequestProcessor.pRequest Got user-level KeeperException when processing sessionid:0x13d3fa582da0006 type:create cxid:0x49 zxid:0x5c txntype:-1 reqpath:n/a Error Path:/solr/overseer Error:KeeperErrorCode = NodeExists for /solr/overseer
[junit4:junit4]   2> 10352 T111 oasc.ShardLeaderElectionContext.waitForReplicasToComeUp Enough replicas found to continue.
[junit4:junit4]   2> 10352 T111 oasc.ShardLeaderElectionContext.runLeaderProcess I may be the new leader - try and sync
[junit4:junit4]   2> 10352 T111 oasc.SyncStrategy.sync Sync replicas to http://127.0.0.1:31610/collection1/
[junit4:junit4]   2> 10353 T111 oasc.SyncStrategy.syncReplicas Sync Success - now sync replicas to me
[junit4:junit4]   2> 10353 T111 oasc.SyncStrategy.syncToMe http://127.0.0.1:31610/collection1/ has no replicas
[junit4:junit4]   2> 10353 T111 oasc.ShardLeaderElectionContext.runLeaderProcess I am the new leader: http://127.0.0.1:31610/collection1/
[junit4:junit4]   2> 10354 T111 oascc.SolrZkClient.makePath makePath: /collections/collection1/leaders/shard1
[junit4:junit4]   2> 10360 T73 oazs.PrepRequestProcessor.pRequest Got user-level KeeperException when processing sessionid:0x13d3fa582da0006 type:create cxid:0x53 zxid:0x60 txntype:-1 reqpath:n/a Error Path:/solr/overseer Error:KeeperErrorCode = NodeExists for /solr/overseer
[junit4:junit4]   2> 11280 T92 oascc.ZkStateReader.updateClusterState Updating cloud state from ZooKeeper... 
[junit4:junit4]   2> 11299 T91 oascc.ZkStateReader$2.process A cluster state change: WatchedEvent state:SyncConnected type:NodeDataChanged path:/clusterstate.json, has occurred - updating... (live nodes size: 2)
[junit4:junit4]   2> 11299 T110 oascc.ZkStateReader$2.process A cluster state change: WatchedEvent state:SyncConnected type:NodeDataChanged path:/clusterstate.json, has occurred - updating... (live nodes size: 2)
[junit4:junit4]   2> 11299 T97 oascc.ZkStateReader$2.process A cluster state change: WatchedEvent state:SyncConnected type:NodeDataChanged path:/clusterstate.json, has occurred - updating... (live nodes size: 2)
[junit4:junit4]   2> 11333 T111 oasc.ZkController.register We are http://127.0.0.1:31610/collection1/ and leader is http://127.0.0.1:31610/collection1/
[junit4:junit4]   2> 11333 T111 oasc.ZkController.register No LogReplay needed for core=collection1 baseURL=http://127.0.0.1:31610
[junit4:junit4]   2> 11333 T111 oasc.ZkController.checkRecovery I am the leader, no recovery necessary
[junit4:junit4]   2> 11333 T111 oasc.ZkController.publish publishing core=collection1 state=active
[junit4:junit4]   2> 11334 T111 oasc.ZkController.publish numShards not found on descriptor - reading it from system property
[junit4:junit4]   2> 11336 T111 oascc.ZkStateReader.updateClusterState Updating cloud state from ZooKeeper... 
[junit4:junit4]   2> 11338 T68 oass.SolrDispatchFilter.init user.dir=/usr/home/hudson/hudson-slave/workspace/Lucene-Solr-Tests-4.x-Java6/solr/build/solr-core/test/J0
[junit4:junit4]   2> 11338 T68 oass.SolrDispatchFilter.init SolrDispatchFilter.init() done
[junit4:junit4]   2> 11339 T68 oascsi.HttpClientUtil.createClient Creating new http client, config:maxConnections=128&maxConnectionsPerHost=32&followRedirects=false
[junit4:junit4]   2> 11533 T68 oejs.Server.doStart jetty-8.1.8.v20121106
[junit4:junit4]   2> 11536 T68 oejs.AbstractConnector.doStart Started SocketConnector@127.0.0.1:15202
[junit4:junit4]   2> 11536 T68 oass.SolrDispatchFilter.init SolrDispatchFilter.init()
[junit4:junit4]   2> 11537 T68 oasc.SolrResourceLoader.locateSolrHome JNDI not configured for solr (NoInitialContextEx)
[junit4:junit4]   2> 11537 T68 oasc.SolrResourceLoader.locateSolrHome using system property solr.solr.home: /usr/home/hudson/hudson-slave/workspace/Lucene-Solr-Tests-4.x-Java6/solr/build/solr-core/test/J0/./org.apache.solr.cloud.SyncSliceTest-jetty2-1362572455371
[junit4:junit4]   2> 11538 T68 oasc.CoreContainer$Initializer.initialize looking for solr.xml: /usr/home/hudson/hudson-slave/workspace/Lucene-Solr-Tests-4.x-Java6/solr/build/solr-core/test/J0/./org.apache.solr.cloud.SyncSliceTest-jetty2-1362572455371/solr.xml
[junit4:junit4]   2> 11538 T68 oasc.CoreContainer.<init> New CoreContainer 50517683
[junit4:junit4]   2> 11539 T68 oasc.CoreContainer.load Loading CoreContainer using Solr Home: '/usr/home/hudson/hudson-slave/workspace/Lucene-Solr-Tests-4.x-Java6/solr/build/solr-core/test/J0/./org.apache.solr.cloud.SyncSliceTest-jetty2-1362572455371/'
[junit4:junit4]   2> 11540 T68 oasc.SolrResourceLoader.<init> new SolrResourceLoader for directory: '/usr/home/hudson/hudson-slave/workspace/Lucene-Solr-Tests-4.x-Java6/solr/build/solr-core/test/J0/./org.apache.solr.cloud.SyncSliceTest-jetty2-1362572455371/'
[junit4:junit4]   2> 11589 T68 oashc.HttpShardHandlerFactory.getParameter Setting socketTimeout to: 120000
[junit4:junit4]   2> 11589 T68 oashc.HttpShardHandlerFactory.getParameter Setting urlScheme to: http://
[junit4:junit4]   2> 11590 T68 oashc.HttpShardHandlerFactory.getParameter Setting connTimeout to: 15000
[junit4:junit4]   2> 11590 T68 oashc.HttpShardHandlerFactory.getParameter Setting maxConnectionsPerHost to: 20
[junit4:junit4]   2> 11591 T68 oashc.HttpShardHandlerFactory.getParameter Setting corePoolSize to: 0
[junit4:junit4]   2> 11591 T68 oashc.HttpShardHandlerFactory.getParameter Setting maximumPoolSize to: 2147483647
[junit4:junit4]   2> 11592 T68 oashc.HttpShardHandlerFactory.getParameter Setting maxThreadIdleTime to: 5
[junit4:junit4]   2> 11592 T68 oashc.HttpShardHandlerFactory.getParameter Setting sizeOfQueue to: -1
[junit4:junit4]   2> 11592 T68 oashc.HttpShardHandlerFactory.getParameter Setting fairnessPolicy to: false
[junit4:junit4]   2> 11593 T68 oascsi.HttpClientUtil.createClient Creating new http client, config:maxConnectionsPerHost=20&maxConnections=10000&socketTimeout=120000&connTimeout=15000&retry=false
[junit4:junit4]   2> 11614 T68 oasc.CoreContainer.load Registering Log Listener
[junit4:junit4]   2> 11633 T68 oasc.CoreContainer.initZooKeeper Zookeeper client=127.0.0.1:20857/solr
[junit4:junit4]   2> 11634 T68 oasc.ZkController.checkChrootPath zkHost includes chroot
[junit4:junit4]   2> 11636 T68 oaz.ZooKeeper.<init> Initiating client connection, connectString=127.0.0.1:20857 sessionTimeout=60000 watcher=org.apache.solr.common.cloud.ConnectionManager@798ef8a3
[junit4:junit4]   2> 11638 T68 oascc.ConnectionManager.waitForConnected Waiting for client to connect to ZooKeeper
[junit4:junit4]   2> 11638 T122 oaz.ClientCnxn$SendThread.logStartConnect Opening socket connection to server localhost/127.0.0.1:20857. Will not attempt to authenticate using SASL (access denied (javax.security.auth.AuthPermission getLoginConfiguration))
[junit4:junit4]   2> 11639 T122 oaz.ClientCnxn$SendThread.primeConnection Socket connection established to localhost/127.0.0.1:20857, initiating session
[junit4:junit4]   2> 11639 T70 oazs.NIOServerCnxnFactory.run Accepted socket connection from /140.211.11.196:15203
[junit4:junit4]   2> 11640 T70 oazs.ZooKeeperServer.processConnectRequest Client attempting to establish new session at /140.211.11.196:15203
[junit4:junit4]   2> 11642 T72 oazs.ZooKeeperServer.finishSessionInit Established session 0x13d3fa582da0007 with negotiated timeout 20000 for client /140.211.11.196:15203
[junit4:junit4]   2> 11642 T122 oaz.ClientCnxn$SendThread.onConnected Session establishment complete on server localhost/127.0.0.1:20857, sessionid = 0x13d3fa582da0007, negotiated timeout = 20000
[junit4:junit4]   2> 11643 T123 oascc.ConnectionManager.process Watcher org.apache.solr.common.cloud.ConnectionManager@798ef8a3 name:ZooKeeperConnection Watcher:127.0.0.1:20857 got event WatchedEvent state:SyncConnected type:None path:null path:null type:None
[junit4:junit4]   2> 11643 T68 oascc.ConnectionManager.waitForConnected Client is connected to ZooKeeper
[junit4:junit4]   2> 11645 T73 oazs.PrepRequestProcessor.pRequest2Txn Processed session termination for sessionid: 0x13d3fa582da0007
[junit4:junit4]   2> 11653 T123 oaz.ClientCnxn$EventThread.run EventThread shut down
[junit4:junit4]   2> 11653 T68 oaz.ZooKeeper.close Session: 0x13d3fa582da0007 closed
[junit4:junit4]   2> 11653 T70 oazs.NIOServerCnxn.closeSock Closed socket connection for client /140.211.11.196:15203 which had sessionid 0x13d3fa582da0007
[junit4:junit4]   2> 11654 T68 oascsi.HttpClientUtil.createClient Creating new http client, config:maxConnections=500&maxConnectionsPerHost=16&socketTimeout=120000&connTimeout=15000
[junit4:junit4]   2> 11666 T68 oaz.ZooKeeper.<init> Initiating client connection, connectString=127.0.0.1:20857/solr sessionTimeout=30000 watcher=org.apache.solr.common.cloud.ConnectionManager@12d67620
[junit4:junit4]   2> 11667 T68 oascc.ConnectionManager.waitForConnected Waiting for client to connect to ZooKeeper
[junit4:junit4]   2> 11667 T124 oaz.ClientCnxn$SendThread.logStartConnect Opening socket connection to server localhost/127.0.0.1:20857. Will not attempt to authenticate using SASL (access denied (javax.security.auth.AuthPermission getLoginConfiguration))
[junit4:junit4]   2> 11668 T124 oaz.ClientCnxn$SendThread.primeConnection Socket connection established to localhost/127.0.0.1:20857, initiating session
[junit4:junit4]   2> 11668 T70 oazs.NIOServerCnxnFactory.run Accepted socket connection from /140.211.11.196:15204
[junit4:junit4]   2> 11669 T70 oazs.ZooKeeperServer.processConnectRequest Client attempting to establish new session at /140.211.11.196:15204
[junit4:junit4]   2> 11670 T72 oazs.ZooKeeperServer.finishSessionInit Established session 0x13d3fa582da0008 with negotiated timeout 20000 for client /140.211.11.196:15204
[junit4:junit4]   2> 11670 T124 oaz.ClientCnxn$SendThread.onConnected Session establishment complete on server localhost/127.0.0.1:20857, sessionid = 0x13d3fa582da0008, negotiated timeout = 20000
[junit4:junit4]   2> 11671 T125 oascc.ConnectionManager.process Watcher org.apache.solr.common.cloud.ConnectionManager@12d67620 name:ZooKeeperConnection Watcher:127.0.0.1:20857/solr got event WatchedEvent state:SyncConnected type:None path:null path:null type:None
[junit4:junit4]   2> 11671 T68 oascc.ConnectionManager.waitForConnected Client is connected to ZooKeeper
[junit4:junit4]   2> 11674 T73 oazs.PrepRequestProcessor.pRequest Got user-level KeeperException when processing sessionid:0x13d3fa582da0008 type:create cxid:0x1 zxid:0x6d txntype:-1 reqpath:n/a Error Path:/solr/overseer Error:KeeperErrorCode = NodeExists for /solr/overseer
[junit4:junit4]   2> 11676 T73 oazs.PrepRequestProcessor.pRequest Got user-level KeeperException when processing sessionid:0x13d3fa582da0008 type:create cxid:0x2 zxid:0x6e txntype:-1 reqpath:n/a Error Path:/solr/overseer Error:KeeperErrorCode = NodeExists for /solr/overseer
[junit4:junit4]   2> 11678 T68 oascc.ZkStateReader.createClusterStateWatchersAndUpdate Updating cluster state from ZooKeeper... 
[junit4:junit4]   2> 12683 T68 oasc.ZkController.createEphemeralLiveNode Register node as live in ZooKeeper:/live_nodes/127.0.0.1:15202_
[junit4:junit4]   2> 12684 T73 oazs.PrepRequestProcessor.pRequest Got user-level KeeperException when processing sessionid:0x13d3fa582da0008 type:delete cxid:0x9 zxid:0x6f txntype:-1 reqpath:n/a Error Path:/solr/live_nodes/127.0.0.1:15202_ Error:KeeperErrorCode = NoNode for /solr/live_nodes/127.0.0.1:15202_
[junit4:junit4]   2> 12715 T68 oascc.SolrZkClient.makePath makePath: /live_nodes/127.0.0.1:15202_
[junit4:junit4]   2> 12719 T110 oascc.ZkStateReader$2.process A cluster state change: WatchedEvent state:SyncConnected type:NodeChildrenChanged path:/live_nodes, has occurred - updating... (live nodes size: 2)
[junit4:junit4]   2> 12720 T97 oascc.ZkStateReader$3.process Updating live nodes... (3)
[junit4:junit4]   2> 12720 T91 oascc.ZkStateReader$3.process Updating live nodes... (3)
[junit4:junit4]   2> 12720 T97 oascc.ZkStateReader$2.process A cluster state change: WatchedEvent state:SyncConnected type:NodeChildrenChanged path:/live_nodes, has occurred - updating... (live nodes size: 3)
[junit4:junit4]   2> 12720 T125 oascc.ZkStateReader$3.process Updating live nodes... (3)
[junit4:junit4]   2> 12720 T91 oascc.ZkStateReader$2.process A cluster state change: WatchedEvent state:SyncConnected type:NodeChildrenChanged path:/live_nodes, has occurred - updating... (live nodes size: 3)
[junit4:junit4]   2> 12722 T110 oascc.ZkStateReader$3.process Updating live nodes... (3)
[junit4:junit4]   2> 12743 T126 oasc.CoreContainer.create Creating SolrCore 'collection1' using instanceDir: /usr/home/hudson/hudson-slave/workspace/Lucene-Solr-Tests-4.x-Java6/solr/build/solr-core/test/J0/./org.apache.solr.cloud.SyncSliceTest-jetty2-1362572455371/collection1
[junit4:junit4]   2> 12743 T126 oasc.ZkController.createCollectionZkNode Check for collection zkNode:collection1
[junit4:junit4]   2> 12744 T126 oasc.ZkController.createCollectionZkNode Collection zkNode exists
[junit4:junit4]   2> 12744 T126 oasc.ZkController.readConfigName Load collection config from:/collections/collection1
[junit4:junit4]   2> 12746 T126 oasc.SolrResourceLoader.<init> new SolrResourceLoader for directory: '/usr/home/hudson/hudson-slave/workspace/Lucene-Solr-Tests-4.x-Java6/solr/build/solr-core/test/J0/./org.apache.solr.cloud.SyncSliceTest-jetty2-1362572455371/collection1/'
[junit4:junit4]   2> 12747 T126 oasc.SolrResourceLoader.replaceClassLoader Adding 'file:/usr/home/hudson/hudson-slave/workspace/Lucene-Solr-Tests-4.x-Java6/solr/build/solr-core/test/J0/org.apache.solr.cloud.SyncSliceTest-jetty2-1362572455371/collection1/lib/classes/' to classloader
[junit4:junit4]   2> 12748 T126 oasc.SolrResourceLoader.replaceClassLoader Adding 'file:/usr/home/hudson/hudson-slave/workspace/Lucene-Solr-Tests-4.x-Java6/solr/build/solr-core/test/J0/org.apache.solr.cloud.SyncSliceTest-jetty2-1362572455371/collection1/lib/README' to classloader
[junit4:junit4]   2> 12801 T126 oasc.SolrConfig.<init> Using Lucene MatchVersion: LUCENE_42
[junit4:junit4]   2> 12820 T92 oascc.ZkStateReader.updateClusterState Updating cloud state from ZooKeeper... 
[junit4:junit4]   2> 12821 T92 oasc.Overseer$ClusterStateUpdater.updateState Update state numShards=1 message={
[junit4:junit4]   2> 	  "operation":"state",
[junit4:junit4]   2> 	  "core_node_name":"2",
[junit4:junit4]   2> 	  "numShards":"1",
[junit4:junit4]   2> 	  "shard":"shard1",
[junit4:junit4]   2> 	  "roles":null,
[junit4:junit4]   2> 	  "state":"active",
[junit4:junit4]   2> 	  "core":"collection1",
[junit4:junit4]   2> 	  "collection":"collection1",
[junit4:junit4]   2> 	  "node_name":"127.0.0.1:31610_",
[junit4:junit4]   2> 	  "base_url":"http://127.0.0.1:31610"}
[junit4:junit4]   2> 12835 T91 oascc.ZkStateReader$2.process A cluster state change: WatchedEvent state:SyncConnected type:NodeDataChanged path:/clusterstate.json, has occurred - updating... (live nodes size: 3)
[junit4:junit4]   2> 12835 T97 oascc.ZkStateReader$2.process A cluster state change: WatchedEvent state:SyncConnected type:NodeDataChanged path:/clusterstate.json, has occurred - updating... (live nodes size: 3)
[junit4:junit4]   2> 12835 T110 oascc.ZkStateReader$2.process A cluster state change: WatchedEvent state:SyncConnected type:NodeDataChanged path:/clusterstate.json, has occurred - updating... (live nodes size: 3)
[junit4:junit4]   2> 12835 T125 oascc.ZkStateReader$2.process A cluster state change: WatchedEvent state:SyncConnected type:NodeDataChanged path:/clusterstate.json, has occurred - updating... (live nodes size: 3)
[junit4:junit4]   2> 12863 T126 oasc.SolrConfig.<init> Loaded SolrConfig: solrconfig.xml
[junit4:junit4]   2> 12965 T126 oass.IndexSchema.readSchema Reading Solr Schema
[junit4:junit4]   2> 12995 T126 oass.IndexSchema.readSchema Schema name=test
[junit4:junit4]   2> 13620 T126 oass.OpenExchangeRatesOrgProvider.init Initialized with rates=open-exchange-rates.json, refreshInterval=1440.
[junit4:junit4]   2> 13636 T126 oass.IndexSchema.readSchema default search field in schema is text
[junit4:junit4]   2> 13640 T126 oass.IndexSchema.readSchema unique key field: id
[junit4:junit4]   2> 13682 T126 oass.FileExchangeRateProvider.reload Reloading exchange rates from file currency.xml
[junit4:junit4]   2> 13689 T126 oass.FileExchangeRateProvider.reload Reloading exchange rates from file currency.xml
[junit4:junit4]   2> 13695 T126 oass.OpenExchangeRatesOrgProvider.reload Reloading exchange rates from open-exchange-rates.json
[junit4:junit4]   2> 13696 T126 oass.OpenExchangeRatesOrgProvider$OpenExchangeRates.<init> WARNING Unknown key IMPORTANT NOTE
[junit4:junit4]   2> 13697 T126 oass.OpenExchangeRatesOrgProvider$OpenExchangeRates.<init> WARNING Expected key, got STRING
[junit4:junit4]   2> 13697 T126 oass.OpenExchangeRatesOrgProvider.reload Reloading exchange rates from open-exchange-rates.json
[junit4:junit4]   2> 13699 T126 oass.OpenExchangeRatesOrgProvider$OpenExchangeRates.<init> WARNING Unknown key IMPORTANT NOTE
[junit4:junit4]   2> 13700 T126 oass.OpenExchangeRatesOrgProvider$OpenExchangeRates.<init> WARNING Expected key, got STRING
[junit4:junit4]   2> 13700 T126 oasc.SolrCore.<init> [collection1] Opening new SolrCore at /usr/home/hudson/hudson-slave/workspace/Lucene-Solr-Tests-4.x-Java6/solr/build/solr-core/test/J0/./org.apache.solr.cloud.SyncSliceTest-jetty2-1362572455371/collection1/, dataDir=./org.apache.solr.cloud.SyncSliceTest-1362572444026/jetty2/
[junit4:junit4]   2> 13700 T126 oasc.JmxMonitoredMap.<init> JMX monitoring is enabled. Adding Solr mbeans to JMX Server: com.sun.jmx.mbeanserver.JmxMBeanServer@66fdfc58
[junit4:junit4]   2> 13701 T126 oasc.SolrCore.initDirectoryFactory org.apache.solr.core.MockDirectoryFactory
[junit4:junit4]   2> 13703 T126 oasc.CachingDirectoryFactory.get return new directory for /usr/home/hudson/hudson-slave/workspace/Lucene-Solr-Tests-4.x-Java6/solr/build/solr-core/test/J0/./org.apache.solr.cloud.SyncSliceTest-1362572444026/jetty2 forceNew:false
[junit4:junit4]   2> 13703 T126 oasc.CachingDirectoryFactory.close Releasing directory:/usr/home/hudson/hudson-slave/workspace/Lucene-Solr-Tests-4.x-Java6/solr/build/solr-core/test/J0/./org.apache.solr.cloud.SyncSliceTest-1362572444026/jetty2
[junit4:junit4]   2> 13703 T126 oasc.SolrCore.getNewIndexDir New index directory detected: old=null new=./org.apache.solr.cloud.SyncSliceTest-1362572444026/jetty2/index/
[junit4:junit4]   2> 13704 T126 oasc.SolrCore.initIndex WARNING [collection1] Solr index directory './org.apache.solr.cloud.SyncSliceTest-1362572444026/jetty2/index' doesn't exist. Creating new index...
[junit4:junit4]   2> 13705 T126 oasc.CachingDirectoryFactory.get return new directory for /usr/home/hudson/hudson-slave/workspace/Lucene-Solr-Tests-4.x-Java6/solr/build/solr-core/test/J0/./org.apache.solr.cloud.SyncSliceTest-1362572444026/jetty2/index forceNew:false
[junit4:junit4]   2> 13708 T126 oasc.SolrDeletionPolicy.onCommit SolrDeletionPolicy.onCommit: commits:num=1
[junit4:junit4]   2> 		commit{dir=BaseDirectoryWrapper(org.apache.lucene.store.RAMDirectory@29aaa31f lockFactory=org.apache.lucene.store.NativeFSLockFactory@33fda70b),segFN=segments_1,generation=1,filenames=[segments_1]
[junit4:junit4]   2> 13708 T126 oasc.SolrDeletionPolicy.updateCommits newest commit = 1[segments_1]
[junit4:junit4]   2> 13709 T126 oasc.CachingDirectoryFactory.close Releasing directory:/usr/home/hudson/hudson-slave/workspace/Lucene-Solr-Tests-4.x-Java6/solr/build/solr-core/test/J0/./org.apache.solr.cloud.SyncSliceTest-1362572444026/jetty2/index
[junit4:junit4]   2> 13711 T126 oasup.UpdateRequestProcessorChain.init inserting DistributedUpdateProcessorFactory into updateRequestProcessorChain "dedupe"
[junit4:junit4]   2> 13712 T126 oasup.UpdateRequestProcessorChain.init inserting DistributedUpdateProcessorFactory into updateRequestProcessorChain "stored_sig"
[junit4:junit4]   2> 13712 T126 oasup.UpdateRequestProcessorChain.init inserting DistributedUpdateProcessorFactory into updateRequestProcessorChain "distrib-dup-test-chain-implicit"
[junit4:junit4]   2> 13713 T126 oasc.RequestHandlers.initHandlersFromConfig created standard: solr.StandardRequestHandler
[junit4:junit4]   2> 13714 T126 oasc.RequestHandlers.initHandlersFromConfig created /get: solr.RealTimeGetHandler
[junit4:junit4]   2> 13715 T126 oasc.RequestHandlers.initHandlersFromConfig adding lazy requestHandler: solr.ReplicationHandler
[junit4:junit4]   2> 13715 T126 oasc.RequestHandlers.initHandlersFromConfig created /replication: solr.ReplicationHandler
[junit4:junit4]   2> 13716 T126 oasc.RequestHandlers.initHandlersFromConfig created /update: solr.UpdateRequestHandler
[junit4:junit4]   2> 13716 T126 oasc.RequestHandlers.initHandlersFromConfig created /admin/: org.apache.solr.handler.admin.AdminHandlers
[junit4:junit4]   2> 13724 T126 oashl.XMLLoader.init xsltCacheLifetimeSeconds=60
[junit4:junit4]   2> 13730 T126 oasc.CachingDirectoryFactory.close Releasing directory:/usr/home/hudson/hudson-slave/workspace/Lucene-Solr-Tests-4.x-Java6/solr/build/solr-core/test/J0/./org.apache.solr.cloud.SyncSliceTest-1362572444026/jetty2
[junit4:junit4]   2> 13731 T126 oass.SolrIndexSearcher.<init> Opening Searcher@2ca8fc2d main
[junit4:junit4]   2> 13731 T126 oasu.UpdateHandler.clearLog Clearing tlog files, tlogDir=./org.apache.solr.cloud.SyncSliceTest-1362572444026/jetty2/tlog
[junit4:junit4]   2> 13732 T126 oasu.CommitTracker.<init> Hard AutoCommit: disabled
[junit4:junit4]   2> 13733 T126 oasu.CommitTracker.<init> Soft AutoCommit: disabled
[junit4:junit4]   2> 13737 T127 oasc.SolrCore.registerSearcher [collection1] Registered new searcher Searcher@2ca8fc2d main{StandardDirectoryReader(segments_1:1)}
[junit4:junit4]   2> 13740 T126 oasc.ZkController.publish publishing core=collection1 state=down
[junit4:junit4]   2> 13740 T126 oasc.ZkController.publish numShards not found on descriptor - reading it from system property
[junit4:junit4]   2> 14343 T92 oascc.ZkStateReader.updateClusterState Updating cloud state from ZooKeeper... 
[junit4:junit4]   2> 14344 T92 oasc.Overseer$ClusterStateUpdater.updateState Update state numShards=1 message={
[junit4:junit4]   2> 	  "operation":"state",
[junit4:junit4]   2> 	  "core_node_name":"3",
[junit4:junit4]   2> 	  "numShards":"1",
[junit4:junit4]   2> 	  "shard":null,
[junit4:junit4]   2> 	  "roles":null,
[junit4:junit4]   2> 	  "state":"down",
[junit4:junit4]   2> 	  "core":"collection1",
[junit4:junit4]   2> 	  "collection":"collection1",
[junit4:junit4]   2> 	  "node_name":"127.0.0.1:15202_",
[junit4:junit4]   2> 	  "base_url":"http://127.0.0.1:15202"}
[junit4:junit4]   2> 14344 T92 oasc.Overseer$ClusterStateUpdater.updateState Collection already exists with numShards=1
[junit4:junit4]   2> 14344 T92 oasc.Overseer$ClusterStateUpdater.updateState Assigning new node to shard shard=shard1
[junit4:junit4]   2> 14357 T91 oascc.ZkStateReader$2.process A cluster state change: WatchedEvent state:SyncConnected type:NodeDataChanged path:/clusterstate.json, has occurred - updating... (live nodes size: 3)
[junit4:junit4]   2> 14357 T110 oascc.ZkStateReader$2.process A cluster state change: WatchedEvent state:SyncConnected type:NodeDataChanged path:/clusterstate.json, has occurred - updating... (live nodes size: 3)
[junit4:junit4]   2> 14357 T97 oascc.ZkStateReader$2.process A cluster state change: WatchedEvent state:SyncConnected type:NodeDataChanged path:/clusterstate.json, has occurred - updating... (live nodes size: 3)
[junit4:junit4]   2> 14357 T125 oascc.ZkStateReader$2.process A cluster state change: WatchedEvent state:SyncConnected type:NodeDataChanged path:/clusterstate.json, has occurred - updating... (live nodes size: 3)
[junit4:junit4]   2> 14747 T126 oasc.CoreContainer.registerCore registering core: collection1
[junit4:junit4]   2> 14747 T126 oasc.ZkController.register Register replica - core:collection1 address:http://127.0.0.1:15202 collection:collection1 shard:shard1
[junit4:junit4]   2> 14752 T126 oasc.ZkController.register We are http://127.0.0.1:15202/collection1/ and leader is http://127.0.0.1:31610/collection1/
[junit4:junit4]   2> 14752 T126 oasc.ZkController.register No LogReplay needed for core=collection1 baseURL=http://127.0.0.1:15202
[junit4:junit4]   2> 14752 T126 oasc.ZkController.checkRecovery Core needs to recover:collection1
[junit4:junit4]   2> 14753 T126 oasu.DefaultSolrCoreState.doRecovery Running recovery - first canceling any ongoing recovery
[junit4:junit4]   2> ASYNC  NEW_CORE C2 name=collection1 org.apache.solr.core.SolrCore@8aa35b url=http://127.0.0.1:15202/collection1 node=127.0.0.1:15202_ C2_STATE=coll:collection1 core:collection1 props:{state=down, core=collection1, collection=collection1, node_name=127.0.0.1:15202_, base_url=http://127.0.0.1:15202}
[junit4:junit4]   2> 14759 T128 C2 P15202 oasc.RecoveryStrategy.run Starting recovery process.  core=collection1 recoveringAfterStartup=true
[junit4:junit4]   2> 14760 T126 oascc.ZkStateReader.updateClusterState Updating cloud state from ZooKeeper... 
[junit4:junit4]   2> 14760 T128 C2 P15202 oasc.RecoveryStrategy.doRecovery ###### startupVersions=[]
[junit4:junit4]   2> 14760 T128 C2 P15202 oasc.ZkController.publish publishing core=collection1 state=recovering
[junit4:junit4]   2> 14761 T128 C2 P15202 oasc.ZkController.publish numShards not found on descriptor - reading it from system property
[junit4:junit4]   2> 14761 T68 oass.SolrDispatchFilter.init user.dir=/usr/home/hudson/hudson-slave/workspace/Lucene-Solr-Tests-4.x-Java6/solr/build/solr-core/test/J0
[junit4:junit4]   2> 14762 T68 oass.SolrDispatchFilter.init SolrDispatchFilter.init() done
[junit4:junit4]   2> 14762 T68 oascsi.HttpClientUtil.createClient Creating new http client, config:maxConnections=128&maxConnectionsPerHost=32&followRedirects=false
[junit4:junit4]   2> 14852 T128 C2 P15202 oascsi.HttpClientUtil.createClient Creating new http client, config:maxConnections=128&maxConnectionsPerHost=32&followRedirects=false
[junit4:junit4]   2> 14983 T68 oejs.Server.doStart jetty-8.1.8.v20121106
[junit4:junit4]   2> 14992 T68 oejs.AbstractConnector.doStart Started SocketConnector@127.0.0.1:15210
[junit4:junit4]   2> 14994 T68 oass.SolrDispatchFilter.init SolrDispatchFilter.init()
[junit4:junit4]   2> 14994 T68 oasc.SolrResourceLoader.locateSolrHome JNDI not configured for solr (NoInitialContextEx)
[junit4:junit4]   2> 14995 T68 oasc.SolrResourceLoader.locateSolrHome using system property solr.solr.home: /usr/home/hudson/hudson-slave/workspace/Lucene-Solr-Tests-4.x-Java6/solr/build/solr-core/test/J0/./org.apache.solr.cloud.SyncSliceTest-jetty3-1362572458794
[junit4:junit4]   2> 14996 T68 oasc.CoreContainer$Initializer.initialize looking for solr.xml: /usr/home/hudson/hudson-slave/workspace/Lucene-Solr-Tests-4.x-Java6/solr/build/solr-core/test/J0/./org.apache.solr.cloud.SyncSliceTest-jetty3-1362572458794/solr.xml
[junit4:junit4]   2> 14996 T68 oasc.CoreContainer.<init> New CoreContainer 1822751095
[junit4:junit4]   2> 14998 T68 oasc.CoreContainer.load Loading CoreContainer using Solr Home: '/usr/home/hudson/hudson-slave/workspace/Lucene-Solr-Tests-4.x-Java6/solr/build/solr-core/test/J0/./org.apache.solr.cloud.SyncSliceTest-jetty3-1362572458794/'
[junit4:junit4]   2> 14998 T68 oasc.SolrResourceLoader.<init> new SolrResourceLoader for directory: '/usr/home/hudson/hudson-slave/workspace/Lucene-Solr-Tests-4.x-Java6/solr/build/solr-core/test/J0/./org.apache.solr.cloud.SyncSliceTest-jetty3-1362572458794/'
[junit4:junit4]   2> 15213 T68 oashc.HttpShardHandlerFactory.getParameter Setting socketTimeout to: 120000
[junit4:junit4]   2> 15213 T68 oashc.HttpShardHandlerFactory.getParameter Setting urlScheme to: http://
[junit4:junit4]   2> 15214 T68 oashc.HttpShardHandlerFactory.getParameter Setting connTimeout to: 15000
[junit4:junit4]   2> 15214 T68 oashc.HttpShardHandlerFactory.getParameter Setting maxConnectionsPerHost to: 20
[junit4:junit4]   2> 15215 T68 oashc.HttpShardHandlerFactory.getParameter Setting corePoolSize to: 0
[junit4:junit4]   2> 15215 T68 oashc.HttpShardHandlerFactory.getParameter Setting maximumPoolSize to: 2147483647
[junit4:junit4]   2> 15215 T68 oashc.HttpShardHandlerFactory.getParameter Setting maxThreadIdleTime to: 5
[junit4:junit4]   2> 15216 T68 oashc.HttpShardHandlerFactory.getParameter Setting sizeOfQueue to: -1
[junit4:junit4]   2> 15216 T68 oashc.HttpShardHandlerFactory.getParameter Setting fairnessPolicy to: false
[junit4:junit4]   2> 15217 T68 oascsi.HttpClientUtil.createClient Creating new http client, config:maxConnectionsPerHost=20&maxConnections=10000&socketTimeout=120000&connTimeout=15000&retry=false
[junit4:junit4]   2> 15259 T68 oasc.CoreContainer.load Registering Log Listener
[junit4:junit4]   2> 15399 T68 oasc.CoreContainer.initZooKeeper Zookeeper client=127.0.0.1:20857/solr
[junit4:junit4]   2> 15399 T68 oasc.ZkController.checkChrootPath zkHost includes chroot
[junit4:junit4]   2> 15400 T68 oaz.ZooKeeper.<init> Initiating client connection, connectString=127.0.0.1:20857 sessionTimeout=60000 watcher=org.apache.solr.common.cloud.ConnectionManager@26ec9e7b
[junit4:junit4]   2> 15401 T68 oascc.ConnectionManager.waitForConnected Waiting for client to connect to ZooKeeper
[junit4:junit4]   2> 15402 T138 oaz.ClientCnxn$SendThread.logStartConnect Opening socket connection to server localhost/127.0.0.1:20857. Will not attempt to authenticate using SASL (access denied (javax.security.auth.AuthPermission getLoginConfiguration))
[junit4:junit4]   2> 15403 T138 oaz.ClientCnxn$SendThread.primeConnection Socket connection established to localhost/127.0.0.1:20857, initiating session
[junit4:junit4]   2> 15403 T70 oazs.NIOServerCnxnFactory.run Accepted socket connection from /140.211.11.196:15245
[junit4:junit4]   2> 15403 T70 oazs.ZooKeeperServer.processConnectRequest Client attempting to establish new session at /140.211.11.196:15245
[junit4:junit4]   2> 15409 T72 oazs.ZooKeeperServer.finishSessionInit Established session 0x13d3fa582da0009 with negotiated timeout 20000 for client /140.211.11.196:15245
[junit4:junit4]   2> 15410 T138 oaz.ClientCnxn$SendThread.onConnected Session establishment complete on server localhost/127.0.0.1:20857, sessionid = 0x13d3fa582da0009, negotiated timeout = 20000
[junit4:junit4]   2> 15410 T139 oascc.ConnectionManager.process Watcher org.apache.solr.common.cloud.ConnectionManager@26ec9e7b name:ZooKeeperConnection Watcher:127.0.0.1:20857 got event WatchedEvent state:SyncConnected type:None path:null path:null type:None
[junit4:junit4]   2> 15410 T68 oascc.ConnectionManager.waitForConnected Client is connected to ZooKeeper
[junit4:junit4]   2> 15412 T73 oazs.PrepRequestProcessor.pRequest2Txn Processed session termination for sessionid: 0x13d3fa582da0009
[junit4:junit4]   2> 15421 T70 oazs.NIOServerCnxn.closeSock Closed socket connection for client /140.211.11.196:15245 which had sessionid 0x13d3fa582da0009
[junit4:junit4]   2> 15421 T139 oaz.ClientCnxn$EventThread.run EventThread shut down
[junit4:junit4]   2> 15421 T68 oaz.ZooKeeper.close Session: 0x13d3fa582da0009 closed
[junit4:junit4]   2> 15422 T68 oascsi.HttpClientUtil.createClient Creating new http client, config:maxConnections=500&maxConnectionsPerHost=16&socketTimeout=120000&connTimeout=15000
[junit4:junit4]   2> 15445 T68 oaz.ZooKeeper.<init> Initiating client connection, connectString=127.0.0.1:20857/solr sessionTimeout=30000 watcher=org.apache.solr.common.cloud.ConnectionManager@3f235f86
[junit4:junit4]   2> 15446 T68 oascc.ConnectionManager.waitForConnected Waiting for client to connect to ZooKeeper
[junit4:junit4]   2> 15447 T140 oaz.ClientCnxn$SendThread.logStartConnect Opening socket connection to server localhost/127.0.0.1:20857. Will not attempt to authenticate using SASL (access denied (javax.security.auth.AuthPermission getLoginConfiguration))
[junit4:junit4]   2> 15447 T140 oaz.ClientCnxn$SendThread.primeConnection Socket connection established to localhost/127.0.0.1:20857, initiating session
[junit4:junit4]   2> 15448 T70 oazs.NIOServerCnxnFactory.run Accepted socket connection from /140.211.11.196:15246
[junit4:junit4]   2> 15448 T70 oazs.ZooKeeperServer.processConnectRequest Client attempting to establish new session at /140.211.11.196:15246
[junit4:junit4]   2> 15453 T72 oazs.ZooKeeperServer.finishSessionInit Established session 0x13d3fa582da000a with negotiated timeout 20000 for client /140.211.11.196:15246
[junit4:junit4]   2> 15453 T140 oaz.ClientCnxn$SendThread.onConnected Session establishment complete on server localhost/127.0.0.1:20857, sessionid = 0x13d3fa582da000a, negotiated timeout = 20000
[junit4:junit4]   2> 15453 T141 oascc.ConnectionManager.process Watcher org.apache.solr.common.cloud.ConnectionManager@3f235f86 name:ZooKeeperConnection Watcher:127.0.0.1:20857/solr got event WatchedEvent state:SyncConnected type:None path:null path:null type:None
[junit4:junit4]   2> 15454 T68 oascc.ConnectionManager.waitForConnected Client is connected to ZooKeeper
[junit4:junit4]   2> 15455 T73 oazs.PrepRequestProcessor.pRequest Got user-level KeeperException when processing sessionid:0x13d3fa582da000a type:create cxid:0x1 zxid:0x80 txntype:-1 reqpath:n/a Error Path:/solr/overseer Error:KeeperErrorCode = NodeExists for /solr/overseer
[junit4:junit4]   2> 15457 T73 oazs.PrepRequestProcessor.pRequest Got user-level KeeperException when processing sessionid:0x13d3fa582da000a type:create cxid:0x2 zxid:0x81 txntype:-1 reqpath:n/a Error Path:/solr/overseer Error:KeeperErrorCode = NodeExists for /solr/overseer
[junit4:junit4]   2> 15460 T68 oascc.ZkStateReader.createClusterStateWatchersAndUpdate Updating cluster state from ZooKeeper... 
[junit4:junit4]   2> 15865 T92 oascc.ZkStateReader.updateClusterState Updating cloud state from ZooKeeper... 
[junit4:junit4]   2> 15866 T92 oasc.Overseer$ClusterStateUpdater.updateState Update state numShards=1 message={
[junit4:junit4]   2> 	  "operation":"state",
[junit4:junit4]   2> 	  "core_node_name":"3",
[junit4:junit4]   2> 	  "numShards":"1",
[junit4:junit4]   2> 	  "shard":"shard1",
[junit4:junit4]   2> 	  "roles":null,
[junit4:junit4]   2> 	  "state":"recovering",
[junit4:junit4]   2> 	  "core":"collection1",
[junit4:junit4]   2> 	  "collection":"collection1",
[junit4:junit4]   2> 	  "node_name":"127.0.0.1:15202_",
[junit4:junit4]   2> 	  "base_url":"http://127.0.0.1:15202"}
[junit4:junit4]   2> 15890 T91 oascc.ZkStateReader$2.process A cluster state change: WatchedEvent state:SyncConnected type:NodeDataChanged path:/clusterstate.json, has occurred - updating... (live nodes size: 3)
[junit4:junit4]   2> 15890 T97 oascc.ZkStateReader$2.process A cluster state change: WatchedEvent state:SyncConnected type:NodeDataChanged path:/clusterstate.json, has occurred - updating... (live nodes size: 3)
[junit4:junit4]   2> 15890 T141 oascc.ZkStateReader$2.process A cluster state change: WatchedEvent state:SyncConnected type:NodeDataChanged path:/clusterstate.json, has occurred - updating... (live nodes size: 3)
[junit4:junit4]   2> 15890 T110 oascc.ZkStateReader$2.process A cluster state change: WatchedEvent state:SyncConnected type:NodeDataChanged path:/clusterstate.json, has occurred - updating... (live nodes size: 3)
[junit4:junit4]   2> 15890 T125 oascc.ZkStateReader$2.process A cluster state change: WatchedEvent state:SyncConnected type:NodeDataChanged path:/clusterstate.json, has occurred - updating... (live nodes size: 3)
[junit4:junit4]   2> 16383 T100 oass.SolrDispatchFilter.handleAdminRequest /admin/cores {coreNodeName=3&state=recovering&nodeName=127.0.0.1:15202_&action=PREPRECOVERY&checkLive=true&core=collection1&wt=javabin&onlyIfLeader=true&version=2} status=0 QTime=9 
[junit4:junit4]   2> 16465 T68 oasc.ZkController.createEphemeralLiveNode Register node as live in ZooKeeper:/live_nodes/127.0.0.1:15210_
[junit4:junit4]   2> 16467 T73 oazs.PrepRequestProcessor.pRequest Got user-level KeeperException when processing sessionid:0x13d3fa582da000a type:delete cxid:0xb zxid:0x86 txntype:-1 reqpath:n/a Error Path:/solr/live_nodes/127.0.0.1:15210_ Error:KeeperErrorCode = NoNode for /solr/live_nodes/127.0.0.1:15210_
[junit4:junit4]   2> 16475 T68 oascc.SolrZkClient.makePath makePath: /live_nodes/127.0.0.1:15210_
[junit4:junit4]   2> 16489 T110 oascc.ZkStateReader$2.process A cluster state change: WatchedEvent state:SyncConnected type:NodeChildrenChanged path:/live_nodes, has occurred - updating... (live nodes size: 3)
[junit4:junit4]   2> 16491 T91 oascc.ZkStateReader$3.process Updating live nodes... (4)
[junit4:junit4]   2> 16491 T141 oascc.ZkStateReader$3.process Updating live nodes... (4)
[junit4:junit4]   2> 16494 T141 oascc.ZkStateReader$2.process A cluster state change: WatchedEvent state:SyncConnected type:NodeChildrenChanged path:/live_nodes, has occurred - updating... (live nodes size: 4)
[junit4:junit4]   2> 16490 T125 oascc.ZkStateReader$3.process Updating live nodes... (4)
[junit4:junit4]   2> 16490 T97 oascc.ZkStateReader$3.process Updating live nodes... (4)
[junit4:junit4]   2> 16499 T97 oascc.ZkStateReader$2.process A cluster state change: WatchedEvent state:SyncConnected type:NodeChildrenChanged path:/live_nodes, has occurred - updating... (live nodes size: 4)
[junit4:junit4]   2> 16494 T110 oascc.ZkStateReader$3.process Updating live nodes... (4)
[junit4:junit4]   2> 16493 T91 oascc.ZkStateReader$2.process A cluster state change: WatchedEvent state:SyncConnected type:NodeChildrenChanged path:/live_nodes, has occurred - updating... (live nodes size: 4)
[junit4:junit4]   2> 16497 T125 oascc.ZkStateReader$2.process A cluster state change: WatchedEvent state:SyncConnected type:NodeChildrenChanged path:/live_nodes, has occurred - updating... (live nodes size: 4)
[junit4:junit4]   2> 16541 T142 oasc.CoreContainer.create Creating SolrCore 'collection1' using instanceDir: /usr/home/hudson/hudson-slave/workspace/Lucene-Solr-Tests-4.x-Java6/solr/build/solr-core/test/J0/./org.apache.solr.cloud.SyncSliceTest-jetty3-1362572458794/collection1
[junit4:junit4]   2> 16542 T142 oasc.ZkController.createCollectionZkNode Check for collection zkNode:collection1
[junit4:junit4]   2> 16544 T142 oasc.ZkController.createCollectionZkNode Collection zkNode exists
[junit4:junit4]   2> 16544 T142 oasc.ZkController.readConfigName Load collection config from:/collections/collection1
[junit4:junit4]   2> 16547 T142 oasc.SolrResourceLoader.<init> new SolrResourceLoader for directory: '/usr/home/hudson/hudson-slave/workspace/Lucene-Solr-Tests-4.x-Java6/solr/build/solr-core/test/J0/./org.apache.solr.cloud.SyncSliceTest-jetty3-1362572458794/collection1/'
[junit4:junit4]   2> 16549 T142 oasc.SolrResourceLoader.replaceClassLoader Adding 'file:/usr/home/hudson/hudson-slave/workspace/Lucene-Solr-Tests-4.x-Java6/solr/build/solr-core/test/J0/org.apache.solr.cloud.SyncSliceTest-jetty3-1362572458794/collection1/lib/classes/' to classloader
[junit4:junit4]   2> 16550 T142 oasc.SolrResourceLoader.replaceClassLoader Adding 'file:/usr/home/hudson/hudson-slave/workspace/Lucene-Solr-Tests-4.x-Java6/solr/build/solr-core/test/J0/org.apache.solr.cloud.SyncSliceTest-jetty3-1362572458794/collection1/lib/README' to classloader
[junit4:junit4]   2> 16663 T142 oasc.SolrConfig.<init> Using Lucene MatchVersion: LUCENE_42
[junit4:junit4]   2> 16738 T142 oasc.SolrConfig.<init> Loaded SolrConfig: solrconfig.xml
[junit4:junit4]   2> 16839 T142 oass.IndexSchema.readSchema Reading Solr Schema
[junit4:junit4]   2> 16865 T142 oass.IndexSchema.readSchema Schema name=test
[junit4:junit4]   2> 17477 T142 oass.OpenExchangeRatesOrgProvider.init Initialized with rates=open-exchange-rates.json, refreshInterval=1440.
[junit4:junit4]   2> 17490 T142 oass.IndexSchema.readSchema default search field in schema is text
[junit4:junit4]   2> 17493 T142 oass.IndexSchema.readSchema unique key field: id
[junit4:junit4]   2> 17517 T142 oass.FileExchangeRateProvider.reload Reloading exchange rates from file currency.xml
[junit4:junit4]   2> 17522 T142 oass.FileExchangeRateProvider.reload Reloading exchange rates from file currency.xml
[junit4:junit4]   2> 17527 T142 oass.OpenExchangeRatesOrgProvider.reload Reloading exchange rates from open-exchange-rates.json
[junit4:junit4]   2> 17528 T142 oass.OpenExchangeRatesOrgProvider$OpenExchangeRates.<init> WARNING Unknown key IMPORTANT NOTE
[junit4:junit4]   2> 17529 T142 oass.OpenExchangeRatesOrgProvider$OpenExchangeRates.<init> WARNING Expected key, got STRING
[junit4:junit4]   2> 17529 T142 oass.OpenExchangeRatesOrgProvider.reload Reloading exchange rates from open-exchange-rates.json
[junit4:junit4]   2> 17531 T142 oass.OpenExchangeRatesOrgProvider$OpenExchangeRates.<init> WARNING Unknown key IMPORTANT NOTE
[junit4:junit4]   2> 17532 T142 oass.OpenExchangeRatesOrgProvider$OpenExchangeRates.<init> WARNING Expected key, got STRING
[junit4:junit4]   2> 17532 T142 oasc.SolrCore.<init> [collection1] Opening new SolrCore at /usr/home/hudson/hudson-slave/workspace/Lucene-Solr-Tests-4.x-Java6/solr/build/solr-core/test/J0/./org.apache.solr.cloud.SyncSliceTest-jetty3-1362572458794/collection1/, dataDir=./org.apache.solr.cloud.SyncSliceTest-1362572444026/jetty3/
[junit4:junit4]   2> 17533 T142 oasc.JmxMonitoredMap.<init> JMX monitoring is enabled. Adding Solr mbeans to JMX Server: com.sun.jmx.mbeanserver.JmxMBeanServer@66fdfc58
[junit4:junit4]   2> 17533 T142 oasc.SolrCore.initDirectoryFactory org.apache.solr.core.MockDirectoryFactory
[junit4:junit4]   2> 17535 T142 oasc.CachingDirectoryFactory.get return new directory for /usr/home/hudson/hudson-slave/workspace/Lucene-Solr-Tests-4.x-Java6/solr/build/solr-core/test/J0/./org.apache.solr.cloud.SyncSliceTest-1362572444026/jetty3 forceNew:false
[junit4:junit4]   2> 17535 T142 oasc.CachingDirectoryFactory.close Releasing directory:/usr/home/hudson/hudson-slave/workspace/Lucene-Solr-Tests-4.x-Java6/solr/build/solr-core/test/J0/./org.apache.solr.cloud.SyncSliceTest-1362572444026/jetty3
[junit4:junit4]   2> 17536 T142 oasc.SolrCore.getNewIndexDir New index directory detected: old=null new=./org.apache.solr.cloud.SyncSliceTest-1362572444026/jetty3/index/
[junit4:junit4]   2> 17536 T142 oasc.SolrCore.initIndex WARNING [collection1] Solr index directory './org.apache.solr.cloud.SyncSliceTest-1362572444026/jetty3/index' doesn't exist. Creating new index...
[junit4:junit4]   2> 17537 T142 oasc.CachingDirectoryFactory.get return new directory for /usr/home/hudson/hudson-slave/workspace/Lucene-Solr-Tests-4.x-Java6/solr/build/solr-core/test/J0/./org.apache.solr.cloud.SyncSliceTest-1362572444026/jetty3/index forceNew:false
[junit4:junit4]   2> 17539 T142 oasc.SolrDeletionPolicy.onCommit SolrDeletionPolicy.onCommit: commits:num=1
[junit4:junit4]   2> 		commit{dir=BaseDirectoryWrapper(org.apache.lucene.store.RAMDirectory@161c8d89 lockFactory=org.apache.lucene.store.NativeFSLockFactory@2c60db95),segFN=segments_1,generation=1,filenames=[segments_1]
[junit4:junit4]   2> 17539 T142 oasc.SolrDeletionPolicy.updateCommits newest commit = 1[segments_1]
[junit4:junit4]   2> 17540 T142 oasc.CachingDirectoryFactory.close Releasing directory:/usr/home/hudson/hudson-slave/workspace/Lucene-Solr-Tests-4.x-Java6/solr/build/solr-core/test/J0/./org.apache.solr.cloud.SyncSliceTest-1362572444026/jetty3/index
[junit4:junit4]   2> 17542 T142 oasup.UpdateRequestProcessorChain.init inserting DistributedUpdateProcessorFactory into updateRequestProcessorChain "dedupe"
[junit4:junit4]   2> 17543 T142 oasup.UpdateRequestProcessorChain.init inserting DistributedUpdateProcessorFactory into updateRequestProcessorChain "stored_sig"
[junit4:junit4]   2> 17543 T142 oasup.UpdateRequestProcessorChain.init inserting DistributedUpdateProcessorFactory into updateRequestProcessorChain "distrib-dup-test-chain-implicit"
[junit4:junit4]   2> 17544 T142 oasc.RequestHandlers.initHandlersFromConfig created standard: solr.StandardRequestHandler
[junit4:junit4]   2> 17544 T142 oasc.RequestHandlers.initHandlersFromConfig created /get: solr.RealTimeGetHandler
[junit4:junit4]   2> 17545 T142 oasc.RequestHandlers.initHandlersFromConfig adding lazy requestHandler: solr.ReplicationHandler
[junit4:junit4]   2> 17545 T142 oasc.RequestHandlers.initHandlersFromConfig created /replication: solr.ReplicationHandler
[junit4:junit4]   2> 17546 T142 oasc.RequestHandlers.initHandlersFromConfig created /update: solr.UpdateRequestHandler
[junit4:junit4]   2> 17546 T142 oasc.RequestHandlers.initHandlersFromConfig created /admin/: org.apache.solr.handler.admin.AdminHandlers
[junit4:junit4]   2> 17551 T142 oashl.XMLLoader.init xsltCacheLifetimeSeconds=60
[junit4:junit4]   2> 17555 T142 oasc.CachingDirectoryFactory.close Releasing directory:/usr/home/hudson/hudson-slave/workspace/Lucene-Solr-Tests-4.x-Java6/solr/build/solr-core/test/J0/./org.apache.solr.cloud.SyncSliceTest-1362572444026/jetty3
[junit4:junit4]   2> 17556 T142 oass.SolrIndexSearcher.<init> Opening Searcher@50b5c214 main
[junit4:junit4]   2> 17556 T142 oasu.UpdateHandler.clearLog Clearing tlog files, tlogDir=./org.apache.solr.cloud.SyncSliceTest-1362572444026/jetty3/tlog
[junit4:junit4]   2> 17557 T142 oasu.CommitTracker.<init> Hard AutoCommit: disabled
[junit4:junit4]   2> 17557 T142 oasu.CommitTracker.<init> Soft AutoCommit: disabled
[junit4:junit4]   2> 17563 T143 oasc.SolrCore.registerSearcher [collection1] Registered new searcher Searcher@50b5c214 main{StandardDirectoryReader(segments_1:1)}
[junit4:junit4]   2> 17566 T142 oasc.ZkController.publish publishing core=collection1 state=down
[junit4:junit4]   2> 17566 T142 oasc.ZkController.publish numShards not found on descriptor - reading it from system property
[junit4:junit4]   2>  C2_STATE=coll:collection1 core:collection1 props:{shard=shard1, state=recovering, core=collection1, collection=collection1, node_name=127.0.0.1:15202_, base_url=http://127.0.0.1:15202}
[junit4:junit4]   2> 18594 T128 C2 P15202 oasc.RecoveryStrategy.doRecovery Attempting to PeerSync from http://127.0.0.1:31610/collection1/ core=collection1 - recoveringAfterStartup=true
[junit4:junit4]   2> 18603 T128 C2 P15202 oascsi.HttpClientUtil.createClient Creating new http client, config:maxConnectionsPerHost=20&maxConnections=10000&connTimeout=30000&socketTimeout=30000&retry=false
[junit4:junit4]   2> 18625 T128 C2 P15202 oasu.PeerSync.sync PeerSync: core=collection1 url=http://127.0.0.1:15202 START replicas=[http://127.0.0.1:31610/collection1/] nUpdates=100
[junit4:junit4]   2> 18635 T128 C2 P15202 oasu.PeerSync.sync WARNING no frame of reference to tell of we've missed updates
[junit4:junit4]   2> 18636 T128 C2 P15202 oasc.RecoveryStrategy.doRecovery PeerSync Recovery was not successful - trying replication. core=collection1
[junit4:junit4]   2> 18636 T128 C2 P15202 oasc.RecoveryStrategy.doRecovery Starting Replication Recovery. core=collection1
[junit4:junit4]   2> 18636 T128 C2 P15202 oasc.RecoveryStrategy.doRecovery Begin buffering updates. core=collection1
[junit4:junit4]   2> 18636 T128 C2 P15202 oasu.UpdateLog.bufferUpdates Starting to buffer updates. FSUpdateLog{state=ACTIVE, tlog=null}
[junit4:junit4]   2> 18637 T128 C2 P15202 oasc.RecoveryStrategy.replicate Attempting to replicate from http://127.0.0.1:31610/collection1/. core=collection1
[junit4:junit4]   2> 18637 T128 C2 P15202 oascsi.HttpClientUtil.createClient Creating new http client, config:maxConnections=128&maxConnectionsPerHost=32&followRedirects=false
[junit4:junit4]   2> ASYNC  NEW_CORE C3 name=collection1 org.apache.solr.core.SolrCore@50f47076 url=http://127.0.0.1:31610/collection1 node=127.0.0.1:31610_ C3_STATE=coll:collection1 core:collection1 props:{shard=shard1, state=active, core=collection1, collection=collection1, node_name=127.0.0.1:31610_, base_url=http://127.0.0.1:31610, leader=true}
[junit4:junit4]   2> 18688 T101 C3 P31610 REQ /get {getVersions=100&distrib=false&wt=javabin&qt=/get&version=2} status=0 QTime=6 
[junit4:junit4]   2> 18703 T102 C3 P31610 oasu.DirectUpdateHandler2.commit start commit{,optimize=false,openSearcher=false,waitSearcher=true,expungeDeletes=false,softCommit=false,prepareCommit=false}
[junit4:junit4]   2> 18705 T102 C3 P31610 oasc.CachingDirectoryFactory.close Releasing directory:/usr/home/hudson/hudson-slave/workspace/Lucene-Solr-Tests-4.x-Java6/solr/build/solr-core/test/J0/./org.apache.solr.cloud.SyncSliceTest-1362572444026/jetty1
[junit4:junit4]   2> 18706 T102 C3 P31610 oasc.SolrDeletionPolicy.onInit SolrDeletionPolicy.onInit: commits:num=1
[junit4:junit4]   2> 		commit{dir=BaseDirectoryWrapper(org.apache.lucene.store.RAMDirectory@4e2a718 lockFactory=org.apache.lucene.store.NativeFSLockFactory@21ef3faa),segFN=segments_1,generation=1,filenames=[segments_1]
[junit4:junit4]   2> 18707 T102 C3 P31610 oasc.SolrDeletionPolicy.updateCommits newest commit = 1[segments_1]
[junit4:junit4]   2> 18708 T102 C3 P31610 oasc.SolrDeletionPolicy.onCommit SolrDeletionPolicy.onCommit: commits:num=2
[junit4:junit4]   2> 		commit{dir=BaseDirectoryWrapper(org.apache.lucene.store.RAMDirectory@4e2a718 lockFactory=org.apache.lucene.store.NativeFSLockFactory@21ef3faa),segFN=segments_1,generation=1,filenames=[segments_1]
[junit4:junit4]   2> 		commit{dir=BaseDirectoryWrapper(org.apache.lucene.store.RAMDirectory@4e2a718 lockFactory=org.apache.lucene.store.NativeFSLockFactory@21ef3faa),segFN=segments_2,generation=2,filenames=[segments_2]
[junit4:junit4]   2> 18708 T102 C3 P31610 oasc.SolrDeletionPolicy.updateCommits newest commit = 2[segments_2]
[junit4:junit4]   2> 18709 T102 C3 P31610 oasc.CachingDirectoryFactory.close Releasing directory:/usr/home/hudson/hudson-slave/workspace/Lucene-Solr-Tests-4.x-Java6/solr/build/solr-core/test/J0/./org.apache.solr.cloud.SyncSliceTest-1362572444026/jetty1
[junit4:junit4]   2> 18709 T102 C3 P31610 oass.SolrIndexSearcher.<init> Opening Searcher@48dc7d5f realtime
[junit4:junit4]   2> 18709 T102 C3 P31610 oasu.DirectUpdateHandler2.commit end_commit_flush
[junit4:junit4]   2> 18710 T102 C3 P31610 /update {waitSearcher=true&openSearcher=false&commit=true&wt=javabin&commit_end_point=true&version=2&softCommit=false} {commit=} 0 28
[junit4:junit4]   2> 18766 T128 C2 P15202 oash.ReplicationHandler.inform Commits will be reserved for  10000
[junit4:junit4]   2> 18766 T128 C2 P15202 oascsi.HttpClientUtil.createClient Creating new http client, config:connTimeout=5000&socketTimeout=20000&allowCompression=false&maxConnections=10000&maxConnectionsPerHost=10000
[junit4:junit4]   2> 18793 T128 C2 P15202 oash.SnapPuller.<init>  No value set for 'pollInterval'. Timer Task not started.
[junit4:junit4]   2> 18848 T103 C3 P31610 oash.ReplicationHandler.inform Commits will be reserved for  10000
[junit4:junit4]   2> 18848 T103 C3 P31610 REQ /replication {command=indexversion&qt=/replication&wt=javabin&version=2} status=0 QTime=53 
[junit4:junit4]   2> 18850 T128 C2 P15202 oash.SnapPuller.fetchLatestIndex Master's generation: 2
[junit4:junit4]   2> 18850 T128 C2 P15202 oash.SnapPuller.fetchLatestIndex Slave's generation: 1
[junit4:junit4]   2> 18850 T128 C2 P15202 oash.SnapPuller.fetchLatestIndex Starting replication process
[junit4:junit4]   2> 18854 T103 C3 P31610 oasc.CachingDirectoryFactory.close Releasing directory:/usr/home/hudson/hudson-slave/workspace/Lucene-Solr-Tests-4.x-Java6/solr/build/solr-core/test/J0/./org.apache.solr.cloud.SyncSliceTest-1362572444026/jetty1
[junit4:junit4]   2> 18855 T103 C3 P31610 oasc.CachingDirectoryFactory.close Releasing directory:/usr/home/hudson/hudson-slave/workspace/Lucene-Solr-Tests-4.x-Java6/solr/build/solr-core/test/J0/./org.apache.solr.cloud.SyncSliceTest-1362572444026/jetty1/index
[junit4:junit4]   2> 18855 T103 C3 P31610 REQ /replication {command=filelist&qt=/replication&wt=javabin&generation=2&version=2} status=0 QTime=1 
[junit4:junit4]   2> 18856 T128 C2 P15202 oash.SnapPuller.fetchLatestIndex Number of files in latest index in master: 1
[junit4:junit4]   2> 18859 T128 C2 P15202 oasc.CachingDirectoryFactory.get return new directory for /usr/home/hudson/hudson-slave/workspace/Lucene-Solr-Tests-4.x-Java6/solr/build/solr-core/test/J0/./org.apache.solr.cloud.SyncSliceTest-1362572444026/jetty2/index.20130306082102874 forceNew:false
[junit4:junit4]   2> 18860 T128 C2 P15202 oasc.CachingDirectoryFactory.close Releasing directory:/usr/home/hudson/hudson-slave/workspace/Lucene-Solr-Tests-4.x-Java6/solr/build/solr-core/test/J0/./org.apache.solr.cloud.SyncSliceTest-1362572444026/jetty2
[junit4:junit4]   2> 18860 T128 C2 P15202 oash.SnapPuller.fetchLatestIndex Starting download to MockDirWrapper(org.apache.lucene.store.MMapDirectory@/usr/home/hudson/hudson-slave/workspace/Lucene-Solr-Tests-4.x-Java6/solr/build/solr-core/test/J0/index94749480tmp lockFactory=org.apache.lucene.store.NativeFSLockFactory@4404735c) fullCopy=false
[junit4:junit4]   2> 18873 T103 C3 P31610 REQ /replication {file=segments_2&command=filecontent&checksum=true&wt=filestream&qt=/replication&generation=2} status=0 QTime=4 
[junit4:junit4]   2> 18886 T128 C2 P15202 oasc.CachingDirectoryFactory.close Releasing directory:/usr/home/hudson/hudson-slave/workspace/Lucene-Solr-Tests-4.x-Java6/solr/build/solr-core/test/J0/./org.apache.solr.cloud.SyncSliceTest-1362572444026/jetty2/index
[junit4:junit4]   2> 18886 T128 C2 P15202 oash.SnapPuller.fetchLatestIndex Total time taken for download : 0 secs
[junit4:junit4]   2> 18898 T128 C2 P15202 oasc.CachingDirectoryFactory.close Releasing directory:/usr/home/hudson/hudson-slave/workspace/Lucene-Solr-Tests-4.x-Java6/solr/build/solr-core/test/J0/./org.apache.solr.cloud.SyncSliceTest-1362572444026/jetty2
[junit4:junit4]   2> 18905 T128 C2 P15202 oasc.CachingDirectoryFactory.close Releasing directory:/usr/home/hudson/hudson-slave/workspace/Lucene-Solr-Tests-4.x-Java6/solr/build/solr-core/test/J0/./org.apache.solr.cloud.SyncSliceTest-1362572444026/jetty2
[junit4:junit4]   2> 18905 T128 C2 P15202 oasu.DefaultSolrCoreState.newIndexWriter Creating new IndexWriter...
[junit4:junit4]   2> 18905 T128 C2 P15202 oasu.DefaultSolrCoreState.newIndexWriter Waiting until IndexWriter is unused... core=collection1
[junit4:junit4]   2> 18906 T92 oascc.ZkStateReader.updateClusterState Updating cloud state from ZooKeeper... 
[junit4:junit4]   2> 18906 T128 C2 P15202 oasc.CachingDirectoryFactory.close Releasing directory:/usr/home/hudson/hudson-slave/workspace/Lucene-Solr-Tests-4.x-Java6/solr/build/solr-core/test/J0/./org.apache.solr.cloud.SyncSliceTest-1362572444026/jetty2
[junit4:junit4]   2> 18907 T92 oasc.Overseer$ClusterStateUpdater.updateState Update state numShards=1 message={
[junit4:junit4]   2> 	  "operation":"state",
[junit4:junit4]   2> 	  "core_node_name":"4",
[junit4:junit4]   2> 	  "numShards":"1",
[junit4:junit4]   2> 	  "shard":null,
[junit4:junit4]   2> 	  "roles":null,
[junit4:junit4]   2> 	  "state":"down",
[junit4:junit4]   2> 	  "core":"collection1",
[junit4:junit4]   2> 	  "collection":"collection1",
[junit4:junit4]   2> 	  "node_name":"127.0.0.1:15210_",
[junit4:junit4]   2> 	  "base_url":"http://127.0.0.1:15210"}
[junit4:junit4]   2> 18907 T92 oasc.Overseer$ClusterStateUpdater.updateState Collection already exists with numShards=1
[junit4:junit4]   2> 18907 T92 oasc.Overseer$ClusterStateUpdater.updateState Assigning new node to shard shard=shard1
[junit4:junit4]   2> 18908 T128 C2 P15202 oasc.SolrDeletionPolicy.onInit SolrDeletionPolicy.onInit: commits:num=2
[junit4:junit4]   2> 		commit{dir=BaseDirectoryWrapper(org.apache.lucene.store.RAMDirectory@29aaa31f lockFactory=org.apache.lucene.store.NativeFSLockFactory@33fda70b),segFN=segments_1,generation=1,filenames=[segments_1]
[junit4:junit4]   2> 		commit{dir=BaseDirectoryWrapper(org.apache.lucene.store.RAMDirectory@29aaa31f lockFactory=org.apache.lucene.store.NativeFSLockFactory@33fda70b),segFN=segments_2,generation=2,filenames=[segments_2]
[junit4:junit4]   2> 18908 T128 C2 P15202 oasc.SolrDeletionPolicy.updateCommits newest commit = 2[segments_2]
[junit4:junit4]   2> 18909 T128 C2 P15202 oasu.DefaultSolrCoreState.newIndexWriter New IndexWriter is ready to be used.
[junit4:junit4]   2> 18909 T128 C2 P15202 oasc.CachingDirectoryFactory.close Releasing directory:/usr/home/hudson/hudson-slave/workspace/Lucene-Solr-Tests-4.x-Java6/solr/build/solr-core/test/J0/./org.apache.solr.cloud.SyncSliceTest-1362572444026/jetty2
[junit4:junit4]   2> 18909 T128 C2 P15202 oass.SolrIndexSearcher.<init> Opening Searcher@12a262c1 main
[junit4:junit4]   2> 18911 T127 oasc.SolrCore.registerSearcher [collection1] Registered new searcher Searcher@12a262c1 main{StandardDirectoryReader(segments_2:1:nrt)}
[junit4:junit4]   2> 18911 T127 oasc.CachingDirectoryFactory.close Releasing directory:/usr/home/hudson/hudson-slave/workspace/Lucene-Solr-Tests-4.x-Java6/solr/build/solr-core/test/J0/./org.apache.solr.cloud.SyncSliceTest-1362572444026/jetty2/index
[junit4:junit4]   2> 18911 T128 C2 P15202 oash.SnapPuller.fetchLatestIndex removing temporary index download directory files MockDirWrapper(org.apache.lucene.store.MMapDirectory@/usr/home/hudson/hudson-slave/workspace/Lucene-Solr-Tests-4.x-Java6/solr/build/solr-core/test/J0/index94749480tmp lockFactory=org.apache.lucene.store.NativeFSLockFactory@4404735c)
[junit4:junit4]   2> 18912 T128 C2 P15202 oasc.CachingDirectoryFactory.close Releasing directory:/usr/home/hudson/hudson-slave/workspace/Lucene-Solr-Tests-4.x-Java6/solr/build/solr-core/test/J0/./org.apache.solr.cloud.SyncSliceTest-1362572444026/jetty2/index.20130306082102874
[junit4:junit4]   2> 18912 T128 C2 P15202 oasc.CachingDirectoryFactory.close Releasing directory:/usr/home/hudson/hudson-slave/workspace/Lucene-Solr-Tests-4.x-Java6/solr/build/solr-core/test/J0/./org.apache.solr.cloud.SyncSliceTest-1362572444026/jetty2/index
[junit4:junit4]   2> 18913 T128 C2 P15202 oasc.RecoveryStrategy.replay No replay needed. core=collection1
[junit4:junit4]   2> 18913 T128 C2 P15202 oasc.RecoveryStrategy.doRecovery Replication Recovery was successful - registering as Active. core=collection1
[junit4:junit4]   2> 18913 T128 C2 P15202 oasc.ZkController.publish publishing core=collection1 state=active
[junit4:junit4]   2> 18913 T128 C2 P15202 oasc.ZkController.publish numShards not found on descriptor - reading it from system property
[junit4:junit4]   2> 18923 T128 C2 P15202 oasc.RecoveryStrategy.doRecovery Finished recovery process. core=collection1
[junit4:junit4]   2> 18924 T141 oascc.ZkStateReader$2.process A cluster state change: WatchedEvent state:SyncConnected type:NodeDataChanged path:/clusterstate.json, has occurred - updating... (live nodes size: 4)
[junit4:junit4]   2> 18924 T91 oascc.ZkStateReader$2.process A cluster state change: WatchedEvent state:SyncConnected type:NodeDataChanged path:/clusterstate.json, has occurred - updating... (live nodes size: 4)
[junit4:junit4]   2> 18924 T125 oascc.ZkStateReader$2.process A cluster state change: WatchedEvent state:SyncConnected type:NodeDataChanged path:/clusterstate.json, has occurred - updating... (live nodes size: 4)
[junit4:junit4]   2> 18924 T97 oascc.ZkStateReader$2.process A cluster state change: WatchedEvent state:SyncConnected type:NodeDataChanged path:/clusterstate.json, has occurred - updating... (live nodes size: 4)
[junit4:junit4]   2> 18924 T110 oascc.ZkStateReader$2.process A cluster state change: WatchedEvent state:SyncConnected type:NodeDataChanged path:/clusterstate.json, has occurred - updating... (live nodes size: 4)
[junit4:junit4]   2> 19572 T142 oasc.CoreContainer.registerCore registering core: collection1
[junit4:junit4]   2> 19572 T142 oasc.ZkController.register Register replica - core:collection1 address:http://127.0.0.1:15210 collection:collection1 shard:shard1
[junit4:junit4]   2> 19577 T142 oasc.ZkController.register We are http://127.0.0.1:15210/collection1/ and leader is http://127.0.0.1:31610/collection1/
[junit4:junit4]   2> 19578 T142 oasc.ZkController.register No LogReplay needed for core=collection1 baseURL=http://127.0.0.1:15210
[junit4:junit4]   2> 19578 T142 oasc.ZkController.checkRecovery Core needs to recover:collection1
[junit4:junit4]   2> 19578 T142 oasu.DefaultSolrCoreState.doRecovery Running recovery - first canceling any ongoing recovery
[junit4:junit4]   2> ASYNC  NEW_CORE C4 name=collection1 org.apache.solr.core.SolrCore@5ee16306 url=http://127.0.0.1:15210/collection1 node=127.0.0.1:15210_ C4_STATE=coll:collection1 core:collection1 props:{state=down, core=collection1, collection=collection1, node_name=127.0.0.1:15210_, base_url=http://127.0.0.1:15210}
[junit4:junit4]   2> 19579 T146 C4 P15210 oasc.RecoveryStrategy.run Starting recovery process.  core=collection1 recoveringAfterStartup=true
[junit4:junit4]   2> 19580 T146 C4 P15210 oasc.RecoveryStrategy.doRecovery ###### startupVersions=[]
[junit4:junit4]   2> 19580 T142 oascc.ZkStateReader.updateClusterState Updating cloud state from ZooKeeper... 
[junit4:junit4]   2> 19580 T146 C4 P15210 oasc.ZkController.publish publishing core=collection1 state=recovering
[junit4:junit4]   2> 19580 T146 C4 P15210 oasc.ZkController.publish numShards not found on descriptor - reading it from system property
[junit4:junit4]   2> 19581 T68 oass.SolrDispatchFilter.init user.dir=/usr/home/hudson/hudson-slave/workspace/Lucene-Solr-Tests-4.x-Java6/solr/build/solr-core/test/J0
[junit4:junit4]   2> 19582 T68 oass.SolrDispatchFilter.init SolrDispatchFilter.init() done
[junit4:junit4]   2> 19583 T146 C4 P15210 oascsi.HttpClientUtil.createClient Creating new http client, config:maxConnections=128&maxConnectionsPerHost=32&followRedirects=false
[junit4:junit4]   2> 19582 T68 oascsi.HttpClientUtil.createClient Creating new http client, config:maxConnections=128&maxConnectionsPerHost=32&followRedirects=false
[junit4:junit4]   2> 19788 T68 oejs.Server.doStart jetty-8.1.8.v20121106
[junit4:junit4]   2> 19791 T68 oejs.AbstractConnector.doStart Started SocketConnector@127.0.0.1:15308
[junit4:junit4]   2> 19792 T68 oass.SolrDispatchFilter.init SolrDispatchFilter.init()
[junit4:junit4]   2> 19792 T68 oasc.SolrResourceLoader.locateSolrHome JNDI not configured for solr (NoInitialContextEx)
[junit4:junit4]   2> 19793 T68 oasc.SolrResourceLoader.locateSolrHome using system property solr.solr.home: /usr/home/hudson/hudson-slave/workspace/Lucene-Solr-Tests-4.x-Java6/solr/build/solr-core/test/J0/./org.apache.solr.cloud.SyncSliceTest-jetty4-1362572463621
[junit4:junit4]   2> 19793 T68 oasc.CoreContainer$Initializer.initialize looking for solr.xml: /usr/home/hudson/hudson-slave/workspace/Lucene-Solr-Tests-4.x-Java6/solr/build/solr-core/test/J0/./org.apache.solr.cloud.SyncSliceTest-jetty4-1362572463621/solr.xml
[junit4:junit4]   2> 19793 T68 oasc.CoreContainer.<init> New CoreContainer 1450269807
[junit4:junit4]   2> 19794 T68 oasc.CoreContainer.load Loading CoreContainer using Solr Home: '/usr/home/hudson/hudson-slave/workspace/Lucene-Solr-Tests-4.x-Java6/solr/build/solr-core/test/J0/./org.apache.solr.cloud.SyncSliceTest-jetty4-1362572463621/'
[junit4:junit4]   2> 19795 T68 oasc.SolrResourceLoader.<init> new SolrResourceLoader for directory: '/usr/home/hudson/hudson-slave/workspace/Lucene-Solr-Tests-4.x-Java6/solr/build/solr-core/test/J0/./org.apache.solr.cloud.SyncSliceTest-jetty4-1362572463621/'
[junit4:junit4]   2> 19855 T68 oashc.HttpShardHandlerFactory.getParameter Setting socketTimeout to: 120000
[junit4:junit4]   2> 19856 T68 oashc.HttpShardHandlerFactory.getParameter Setting urlScheme to: http://
[junit4:junit4]   2> 19857 T68 oashc.HttpShardHandlerFactory.getParameter Setting connTimeout to: 15000
[junit4:junit4]   2> 19857 T68 oashc.HttpShardHandlerFactory.getParameter Setting maxConnectionsPerHost to: 20
[junit4:junit4]   2> 19857 T68 oashc.HttpShardHandlerFactory.getParameter Setting corePoolSize to: 0
[junit4:junit4]   2> 19858 T68 oashc.HttpShardHandlerFactory.getParameter Setting maximumPoolSize to: 2147483647
[junit4:junit4]   2> 19858 T68 oashc.HttpShardHandlerFactory.getParameter Setting maxThreadIdleTime to: 5
[junit4:junit4]   2> 19859 T68 oashc.HttpShardHandlerFactory.getParameter Setting sizeOfQueue to: -1
[junit4:junit4]   2> 19859 T68 oashc.HttpShardHandlerFactory.getParameter Setting fairnessPolicy to: false
[junit4:junit4]   2> 19860 T68 oascsi.HttpClientUtil.createClient Creating new http client, config:maxConnectionsPerHost=20&maxConnections=10000&socketTimeout=120000&connTimeout=15000&retry=false
[junit4:junit4]   2> 19881 T68 oasc.CoreContainer.load Registering Log Listener
[junit4:junit4]   2> 19901 T68 oasc.CoreContainer.initZooKeeper Zookeeper client=127.0.0.1:20857/solr
[junit4:junit4]   2> 19901 T68 oasc.ZkController.checkChrootPath zkHost includes chroot
[junit4:junit4]   2> 19902 T68 oaz.ZooKeeper.<init> Initiating client connection, connectString=127.0.0.1:20857 sessionTimeout=60000 watcher=org.apache.solr.common.cloud.ConnectionManager@3bda6b61
[junit4:junit4]   2> 19903 T68 oascc.ConnectionManager.waitForConnected Waiting for client to connect to ZooKeeper
[junit4:junit4]   2> 19904 T156 oaz.ClientCnxn$SendThread.logStartConnect Opening socket connection to server localhost/127.0.0.1:20857. Will not attempt to authenticate using SASL (access denied (javax.security.auth.AuthPermission getLoginConfiguration))
[junit4:junit4]   2> 19904 T156 oaz.ClientCnxn$SendThread.primeConnection Socket connection established to localhost/127.0.0.1:20857, initiating session
[junit4:junit4]   2> 19905 T70 oazs.NIOServerCnxnFactory.run Accepted socket connection from /140.211.11.196:15309
[junit4:junit4]   2> 19905 T70 oazs.ZooKeeperServer.processConnectRequest Client attempting to establish new session at /140.211.11.196:15309
[junit4:junit4]   2> 19907 T72 oazs.ZooKeeperServer.finishSessionInit Established session 0x13d3fa582da000b with negotiated timeout 20000 for client /140.211.11.196:15309
[junit4:junit4]   2> 19907 T156 oaz.ClientCnxn$SendThread.onConnected Session establishment complete on server localhost/127.0.0.1:20857, sessionid = 0x13d3fa582da000b, negotiated timeout = 20000
[junit4:junit4]   2> 19908 T157 oascc.ConnectionManager.process Watcher org.apache.solr.common.cloud.ConnectionManager@3bda6b61 name:ZooKeeperConnection Watcher:127.0.0.1:20857 got event WatchedEvent state:SyncConnected type:None path:null path:null type:None
[junit4:junit4]   2> 19908 T68 oascc.ConnectionManager.waitForConnected Client is connected to ZooKeeper
[junit4:junit4]   2> 19910 T73 oazs.PrepRequestProcessor.pRequest2Txn Processed session termination for sessionid: 0x13d3fa582da000b
[junit4:junit4]   2> 19921 T157 oaz.ClientCnxn$EventThread.run EventThread shut down
[junit4:junit4]   2> 19921 T70 oazs.NIOServerCnxn.closeSock Closed socket connection for client /140.211.11.196:15309 which had sessionid 0x13d3fa582da000b
[junit4:junit4]   2> 19921 T68 oaz.ZooKeeper.close Session: 0x13d3fa582da000b closed
[junit4:junit4]   2> 19922 T68 oascsi.HttpClientUtil.createClient Creating new http client, config:maxConnections=500&maxConnectionsPerHost=16&socketTimeout=120000&connTimeout=15000
[junit4:junit4]   2> 19933 T68 oaz.ZooKeeper.<init> Initiating client connection, connectString=127.0.0.1:20857/solr sessionTimeout=30000 watcher=org.apache.solr.common.cloud.ConnectionManager@34c31a61
[junit4:junit4]   2> 19934 T68 oascc.ConnectionManager.waitForConnected Waiting for client to connect to ZooKeeper
[junit4:junit4]   2> 19934 T158 oaz.ClientCnxn$SendThread.logStartConnect Opening socket connection to server localhost/127.0.0.1:20857. Will not attempt to authenticate using SASL (access denied (javax.security.auth.AuthPermission getLoginConfiguration))
[junit4:junit4]   2> 19935 T158 oaz.ClientCnxn$SendThread.primeConnection Socket connection established to localhost/127.0.0.1:20857, initiating session
[junit4:junit4]   2> 19935 T70 oazs.NIOServerCnxnFactory.run Accepted socket connection from /140.211.11.196:15310
[junit4:junit4]   2> 19935 T70 oazs.ZooKeeperServer.processConnectRequest Client attempting to establish new session at /140.211.11.196:15310
[junit4:junit4]   2> 19937 T72 oazs.ZooKeeperServer.finishSessionInit Established session 0x13d3fa582da000c with negotiated timeout 20000 for client /140.211.11.196:15310
[junit4:junit4]   2> 19937 T158 oaz.ClientCnxn$SendThread.onConnected Session establishment complete on server localhost/127.0.0.1:20857, sessionid = 0x13d3fa582da000c, negotiated timeout = 20000
[junit4:junit4]   2> 19937 T159 oascc.ConnectionManager.process Watcher org.apache.solr.common.cloud.ConnectionManager@34c31a61 name:ZooKeeperConnection Watcher:127.0.0.1:20857/solr got event WatchedEvent state:SyncConnected type:None path:null path:null type:None
[junit4:junit4]   2> 19937 T68 oascc.ConnectionManager.waitForConnected Client is connected to ZooKeeper
[junit4:junit4]   2> 19938 T73 oazs.PrepRequestProcessor.pRequest Got user-level KeeperException when processing sessionid:0x13d3fa582da000c type:create cxid:0x1 zxid:0x94 txntype:-1 reqpath:n/a Error Path:/solr/overseer Error:KeeperErrorCode = NodeExists for /solr/overseer
[junit4:junit4]   2> 19940 T73 oazs.PrepRequestProcessor.pRequest Got user-level KeeperException when processing sessionid:0x13d3fa582da000c type:create cxid:0x2 zxid:0x95 txntype:-1 reqpath:n/a Error Path:/solr/overseer Error:KeeperErrorCode = NodeExists for /solr/overseer
[junit4:junit4]   2> 19948 T68 oascc.ZkStateReader.createClusterStateWatchersAndUpdate Updating cluster state from ZooKeeper... 
[junit4:junit4]   2> 20433 T92 oascc.ZkStateReader.updateClusterState Updating cloud state from ZooKeeper... 
[junit4:junit4]   2> 20434 T92 oasc.Overseer$ClusterStateUpdater.updateState Update state numShards=1 message={
[junit4:junit4]   2> 	  "operation":"state",
[junit4:junit4]   2> 	  "core_node_name":"3",
[junit4:junit4]   2> 	  "numShards":"1",
[junit4:junit4]   2> 	  "shard":"shard1",
[junit4:junit4]   2> 	  "roles":null,
[junit4:junit4]   2> 	  "state":"active",
[junit4:junit4]   2> 	  "core":"collection1",
[junit4:junit4]   2> 	  "collection":"collection1",
[junit4:junit4]   2> 	  "node_name":"127.0.0.1:15202_",
[junit4:junit4]   2> 	  "base_url":"http://127.0.0.1:15202"}
[junit4:junit4]   2> 20447 T92 oasc.Overseer$ClusterStateUpdater.updateState Update state numShards=1 message={
[junit4:junit4]   2> 	  "operation":"state",
[junit4:junit4]   2> 	  "core_node_name":"4",
[junit4:junit4]   2> 	  "numShards":"1",
[junit4:junit4]   2> 	  "shard":"shard1",
[junit4:junit4]   2> 	  "roles":null,
[junit4:junit4]   2> 	  "state":"recovering",
[junit4:junit4]   2> 	  "core":"collection1",
[junit4:junit4]   2> 	  "collection":"collection1",
[junit4:junit4]   2> 	  "node_name":"127.0.0.1:15210_",
[junit4:junit4]   2> 	  "base_url":"http://127.0.0.1:15210"}
[junit4:junit4]   2> 20459 T91 oascc.ZkStateReader$2.process A cluster state change: WatchedEvent state:SyncConnected type:NodeDataChanged path:/clusterstate.json, has occurred - updating... (live nodes size: 4)
[junit4:junit4]   2> 20460 T97 oascc.ZkStateReader$2.process A cluster state change: WatchedEvent state:SyncConnected type:NodeDataChanged path:/clusterstate.json, has occurred - updating... (live nodes size: 4)
[junit4:junit4]   2> 20460 T110 oascc.ZkStateReader$2.process A cluster state change: WatchedEvent state:SyncConnected type:NodeDataChanged path:/clusterstate.json, has occurred - updating... (live nodes size: 4)
[junit4:junit4]   2> 20460 T159 oascc.ZkStateReader$2.process A cluster state change: WatchedEvent state:SyncConnected type:NodeDataChanged path:/clusterstate.json, has occurred - updating... (live nodes size: 4)
[junit4:junit4]   2> 20460 T125 oascc.ZkStateReader$2.process A cluster state change: WatchedEvent state:SyncConnected type:NodeDataChanged path:/clusterstate.json, has occurred - updating... (live nodes size: 4)
[junit4:junit4]   2> 20459 T141 oascc.ZkStateReader$2.process A cluster state change: WatchedEvent state:SyncConnected type:NodeDataChanged path:/clusterstate.json, has occurred - updating... (live nodes size: 4)
[junit4:junit4]   2> 20608 T104 oass.SolrDispatchFilter.handleAdminRequest /admin/cores {coreNodeName=4&state=recovering&nodeName=127.0.0.1:15210_&action=PREPRECOVERY&checkLive=true&core=collection1&wt=javabin&onlyIfLeader=true&version=2} status=0 QTime=1001 
[junit4:junit4]   2> 20952 T68 oasc.ZkController.createEphemeralLiveNode Register node as live in ZooKeeper:/live_nodes/127.0.0.1:15308_
[junit4:junit4]   2> 20953 T73 oazs.PrepRequestProcessor.pRequest Got user-level KeeperException when processing sessionid:0x13d3fa582da000c type:delete cxid:0xb zxid:0x9d txntype:-1 reqpath:n/a Error Path:/solr/live_nodes/127.0.0.1:15308_ Error:KeeperErrorCode = NoNode for /solr/live_nodes/127.0.0.1:15308_
[junit4:junit4]   2> 20955 T68 oascc.SolrZkClient.makePath makePath: /live_nodes/127.0.0.1:15308_
[junit4:junit4]   2> 20958 T110 oascc.ZkStateReader$2.process A cluster state change: WatchedEvent state:SyncConnected type:NodeChildrenChanged path:/live_nodes, has occurred - updating... (live nodes size: 4)
[junit4:junit4]   2> 20959 T141 oascc.ZkStateReader$3.process Updating live nodes... (5)
[junit4:junit4]   2> 20959 T97 oascc.ZkStateReader$3.process Updating live nodes... (5)
[junit4:junit4]   2> 20959 T125 oascc.ZkStateReader$3.process Updating live nodes... (5)
[junit4:junit4]   2> 20959 T141 oascc.ZkStateReader$2.process A cluster state change: WatchedEvent state:SyncConnected type:NodeChildrenChanged path:/live_nodes, has occurred - updating... (live nodes size: 5)
[junit4:junit4]   2> 20959 T159 oascc.ZkStateReader$3.process Updating live nodes... (5)
[junit4:junit4]   2> 20959 T97 oascc.ZkStateReader$2.process A cluster state change: WatchedEvent state:SyncConnected type:NodeChildrenChanged path:/live_nodes, has occurred - updating... (live nodes size: 5)
[junit4:junit4]   2> 20959 T91 oascc.ZkStateReader$3.process Updating live nodes... (5)
[junit4:junit4]   2> 20960 T159 oascc.ZkStateReader$2.process A cluster state change: WatchedEvent state:SyncConnected type:NodeChildrenChanged path:/live_nodes, has occurred - updating... (live nodes size: 5)
[junit4:junit4]   2> 20959 T125 oascc.ZkStateReader$2.process A cluster state change: WatchedEvent state:SyncConnected type:NodeChildrenChanged path:/live_nodes, has occurred - updating... (live nodes size: 5)
[junit4:junit4]   2> 20960 T91 oascc.ZkStateReader$2.process A cluster state change: WatchedEvent state:SyncConnected type:NodeChildrenChanged path:/live_nodes, has occurred - updating... (live nodes size: 5)
[junit4:junit4]   2> 20962 T110 oascc.ZkStateReader$3.process Updating live nodes... (5)
[junit4:junit4]   2> 20971 T160 oasc.CoreContainer.create Creating SolrCore 'collection1' using instanceDir: /usr/home/hudson/hudson-slave/workspace/Lucene-Solr-Tests-4.x-Java6/solr/build/solr-core/test/J0/./org.apache.solr.cloud.SyncSliceTest-jetty4-1362572463621/collection1
[junit4:junit4]   2> 20972 T160 oasc.ZkController.createCollectionZkNode Check for collection zkNode:collection1
[junit4:junit4]   2> 20973 T160 oasc.ZkController.createCollectionZkNode Collection zkNode exists
[junit4:junit4]   2> 20973 T160 oasc.ZkController.readConfigName Load collection config from:/collections/collection1
[junit4:junit4]   2> 20975 T160 oasc.SolrResourceLoader.<init> new SolrResourceLoader for directory: '/usr/home/hudson/hudson-slave/workspace/Lucene-Solr-Tests-4.x-Java6/solr/build/solr-core/test/J0/./org.apache.solr.cloud.SyncSliceTest-jetty4-1362572463621/collection1/'
[junit4:junit4]   2> 20976 T160 oasc.SolrResourceLoader.replaceClassLoader Adding 'file:/usr/home/hudson/hudson-slave/workspace/Lucene-Solr-Tests-4.x-Java6/solr/build/solr-core/test/J0/org.apache.solr.cloud.SyncSliceTest-jetty4-1362572463621/collection1/lib/README' to classloader
[junit4:junit4]   2> 20977 T160 oasc.SolrResourceLoader.replaceClassLoader Adding 'file:/usr/home/hudson/hudson-slave/workspace/Lucene-Solr-Tests-4.x-Java6/solr/build/solr-core/test/J0/org.apache.solr.cloud.SyncSliceTest-jetty4-1362572463621/collection1/lib/classes/' to classloader
[junit4:junit4]   2> 21029 T160 oasc.SolrConfig.<init> Using Lucene MatchVersion: LUCENE_42
[junit4:junit4]   2> 21092 T160 oasc.SolrConfig.<init> Loaded SolrConfig: solrconfig.xml
[junit4:junit4]   2> 21193 T160 oass.IndexSchema.readSchema Reading Solr Schema
[junit4:junit4]   2> 21219 T160 oass.IndexSchema.readSchema Schema name=test
[junit4:junit4]   2> 21873 T160 oass.OpenExchangeRatesOrgProvider.init Initialized with rates=open-exchange-rates.json, refreshInterval=1440.
[junit4:junit4]   2> 21884 T160 oass.IndexSchema.readSchema default search field in schema is text
[junit4:junit4]   2> 21886 T160 oass.IndexSchema.readSchema unique key field: id
[junit4:junit4]   2> 21908 T160 oass.FileExchangeRateProvider.reload Reloading exchange rates from file currency.xml
[junit4:junit4]   2> 21912 T160 oass.FileExchangeRateProvider.reload Reloading exchange rates from file currency.xml
[junit4:junit4]   2> 21916 T160 oass.OpenExchangeRatesOrgProvider.reload Reloading exchange rates from open-exchange-rates.json
[junit4:junit4]   2> 21917 T160 oass.OpenExchangeRatesOrgProvider$OpenExchangeRates.<init> WARNING Unknown key IMPORTANT NOTE
[junit4:junit4]   2> 21917 T160 oass.OpenExchangeRatesOrgProvider$OpenExchangeRates.<init> WARNING Expected key, got STRING
[junit4:junit4]   2> 21918 T160 oass.OpenExchangeRatesOrgProvider.reload Reloading exchange rates from open-exchange-rates.json
[junit4:junit4]   2> 21919 T160 oass.OpenExchangeRatesOrgProvider$OpenExchangeRates.<init> WARNING Unknown key IMPORTANT NOTE
[junit4:junit4]   2> 21919 T160 oass.OpenExchangeRatesOrgProvider$OpenExchangeRates.<init> WARNING Expected key, got STRING
[junit4:junit4]   2> 21919 T160 oasc.SolrCore.<init> [collection1] Opening new SolrCore at /usr/home/hudson/hudson-slave/workspace/Lucene-Solr-Tests-4.x-Java6/solr/build/solr-core/test/J0/./org.apache.solr.cloud.SyncSliceTest-jetty4-1362572463621/collection1/, dataDir=./org.apache.solr.cloud.SyncSliceTest-1362572444026/jetty4/
[junit4:junit4]   2> 21919 T160 oasc.JmxMonitoredMap.<init> JMX monitoring is enabled. Adding Solr mbeans to JMX Server: com.sun.jmx.mbeanserver.JmxMBeanServer@66fdfc58
[junit4:junit4]   2> 21920 T160 oasc.SolrCore.initDirectoryFactory org.apache.solr.core.MockDirectoryFactory
[junit4:junit4]   2> 21921 T160 oasc.CachingDirectoryFactory.get return new directory for /usr/home/hudson/hudson-slave/workspace/Lucene-Solr-Tests-4.x-Java6/solr/build/solr-core/test/J0/./org.apache.solr.cloud.SyncSliceTest-1362572444026/jetty4 forceNew:false
[junit4:junit4]   2> 21922 T160 oasc.CachingDirectoryFactory.close Releasing directory:/usr/home/hudson/hudson-slave/workspace/Lucene-Solr-Tests-4.x-Java6/solr/build/solr-core/test/J0/./org.apache.solr.cloud.SyncSliceTest-1362572444026/jetty4
[junit4:junit4]   2> 21922 T160 oasc.SolrCore.getNewIndexDir New index directory detected: old=null new=./org.apache.solr.cloud.SyncSliceTest-1362572444026/jetty4/index/
[junit4:junit4]   2> 21922 T160 oasc.SolrCore.initIndex WARNING [collection1] Solr index directory './org.apache.solr.cloud.SyncSliceTest-1362572444026/jetty4/index' doesn't exist. Creating new index...
[junit4:junit4]   2> 21922 T160 oasc.CachingDirectoryFactory.get return new directory for /usr/home/hudson/hudson-slave/workspace/Lucene-Solr-Tests-4.x-Java6/solr/build/solr-core/test/J0/./org.apache.solr.cloud.SyncSliceTest-1362572444026/jetty4/index forceNew:false
[junit4:junit4]   2> 21924 T160 oasc.SolrDeletionPolicy.onCommit SolrDeletionPolicy.onCommit: commits:num=1
[junit4:junit4]   2> 		commit{dir=BaseDirectoryWrapper(org.apache.lucene.store.RAMDirectory@607ac250 lockFactory=org.apache.lucene.store.NativeFSLockFactory@1f27df44),segFN=segments_1,generation=1,filenames=[segments_1]
[junit4:junit4]   2> 21924 T160 oasc.SolrDeletionPolicy.updateCommits newest commit = 1[segments_1]
[junit4:junit4]   2> 21925 T160 oasc.CachingDirectoryFactory.close Releasing directory:/usr/home/hudson/hudson-slave/workspace/Lucene-Solr-Tests-4.x-Java6/solr/build/solr-core/test/J0/./org.apache.solr.cloud.SyncSliceTest-1362572444026/jetty4/index
[junit4:junit4]   2> 21926 T160 oasup.UpdateRequestProcessorChain.init inserting DistributedUpdateProcessorFactory into updateRequestProcessorChain "dedupe"
[junit4:junit4]   2> 21927 T160 oasup.UpdateRequestProcessorChain.init inserting DistributedUpdateProcessorFactory into updateRequestProcessorChain "stored_sig"
[junit4:junit4]   2> 21928 T160 oasup.UpdateRequestProcessorChain.init inserting DistributedUpdateProcessorFactory into updateRequestProcessorChain "distrib-dup-test-chain-implicit"
[junit4:junit4]   2> 21928 T160 oasc.RequestHandlers.initHandlersFromConfig created standard: solr.StandardRequestHandler
[junit4:junit4]   2> 21929 T160 oasc.RequestHandlers.initHandlersFromConfig created /get: solr.RealTimeGetHandler
[junit4:junit4]   2> 21929 T160 oasc.RequestHandlers.initHandlersFromConfig adding lazy requestHandler: solr.ReplicationHandler
[junit4:junit4]   2> 21929 T160 oasc.RequestHandlers.initHandlersFromConfig created /replication: solr.ReplicationHandler
[junit4:junit4]   2> 21929 T160 oasc.RequestHandlers.initHandlersFromConfig created /update: solr.UpdateRequestHandler
[junit4:junit4]   2> 21930 T160 oasc.RequestHandlers.initHandlersFromConfig created /admin/: org.apache.solr.handler.admin.AdminHandlers
[junit4:junit4]   2> 21934 T160 oashl.XMLLoader.init xsltCacheLifetimeSeconds=60
[junit4:junit4]   2> 21939 T160 oasc.CachingDirectoryFactory.close Releasing directory:/usr/home/hudson/hudson-slave/workspace/Lucene-Solr-Tests-4.x-Java6/solr/build/solr-core/test/J0/./org.apache.solr.cloud.SyncSliceTest-1362572444026/jetty4
[junit4:junit4]   2> 21939 T160 oass.SolrIndexSearcher.<init> Opening Searcher@35188d90 main
[junit4:junit4]   2> 21940 T160 oasu.UpdateHandler.clearLog Clearing tlog files, tlogDir=./org.apache.solr.cloud.SyncSliceTest-1362572444026/jetty4/tlog
[junit4:junit4]   2> 21940 T160 oasu.CommitTracker.<init> Hard AutoCommit: disabled
[junit4:junit4]   2> 21940 T160 oasu.CommitTracker.<init> Soft AutoCommit: disabled
[junit4:junit4]   2> 21944 T161 oasc.SolrCore.registerSearcher [collection1] Registered new searcher Searcher@35188d90 main{StandardDirectoryReader(segments_1:1)}
[junit4:junit4]   2> 21945 T160 oasc.ZkController.publish publishing core=collection1 state=down
[junit4:junit4]   2> 21946 T160 oasc.ZkController.publish numShards not found on descriptor - reading it from system property
[junit4:junit4]   2> 21976 T92 oascc.ZkStateReader.updateClusterState Updating cloud state from ZooKeeper... 
[junit4:junit4]   2> 21977 T92 oasc.Overseer$ClusterStateUpdater.updateState Update state numShards=1 message={
[junit4:junit4]   2> 	  "operation":"state",
[junit4:junit4]   2> 	  "core_node_name":"5",
[junit4:junit4]   2> 	  "numShards":"1",
[junit4:junit4]   2> 	  "shard":null,
[junit4:junit4]   2> 	  "roles":null,
[junit4:junit4]   2> 	  "state":"down",
[junit4:junit4]   2> 	  "core":"collection1",
[junit4:junit4]   2> 	  "collection":"collection1",
[junit4:junit4]   2> 	  "node_name":"127.0.0.1:15308_",
[junit4:junit4]   2> 	  "base_url":"http://127.0.0.1:15308"}
[junit4:junit4]   2> 21977 T92 oasc.Overseer$ClusterStateUpdater.updateState Collection already exists with numShards=1
[junit4:junit4]   2> 21978 T92 oasc.Overseer$ClusterStateUpdater.updateState Assigning new node to shard shard=shard1
[junit4:junit4]   2> 21990 T91 oascc.ZkStateReader$2.process A cluster state change: WatchedEvent state:SyncConnected type:NodeDataChanged path:/clusterstate.json, has occurred - updating... (live nodes size: 5)
[junit4:junit4]   2> 21990 T141 oascc.ZkStateReader$2.process A cluster state change: WatchedEvent state:SyncConnected type:NodeDataChanged path:/clusterstate.json, has occurred - updating... (live nodes size: 5)
[junit4:junit4]   2> 21990 T110 oascc.ZkStateReader$2.process A cluster state change: WatchedEvent state:SyncConnected type:NodeDataChanged path:/clusterstate.json, has occurred - updating... (live nodes size: 5)
[junit4:junit4]   2> 21990 T159 oascc.ZkStateReader$2.process A cluster state change: WatchedEvent state:SyncConnected type:NodeDataChanged path:/clusterstate.json, has occurred - updating... (live nodes size: 5)
[junit4:junit4]   2> 21990 T125 oascc.ZkStateReader$2.process A cluster state change: WatchedEvent state:SyncConnected type:NodeDataChanged path:/clusterstate.json, has occurred - updating... (live nodes size: 5)
[junit4:junit4]   2> 21990 T97 oascc.ZkStateReader$2.process A cluster state change: WatchedEvent state:SyncConnected type:NodeDataChanged path:/clusterstate.json, has occurred - updating... (live nodes size: 5)
[junit4:junit4]   2>  C4_STATE=coll:collection1 core:collection1 props:{shard=shard1, state=recovering, core=collection1, collection=collection1, node_name=127.0.0.1:15210_, base_url=http://127.0.0.1:15210}
[junit4:junit4]   2> 22610 T146 C4 P15210 oasc.RecoveryStrategy.doRecovery Attempting to PeerSync from http://127.0.0.1:31610/collection1/ core=collection1 - recoveringAfterStartup=true
[junit4:junit4]   2> 22610 T146 C4 P15210 oasu.PeerSync.sync PeerSync: core=collection1 url=http://127.0.0.1:15210 START replicas=[http://127.0.0.1:31610/collection1/] nUpdates=100
[junit4:junit4]   2> 22611 T146 C4 P15210 oasu.PeerSync.sync WARNING no frame of reference to tell of we've missed updates
[junit4:junit4]   2> 22612 T146 C4 P15210 oasc.RecoveryStrategy.doRecovery PeerSync Recovery was not successful - trying replication. core=collection1
[junit4:junit4]   2> 22612 T146 C4 P15210 oasc.RecoveryStrategy.doRecovery Starting Replication Recovery. core=collection1
[junit4:junit4]   2> 22612 T146 C4 P15210 oasc.RecoveryStrategy.doRecovery Begin buffering updates. core=collection1
[junit4:junit4]   2> 22612 T146 C4 P15210 oasu.UpdateLog.bufferUpdates Starting to buffer updates. FSUpdateLog{state=ACTIVE, tlog=null}
[junit4:junit4]   2> 22613 T146 C4 P15210 oasc.RecoveryStrategy.replicate Attempting to replicate from http://127.0.0.1:31610/collection1/. core=collection1
[junit4:junit4]   2> 22613 T146 C4 P15210 oascsi.HttpClientUtil.createClient Creating new http client, config:maxConnections=128&maxConnectionsPerHost=32&followRedirects=false
[junit4:junit4]   2> 22615 T101 C3 P31610 REQ /get {getVersions=100&distrib=false&wt=javabin&qt=/get&version=2} status=0 QTime=0 
[junit4:junit4]   2> 22632 T105 C3 P31610 oasu.DirectUpdateHandler2.commit start commit{,optimize=false,openSearcher=false,waitSearcher=true,expungeDeletes=false,softCommit=false,prepareCommit=false}
[junit4:junit4]   2> 22633 T105 C3 P31610 oasc.SolrDeletionPolicy.onCommit SolrDeletionPolicy.onCommit: commits:num=2
[junit4:junit4]   2> 		commit{dir=BaseDirectoryWrapper(org.apache.lucene.store.RAMDirectory@4e2a718 lockFactory=org.apache.lucene.store.NativeFSLockFactory@21ef3faa),segFN=segments_2,generation=2,filenames=[segments_2]
[junit4:junit4]   2> 		commit{dir=BaseDirectoryWrapper(org.apache.lucene.store.RAMDirectory@4e2a718 lockFactory=org.apache.lucene.store.NativeFSLockFactory@21ef3faa),segFN=segments_3,generation=3,filenames=[segments_3]
[junit4:junit4]   2> 22633 T105 C3 P31610 oasc.SolrDeletionPolicy.updateCommits newest commit = 3[segments_3]
[junit4:junit4]   2> 22634 T105 C3 P31610 oasc.CachingDirectoryFactory.close Releasing directory:/usr/home/hudson/hudson-slave/workspace/Lucene-Solr-Tests-4.x-Java6/solr/build/solr-core/test/J0/./org.apache.solr.cloud.SyncSliceTest-1362572444026/jetty1
[junit4:junit4]   2> 22635 T105 C3 P31610 oasu.DirectUpdateHandler2.commit end_commit_flush
[junit4:junit4]   2> 22635 T105 C3 P31610 /update {waitSearcher=true&openSearcher=false&commit=true&wt=javabin&commit_end_point=true&version=2&softCommit=false} {commit=} 0 3
[junit4:junit4]   2> 22636 T146 C4 P15210 oash.ReplicationHandler.inform Commits will be reserved for  10000
[junit4:junit4]   2> 22637 T146 C4 P15210 oash.SnapPuller.<init>  No value set for 'pollInterval'. Timer Task not started.
[junit4:junit4]   2> 22640 T103 C3 P31610 REQ /replication {command=indexversion&qt=/replication&wt=javabin&version=2} status=0 QTime=1 
[junit4:junit4]   2> 22640 T146 C4 P15210 oash.SnapPuller.fetchLatestIndex Master's generation: 3
[junit4:junit4]   2> 22641 T146 C4 P15210 oash.SnapPuller.fetchLatestIndex Slave's generation: 1
[junit4:junit4]   2> 22641 T146 C4 P15210 oash.SnapPuller.fetchLatestIndex Starting replication process
[junit4:junit4]   2> 22644 T103 C3 P31610 oasc.CachingDirectoryFactory.close Releasing directory:/usr/home/hudson/hudson-slave/workspace/Lucene-Solr-Tests-4.x-Java6/solr/build/solr-core/test/J0/./org.apache.solr.cloud.SyncSliceTest-1362572444026/jetty1
[junit4:junit4]   2> 22644 T103 C3 P31610 oasc.CachingDirectoryFactory.close Releasing directory:/usr/home/hudson/hudson-slave/workspace/Lucene-Solr-Tests-4.x-Java6/solr/build/solr-core/test/J0/./org.apache.solr.cloud.SyncSliceTest-1362572444026/jetty1/index
[junit4:junit4]   2> 22644 T103 C3 P31610 REQ /replication {command=filelist&qt=/replication&wt=javabin&generation=3&version=2} status=0 QTime=1 
[junit4:junit4]   2> 22645 T146 C4 P15210 oash.SnapPuller.fetchLatestIndex Number of files in latest index in master: 1
[junit4:junit4]   2> 22647 T146 C4 P15210 oasc.CachingDirectoryFactory.get return new directory for /usr/home/hudson/hudson-slave/workspace/Lucene-Solr-Tests-4.x-Java6/solr/build/solr-core/test/J0/./org.apache.solr.cloud.SyncSliceTest-1362572444026/jetty3/index.20130306082106662 forceNew:false
[junit4:junit4]   2> 22647 T146 C4 P15210 oasc.CachingDirectoryFactory.close Releasing directory:/usr/home/hudson/hudson-slave/workspace/Lucene-Solr-Tests-4.x-Java6/solr/build/solr-core/test/J0/./org.apache.solr.cloud.SyncSliceTest-1362572444026/jetty3
[junit4:junit4]   2> 22648 T146 C4 P15210 oash.SnapPuller.fetchLatestIndex Starting download to MockDirWrapper(org.apache.lucene.store.MMapDirectory@/usr/home/hudson/hudson-slave/workspace/Lucene-Solr-Tests-4.x-Java6/solr/build/solr-core/test/J0/index94749482tmp lockFactory=org.apache.lucene.store.NativeFSLockFactory@108c4c0a) fullCopy=false
[junit4:junit4]   2> 22652 T103 C3 P31610 REQ /replication {file=segments_3&command=filecontent&checksum=true&wt=filestream&qt=/replication&generation=3} status=0 QTime=0 
[junit4:junit4]   2> 22653 T146 C4 P15210 oasc.CachingDirectoryFactory.close Releasing directory:/usr/home/hudson/hudson-slave/workspace/Lucene-Solr-Tests-4.x-Java6/solr/build/solr-core/test/J0/./org.apache.solr.cloud.SyncSliceTest-1362572444026/jetty3/index
[junit4:junit4]   2> 22653 T146 C4 P15210 oash.SnapPuller.fetchLatestIndex Total time taken for download : 0 secs
[junit4:junit4]   2> 22655 T146 C4 P15210 oasc.CachingDirectoryFactory.close Releasing directory:/usr/home/hudson/hudson-slave/workspace/Lucene-Solr-Tests-4.x-Java6/solr/build/solr-core/test/J0/./org.apache.solr.cloud.SyncSliceTest-1362572444026/jetty3
[junit4:junit4]   2> 22656 T146 C4 P15210 oasc.CachingDirectoryFactory.close Releasing directory:/usr/home/hudson/hudson-slave/workspace/Lucene-Solr-Tests-4.x-Java6/solr/build/solr-core/test/J0/./org.apache.solr.cloud.SyncSliceTest-1362572444026/jetty3
[junit4:junit4]   2> 22656 T146 C4 P15210 oasu.DefaultSolrCoreState.newIndexWriter Creating new IndexWriter...
[junit4:junit4]   2> 22657 T146 C4 P15210 oasu.DefaultSolrCoreState.newIndexWriter Waiting until IndexWriter is unused... core=collection1
[junit4:junit4]   2> 22657 T146 C4 P15210 oasc.CachingDirectoryFactory.close Releasing directory:/usr/home/hudson/hudson-slave/workspace/Lucene-Solr-Tests-4.x-Java6/solr/build/solr-core/test/J0/./org.apache.solr.cloud.SyncSliceTest-1362572444026/jetty3
[junit4:junit4]   2> 22659 T146 C4 P15210 oasc.SolrDeletionPolicy.onInit SolrDeletionPolicy.onInit: commits:num=2
[junit4:junit4]   2> 		commit{dir=BaseDirectoryWrapper(org.apache.lucene.store.RAMDirectory@161c8d89 lockFactory=org.apache.lucene.store.NativeFSLockFactory@2c60db95),segFN=segments_1,generation=1,filenames=[segments_1]
[junit4:junit4]   2> 		commit{dir=BaseDirectoryWrapper(org.apache.lucene.store.RAMDirectory@161c8d89 lockFactory=org.apache.lucene.store.NativeFSLockFactory@2c60db95),segFN=segments_3,generation=3,filenames=[segments_3]
[junit4:junit4]   2> 22659 T146 C4 P15210 oasc.SolrDeletionPolicy.updateCommits newest commit = 3[segments_3]
[junit4:junit4]   2> 22659 T146 C4 P15210 oasu.DefaultSolrCoreState.newIndexWriter New IndexWriter is ready to be used.
[junit4:junit4]   2> 22660 T146 C4 P15210 oasc.CachingDirectoryFactory.close Releasing directory:/usr/home/hudson/hudson-slave/workspace/Lucene-Solr-Tests-4.x-Java6/solr/build/solr-core/test/J0/./org.apache.solr.cloud.SyncSliceTest-1362572444026/jetty3
[junit4:junit4]   2> 22660 T146 C4 P15210 oass.SolrIndexSearcher.<init> Opening Searcher@2b697029 main
[junit4:junit4]   2> 22661 T143 oasc.SolrCore.registerSearcher [collection1] Registered new searcher Searcher@2b697029 main{StandardDirectoryReader(segments_3:1:nrt)}
[junit4:junit4]   2> 22662 T143 oasc.CachingDirectoryFactory.close Releasing directory:/usr/home/hudson/hudson-slave/workspace/Lucene-Solr-Tests-4.x-Java6/solr/build/solr-core/test/J0/./org.apache.solr.cloud.SyncSliceTest-1362572444026/jetty3/index
[junit4:junit4]   2> 22662 T146 C4 P15210 oash.SnapPuller.fetchLatestIndex removing temporary index download directory files MockDirWrapper(org.apache.lucene.store.MMapDirectory@/usr/home/hudson/hudson-slave/workspace/Lucene-Solr-Tests-4.x-Java6/solr/build/solr-core/test/J0/index94749482tmp lockFactory=org.apache.lucene.store.NativeFSLockFactory@108c4c0a)
[junit4:junit4]   2> 22663 T146 C4 P15210 oasc.CachingDirectoryFactory.close Releasing directory:/usr/home/hudson/hudson-slave/workspace/Lucene-Solr-Tests-4.x-Java6/solr/build/solr-core/test/J0/./org.apache.solr.cloud.SyncSliceTest-1362572444026/jetty3/index.20130306082106662
[junit4:junit4]   2> 22663 T146 C4 P15210 oasc.CachingDirectoryFactory.close Releasing directory:/usr/home/hudson/hudson-slave/workspace/Lucene-Solr-Tests-4.x-Java6/solr/build/solr-core/test/J0/./org.apache.solr.cloud.SyncSliceTest-1362572444026/jetty3/index
[junit4:junit4]   2> 22663 T146 C4 P15210 oasc.RecoveryStrategy.replay No replay needed. core=collection1
[junit4:junit4]   2> 22663 T146 C4 P15210 oasc.RecoveryStrategy.doRecovery Replication Recovery was successful - registering as Active. core=collection1
[junit4:junit4]   2> 22664 T146 C4 P15210 oasc.ZkController.publish publishing core=collection1 state=active
[junit4:junit4]   2> 22664 T146 C4 P15210 oasc.ZkController.publish numShards not found on descriptor - reading it from system property
[junit4:junit4]   2> 22666 T146 C4 P15210 oasc.RecoveryStrategy.doRecovery Finished recovery process. core=collection1
[junit4:junit4]   2> 22975 T160 oasc.CoreContainer.registerCore registering core: collection1
[junit4:junit4]   2> 22975 T160 oasc.ZkController.register Register replica - core:collection1 address:http://127.0.0.1:15308 collection:collection1 shard:shard1
[junit4:junit4]   2> 22980 T160 oasc.ZkController.register We are http://127.0.0.1:15308/collection1/ and leader is http://127.0.0.1:31610/collection1/
[junit4:junit4]   2> 22980 T160 oasc.ZkController.register No LogReplay needed for core=collection1 baseURL=http://127.0.0.1:15308
[junit4:junit4]   2> 22980 T160 oasc.ZkController.checkRecovery Core needs to recover:collection1
[junit4:junit4]   2> 22981 T160 oasu.DefaultSolrCoreState.doRecovery Running recovery - first canceling any ongoing recovery
[junit4:junit4]   2> ASYNC  NEW_CORE C5 name=collection1 org.apache.solr.core.SolrCore@2607ed8b url=http://127.0.0.1:15308/collection1 node=127.0.0.1:15308_ C5_STATE=coll:collection1 core:collection1 props:{state=down, core=collection1, collection=collection1, node_name=127.0.0.1:15308_, base_url=http://127.0.0.1:15308}
[junit4:junit4]   2> 22981 T164 C5 P15308 oasc.RecoveryStrategy.run Starting recovery process.  core=collection1 recoveringAfterStartup=true
[junit4:junit4]   2> 22982 T164 C5 P15308 oasc.RecoveryStrategy.doRecovery ###### startupVersions=[]
[junit4:junit4]   2> 22982 T164 C5 P15308 oasc.ZkController.publish publishing core=collection1 state=recovering
[junit4:junit4]   2> 22982 T160 oascc.ZkStateReader.updateClusterState Updating cloud state from ZooKeeper... 
[junit4:junit4]   2> 22982 T164 C5 P15308 oasc.ZkController.publish numShards not found on descriptor - reading it from system property
[junit4:junit4]   2> 22983 T68 oass.SolrDispatchFilter.init user.dir=/usr/home/hudson/hudson-slave/workspace/Lucene-Solr-Tests-4.x-Java6/solr/build/solr-core/test/J0
[junit4:junit4]   2> 22984 T164 C5 P15308 oascsi.HttpClientUtil.createClient Creating new http client, config:maxConnections=128&maxConnectionsPerHost=32&followRedirects=false
[junit4:junit4]   2> 22984 T68 oass.SolrDispatchFilter.init SolrDispatchFilter.init() done
[junit4:junit4]   2> 22985 T68 oascsi.HttpClientUtil.createClient Creating new http client, config:maxConnections=128&maxConnectionsPerHost=32&followRedirects=false
[junit4:junit4]   2> 23008 T68 oascc.ZkStateReader.updateClusterState Updating cloud state from ZooKeeper... 
[junit4:junit4]   2> 23010 T68 oasc.AbstractFullDistribZkTestBase.waitForThingsToLevelOut Wait for recoveries to finish - wait 15 for each attempt
[junit4:junit4]   2> 23011 T68 oasc.AbstractDistribZkTestBase.waitForRecoveriesToFinish Wait for recoveries to finish - collection: collection1 failOnTimeout:true timeout (sec):15
[junit4:junit4]   2> 23012 T68 oascc.ZkStateReader.updateClusterState Updating cloud state from ZooKeeper... 
[junit4:junit4]   2> 23498 T92 oascc.ZkStateReader.updateClusterState Updating cloud state from ZooKeeper... 
[junit4:junit4]   2> 23499 T92 oasc.Overseer$ClusterStateUpdater.updateState Update state numShards=1 message={
[junit4:junit4]   2> 	  "operation":"state",
[junit4:junit4]   2> 	  "core_node_name":"4",
[junit4:junit4]   2> 	  "numShards":"1",
[junit4:junit4]   2> 	  "shard":"shard1",
[junit4:junit4]   2> 	  "roles":null,
[junit4:junit4]   2> 	  "state":"active",
[junit4:junit4]   2> 	  "core":"collection1",
[junit4:junit4]   2> 	  "collection":"collection1",
[junit4:junit4]   2> 	  "node_name":"127.0.0.1:15210_",
[junit4:junit4]   2> 	  "base_url":"http://127.0.0.1:15210"}
[junit4:junit4]   2> 24519 T72 oazsp.FileTxnLog.commit WARNING fsync-ing the write ahead log in SyncThread:0 took 1018ms which will adversely effect operation latency. See the ZooKeeper troubleshooting guide
[junit4:junit4]   2> 24520 T68 oascc.ZkStateReader.updateClusterState Updating cloud state from ZooKeeper... 
[junit4:junit4]   2> 24548 T92 oasc.Overseer$ClusterStateUpdater.updateState Update state numShards=1 message={
[junit4:junit4]   2> 	  "operation":"state",
[junit4:junit4]   2> 	  "core_node_name":"5",
[junit4:junit4]   2> 	  "numShards":"1",
[junit4:junit4]   2> 	  "shard":"shard1",
[junit4:junit4]   2> 	  "roles":null,
[junit4:junit4]   2> 	  "state":"recovering",
[junit4:junit4]   2> 	  "core":"collection1",
[junit4:junit4]   2> 	  "collection":"collection1",
[junit4:junit4]   2> 	  "node_name":"127.0.0.1:15308_",
[junit4:junit4]   2> 	  "base_url":"http://127.0.0.1:15308"}
[junit4:junit4]   2> 24638 T91 oascc.ZkStateReader$2.process A cluster state change: WatchedEvent state:SyncConnected type:NodeDataChanged path:/clusterstate.json, has occurred - updating... (live nodes size: 5)
[junit4:junit4]   2> 24638 T125 oascc.ZkStateReader$2.process A cluster state change: WatchedEvent state:SyncConnected type:NodeDataChanged path:/clusterstate.json, has occurred - updating... (live nodes size: 5)
[junit4:junit4]   2> 24638 T97 oascc.ZkStateReader$2.process A cluster state change: WatchedEvent state:SyncConnected type:NodeDataChanged path:/clusterstate.json, has occurred - updating... (live nodes size: 5)
[junit4:junit4]   2> 24638 T110 oascc.ZkStateReader$2.process A cluster state change: WatchedEvent state:SyncConnected type:NodeDataChanged path:/clusterstate.json, has occurred - updating... (live nodes size: 5)
[junit4:junit4]   2> 24638 T159 oascc.ZkStateReader$2.process A cluster state change: WatchedEvent state:SyncConnected type:NodeDataChanged path:/clusterstate.json, has occurred - updating... (live nodes size: 5)
[junit4:junit4]   2> 24638 T141 oascc.ZkStateReader$2.process A cluster state change: WatchedEvent state:SyncConnected type:NodeDataChanged path:/clusterstate.json, has occurred - updating... (live nodes size: 5)
[junit4:junit4]   2> 25520 T106 oass.SolrDispatchFilter.handleAdminRequest /admin/cores {coreNodeName=5&state=recovering&nodeName=127.0.0.1:15308_&action=PREPRECOVERY&checkLive=true&core=collection1&wt=javabin&onlyIfLeader=true&version=2} status=0 QTime=2511 
[junit4:junit4]   2> 25524 T68 oascc.ZkStateReader.updateClusterState Updating cloud state from ZooKeeper... 
[junit4:junit4]   2> 26527 T68 oascc.ZkStateReader.updateClusterState Updating cloud state from ZooKeeper... 
[junit4:junit4]   2>  C5_STATE=coll:collection1 core:collection1 props:{shard=shard1, state=recovering, core=collection1, collection=collection1, node_name=127.0.0.1:15308_, base_url=http://127.0.0.1:15308}
[junit4:junit4]   2> 27522 T164 C5 P15308 oasc.RecoveryStrategy.doRecovery Attempting to PeerSync from http://127.0.0.1:31610/collection1/ core=collection1 - recoveringAfterStartup=true
[junit4:junit4]   2> 27522 T164 C5 P15308 oasu.PeerSync.sync PeerSync: core=collection1 url=http://127.0.0.1:15308 START replicas=[http://127.0.0.1:31610/collection1/] nUpdates=100
[junit4:junit4]   2> 27524 T164 C5 P15308 oasu.PeerSync.sync WARNING no frame of reference to tell of we've missed updates
[junit4:junit4]   2> 27524 T164 C5 P15308 oasc.RecoveryStrategy.doRecovery PeerSync Recovery was not successful - trying replication. core=collection1
[junit4:junit4]   2> 27524 T164 C5 P15308 oasc.RecoveryStrategy.doRecovery Starting Replication Recovery. core=collection1
[junit4:junit4]   2> 27524 T164 C5 P15308 oasc.RecoveryStrategy.doRecovery Begin buffering updates. core=collection1
[junit4:junit4]   2> 27525 T164 C5 P15308 oasu.UpdateLog.bufferUpdates Starting to buffer updates. FSUpdateLog{state=ACTIVE, tlog=null}
[junit4:junit4]   2> 27525 T164 C5 P15308 oasc.RecoveryStrategy.replicate Attempting to replicate from http://127.0.0.1:31610/collection1/. core=collection1
[junit4:junit4]   2> 27525 T164 C5 P15308 oascsi.HttpClientUtil.createClient Creating new http client, config:maxConnections=128&maxConnectionsPerHost=32&followRedirects=false
[junit4:junit4]   2> 27527 T101 C3 P31610 REQ /get {getVersions=100&distrib=false&wt=javabin&qt=/get&version=2} status=0 QTime=0 
[junit4:junit4]   2> 27529 T68 oascc.ZkStateReader.updateClusterState Updating cloud state from ZooKeeper... 
[junit4:junit4]   2> 27540 T100 C3 P31610 oasu.DirectUpdateHandler2.commit start commit{,optimize=false,openSearcher=false,waitSearcher=true,expungeDeletes=false,softCommit=false,prepareCommit=false}
[junit4:junit4]   2> 27540 T100 C3 P31610 oasc.SolrDeletionPolicy.onCommit SolrDeletionPolicy.onCommit: commits:num=3
[junit4:junit4]   2> 		commit{dir=BaseDirectoryWrapper(org.apache.lucene.store.RAMDirectory@4e2a718 lockFactory=org.apache.lucene.store.NativeFSLockFactory@21ef3faa),segFN=segments_2,generation=2,filenames=[segments_2]
[junit4:junit4]   2> 		commit{dir=BaseDirectoryWrapper(org.apache.lucene.store.RAMDirectory@4e2a718 lockFactory=org.apache.lucene.store.NativeFSLockFactory@21ef3faa),segFN=segments_3,generation=3,filenames=[segments_3]
[junit4:junit4]   2> 		commit{dir=BaseDirectoryWrapper(org.apache.lucene.store.RAMDirectory@4e2a718 lockFactory=org.apache.lucene.store.NativeFSLockFactory@21ef3faa),segFN=segments_4,generation=4,filenames=[segments_4]
[junit4:junit4]   2> 27541 T100 C3 P31610 oasc.SolrDeletionPolicy.updateCommits newest commit = 4[segments_4]
[junit4:junit4]   2> 27542 T100 C3 P31610 oasc.CachingDirectoryFactory.close Releasing directory:/usr/home/hudson/hudson-slave/workspace/Lucene-Solr-Tests-4.x-Java6/solr/build/solr-core/test/J0/./org.apache.solr.cloud.SyncSliceTest-1362572444026/jetty1
[junit4:junit4]   2> 27542 T100 C3 P31610 oasu.DirectUpdateHandler2.commit end_commit_flush
[junit4:junit4]   2> 27543 T100 C3 P31610 /update {waitSearcher=true&openSearcher=false&commit=true&wt=javabin&commit_end_point=true&version=2&softCommit=false} {commit=} 0 3
[junit4:junit4]   2> 27544 T164 C5 P15308 oash.ReplicationHandler.inform Commits will be reserved for  10000
[junit4:junit4]   2> 27544 T164 C5 P15308 oash.SnapPuller.<init>  No value set for 'pollInterval'. Timer Task not started.
[junit4:junit4]   2> 27547 T103 C3 P31610 REQ /replication {command=indexversion&qt=/replication&wt=javabin&version=2} status=0 QTime=1 
[junit4:junit4]   2> 27547 T164 C5 P15308 oash.SnapPuller.fetchLatestIndex Master's generation: 4
[junit4:junit4]   2> 27548 T164 C5 P15308 oash.SnapPuller.fetchLatestIndex Slave's generation: 1
[junit4:junit4]   2> 27548 T164 C5 P15308 oash.SnapPuller.fetchLatestIndex Starting replication process
[junit4:junit4]   2> 27551 T103 C3 P31610 oasc.CachingDirectoryFactory.close Releasing directory:/usr/home/hudson/hudson-slave/workspace/Lucene-Solr-Tests-4.x-Java6/solr/build/solr-core/test/J0/./org.apache.solr.cloud.SyncSliceTest-1362572444026/jetty1
[junit4:junit4]   2> 27551 T103 C3 P31610 oasc.CachingDirectoryFactory.close Releasing directory:/usr/home/hudson/hudson-slave/workspace/Lucene-Solr-Tests-4.x-Java6/solr/build/solr-core/test/J0/./org.apache.solr.cloud.SyncSliceTest-1362572444026/jetty1/index
[junit4:junit4]   2> 27551 T103 C3 P31610 REQ /replication {command=filelist&qt=/replication&wt=javabin&generation=4&version=2} status=0 QTime=1 
[junit4:junit4]   2> 27552 T164 C5 P15308 oash.SnapPuller.fetchLatestIndex Number of files in latest index in master: 1
[junit4:junit4]   2> 27554 T164 C5 P15308 oasc.CachingDirectoryFactory.get return new directory for /usr/home/hudson/hudson-slave/workspace/Lucene-Solr-Tests-4.x-Java6/solr/build/solr-core/test/J0/./org.apache.solr.cloud.SyncSliceTest-1362572444026/jetty4/index.20130306082111570 forceNew:false
[junit4:junit4]   2> 27555 T164 C5 P15308 oasc.CachingDirectoryFactory.close Releasing directory:/usr/home/hudson/hudson-slave/workspace/Lucene-Solr-Tests-4.x-Java6/solr/build/solr-core/test/J0/./org.apache.solr.cloud.SyncSliceTest-1362572444026/jetty4
[junit4:junit4]   2> 27555 T164 C5 P15308 oash.SnapPuller.fetchLatestIndex Starting download to MockDirWrapper(org.apache.lucene.store.MMapDirectory@/usr/home/hudson/hudson-slave/workspace/Lucene-Solr-Tests-4.x-Java6/solr/build/solr-core/test/J0/index94749483tmp lockFactory=org.apache.lucene.store.NativeFSLockFactory@397b0012) fullCopy=false
[junit4:junit4]   2> 27559 T103 C3 P31610 REQ /replication {file=segments_4&command=filecontent&checksum=true&wt=filestream&qt=/replication&generation=4} status=0 QTime=1 
[junit4:junit4]   2> 27560 T164 C5 P15308 oasc.CachingDirectoryFactory.close Releasing directory:/usr/home/hudson/hudson-slave/workspace/Lucene-Solr-Tests-4.x-Java6/solr/build/solr-core/test/J0/./org.apache.solr.cloud.SyncSliceTest-1362572444026/jetty4/index
[junit4:junit4]   2> 27560 T164 C5 P15308 oash.SnapPuller.fetchLatestIndex Total time taken for download : 0 secs
[junit4:junit4]   2> 27562 T164 C5 P15308 oasc.CachingDirectoryFactory.close Releasing directory:/usr/home/hudson/hudson-slave/workspace/Lucene-Solr-Tests-4.x-Java6/solr/build/solr-core/test/J0/./org.apache.solr.cloud.SyncSliceTest-1362572444026/jetty4
[junit4:junit4]   2> 27563 T164 C5 P15308 oasc.CachingDirectoryFactory.close Releasing directory:/usr/home/hudson/hudson-slave/workspace/Lucene-Solr-Tests-4.x-Java6/solr/build/solr-core/test/J0/./org.apache.solr.cloud.SyncSliceTest-1362572444026/jetty4
[junit4:junit4]   2> 27564 T164 C5 P15308 oasu.DefaultSolrCoreState.newIndexWriter Creating new IndexWriter...
[junit4:junit4]   2> 27564 T164 C5 P15308 oasu.DefaultSolrCoreState.newIndexWriter Waiting until IndexWriter is unused... core=collection1
[junit4:junit4]   2> 27564 T164 C5 P15308 oasc.CachingDirectoryFactory.close Releasing directory:/usr/home/hudson/hudson-slave/workspace/Lucene-Solr-Tests-4.x-Java6/solr/build/solr-core/test/J0/./org.apache.solr.cloud.SyncSliceTest-1362572444026/jetty4
[junit4:junit4]   2> 27566 T164 C5 P15308 oasc.SolrDeletionPolicy.onInit SolrDeletionPolicy.onInit: commits:num=2
[junit4:junit4]   

[...truncated too long message...]

36)
[junit4:junit4]    > 	at com.carrotsearch.randomizedtesting.rules.SystemPropertiesRestoreRule$1.evaluate(SystemPropertiesRestoreRule.java:53)
[junit4:junit4]    > 	at org.apache.lucene.util.AbstractBeforeAfterRule$1.evaluate(AbstractBeforeAfterRule.java:46)
[junit4:junit4]    > 	at org.apache.lucene.util.TestRuleStoreClassName$1.evaluate(TestRuleStoreClassName.java:42)
[junit4:junit4]    > 	at com.carrotsearch.randomizedtesting.rules.SystemPropertiesInvariantRule$1.evaluate(SystemPropertiesInvariantRule.java:55)
[junit4:junit4]    > 	at com.carrotsearch.randomizedtesting.rules.NoShadowingOrOverridesOnMethodsRule$1.evaluate(NoShadowingOrOverridesOnMethodsRule.java:39)
[junit4:junit4]    > 	at com.carrotsearch.randomizedtesting.rules.NoShadowingOrOverridesOnMethodsRule$1.evaluate(NoShadowingOrOverridesOnMethodsRule.java:39)
[junit4:junit4]    > 	at com.carrotsearch.randomizedtesting.rules.StatementAdapter.evaluate(StatementAdapter.java:36)
[junit4:junit4]    > 	at org.apache.lucene.util.TestRuleAssertionsRequired$1.evaluate(TestRuleAssertionsRequired.java:43)
[junit4:junit4]    > 	at org.apache.lucene.util.TestRuleMarkFailure$1.evaluate(TestRuleMarkFailure.java:48)
[junit4:junit4]    > 	at org.apache.lucene.util.TestRuleIgnoreAfterMaxFailures$1.evaluate(TestRuleIgnoreAfterMaxFailures.java:70)
[junit4:junit4]    > 	at org.apache.lucene.util.TestRuleIgnoreTestSuites$1.evaluate(TestRuleIgnoreTestSuites.java:55)
[junit4:junit4]    > 	at com.carrotsearch.randomizedtesting.rules.StatementAdapter.evaluate(StatementAdapter.java:36)
[junit4:junit4]    > 	at com.carrotsearch.randomizedtesting.ThreadLeakControl$StatementRunner.run(ThreadLeakControl.java:358)
[junit4:junit4]    > 	at java.lang.Thread.run(Thread.java:679)
[junit4:junit4]   2> 144952 T68 oas.SolrTestCaseJ4.deleteCore ###deleteCore
[junit4:junit4]   2> 144984 T71 oazs.SessionTrackerImpl.run SessionTrackerImpl exited loop!
[junit4:junit4]   2> 145953 T159 oascc.ZkStateReader$3.process WARNING ZooKeeper watch triggered, but Solr cannot talk to ZK
[junit4:junit4]   2> 145953 T159 oascc.ZkStateReader$2.process A cluster state change: WatchedEvent state:SyncConnected type:NodeChildrenChanged path:/live_nodes, has occurred - updating... (live nodes size: 1)
[junit4:junit4]   2> 145953 T159 oascc.ZkStateReader$2.process WARNING ZooKeeper watch triggered, but Solr cannot talk to ZK
[junit4:junit4]   2> 145953 T159 oaz.ClientCnxn$EventThread.run EventThread shut down
[junit4:junit4]   2> 172452 T141 oasu.PeerSync.handleResponse WARNING PeerSync: core=collection1 url=http://127.0.0.1:15210  couldn't connect to http://127.0.0.1:15202/collection1/, counting as success
[junit4:junit4]   2> 172452 T141 oasu.PeerSync.sync PeerSync: core=collection1 url=http://127.0.0.1:15210 DONE. sync succeeded
[junit4:junit4]   2> 172453 T141 oasc.SyncStrategy.syncReplicas We have been closed, won't attempt to sync replicas back to leader
[junit4:junit4]   2> 172455 T141 oasc.ShardLeaderElectionContext.rejoinLeaderElection Not rejoining election because CoreContainer is shutdown
[junit4:junit4]   2> 172455 T141 oasc.SolrCore.close [collection1]  CLOSING SolrCore org.apache.solr.core.SolrCore@5ee16306
[junit4:junit4]   2> 172457 T141 oasu.DirectUpdateHandler2.close closing DirectUpdateHandler2{commits=10,autocommits=0,soft autocommits=0,optimizes=0,rollbacks=0,expungeDeletes=0,docsPending=0,adds=0,deletesById=0,deletesByQuery=0,errors=0,cumulative_adds=305,cumulative_deletesById=0,cumulative_deletesByQuery=1,cumulative_errors=0}
[junit4:junit4]   2> 172457 T141 oasu.SolrCoreState.decrefSolrCoreState Closing SolrCoreState
[junit4:junit4]   2> 172457 T141 oasu.DefaultSolrCoreState.closeIndexWriter SolrCoreState ref count has reached 0 - closing IndexWriter
[junit4:junit4]   2> 172458 T141 oasu.DefaultSolrCoreState.closeIndexWriter closing IndexWriter with IndexWriterCloser
[junit4:junit4]   2> 172458 T141 C4 P15210 oasu.TransactionLog.forceClose SEVERE Error: Forcing close of tlog{file=./org.apache.solr.cloud.SyncSliceTest-1362572444026/jetty3/tlog/tlog.0000000000000000005 refcount=1}
[junit4:junit4]   2> 172460 T141 C4 P15210 oasc.CachingDirectoryFactory.close Releasing directory:/usr/home/hudson/hudson-slave/workspace/Lucene-Solr-Tests-4.x-Java6/solr/build/solr-core/test/J0/./org.apache.solr.cloud.SyncSliceTest-1362572444026/jetty3/index
[junit4:junit4]   2> 172461 T141 oasc.SolrCore.closeSearcher [collection1] Closing main searcher on request.
[junit4:junit4]   2> 172461 T141 oasc.CachingDirectoryFactory.close Releasing directory:/usr/home/hudson/hudson-slave/workspace/Lucene-Solr-Tests-4.x-Java6/solr/build/solr-core/test/J0/./org.apache.solr.cloud.SyncSliceTest-1362572444026/jetty3/index
[junit4:junit4]   2> 172461 T141 oasc.CachingDirectoryFactory.close Closing directory when closing factory:/usr/home/hudson/hudson-slave/workspace/Lucene-Solr-Tests-4.x-Java6/solr/build/solr-core/test/J0/./org.apache.solr.cloud.SyncSliceTest-1362572444026/jetty3
[junit4:junit4]   2> 172462 T141 oasc.CachingDirectoryFactory.closeDirectory Closing directory:/usr/home/hudson/hudson-slave/workspace/Lucene-Solr-Tests-4.x-Java6/solr/build/solr-core/test/J0/./org.apache.solr.cloud.SyncSliceTest-1362572444026/jetty3
[junit4:junit4]   2> 172462 T141 oasc.CachingDirectoryFactory.close Closing directory when closing factory:/usr/home/hudson/hudson-slave/workspace/Lucene-Solr-Tests-4.x-Java6/solr/build/solr-core/test/J0/./org.apache.solr.cloud.SyncSliceTest-1362572444026/jetty3/index
[junit4:junit4]   2> 172462 T141 oasc.CachingDirectoryFactory.closeDirectory Closing directory:/usr/home/hudson/hudson-slave/workspace/Lucene-Solr-Tests-4.x-Java6/solr/build/solr-core/test/J0/./org.apache.solr.cloud.SyncSliceTest-1362572444026/jetty3/index
[junit4:junit4]   2> 172480 T141 oasc.CachingDirectoryFactory.close Closing directory when closing factory:/usr/home/hudson/hudson-slave/workspace/Lucene-Solr-Tests-4.x-Java6/solr/build/solr-core/test/J0/./org.apache.solr.cloud.SyncSliceTest-1362572444026/jetty3/index.20130306082106662
[junit4:junit4]   2> 172480 T141 oasc.CachingDirectoryFactory.closeDirectory Closing directory:/usr/home/hudson/hudson-slave/workspace/Lucene-Solr-Tests-4.x-Java6/solr/build/solr-core/test/J0/./org.apache.solr.cloud.SyncSliceTest-1362572444026/jetty3/index.20130306082106662
[junit4:junit4]   2> 172481 T141 oascc.ZkStateReader$3.process WARNING ZooKeeper watch triggered, but Solr cannot talk to ZK
[junit4:junit4]   2> 172481 T141 oascc.ZkStateReader$2.process A cluster state change: WatchedEvent state:SyncConnected type:NodeChildrenChanged path:/live_nodes, has occurred - updating... (live nodes size: 3)
[junit4:junit4]   2> 172481 T141 oascc.ZkStateReader$2.process WARNING ZooKeeper watch triggered, but Solr cannot talk to ZK
[junit4:junit4]   2> 172481 T141 oasc.LeaderElector$1.process WARNING  org.apache.zookeeper.KeeperException$SessionExpiredException: KeeperErrorCode = Session expired for /overseer_elect/election
[junit4:junit4]   2> 	at org.apache.zookeeper.KeeperException.create(KeeperException.java:127)
[junit4:junit4]   2> 	at org.apache.zookeeper.KeeperException.create(KeeperException.java:51)
[junit4:junit4]   2> 	at org.apache.zookeeper.ZooKeeper.getChildren(ZooKeeper.java:1468)
[junit4:junit4]   2> 	at org.apache.solr.common.cloud.SolrZkClient$6.execute(SolrZkClient.java:236)
[junit4:junit4]   2> 	at org.apache.solr.common.cloud.SolrZkClient$6.execute(SolrZkClient.java:233)
[junit4:junit4]   2> 	at org.apache.solr.common.cloud.ZkCmdExecutor.retryOperation(ZkCmdExecutor.java:65)
[junit4:junit4]   2> 	at org.apache.solr.common.cloud.SolrZkClient.getChildren(SolrZkClient.java:233)
[junit4:junit4]   2> 	at org.apache.solr.cloud.LeaderElector.checkIfIamLeader(LeaderElector.java:84)
[junit4:junit4]   2> 	at org.apache.solr.cloud.LeaderElector.access$000(LeaderElector.java:55)
[junit4:junit4]   2> 	at org.apache.solr.cloud.LeaderElector$1.process(LeaderElector.java:129)
[junit4:junit4]   2> 	at org.apache.zookeeper.ClientCnxn$EventThread.processEvent(ClientCnxn.java:519)
[junit4:junit4]   2> 	at org.apache.zookeeper.ClientCnxn$EventThread.run(ClientCnxn.java:495)
[junit4:junit4]   2> 
[junit4:junit4]   2> 172482 T141 oaz.ClientCnxn$EventThread.run EventThread shut down
[junit4:junit4]   2> NOTE: test params are: codec=Lucene40, sim=DefaultSimilarity, locale=tr, timezone=America/Lower_Princes
[junit4:junit4]   2> NOTE: FreeBSD 9.0-RELEASE amd64/Sun Microsystems Inc. 1.6.0_32 (64-bit)/cpus=16,threads=3,free=284940136,total=427884544
[junit4:junit4]   2> NOTE: All tests run in this JVM: [TestCollationKeyRangeQueries, SearchHandlerTest, TestJoin, SyncSliceTest]
[junit4:junit4] Completed on J0 in 173.03s, 1 test, 1 failure <<< FAILURES!

[...truncated 772 lines...]
BUILD FAILED
/usr/home/hudson/hudson-slave/workspace/Lucene-Solr-Tests-4.x-Java6/build.xml:381: The following error occurred while executing this line:
/usr/home/hudson/hudson-slave/workspace/Lucene-Solr-Tests-4.x-Java6/build.xml:361: The following error occurred while executing this line:
/usr/home/hudson/hudson-slave/workspace/Lucene-Solr-Tests-4.x-Java6/build.xml:39: The following error occurred while executing this line:
/usr/home/hudson/hudson-slave/workspace/Lucene-Solr-Tests-4.x-Java6/solr/build.xml:183: The following error occurred while executing this line:
/usr/home/hudson/hudson-slave/workspace/Lucene-Solr-Tests-4.x-Java6/solr/common-build.xml:449: The following error occurred while executing this line:
/usr/home/hudson/hudson-slave/workspace/Lucene-Solr-Tests-4.x-Java6/lucene/common-build.xml:1213: The following error occurred while executing this line:
/usr/home/hudson/hudson-slave/workspace/Lucene-Solr-Tests-4.x-Java6/lucene/common-build.xml:877: There were test failures: 267 suites, 1127 tests, 1 failure, 23 ignored (4 assumptions)

Total time: 46 minutes 3 seconds
Build step 'Invoke Ant' marked build as failure
Archiving artifacts
Recording test results
Email was triggered for: Failure
Sending email for trigger: Failure



Mime
View raw message