lucene-dev mailing list archives

Site index · List index
Message view « Date » · « Thread »
Top « Date » · « Thread »
From Robert Muir <rcm...@gmail.com>
Subject Re: [JENKINS] Lucene-trunk-Linux-Java7-64-test-only - Build # 25214 - Failure!
Date Tue, 26 Feb 2013 11:59:59 GMT
test bug: i committed a fix

On Tue, Feb 26, 2013 at 6:01 AM,  <builder@flonkings.com> wrote:
> Build: builds.flonkings.com/job/Lucene-trunk-Linux-Java7-64-test-only/25214/
>
> 1 tests failed.
> REGRESSION:  org.apache.lucene.search.TestSameScoresWithThreads.test
>
> Error Message:
> MockDirectoryWrapper: cannot close: there are still open files: {_0.tvx=1, _0.pos=1,
_0.dvd=1, _0.tvd=1, _0.nvd=1, _0.tim=1, _0.tvf=1, _0.fdx=1, _0.doc=1, _0.fdt=1}
>
> Stack Trace:
> java.lang.RuntimeException: MockDirectoryWrapper: cannot close: there are still open
files: {_0.tvx=1, _0.pos=1, _0.dvd=1, _0.tvd=1, _0.nvd=1, _0.tim=1, _0.tvf=1, _0.fdx=1, _0.doc=1,
_0.fdt=1}
>         at __randomizedtesting.SeedInfo.seed([3E926F8BCE0591B5:B6C6505160F9FC4D]:0)
>         at org.apache.lucene.store.MockDirectoryWrapper.close(MockDirectoryWrapper.java:585)
>         at org.apache.lucene.search.TestSameScoresWithThreads.test(TestSameScoresWithThreads.java:121)
>         at sun.reflect.NativeMethodAccessorImpl.invoke0(Native Method)
>         at sun.reflect.NativeMethodAccessorImpl.invoke(NativeMethodAccessorImpl.java:57)
>         at sun.reflect.DelegatingMethodAccessorImpl.invoke(DelegatingMethodAccessorImpl.java:43)
>         at java.lang.reflect.Method.invoke(Method.java:601)
>         at com.carrotsearch.randomizedtesting.RandomizedRunner.invoke(RandomizedRunner.java:1559)
>         at com.carrotsearch.randomizedtesting.RandomizedRunner.access$600(RandomizedRunner.java:79)
>         at com.carrotsearch.randomizedtesting.RandomizedRunner$6.evaluate(RandomizedRunner.java:737)
>         at com.carrotsearch.randomizedtesting.RandomizedRunner$7.evaluate(RandomizedRunner.java:773)
>         at com.carrotsearch.randomizedtesting.RandomizedRunner$8.evaluate(RandomizedRunner.java:787)
>         at org.apache.lucene.util.TestRuleSetupTeardownChained$1.evaluate(TestRuleSetupTeardownChained.java:50)
>         at org.apache.lucene.util.TestRuleFieldCacheSanity$1.evaluate(TestRuleFieldCacheSanity.java:51)
>         at org.apache.lucene.util.AbstractBeforeAfterRule$1.evaluate(AbstractBeforeAfterRule.java:46)
>         at com.carrotsearch.randomizedtesting.rules.SystemPropertiesInvariantRule$1.evaluate(SystemPropertiesInvariantRule.java:55)
>         at org.apache.lucene.util.TestRuleThreadAndTestName$1.evaluate(TestRuleThreadAndTestName.java:49)
>         at org.apache.lucene.util.TestRuleIgnoreAfterMaxFailures$1.evaluate(TestRuleIgnoreAfterMaxFailures.java:70)
>         at org.apache.lucene.util.TestRuleMarkFailure$1.evaluate(TestRuleMarkFailure.java:48)
>         at com.carrotsearch.randomizedtesting.rules.StatementAdapter.evaluate(StatementAdapter.java:36)
>         at com.carrotsearch.randomizedtesting.ThreadLeakControl$StatementRunner.run(ThreadLeakControl.java:358)
>         at com.carrotsearch.randomizedtesting.ThreadLeakControl.forkTimeoutingTask(ThreadLeakControl.java:782)
>         at com.carrotsearch.randomizedtesting.ThreadLeakControl$3.evaluate(ThreadLeakControl.java:442)
>         at com.carrotsearch.randomizedtesting.RandomizedRunner.runSingleTest(RandomizedRunner.java:746)
>         at com.carrotsearch.randomizedtesting.RandomizedRunner$3.evaluate(RandomizedRunner.java:648)
>         at com.carrotsearch.randomizedtesting.RandomizedRunner$4.evaluate(RandomizedRunner.java:682)
>         at com.carrotsearch.randomizedtesting.RandomizedRunner$5.evaluate(RandomizedRunner.java:693)
>         at org.apache.lucene.util.AbstractBeforeAfterRule$1.evaluate(AbstractBeforeAfterRule.java:46)
>         at org.apache.lucene.util.TestRuleStoreClassName$1.evaluate(TestRuleStoreClassName.java:42)
>         at com.carrotsearch.randomizedtesting.rules.SystemPropertiesInvariantRule$1.evaluate(SystemPropertiesInvariantRule.java:55)
>         at com.carrotsearch.randomizedtesting.rules.NoShadowingOrOverridesOnMethodsRule$1.evaluate(NoShadowingOrOverridesOnMethodsRule.java:39)
>         at com.carrotsearch.randomizedtesting.rules.NoShadowingOrOverridesOnMethodsRule$1.evaluate(NoShadowingOrOverridesOnMethodsRule.java:39)
>         at com.carrotsearch.randomizedtesting.rules.StatementAdapter.evaluate(StatementAdapter.java:36)
>         at org.apache.lucene.util.TestRuleAssertionsRequired$1.evaluate(TestRuleAssertionsRequired.java:43)
>         at org.apache.lucene.util.TestRuleMarkFailure$1.evaluate(TestRuleMarkFailure.java:48)
>         at org.apache.lucene.util.TestRuleIgnoreAfterMaxFailures$1.evaluate(TestRuleIgnoreAfterMaxFailures.java:70)
>         at org.apache.lucene.util.TestRuleIgnoreTestSuites$1.evaluate(TestRuleIgnoreTestSuites.java:55)
>         at com.carrotsearch.randomizedtesting.rules.StatementAdapter.evaluate(StatementAdapter.java:36)
>         at com.carrotsearch.randomizedtesting.ThreadLeakControl$StatementRunner.run(ThreadLeakControl.java:358)
>         at java.lang.Thread.run(Thread.java:722)
> Caused by: java.lang.RuntimeException: unclosed IndexInput: _0.nvd
>         at org.apache.lucene.store.MockDirectoryWrapper.addFileHandle(MockDirectoryWrapper.java:476)
>         at org.apache.lucene.store.MockDirectoryWrapper.openInput(MockDirectoryWrapper.java:518)
>         at org.apache.lucene.codecs.lucene42.Lucene42DocValuesProducer.<init>(Lucene42DocValuesProducer.java:96)
>         at org.apache.lucene.codecs.lucene42.Lucene42NormsFormat.normsProducer(Lucene42NormsFormat.java:57)
>         at org.apache.lucene.codecs.asserting.AssertingNormsFormat.normsProducer(AssertingNormsFormat.java:47)
>         at org.apache.lucene.index.SegmentCoreReaders.<init>(SegmentCoreReaders.java:141)
>         at org.apache.lucene.index.SegmentReader.<init>(SegmentReader.java:56)
>         at org.apache.lucene.index.ReadersAndLiveDocs.getReader(ReadersAndLiveDocs.java:121)
>         at org.apache.lucene.index.ReadersAndLiveDocs.getReadOnlyClone(ReadersAndLiveDocs.java:218)
>         at org.apache.lucene.index.StandardDirectoryReader.open(StandardDirectoryReader.java:96)
>         at org.apache.lucene.index.IndexWriter.getReader(IndexWriter.java:367)
>         at org.apache.lucene.index.RandomIndexWriter.getReader(RandomIndexWriter.java:310)
>         at org.apache.lucene.index.RandomIndexWriter.getReader(RandomIndexWriter.java:255)
>         at org.apache.lucene.search.TestSameScoresWithThreads.test(TestSameScoresWithThreads.java:56)
>         ... 37 more
>
>
>
>
> Build Log:
> [...truncated 1157 lines...]
> [junit4:junit4] Suite: org.apache.lucene.search.TestSameScoresWithThreads
> [junit4:junit4]   2> NOTE: reproduce with: ant test  -Dtestcase=TestSameScoresWithThreads
-Dtests.method=test -Dtests.seed=3E926F8BCE0591B5 -Dtests.slow=true -Dtests.locale=es_CR -Dtests.timezone=Australia/Broken_Hill
-Dtests.file.encoding=US-ASCII
> [junit4:junit4] ERROR   1.75s J2 | TestSameScoresWithThreads.test <<<
> [junit4:junit4]    > Throwable #1: java.lang.RuntimeException: MockDirectoryWrapper:
cannot close: there are still open files: {_0.tvx=1, _0.pos=1, _0.dvd=1, _0.tvd=1, _0.nvd=1,
_0.tim=1, _0.tvf=1, _0.fdx=1, _0.doc=1, _0.fdt=1}
> [junit4:junit4]    >    at __randomizedtesting.SeedInfo.seed([3E926F8BCE0591B5:B6C6505160F9FC4D]:0)
> [junit4:junit4]    >    at org.apache.lucene.store.MockDirectoryWrapper.close(MockDirectoryWrapper.java:585)
> [junit4:junit4]    >    at org.apache.lucene.search.TestSameScoresWithThreads.test(TestSameScoresWithThreads.java:121)
> [junit4:junit4]    >    at sun.reflect.NativeMethodAccessorImpl.invoke0(Native Method)
> [junit4:junit4]    >    at sun.reflect.NativeMethodAccessorImpl.invoke(NativeMethodAccessorImpl.java:57)
> [junit4:junit4]    >    at sun.reflect.DelegatingMethodAccessorImpl.invoke(DelegatingMethodAccessorImpl.java:43)
> [junit4:junit4]    >    at java.lang.reflect.Method.invoke(Method.java:601)
> [junit4:junit4]    >    at com.carrotsearch.randomizedtesting.RandomizedRunner.invoke(RandomizedRunner.java:1559)
> [junit4:junit4]    >    at com.carrotsearch.randomizedtesting.RandomizedRunner.access$600(RandomizedRunner.java:79)
> [junit4:junit4]    >    at com.carrotsearch.randomizedtesting.RandomizedRunner$6.evaluate(RandomizedRunner.java:737)
> [junit4:junit4]    >    at com.carrotsearch.randomizedtesting.RandomizedRunner$7.evaluate(RandomizedRunner.java:773)
> [junit4:junit4]    >    at com.carrotsearch.randomizedtesting.RandomizedRunner$8.evaluate(RandomizedRunner.java:787)
> [junit4:junit4]    >    at org.apache.lucene.util.TestRuleSetupTeardownChained$1.evaluate(TestRuleSetupTeardownChained.java:50)
> [junit4:junit4]    >    at org.apache.lucene.util.TestRuleFieldCacheSanity$1.evaluate(TestRuleFieldCacheSanity.java:51)
> [junit4:junit4]    >    at org.apache.lucene.util.AbstractBeforeAfterRule$1.evaluate(AbstractBeforeAfterRule.java:46)
> [junit4:junit4]    >    at com.carrotsearch.randomizedtesting.rules.SystemPropertiesInvariantRule$1.evaluate(SystemPropertiesInvariantRule.java:55)
> [junit4:junit4]    >    at org.apache.lucene.util.TestRuleThreadAndTestName$1.evaluate(TestRuleThreadAndTestName.java:49)
> [junit4:junit4]    >    at org.apache.lucene.util.TestRuleIgnoreAfterMaxFailures$1.evaluate(TestRuleIgnoreAfterMaxFailures.java:70)
> [junit4:junit4]    >    at org.apache.lucene.util.TestRuleMarkFailure$1.evaluate(TestRuleMarkFailure.java:48)
> [junit4:junit4]    >    at com.carrotsearch.randomizedtesting.rules.StatementAdapter.evaluate(StatementAdapter.java:36)
> [junit4:junit4]    >    at com.carrotsearch.randomizedtesting.ThreadLeakControl$StatementRunner.run(ThreadLeakControl.java:358)
> [junit4:junit4]    >    at com.carrotsearch.randomizedtesting.ThreadLeakControl.forkTimeoutingTask(ThreadLeakControl.java:782)
> [junit4:junit4]    >    at com.carrotsearch.randomizedtesting.ThreadLeakControl$3.evaluate(ThreadLeakControl.java:442)
> [junit4:junit4]    >    at com.carrotsearch.randomizedtesting.RandomizedRunner.runSingleTest(RandomizedRunner.java:746)
> [junit4:junit4]    >    at com.carrotsearch.randomizedtesting.RandomizedRunner$3.evaluate(RandomizedRunner.java:648)
> [junit4:junit4]    >    at com.carrotsearch.randomizedtesting.RandomizedRunner$4.evaluate(RandomizedRunner.java:682)
> [junit4:junit4]    >    at com.carrotsearch.randomizedtesting.RandomizedRunner$5.evaluate(RandomizedRunner.java:693)
> [junit4:junit4]    >    at org.apache.lucene.util.AbstractBeforeAfterRule$1.evaluate(AbstractBeforeAfterRule.java:46)
> [junit4:junit4]    >    at org.apache.lucene.util.TestRuleStoreClassName$1.evaluate(TestRuleStoreClassName.java:42)
> [junit4:junit4]    >    at com.carrotsearch.randomizedtesting.rules.SystemPropertiesInvariantRule$1.evaluate(SystemPropertiesInvariantRule.java:55)
> [junit4:junit4]    >    at com.carrotsearch.randomizedtesting.rules.NoShadowingOrOverridesOnMethodsRule$1.evaluate(NoShadowingOrOverridesOnMethodsRule.java:39)
> [junit4:junit4]    >    at com.carrotsearch.randomizedtesting.rules.NoShadowingOrOverridesOnMethodsRule$1.evaluate(NoShadowingOrOverridesOnMethodsRule.java:39)
> [junit4:junit4]    >    at com.carrotsearch.randomizedtesting.rules.StatementAdapter.evaluate(StatementAdapter.java:36)
> [junit4:junit4]    >    at org.apache.lucene.util.TestRuleAssertionsRequired$1.evaluate(TestRuleAssertionsRequired.java:43)
> [junit4:junit4]    >    at org.apache.lucene.util.TestRuleMarkFailure$1.evaluate(TestRuleMarkFailure.java:48)
> [junit4:junit4]    >    at org.apache.lucene.util.TestRuleIgnoreAfterMaxFailures$1.evaluate(TestRuleIgnoreAfterMaxFailures.java:70)
> [junit4:junit4]    >    at org.apache.lucene.util.TestRuleIgnoreTestSuites$1.evaluate(TestRuleIgnoreTestSuites.java:55)
> [junit4:junit4]    >    at com.carrotsearch.randomizedtesting.rules.StatementAdapter.evaluate(StatementAdapter.java:36)
> [junit4:junit4]    >    at com.carrotsearch.randomizedtesting.ThreadLeakControl$StatementRunner.run(ThreadLeakControl.java:358)
> [junit4:junit4]    >    at java.lang.Thread.run(Thread.java:722)
> [junit4:junit4]    > Caused by: java.lang.RuntimeException: unclosed IndexInput: _0.nvd
> [junit4:junit4]    >    at org.apache.lucene.store.MockDirectoryWrapper.addFileHandle(MockDirectoryWrapper.java:476)
> [junit4:junit4]    >    at org.apache.lucene.store.MockDirectoryWrapper.openInput(MockDirectoryWrapper.java:518)
> [junit4:junit4]    >    at org.apache.lucene.codecs.lucene42.Lucene42DocValuesProducer.<init>(Lucene42DocValuesProducer.java:96)
> [junit4:junit4]    >    at org.apache.lucene.codecs.lucene42.Lucene42NormsFormat.normsProducer(Lucene42NormsFormat.java:57)
> [junit4:junit4]    >    at org.apache.lucene.codecs.asserting.AssertingNormsFormat.normsProducer(AssertingNormsFormat.java:47)
> [junit4:junit4]    >    at org.apache.lucene.index.SegmentCoreReaders.<init>(SegmentCoreReaders.java:141)
> [junit4:junit4]    >    at org.apache.lucene.index.SegmentReader.<init>(SegmentReader.java:56)
> [junit4:junit4]    >    at org.apache.lucene.index.ReadersAndLiveDocs.getReader(ReadersAndLiveDocs.java:121)
> [junit4:junit4]    >    at org.apache.lucene.index.ReadersAndLiveDocs.getReadOnlyClone(ReadersAndLiveDocs.java:218)
> [junit4:junit4]    >    at org.apache.lucene.index.StandardDirectoryReader.open(StandardDirectoryReader.java:96)
> [junit4:junit4]    >    at org.apache.lucene.index.IndexWriter.getReader(IndexWriter.java:367)
> [junit4:junit4]    >    at org.apache.lucene.index.RandomIndexWriter.getReader(RandomIndexWriter.java:310)
> [junit4:junit4]    >    at org.apache.lucene.index.RandomIndexWriter.getReader(RandomIndexWriter.java:255)
> [junit4:junit4]    >    at org.apache.lucene.search.TestSameScoresWithThreads.test(TestSameScoresWithThreads.java:56)
> [junit4:junit4]    >    ... 37 more
> [junit4:junit4]   2> NOTE: test params are: codec=Asserting, sim=DefaultSimilarity,
locale=es_CR, timezone=Australia/Broken_Hill
> [junit4:junit4]   2> NOTE: Linux 3.2.0-26-generic amd64/Oracle Corporation 1.7.0_05
(64-bit)/cpus=8,threads=1,free=112853408,total=260833280
> [junit4:junit4]   2> NOTE: All tests run in this JVM: [TestBooleanQuery, TestIndexableField,
TestRegexpQuery, TestConcurrentMergeScheduler, TestDocCount, TestPerFieldPostingsFormat, TestDisjunctionMaxQuery,
TestTermVectors, TestBitVector, TestLazyProxSkipping, ThrowInUncaught, TestFieldMaskingSpanQuery,
TestLevenshteinAutomata, TestRollback, TestForUtil, TestFixedBitSet, TestAutomatonQueryUnicode,
TestPhrasePrefixQuery, TestMockAnalyzer, TestDocBoost, TestBagOfPostings, TestFSTs, TestIndexWriterWithThreads,
TestPackedInts, TestAtomicUpdate, TestIndexWriterUnicode, TestNRTCachingDirectory, TestWeakIdentityMap,
TestDeterminizeLexicon, TestDocValuesIndexing, TestFieldCacheRewriteMethod, TestUTF32ToUTF8,
TestSegmentMerger, TestWindowsMMap, TestMaxTermFrequency, TestFieldCacheSanityChecker, TestTermsEnum2,
TestUnicodeUtil, TestSimilarity2, TestSimpleExplanationsOfNonMatches, TestSpanMultiTermQueryWrapper,
TestPerSegmentDeletes, TestParallelReaderEmptyIndex, TestTopDocsCollector, TestBooleanScorer,
TestDirectory, TestBinaryDocument, TestVirtualMethod, MultiCollectorTest, TestVersionComparator,
TestIOUtils, TestLucene40PostingsFormat, TestTwoPhaseCommitTool, TestBooleanQueryVisitSubscorers,
TestSameScoresWithThreads]
> [junit4:junit4] Completed on J2 in 1.84s, 1 test, 1 error <<< FAILURES!
>
> [...truncated 60 lines...]
> BUILD FAILED
> /var/lib/jenkins/workspace/Lucene-trunk-Linux-Java7-64-test-only/checkout/lucene/build.xml:50:
The following error occurred while executing this line:
> /var/lib/jenkins/workspace/Lucene-trunk-Linux-Java7-64-test-only/checkout/lucene/common-build.xml:1202:
The following error occurred while executing this line:
> /var/lib/jenkins/workspace/Lucene-trunk-Linux-Java7-64-test-only/checkout/lucene/common-build.xml:865:
There were test failures: 342 suites, 2138 tests, 1 error, 43 ignored (31 assumptions)
>
> Total time: 4 minutes 26 seconds
> Build step 'Invoke Ant' marked build as failure
> Archiving artifacts
> Recording test results
> Email was triggered for: Failure
> Sending email for trigger: Failure
>
>
>
>
>
> ---------------------------------------------------------------------
> To unsubscribe, e-mail: dev-unsubscribe@lucene.apache.org
> For additional commands, e-mail: dev-help@lucene.apache.org

---------------------------------------------------------------------
To unsubscribe, e-mail: dev-unsubscribe@lucene.apache.org
For additional commands, e-mail: dev-help@lucene.apache.org


Mime
View raw message