lucene-dev mailing list archives

Site index · List index
Message view « Date » · « Thread »
Top « Date » · « Thread »
From Robert Muir <rcm...@gmail.com>
Subject Re: [JENKINS] Lucene-Solr-4.x-Linux (64bit/jdk1.7.0_10) - Build # 4246 - Failure!
Date Tue, 12 Feb 2013 22:24:17 GMT
Thanks Mike! I wonder who caused that?

On Tue, Feb 12, 2013 at 5:19 PM, Michael McCandless
<lucene@mikemccandless.com> wrote:
> OK I committed a fix ... just bug in 4.x only.
>
> Mike McCandless
>
> http://blog.mikemccandless.com
>
> On Tue, Feb 12, 2013 at 9:34 AM, Michael McCandless
> <lucene@mikemccandless.com> wrote:
>> I'll dig.
>>
>> Mike McCandless
>>
>> http://blog.mikemccandless.com
>>
>>
>> On Tue, Feb 12, 2013 at 4:20 AM, Policeman Jenkins Server
>> <jenkins@thetaphi.de> wrote:
>>> Build: http://jenkins.thetaphi.de/job/Lucene-Solr-4.x-Linux/4246/
>>> Java: 64bit/jdk1.7.0_10 -XX:+UseParallelGC
>>>
>>> 1 tests failed.
>>> REGRESSION:  org.apache.lucene.search.TestSort.testParallelMultiSort
>>>
>>> Error Message:
>>> testParallelMultiSort various: Insane FieldCache usage(s) found expected:<0>
but was:<1>
>>>
>>> Stack Trace:
>>> java.lang.AssertionError: testParallelMultiSort various: Insane FieldCache usage(s)
found expected:<0> but was:<1>
>>>         at __randomizedtesting.SeedInfo.seed([6601BDBD3EAA0C2D:B6A534F498D2C515]:0)
>>>         at org.junit.Assert.fail(Assert.java:93)
>>>         at org.junit.Assert.failNotEquals(Assert.java:647)
>>>         at org.junit.Assert.assertEquals(Assert.java:128)
>>>         at org.junit.Assert.assertEquals(Assert.java:472)
>>>         at org.apache.lucene.util.LuceneTestCase.assertSaneFieldCaches(LuceneTestCase.java:588)
>>>         at org.apache.lucene.search.TestSort.runMultiSorts(TestSort.java:1331)
>>>         at org.apache.lucene.search.TestSort.testParallelMultiSort(TestSort.java:975)
>>>         at sun.reflect.NativeMethodAccessorImpl.invoke0(Native Method)
>>>         at sun.reflect.NativeMethodAccessorImpl.invoke(NativeMethodAccessorImpl.java:57)
>>>         at sun.reflect.DelegatingMethodAccessorImpl.invoke(DelegatingMethodAccessorImpl.java:43)
>>>         at java.lang.reflect.Method.invoke(Method.java:601)
>>>         at com.carrotsearch.randomizedtesting.RandomizedRunner.invoke(RandomizedRunner.java:1559)
>>>         at com.carrotsearch.randomizedtesting.RandomizedRunner.access$600(RandomizedRunner.java:79)
>>>         at com.carrotsearch.randomizedtesting.RandomizedRunner$6.evaluate(RandomizedRunner.java:737)
>>>         at com.carrotsearch.randomizedtesting.RandomizedRunner$7.evaluate(RandomizedRunner.java:773)
>>>         at com.carrotsearch.randomizedtesting.RandomizedRunner$8.evaluate(RandomizedRunner.java:787)
>>>         at org.apache.lucene.util.TestRuleSetupTeardownChained$1.evaluate(TestRuleSetupTeardownChained.java:50)
>>>         at org.apache.lucene.util.TestRuleFieldCacheSanity$1.evaluate(TestRuleFieldCacheSanity.java:51)
>>>         at org.apache.lucene.util.AbstractBeforeAfterRule$1.evaluate(AbstractBeforeAfterRule.java:46)
>>>         at com.carrotsearch.randomizedtesting.rules.SystemPropertiesInvariantRule$1.evaluate(SystemPropertiesInvariantRule.java:55)
>>>         at org.apache.lucene.util.TestRuleThreadAndTestName$1.evaluate(TestRuleThreadAndTestName.java:49)
>>>         at org.apache.lucene.util.TestRuleIgnoreAfterMaxFailures$1.evaluate(TestRuleIgnoreAfterMaxFailures.java:70)
>>>         at org.apache.lucene.util.TestRuleMarkFailure$1.evaluate(TestRuleMarkFailure.java:48)
>>>         at com.carrotsearch.randomizedtesting.rules.StatementAdapter.evaluate(StatementAdapter.java:36)
>>>         at com.carrotsearch.randomizedtesting.ThreadLeakControl$StatementRunner.run(ThreadLeakControl.java:358)
>>>         at com.carrotsearch.randomizedtesting.ThreadLeakControl.forkTimeoutingTask(ThreadLeakControl.java:782)
>>>         at com.carrotsearch.randomizedtesting.ThreadLeakControl$3.evaluate(ThreadLeakControl.java:442)
>>>         at com.carrotsearch.randomizedtesting.RandomizedRunner.runSingleTest(RandomizedRunner.java:746)
>>>         at com.carrotsearch.randomizedtesting.RandomizedRunner$3.evaluate(RandomizedRunner.java:648)
>>>         at com.carrotsearch.randomizedtesting.RandomizedRunner$4.evaluate(RandomizedRunner.java:682)
>>>         at com.carrotsearch.randomizedtesting.RandomizedRunner$5.evaluate(RandomizedRunner.java:693)
>>>         at org.apache.lucene.util.AbstractBeforeAfterRule$1.evaluate(AbstractBeforeAfterRule.java:46)
>>>         at org.apache.lucene.util.TestRuleStoreClassName$1.evaluate(TestRuleStoreClassName.java:42)
>>>         at com.carrotsearch.randomizedtesting.rules.SystemPropertiesInvariantRule$1.evaluate(SystemPropertiesInvariantRule.java:55)
>>>         at com.carrotsearch.randomizedtesting.rules.NoShadowingOrOverridesOnMethodsRule$1.evaluate(NoShadowingOrOverridesOnMethodsRule.java:39)
>>>         at com.carrotsearch.randomizedtesting.rules.NoShadowingOrOverridesOnMethodsRule$1.evaluate(NoShadowingOrOverridesOnMethodsRule.java:39)
>>>         at com.carrotsearch.randomizedtesting.rules.StatementAdapter.evaluate(StatementAdapter.java:36)
>>>         at org.apache.lucene.util.TestRuleAssertionsRequired$1.evaluate(TestRuleAssertionsRequired.java:43)
>>>         at org.apache.lucene.util.TestRuleMarkFailure$1.evaluate(TestRuleMarkFailure.java:48)
>>>         at org.apache.lucene.util.TestRuleIgnoreAfterMaxFailures$1.evaluate(TestRuleIgnoreAfterMaxFailures.java:70)
>>>         at org.apache.lucene.util.TestRuleIgnoreTestSuites$1.evaluate(TestRuleIgnoreTestSuites.java:55)
>>>         at com.carrotsearch.randomizedtesting.rules.StatementAdapter.evaluate(StatementAdapter.java:36)
>>>         at com.carrotsearch.randomizedtesting.ThreadLeakControl$StatementRunner.run(ThreadLeakControl.java:358)
>>>         at java.lang.Thread.run(Thread.java:722)
>>>
>>>
>>>
>>>
>>> Build Log:
>>> [...truncated 732 lines...]
>>> [junit4:junit4] Suite: org.apache.lucene.search.TestSort
>>> [junit4:junit4]   2> *** BEGIN testParallelMultiSort various: Insane FieldCache
usage(s) ***
>>> [junit4:junit4]   2> VALUEMISMATCH: Multiple distinct value objects for SegmentCoreReader(owner=_1(4.2):c1)+string_dv
>>> [junit4:junit4]   2>    'SegmentCoreReader(owner=_1(4.2):c1)'=>'string_dv',class
org.apache.lucene.index.BinaryDocValues,0.5=>org.apache.lucene.search.FieldCacheImpl$BinaryDocValuesImpl#392720520
(size =~ 176 bytes)
>>> [junit4:junit4]   2>    'SegmentCoreReader(owner=_1(4.2):c1)'=>'string_dv',class
org.apache.lucene.index.SortedDocValues,0.5=>org.apache.lucene.search.FieldCacheImpl$SortedDocValuesImpl#502365992
(size =~ 224 bytes)
>>> [junit4:junit4]   2>
>>> [junit4:junit4]   2> *** END testParallelMultiSort various: Insane FieldCache
usage(s) ***
>>> [junit4:junit4]   2> NOTE: reproduce with: ant test  -Dtestcase=TestSort -Dtests.method=testParallelMultiSort
-Dtests.seed=6601BDBD3EAA0C2D -Dtests.multiplier=3 -Dtests.slow=true -Dtests.locale=de_DE
-Dtests.timezone=America/Kentucky/Monticello -Dtests.file.encoding=ISO-8859-1
>>> [junit4:junit4] FAILURE 0.15s J1 | TestSort.testParallelMultiSort <<<
>>> [junit4:junit4]    > Throwable #1: java.lang.AssertionError: testParallelMultiSort
various: Insane FieldCache usage(s) found expected:<0> but was:<1>
>>> [junit4:junit4]    >    at __randomizedtesting.SeedInfo.seed([6601BDBD3EAA0C2D:B6A534F498D2C515]:0)
>>> [junit4:junit4]    >    at org.junit.Assert.fail(Assert.java:93)
>>> [junit4:junit4]    >    at org.junit.Assert.failNotEquals(Assert.java:647)
>>> [junit4:junit4]    >    at org.junit.Assert.assertEquals(Assert.java:128)
>>> [junit4:junit4]    >    at org.junit.Assert.assertEquals(Assert.java:472)
>>> [junit4:junit4]    >    at org.apache.lucene.util.LuceneTestCase.assertSaneFieldCaches(LuceneTestCase.java:588)
>>> [junit4:junit4]    >    at org.apache.lucene.search.TestSort.runMultiSorts(TestSort.java:1331)
>>> [junit4:junit4]    >    at org.apache.lucene.search.TestSort.testParallelMultiSort(TestSort.java:975)
>>> [junit4:junit4]    >    at sun.reflect.NativeMethodAccessorImpl.invoke0(Native
Method)
>>> [junit4:junit4]    >    at sun.reflect.NativeMethodAccessorImpl.invoke(NativeMethodAccessorImpl.java:57)
>>> [junit4:junit4]    >    at sun.reflect.DelegatingMethodAccessorImpl.invoke(DelegatingMethodAccessorImpl.java:43)
>>> [junit4:junit4]    >    at java.lang.reflect.Method.invoke(Method.java:601)
>>> [junit4:junit4]    >    at com.carrotsearch.randomizedtesting.RandomizedRunner.invoke(RandomizedRunner.java:1559)
>>> [junit4:junit4]    >    at com.carrotsearch.randomizedtesting.RandomizedRunner.access$600(RandomizedRunner.java:79)
>>> [junit4:junit4]    >    at com.carrotsearch.randomizedtesting.RandomizedRunner$6.evaluate(RandomizedRunner.java:737)
>>> [junit4:junit4]    >    at com.carrotsearch.randomizedtesting.RandomizedRunner$7.evaluate(RandomizedRunner.java:773)
>>> [junit4:junit4]    >    at com.carrotsearch.randomizedtesting.RandomizedRunner$8.evaluate(RandomizedRunner.java:787)
>>> [junit4:junit4]    >    at org.apache.lucene.util.TestRuleSetupTeardownChained$1.evaluate(TestRuleSetupTeardownChained.java:50)
>>> [junit4:junit4]    >    at org.apache.lucene.util.TestRuleFieldCacheSanity$1.evaluate(TestRuleFieldCacheSanity.java:51)
>>> [junit4:junit4]    >    at org.apache.lucene.util.AbstractBeforeAfterRule$1.evaluate(AbstractBeforeAfterRule.java:46)
>>> [junit4:junit4]    >    at com.carrotsearch.randomizedtesting.rules.SystemPropertiesInvariantRule$1.evaluate(SystemPropertiesInvariantRule.java:55)
>>> [junit4:junit4]    >    at org.apache.lucene.util.TestRuleThreadAndTestName$1.evaluate(TestRuleThreadAndTestName.java:49)
>>> [junit4:junit4]    >    at org.apache.lucene.util.TestRuleIgnoreAfterMaxFailures$1.evaluate(TestRuleIgnoreAfterMaxFailures.java:70)
>>> [junit4:junit4]    >    at org.apache.lucene.util.TestRuleMarkFailure$1.evaluate(TestRuleMarkFailure.java:48)
>>> [junit4:junit4]    >    at com.carrotsearch.randomizedtesting.rules.StatementAdapter.evaluate(StatementAdapter.java:36)
>>> [junit4:junit4]    >    at com.carrotsearch.randomizedtesting.ThreadLeakControl$StatementRunner.run(ThreadLeakControl.java:358)
>>> [junit4:junit4]    >    at com.carrotsearch.randomizedtesting.ThreadLeakControl.forkTimeoutingTask(ThreadLeakControl.java:782)
>>> [junit4:junit4]    >    at com.carrotsearch.randomizedtesting.ThreadLeakControl$3.evaluate(ThreadLeakControl.java:442)
>>> [junit4:junit4]    >    at com.carrotsearch.randomizedtesting.RandomizedRunner.runSingleTest(RandomizedRunner.java:746)
>>> [junit4:junit4]    >    at com.carrotsearch.randomizedtesting.RandomizedRunner$3.evaluate(RandomizedRunner.java:648)
>>> [junit4:junit4]    >    at com.carrotsearch.randomizedtesting.RandomizedRunner$4.evaluate(RandomizedRunner.java:682)
>>> [junit4:junit4]    >    at com.carrotsearch.randomizedtesting.RandomizedRunner$5.evaluate(RandomizedRunner.java:693)
>>> [junit4:junit4]    >    at org.apache.lucene.util.AbstractBeforeAfterRule$1.evaluate(AbstractBeforeAfterRule.java:46)
>>> [junit4:junit4]    >    at org.apache.lucene.util.TestRuleStoreClassName$1.evaluate(TestRuleStoreClassName.java:42)
>>> [junit4:junit4]    >    at com.carrotsearch.randomizedtesting.rules.SystemPropertiesInvariantRule$1.evaluate(SystemPropertiesInvariantRule.java:55)
>>> [junit4:junit4]    >    at com.carrotsearch.randomizedtesting.rules.NoShadowingOrOverridesOnMethodsRule$1.evaluate(NoShadowingOrOverridesOnMethodsRule.java:39)
>>> [junit4:junit4]    >    at com.carrotsearch.randomizedtesting.rules.NoShadowingOrOverridesOnMethodsRule$1.evaluate(NoShadowingOrOverridesOnMethodsRule.java:39)
>>> [junit4:junit4]    >    at com.carrotsearch.randomizedtesting.rules.StatementAdapter.evaluate(StatementAdapter.java:36)
>>> [junit4:junit4]    >    at org.apache.lucene.util.TestRuleAssertionsRequired$1.evaluate(TestRuleAssertionsRequired.java:43)
>>> [junit4:junit4]    >    at org.apache.lucene.util.TestRuleMarkFailure$1.evaluate(TestRuleMarkFailure.java:48)
>>> [junit4:junit4]    >    at org.apache.lucene.util.TestRuleIgnoreAfterMaxFailures$1.evaluate(TestRuleIgnoreAfterMaxFailures.java:70)
>>> [junit4:junit4]    >    at org.apache.lucene.util.TestRuleIgnoreTestSuites$1.evaluate(TestRuleIgnoreTestSuites.java:55)
>>> [junit4:junit4]    >    at com.carrotsearch.randomizedtesting.rules.StatementAdapter.evaluate(StatementAdapter.java:36)
>>> [junit4:junit4]    >    at com.carrotsearch.randomizedtesting.ThreadLeakControl$StatementRunner.run(ThreadLeakControl.java:358)
>>> [junit4:junit4]    >    at java.lang.Thread.run(Thread.java:722)
>>> [junit4:junit4]   2> NOTE: test params are: codec=SimpleText, sim=DefaultSimilarity,
locale=de_DE, timezone=America/Kentucky/Monticello
>>> [junit4:junit4]   2> NOTE: Linux 3.2.0-37-generic amd64/Oracle Corporation
1.7.0_10 (64-bit)/cpus=8,threads=1,free=223437176,total=286261248
>>> [junit4:junit4]   2> NOTE: All tests run in this JVM: [TestTermInfosReaderIndex,
TestField, TestFieldCache, TestNumericRangeQuery32, TestNoMergePolicy, TestSubScorerFreqs,
TestBytesRef, Nested1, Nested2, Nested3, TestMultiPhraseQuery, Test2BPostingsBytes, TestIndexWriterUnicode,
TestReuseDocsEnum, TestTermsEnum, TestFileSwitchDirectory, TestNumericTokenStream, TestLookaheadTokenFilter,
TestDocCount, TestMatchAllDocsQuery, TestTermVectors, TestPerSegmentDeletes, TestIndexWriterMergePolicy,
TestTransactionRollback, TestBlockPostingsFormat2, TestDocValuesWithThreads, TestParallelTermEnum,
TestBlockPostingsFormat, TestTermdocPerf, TestBagOfPostings, TestOmitNorms, TestDoc, TestQueryWrapperFilter,
TestCloseableThreadLocal, TestToken, TestFieldMaskingSpanQuery, TestBasicOperations, TestRecyclingIntBlockAllocator,
TestMinimize, TestHugeRamFile, TestFieldsReader, TestRegexpRandom2, TestFSTs, TestConjunctions,
TestNRTManager, Nested, TestAutomatonQuery, Before3, Before3, TestBitVector, TestBinaryTerms,
TestTermRangeFilter, TestIndexWriterConfig, TestDocValuesScoring, TestForUtil, TestSimilarity2,
TestRamUsageEstimator, TestAssertions, TestPayloads, TestNearSpansOrdered, TestTermsEnum2,
TestBooleanOr, TestBackwardsCompatibility3x, TestNumericRangeQuery64, TestBagOfPositions,
TestBooleanQuery, TestConstantScoreQuery, TestDocValuesIndexing, TestSpanMultiTermQueryWrapper,
TestDemo, TestDocIdSet, TestPackedInts, TestSearch, TestPerFieldDocValuesFormat, TestExplanations,
TestSpansAdvanced, TestIdentityHashSet, TestDisjunctionMaxQuery, TestPerFieldPostingsFormat,
TestNRTCachingDirectory, TestMixedCodecs, TestNewestSegment, TestParallelCompositeReader,
TestPayloadTermQuery, TestRandomStoredFields, TestCompoundFile, TestMaxTermFrequency, TestCodecHoldsOpenFiles,
TestCustomNorms, TestSnapshotDeletionPolicy, TestNRTThreads, TestLucene40PostingsReader, TestFlushByRamOrCountsPolicy,
TestSearchAfter, TestSloppyPhraseQuery, TestPersistentSnapshotDeletionPolicy, TestSort]
>>> [junit4:junit4] Completed on J1 in 3.17s, 25 tests, 1 failure <<< FAILURES!
>>>
>>> [...truncated 477 lines...]
>>> BUILD FAILED
>>> /mnt/ssd/jenkins/workspace/Lucene-Solr-4.x-Linux/build.xml:381: The following
error occurred while executing this line:
>>> /mnt/ssd/jenkins/workspace/Lucene-Solr-4.x-Linux/build.xml:361: The following
error occurred while executing this line:
>>> /mnt/ssd/jenkins/workspace/Lucene-Solr-4.x-Linux/build.xml:39: The following
error occurred while executing this line:
>>> /mnt/ssd/jenkins/workspace/Lucene-Solr-4.x-Linux/lucene/build.xml:50: The following
error occurred while executing this line:
>>> /mnt/ssd/jenkins/workspace/Lucene-Solr-4.x-Linux/lucene/common-build.xml:1202:
The following error occurred while executing this line:
>>> /mnt/ssd/jenkins/workspace/Lucene-Solr-4.x-Linux/lucene/common-build.xml:865:
There were test failures: 345 suites, 2060 tests, 1 failure, 23 ignored (11 assumptions)
>>>
>>> Total time: 8 minutes 55 seconds
>>> Build step 'Invoke Ant' marked build as failure
>>> Archiving artifacts
>>> Recording test results
>>> Description set: Java: 64bit/jdk1.7.0_10 -XX:+UseParallelGC
>>> Email was triggered for: Failure
>>> Sending email for trigger: Failure
>>>
>>>
>>>
>>>
>>> ---------------------------------------------------------------------
>>> To unsubscribe, e-mail: dev-unsubscribe@lucene.apache.org
>>> For additional commands, e-mail: dev-help@lucene.apache.org
>
> ---------------------------------------------------------------------
> To unsubscribe, e-mail: dev-unsubscribe@lucene.apache.org
> For additional commands, e-mail: dev-help@lucene.apache.org
>

---------------------------------------------------------------------
To unsubscribe, e-mail: dev-unsubscribe@lucene.apache.org
For additional commands, e-mail: dev-help@lucene.apache.org


Mime
View raw message