lucene-dev mailing list archives

Site index · List index
Message view « Date » · « Thread »
Top « Date » · « Thread »
From Policeman Jenkins Server <jenk...@thetaphi.de>
Subject [JENKINS] Lucene-Solr-4.x-MacOSX (64bit/jdk1.7.0) - Build # 212 - Failure!
Date Thu, 14 Feb 2013 17:46:43 GMT
Build: http://jenkins.thetaphi.de/job/Lucene-Solr-4.x-MacOSX/212/
Java: 64bit/jdk1.7.0 -XX:+UseConcMarkSweepGC

1 tests failed.
REGRESSION:  org.apache.solr.cloud.BasicDistributedZkTest.testDistribSearch

Error Message:
IOException occured when talking to server at: http://127.0.0.1:52026/oneInstanceCollection24

Stack Trace:
org.apache.solr.client.solrj.SolrServerException: IOException occured when talking to server at: http://127.0.0.1:52026/oneInstanceCollection24
	at __randomizedtesting.SeedInfo.seed([1BF9734DD641D17B:9A1FFD55A11EB147]:0)
	at org.apache.solr.client.solrj.impl.HttpSolrServer.request(HttpSolrServer.java:416)
	at org.apache.solr.client.solrj.impl.HttpSolrServer.request(HttpSolrServer.java:181)
	at org.apache.solr.client.solrj.request.AbstractUpdateRequest.process(AbstractUpdateRequest.java:117)
	at org.apache.solr.client.solrj.SolrServer.add(SolrServer.java:116)
	at org.apache.solr.client.solrj.SolrServer.add(SolrServer.java:102)
	at org.apache.solr.cloud.BasicDistributedZkTest.testANewCollectionInOneInstanceWithManualShardAssignement(BasicDistributedZkTest.java:1026)
	at org.apache.solr.cloud.BasicDistributedZkTest.doTest(BasicDistributedZkTest.java:331)
	at org.apache.solr.BaseDistributedSearchTestCase.testDistribSearch(BaseDistributedSearchTestCase.java:794)
	at sun.reflect.NativeMethodAccessorImpl.invoke0(Native Method)
	at sun.reflect.NativeMethodAccessorImpl.invoke(NativeMethodAccessorImpl.java:57)
	at sun.reflect.DelegatingMethodAccessorImpl.invoke(DelegatingMethodAccessorImpl.java:43)
	at java.lang.reflect.Method.invoke(Method.java:601)
	at com.carrotsearch.randomizedtesting.RandomizedRunner.invoke(RandomizedRunner.java:1559)
	at com.carrotsearch.randomizedtesting.RandomizedRunner.access$600(RandomizedRunner.java:79)
	at com.carrotsearch.randomizedtesting.RandomizedRunner$6.evaluate(RandomizedRunner.java:737)
	at com.carrotsearch.randomizedtesting.RandomizedRunner$7.evaluate(RandomizedRunner.java:773)
	at com.carrotsearch.randomizedtesting.RandomizedRunner$8.evaluate(RandomizedRunner.java:787)
	at com.carrotsearch.randomizedtesting.rules.SystemPropertiesRestoreRule$1.evaluate(SystemPropertiesRestoreRule.java:53)
	at org.apache.lucene.util.TestRuleSetupTeardownChained$1.evaluate(TestRuleSetupTeardownChained.java:50)
	at org.apache.lucene.util.TestRuleFieldCacheSanity$1.evaluate(TestRuleFieldCacheSanity.java:51)
	at org.apache.lucene.util.AbstractBeforeAfterRule$1.evaluate(AbstractBeforeAfterRule.java:46)
	at com.carrotsearch.randomizedtesting.rules.SystemPropertiesInvariantRule$1.evaluate(SystemPropertiesInvariantRule.java:55)
	at org.apache.lucene.util.TestRuleThreadAndTestName$1.evaluate(TestRuleThreadAndTestName.java:49)
	at org.apache.lucene.util.TestRuleIgnoreAfterMaxFailures$1.evaluate(TestRuleIgnoreAfterMaxFailures.java:70)
	at org.apache.lucene.util.TestRuleMarkFailure$1.evaluate(TestRuleMarkFailure.java:48)
	at com.carrotsearch.randomizedtesting.rules.StatementAdapter.evaluate(StatementAdapter.java:36)
	at com.carrotsearch.randomizedtesting.ThreadLeakControl$StatementRunner.run(ThreadLeakControl.java:358)
	at com.carrotsearch.randomizedtesting.ThreadLeakControl.forkTimeoutingTask(ThreadLeakControl.java:782)
	at com.carrotsearch.randomizedtesting.ThreadLeakControl$3.evaluate(ThreadLeakControl.java:442)
	at com.carrotsearch.randomizedtesting.RandomizedRunner.runSingleTest(RandomizedRunner.java:746)
	at com.carrotsearch.randomizedtesting.RandomizedRunner$3.evaluate(RandomizedRunner.java:648)
	at com.carrotsearch.randomizedtesting.RandomizedRunner$4.evaluate(RandomizedRunner.java:682)
	at com.carrotsearch.randomizedtesting.RandomizedRunner$5.evaluate(RandomizedRunner.java:693)
	at com.carrotsearch.randomizedtesting.rules.StatementAdapter.evaluate(StatementAdapter.java:36)
	at com.carrotsearch.randomizedtesting.rules.SystemPropertiesRestoreRule$1.evaluate(SystemPropertiesRestoreRule.java:53)
	at org.apache.lucene.util.AbstractBeforeAfterRule$1.evaluate(AbstractBeforeAfterRule.java:46)
	at org.apache.lucene.util.TestRuleStoreClassName$1.evaluate(TestRuleStoreClassName.java:42)
	at com.carrotsearch.randomizedtesting.rules.SystemPropertiesInvariantRule$1.evaluate(SystemPropertiesInvariantRule.java:55)
	at com.carrotsearch.randomizedtesting.rules.NoShadowingOrOverridesOnMethodsRule$1.evaluate(NoShadowingOrOverridesOnMethodsRule.java:39)
	at com.carrotsearch.randomizedtesting.rules.NoShadowingOrOverridesOnMethodsRule$1.evaluate(NoShadowingOrOverridesOnMethodsRule.java:39)
	at com.carrotsearch.randomizedtesting.rules.StatementAdapter.evaluate(StatementAdapter.java:36)
	at org.apache.lucene.util.TestRuleAssertionsRequired$1.evaluate(TestRuleAssertionsRequired.java:43)
	at org.apache.lucene.util.TestRuleMarkFailure$1.evaluate(TestRuleMarkFailure.java:48)
	at org.apache.lucene.util.TestRuleIgnoreAfterMaxFailures$1.evaluate(TestRuleIgnoreAfterMaxFailures.java:70)
	at org.apache.lucene.util.TestRuleIgnoreTestSuites$1.evaluate(TestRuleIgnoreTestSuites.java:55)
	at com.carrotsearch.randomizedtesting.rules.StatementAdapter.evaluate(StatementAdapter.java:36)
	at com.carrotsearch.randomizedtesting.ThreadLeakControl$StatementRunner.run(ThreadLeakControl.java:358)
	at java.lang.Thread.run(Thread.java:722)
Caused by: java.net.SocketException: Invalid argument
	at java.net.SocketInputStream.socketRead0(Native Method)
	at java.net.SocketInputStream.read(SocketInputStream.java:150)
	at java.net.SocketInputStream.read(SocketInputStream.java:121)
	at org.apache.http.impl.io.AbstractSessionInputBuffer.fillBuffer(AbstractSessionInputBuffer.java:166)
	at org.apache.http.impl.io.SocketInputBuffer.fillBuffer(SocketInputBuffer.java:90)
	at org.apache.http.impl.io.AbstractSessionInputBuffer.readLine(AbstractSessionInputBuffer.java:281)
	at org.apache.http.impl.conn.DefaultHttpResponseParser.parseHead(DefaultHttpResponseParser.java:92)
	at org.apache.http.impl.conn.DefaultHttpResponseParser.parseHead(DefaultHttpResponseParser.java:62)
	at org.apache.http.impl.io.AbstractMessageParser.parse(AbstractMessageParser.java:254)
	at org.apache.http.impl.AbstractHttpClientConnection.receiveResponseHeader(AbstractHttpClientConnection.java:289)
	at org.apache.http.impl.conn.DefaultClientConnection.receiveResponseHeader(DefaultClientConnection.java:252)
	at org.apache.http.impl.conn.ManagedClientConnectionImpl.receiveResponseHeader(ManagedClientConnectionImpl.java:191)
	at org.apache.http.protocol.HttpRequestExecutor.doReceiveResponse(HttpRequestExecutor.java:300)
	at org.apache.http.protocol.HttpRequestExecutor.execute(HttpRequestExecutor.java:127)
	at org.apache.http.impl.client.DefaultRequestDirector.tryExecute(DefaultRequestDirector.java:717)
	at org.apache.http.impl.client.DefaultRequestDirector.execute(DefaultRequestDirector.java:522)
	at org.apache.http.impl.client.AbstractHttpClient.execute(AbstractHttpClient.java:906)
	at org.apache.http.impl.client.AbstractHttpClient.execute(AbstractHttpClient.java:805)
	at org.apache.http.impl.client.AbstractHttpClient.execute(AbstractHttpClient.java:784)
	at org.apache.solr.client.solrj.impl.HttpSolrServer.request(HttpSolrServer.java:353)
	... 47 more




Build Log:
[...truncated 8963 lines...]
[junit4:junit4] Suite: org.apache.solr.cloud.BasicDistributedZkTest
[junit4:junit4]   2> 0 T3427 oas.BaseDistributedSearchTestCase.initHostContext Setting hostContext system property: /
[junit4:junit4]   2> 6 T3427 oas.SolrTestCaseJ4.setUp ###Starting testDistribSearch
[junit4:junit4]   2> Creating dataDir: /Users/jenkins/jenkins-slave/workspace/Lucene-Solr-4.x-MacOSX/solr/build/solr-core/test/J0/./solrtest-BasicDistributedZkTest-1360862409790
[junit4:junit4]   2> 8 T3427 oasc.ZkTestServer.run STARTING ZK TEST SERVER
[junit4:junit4]   2> 9 T3428 oasc.ZkTestServer$ZKServerMain.runFromConfig Starting server
[junit4:junit4]   2> 11 T3428 oazs.ZooKeeperServer.setTickTime tickTime set to 1000
[junit4:junit4]   2> 11 T3428 oazs.ZooKeeperServer.setMinSessionTimeout minSessionTimeout set to -1
[junit4:junit4]   2> 11 T3428 oazs.ZooKeeperServer.setMaxSessionTimeout maxSessionTimeout set to -1
[junit4:junit4]   2> 12 T3428 oazs.NIOServerCnxnFactory.configure binding to port 0.0.0.0/0.0.0.0:0
[junit4:junit4]   2> 13 T3428 oazsp.FileTxnSnapLog.save Snapshotting: 0x0 to /Users/jenkins/jenkins-slave/workspace/Lucene-Solr-4.x-MacOSX/solr/build/solr-core/test/J0/./org.apache.solr.cloud.BasicDistributedZkTest-1360862409790/zookeeper/server1/data/version-2/snapshot.0
[junit4:junit4]   2> 111 T3427 oasc.ZkTestServer.run start zk server on port:52019
[junit4:junit4]   2> 112 T3427 oaz.ZooKeeper.<init> Initiating client connection, connectString=127.0.0.1:52019 sessionTimeout=10000 watcher=org.apache.solr.common.cloud.ConnectionManager@5363b98c
[junit4:junit4]   2> 113 T3427 oascc.ConnectionManager.waitForConnected Waiting for client to connect to ZooKeeper
[junit4:junit4]   2> 114 T3433 oaz.ClientCnxn$SendThread.logStartConnect Opening socket connection to server localhost/127.0.0.1:52019. Will not attempt to authenticate using SASL (access denied ("javax.security.auth.AuthPermission" "getLoginConfiguration"))
[junit4:junit4]   2> 115 T3433 oaz.ClientCnxn$SendThread.primeConnection Socket connection established to localhost/127.0.0.1:52019, initiating session
[junit4:junit4]   2> 115 T3429 oazs.NIOServerCnxnFactory.run Accepted socket connection from /127.0.0.1:52020
[junit4:junit4]   2> 116 T3429 oazs.ZooKeeperServer.processConnectRequest Client attempting to establish new session at /127.0.0.1:52020
[junit4:junit4]   2> 116 T3431 oazsp.FileTxnLog.append Creating new log file: log.1
[junit4:junit4]   2> 119 T3431 oazs.ZooKeeperServer.finishSessionInit Established session 0x13cd9b874450000 with negotiated timeout 10000 for client /127.0.0.1:52020
[junit4:junit4]   2> 120 T3433 oaz.ClientCnxn$SendThread.onConnected Session establishment complete on server localhost/127.0.0.1:52019, sessionid = 0x13cd9b874450000, negotiated timeout = 10000
[junit4:junit4]   2> 120 T3434 oascc.ConnectionManager.process Watcher org.apache.solr.common.cloud.ConnectionManager@5363b98c name:ZooKeeperConnection Watcher:127.0.0.1:52019 got event WatchedEvent state:SyncConnected type:None path:null path:null type:None
[junit4:junit4]   2> 121 T3427 oascc.ConnectionManager.waitForConnected Client is connected to ZooKeeper
[junit4:junit4]   2> 121 T3427 oascc.SolrZkClient.makePath makePath: /solr
[junit4:junit4]   2> 126 T3432 oazs.PrepRequestProcessor.pRequest2Txn Processed session termination for sessionid: 0x13cd9b874450000
[junit4:junit4]   2> 128 T3434 oaz.ClientCnxn$EventThread.run EventThread shut down
[junit4:junit4]   2> 128 T3427 oaz.ZooKeeper.close Session: 0x13cd9b874450000 closed
[junit4:junit4]   2> 129 T3429 oazs.NIOServerCnxn.closeSock Closed socket connection for client /127.0.0.1:52020 which had sessionid 0x13cd9b874450000
[junit4:junit4]   2> 129 T3427 oaz.ZooKeeper.<init> Initiating client connection, connectString=127.0.0.1:52019/solr sessionTimeout=10000 watcher=org.apache.solr.common.cloud.ConnectionManager@1ddcbbf0
[junit4:junit4]   2> 130 T3427 oascc.ConnectionManager.waitForConnected Waiting for client to connect to ZooKeeper
[junit4:junit4]   2> 131 T3435 oaz.ClientCnxn$SendThread.logStartConnect Opening socket connection to server localhost/127.0.0.1:52019. Will not attempt to authenticate using SASL (access denied ("javax.security.auth.AuthPermission" "getLoginConfiguration"))
[junit4:junit4]   2> 131 T3435 oaz.ClientCnxn$SendThread.primeConnection Socket connection established to localhost/127.0.0.1:52019, initiating session
[junit4:junit4]   2> 132 T3429 oazs.NIOServerCnxnFactory.run Accepted socket connection from /127.0.0.1:52021
[junit4:junit4]   2> 132 T3429 oazs.ZooKeeperServer.processConnectRequest Client attempting to establish new session at /127.0.0.1:52021
[junit4:junit4]   2> 134 T3431 oazs.ZooKeeperServer.finishSessionInit Established session 0x13cd9b874450001 with negotiated timeout 10000 for client /127.0.0.1:52021
[junit4:junit4]   2> 134 T3435 oaz.ClientCnxn$SendThread.onConnected Session establishment complete on server localhost/127.0.0.1:52019, sessionid = 0x13cd9b874450001, negotiated timeout = 10000
[junit4:junit4]   2> 135 T3436 oascc.ConnectionManager.process Watcher org.apache.solr.common.cloud.ConnectionManager@1ddcbbf0 name:ZooKeeperConnection Watcher:127.0.0.1:52019/solr got event WatchedEvent state:SyncConnected type:None path:null path:null type:None
[junit4:junit4]   2> 135 T3427 oascc.ConnectionManager.waitForConnected Client is connected to ZooKeeper
[junit4:junit4]   2> 136 T3427 oascc.SolrZkClient.makePath makePath: /collections/collection1
[junit4:junit4]   2> 141 T3427 oascc.SolrZkClient.makePath makePath: /collections/collection1/shards
[junit4:junit4]   2> 147 T3427 oascc.SolrZkClient.makePath makePath: /collections/control_collection
[junit4:junit4]   2> 151 T3427 oascc.SolrZkClient.makePath makePath: /collections/control_collection/shards
[junit4:junit4]   2> 156 T3427 oasc.AbstractZkTestCase.putConfig put /Users/jenkins/jenkins-slave/workspace/Lucene-Solr-4.x-MacOSX/solr/build/solr-core/test-files/solr/collection1/conf/solrconfig.xml to /configs/conf1/solrconfig.xml
[junit4:junit4]   2> 157 T3427 oascc.SolrZkClient.makePath makePath: /configs/conf1/solrconfig.xml
[junit4:junit4]   2> 165 T3427 oasc.AbstractZkTestCase.putConfig put /Users/jenkins/jenkins-slave/workspace/Lucene-Solr-4.x-MacOSX/solr/build/solr-core/test-files/solr/collection1/conf/schema.xml to /configs/conf1/schema.xml
[junit4:junit4]   2> 166 T3427 oascc.SolrZkClient.makePath makePath: /configs/conf1/schema.xml
[junit4:junit4]   2> 173 T3427 oasc.AbstractZkTestCase.putConfig put /Users/jenkins/jenkins-slave/workspace/Lucene-Solr-4.x-MacOSX/solr/build/solr-core/test-files/solr/collection1/conf/stopwords.txt to /configs/conf1/stopwords.txt
[junit4:junit4]   2> 174 T3427 oascc.SolrZkClient.makePath makePath: /configs/conf1/stopwords.txt
[junit4:junit4]   2> 180 T3427 oasc.AbstractZkTestCase.putConfig put /Users/jenkins/jenkins-slave/workspace/Lucene-Solr-4.x-MacOSX/solr/build/solr-core/test-files/solr/collection1/conf/protwords.txt to /configs/conf1/protwords.txt
[junit4:junit4]   2> 181 T3427 oascc.SolrZkClient.makePath makePath: /configs/conf1/protwords.txt
[junit4:junit4]   2> 186 T3427 oasc.AbstractZkTestCase.putConfig put /Users/jenkins/jenkins-slave/workspace/Lucene-Solr-4.x-MacOSX/solr/build/solr-core/test-files/solr/collection1/conf/currency.xml to /configs/conf1/currency.xml
[junit4:junit4]   2> 186 T3427 oascc.SolrZkClient.makePath makePath: /configs/conf1/currency.xml
[junit4:junit4]   2> 190 T3427 oasc.AbstractZkTestCase.putConfig put /Users/jenkins/jenkins-slave/workspace/Lucene-Solr-4.x-MacOSX/solr/build/solr-core/test-files/solr/collection1/conf/open-exchange-rates.json to /configs/conf1/open-exchange-rates.json
[junit4:junit4]   2> 191 T3427 oascc.SolrZkClient.makePath makePath: /configs/conf1/open-exchange-rates.json
[junit4:junit4]   2> 195 T3427 oasc.AbstractZkTestCase.putConfig put /Users/jenkins/jenkins-slave/workspace/Lucene-Solr-4.x-MacOSX/solr/build/solr-core/test-files/solr/collection1/conf/mapping-ISOLatin1Accent.txt to /configs/conf1/mapping-ISOLatin1Accent.txt
[junit4:junit4]   2> 196 T3427 oascc.SolrZkClient.makePath makePath: /configs/conf1/mapping-ISOLatin1Accent.txt
[junit4:junit4]   2> 201 T3427 oasc.AbstractZkTestCase.putConfig put /Users/jenkins/jenkins-slave/workspace/Lucene-Solr-4.x-MacOSX/solr/build/solr-core/test-files/solr/collection1/conf/old_synonyms.txt to /configs/conf1/old_synonyms.txt
[junit4:junit4]   2> 201 T3427 oascc.SolrZkClient.makePath makePath: /configs/conf1/old_synonyms.txt
[junit4:junit4]   2> 205 T3427 oasc.AbstractZkTestCase.putConfig put /Users/jenkins/jenkins-slave/workspace/Lucene-Solr-4.x-MacOSX/solr/build/solr-core/test-files/solr/collection1/conf/synonyms.txt to /configs/conf1/synonyms.txt
[junit4:junit4]   2> 206 T3427 oascc.SolrZkClient.makePath makePath: /configs/conf1/synonyms.txt
[junit4:junit4]   2> 211 T3432 oazs.PrepRequestProcessor.pRequest2Txn Processed session termination for sessionid: 0x13cd9b874450001
[junit4:junit4]   2> 212 T3429 oazs.NIOServerCnxn.closeSock Closed socket connection for client /127.0.0.1:52021 which had sessionid 0x13cd9b874450001
[junit4:junit4]   2> 212 T3436 oaz.ClientCnxn$EventThread.run EventThread shut down
[junit4:junit4]   2> 212 T3427 oaz.ZooKeeper.close Session: 0x13cd9b874450001 closed
[junit4:junit4]   2> 401 T3427 oejs.Server.doStart jetty-8.1.8.v20121106
[junit4:junit4]   2> 405 T3427 oejs.AbstractConnector.doStart Started SelectChannelConnector@127.0.0.1:52022
[junit4:junit4]   2> 406 T3427 oass.SolrDispatchFilter.init SolrDispatchFilter.init()
[junit4:junit4]   2> 407 T3427 oasc.SolrResourceLoader.locateSolrHome JNDI not configured for solr (NoInitialContextEx)
[junit4:junit4]   2> 408 T3427 oasc.SolrResourceLoader.locateSolrHome using system property solr.solr.home: /Users/jenkins/jenkins-slave/workspace/Lucene-Solr-4.x-MacOSX/solr/build/solr-core/test/J0/./org.apache.solr.cloud.BasicDistributedZkTest-controljetty-1360862409996
[junit4:junit4]   2> 408 T3427 oasc.CoreContainer$Initializer.initialize looking for solr.xml: /Users/jenkins/jenkins-slave/workspace/Lucene-Solr-4.x-MacOSX/solr/build/solr-core/test/J0/./org.apache.solr.cloud.BasicDistributedZkTest-controljetty-1360862409996/solr.xml
[junit4:junit4]   2> 409 T3427 oasc.CoreContainer.<init> New CoreContainer 967044155
[junit4:junit4]   2> 410 T3427 oasc.CoreContainer.load Loading CoreContainer using Solr Home: '/Users/jenkins/jenkins-slave/workspace/Lucene-Solr-4.x-MacOSX/solr/build/solr-core/test/J0/./org.apache.solr.cloud.BasicDistributedZkTest-controljetty-1360862409996/'
[junit4:junit4]   2> 411 T3427 oasc.SolrResourceLoader.<init> new SolrResourceLoader for directory: '/Users/jenkins/jenkins-slave/workspace/Lucene-Solr-4.x-MacOSX/solr/build/solr-core/test/J0/./org.apache.solr.cloud.BasicDistributedZkTest-controljetty-1360862409996/'
[junit4:junit4]   2> 455 T3427 oashc.HttpShardHandlerFactory.getParameter Setting socketTimeout to: 60000
[junit4:junit4]   2> 456 T3427 oashc.HttpShardHandlerFactory.getParameter Setting urlScheme to: http://
[junit4:junit4]   2> 456 T3427 oashc.HttpShardHandlerFactory.getParameter Setting connTimeout to: 15000
[junit4:junit4]   2> 457 T3427 oashc.HttpShardHandlerFactory.getParameter Setting maxConnectionsPerHost to: 20
[junit4:junit4]   2> 457 T3427 oashc.HttpShardHandlerFactory.getParameter Setting corePoolSize to: 0
[junit4:junit4]   2> 458 T3427 oashc.HttpShardHandlerFactory.getParameter Setting maximumPoolSize to: 2147483647
[junit4:junit4]   2> 458 T3427 oashc.HttpShardHandlerFactory.getParameter Setting maxThreadIdleTime to: 5
[junit4:junit4]   2> 459 T3427 oashc.HttpShardHandlerFactory.getParameter Setting sizeOfQueue to: -1
[junit4:junit4]   2> 459 T3427 oashc.HttpShardHandlerFactory.getParameter Setting fairnessPolicy to: false
[junit4:junit4]   2> 460 T3427 oascsi.HttpClientUtil.createClient Creating new http client, config:maxConnectionsPerHost=20&maxConnections=10000&socketTimeout=60000&connTimeout=15000&retry=false
[junit4:junit4]   2> 473 T3427 oasc.CoreContainer.load Registering Log Listener
[junit4:junit4]   2> 492 T3427 oasc.CoreContainer.initZooKeeper Zookeeper client=127.0.0.1:52019/solr
[junit4:junit4]   2> 493 T3427 oasc.ZkController.checkChrootPath zkHost includes chroot
[junit4:junit4]   2> 493 T3427 oaz.ZooKeeper.<init> Initiating client connection, connectString=127.0.0.1:52019 sessionTimeout=60000 watcher=org.apache.solr.common.cloud.ConnectionManager@7d6342f0
[junit4:junit4]   2> 508 T3446 oaz.ClientCnxn$SendThread.logStartConnect Opening socket connection to server localhost/127.0.0.1:52019. Will not attempt to authenticate using SASL (access denied ("javax.security.auth.AuthPermission" "getLoginConfiguration"))
[junit4:junit4]   2> 509 T3446 oaz.ClientCnxn$SendThread.primeConnection Socket connection established to localhost/127.0.0.1:52019, initiating session
[junit4:junit4]   2> 509 T3427 oascc.ConnectionManager.waitForConnected Waiting for client to connect to ZooKeeper
[junit4:junit4]   2> 510 T3429 oazs.NIOServerCnxnFactory.run Accepted socket connection from /127.0.0.1:52023
[junit4:junit4]   2> 511 T3429 oazs.ZooKeeperServer.processConnectRequest Client attempting to establish new session at /127.0.0.1:52023
[junit4:junit4]   2> 512 T3431 oazs.ZooKeeperServer.finishSessionInit Established session 0x13cd9b874450002 with negotiated timeout 20000 for client /127.0.0.1:52023
[junit4:junit4]   2> 512 T3446 oaz.ClientCnxn$SendThread.onConnected Session establishment complete on server localhost/127.0.0.1:52019, sessionid = 0x13cd9b874450002, negotiated timeout = 20000
[junit4:junit4]   2> 513 T3447 oascc.ConnectionManager.process Watcher org.apache.solr.common.cloud.ConnectionManager@7d6342f0 name:ZooKeeperConnection Watcher:127.0.0.1:52019 got event WatchedEvent state:SyncConnected type:None path:null path:null type:None
[junit4:junit4]   2> 513 T3427 oascc.ConnectionManager.waitForConnected Client is connected to ZooKeeper
[junit4:junit4]   2> 516 T3432 oazs.PrepRequestProcessor.pRequest2Txn Processed session termination for sessionid: 0x13cd9b874450002
[junit4:junit4]   2> 517 T3429 oazs.NIOServerCnxn.closeSock Closed socket connection for client /127.0.0.1:52023 which had sessionid 0x13cd9b874450002
[junit4:junit4]   2> 517 T3447 oaz.ClientCnxn$EventThread.run EventThread shut down
[junit4:junit4]   2> 517 T3427 oaz.ZooKeeper.close Session: 0x13cd9b874450002 closed
[junit4:junit4]   2> 518 T3427 oascsi.HttpClientUtil.createClient Creating new http client, config:maxConnections=500&maxConnectionsPerHost=16&socketTimeout=60000&connTimeout=15000
[junit4:junit4]   2> 523 T3427 oaz.ZooKeeper.<init> Initiating client connection, connectString=127.0.0.1:52019/solr sessionTimeout=30000 watcher=org.apache.solr.common.cloud.ConnectionManager@436460aa
[junit4:junit4]   2> 524 T3427 oascc.ConnectionManager.waitForConnected Waiting for client to connect to ZooKeeper
[junit4:junit4]   2> 524 T3448 oaz.ClientCnxn$SendThread.logStartConnect Opening socket connection to server localhost/127.0.0.1:52019. Will not attempt to authenticate using SASL (access denied ("javax.security.auth.AuthPermission" "getLoginConfiguration"))
[junit4:junit4]   2> 525 T3448 oaz.ClientCnxn$SendThread.primeConnection Socket connection established to localhost/127.0.0.1:52019, initiating session
[junit4:junit4]   2> 525 T3429 oazs.NIOServerCnxnFactory.run Accepted socket connection from /127.0.0.1:52024
[junit4:junit4]   2> 526 T3429 oazs.ZooKeeperServer.processConnectRequest Client attempting to establish new session at /127.0.0.1:52024
[junit4:junit4]   2> 527 T3431 oazs.ZooKeeperServer.finishSessionInit Established session 0x13cd9b874450003 with negotiated timeout 20000 for client /127.0.0.1:52024
[junit4:junit4]   2> 527 T3448 oaz.ClientCnxn$SendThread.onConnected Session establishment complete on server localhost/127.0.0.1:52019, sessionid = 0x13cd9b874450003, negotiated timeout = 20000
[junit4:junit4]   2> 527 T3449 oascc.ConnectionManager.process Watcher org.apache.solr.common.cloud.ConnectionManager@436460aa name:ZooKeeperConnection Watcher:127.0.0.1:52019/solr got event WatchedEvent state:SyncConnected type:None path:null path:null type:None
[junit4:junit4]   2> 528 T3427 oascc.ConnectionManager.waitForConnected Client is connected to ZooKeeper
[junit4:junit4]   2> 530 T3432 oazs.PrepRequestProcessor.pRequest Got user-level KeeperException when processing sessionid:0x13cd9b874450003 type:create cxid:0x2 zxid:0x1a txntype:-1 reqpath:n/a Error Path:/solr/overseer Error:KeeperErrorCode = NodeExists for /solr/overseer
[junit4:junit4]   2> 532 T3427 oascc.SolrZkClient.makePath makePath: /live_nodes
[junit4:junit4]   2> 534 T3427 oasc.ZkController.createEphemeralLiveNode Register node as live in ZooKeeper:/live_nodes/127.0.0.1:52022_
[junit4:junit4]   2> 535 T3432 oazs.PrepRequestProcessor.pRequest Got user-level KeeperException when processing sessionid:0x13cd9b874450003 type:delete cxid:0x8 zxid:0x1c txntype:-1 reqpath:n/a Error Path:/solr/live_nodes/127.0.0.1:52022_ Error:KeeperErrorCode = NoNode for /solr/live_nodes/127.0.0.1:52022_
[junit4:junit4]   2> 536 T3427 oascc.SolrZkClient.makePath makePath: /live_nodes/127.0.0.1:52022_
[junit4:junit4]   2> 540 T3427 oascc.SolrZkClient.makePath makePath: /overseer_elect/election
[junit4:junit4]   2> 548 T3432 oazs.PrepRequestProcessor.pRequest Got user-level KeeperException when processing sessionid:0x13cd9b874450003 type:delete cxid:0x16 zxid:0x21 txntype:-1 reqpath:n/a Error Path:/solr/overseer_elect/leader Error:KeeperErrorCode = NoNode for /solr/overseer_elect/leader
[junit4:junit4]   2> 549 T3427 oascc.SolrZkClient.makePath makePath: /overseer_elect/leader
[junit4:junit4]   2> 552 T3427 oasc.Overseer.start Overseer (id=89185478888456195-127.0.0.1:52022_-n_0000000000) starting
[junit4:junit4]   2> 553 T3432 oazs.PrepRequestProcessor.pRequest Got user-level KeeperException when processing sessionid:0x13cd9b874450003 type:create cxid:0x1b zxid:0x23 txntype:-1 reqpath:n/a Error Path:/solr/overseer Error:KeeperErrorCode = NodeExists for /solr/overseer
[junit4:junit4]   2> 554 T3432 oazs.PrepRequestProcessor.pRequest Got user-level KeeperException when processing sessionid:0x13cd9b874450003 type:create cxid:0x1c zxid:0x24 txntype:-1 reqpath:n/a Error Path:/solr/overseer Error:KeeperErrorCode = NodeExists for /solr/overseer
[junit4:junit4]   2> 556 T3432 oazs.PrepRequestProcessor.pRequest Got user-level KeeperException when processing sessionid:0x13cd9b874450003 type:create cxid:0x1d zxid:0x25 txntype:-1 reqpath:n/a Error Path:/solr/overseer Error:KeeperErrorCode = NodeExists for /solr/overseer
[junit4:junit4]   2> 557 T3432 oazs.PrepRequestProcessor.pRequest Got user-level KeeperException when processing sessionid:0x13cd9b874450003 type:create cxid:0x1e zxid:0x26 txntype:-1 reqpath:n/a Error Path:/solr/overseer Error:KeeperErrorCode = NodeExists for /solr/overseer
[junit4:junit4]   2> 558 T3451 oasc.OverseerCollectionProcessor.run Process current queue of collection creations
[junit4:junit4]   2> 559 T3427 oascc.SolrZkClient.makePath makePath: /clusterstate.json
[junit4:junit4]   2> 563 T3427 oascc.ZkStateReader.createClusterStateWatchersAndUpdate Updating cluster state from ZooKeeper... 
[junit4:junit4]   2> 566 T3450 oasc.Overseer$ClusterStateUpdater.run Starting to work on the main queue
[junit4:junit4]   2> 572 T3452 oasc.CoreContainer.create Creating SolrCore 'collection1' using instanceDir: /Users/jenkins/jenkins-slave/workspace/Lucene-Solr-4.x-MacOSX/solr/build/solr-core/test/J0/./org.apache.solr.cloud.BasicDistributedZkTest-controljetty-1360862409996/collection1
[junit4:junit4]   2> 572 T3452 oasc.ZkController.createCollectionZkNode Check for collection zkNode:control_collection
[junit4:junit4]   2> 573 T3452 oasc.ZkController.createCollectionZkNode Collection zkNode exists
[junit4:junit4]   2> 574 T3452 oasc.ZkController.readConfigName Load collection config from:/collections/control_collection
[junit4:junit4]   2> 576 T3452 oasc.SolrResourceLoader.<init> new SolrResourceLoader for directory: '/Users/jenkins/jenkins-slave/workspace/Lucene-Solr-4.x-MacOSX/solr/build/solr-core/test/J0/./org.apache.solr.cloud.BasicDistributedZkTest-controljetty-1360862409996/collection1/'
[junit4:junit4]   2> 577 T3452 oasc.SolrResourceLoader.replaceClassLoader Adding 'file:/Users/jenkins/jenkins-slave/workspace/Lucene-Solr-4.x-MacOSX/solr/build/solr-core/test/J0/org.apache.solr.cloud.BasicDistributedZkTest-controljetty-1360862409996/collection1/lib/classes/' to classloader
[junit4:junit4]   2> 577 T3452 oasc.SolrResourceLoader.replaceClassLoader Adding 'file:/Users/jenkins/jenkins-slave/workspace/Lucene-Solr-4.x-MacOSX/solr/build/solr-core/test/J0/org.apache.solr.cloud.BasicDistributedZkTest-controljetty-1360862409996/collection1/lib/README' to classloader
[junit4:junit4]   2> 639 T3452 oasc.SolrConfig.<init> Using Lucene MatchVersion: LUCENE_42
[junit4:junit4]   2> 706 T3452 oasc.SolrConfig.<init> Loaded SolrConfig: solrconfig.xml
[junit4:junit4]   2> 708 T3452 oass.IndexSchema.readSchema Reading Solr Schema
[junit4:junit4]   2> 719 T3452 oass.IndexSchema.readSchema Schema name=test
[junit4:junit4]   2> 1313 T3452 oass.OpenExchangeRatesOrgProvider.init Initialized with rates=open-exchange-rates.json, refreshInterval=1440.
[junit4:junit4]   2> 1321 T3452 oass.IndexSchema.readSchema default search field in schema is text
[junit4:junit4]   2> 1325 T3452 oass.IndexSchema.readSchema unique key field: id
[junit4:junit4]   2> 1349 T3452 oass.FileExchangeRateProvider.reload Reloading exchange rates from file currency.xml
[junit4:junit4]   2> 1357 T3452 oass.FileExchangeRateProvider.reload Reloading exchange rates from file currency.xml
[junit4:junit4]   2> 1366 T3452 oass.OpenExchangeRatesOrgProvider.reload Reloading exchange rates from open-exchange-rates.json
[junit4:junit4]   2> 1369 T3452 oass.OpenExchangeRatesOrgProvider.reload Reloading exchange rates from open-exchange-rates.json
[junit4:junit4]   2> 1372 T3452 oasc.SolrCore.<init> [collection1] Opening new SolrCore at /Users/jenkins/jenkins-slave/workspace/Lucene-Solr-4.x-MacOSX/solr/build/solr-core/test/J0/./org.apache.solr.cloud.BasicDistributedZkTest-controljetty-1360862409996/collection1/, dataDir=./org.apache.solr.cloud.BasicDistributedZkTest-1360862409790/control/data/
[junit4:junit4]   2> 1372 T3452 oasc.JmxMonitoredMap.<init> JMX monitoring is enabled. Adding Solr mbeans to JMX Server: com.sun.jmx.mbeanserver.JmxMBeanServer@3cafd472
[junit4:junit4]   2> 1373 T3452 oasc.SolrCore.initDirectoryFactory solr.NRTCachingDirectoryFactory
[junit4:junit4]   2> 1374 T3452 oasc.CachingDirectoryFactory.get return new directory for /Users/jenkins/jenkins-slave/workspace/Lucene-Solr-4.x-MacOSX/solr/build/solr-core/test/J0/./org.apache.solr.cloud.BasicDistributedZkTest-1360862409790/control/data forceNew:false
[junit4:junit4]   2> 1374 T3452 oasc.CachingDirectoryFactory.close Releasing directory:/Users/jenkins/jenkins-slave/workspace/Lucene-Solr-4.x-MacOSX/solr/build/solr-core/test/J0/./org.apache.solr.cloud.BasicDistributedZkTest-1360862409790/control/data
[junit4:junit4]   2> 1374 T3452 oasc.SolrCore.getNewIndexDir New index directory detected: old=null new=./org.apache.solr.cloud.BasicDistributedZkTest-1360862409790/control/data/index/
[junit4:junit4]   2> 1375 T3452 oasc.SolrCore.initIndex WARNING [collection1] Solr index directory './org.apache.solr.cloud.BasicDistributedZkTest-1360862409790/control/data/index' doesn't exist. Creating new index...
[junit4:junit4]   2> 1376 T3452 oasc.CachingDirectoryFactory.get return new directory for /Users/jenkins/jenkins-slave/workspace/Lucene-Solr-4.x-MacOSX/solr/build/solr-core/test/J0/./org.apache.solr.cloud.BasicDistributedZkTest-1360862409790/control/data/index forceNew:false
[junit4:junit4]   2> 1380 T3452 oasc.SolrDeletionPolicy.onCommit SolrDeletionPolicy.onCommit: commits:num=1
[junit4:junit4]   2> 		commit{dir=RateLimitedDirectoryWrapper(NRTCachingDirectory(org.apache.lucene.store.NIOFSDirectory@/Users/jenkins/jenkins-slave/workspace/Lucene-Solr-4.x-MacOSX/solr/build/solr-core/test/J0/org.apache.solr.cloud.BasicDistributedZkTest-1360862409790/control/data/index lockFactory=org.apache.lucene.store.NativeFSLockFactory@1eedd202; maxCacheMB=48.0 maxMergeSizeMB=4.0)),segFN=segments_1,generation=1,filenames=[segments_1]
[junit4:junit4]   2> 1381 T3452 oasc.SolrDeletionPolicy.updateCommits newest commit = 1[segments_1]
[junit4:junit4]   2> 1381 T3452 oasc.CachingDirectoryFactory.close Releasing directory:/Users/jenkins/jenkins-slave/workspace/Lucene-Solr-4.x-MacOSX/solr/build/solr-core/test/J0/./org.apache.solr.cloud.BasicDistributedZkTest-1360862409790/control/data/index
[junit4:junit4]   2> 1382 T3452 oasc.SolrCore.initWriters created xml: solr.XMLResponseWriter
[junit4:junit4]   2> 1384 T3452 oasup.UpdateRequestProcessorChain.init inserting DistributedUpdateProcessorFactory into updateRequestProcessorChain "dedupe"
[junit4:junit4]   2> 1384 T3452 oasup.UpdateRequestProcessorChain.init inserting DistributedUpdateProcessorFactory into updateRequestProcessorChain "dedupe-allfields"
[junit4:junit4]   2> 1385 T3452 oasup.UpdateRequestProcessorChain.init inserting DistributedUpdateProcessorFactory into updateRequestProcessorChain "stored_sig"
[junit4:junit4]   2> 1385 T3452 oasup.UpdateRequestProcessorChain.init inserting DistributedUpdateProcessorFactory into updateRequestProcessorChain "uniq-fields"
[junit4:junit4]   2> 1386 T3452 oasup.UpdateRequestProcessorChain.init inserting DistributedUpdateProcessorFactory into updateRequestProcessorChain "distrib-dup-test-chain-implicit"
[junit4:junit4]   2> 1386 T3452 oasc.RequestHandlers.initHandlersFromConfig adding lazy requestHandler: solr.ReplicationHandler
[junit4:junit4]   2> 1386 T3452 oasc.RequestHandlers.initHandlersFromConfig created /replication: solr.ReplicationHandler
[junit4:junit4]   2> 1387 T3452 oasc.RequestHandlers.initHandlersFromConfig created standard: solr.StandardRequestHandler
[junit4:junit4]   2> 1388 T3452 oasc.RequestHandlers.initHandlersFromConfig created /get: solr.RealTimeGetHandler
[junit4:junit4]   2> 1388 T3452 oasc.RequestHandlers.initHandlersFromConfig created dismax: solr.SearchHandler
[junit4:junit4]   2> 1389 T3452 oasc.RequestHandlers.initHandlersFromConfig created mock: org.apache.solr.core.MockQuerySenderListenerReqHandler
[junit4:junit4]   2> 1390 T3452 oasc.RequestHandlers.initHandlersFromConfig created /admin/: org.apache.solr.handler.admin.AdminHandlers
[junit4:junit4]   2> 1391 T3452 oasc.RequestHandlers.initHandlersFromConfig created defaults: solr.StandardRequestHandler
[junit4:junit4]   2> 1391 T3452 oasc.RequestHandlers.initHandlersFromConfig adding lazy requestHandler: solr.StandardRequestHandler
[junit4:junit4]   2> 1392 T3452 oasc.RequestHandlers.initHandlersFromConfig created lazy: solr.StandardRequestHandler
[junit4:junit4]   2> 1392 T3452 oasc.RequestHandlers.initHandlersFromConfig created /update: solr.UpdateRequestHandler
[junit4:junit4]   2> 1393 T3452 oasc.RequestHandlers.initHandlersFromConfig created /terms: org.apache.solr.handler.component.SearchHandler
[junit4:junit4]   2> 1394 T3452 oasc.RequestHandlers.initHandlersFromConfig created spellCheckCompRH: org.apache.solr.handler.component.SearchHandler
[junit4:junit4]   2> 1395 T3452 oasc.RequestHandlers.initHandlersFromConfig created spellCheckCompRH_Direct: org.apache.solr.handler.component.SearchHandler
[junit4:junit4]   2> 1395 T3452 oasc.RequestHandlers.initHandlersFromConfig created spellCheckWithWordbreak: org.apache.solr.handler.component.SearchHandler
[junit4:junit4]   2> 1396 T3452 oasc.RequestHandlers.initHandlersFromConfig created spellCheckWithWordbreak_Direct: org.apache.solr.handler.component.SearchHandler
[junit4:junit4]   2> 1397 T3452 oasc.RequestHandlers.initHandlersFromConfig created spellCheckCompRH1: org.apache.solr.handler.component.SearchHandler
[junit4:junit4]   2> 1398 T3452 oasc.RequestHandlers.initHandlersFromConfig created mltrh: org.apache.solr.handler.component.SearchHandler
[junit4:junit4]   2> 1399 T3452 oasc.RequestHandlers.initHandlersFromConfig created tvrh: org.apache.solr.handler.component.SearchHandler
[junit4:junit4]   2> 1400 T3452 oasc.RequestHandlers.initHandlersFromConfig created /mlt: solr.MoreLikeThisHandler
[junit4:junit4]   2> 1401 T3452 oasc.RequestHandlers.initHandlersFromConfig created /debug/dump: solr.DumpRequestHandler
[junit4:junit4]   2> 1407 T3452 oashl.XMLLoader.init xsltCacheLifetimeSeconds=60
[junit4:junit4]   2> 1411 T3452 oasc.SolrCore.initDeprecatedSupport WARNING solrconfig.xml uses deprecated <admin/gettableFiles>, Please update your config to use the ShowFileRequestHandler.
[junit4:junit4]   2> 1412 T3452 oasc.SolrCore.initDeprecatedSupport WARNING adding ShowFileRequestHandler with hidden files: [SCHEMA.XML, OLD_SYNONYMS.TXT, STOPWORDS.TXT, PROTWORDS.TXT, OPEN-EXCHANGE-RATES.JSON, SYNONYMS.TXT, CURRENCY.XML, MAPPING-ISOLATIN1ACCENT.TXT]
[junit4:junit4]   2> 1416 T3452 oasc.CachingDirectoryFactory.close Releasing directory:/Users/jenkins/jenkins-slave/workspace/Lucene-Solr-4.x-MacOSX/solr/build/solr-core/test/J0/./org.apache.solr.cloud.BasicDistributedZkTest-1360862409790/control/data
[junit4:junit4]   2> 1417 T3452 oass.SolrIndexSearcher.<init> Opening Searcher@789bf22c main
[junit4:junit4]   2> 1419 T3452 oasu.CommitTracker.<init> Hard AutoCommit: disabled
[junit4:junit4]   2> 1419 T3452 oasu.CommitTracker.<init> Soft AutoCommit: disabled
[junit4:junit4]   2> 1420 T3452 oashc.SpellCheckComponent.inform Initializing spell checkers
[junit4:junit4]   2> 1426 T3452 oass.DirectSolrSpellChecker.init init: {name=direct,classname=DirectSolrSpellChecker,field=lowerfilt,minQueryLength=3}
[junit4:junit4]   2> 1464 T3453 oasc.SolrCore.registerSearcher [collection1] Registered new searcher Searcher@789bf22c main{StandardDirectoryReader(segments_1:1)}
[junit4:junit4]   2> 1472 T3452 oasc.ZkController.publish publishing core=collection1 state=down
[junit4:junit4]   2> 1473 T3452 oasc.ZkController.publish numShards not found on descriptor - reading it from system property
[junit4:junit4]   2> 1474 T3432 oazs.PrepRequestProcessor.pRequest Got user-level KeeperException when processing sessionid:0x13cd9b874450003 type:create cxid:0x51 zxid:0x29 txntype:-1 reqpath:n/a Error Path:/solr/overseer/queue Error:KeeperErrorCode = NoNode for /solr/overseer/queue
[junit4:junit4]   2> 2074 T3450 oascc.ZkStateReader.updateClusterState Updating cloud state from ZooKeeper... 
[junit4:junit4]   2> 2075 T3450 oasc.Overseer$ClusterStateUpdater.updateState Update state numShards=1 message={
[junit4:junit4]   2> 	  "operation":"state",
[junit4:junit4]   2> 	  "numShards":"1",
[junit4:junit4]   2> 	  "shard":null,
[junit4:junit4]   2> 	  "roles":null,
[junit4:junit4]   2> 	  "state":"down",
[junit4:junit4]   2> 	  "core":"collection1",
[junit4:junit4]   2> 	  "collection":"control_collection",
[junit4:junit4]   2> 	  "node_name":"127.0.0.1:52022_",
[junit4:junit4]   2> 	  "base_url":"http://127.0.0.1:52022"}
[junit4:junit4]   2> 2075 T3450 oasc.Overseer$ClusterStateUpdater.createCollection Create collection control_collection with numShards 1
[junit4:junit4]   2> 2076 T3450 oasc.Overseer$ClusterStateUpdater.updateState Assigning new node to shard shard=shard1
[junit4:junit4]   2> 2076 T3432 oazs.PrepRequestProcessor.pRequest Got user-level KeeperException when processing sessionid:0x13cd9b874450003 type:create cxid:0x59 zxid:0x2c txntype:-1 reqpath:n/a Error Path:/solr/overseer/queue-work Error:KeeperErrorCode = NoNode for /solr/overseer/queue-work
[junit4:junit4]   2> 2085 T3449 oascc.ZkStateReader$2.process A cluster state change: WatchedEvent state:SyncConnected type:NodeDataChanged path:/clusterstate.json, has occurred - updating... (live nodes size: 1)
[junit4:junit4]   2> 2480 T3452 oasc.CoreContainer.registerCore registering core: collection1
[junit4:junit4]   2> 2480 T3452 oasc.ZkController.register Register replica - core:collection1 address:http://127.0.0.1:52022 collection:control_collection shard:shard1
[junit4:junit4]   2> 2482 T3452 oascc.SolrZkClient.makePath makePath: /collections/control_collection/leader_elect/shard1/election
[junit4:junit4]   2> 2494 T3432 oazs.PrepRequestProcessor.pRequest Got user-level KeeperException when processing sessionid:0x13cd9b874450003 type:delete cxid:0x73 zxid:0x36 txntype:-1 reqpath:n/a Error Path:/solr/collections/control_collection/leaders Error:KeeperErrorCode = NoNode for /solr/collections/control_collection/leaders
[junit4:junit4]   2> 2495 T3452 oasc.ShardLeaderElectionContext.runLeaderProcess Running the leader process.
[junit4:junit4]   2> 2495 T3432 oazs.PrepRequestProcessor.pRequest Got user-level KeeperException when processing sessionid:0x13cd9b874450003 type:create cxid:0x74 zxid:0x37 txntype:-1 reqpath:n/a Error Path:/solr/overseer Error:KeeperErrorCode = NodeExists for /solr/overseer
[junit4:junit4]   2> 2499 T3452 oasc.ShardLeaderElectionContext.waitForReplicasToComeUp Enough replicas found to continue.
[junit4:junit4]   2> 2499 T3452 oasc.ShardLeaderElectionContext.runLeaderProcess I may be the new leader - try and sync
[junit4:junit4]   2> 2499 T3452 oasc.SyncStrategy.sync Sync replicas to http://127.0.0.1:52022/collection1/
[junit4:junit4]   2> 2500 T3452 oasc.SyncStrategy.syncReplicas Sync Success - now sync replicas to me
[junit4:junit4]   2> 2500 T3452 oasc.SyncStrategy.syncToMe http://127.0.0.1:52022/collection1/ has no replicas
[junit4:junit4]   2> 2501 T3452 oasc.ShardLeaderElectionContext.runLeaderProcess I am the new leader: http://127.0.0.1:52022/collection1/
[junit4:junit4]   2> 2501 T3452 oascc.SolrZkClient.makePath makePath: /collections/control_collection/leaders/shard1
[junit4:junit4]   2> 2508 T3432 oazs.PrepRequestProcessor.pRequest Got user-level KeeperException when processing sessionid:0x13cd9b874450003 type:create cxid:0x7e zxid:0x3b txntype:-1 reqpath:n/a Error Path:/solr/overseer Error:KeeperErrorCode = NodeExists for /solr/overseer
[junit4:junit4]   2> 3592 T3450 oascc.ZkStateReader.updateClusterState Updating cloud state from ZooKeeper... 
[junit4:junit4]   2> 3604 T3449 oascc.ZkStateReader$2.process A cluster state change: WatchedEvent state:SyncConnected type:NodeDataChanged path:/clusterstate.json, has occurred - updating... (live nodes size: 1)
[junit4:junit4]   2> 3643 T3452 oasc.ZkController.register We are http://127.0.0.1:52022/collection1/ and leader is http://127.0.0.1:52022/collection1/
[junit4:junit4]   2> 3644 T3452 oasc.ZkController.register No LogReplay needed for core=collection1 baseURL=http://127.0.0.1:52022
[junit4:junit4]   2> 3644 T3452 oasc.ZkController.checkRecovery I am the leader, no recovery necessary
[junit4:junit4]   2> 3644 T3452 oasc.ZkController.publish publishing core=collection1 state=active
[junit4:junit4]   2> 3645 T3452 oasc.ZkController.publish numShards not found on descriptor - reading it from system property
[junit4:junit4]   2> 3647 T3452 oascc.ZkStateReader.updateClusterState Updating cloud state from ZooKeeper... 
[junit4:junit4]   2> 3648 T3427 oass.SolrDispatchFilter.init user.dir=/Users/jenkins/jenkins-slave/workspace/Lucene-Solr-4.x-MacOSX/solr/build/solr-core/test/J0
[junit4:junit4]   2> 3648 T3427 oass.SolrDispatchFilter.init SolrDispatchFilter.init() done
[junit4:junit4]   2> 3649 T3427 oascsi.HttpClientUtil.createClient Creating new http client, config:maxConnections=128&maxConnectionsPerHost=32&followRedirects=false
[junit4:junit4]   2> 3655 T3427 oascsi.HttpClientUtil.createClient Creating new http client, config:
[junit4:junit4]   2> 3656 T3427 oaz.ZooKeeper.<init> Initiating client connection, connectString=127.0.0.1:52019/solr sessionTimeout=10000 watcher=org.apache.solr.common.cloud.ConnectionManager@3d6d0d81
[junit4:junit4]   2> 3657 T3427 oascc.ConnectionManager.waitForConnected Waiting for client to connect to ZooKeeper
[junit4:junit4]   2> 3658 T3454 oaz.ClientCnxn$SendThread.logStartConnect Opening socket connection to server localhost/127.0.0.1:52019. Will not attempt to authenticate using SASL (access denied ("javax.security.auth.AuthPermission" "getLoginConfiguration"))
[junit4:junit4]   2> 3659 T3454 oaz.ClientCnxn$SendThread.primeConnection Socket connection established to localhost/127.0.0.1:52019, initiating session
[junit4:junit4]   2> 3659 T3429 oazs.NIOServerCnxnFactory.run Accepted socket connection from /127.0.0.1:52025
[junit4:junit4]   2> 3660 T3429 oazs.ZooKeeperServer.processConnectRequest Client attempting to establish new session at /127.0.0.1:52025
[junit4:junit4]   2> 3661 T3431 oazs.ZooKeeperServer.finishSessionInit Established session 0x13cd9b874450004 with negotiated timeout 10000 for client /127.0.0.1:52025
[junit4:junit4]   2> 3661 T3454 oaz.ClientCnxn$SendThread.onConnected Session establishment complete on server localhost/127.0.0.1:52019, sessionid = 0x13cd9b874450004, negotiated timeout = 10000
[junit4:junit4]   2> 3661 T3455 oascc.ConnectionManager.process Watcher org.apache.solr.common.cloud.ConnectionManager@3d6d0d81 name:ZooKeeperConnection Watcher:127.0.0.1:52019/solr got event WatchedEvent state:SyncConnected type:None path:null path:null type:None
[junit4:junit4]   2> 3662 T3427 oascc.ConnectionManager.waitForConnected Client is connected to ZooKeeper
[junit4:junit4]   2> 3663 T3427 oascc.ZkStateReader.createClusterStateWatchersAndUpdate Updating cluster state from ZooKeeper... 
[junit4:junit4]   2> 3666 T3427 oasc.ChaosMonkey.monkeyLog monkey: init - expire sessions:true cause connection loss:true
[junit4:junit4]   2> 3861 T3427 oejs.Server.doStart jetty-8.1.8.v20121106
[junit4:junit4]   2> 3865 T3427 oejs.AbstractConnector.doStart Started SelectChannelConnector@127.0.0.1:52026
[junit4:junit4]   2> 3866 T3427 oass.SolrDispatchFilter.init SolrDispatchFilter.init()
[junit4:junit4]   2> 3867 T3427 oasc.SolrResourceLoader.locateSolrHome JNDI not configured for solr (NoInitialContextEx)
[junit4:junit4]   2> 3868 T3427 oasc.SolrResourceLoader.locateSolrHome using system property solr.solr.home: /Users/jenkins/jenkins-slave/workspace/Lucene-Solr-4.x-MacOSX/solr/build/solr-core/test/J0/./org.apache.solr.cloud.BasicDistributedZkTest-jetty1-1360862413449
[junit4:junit4]   2> 3868 T3427 oasc.CoreContainer$Initializer.initialize looking for solr.xml: /Users/jenkins/jenkins-slave/workspace/Lucene-Solr-4.x-MacOSX/solr/build/solr-core/test/J0/./org.apache.solr.cloud.BasicDistributedZkTest-jetty1-1360862413449/solr.xml
[junit4:junit4]   2> 3869 T3427 oasc.CoreContainer.<init> New CoreContainer 596594191
[junit4:junit4]   2> 3869 T3427 oasc.CoreContainer.load Loading CoreContainer using Solr Home: '/Users/jenkins/jenkins-slave/workspace/Lucene-Solr-4.x-MacOSX/solr/build/solr-core/test/J0/./org.apache.solr.cloud.BasicDistributedZkTest-jetty1-1360862413449/'
[junit4:junit4]   2> 3870 T3427 oasc.SolrResourceLoader.<init> new SolrResourceLoader for directory: '/Users/jenkins/jenkins-slave/workspace/Lucene-Solr-4.x-MacOSX/solr/build/solr-core/test/J0/./org.apache.solr.cloud.BasicDistributedZkTest-jetty1-1360862413449/'
[junit4:junit4]   2> 3908 T3427 oashc.HttpShardHandlerFactory.getParameter Setting socketTimeout to: 60000
[junit4:junit4]   2> 3909 T3427 oashc.HttpShardHandlerFactory.getParameter Setting urlScheme to: http://
[junit4:junit4]   2> 3909 T3427 oashc.HttpShardHandlerFactory.getParameter Setting connTimeout to: 15000
[junit4:junit4]   2> 3910 T3427 oashc.HttpShardHandlerFactory.getParameter Setting maxConnectionsPerHost to: 20
[junit4:junit4]   2> 3910 T3427 oashc.HttpShardHandlerFactory.getParameter Setting corePoolSize to: 0
[junit4:junit4]   2> 3911 T3427 oashc.HttpShardHandlerFactory.getParameter Setting maximumPoolSize to: 2147483647
[junit4:junit4]   2> 3911 T3427 oashc.HttpShardHandlerFactory.getParameter Setting maxThreadIdleTime to: 5
[junit4:junit4]   2> 3912 T3427 oashc.HttpShardHandlerFactory.getParameter Setting sizeOfQueue to: -1
[junit4:junit4]   2> 3912 T3427 oashc.HttpShardHandlerFactory.getParameter Setting fairnessPolicy to: false
[junit4:junit4]   2> 3913 T3427 oascsi.HttpClientUtil.createClient Creating new http client, config:maxConnectionsPerHost=20&maxConnections=10000&socketTimeout=60000&connTimeout=15000&retry=false
[junit4:junit4]   2> 3927 T3427 oasc.CoreContainer.load Registering Log Listener
[junit4:junit4]   2> 3959 T3427 oasc.CoreContainer.initZooKeeper Zookeeper client=127.0.0.1:52019/solr
[junit4:junit4]   2> 3959 T3427 oasc.ZkController.checkChrootPath zkHost includes chroot
[junit4:junit4]   2> 3960 T3427 oaz.ZooKeeper.<init> Initiating client connection, connectString=127.0.0.1:52019 sessionTimeout=60000 watcher=org.apache.solr.common.cloud.ConnectionManager@4efa6026
[junit4:junit4]   2> 3961 T3427 oascc.ConnectionManager.waitForConnected Waiting for client to connect to ZooKeeper
[junit4:junit4]   2> 3962 T3465 oaz.ClientCnxn$SendThread.logStartConnect Opening socket connection to server localhost/127.0.0.1:52019. Will not attempt to authenticate using SASL (access denied ("javax.security.auth.AuthPermission" "getLoginConfiguration"))
[junit4:junit4]   2> 3962 T3465 oaz.ClientCnxn$SendThread.primeConnection Socket connection established to localhost/127.0.0.1:52019, initiating session
[junit4:junit4]   2> 3963 T3429 oazs.NIOServerCnxnFactory.run Accepted socket connection from /127.0.0.1:52027
[junit4:junit4]   2> 3964 T3429 oazs.ZooKeeperServer.processConnectRequest Client attempting to establish new session at /127.0.0.1:52027
[junit4:junit4]   2> 3965 T3431 oazs.ZooKeeperServer.finishSessionInit Established session 0x13cd9b874450005 with negotiated timeout 20000 for client /127.0.0.1:52027
[junit4:junit4]   2> 3965 T3465 oaz.ClientCnxn$SendThread.onConnected Session establishment complete on server localhost/127.0.0.1:52019, sessionid = 0x13cd9b874450005, negotiated timeout = 20000
[junit4:junit4]   2> 3965 T3466 oascc.ConnectionManager.process Watcher org.apache.solr.common.cloud.ConnectionManager@4efa6026 name:ZooKeeperConnection Watcher:127.0.0.1:52019 got event WatchedEvent state:SyncConnected type:None path:null path:null type:None
[junit4:junit4]   2> 3966 T3427 oascc.ConnectionManager.waitForConnected Client is connected to ZooKeeper
[junit4:junit4]   2> 3968 T3432 oazs.PrepRequestProcessor.pRequest2Txn Processed session termination for sessionid: 0x13cd9b874450005
[junit4:junit4]   2> 3969 T3429 oazs.NIOServerCnxn.closeSock Closed socket connection for client /127.0.0.1:52027 which had sessionid 0x13cd9b874450005
[junit4:junit4]   2> 3969 T3427 oaz.ZooKeeper.close Session: 0x13cd9b874450005 closed
[junit4:junit4]   2> 3969 T3466 oaz.ClientCnxn$EventThread.run EventThread shut down
[junit4:junit4]   2> 3969 T3427 oascsi.HttpClientUtil.createClient Creating new http client, config:maxConnections=500&maxConnectionsPerHost=16&socketTimeout=60000&connTimeout=15000
[junit4:junit4]   2> 3975 T3427 oaz.ZooKeeper.<init> Initiating client connection, connectString=127.0.0.1:52019/solr sessionTimeout=30000 watcher=org.apache.solr.common.cloud.ConnectionManager@36f97c44
[junit4:junit4]   2> 3976 T3427 oascc.ConnectionManager.waitForConnected Waiting for client to connect to ZooKeeper
[junit4:junit4]   2> 3976 T3467 oaz.ClientCnxn$SendThread.logStartConnect Opening socket connection to server localhost/127.0.0.1:52019. Will not attempt to authenticate using SASL (access denied ("javax.security.auth.AuthPermission" "getLoginConfiguration"))
[junit4:junit4]   2> 3977 T3467 oaz.ClientCnxn$SendThread.primeConnection Socket connection established to localhost/127.0.0.1:52019, initiating session
[junit4:junit4]   2> 3978 T3429 oazs.NIOServerCnxnFactory.run Accepted socket connection from /127.0.0.1:52028
[junit4:junit4]   2> 3978 T3429 oazs.ZooKeeperServer.processConnectRequest Client attempting to establish new session at /127.0.0.1:52028
[junit4:junit4]   2> 3979 T3431 oazs.ZooKeeperServer.finishSessionInit Established session 0x13cd9b874450006 with negotiated timeout 20000 for client /127.0.0.1:52028
[junit4:junit4]   2> 3979 T3467 oaz.ClientCnxn$SendThread.onConnected Session establishment complete on server localhost/127.0.0.1:52019, sessionid = 0x13cd9b874450006, negotiated timeout = 20000
[junit4:junit4]   2> 3980 T3468 oascc.ConnectionManager.process Watcher org.apache.solr.common.cloud.ConnectionManager@36f97c44 name:ZooKeeperConnection Watcher:127.0.0.1:52019/solr got event WatchedEvent state:SyncConnected type:None path:null path:null type:None
[junit4:junit4]   2> 3980 T3427 oascc.ConnectionManager.waitForConnected Client is connected to ZooKeeper
[junit4:junit4]   2> 3981 T3432 oazs.PrepRequestProcessor.pRequest Got user-level KeeperException when processing sessionid:0x13cd9b874450006 type:create cxid:0x1 zxid:0x49 txntype:-1 reqpath:n/a Error Path:/solr/overseer Error:KeeperErrorCode = NodeExists for /solr/overseer
[junit4:junit4]   2> 3983 T3432 oazs.PrepRequestProcessor.pRequest Got user-level KeeperException when processing sessionid:0x13cd9b874450006 type:create cxid:0x2 zxid:0x4a txntype:-1 reqpath:n/a Error Path:/solr/overseer Error:KeeperErrorCode = NodeExists for /solr/overseer
[junit4:junit4]   2> 3986 T3427 oascc.ZkStateReader.createClusterStateWatchersAndUpdate Updating cluster state from ZooKeeper... 
[junit4:junit4]   2> 3989 T3427 oasc.ZkController.createEphemeralLiveNode Register node as live in ZooKeeper:/live_nodes/127.0.0.1:52026_
[junit4:junit4]   2> 3990 T3432 oazs.PrepRequestProcessor.pRequest Got user-level KeeperException when processing sessionid:0x13cd9b874450006 type:delete cxid:0x9 zxid:0x4b txntype:-1 reqpath:n/a Error Path:/solr/live_nodes/127.0.0.1:52026_ Error:KeeperErrorCode = NoNode for /solr/live_nodes/127.0.0.1:52026_
[junit4:junit4]   2> 3991 T3427 oascc.SolrZkClient.makePath makePath: /live_nodes/127.0.0.1:52026_
[junit4:junit4]   2> 3994 T3449 oascc.ZkStateReader$2.process A cluster state change: WatchedEvent state:SyncConnected type:NodeChildrenChanged path:/live_nodes, has occurred - updating... (live nodes size: 1)
[junit4:junit4]   2> 3995 T3468 oascc.ZkStateReader$3.process Updating live nodes... (2)
[junit4:junit4]   2> 3995 T3455 oascc.ZkStateReader$3.process Updating live nodes... (2)
[junit4:junit4]   2> 3997 T3449 oascc.ZkStateReader$3.process Updating live nodes... (2)
[junit4:junit4]   2> 4005 T3469 oasc.CoreContainer.create Creating SolrCore 'collection1' using instanceDir: /Users/jenkins/jenkins-slave/workspace/Lucene-Solr-4.x-MacOSX/solr/build/solr-core/test/J0/./org.apache.solr.cloud.BasicDistributedZkTest-jetty1-1360862413449/collection1
[junit4:junit4]   2> 4006 T3469 oasc.ZkController.createCollectionZkNode Check for collection zkNode:collection1
[junit4:junit4]   2> 4007 T3469 oasc.ZkController.createCollectionZkNode Collection zkNode exists
[junit4:junit4]   2> 4007 T3469 oasc.ZkController.readConfigName Load collection config from:/collections/collection1
[junit4:junit4]   2> 4009 T3469 oasc.SolrResourceLoader.<init> new SolrResourceLoader for directory: '/Users/jenkins/jenkins-slave/workspace/Lucene-Solr-4.x-MacOSX/solr/build/solr-core/test/J0/./org.apache.solr.cloud.BasicDistributedZkTest-jetty1-1360862413449/collection1/'
[junit4:junit4]   2> 4010 T3469 oasc.SolrResourceLoader.replaceClassLoader Adding 'file:/Users/jenkins/jenkins-slave/workspace/Lucene-Solr-4.x-MacOSX/solr/build/solr-core/test/J0/org.apache.solr.cloud.BasicDistributedZkTest-jetty1-1360862413449/collection1/lib/classes/' to classloader
[junit4:junit4]   2> 4010 T3469 oasc.SolrResourceLoader.replaceClassLoader Adding 'file:/Users/jenkins/jenkins-slave/workspace/Lucene-Solr-4.x-MacOSX/solr/build/solr-core/test/J0/org.apache.solr.cloud.BasicDistributedZkTest-jetty1-1360862413449/collection1/lib/README' to classloader
[junit4:junit4]   2> 4056 T3469 oasc.SolrConfig.<init> Using Lucene MatchVersion: LUCENE_42
[junit4:junit4]   2> 4118 T3469 oasc.SolrConfig.<init> Loaded SolrConfig: solrconfig.xml
[junit4:junit4]   2> 4120 T3469 oass.IndexSchema.readSchema Reading Solr Schema
[junit4:junit4]   2> 4126 T3469 oass.IndexSchema.readSchema Schema name=test
[junit4:junit4]   2> 4695 T3469 oass.OpenExchangeRatesOrgProvider.init Initialized with rates=open-exchange-rates.json, refreshInterval=1440.
[junit4:junit4]   2> 4704 T3469 oass.IndexSchema.readSchema default search field in schema is text
[junit4:junit4]   2> 4708 T3469 oass.IndexSchema.readSchema unique key field: id
[junit4:junit4]   2> 4728 T3469 oass.FileExchangeRateProvider.reload Reloading exchange rates from file currency.xml
[junit4:junit4]   2> 4733 T3469 oass.FileExchangeRateProvider.reload Reloading exchange rates from file currency.xml
[junit4:junit4]   2> 4738 T3469 oass.OpenExchangeRatesOrgProvider.reload Reloading exchange rates from open-exchange-rates.json
[junit4:junit4]   2> 4740 T3469 oass.OpenExchangeRatesOrgProvider.reload Reloading exchange rates from open-exchange-rates.json
[junit4:junit4]   2> 4742 T3469 oasc.SolrCore.<init> [collection1] Opening new SolrCore at /Users/jenkins/jenkins-slave/workspace/Lucene-Solr-4.x-MacOSX/solr/build/solr-core/test/J0/./org.apache.solr.cloud.BasicDistributedZkTest-jetty1-1360862413449/collection1/, dataDir=./org.apache.solr.cloud.BasicDistributedZkTest-1360862409790/jetty1/
[junit4:junit4]   2> 4743 T3469 oasc.JmxMonitoredMap.<init> JMX monitoring is enabled. Adding Solr mbeans to JMX Server: com.sun.jmx.mbeanserver.JmxMBeanServer@3cafd472
[junit4:junit4]   2> 4743 T3469 oasc.SolrCore.initDirectoryFactory solr.NRTCachingDirectoryFactory
[junit4:junit4]   2> 4744 T3469 oasc.CachingDirectoryFactory.get return new directory for /Users/jenkins/jenkins-slave/workspace/Lucene-Solr-4.x-MacOSX/solr/build/solr-core/test/J0/./org.apache.solr.cloud.BasicDistributedZkTest-1360862409790/jetty1 forceNew:false
[junit4:junit4]   2> 4745 T3469 oasc.CachingDirectoryFactory.close Releasing directory:/Users/jenkins/jenkins-slave/workspace/Lucene-Solr-4.x-MacOSX/solr/build/solr-core/test/J0/./org.apache.solr.cloud.BasicDistributedZkTest-1360862409790/jetty1
[junit4:junit4]   2> 4745 T3469 oasc.SolrCore.getNewIndexDir New index directory detected: old=null new=./org.apache.solr.cloud.BasicDistributedZkTest-1360862409790/jetty1/index/
[junit4:junit4]   2> 4745 T3469 oasc.SolrCore.initIndex WARNING [collection1] Solr index directory './org.apache.solr.cloud.BasicDistributedZkTest-1360862409790/jetty1/index' doesn't exist. Creating new index...
[junit4:junit4]   2> 4746 T3469 oasc.CachingDirectoryFactory.get return new directory for /Users/jenkins/jenkins-slave/workspace/Lucene-Solr-4.x-MacOSX/solr/build/solr-core/test/J0/./org.apache.solr.cloud.BasicDistributedZkTest-1360862409790/jetty1/index forceNew:false
[junit4:junit4]   2> 4750 T3469 oasc.SolrDeletionPolicy.onCommit SolrDeletionPolicy.onCommit: commits:num=1
[junit4:junit4]   2> 		commit{dir=RateLimitedDirectoryWrapper(NRTCachingDirectory(org.apache.lucene.store.NIOFSDirectory@/Users/jenkins/jenkins-slave/workspace/Lucene-Solr-4.x-MacOSX/solr/build/solr-core/test/J0/org.apache.solr.cloud.BasicDistributedZkTest-1360862409790/jetty1/index lockFactory=org.apache.lucene.store.NativeFSLockFactory@250a06e; maxCacheMB=48.0 maxMergeSizeMB=4.0)),segFN=segments_1,generation=1,filenames=[segments_1]
[junit4:junit4]   2> 4751 T3469 oasc.SolrDeletionPolicy.updateCommits newest commit = 1[segments_1]
[junit4:junit4]   2> 4751 T3469 oasc.CachingDirectoryFactory.close Releasing directory:/Users/jenkins/jenkins-slave/workspace/Lucene-Solr-4.x-MacOSX/solr/build/solr-core/test/J0/./org.apache.solr.cloud.BasicDistributedZkTest-1360862409790/jetty1/index
[junit4:junit4]   2> 4752 T3469 oasc.SolrCore.initWriters created xml: solr.XMLResponseWriter
[junit4:junit4]   2> 4754 T3469 oasup.UpdateRequestProcessorChain.init inserting DistributedUpdateProcessorFactory into updateRequestProcessorChain "dedupe"
[junit4:junit4]   2> 4755 T3469 oasup.UpdateRequestProcessorChain.init inserting DistributedUpdateProcessorFactory into updateRequestProcessorChain "dedupe-allfields"
[junit4:junit4]   2> 4755 T3469 oasup.UpdateRequestProcessorChain.init inserting DistributedUpdateProcessorFactory into updateRequestProcessorChain "stored_sig"
[junit4:junit4]   2> 4756 T3469 oasup.UpdateRequestProcessorChain.init inserting DistributedUpdateProcessorFactory into updateRequestProcessorChain "uniq-fields"
[junit4:junit4]   2> 4757 T3469 oasup.UpdateRequestProcessorChain.init inserting DistributedUpdateProcessorFactory into updateRequestProcessorChain "distrib-dup-test-chain-implicit"
[junit4:junit4]   2> 4757 T3469 oasc.RequestHandlers.initHandlersFromConfig adding lazy requestHandler: solr.ReplicationHandler
[junit4:junit4]   2> 4758 T3469 oasc.RequestHandlers.initHandlersFromConfig created /replication: solr.ReplicationHandler
[junit4:junit4]   2> 4759 T3469 oasc.RequestHandlers.initHandlersFromConfig created standard: solr.StandardRequestHandler
[junit4:junit4]   2> 4760 T3469 oasc.RequestHandlers.initHandlersFromConfig created /get: solr.RealTimeGetHandler
[junit4:junit4]   2> 4760 T3469 oasc.RequestHandlers.initHandlersFromConfig created dismax: solr.SearchHandler
[junit4:junit4]   2> 4761 T3469 oasc.RequestHandlers.initHandlersFromConfig created mock: org.apache.solr.core.MockQuerySenderListenerReqHandler
[junit4:junit4]   2> 4761 T3469 oasc.RequestHandlers.initHandlersFromConfig created /admin/: org.apache.solr.handler.admin.AdminHandlers
[junit4:junit4]   2> 4762 T3469 oasc.RequestHandlers.initHandlersFromConfig created defaults: solr.StandardRequestHandler
[junit4:junit4]   2> 4762 T3469 oasc.RequestHandlers.initHandlersFromConfig adding lazy requestHandler: solr.StandardRequestHandler
[junit4:junit4]   2> 4763 T3469 oasc.RequestHandlers.initHandlersFromConfig created lazy: solr.StandardRequestHandler
[junit4:junit4]   2> 4764 T3469 oasc.RequestHandlers.initHandlersFromConfig created /update: solr.UpdateRequestHandler
[junit4:junit4]   2> 4764 T3469 oasc.RequestHandlers.initHandlersFromConfig created /terms: org.apache.solr.handler.component.SearchHandler
[junit4:junit4]   2> 4765 T3469 oasc.RequestHandlers.initHandlersFromConfig created spellCheckCompRH: org.apache.solr.handler.component.SearchHandler
[junit4:junit4]   2> 4765 T3469 oasc.RequestHandlers.initHandlersFromConfig created spellCheckCompRH_Direct: org.apache.solr.handler.component.SearchHandler
[junit4:junit4]   2> 4766 T3469 oasc.RequestHandlers.initHandlersFromConfig created spellCheckWithWordbreak: org.apache.solr.handler.component.SearchHandler
[junit4:junit4]   2> 4767 T3469 oasc.RequestHandlers.initHandlersFromConfig created spellCheckWithWordbreak_Direct: org.apache.solr.handler.component.SearchHandler
[junit4:junit4]   2> 4767 T3469 oasc.RequestHandlers.initHandlersFromConfig created spellCheckCompRH1: org.apache.solr.handler.component.SearchHandler
[junit4:junit4]   2> 4768 T3469 oasc.RequestHandlers.initHandlersFromConfig created mltrh: org.apache.solr.handler.component.SearchHandler
[junit4:junit4]   2> 4769 T3469 oasc.RequestHandlers.initHandlersFromConfig created tvrh: org.apache.solr.handler.component.SearchHandler
[junit4:junit4]   2> 4769 T3469 oasc.RequestHandlers.initHandlersFromConfig created /mlt: solr.MoreLikeThisHandler
[junit4:junit4]   2> 4770 T3469 oasc.RequestHandlers.initHandlersFromConfig created /debug/dump: solr.DumpRequestHandler
[junit4:junit4]   2> 4776 T3469 oashl.XMLLoader.init xsltCacheLifetimeSeconds=60
[junit4:junit4]   2> 4779 T3469 oasc.SolrCore.initDeprecatedSupport WARNING solrconfig.xml uses deprecated <admin/gettableFiles>, Please update your config to use the ShowFileRequestHandler.
[junit4:junit4]   2> 4781 T3469 oasc.SolrCore.initDeprecatedSupport WARNING adding ShowFileRequestHandler with hidden files: [SCHEMA.XML, OLD_SYNONYMS.TXT, STOPWORDS.TXT, PROTWORDS.TXT, OPEN-EXCHANGE-RATES.JSON, SYNONYMS.TXT, CURRENCY.XML, MAPPING-ISOLATIN1ACCENT.TXT]
[junit4:junit4]   2> 4783 T3469 oasc.CachingDirectoryFactory.close Releasing directory:/Users/jenkins/jenkins-slave/workspace/Lucene-Solr-4.x-MacOSX/solr/build/solr-core/test/J0/./org.apache.solr.cloud.BasicDistributedZkTest-1360862409790/jetty1
[junit4:junit4]   2> 4784 T3469 oass.SolrIndexSearcher.<init> Opening Searcher@4766fc31 main
[junit4:junit4]   2> 4785 T3469 oasu.CommitTracker.<init> Hard AutoCommit: disabled
[junit4:junit4]   2> 4786 T3469 oasu.CommitTracker.<init> Soft AutoCommit: disabled
[junit4:junit4]   2> 4786 T3469 oashc.SpellCheckComponent.inform Initializing spell checkers
[junit4:junit4]   2> 4795 T3469 oass.DirectSolrSpellChecker.init init: {name=direct,classname=DirectSolrSpellChecker,field=lowerfilt,minQueryLength=3}
[junit4:junit4]   2> 4828 T3470 oasc.SolrCore.registerSearcher [collection1] Registered new searcher Searcher@4766fc31 main{StandardDirectoryReader(segments_1:1)}
[junit4:junit4]   2> 4835 T3469 oasc.ZkController.publish publishing core=collection1 state=down
[junit4:junit4]   2> 4835 T3469 oasc.ZkController.publish numShards not found on descriptor - reading it from system property
[junit4:junit4]   2> 5115 T3450 oascc.ZkStateReader.updateClusterState Updating cloud state from ZooKeeper... 
[junit4:junit4]   2> 5118 T3450 oasc.Overseer$ClusterStateUpdater.updateState Update state numShards=1 message={
[junit4:junit4]   2> 	  "operation":"state",
[junit4:junit4]   2> 	  "numShards":"1",
[junit4:junit4]   2> 	  "shard":"shard1",
[junit4:junit4]   2> 	  "roles":null,
[junit4:junit4]   2> 	  "state":"active",
[junit4:junit4]   2> 	  "core":"collection1",
[junit4:junit4]   2> 	  "collection":"control_collection",
[junit4:junit4]   2> 	  "node_name":"127.0.0.1:52022_",
[junit4:junit4]   2> 	  "base_url":"http://127.0.0.1:52022"}
[junit4:junit4]   2> 5126 T3450 oasc.Overseer$ClusterStateUpdater.updateState Update state numShards=2 message={
[junit4:junit4]   2> 	  "operation":"state",
[junit4:junit4]   2> 	  "numShards":"2",
[junit4:junit4]   2> 	  "shard":null,
[junit4:junit4]   2> 	  "roles":null,
[junit4:junit4]   2> 	  "state":"down",
[junit4:junit4]   2> 	  "core":"collection1",
[junit4:junit4]   2> 	  "collection":"collection1",
[junit4:junit4]   2> 	  "node_name":"127.0.0.1:52026_",
[junit4:junit4]   2> 	  "base_url":"http://127.0.0.1:52026"}
[junit4:junit4]   2> 5127 T3450 oasc.Overseer$ClusterStateUpdater.createCollection Create collection collection1 with numShards 2
[junit4:junit4]   2> 5128 T3450 oasc.Overseer$ClusterStateUpdater.updateState Assigning new node to shard shard=shard1
[junit4:junit4]   2> 5139 T3468 oascc.ZkStateReader$2.process A cluster state change: WatchedEvent state:SyncConnected type:NodeDataChanged path:/clusterstate.json, has occurred - updating... (live nodes size: 2)
[junit4:junit4]   2> 5141 T3449 oascc.ZkStateReader$2.process A cluster state change: WatchedEvent state:SyncConnected type:NodeDataChanged path:/clusterstate.json, has occurred - updating... (live nodes size: 2)
[junit4:junit4]   2> 5145 T3455 oascc.ZkStateReader$2.process A cluster state change: WatchedEvent state:SyncConnected type:NodeDataChanged path:/clusterstate.json, has occurred - updating... (live nodes size: 2)
[junit4:junit4]   2> 5839 T3469 oasc.CoreContainer.registerCore registering core: collection1
[junit4:junit4]   2> 5839 T3469 oasc.ZkController.register Register replica - core:collection1 address:http://127.0.0.1:52026 collection:collection1 shard:shard1
[junit4:junit4]   2> 5840 T3469 oascc.SolrZkClient.makePath makePath: /collections/collection1/leader_elect/shard1/election
[junit4:junit4]   2> 5849 T3432 oazs.PrepRequestProcessor.pRequest Got user-level KeeperException when processing sessionid:0x13cd9b874450006 type:delete cxid:0x45 zxid:0x5a txntype:-1 reqpath:n/a Error Path:/solr/collections/collection1/leaders Error:KeeperErrorCode = NoNode for /solr/collections/collection1/leaders
[junit4:junit4]   2> 5851 T3469 oasc.ShardLeaderElectionContext.runLeaderProcess Running the leader process.
[junit4:junit4]   2> 5852 T3432 oazs.PrepRequestProcessor.pRequest Got user-level KeeperException when processing sessionid:0x13cd9b874450006 type:create cxid:0x46 zxid:0x5b txntype:-1 reqpath:n/a Error Path:/solr/overseer Error:KeeperErrorCode = NodeExists for /solr/overseer
[junit4:junit4]   2> 5856 T3469 oasc.ShardLeaderElectionContext.waitForReplicasToComeUp Enough replicas found to continue.
[junit4:junit4]   2> 5856 T3469 oasc.ShardLeaderElectionContext.runLeaderProcess I may be the new leader - try and sync
[junit4:junit4]   2> 5856 T3469 oasc.SyncStrategy.sync Sync replicas to http://127.0.0.1:52026/collection1/
[junit4:junit4]   2> 5857 T3469 oasc.SyncStrategy.syncReplicas Sync Success - now sync replicas to me
[junit4:junit4]   2> 5857 T3469 oasc.SyncStrategy.syncToMe http://127.0.0.1:52026/collection1/ has no replicas
[junit4:junit4]   2> 5857 T3469 oasc.ShardLeaderElectionContext.runLeaderProcess I am the new leader: http://127.0.0.1:52026/collection1/
[junit4:junit4]   2> 5857 T3469 oascc.SolrZkClient.makePath makePath: /collections/collection1/leaders/shard1
[junit4:junit4]   2> 5862 T3432 oazs.PrepRequestProcessor.pRequest Got user-level KeeperException when processing sessionid:0x13cd9b874450006 type:create cxid:0x50 zxid:0x5f txntype:-1 reqpath:n/a Error Path:/solr/overseer Error:KeeperErrorCode = NodeExists for /solr/overseer
[junit4:junit4]   2> 6653 T3450 oascc.ZkStateReader.updateClusterState Updating cloud state from ZooKeeper... 
[junit4:junit4]   2> 6664 T3468 oascc.ZkStateReader$2.process A cluster state change: WatchedEvent state:SyncConnected type:NodeDataChanged path:/clusterstate.json, has occurred - updating... (live nodes size: 2)
[junit4:junit4]   2> 6664 T3449 oascc.ZkStateReader$2.process A cluster state change: WatchedEvent state:SyncConnected type:NodeDataChanged path:/clusterstate.json, has occurred - updating... (live nodes size: 2)
[junit4:junit4]   2> 6664 T3455 oascc.ZkStateReader$2.process A cluster state change: WatchedEvent state:SyncConnected type:NodeDataChanged path:/clusterstate.json, has occurred - updating... (live nodes size: 2)
[junit4:junit4]   2> 6697 T3469 oasc.ZkController.register We are http://127.0.0.1:52026/collection1/ and leader is http://127.0.0.1:52026/collection1/
[junit4:junit4]   2> 6697 T3469 oasc.ZkController.register No LogReplay needed for core=collection1 baseURL=http://127.0.0.1:52026
[junit4:junit4]   2> 6698 T3469 oasc.ZkController.checkRecovery I am the leader, no recovery necessary
[junit4:junit4]   2> 6698 T3469 oasc.ZkController.publish publishing core=collection1 state=active
[junit4:junit4]   2> 6698 T3469 oasc.ZkController.publish numShards not found on descriptor - reading it from system property
[junit4:junit4]   2> 6701 T3469 oascc.ZkStateReader.updateClusterState Updating cloud state from ZooKeeper... 
[junit4:junit4]   2> 6703 T3427 oass.SolrDispatchFilter.init user.dir=/Users/jenkins/jenkins-slave/workspace/Lucene-Solr-4.x-MacOSX/solr/build/solr-core/test/J0
[junit4:junit4]   2> 6703 T3427 oass.SolrDispatchFilter.init SolrDispatchFilter.init() done
[junit4:junit4]   2> 6704 T3427 oascsi.HttpClientUtil.createClient Creating new http client, config:maxConnections=128&maxConnectionsPerHost=32&followRedirects=false
[junit4:junit4]   2> 6906 T3427 oejs.Server.doStart jetty-8.1.8.v20121106
[junit4:junit4]   2> 6911 T3427 oejs.AbstractConnector.doStart Started SelectChannelConnector@127.0.0.1:52029
[junit4:junit4]   2> 6913 T3427 oass.SolrDispatchFilter.init SolrDispatchFilter.init()
[junit4:junit4]   2> 6913 T3427 oasc.SolrResourceLoader.locateSolrHome JNDI not configured for solr (NoInitialContextEx)
[junit4:junit4]   2> 6914 T3427 oasc.SolrResourceLoader.locateSolrHome using system property solr.solr.home: /Users/jenkins/jenkins-slave/workspace/Lucene-Solr-4.x-MacOSX/solr/build/solr-core/test/J0/./org.apache.solr.cloud.BasicDistributedZkTest-jetty2-1360862416493
[junit4:junit4]   2> 6914 T3427 oasc.CoreContainer$Initializer.initialize looking for solr.xml: /Users/jenkins/jenkins-slave/workspace/Lucene-Solr-4.x-MacOSX/solr/build/solr-core/test/J0/./org.apache.solr.cloud.BasicDistributedZkTest-jetty2-1360862416493/solr.xml
[junit4:junit4]   2> 6915 T3427 oasc.CoreContainer.<init> New CoreContainer 650735612
[junit4:junit4]   2> 6915 T3427 oasc.CoreContainer.load Loading CoreContainer using Solr Home: '/Users/jenkins/jenkins-slave/workspace/Lucene-Solr-4.x-MacOSX/solr/build/solr-core/test/J0/./org.apache.solr.cloud.BasicDistributedZkTest-jetty2-1360862416493/'
[junit4:junit4]   2> 6916 T3427 oasc.SolrResourceLoader.<init> new SolrResourceLoader for directory: '/Users/jenkins/jenkins-slave/workspace/Lucene-Solr-4.x-MacOSX/solr/build/solr-core/test/J0/./org.apache.solr.cloud.BasicDistributedZkTest-jetty2-1360862416493/'
[junit4:junit4]   2> 6974 T3427 oashc.HttpShardHandlerFactory.getParameter Setting socketTimeout to: 60000
[junit4:junit4]   2> 6975 T3427 oashc.HttpShardHandlerFactory.getParameter Setting urlScheme to: http://
[junit4:junit4]   2> 6976 T3427 oashc.HttpShardHandlerFactory.getParameter Setting connTimeout to: 15000
[junit4:junit4]   2> 6977 T3427 oashc.HttpShardHandlerFactory.getParameter Setting maxConnectionsPerHost to: 20
[junit4:junit4]   2> 6977 T3427 oashc.HttpShardHandlerFactory.getParameter Setting corePoolSize to: 0
[junit4:junit4]   2> 6978 T3427 oashc.HttpShardHandlerFactory.getParameter Setting maximumPoolSize to: 2147483647
[junit4:junit4]   2> 6979 T3427 oashc.HttpShardHandlerFactory.getParameter Setting maxThreadIdleTime to: 5
[junit4:junit4]   2> 6979 T3427 oashc.HttpShardHandlerFactory.getParameter Setting sizeOfQueue to: -1
[junit4:junit4]   2> 6980 T3427 oashc.HttpShardHandlerFactory.getParameter Setting fairnessPolicy to: false
[junit4:junit4]   2> 6981 T3427 oascsi.HttpClientUtil.createClient Creating new http client, config:maxConnectionsPerHost=20&maxConnections=10000&socketTimeout=60000&connTimeout=15000&retry=false
[junit4:junit4]   2> 6997 T3427 oasc.CoreContainer.load Registering Log Listener
[junit4:junit4]   2> 7016 T3427 oasc.CoreContainer.initZooKeeper Zookeeper client=127.0.0.1:52019/solr
[junit4:junit4]   2> 7017 T3427 oasc.ZkController.checkChrootPath zkHost includes chroot
[junit4:junit4]   2> 7018 T3427 oaz.ZooKeeper.<init> Initiating client connection, connectString=127.0.0.1:52019 sessionTimeout=60000 watcher=org.apache.solr.common.cloud.ConnectionManager@b8c3de3
[junit4:junit4]   2> 7020 T3427 oascc.ConnectionManager.waitForConnected Waiting for client to connect to ZooKeeper
[junit4:junit4]   2> 7020 T3480 oaz.ClientCnxn$SendThread.logStartConnect Opening socket connection to server localhost/127.0.0.1:52019. Will not attempt to authenticate using SASL (access denied ("javax.security.auth.AuthPermission" "getLoginConfiguration"))
[junit4:junit4]   2> 7022 T3480 oaz.ClientCnxn$SendThread.primeConnection Socket connection established to localhost/127.0.0.1:52019, initiating session
[junit4:junit4]   2> 7022 T3429 oazs.NIOServerCnxnFactory.run Accepted socket connection from /127.0.0.1:52030
[junit4:junit4]   2> 7023 T3429 oazs.ZooKeeperServer.processConnectRequest Client attempting to establish new session at /127.0.0.1:52030
[junit4:junit4]   2> 7027 T3431 oazs.ZooKeeperServer.finishSessionInit Established session 0x13cd9b874450007 with negotiated timeout 20000 for client /127.0.0.1:52030
[junit4:junit4]   2> 7027 T3480 oaz.ClientCnxn$SendThread.onConnected Session establishment complete on server localhost/127.0.0.1:52019, sessionid = 0x13cd9b874450007, negotiated timeout = 20000
[junit4:junit4]   2> 7027 T3481 oascc.ConnectionManager.process Watcher org.apache.solr.common.cloud.ConnectionManager@b8c3de3 name:ZooKeeperConnection Watcher:127.0.0.1:52019 got event WatchedEvent state:SyncConnected type:None path:null path:null type:None
[junit4:junit4]   2> 7028 T3427 oascc.ConnectionManager.waitForConnected Client is connected to ZooKeeper
[junit4:junit4]   2> 7030 T3432 oazs.PrepRequestProcessor.pRequest2Txn Processed session termination for sessionid: 0x13cd9b874450007
[junit4:junit4]   2> 7031 T3429 oazs.NIOServerCnxn.closeSock Closed socket connection for client /127.0.0.1:52030 which had sessionid 0x13cd9b874450007
[junit4:junit4]   2> 7031 T3427 oaz.ZooKeeper.close Session: 0x13cd9b874450007 closed
[junit4:junit4]   2> 7032 T3481 oaz.ClientCnxn$EventThread.run EventThread shut down
[junit4:junit4]   2> 7032 T3427 oascsi.HttpClientUtil.createClient Creating new http client, config:maxConnections=500&maxConnectionsPerHost=16&socketTimeout=60000&connTimeout=15000
[junit4:junit4]   2> 7038 T3427 oaz.ZooKeeper.<init> Initiating client connection, connectString=127.0.0.1:52019/solr sessionTimeout=30000 watcher=org.apache.solr.common.cloud.ConnectionManager@5f5d56e2
[junit4:junit4]   2> 7040 T3427 oascc.ConnectionManager.waitForConnected Waiting for client to connect to ZooKeeper
[junit4:junit4]   2> 7041 T3482 oaz.ClientCnxn$SendThread.logStartConnect Opening socket connection to server localhost/127.0.0.1:52019. Will not attempt to authenticate using SASL (access denied ("javax.security.auth.AuthPermission" "getLoginConfiguration"))
[junit4:junit4]   2> 7042 T3482 oaz.ClientCnxn$SendThread.primeConnection Socket connection established to localhost/127.0.0.1:52019, initiating session
[junit4:junit4]   2> 7043 T3429 oazs.NIOServerCnxnFactory.run Accepted socket connection from /127.0.0.1:52031
[junit4:junit4]   2> 7043 T3429 oazs.ZooKeeperServer.processConnectRequest Client attempting to establish new session at /127.0.0.1:52031
[junit4:junit4]   2> 7045 T3431 oazs.ZooKeeperServer.finishSessionInit Established session 0x13cd9b874450008 with negotiated timeout 20000 for client /127.0.0.1:52031
[junit4:junit4]   2> 7045 T3482 oaz.ClientCnxn$SendThread.onConnected Session establishment complete on server localhost/127.0.0.1:52019, sessionid = 0x13cd9b874450008, negotiated timeout = 20000
[junit4:junit4]   2> 7046 T3483 oascc.ConnectionManager.process Watcher org.apache.solr.common.cloud.ConnectionManager@5f5d56e2 name:ZooKeeperConnection Watcher:127.0.0.1:52019/solr got event WatchedEvent state:SyncConnected type:None path:null path:null type:None
[junit4:junit4]   2> 7047 T3427 oascc.ConnectionManager.waitForConnected Client is connected to ZooKeeper
[junit4:junit4]   2> 7048 T3432 oazs.PrepRequestProcessor.pRequest Got user-level KeeperException when processing sessionid:0x13cd9b874450008 type:create cxid:0x1 zxid:0x6c txntype:-1 reqpath:n/a Error Path:/solr/overseer Error:KeeperErrorCode = NodeExists for /solr/overseer
[junit4:junit4]   2> 7049 T3432 oazs.PrepRequestProcessor.pRequest Got user-level KeeperException when processing sessionid:0x13cd9b874450008 type:create cxid:0x2 zxid:0x6d txntype:-1 reqpath:n/a Error Path:/solr/overseer Error:KeeperErrorCode = NodeExists for /solr/overseer
[junit4:junit4]   2> 7053 T3427 oascc.ZkStateReader.createClusterStateWatchersAndUpdate Updating cluster state from ZooKeeper... 
[junit4:junit4]   2> 7057 T3427 oasc.ZkController.createEphemeralLiveNode Register node as live in ZooKeeper:/live_nodes/127.0.0.1:52029_
[junit4:junit4]   2> 7058 T3432 oazs.PrepRequestProcessor.pRequest Got user-level KeeperException when processing sessionid:0x13cd9b874450008 type:delete cxid:0x9 zxid:0x6e txntype:-1 reqpath:n/a Error Path:/solr/live_nodes/127.0.0.1:52029_ Error:KeeperErrorCode = NoNode for /solr/live_nodes/127.0.0.1:52029_
[junit4:junit4]   2> 7060 T3427 oascc.SolrZkClient.makePath makePath: /live_nodes/127.0.0.1:52029_
[junit4:junit4]   2> 7064 T3468 oascc.ZkStateReader$2.process A cluster state change: WatchedEvent state:SyncConnected type:NodeChildrenChanged path:/live_nodes, has occurred - updating... (live nodes size: 2)
[junit4:junit4]   2> 7064 T3449 oascc.ZkStateReader$2.process A cluster state change: WatchedEvent state:SyncConnected type:NodeChildrenChanged path:/live_nodes, has occurred - updating... (live nodes size: 2)
[junit4:junit4]   2> 7066 T3455 oascc.ZkStateReader$3.process Updating live nodes... (3)
[junit4:junit4]   2> 7066 T3455 oascc.ZkStateReader$2.process A cluster state change: WatchedEvent state:SyncConnected type:NodeChildrenChanged path:/live_nodes, has occurred - updating... (live nodes size: 3)
[junit4:junit4]   2> 7067 T3483 oascc.ZkStateReader$3.process Updating live nodes... (3)
[junit4:junit4]   2> 7068 T3468 oascc.ZkStateReader$3.process Updating live nodes... (3)
[junit4:junit4]   2> 7070 T3449 oascc.ZkStateReader$3.process Updating live nodes... (3)
[junit4:junit4]   2> 7080 T3484 oasc.CoreContainer.create Creating SolrCore 'collection1' using instanceDir: /Users/jenkins/jenkins-slave/workspace/Lucene-Solr-4.x-MacOSX/solr/build/solr-core/test/J0/./org.apache.solr.cloud.BasicDistributedZkTest-jetty2-1360862416493/collection1
[junit4:junit4]   2> 7080 T3484 oasc.ZkController.createCollectionZkNode Check for collection zkNode:collection1
[junit4:junit4]   2> 7081 T3484 oasc.ZkController.createCollectionZkNode Collection zkNode exists
[junit4:junit4]   2> 7082 T3484 oasc.ZkController.readConfigName Load collection config from:/collections/collection1
[junit4:junit4]   2> 7084 T3484 oasc.SolrResourceLoader.<init> new SolrResourceLoader for directory: '/Users/jenkins/jenkins-slave/workspace/Lucene-Solr-4.x-MacOSX/solr/build/solr-core/test/J0/./org.apache.solr.cloud.BasicDistributedZkTest-jetty2-1360862416493/collection1/'
[junit4:junit4]   2> 7085 T3484 oasc.SolrResourceLoader.replaceClassLoader Adding 'file:/Users/jenkins/jenkins-slave/workspace/Lucene-Solr-4.x-MacOSX/solr/build/solr-core/test/J0/org.apache.solr.cloud.BasicDistributedZkTest-jetty2-1360862416493/collection1/lib/classes/' to classloader
[junit4:junit4]   2> 7086 T3484 oasc.SolrResourceLoader.replaceClassLoader Adding 'file:/Users/jenkins/jenkins-slave/workspace/Lucene-Solr-4.x-MacOSX/solr/build/solr-core/test/J0/org.apache.solr.cloud.BasicDistributedZkTest-jetty2-1360862416493/collection1/lib/README' to classloader
[junit4:junit4]   2> 7142 T3484 oasc.SolrConfig.<init> Using Lucene MatchVersion: LUCENE_42
[junit4:junit4]   2> 7213 T3484 oasc.SolrConfig.<init> Loaded SolrConfig: solrconfig.xml
[junit4:junit4]   2> 7214 T3484 oass.IndexSchema.readSchema Reading Solr Schema
[junit4:junit4]   2> 7224 T3484 oass.IndexSchema.readSchema Schema name=test
[junit4:junit4]   2> 7802 T3484 oass.OpenExchangeRatesOrgProvider.init Initialized with rates=open-exchange-rates.json, refreshInterval=1440.
[junit4:junit4]   2> 7811 T3484 oass.IndexSchema.readSchema default search field in schema is text
[junit4:junit4]   2> 7814 T3484 oass.IndexSchema.readSchema unique key field: id
[junit4:junit4]   2> 7835 T3484 oass.FileExchangeRateProvider.reload Reloading exchange rates from file currency.xml
[junit4:junit4]   2> 7840 T3484 oass.FileExchangeRateProvider.reload Reloading exchange rates from file currency.xml
[junit4:junit4]   2> 7846 T3484 oass.OpenExchangeRatesOrgProvider.reload Reloading exchange rates from open-exchange-rates.json
[junit4:junit4]   2> 7848 T3484 oass.OpenExchangeRatesOrgProvider.reload Reloading exchange rates from open-exchange-rates.json
[junit4:junit4]   2> 7850 T3484 oasc.SolrCore.<init> [collection1] Opening new SolrCore at /Users/jenkins/jenkins-slave/workspace/Lucene-Solr-4.x-MacOSX/solr/build/solr-core/test/J0/./org.apache.solr.cloud.BasicDistributedZkTest-jetty2-1360862416493/collection1/, dataDir=./org.apache.solr.cloud.BasicDistributedZkTest-1360862409790/jetty2/
[junit4:junit4]   2> 7850 T3484 oasc.JmxMonitoredMap.<init> JMX monitoring is enabled. Adding Solr mbeans to JMX Server: com.sun.jmx.mbeanserver.JmxMBeanServer@3cafd472
[junit4:junit4]   2> 7851 T3484 oasc.SolrCore.initDirectoryFactory solr.NRTCachingDirectoryFactory
[junit4:junit4]   2> 7851 T3484 oasc.CachingDirectoryFactory.get return new directory for /Users/jenkins/jenkins-slave/workspace/Lucene-Solr-4.x-MacOSX/solr/build/solr-core/test/J0/./org.apache.solr.cloud.BasicDistributedZkTest-1360862409790/jetty2 forceNew:false
[junit4:junit4]   2> 7852 T3484 oasc.CachingDirectoryFactory.close Releasing directory:/Users/jenkins/jenkins-slave/workspace/Lucene-Solr-4.x-MacOSX/solr/build/solr-core/test/J0/./org.apache.solr.cloud.BasicDistributedZkTest-1360862409790/jetty2
[junit4:junit4]   2> 7852 T3484 oasc.SolrCore.getNewIndexDir New index directory detected: old=null new=./org.apache.solr.cloud.BasicDistributedZkTest-1360862409790/jetty2/index/
[junit4:junit4]   2> 7853 T3484 oasc.SolrCore.initIndex WARNING [collection1] Solr index directory './org.apache.solr.cloud.BasicDistributedZkTest-1360862409790/jetty2/index' doesn't exist. Creating new index...
[junit4:junit4]   2> 7853 T3484 oasc.CachingDirectoryFactory.get return new directory for /Users/jenkins/jenkins-slave/workspace/Lucene-Solr-4.x-MacOSX/solr/build/solr-core/test/J0/./org.apache.solr.cloud.BasicDistributedZkTest-1360862409790/jetty2/index forceNew:false
[junit4:junit4]   2> 7858 T3484 oasc.SolrDeletionPolicy.onCommit SolrDeletionPolicy.onCommit: commits:num=1
[junit4:junit4]   2> 		commit{dir=RateLimitedDirectoryWrapper(NRTCachingDirectory(org.apache.lucene.store.NIOFSDirectory@/Users/jenkins/jenkins-slave/workspace/Lucene-Solr-4.x-MacOSX/solr/build/solr-core/test/J0/org.apache.solr.cloud.BasicDistributedZkTest-1360862409790/jetty2/index lockFactory=org.apache.lucene.store.NativeFSLockFactory@61756f39; maxCacheMB=48.0 maxMergeSizeMB=4.0)),segFN=segments_1,generation=1,filenames=[segments_1]
[junit4:junit4]   2> 7858 T3484 oasc.SolrDeletionPolicy.updateCommits newest commit = 1[segments_1]
[junit4:junit4]   2> 7859 T3484 oasc.CachingDirectoryFactory.close Releasing directory:/Users/jenkins/jenkins-slave/workspace/Lucene-Solr-4.x-MacOSX/solr/build/solr-core/test/J0/./org.apache.solr.cloud.BasicDistributedZkTest-1360862409790/jetty2/index
[junit4:junit4]   2> 7859 T3484 oasc.SolrCore.initWriters created xml: solr.XMLResponseWriter
[junit4:junit4]   2> 7862 T3484 oasup.UpdateRequestProcessorChain.init inserting DistributedUpdateProcessorFactory into updateRequestProcessorChain "dedupe"
[junit4:junit4]   2> 7862 T3484 oasup.UpdateRequestProcessorChain.init inserting DistributedUpdateProcessorFactory into updateRequestProcessorChain "dedupe-allfields"
[junit4:junit4]   2> 7862 T3484 oasup.UpdateRequestProcessorChain.init inserting DistributedUpdateProcessorFactory into updateRequestProcessorChain "stored_sig"
[junit4:junit4]   2> 7863 T3484 oasup.UpdateRequestProcessorChain.init inserting DistributedUpdateProcessorFactory into updateRequestProcessorChain "uniq-fields"
[junit4:junit4]   2> 7864 T3484 oasup.UpdateRequestProcessorChain.init inserting DistributedUpdateProcessorFactory into updateRequestProcessorChain "distrib-dup-test-chain-implicit"
[junit4:junit4]   2> 7864 T3484 oasc.RequestHandlers.initHandlersFromConfig adding lazy requestHandler: solr.ReplicationHandler
[junit4:junit4]   2> 7864 T3484 oasc.RequestHandlers.initHandlersFromConfig created /replication: solr.ReplicationHandler
[junit4:junit4]   2> 7865 T3484 oasc.RequestHandlers.initHandlersFromConfig created standard: solr.StandardRequestHandler
[junit4:junit4]   2> 7866 T3484 oasc.RequestHandlers.initHandlersFromConfig created /get: solr.RealTimeGetHandler
[junit4:junit4]   2> 7866 T3484 oasc.RequestHandlers.initHandlersFromConfig created dismax: solr.SearchHandler
[junit4:junit4]   2> 7867 T3484 oasc.RequestHandlers.initHandlersFromConfig created mock: org.apache.solr.core.MockQuerySenderListenerReqHandler
[junit4:junit4]   2> 7868 T3484 oasc.RequestHandlers.initHandlersFromConfig created /admin/: org.apache.solr.handler.admin.AdminHandlers
[junit4:junit4]   2> 7868 T3484 oasc.RequestHandlers.initHandlersFromConfig created defaults: solr.StandardRequestHandler
[junit4:junit4]   2> 7869 T3484 oasc.RequestHandlers.initHandlersFromConfig adding lazy requestHandler: solr.StandardRequestHandler
[junit4:junit4]   2> 7870 T3484 oasc.RequestHandlers.initHandlersFromConfig created lazy: solr.StandardRequestHandler
[junit4:junit4]   2> 7870 T3484 oasc.RequestHandlers.initHandlersFromConfig created /update: solr.UpdateRequestHandler
[junit4:junit4]   2> 7871 T3484 oasc.RequestHandlers.initHandlersFromConfig created /terms: org.apache.solr.handler.component.SearchHandler
[junit4:junit4]   2> 7872 T3484 oasc.RequestHandlers.initHandlersFromConfig created spellCheckCompRH: org.apache.solr.handler.component.SearchHandler
[junit4:junit4]   2> 7872 T3484 oasc.RequestHandlers.initHandlersFromConfig created spellCheckCompRH_Direct: org.apache.solr.handler.component.SearchHandler
[junit4:junit4]   2> 7873 T3484 oasc.RequestHandlers.initHandlersFromConfig created spellCheckWithWordbreak: org.apache.solr.handler.component.SearchHandler
[junit4:junit4]   2> 7873 T3484 oasc.RequestHandlers.initHandlersFromConfig created spellCheckWithWordbreak_Direct: org.apache.solr.handler.component.SearchHandler
[junit4:junit4]   2> 7874 T3484 oasc.RequestHandlers.initHandlersFromConfig created spellCheckCompRH1: org.apache.solr.handler.component.SearchHandler
[junit4:junit4]   2> 7875 T3484 oasc.RequestHandlers.initHandlersFromConfig created mltrh: org.apache.solr.handler.component.SearchHandler
[junit4:junit4]   2> 7875 T3484 oasc.RequestHandlers.initHandlersFromConfig created tvrh: org.apache.solr.handler.component.SearchHandler
[junit4:junit4]   2> 7876 T3484 oasc.RequestHandlers.initHandlersFromConfig created /mlt: solr.MoreLikeThisHandler
[junit4:junit4]   2> 7877 T3484 oasc.RequestHandlers.initHandlersFromConfig created /debug/dump: solr.DumpRequestHandler
[junit4:junit4]   2> 7883 T3484 oashl.XMLLoader.init xsltCacheLifetimeSeconds=60
[junit4:junit4]   2> 7886 T3484 oasc.SolrCore.initDeprecatedSupport WARNING solrconfig.xml uses deprecated <admin/gettableFiles>, Please update your config to use the ShowFileRequestHandler.
[junit4:junit4]   2> 7888 T3484 oasc.SolrCore.initDeprecatedSupport WARNING adding ShowFileRequestHandler with hidden files: [SCHEMA.XML, OLD_SYNONYMS.TXT, STOPWORDS.TXT, PROTWORDS.TXT, OPEN-EXCHANGE-RATES.JSON, SYNONYMS.TXT, CURRENCY.XML, MAPPING-ISOLATIN1ACCENT.TXT]
[junit4:junit4]   2> 7890 T3484 oasc.CachingDirectoryFactory.close Releasing directory:/Users/jenkins/jenkins-slave/workspace/Lucene-Solr-4.x-MacOSX/solr/build/solr-core/test/J0/./org.apache.solr.cloud.BasicDistributedZkTest-1360862409790/jetty2
[junit4:junit4]   2> 7891 T3484 oass.SolrIndexSearcher.<init> Opening Searcher@7bf4aea8 main
[junit4:junit4]   2> 7892 T3484 oasu.CommitTracker.<init> Hard AutoCommit: disabled
[junit4:junit4]   2> 7892 T3484 oasu.CommitTracker.<init> Soft AutoCommit: disabled
[junit4:junit4]   2> 7893 T3484 oashc.SpellCheckComponent.inform Initializing spell checkers
[junit4:junit4]   2> 7898 T3484 oass.DirectSolrSpellChecker.init init: {name=direct,classname=DirectSolrSpellChecker,field=lowerfilt,minQueryLength=3}
[junit4:junit4]   2> 7931 T3485 oasc.SolrCore.registerSearcher [collection1] Registered new searcher Searcher@7bf4aea8 main{StandardDirectoryReader(segments_1:1)}
[junit4:junit4]   2> 7939 T3484 oasc.ZkController.publish publishing core=collection1 state=down
[junit4:junit4]   2> 7939 T3484 oasc.ZkController.publish numShards not found on descriptor - reading it from system property
[junit4:junit4]   2> 8174 T3450 oascc.ZkStateReader.updateClusterState Updating cloud state from ZooKeeper... 
[junit4:junit4]   2> 8175 T3450 oasc.Overseer$ClusterStateUpdater.updateState Update state numShards=2 message={
[junit4:junit4]   2> 	  "operation":"state",
[junit4:junit4]   2> 	  "numShards":"2",
[junit4:junit4]   2> 	  "shard":"shard1",
[junit4:junit4]   2> 	  "roles":null,
[junit4:junit4]   2> 	  "state":"active",
[junit4:junit4]   2> 	  "core":"collection1",
[junit4:junit4]   2> 	  "collection":"collection1",
[junit4:junit4]   2> 	  "node_name":"127.0.0.1:52026_",
[junit4:junit4]   2> 	  "base_url":"http://127.0.0.1:52026"}
[junit4:junit4]   2> 8180 T3450 oasc.Overseer$ClusterStateUpdater.updateState Update state numShards=2 message={
[junit4:junit4]   2> 	  "operation":"state",
[junit4:junit4]   2> 	  "numShards":"2",
[junit4:junit4]   2> 	  "shard":null,
[junit4:junit4]   2> 	  "roles":null,
[junit4:junit4]   2> 	  "state":"down",
[junit4:junit4]   2> 	  "core":"collection1",
[junit4:junit4]   2> 	  "collection":"collection1",
[junit4:junit4]   2> 	  "node_name":"127.0.0.1:52029_",
[junit4:junit4]   2> 	  "base_url":"http://127.0.0.1:52029"}
[junit4:junit4]   2> 8181 T3450 oasc.Overseer$ClusterStateUpdater.updateState Collection already exists with numShards=2
[junit4:junit4]   2> 8181 T3450 oasc.Overseer$ClusterStateUpdater.updateState Assigning new node to shard shard=shard2
[junit4:junit4]   2> 8187 T3468 oascc.ZkStateReader$2.process A cluster state change: WatchedEvent state:SyncConnected type:NodeDataChanged path:/clusterstate.json, has occurred - updating... (live nodes size: 3)
[junit4:junit4]   2> 8187 T3449 oascc.ZkStateReader$2.process A cluster state change: WatchedEvent state:SyncConnected type:NodeDataChanged path:/clusterstate.json, has occurred - updating... (live nodes size: 3)
[junit4:junit4]   2> 8187 T3483 oascc.ZkStateReader$2.process A cluster state change: WatchedEvent state:SyncConnected type:NodeDataChanged path:/clusterstate.json, has occurred - updating... (live nodes size: 3)
[junit4:junit4]   2> 8187 T3455 oascc.ZkStateReader$2.process A cluster state change: WatchedEvent state:SyncConnected type:NodeDataChanged path:/clusterstate.json, has occurred - updating... (live nodes size: 3)
[junit4:junit4]   2> 8943 T3484 oasc.CoreContainer.registerCore registering core: collection1
[junit4:junit4]   2> 8943 T3484 oasc.ZkController.register Register replica - core:collection1 address:http://127.0.0.1:52029 collection:collection1 shard:shard2
[junit4:junit4]   2> 8944 T3484 oascc.SolrZkClient.makePath makePath: /collections/collection1/leader_elect/shard2/election
[junit4:junit4]   2> 8954 T3432 oazs.PrepRequestProcessor.pRequest Got user-level KeeperException when processing sessionid:0x13cd9b874450008 type:delete cxid:0x44 zxid:0x7c txntype:-1 reqpath:n/a Error Path:/solr/collections/collection1/leaders/shard2 Error:KeeperErrorCode = NoNode for /solr/collections/collection1/leaders/shard2
[junit4:junit4]   2> 8955 T3484 oasc.ShardLeaderElectionContext.runLeaderProcess Running the leader process.
[junit4:junit4]   2> 8956 T3432 oazs.PrepRequestProcessor.pRequest Got user-level KeeperException when processing sessionid:0x13cd9b874450008 type:create cxid:0x45 zxid:0x7d txntype:-1 reqpath:n/a Error Path:/solr/overseer Error:KeeperErrorCode = NodeExists for /solr/overseer
[junit4:junit4]   2> 8959 T3484 oasc.ShardLeaderElectionContext.waitForReplicasToComeUp Enough replicas found to continue.
[junit4:junit4]   2> 8959 T3484 oasc.ShardLeaderElectionContext.runLeaderProcess I may be the new leader - try and sync
[junit4:junit4]   2> 8959 T3484 oasc.SyncStrategy.sync Sync replicas to http://127.0.0.1:52029/collection1/
[junit4:junit4]   2> 8960 T3484 oasc.SyncStrategy.syncReplicas Sync Success - now sync replicas to me
[junit4:junit4]   2> 8960 T3484 oasc.SyncStrategy.syncToMe http://127.0.0.1:52029/collection1/ has no replicas
[junit4:junit4]   2> 8960 T3484 oasc.ShardLeaderElectionContext.runLeaderProcess I am the new leader: http://127.0.0.1:52029/collection1/
[junit4:junit4]   2> 8961 T3484 oascc.SolrZkClient.makePath makePath: /collections/collection1/leaders/shard2
[junit4:junit4]   2> 8966 T3432 oazs.PrepRequestProcessor.pRequest Got user-level KeeperException when processing sessionid:0x13cd9b874450008 type:create cxid:0x4e zxid:0x80 txntype:-1 reqpath:n/a Error Path:/solr/overseer Error:KeeperErrorCode = NodeExists for /solr/overseer
[junit4:junit4]   2> 9698 T3450 oascc.ZkStateReader.updateClusterState Updating cloud state from ZooKeeper... 
[junit4:junit4]   2> 9709 T3455 oascc.ZkStateReader$2.process A cluster state change: WatchedEvent state:SyncConnected type:NodeDataChanged path:/clusterstate.json, has occurred - updating... (live nodes size: 3)
[junit4:junit4]   2> 9709 T3449 oascc.ZkStateReader$2.process A cluster state change: WatchedEvent state:SyncConnected type:NodeDataChanged path:/clusterstate.json, has occurred - updating... (live nodes size: 3)
[junit4:junit4]   2> 9710 T3468 oascc.ZkStateReader$2.process A cluster state change: WatchedEvent state:SyncConnected type:NodeDataChanged path:/clusterstate.json, has occurred - updating... (live nodes size: 3)
[junit4:junit4]   2> 9710 T3483 oascc.ZkStateReader$2.process A cluster state change: WatchedEvent state:SyncConnected type:NodeDataChanged path:/clusterstate.json, has occurred - updating... (live nodes size: 3)
[junit4:junit4]   2> 9738 T3484 oasc.ZkController.register We are http://127.0.0.1:52029/collection1/ and leader is http://127.0.0.1:52029/collection1/
[junit4:junit4]   2> 9738 T3484 oasc.ZkController.register No LogReplay needed for core=collection1 baseURL=http://127.0.0.1:52029
[junit4:junit4]   2> 9739 T3484 oasc.ZkController.checkRecovery I am the leader, no recovery necessary
[junit4:junit4]   2> 9739 T3484 oasc.ZkController.publish publishing core=collection1 state=active
[junit4:junit4]   2> 9739 T3484 oasc.ZkController.publish numShards not found on descriptor - reading it from system property
[junit4:junit4]   2> 9741 T3484 oascc.ZkStateReader.updateClusterState Updating cloud state from ZooKeeper... 
[junit4:junit4]   2> 9743 T3427 oass.SolrDispatchFilter.init user.dir=/Users/jenkins/jenkins-slave/workspace/Lucene-Solr-4.x-MacOSX/solr/build/solr-core/test/J0
[junit4:junit4]   2> 9743 T3427 oass.SolrDispatchFilter.init SolrDispatchFilter.init() done
[junit4:junit4]   2> 9744 T3427 oascsi.HttpClientUtil.createClient Creating new http client, config:maxConnections=128&maxConnectionsPerHost=32&followRedirects=false
[junit4:junit4]   2> 9968 T3427 oejs.Server.doStart jetty-8.1.8.v20121106
[junit4:junit4]   2> 9973 T3427 oejs.AbstractConnector.doStart Started SelectChannelConnector@127.0.0.1:52032
[junit4:junit4]   2> 9974 T3427 oass.SolrDispatchFilter.init SolrDispatchFilter.init()
[junit4:junit4]   2> 9974 T3427 oasc.SolrResourceLoader.locateSolrHome JNDI not configured for solr (NoInitialContextEx)
[junit4:junit4]   2> 9975 T3427 oasc.SolrResourceLoader.locateSolrHome using system property solr.solr.home: /Users/jenkins/jenkins-slave/workspace/Lucene-Solr-4.x-MacOSX/solr/build/solr-core/test/J0/./org.apache.solr.cloud.BasicDistributedZkTest-jetty3-1360862419549
[junit4:junit4]   2> 9975 T3427 oasc.CoreContainer$Initializer.initialize looking for solr.xml: /Users/jenkins/jenkins-slave/workspace/Lucene-Solr-4.x-MacOSX/solr/build/solr-core/test/J0/./org.apache.solr.cloud.BasicDistributedZkTest-jetty3-1360862419549/solr.xml
[junit4:junit4]   2> 9976 T3427 oasc.CoreContainer.<init> New CoreContainer 143651826
[junit4:junit4]   2> 9977 T3427 oasc.CoreContainer.load Loading CoreContainer using Solr Home: '/Users/jenkins/jenkins-slave/workspace/Lucene-Solr-4.x-MacOSX/solr/build/solr-core/test/J0/./org.apache.solr.cloud.BasicDistributedZkTest-jetty3-1360862419549/'
[junit4:junit4]   2> 9977 T3427 oasc.SolrResourceLoader.<init> new SolrResourceLoader for directory: '/Users/jenkins/jenkins-slave/workspace/Lucene-Solr-4.x-MacOSX/solr/build/solr-core/test/J0/./org.apache.solr.cloud.BasicDistributedZkTest-jetty3-1360862419549/'
[junit4:junit4]   2> 10016 T3427 oashc.HttpShardHandlerFactory.getParameter Setting socketTimeout to: 60000
[junit4:junit4]   2> 10016 T3427 oashc.HttpShardHandlerFactory.getParameter Setting urlScheme to: http://
[junit4:junit4]   2> 10017 T3427 oashc.HttpShardHandlerFactory.getParameter Setting connTimeout to: 15000
[junit4:junit4]   2> 10017 T3427 oashc.HttpShardHandlerFactory.getParameter Setting maxConnectionsPerHost to: 20
[junit4:junit4]   2> 10018 T3427 oashc.HttpShardHandlerFactory.getParameter Setting corePoolSize to: 0
[junit4:junit4]   2> 10018 T3427 oashc.HttpShardHandlerFactory.getParameter Setting maximumPoolSize to: 2147483647
[junit4:junit4]   2> 10019 T3427 oashc.HttpShardHandlerFactory.getParameter Setting maxThreadIdleTime to: 5
[junit4:junit4]   2> 10019 T3427 oashc.HttpShardHandlerFactory.getParameter Setting sizeOfQueue to: -1
[junit4:junit4]   2> 10020 T3427 oashc.HttpShardHandlerFactory.getParameter Setting fairnessPolicy to: false
[junit4:junit4]   2> 10020 T3427 oascsi.HttpClientUtil.createClient Creating new http client, config:maxConnectionsPerHost=20&maxConnections=10000&socketTimeout=60000&connTimeout=15000&retry=false
[junit4:junit4]   2> 10038 T3427 oasc.CoreContainer.load Registering Log Listener
[junit4:junit4]   2> 10060 T3427 oasc.CoreContainer.initZooKeeper Zookeeper client=127.0.0.1:52019/solr
[junit4:junit4]   2> 10061 T3427 oasc.ZkController.checkChrootPath zkHost includes chroot
[junit4:junit4]   2> 10061 T3427 oaz.ZooKeeper.<init> Initiating client connection, connectString=127.0.0.1:52019 sessionTimeout=60000 watcher=org.apache.solr.common.cloud.ConnectionManager@40c884d4
[junit4:junit4]   2> 10062 T3427 oascc.ConnectionManager.waitForConnected Waiting for client to connect to ZooKeeper
[junit4:junit4]   2> 10063 T3495 oaz.ClientCnxn$SendThread.logStartConnect Opening socket connection to server localhost/127.0.0.1:52019. Will not attempt to authenticate using SASL (access denied ("javax.security.auth.AuthPermission" "getLoginConfiguration"))
[junit4:junit4]   2> 10064 T3495 oaz.ClientCnxn$SendThread.primeConnection Socket connection established to localhost/127.0.0.1:52019, initiating session
[junit4:junit4]   2> 10064 T3429 oazs.NIOServerCnxnFactory.run Accepted socket connection from /127.0.0.1:52033
[junit4:junit4]   2> 10065 T3429 oazs.ZooKeeperServer.processConnectRequest Client attempting to establish new session at /127.0.0.1:52033
[junit4:junit4]   2> 10067 T3431 oazs.ZooKeeperServer.finishSessionInit Established session 0x13cd9b874450009 with negotiated timeout 20000 for client /127.0.0.1:52033
[junit4:junit4]   2> 10067 T3495 oaz.ClientCnxn$SendThread.onConnected Session establishment complete on server localhost/127.0.0.1:52019, sessionid = 0x13cd9b874450009, negotiated timeout = 20000
[junit4:junit4]   2> 10067 T3496 oascc.ConnectionManager.process Watcher org.apache.solr.common.cloud.ConnectionManager@40c884d4 name:ZooKeeperConnection Watcher:127.0.0.1:52019 got event WatchedEvent state:SyncConnected type:None path:null path:null type:None
[junit4:junit4]   2> 10068 T3427 oascc.ConnectionManager.waitForConnected Client is connected to ZooKeeper
[junit4:junit4]   2> 10070 T3432 oazs.PrepRequestProcessor.pRequest2Txn Processed session termination for sessionid: 0x13cd9b874450009
[junit4:junit4]   2> 10071 T3429 oazs.NIOServerCnxn.closeSock Closed socket connection for client /127.0.0.1:52033 which had sessionid 0x13cd9b874450009
[junit4:junit4]   2> 10071 T3427 oaz.ZooKeeper.close Session: 0x13cd9b874450009 closed
[junit4:junit4]   2> 10071 T3496 oaz.ClientCnxn$EventThread.run EventThread shut down
[junit4:junit4]   2> 10071 T3427 oascsi.HttpClientUtil.createClient Creating new http client, config:maxConnections=500&maxConnectionsPerHost=16&socketTimeout=60000&connTimeout=15000
[junit4:junit4]   2> 10077 T3427 oaz.ZooKeeper.<init> Initiating client connection, connectString=127.0.0.1:52019/solr sessionTimeout=30000 watcher=org.apache.solr.common.cloud.ConnectionManager@7ec0b258
[junit4:junit4]   2> 10078 T3427 oascc.ConnectionManager.waitForConnected Waiting for client to connect to ZooKeeper
[junit4:junit4]   2> 10079 T3497 oaz.ClientCnxn$SendThread.logStartConnect Opening socket connection to server localhost/127.0.0.1:52019. Will not attempt to authenticate using SASL (access denied ("javax.security.auth.AuthPermission" "getLoginConfiguration"))
[junit4:junit4]   2> 10080 T3497 oaz.ClientCnxn$SendThread.primeConnection Socket connection established to localhost/127.0.0.1:52019, initiating session
[junit4:junit4]   2> 10081 T3429 oazs.NIOServerCnxnFactory.run Accepted socket connection from /127.0.0.1:52034
[junit4:junit4]   2> 10081 T3429 oazs.ZooKeeperServer.processConnectRequest Client attempting to establish new session at /127.0.0.1:52034
[junit4:junit4]   2> 10083 T3431 oazs.ZooKeeperServer.finishSessionInit Established session 0x13cd9b87445000a with negotiated timeout 20000 for client /127.0.0.1:52034
[junit4:junit4]   2> 10083 T3497 oaz.ClientCnxn$SendThread.onConnected Session establishment complete on server localhost/127.0.0.1:52019, sessionid = 0x13cd9b87445000a, negotiated timeout = 20000
[junit4:junit4]   2> 10083 T3498 oascc.ConnectionManager.process Watcher org.apache.solr.common.cloud.ConnectionManager@7ec0b258 name:ZooKeeperConnection Watcher:127.0.0.1:52019/solr got event WatchedEvent state:SyncConnected type:None path:null path:null type:None
[junit4:junit4]   2> 10084 T3427 oascc.ConnectionManager.waitForConnected Client is connected to ZooKeeper
[junit4:junit4]   2> 10085 T3432 oazs.PrepRequestProcessor.pRequest Got user-level KeeperException when processing sessionid:0x13cd9b87445000a type:create cxid:0x1 zxid:0x8d txntype:-1 reqpath:n/a Error Path:/solr/overseer Error:KeeperErrorCode = NodeExists for /solr/overseer
[junit4:junit4]   2> 10086 T3432 oazs.PrepRequestProcessor.pRequest Got user-level KeeperException when processing sessionid:0x13cd9b87445000a type:create cxid:0x2 zxid:0x8e txntype:-1 reqpath:n/a Error Path:/solr/overseer Error:KeeperErrorCode = NodeExists for /solr/overseer
[junit4:junit4]   2> 10089 T3427 oascc.ZkStateReader.createClusterStateWatchersAndUpdate Updating cluster state from ZooKeeper... 
[junit4:junit4]   2> 10093 T3427 oasc.ZkController.createEphemeralLiveNode Register node as live in ZooKeeper:/live_nodes/127.0.0.1:52032_
[junit4:junit4]   2> 10094 T3432 oazs.PrepRequestProcessor.pRequest Got user-level KeeperException when processing sessionid:0x13cd9b87445000a type:delete cxid:0x9 zxid:0x8f txntype:-1 reqpath:n/a Error Path:/solr/live_nodes/127.0.0.1:52032_ Error:KeeperErrorCode = NoNode for /solr/live_nodes/127.0.0.1:52032_
[junit4:junit4]   2> 10095 T3427 oascc.SolrZkClient.makePath makePath: /live_nodes/127.0.0.1:52032_
[junit4:junit4]   2> 10099 T3468 oascc.ZkStateReader$2.process A cluster state change: WatchedEvent state:SyncConnected type:NodeChildrenChanged path:/live_nodes, has occurred - updating... (live nodes size: 3)
[junit4:junit4]   2> 10099 T3449 oascc.ZkStateReader$2.process A cluster state change: WatchedEvent state:SyncConnected type:NodeChildrenChanged path:/live_nodes, has occurred - updating... (live nodes size: 3)
[junit4:junit4]   2> 10101 T3455 oascc.ZkStateReader$3.process Updating live nodes... (4)
[junit4:junit4]   2> 10101 T3455 oascc.ZkStateReader$2.process A cluster state change: WatchedEvent state:SyncConnected type:NodeChildrenChanged path:/live_nodes, has occurred - updating... (live nodes size: 4)
[junit4:junit4]   2> 10101 T3483 oascc.ZkStateReader$3.process Updating live nodes... (4)
[junit4:junit4]   2> 10101 T3483 oascc.ZkStateReader$2.process A cluster state change: WatchedEvent state:SyncConnected type:NodeChildrenChanged path:/live_nodes, has occurred - updating... (live nodes size: 4)
[junit4:junit4]   2> 10101 T3498 oascc.ZkStateReader$3.process Updating live nodes... (4)
[junit4:junit4]   2> 10104 T3449 oascc.ZkStateReader$3.process Updating live nodes... (4)
[junit4:junit4]   2> 10105 T3468 oascc.ZkStateReader$3.process Updating live nodes... (4)
[junit4:junit4]   2> 10113 T3499 oasc.CoreContainer.create Creating SolrCore 'collection1' using instanceDir: /Users/jenkins/jenkins-slave/workspace/Lucene-Solr-4.x-MacOSX/solr/build/solr-core/test/J0/./org.apache.solr.cloud.BasicDistributedZkTest-jetty3-1360862419549/collection1
[junit4:junit4]   2> 10113 T3499 oasc.ZkController.createCollectionZkNode Check for collection zkNode:collection1
[junit4:junit4]   2> 10114 T3499 oasc.ZkController.createCollectionZkNode Collection zkNode exists
[junit4:junit4]   2> 10114 T3499 oasc.ZkController.readConfigName Load collection config from:/collections/collection1
[junit4:junit4]   2> 10117 T3499 oasc.SolrResourceLoader.<init> new SolrResourceLoader for directory: '/Users/jenkins/jenkins-slave/workspace/Lucene-Solr-4.x-MacOSX/solr/build/solr-core/test/J0/./org.apache.solr.cloud.BasicDistributedZkTest-jetty3-1360862419549/collection1/'
[junit4:junit4]   2> 10117 T3499 oasc.SolrResourceLoader.replaceClassLoader Adding 'file:/Users/jenkins/jenkins-slave/workspace/Lucene-Solr-4.x-MacOSX/solr/build/solr-core/test/J0/org.apache.solr.cloud.BasicDistributedZkTest-jetty3-1360862419549/collection1/lib/classes/' to classloader
[junit4:junit4]   2> 10118 T3499 oasc.SolrResourceLoader.replaceClassLoader Adding 'file:/Users/jenkins/jenkins-slave/workspace/Lucene-Solr-4.x-MacOSX/solr/build/solr-core/test/J0/org.apache.solr.cloud.BasicDistributedZkTest-jetty3-1360862419549/collection1/lib/README' to classloader
[junit4:junit4]   2> 10168 T3499 oasc.SolrConfig.<init> Using Lucene MatchVersion: LUCENE_42
[junit4:junit4]   2> 10235 T3499 oasc.SolrConfig.<init> Loaded SolrConfig: solrconfig.xml
[junit4:junit4]   2> 10236 T3499 oass.IndexSchema.readSchema Reading Solr Schema
[junit4:junit4]   2> 10243 T3499 oass.IndexSchema.readSchema Schema name=test
[junit4:junit4]   2> 10821 T3499 oass.OpenExchangeRatesOrgProvider.init Initialized with rates=open-exchange-rates.json, refreshInterval=1440.
[junit4:junit4]   2> 10830 T3499 oass.IndexSchema.readSchema default search field in schema is text
[junit4:junit4]   2> 10834 T3499 oass.IndexSchema.readSchema unique key field: id
[junit4:junit4]   2> 10855 T3499 oass.FileExchangeRateProvider.reload Reloading exchange rates from file currency.xml
[junit4:junit4]   2> 10862 T3499 oass.FileExchangeRateProvider.reload Reloading exchange rates from file currency.xml
[junit4:junit4]   2> 10867 T3499 oass.OpenExchangeRatesOrgProvider.reload Reloading exchange rates from open-exchange-rates.json
[junit4:junit4]   2> 10870 T3499 oass.OpenExchangeRatesOrgProvider.reload Reloading exchange rates from open-exchange-rates.json
[junit4:junit4]   2> 10872 T3499 oasc.SolrCore.<init> [collection1] Opening new SolrCore at /Users/jenkins/jenkins-slave/workspace/Lucene-Solr-4.x-MacOSX/solr/build/solr-core/test/J0/./org.apache.solr.cloud.BasicDistributedZkTest-jetty3-1360862419549/collection1/, dataDir=./org.apache.solr.cloud.BasicDistributedZkTest-1360862409790/jetty3/
[junit4:junit4]   2> 10873 T3499 oasc.JmxMonitoredMap.<init> JMX monitoring is enabled. Adding Solr mbeans to JMX Server: com.sun.jmx.mbeanserver.JmxMBeanServer@3cafd472
[junit4:junit4]   2> 10874 T3499 oasc.SolrCore.initDirectoryFactory solr.NRTCachingDirectoryFactory
[junit4:junit4]   2> 10875 T3499 oasc.CachingDirectoryFactory.get return new directory for /Users/jenkins/jenkins-slave/workspace/Lucene-Solr-4.x-MacOSX/solr/build/solr-core/test/J0/./org.apache.solr.cloud.BasicDistributedZkTest-1360862409790/jetty3 forceNew:false
[junit4:junit4]   2> 10876 T3499 oasc.CachingDirectoryFactory.close Releasing directory:/Users/jenkins/jenkins-slave/workspace/Lucene-Solr-4.x-MacOSX/solr/build/solr-core/test/J0/./org.apache.solr.cloud.BasicDistributedZkTest-1360862409790/jetty3
[junit4:junit4]   2> 10876 T3499 oasc.SolrCore.getNewIndexDir New index directory detected: old=null new=./org.apache.solr.cloud.BasicDistributedZkTest-1360862409790/jetty3/index/
[junit4:junit4]   2> 10877 T3499 oasc.SolrCore.initIndex WARNING [collection1] Solr index directory './org.apache.solr.cloud.BasicDistributedZkTest-1360862409790/jetty3/index' doesn't exist. Creating new index...
[junit4:junit4]   2> 10878 T3499 oasc.CachingDirectoryFactory.get return new directory for /Users/jenkins/jenkins-slave/workspace/Lucene-Solr-4.x-MacOSX/solr/build/solr-core/test/J0/./org.apache.solr.cloud.BasicDistributedZkTest-1360862409790/jetty3/index forceNew:false
[junit4:junit4]   2> 10884 T3499 oasc.SolrDeletionPolicy.onCommit SolrDeletionPolicy.onCommit: commits:num=1
[junit4:junit4]   2> 		commit{dir=RateLimitedDirectoryWrapper(NRTCachingDirectory(org.apache.lucene.store.NIOFSDirectory@/Users/jenkins/jenkins-slave/workspace/Lucene-Solr-4.x-MacOSX/solr/build/solr-core/test/J0/org.apache.solr.cloud.BasicDistributedZkTest-1360862409790/jetty3/index lockFactory=org.apache.lucene.store.NativeFSLockFactory@664cbf46; maxCacheMB=48.0 maxMergeSizeMB=4.0)),segFN=segments_1,generation=1,filenames=[segments_1]
[junit4:junit4]   2> 10885 T3499 oasc.SolrDeletionPolicy.updateCommits newest commit = 1[segments_1]
[junit4:junit4]   2> 10886 T3499 oasc.CachingDirectoryFactory.close Releasing directory:/Users/jenkins/jenkins-slave/workspace/Lucene-Solr-4.x-MacOSX/solr/build/solr-core/test/J0/./org.apache.solr.cloud.BasicDistributedZkTest-1360862409790/jetty3/index
[junit4:junit4]   2> 10887 T3499 oasc.SolrCore.initWriters created xml: solr.XMLResponseWriter
[junit4:junit4]   2> 10890 T3499 oasup.UpdateRequestProcessorChain.init inserting DistributedUpdateProcessorFactory into updateRequestProcessorChain "dedupe"
[junit4:junit4]   2> 10891 T3499 oasup.UpdateRequestProcessorChain.init inserting DistributedUpdateProcessorFactory into updateRequestProcessorChain "dedupe-allfields"
[junit4:junit4]   2> 10891 T3499 oasup.UpdateRequestProcessorChain.init inserting DistributedUpdateProcessorFactory into updateRequestProcessorChain "stored_sig"
[junit4:junit4]   2> 10891 T3499 oasup.UpdateRequestProcessorChain.init inserting DistributedUpdateProcessorFactory into updateRequestProcessorChain "uniq-fields"
[junit4:junit4]   2> 10892 T3499 oasup.UpdateRequestProcessorChain.init inserting DistributedUpdateProcessorFactory into updateRequestProcessorChain "distrib-dup-test-chain-implicit"
[junit4:junit4]   2> 10892 T3499 oasc.RequestHandlers.initHandlersFromConfig adding lazy requestHandler: solr.ReplicationHandler
[junit4:junit4]   2> 10893 T3499 oasc.RequestHandlers.initHandlersFromConfig created /replication: solr.ReplicationHandler
[junit4:junit4]   2> 10893 T3499 oasc.RequestHandlers.initHandlersFromConfig created standard: solr.StandardRequestHandler
[junit4:junit4]   2> 10894 T3499 oasc.RequestHandlers.initHandlersFromConfig created /get: solr.RealTimeGetHandler
[junit4:junit4]   2> 10895 T3499 oasc.RequestHandlers.initHandlersFromConfig created dismax: solr.SearchHandler
[junit4:junit4]   2> 10895 T3499 oasc.RequestHandlers.initHandlersFromConfig created mock: org.apache.solr.core.MockQuerySenderListenerReqHandler
[junit4:junit4]   2> 10896 T3499 oasc.RequestHandlers.initHandlersFromConfig created /admin/: org.apache.solr.handler.admin.AdminHandlers
[junit4:junit4]   2> 10896 T3499 oasc.RequestHandlers.initHandlersFromConfig created defaults: solr.StandardRequestHandler
[junit4:junit4]   2> 10897 T3499 oasc.RequestHandlers.initHandlersFromConfig adding lazy requestHandler: solr.StandardRequestHandler
[junit4:junit4]   2> 10897 T3499 oasc.RequestHandlers.initHandlersFromConfig created lazy: solr.StandardRequestHandler
[junit4:junit4]   2> 10898 T3499 oasc.RequestHandlers.initHandlersFromConfig created /update: solr.UpdateRequestHandler
[junit4:junit4]   2> 10898 T3499 oasc.RequestHandlers.initHandlersFromConfig created /terms: org.apache.solr.handler.component.SearchHandler
[junit4:junit4]   2> 10899 T3499 oasc.RequestHandlers.initHandlersFromConfig created spellCheckCompRH: org.apache.solr.handler.component.SearchHandler
[junit4:junit4]   2> 10900 T3499 oasc.RequestHandlers.initHandlersFromConfig created spellCheckCompRH_Direct: org.apache.solr.handler.component.SearchHandler
[junit4:junit4]   2> 10901 T3499 oasc.RequestHandlers.initHandlersFromConfig created spellCheckWithWordbreak: org.apache.solr.handler.component.SearchHandler
[junit4:junit4]   2> 10901 T3499 oasc.RequestHandlers.initHandlersFromConfig created spellCheckWithWordbreak_Direct: org.apache.solr.handler.component.SearchHandler
[junit4:junit4]   2> 10902 T3499 oasc.RequestHandlers.initHandlersFromConfig created spellCheckCompRH1: org.apache.solr.handler.component.SearchHandler
[junit4:junit4]   2> 10903 T3499 oasc.RequestHandlers.initHandlersFromConfig created mltrh: org.apache.solr.handler.component.SearchHandler
[junit4:junit4]   2> 10903 T3499 oasc.RequestHandlers.initHandlersFromConfig created tvrh: org.apache.solr.handler.component.SearchHandler
[junit4:junit4]   2> 10904 T3499 oasc.RequestHandlers.initHandlersFromConfig created /mlt: solr.MoreLikeThisHandler
[junit4:junit4]   2> 10904 T3499 oasc.RequestHandlers.initHandlersFromConfig created /debug/dump: solr.DumpRequestHandler
[junit4:junit4]   2> 10910 T3499 oashl.XMLLoader.init xsltCacheLifetimeSeconds=60
[junit4:junit4]   2> 10913 T3499 oasc.SolrCore.initDeprecatedSupport WARNING solrconfig.xml uses deprecated <admin/gettableFiles>, Please update your config to use the ShowFileRequestHandler.
[junit4:junit4]   2> 10915 T3499 oasc.SolrCore.initDeprecatedSupport WARNING adding ShowFileRequestHandler with hidden files: [SCHEMA.XML, OLD_SYNONYMS.TXT, STOPWORDS.TXT, PROTWORDS.TXT, OPEN-EXCHANGE-RATES.JSON, SYNONYMS.TXT, CURRENCY.XML, MAPPING-ISOLATIN1ACCENT.TXT]
[junit4:junit4]   2> 10918 T3499 oasc.CachingDirectoryFactory.close Releasing directory:/Users/jenkins/jenkins-slave/workspace/Lucene-Solr-4.x-MacOSX/solr/build/solr-core/test/J0/./org.apache.solr.cloud.BasicDistributedZkTest-1360862409790/jetty3
[junit4:junit4]   2> 10920 T3499 oass.SolrIndexSearcher.<init> Opening Searcher@2abcaa3f main
[junit4:junit4]   2> 10921 T3499 oasu.CommitTracker.<init> Hard AutoCommit: disabled
[junit4:junit4]   2> 10922 T3499 oasu.CommitTracker.<init> Soft AutoCommit: disabled
[junit4:junit4]   2> 10923 T3499 oashc.SpellCheckComponent.inform Initializing spell checkers
[junit4:junit4]   2> 10930 T3499 oass.DirectSolrSpellChecker.init init: {name=direct,classname=DirectSolrSpellChecker,field=lowerfilt,minQueryLength=3}
[junit4:junit4]   2> 10966 T3500 oasc.SolrCore.registerSearcher [collection1] Registered new searcher Searcher@2abcaa3f main{StandardDirectoryReader(segments_1:1)}
[junit4:junit4]   2> 10974 T3499 oasc.ZkController.publish publishing core=collection1 state=down
[junit4:junit4]   2> 10974 T3499 oasc.ZkController.publish numShards not found on descriptor - reading it from system property
[junit4:junit4]   2> 11221 T3450 oascc.ZkStateReader.updateClusterState Updating cloud state from ZooKeeper... 
[junit4:junit4]   2> 11223 T3450 oasc.Overseer$ClusterStateUpdater.updateState Update state numShards=2 message={
[junit4:junit4]   2> 	  "operation":"state",
[junit4:junit4]   2> 	  "numShards":"2",
[junit4:junit4]   2> 	  "shard":"shard2",
[junit4:junit4]   2> 	  "roles":null,
[junit4:junit4]   2> 	  "state":"active",
[junit4:junit4]   2> 	  "core":"collection1",
[junit4:junit4]   2> 	  "collection":"collection1",
[junit4:junit4]   2> 	  "node_name":"127.0.0.1:52029_",
[junit4:junit4]   2> 	  "base_url":"http://127.0.0.1:52029"}
[junit4:junit4]   2> 11229 T3450 oasc.Overseer$ClusterStateUpdater.updateState Update state numShards=2 message={
[junit4:junit4]   2> 	  "operation":"state",
[junit4:junit4]   2> 	  "numShards":"2",
[junit4:junit4]   2> 	  "shard":null,
[junit4:junit4]   2> 	  "roles":null,
[junit4:junit4]   2> 	  "state":"down",
[junit4:junit4]   2> 	  "core":"collection1",
[junit4:junit4]   2> 	  "collection":"collection1",
[junit4:junit4]   2> 	  "node_name":"127.0.0.1:52032_",
[junit4:junit4]   2> 	  "base_url":"http://127.0.0.1:52032"}
[junit4:junit4]   2> 11229 T3450 oasc.Overseer$ClusterStateUpdater.updateState Collection already exists with numShards=2
[junit4:junit4]   2> 11230 T3450 oasc.Overseer$ClusterStateUpdater.updateState Assigning new node to shard shard=shard1
[junit4:junit4]   2> 11252 T3449 oascc.ZkStateReader$2.process A cluster state change: WatchedEvent state:SyncConnected type:NodeDataChanged path:/clusterstate.json, has occurred - updating... (live nodes size: 4)
[junit4:junit4]   2> 11252 T3468 oascc.ZkStateReader$2.process A cluster state change: WatchedEvent state:SyncConnected type:NodeDataChanged path:/clusterstate.json, has occurred - updating... (live nodes size: 4)
[junit4:junit4]   2> 11252 T3483 oascc.ZkStateReader$2.process A cluster state change: WatchedEvent state:SyncConnected type:NodeDataChanged path:/clusterstate.json, has occurred - updating... (live nodes size: 4)
[junit4:junit4]   2> 11252 T3455 oascc.ZkStateReader$2.process A cluster state change: WatchedEvent state:SyncConnected type:NodeDataChanged path:/clusterstate.json, has occurred - updating... (live nodes size: 4)
[junit4:junit4]   2> 11252 T3498 oascc.ZkStateReader$2.process A cluster state change: WatchedEvent state:SyncConnected type:NodeDataChanged path:/clusterstate.json, has occurred - updating... (live nodes size: 4)
[junit4:junit4]   2> 11977 T3499 oasc.CoreContainer.registerCore registering core: collection1
[junit4:junit4]   2> 11978 T3499 oasc.ZkController.register Register replica - core:collection1 address:http://127.0.0.1:52032 collection:collection1 shard:shard1
[junit4:junit4]   2> 11982 T3499 oasc.ZkController.register We are http://127.0.0.1:52032/collection1/ and leader is http://127.0.0.1:52026/collection1/
[junit4:junit4]   2> 11983 T3499 oasc.ZkController.register No LogReplay needed for core=collection1 baseURL=http://127.0.0.1:52032
[junit4:junit4]   2> 11983 T3499 oasc.ZkController.checkRecovery Core needs to recover:collection1
[junit4:junit4]   2> 11983 T3499 oasu.DefaultSolrCoreState.doRecovery Running recovery - first canceling any ongoing recovery
[junit4:junit4]   2> ASYNC  NEW_CORE C193 name=collection1 org.apache.solr.core.SolrCore@1efb010 url=http://127.0.0.1:52032/collection1 node=127.0.0.1:52032_ C193_STATE=coll:collection1 core:collection1 props:{shard=null, roles=null, state=down, core=collection1, collection=collection1, node_name=127.0.0.1:52032_, base_url=http://127.0.0.1:52032}
[junit4:junit4]   2> 11984 T3501 C193 P52032 oasc.RecoveryStrategy.run Starting recovery process.  core=collection1 recoveringAfterStartup=true
[junit4:junit4]   2> 11984 T3499 oascc.ZkStateReader.updateClusterState Updating cloud state from ZooKeeper... 
[junit4:junit4]   2> 11985 T3501 C193 P52032 oasc.RecoveryStrategy.doRecovery ###### startupVersions=[]
[junit4:junit4]   2> 11985 T3501 C193 P52032 oasc.ZkController.publish publishing core=collection1 state=recovering
[junit4:junit4]   2> 11985 T3501 C193 P52032 oasc.ZkController.publish numShards not found on descriptor - reading it from system property
[junit4:junit4]   2> 11985 T3427 oass.SolrDispatchFilter.init user.dir=/Users/jenkins/jenkins-slave/workspace/Lucene-Solr-4.x-MacOSX/solr/build/solr-core/test/J0
[junit4:junit4]   2> 11986 T3427 oass.SolrDispatchFilter.init SolrDispatchFilter.init() done
[junit4:junit4]   2> 11987 T3501 C193 P52032 oascsi.HttpClientUtil.createClient Creating new http client, config:maxConnections=128&maxConnectionsPerHost=32&followRedirects=false
[junit4:junit4]   2> 11987 T3427 oascsi.HttpClientUtil.createClient Creating new http client, config:maxConnections=128&maxConnectionsPerHost=32&followRedirects=false
[junit4:junit4]   2> 12218 T3427 oejs.Server.doStart jetty-8.1.8.v20121106
[junit4:junit4]   2> 12223 T3427 oejs.AbstractConnector.doStart Started SelectChannelConnector@127.0.0.1:52036
[junit4:junit4]   2> 12224 T3427 oass.SolrDispatchFilter.init SolrDispatchFilter.init()
[junit4:junit4]   2> 12225 T3427 oasc.SolrResourceLoader.locateSolrHome JNDI not configured for solr (NoInitialContextEx)
[junit4:junit4]   2> 12225 T3427 oasc.SolrResourceLoader.locateSolrHome using system property solr.solr.home: /Users/jenkins/jenkins-slave/workspace/Lucene-Solr-4.x-MacOSX/solr/build/solr-core/test/J0/./org.apache.solr.cloud.BasicDistributedZkTest-jetty4-1360862421789
[junit4:junit4]   2> 12226 T3427 oasc.CoreContainer$Initializer.initialize looking for solr.xml: /Users/jenkins/jenkins-slave/workspace/Lucene-Solr-4.x-MacOSX/solr/build/solr-core/test/J0/./org.apache.solr.cloud.BasicDistributedZkTest-jetty4-1360862421789/solr.xml
[junit4:junit4]   2> 12226 T3427 oasc.CoreContainer.<init> New CoreContainer 2136260210
[junit4:junit4]   2> 12227 T3427 oasc.CoreContainer.load Loading CoreContainer using Solr Home: '/Users/jenkins/jenkins-slave/workspace/Lucene-Solr-4.x-MacOSX/solr/build/solr-core/test/J0/./org.apache.solr.cloud.BasicDistributedZkTest-jetty4-1360862421789/'
[junit4:junit4]   2> 12227 T3427 oasc.SolrResourceLoader.<init> new SolrResourceLoader for directory: '/Users/jenkins/jenkins-slave/workspace/Lucene-Solr-4.x-MacOSX/solr/build/solr-core/test/J0/./org.apache.solr.cloud.BasicDistributedZkTest-jetty4-1360862421789/'
[junit4:junit4]   2> 12266 T3427 oashc.HttpShardHandlerFactory.getParameter Setting socketTimeout to: 60000
[junit4:junit4]   2> 12266 T3427 oashc.HttpShardHandlerFactory.getParameter Setting urlScheme to: http://
[junit4:junit4]   2> 12267 T3427 oashc.HttpShardHandlerFactory.getParameter Setting connTimeout to: 15000
[junit4:junit4]   2> 12268 T3427 oashc.HttpShardHandlerFactory.getParameter Setting maxConnectionsPerHost to: 20
[junit4:junit4]   2> 12269 T3427 oashc.HttpShardHandlerFactory.getParameter Setting corePoolSize to: 0
[junit4:junit4]   2> 12269 T3427 oashc.HttpShardHandlerFactory.getParameter Setting maximumPoolSize to: 2147483647
[junit4:junit4]   2> 12270 T3427 oashc.HttpShardHandlerFactory.getParameter Setting maxThreadIdleTime to: 5
[junit4:junit4]   2> 12271 T3427 oashc.HttpShardHandlerFactory.getParameter Setting sizeOfQueue to: -1
[junit4:junit4]   2> 12271 T3427 oashc.HttpShardHandlerFactory.getParameter Setting fairnessPolicy to: false
[junit4:junit4]   2> 12272 T3427 oascsi.HttpClientUtil.createClient Creating new http client, config:maxConnectionsPerHost=20&maxConnections=10000&socketTimeout=60000&connTimeout=15000&retry=false
[junit4:junit4]   2> 12286 T3427 oasc.CoreContainer.load Registering Log Listener
[junit4:junit4]   2> 12304 T3427 oasc.CoreContainer.initZooKeeper Zookeeper client=127.0.0.1:52019/solr
[junit4:junit4]   2> 12306 T3427 oasc.ZkController.checkChrootPath zkHost includes chroot
[junit4:junit4]   2> 12307 T3427 oaz.ZooKeeper.<init> Initiating client connection, connectString=127.0.0.1:52019 sessionTimeout=60000 watcher=org.apache.solr.common.cloud.ConnectionManager@722e8722
[junit4:junit4]   2> 12308 T3427 oascc.ConnectionManager.waitForConnected Waiting for client to connect to ZooKeeper
[junit4:junit4]   2> 12309 T3511 oaz.ClientCnxn$SendThread.logStartConnect Opening socket connection to server localhost/127.0.0.1:52019. Will not attempt to authenticate using SASL (access denied ("javax.security.auth.AuthPermission" "getLoginConfiguration"))
[junit4:junit4]   2> 12309 T3511 oaz.ClientCnxn$SendThread.primeConnection Socket connection established to localhost/127.0.0.1:52019, initiating session
[junit4:junit4]   2> 12310 T3429 oazs.NIOServerCnxnFactory.run Accepted socket connection from /127.0.0.1:52037
[junit4:junit4]   2> 12311 T3429 oazs.ZooKeeperServer.processConnectRequest Client attempting to establish new session at /127.0.0.1:52037
[junit4:junit4]   2> 12312 T3431 oazs.ZooKeeperServer.finishSessionInit Established session 0x13cd9b87445000b with negotiated timeout 20000 for client /127.0.0.1:52037
[junit4:junit4]   2> 12312 T3511 oaz.ClientCnxn$SendThread.onConnected Session establishment complete on server localhost/127.0.0.1:52019, sessionid = 0x13cd9b87445000b, negotiated timeout = 20000
[junit4:junit4]   2> 12313 T3512 oascc.ConnectionManager.process Watcher org.apache.solr.common.cloud.ConnectionManager@722e8722 name:ZooKeeperConnection Watcher:127.0.0.1:52019 got event WatchedEvent state:SyncConnected type:None path:null path:null type:None
[junit4:junit4]   2> 12313 T3427 oascc.ConnectionManager.waitForConnected Client is connected to ZooKeeper
[junit4:junit4]   2> 12316 T3432 oazs.PrepRequestProcessor.pRequest2Txn Processed session termination for sessionid: 0x13cd9b87445000b
[junit4:junit4]   2> 12317 T3429 oazs.NIOServerCnxn.closeSock Closed socket connection for client /127.0.0.1:52037 which had sessionid 0x13cd9b87445000b
[junit4:junit4]   2> 12317 T3427 oaz.ZooKeeper.close Session: 0x13cd9b87445000b closed
[junit4:junit4]   2> 12317 T3512 oaz.ClientCnxn$EventThread.run EventThread shut down
[junit4:junit4]   2> 12318 T3427 oascsi.HttpClientUtil.createClient Creating new http client, config:maxConnections=500&maxConnectionsPerHost=16&socketTimeout=60000&connTimeout=15000
[junit4:junit4]   2> 12324 T3427 oaz.ZooKeeper.<init> Initiating client connection, connectString=127.0.0.1:52019/solr sessionTimeout=30000 watcher=org.apache.solr.common.cloud.ConnectionManager@5c9cbe4f
[junit4:junit4]   2> 12325 T3427 oascc.ConnectionManager.waitForConnected Waiting for client to connect to ZooKeeper
[junit4:junit4]   2> 12326 T3513 oaz.ClientCnxn$SendThread.logStartConnect Opening socket connection to server localhost/127.0.0.1:52019. Will not attempt to authenticate using SASL (access denied ("javax.security.auth.AuthPermission" "getLoginConfiguration"))
[junit4:junit4]   2> 12327 T3513 oaz.ClientCnxn$SendThread.primeConnection Socket connection established to localhost/127.0.0.1:52019, initiating session
[junit4:junit4]   2> 12327 T3429 oazs.NIOServerCnxnFactory.run Accepted socket connection from /127.0.0.1:52038
[junit4:junit4]   2> 12328 T3429 oazs.ZooKeeperServer.processConnectRequest Client attempting to establish new session at /127.0.0.1:52038
[junit4:junit4]   2> 12329 T3431 oazs.ZooKeeperServer.finishSessionInit Established session 0x13cd9b87445000c with negotiated timeout 20000 for client /127.0.0.1:52038
[junit4:junit4]   2> 12329 T3513 oaz.ClientCnxn$SendThread.onConnected Session establishment complete on server localhost/127.0.0.1:52019, sessionid = 0x13cd9b87445000c, negotiated timeout = 20000
[junit4:junit4]   2> 12330 T3514 oascc.ConnectionManager.process Watcher org.apache.solr.common.cloud.ConnectionManager@5c9cbe4f name:ZooKeeperConnection Watcher:127.0.0.1:52019/solr got event WatchedEvent state:SyncConnected type:None path:null path:null type:None
[junit4:junit4]   2> 12330 T3427 oascc.ConnectionManager.waitForConnected Client is connected to ZooKeeper
[junit4:junit4]   2> 12331 T3432 oazs.PrepRequestProcessor.pRequest Got user-level KeeperException when processing sessionid:0x13cd9b87445000c type:create cxid:0x1 zxid:0x9f txntype:-1 reqpath:n/a Error Path:/solr/overseer Error:KeeperErrorCode = NodeExists for /solr/overseer
[junit4:junit4]   2> 12333 T3432 oazs.PrepRequestProcessor.pRequest Got user-level KeeperException when processing sessionid:0x13cd9b87445000c type:create cxid:0x2 zxid:0xa0 txntype:-1 reqpath:n/a Error Path:/solr/overseer Error:KeeperErrorCode = NodeExists for /solr/overseer
[junit4:junit4]   2> 12336 T3427 oascc.ZkStateReader.createClusterStateWatchersAndUpdate Updating cluster state from ZooKeeper... 
[junit4:junit4]   2> 12340 T3427 oasc.ZkController.createEphemeralLiveNode Register node as live in ZooKeeper:/live_nodes/127.0.0.1:52036_
[junit4:junit4]   2> 12341 T3432 oazs.PrepRequestProcessor.pRequest Got user-level KeeperException when processing sessionid:0x13cd9b87445000c type:delete cxid:0x9 zxid:0xa1 txntype:-1 reqpath:n/a Error Path:/solr/live_nodes/127.0.0.1:52036_ Error:KeeperErrorCode = NoNode for /solr/live_nodes/127.0.0.1:52036_
[junit4:junit4]   2> 12342 T3427 oascc.SolrZkClient.makePath makePath: /live_nodes/127.0.0.1:52036_
[junit4:junit4]   2> 12346 T3449 oascc.ZkStateReader$2.process A cluster state change: WatchedEvent state:SyncConnected type:NodeChildrenChanged path:/live_nodes, has occurred - updating... (live nodes size: 4)
[junit4:junit4]   2> 12347 T3498 oascc.ZkStateReader$2.process A cluster state change: WatchedEvent state:SyncConnected type:NodeChildrenChanged path:/live_nodes, has occurred - updating... (live nodes size: 4)
[junit4:junit4]   2> 12347 T3468 oascc.ZkStateReader$2.process A cluster state change: WatchedEvent state:SyncConnected type:NodeChildrenChanged path:/live_nodes, has occurred - updating... (live nodes size: 4)
[junit4:junit4]   2> 12348 T3455 oascc.ZkStateReader$3.process Updating live nodes... (5)
[junit4:junit4]   2> 12349 T3455 oascc.ZkStateReader$2.process A cluster state change: WatchedEvent state:SyncConnected type:NodeChildrenChanged path:/live_nodes, has occurred - updating... (live nodes size: 5)
[junit4:junit4]   2> 12349 T3483 oascc.ZkStateReader$3.process Updating live nodes... (5)
[junit4:junit4]   2> 12350 T3483 oascc.ZkStateReader$2.process A cluster state change: WatchedEvent state:SyncConnected type:NodeChildrenChanged path:/live_nodes, has occurred - updating... (live nodes size: 5)
[junit4:junit4]   2> 12350 T3514 oascc.ZkStateReader$3.process Updating live nodes... (5)
[junit4:junit4]   2> 12355 T3449 oascc.ZkStateReader$3.process Updating live nodes... (5)
[junit4:junit4]   2> 12355 T3498 oascc.ZkStateReader$3.process Updating live nodes... (5)
[junit4:junit4]   2> 12356 T3468 oascc.ZkStateReader$3.process Updating live nodes... (5)
[junit4:junit4]   2> 12363 T3515 oasc.CoreContainer.create Creating SolrCore 'collection1' using instanceDir: /Users/jenkins/jenkins-slave/workspace/Lucene-Solr-4.x-MacOSX/solr/build/solr-core/test/J0/./org.apache.solr.cloud.BasicDistributedZkTest-jetty4-1360862421789/collection1
[junit4:junit4]   2> 12364 T3515 oasc.ZkController.createCollectionZkNode Check for collection zkNode:collection1
[junit4:junit4]   2> 12365 T3515 oasc.ZkController.createCollectionZkNode Collection zkNode exists
[junit4:junit4]   2> 12365 T3515 oasc.ZkController.readConfigName Load collection config from:/collections/collection1
[junit4:junit4]   2> 12367 T3515 oasc.SolrResourceLoader.<init> new SolrResourceLoader for directory: '/Users/jenkins/jenkins-slave/workspace/Lucene-Solr-4.x-MacOSX/solr/build/solr-core/test/J0/./org.apache.solr.cloud.BasicDistributedZkTest-jetty4-1360862421789/collection1/'
[junit4:junit4]   2> 12368 T3515 oasc.SolrResourceLoader.replaceClassLoader Adding 'file:/Users/jenkins/jenkins-slave/workspace/Lucene-Solr-4.x-MacOSX/solr/build/solr-core/test/J0/org.apache.solr.cloud.BasicDistributedZkTest-jetty4-1360862421789/collection1/lib/classes/' to classloader
[junit4:junit4]   2> 12368 T3515 oasc.SolrResourceLoader.replaceClassLoader Adding 'file:/Users/jenkins/jenkins-slave/workspace/Lucene-Solr-4.x-MacOSX/solr/build/solr-core/test/J0/org.apache.solr.cloud.BasicDistributedZkTest-jetty4-1360862421789/collection1/lib/README' to classloader
[junit4:junit4]   2> 12420 T3515 oasc.SolrConfig.<init> Using Lucene MatchVersion: LUCENE_42
[junit4:junit4]   2> 12487 T3515 oasc.SolrConfig.<init> Loaded SolrConfig: solrconfig.xml
[junit4:junit4]   2> 12489 T3515 oass.IndexSchema.readSchema Reading Solr Schema
[junit4:junit4]   2> 12495 T3515 oass.IndexSchema.readSchema Schema name=test
[junit4:junit4]   2> 12764 T3450 oascc.ZkStateReader.updateClusterState Updating cloud state from ZooKeeper... 
[junit4:junit4]   2> 12765 T3450 oasc.Overseer$ClusterStateUpdater.updateState Update state numShards=2 message={
[junit4:junit4]   2> 	  "operation":"state",
[junit4:junit4]   2> 	  "numShards":"2",
[junit4:junit4]   2> 	  "shard":"shard1",
[junit4:junit4]   2> 	  "roles":null,
[junit4:junit4]   2> 	  "state":"recovering",
[junit4:junit4]   2> 	  "core":"collection1",
[junit4:junit4]   2> 	  "collection":"collection1",
[junit4:junit4]   2> 	  "node_name":"127.0.0.1:52032_",
[junit4:junit4]   2> 	  "base_url":"http://127.0.0.1:52032"}
[junit4:junit4]   2> 12770 T3514 oascc.ZkStateReader$2.process A cluster state change: WatchedEvent state:SyncConnected type:NodeDataChanged path:/clusterstate.json, has occurred - updating... (live nodes size: 5)
[junit4:junit4]   2> 12770 T3498 oascc.ZkStateReader$2.process A cluster state change: WatchedEvent state:SyncConnected type:NodeDataChanged path:/clusterstate.json, has occurred - updating... (live nodes size: 5)
[junit4:junit4]   2> 12771 T3483 oascc.ZkStateReader$2.process A cluster state change: WatchedEvent state:SyncConnected type:NodeDataChanged path:/clusterstate.json, has occurred - updating... (live nodes size: 5)
[junit4:junit4]   2> 12771 T3468 oascc.ZkStateReader$2.process A cluster state change: WatchedEvent state:SyncConnected type:NodeDataChanged path:/clusterstate.json, has occurred - updating... (live nodes size: 5)
[junit4:junit4]   2> 12771 T3455 oascc.ZkStateReader$2.process A cluster state change: WatchedEvent state:SyncConnected type:NodeDataChanged path:/clusterstate.json, has occurred - updating... (live nodes size: 5)
[junit4:junit4]   2> 12771 T3449 oascc.ZkStateReader$2.process A cluster state change: WatchedEvent state:SyncConnected type:NodeDataChanged path:/clusterstate.json, has occurred - updating... (live nodes size: 5)
[junit4:junit4]   2> 13051 T3515 oass.OpenExchangeRatesOrgProvider.init Initialized with rates=open-exchange-rates.json, refreshInterval=1440.
[junit4:junit4]   2> 13059 T3515 oass.IndexSchema.readSchema default search field in schema is text
[junit4:junit4]   2> 13062 T3515 oass.IndexSchema.readSchema unique key field: id
[junit4:junit4]   2> 13085 T3515 oass.FileExchangeRateProvider.reload Reloading exchange rates from file currency.xml
[junit4:junit4]   2> 13093 T3515 oass.FileExchangeRateProvider.reload Reloading exchange rates from file currency.xml
[junit4:junit4]   2> 13099 T3515 oass.OpenExchangeRatesOrgProvider.reload Reloading exchange rates from open-exchange-rates.json
[junit4:junit4]   2> 13101 T3515 oass.OpenExchangeRatesOrgProvider.reload Reloading exchange rates from open-exchange-rates.json
[junit4:junit4]   2> 13102 T3515 oasc.SolrCore.<init> [collection1] Opening new SolrCore at /Users/jenkins/jenkins-slave/workspace/Lucene-Solr-4.x-MacOSX/solr/build/solr-core/test/J0/./org.apache.solr.cloud.BasicDistributedZkTest-jetty4-1360862421789/collection1/, dataDir=./org.apache.solr.cloud.BasicDistributedZkTest-1360862409790/jetty4/
[junit4:junit4]   2> 13103 T3515 oasc.JmxMonitoredMap.<init> JMX monitoring is enabled. Adding Solr mbeans to JMX Server: com.sun.jmx.mbeanserver.JmxMBeanServer@3cafd472
[junit4:junit4]   2> 13103 T3515 oasc.SolrCore.initDirectoryFactory solr.NRTCachingDirectoryFactory
[junit4:junit4]   2> 13104 T3515 oasc.CachingDirectoryFactory.get return new directory for /Users/jenkins/jenkins-slave/workspace/Lucene-Solr-4.x-MacOSX/solr/build/solr-core/test/J0/./org.apache.solr.cloud.BasicDistributedZkTest-1360862409790/jetty4 forceNew:false
[junit4:junit4]   2> 13105 T3515 oasc.CachingDirectoryFactory.close Releasing directory:/Users/jenkins/jenkins-slave/workspace/Lucene-Solr-4.x-MacOSX/solr/build/solr-core/test/J0/./org.apache.solr.cloud.BasicDistributedZkTest-1360862409790/jetty4
[junit4:junit4]   2> 13106 T3515 oasc.SolrCore.getNewIndexDir New index directory detected: old=null new=./org.apache.solr.cloud.BasicDistributedZkTest-1360862409790/jetty4/index/
[junit4:junit4]   2> 13106 T3515 oasc.SolrCore.initIndex WARNING [collection1] Solr index directory './org.apache.solr.cloud.BasicDistributedZkTest-1360862409790/jetty4/index' doesn't exist. Creating new index...
[junit4:junit4]   2> 13107 T3515 oasc.CachingDirectoryFactory.get return new directory for /Users/jenkins/jenkins-slave/workspace/Lucene-Solr-4.x-MacOSX/solr/build/solr-core/test/J0/./org.apache.solr.cloud.BasicDistributedZkTest-1360862409790/jetty4/index forceNew:false
[junit4:junit4]   2> 13112 T3515 oasc.SolrDeletionPolicy.onCommit SolrDeletionPolicy.onCommit: commits:num=1
[junit4:junit4]   2> 		commit{dir=RateLimitedDirectoryWrapper(NRTCachingDirectory(org.apache.lucene.store.NIOFSDirectory@/Users/jenkins/jenkins-slave/workspace/Lucene-Solr-4.x-MacOSX/solr/build/solr-core/test/J0/org.apache.solr.cloud.BasicDistributedZkTest-1360862409790/jetty4/index lockFactory=org.apache.lucene.store.NativeFSLockFactory@71f4f512; maxCacheMB=48.0 maxMergeSizeMB=4.0)),segFN=segments_1,generation=1,filenames=[segments_1]
[junit4:junit4]   2> 13112 T3515 oasc.SolrDeletionPolicy.updateCommits newest commit = 1[segments_1]
[junit4:junit4]   2> 13113 T3515 oasc.CachingDirectoryFactory.close Releasing directory:/Users/jenkins/jenkins-slave/workspace/Lucene-Solr-4.x-MacOSX/solr/build/solr-core/test/J0/./org.apache.solr.cloud.BasicDistributedZkTest-1360862409790/jetty4/index
[junit4:junit4]   2> 13114 T3515 oasc.SolrCore.initWriters created xml: solr.XMLResponseWriter
[junit4:junit4]   2> 13116 T3515 oasup.UpdateRequestProcessorChain.init inserting DistributedUpdateProcessorFactory into updateRequestProcessorChain "dedupe"
[junit4:junit4]   2> 13117 T3515 oasup.UpdateRequestProcessorChain.init inserting DistributedUpdateProcessorFactory into updateRequestProcessorChain "dedupe-allfields"
[junit4:junit4]   2> 13118 T3515 oasup.UpdateRequestProcessorChain.init inserting DistributedUpdateProcessorFactory into updateRequestProcessorChain "stored_sig"
[junit4:junit4]   2> 13119 T3515 oasup.UpdateRequestProcessorChain.init inserting DistributedUpdateProcessorFactory into updateRequestProcessorChain "uniq-fields"
[junit4:junit4]   2> 13120 T3515 oasup.UpdateRequestProcessorChain.init inserting DistributedUpdateProcessorFactory into updateRequestProcessorChain "distrib-dup-test-chain-implicit"
[junit4:junit4]   2> 13120 T3515 oasc.RequestHandlers.initHandlersFromConfig adding lazy requestHandler: solr.ReplicationHandler
[junit4:junit4]   2> 13121 T3515 oasc.RequestHandlers.initHandlersFromConfig created /replication: solr.ReplicationHandler
[junit4:junit4]   2> 13122 T3515 oasc.RequestHandlers.initHandlersFromConfig created standard: solr.StandardRequestHandler
[junit4:junit4]   2> 13122 T3515 oasc.RequestHandlers.initHandlersFromConfig created /get: solr.RealTimeGetHandler
[junit4:junit4]   2> 13123 T3515 oasc.RequestHandlers.initHandlersFromConfig created dismax: solr.SearchHandler
[junit4:junit4]   2> 13124 T3515 oasc.RequestHandlers.initHandlersFromConfig created mock: org.apache.solr.core.MockQuerySenderListenerReqHandler
[junit4:junit4]   2> 13124 T3515 oasc.RequestHandlers.initHandlersFromConfig created /admin/: org.apache.solr.handler.admin.AdminHandlers
[junit4:junit4]   2> 13125 T3515 oasc.RequestHandlers.initHandlersFromConfig created defaults: solr.StandardRequestHandler
[junit4:junit4]   2> 13125 T3515 oasc.RequestHandlers.initHandlersFromConfig adding lazy requestHandler: solr.StandardRequestHandler
[junit4:junit4]   2> 13125 T3515 oasc.RequestHandlers.initHandlersFromConfig created lazy: solr.StandardRequestHandler
[junit4:junit4]   2> 13126 T3515 oasc.RequestHandlers.initHandlersFromConfig created /update: solr.UpdateRequestHandler
[junit4:junit4]   2> 13127 T3515 oasc.RequestHandlers.initHandlersFromConfig created /terms: org.apache.solr.handler.component.SearchHandler
[junit4:junit4]   2> 13127 T3515 oasc.RequestHandlers.initHandlersFromConfig created spellCheckCompRH: org.apache.solr.handler.component.SearchHandler
[junit4:junit4]   2> 13128 T3515 oasc.RequestHandlers.initHandlersFromConfig created spellCheckCompRH_Direct: org.apache.solr.handler.component.SearchHandler
[junit4:junit4]   2> 13129 T3515 oasc.RequestHandlers.initHandlersFromConfig created spellCheckWithWordbreak: org.apache.solr.handler.component.SearchHandler
[junit4:junit4]   2> 13129 T3515 oasc.RequestHandlers.initHandlersFromConfig created spellCheckWithWordbreak_Direct: org.apache.solr.handler.component.SearchHandler
[junit4:junit4]   2> 13130 T3515 oasc.RequestHandlers.initHandlersFromConfig created spellCheckCompRH1: org.apache.solr.handler.component.SearchHandler
[junit4:junit4]   2> 13131 T3515 oasc.RequestHandlers.initHandlersFromConfig created mltrh: org.apache.solr.handler.component.SearchHandler
[junit4:junit4]   2> 13132 T3515 oasc.RequestHandlers.initHandlersFromConfig created tvrh: org.apache.solr.handler.component.SearchHandler
[junit4:junit4]   2> 13133 T3515 oasc.RequestHandlers.initHandlersFromConfig created /mlt: solr.MoreLikeThisHandler
[junit4:junit4]   2> 13134 T3515 oasc.RequestHandlers.initHandlersFromConfig created /debug/dump: solr.DumpRequestHandler
[junit4:junit4]   2> 13143 T3515 oashl.XMLLoader.init xsltCacheLifetimeSeconds=60
[junit4:junit4]   2> 13163 T3515 oasc.SolrCore.initDeprecatedSupport WARNING solrconfig.xml uses deprecated <admin/gettableFiles>, Please update your config to use the ShowFileRequestHandler.
[junit4:junit4]   2> 13165 T3515 oasc.SolrCore.initDeprecatedSupport WARNING adding ShowFileRequestHandler with hidden files: [SCHEMA.XML, OLD_SYNONYMS.TXT, STOPWORDS.TXT, PROTWORDS.TXT, OPEN-EXCHANGE-RATES.JSON, SYNONYMS.TXT, CURRENCY.XML, MAPPING-ISOLATIN1ACCENT.TXT]
[junit4:junit4]   2> 13167 T3515 oasc.CachingDirectoryFactory.close Releasing directory:/Users/jenkins/jenkins-slave/workspace/Lucene-Solr-4.x-MacOSX/solr/build/solr-core/test/J0/./org.apache.solr.cloud.BasicDistributedZkTest-1360862409790/jetty4
[junit4:junit4]   2> 13169 T3515 oass.SolrIndexSearcher.<init> Opening Searcher@792ba709 main
[junit4:junit4]   2> 13170 T3515 oasu.CommitTracker.<init> Hard AutoCommit: disabled
[junit4:junit4]   2> 13170 T3515 oasu.CommitTracker.<init> Soft AutoCommit: disabled
[junit4:junit4]   2> 13171 T3515 oashc.SpellCheckComponent.inform Initializing spell checkers
[junit4:junit4]   2> 13176 T3515 oass.DirectSolrSpellChecker.init init: {name=direct,classname=DirectSolrSpellChecker,field=lowerfilt,minQueryLength=3}
[junit4:junit4]   2> 13212 T3516 oasc.SolrCore.registerSearcher [collection1] Registered new searcher Searcher@792ba709 main{StandardDirectoryReader(segments_1:1)}
[junit4:junit4]   2> 13219 T3515 oasc.ZkController.publish publishing core=collection1 state=down
[junit4:junit4]   2> 13219 T3515 oasc.ZkController.publish numShards not found on descriptor - reading it from system property
[junit4:junit4]   2> 14282 T3450 oascc.ZkStateReader.updateClusterState Updating cloud state from ZooKeeper... 
[junit4:junit4]   2> 14283 T3450 oasc.Overseer$ClusterStateUpdater.updateState Update state numShards=2 message={
[junit4:junit4]   2> 	  "operation":"state",
[junit4:junit4]   2> 	  "numShards":"2",
[junit4:junit4]   2> 	  "shard":null,
[junit4:junit4]   2> 	  "roles":null,
[junit4:junit4]   2> 	  "state":"down",
[junit4:junit4]   2> 	  "core":"collection1",
[junit4:junit4]   2> 	  "collection":"collection1",
[junit4:junit4]   2> 	  "node_name":"127.0.0.1:52036_",
[junit4:junit4]   2> 	  "base_url":"http://127.0.0.1:52036"}
[junit4:junit4]   2> 14283 T3450 oasc.Overseer$ClusterStateUpdater.updateState Collection already exists with numShards=2
[junit4:junit4]   2> 14284 T3450 oasc.Overseer$ClusterStateUpdater.updateState Assigning new node to shard shard=shard2
[junit4:junit4]   2> 14290 T3514 oascc.ZkStateReader$2.process A cluster state change: WatchedEvent state:SyncConnected type:NodeDataChanged path:/clusterstate.json, has occurred - updating... (live nodes size: 5)
[junit4:junit4]   2> 14290 T3468 oascc.ZkStateReader$2.process A cluster state change: WatchedEvent state:SyncConnected type:NodeDataChanged path:/clusterstate.json, has occurred - updating... (live nodes size: 5)
[junit4:junit4]   2> 14291 T3455 oascc.ZkStateReader$2.process A cluster state change: WatchedEvent state:SyncConnected type:NodeDataChanged path:/clusterstate.json, has occurred - updating... (live nodes size: 5)
[junit4:junit4]   2> 14291 T3483 oascc.ZkStateReader$2.process A cluster state change: WatchedEvent state:SyncConnected type:NodeDataChanged path:/clusterstate.json, has occurred - updating... (live nodes size: 5)
[junit4:junit4]   2> 14291 T3449 oascc.ZkStateReader$2.process A cluster state change: WatchedEvent state:SyncConnected type:NodeDataChanged path:/clusterstate.json, has occurred - updating... (live nodes size: 5)
[junit4:junit4]   2> 14291 T3498 oascc.ZkStateReader$2.process A cluster state change: WatchedEvent state:SyncConnected type:NodeDataChanged path:/clusterstate.json, has occurred - updating... (live nodes size: 5)
[junit4:junit4]   2>  C193_STATE=coll:collection1 core:collection1 props:{shard=shard1, roles=null, state=recovering, core=collection1, collection=collection1, node_name=127.0.0.1:52032_, base_url=http://127.0.0.1:52032}
[junit4:junit4]   2> 15011 T3501 C193 P52032 oasc.RecoveryStrategy.doRecovery Attempting to PeerSync from http://127.0.0.1:52026/collection1/ core=collection1 - recoveringAfterStartup=true
[junit4:junit4]   2> 15012 T3501 C193 P52032 oasu.PeerSync.sync PeerSync: core=collection1 url=http://127.0.0.1:52032 START replicas=[http://127.0.0.1:52026/collection1/] nUpdates=100
[junit4:junit4]   2> 15012 T3501 C193 P52032 oasu.PeerSync.sync WARNING no frame of reference to tell of we've missed updates
[junit4:junit4]   2> 15013 T3501 C193 P52032 oasc.RecoveryStrategy.doRecovery PeerSync Recovery was not successful - trying replication. core=collection1
[junit4:junit4]   2> 15013 T3501 C193 P52032 oasc.RecoveryStrategy.doRecovery Starting Replication Recovery. core=collection1
[junit4:junit4]   2> 15013 T3501 C193 P52032 oasc.RecoveryStrategy.doRecovery Begin buffering updates. core=collection1
[junit4:junit4]   2> 15013 T3501 C193 P52032 oasu.UpdateLog.bufferUpdates Starting to buffer updates. FSUpdateLog{state=ACTIVE, tlog=null}
[junit4:junit4]   2> 15014 T3501 C193 P52032 oasc.RecoveryStrategy.replicate Attempting to replicate from http://127.0.0.1:52026/collection1/. core=collection1
[junit4:junit4]   2> 15014 T3501 C193 P52032 oascsi.HttpClientUtil.createClient Creating new http client, config:maxConnections=128&maxConnectionsPerHost=32&followRedirects=false
[junit4:junit4]   2> ASYNC  NEW_CORE C194 name=collection1 org.apache.solr.core.SolrCore@610537b1 url=http://127.0.0.1:52026/collection1 node=127.0.0.1:52026_ C194_STATE=coll:collection1 core:collection1 props:{shard=shard1, roles=null, state=active, core=collection1, collection=collection1, node_name=127.0.0.1:52026_, base_url=http://127.0.0.1:52026, leader=true}
[junit4:junit4]   2> 15023 T3461 C194 P52026 REQ /get {getVersions=100&distrib=false&wt=javabin&qt=/get&version=2} status=0 QTime=1 
[junit4:junit4]   2> 15024 T3459 C194 P52026 oasu.DirectUpdateHandler2.commit start commit{,optimize=false,openSearcher=false,waitSearcher=true,expungeDeletes=false,softCommit=false}
[junit4:junit4]   2> 15025 T3459 C194 P52026 oasc.CachingDirectoryFactory.close Releasing directory:/Users/jenkins/jenkins-slave/workspace/Lucene-Solr-4.x-MacOSX/solr/build/solr-core/test/J0/./org.apache.solr.cloud.BasicDistributedZkTest-1360862409790/jetty1
[junit4:junit4]   2> 15029 T3459 C194 P52026 oasc.SolrDeletionPolicy.onInit SolrDeletionPolicy.onInit: commits:num=1
[junit4:junit4]   2> 		commit{dir=RateLimitedDirectoryWrapper(NRTCachingDirectory(org.apache.lucene.store.NIOFSDirectory@/Users/jenkins/jenkins-slave/workspace/Lucene-Solr-4.x-MacOSX/solr/build/solr-core/test/J0/org.apache.solr.cloud.BasicDistributedZkTest-1360862409790/jetty1/index lockFactory=org.apache.lucene.store.NativeFSLockFactory@250a06e; maxCacheMB=48.0 maxMergeSizeMB=4.0)),segFN=segments_1,generation=1,filenames=[segments_1]
[junit4:junit4]   2> 15030 T3459 C194 P52026 oasc.SolrDeletionPolicy.updateCommits newest commit = 1[segments_1]
[junit4:junit4]   2> 15033 T3459 C194 P52026 oasc.SolrDeletionPolicy.onCommit SolrDeletionPolicy.onCommit: commits:num=2
[junit4:junit4]   2> 		commit{dir=RateLimitedDirectoryWrapper(NRTCachingDirectory(org.apache.lucene.store.NIOFSDirectory@/Users/jenkins/jenkins-slave/workspace/Lucene-Solr-4.x-MacOSX/solr/build/solr-core/test/J0/org.apache.solr.cloud.BasicDistributedZkTest-1360862409790/jetty1/index lockFactory=org.apache.lucene.store.NativeFSLockFactory@250a06e; maxCacheMB=48.0 maxMergeSizeMB=4.0)),segFN=segments_1,generation=1,filenames=[segments_1]
[junit4:junit4]   2> 		commit{dir=RateLimitedDirectoryWrapper(NRTCachingDirectory(org.apache.lucene.store.NIOFSDirectory@/Users/jenkins/jenkins-slave/workspace/Lucene-Solr-4.x-MacOSX/solr/build/solr-core/test/J0/org.apache.solr.cloud.BasicDistributedZkTest-1360862409790/jetty1/index lockFactory=org.apache.lucene.store.NativeFSLockFactory@250a06e; maxCacheMB=48.0 maxMergeSizeMB=4.0)),segFN=segments_2,generation=2,filenames=[segments_2]
[junit4:junit4]   2> 15033 T3459 C194 P52026 oasc.SolrDeletionPolicy.updateCommits newest commit = 2[segments_2]
[junit4:junit4]   2> 15034 T3459 C194 P52026 oasc.CachingDirectoryFactory.close Releasing directory:/Users/jenkins/jenkins-slave/workspace/Lucene-Solr-4.x-MacOSX/solr/build/solr-core/test/J0/./org.apache.solr.cloud.BasicDistributedZkTest-1360862409790/jetty1
[junit4:junit4]   2> 15035 T3459 C194 P52026 oass.SolrIndexSearcher.<init> Opening Searcher@32ea05d3 realtime
[junit4:junit4]   2> 15035 T3459 C194 P52026 oasu.DirectUpdateHandler2.commit end_commit_flush
[junit4:junit4]   2> 15035 T3459 C194 P52026 /update {waitSearcher=true&openSearcher=false&commit=true&wt=javabin&commit_end_point=true&version=2&softCommit=false} {commit=} 0 12
[junit4:junit4]   2> 15036 T3501 C193 P52032 oash.ReplicationHandler.inform Commits will be reserved for  10000
[junit4:junit4]   2> 15037 T3501 C193 P52032 oash.SnapPuller.<init>  No value set for 'pollInterval'. Timer Task not started.
[junit4:junit4]   2> 15039 T3463 C194 P52026 oash.ReplicationHandler.inform Commits will be reserved for  10000
[junit4:junit4]   2> 15039 T3463 C194 P52026 REQ /replication {command=indexversion&qt=/replication&wt=javabin&version=2} status=0 QTime=1 
[junit4:junit4]   2> 15040 T3501 C193 P52032 oash.SnapPuller.fetchLatestIndex Master's generation: 2
[junit4:junit4]   2> 15040 T3501 C193 P52032 oash.SnapPuller.fetchLatestIndex Slave's generation: 1
[junit4:junit4]   2> 15041 T3501 C193 P52032 oash.SnapPuller.fetchLatestIndex Starting replication process
[junit4:junit4]   2> 15044 T3464 C194 P52026 oasc.CachingDirectoryFactory.close Releasing directory:/Users/jenkins/jenkins-slave/workspace/Lucene-Solr-4.x-MacOSX/solr/build/solr-core/test/J0/./org.apache.solr.cloud.BasicDistributedZkTest-1360862409790/jetty1
[junit4:junit4]   2> 15044 T3464 C194 P52026 oasc.CachingDirectoryFactory.close Releasing directory:/Users/jenkins/jenkins-slave/workspace/Lucene-Solr-4.x-MacOSX/solr/build/solr-core/test/J0/./org.apache.solr.cloud.BasicDistributedZkTest-1360862409790/jetty1/index
[junit4:junit4]   2> 15045 T3464 C194 P52026 REQ /replication {command=filelist&qt=/replication&wt=javabin&generation=2&version=2} status=0 QTime=1 
[junit4:junit4]   2> 15046 T3501 C193 P52032 oash.SnapPuller.fetchLatestIndex Number of files in latest index in master: 1
[junit4:junit4]   2> 15047 T3501 C193 P52032 oasc.CachingDirectoryFactory.get return new directory for /Users/jenkins/jenkins-slave/workspace/Lucene-Solr-4.x-MacOSX/solr/build/solr-core/test/J0/./org.apache.solr.cloud.BasicDistributedZkTest-1360862409790/jetty3/index.20130214172024829 forceNew:false
[junit4:junit4]   2> 15048 T3501 C193 P52032 oasc.CachingDirectoryFactory.close Releasing directory:/Users/jenkins/jenkins-slave/workspace/Lucene-Solr-4.x-MacOSX/solr/build/solr-core/test/J0/./org.apache.solr.cloud.BasicDistributedZkTest-1360862409790/jetty3
[junit4:junit4]   2> 15048 T3501 C193 P52032 oash.SnapPuller.fetchLatestIndex Starting download to RateLimitedDirectoryWrapper(NRTCachingDirectory(org.apache.lucene.store.NIOFSDirectory@/Users/jenkins/jenkins-slave/workspace/Lucene-Solr-4.x-MacOSX/solr/build/solr-core/test/J0/org.apache.solr.cloud.BasicDistributedZkTest-1360862409790/jetty3/index.20130214172024829 lockFactory=org.apache.lucene.store.NativeFSLockFactory@2511506e; maxCacheMB=48.0 maxMergeSizeMB=4.0)) fullCopy=true
[junit4:junit4]   2> 15053 T3460 C194 P52026 REQ /replication {file=segments_2&command=filecontent&checksum=true&wt=filestream&qt=/replication&generation=2} status=0 QTime=1 
[junit4:junit4]   2> 15054 T3501 C193 P52032 oasc.CachingDirectoryFactory.close Releasing directory:/Users/jenkins/jenkins-slave/workspace/Lucene-Solr-4.x-MacOSX/solr/build/solr-core/test/J0/./org.apache.solr.cloud.BasicDistributedZkTest-1360862409790/jetty3/index
[junit4:junit4]   2> 15054 T3501 C193 P52032 oash.SnapPuller.fetchLatestIndex Total time taken for download : 0 secs
[junit4:junit4]   2> 15055 T3501 C193 P52032 oash.SnapPuller.modifyIndexProps New index installed. Updating index properties... index=index.20130214172024829
[junit4:junit4]   2> 15056 T3501 C193 P52032 oasc.CachingDirectoryFactory.close Releasing directory:/Users/jenkins/jenkins-slave/workspace/Lucene-Solr-4.x-MacOSX/solr/build/solr-core/test/J0/./org.apache.solr.cloud.BasicDistributedZkTest-1360862409790/jetty3
[junit4:junit4]   2> 15056 T3501 C193 P52032 oasc.CachingDirectoryFactory.close Releasing directory:/Users/jenkins/jenkins-slave/workspace/Lucene-Solr-4.x-MacOSX/solr/build/solr-core/test/J0/./org.apache.solr.cloud.BasicDistributedZkTest-1360862409790/jetty3
[junit4:junit4]   2> 15057 T3501 C193 P52032 oasc.SolrCore.getNewIndexDir New index directory detected: old=./org.apache.solr.cloud.BasicDistributedZkTest-1360862409790/jetty3/index/ new=./org.apache.solr.cloud.BasicDistributedZkTest-1360862409790/jetty3/index.20130214172024829
[junit4:junit4]   2> 15059 T3501 C193 P52032 oasc.SolrDeletionPolicy.onInit SolrDeletionPolicy.onInit: commits:num=1
[junit4:junit4]   2> 		commit{dir=RateLimitedDirectoryWrapper(NRTCachingDirectory(org.apache.lucene.store.NIOFSDirectory@/Users/jenkins/jenkins-slave/workspace/Lucene-Solr-4.x-MacOSX/solr/build/solr-core/test/J0/org.apache.solr.cloud.BasicDistributedZkTest-1360862409790/jetty3/index.20130214172024829 lockFactory=org.apache.lucene.store.NativeFSLockFactory@2511506e; maxCacheMB=48.0 maxMergeSizeMB=4.0)),segFN=segments_2,generation=2,filenames=[segments_2]
[junit4:junit4]   2> 15060 T3501 C193 P52032 oasc.SolrDeletionPolicy.updateCommits newest commit = 2[segments_2]
[junit4:junit4]   2> 15061 T3501 C193 P52032 oasc.CachingDirectoryFactory.close Releasing directory:/Users/jenkins/jenkins-slave/workspace/Lucene-Solr-4.x-MacOSX/solr/build/solr-core/test/J0/./org.apache.solr.cloud.BasicDistributedZkTest-1360862409790/jetty3
[junit4:junit4]   2> 15062 T3501 C193 P52032 oasu.DefaultSolrCoreState.newIndexWriter Creating new IndexWriter...
[junit4:junit4]   2> 15062 T3501 C193 P52032 oasu.DefaultSolrCoreState.newIndexWriter Waiting until IndexWriter is unused... core=collection1
[junit4:junit4]   2> 15062 T3501 C193 P52032 oasu.DefaultSolrCoreState.newIndexWriter Rollback old IndexWriter... core=collection1
[junit4:junit4]   2> 15063 T3501 C193 P52032 oasc.CachingDirectoryFactory.close Releasing directory:/Users/jenkins/jenkins-slave/workspace/Lucene-Solr-4.x-MacOSX/solr/build/solr-core/test/J0/./org.apache.solr.cloud.BasicDistributedZkTest-1360862409790/jetty3/index.20130214172024829
[junit4:junit4]   2> 15064 T3501 C193 P52032 oasc.CachingDirectoryFactory.close Releasing directory:/Users/jenkins/jenkins-slave/workspace/Lucene-Solr-4.x-MacOSX/solr/build/solr-core/test/J0/./org.apache.solr.cloud.BasicDistributedZkTest-1360862409790/jetty3
[junit4:junit4]   2> 15066 T3501 C193 P52032 oasc.SolrDeletionPolicy.onInit SolrDeletionPolicy.onInit: commits:num=1
[junit4:junit4]   2> 		commit{dir=RateLimitedDirectoryWrapper(NRTCachingDirectory(org.apache.lucene.store.NIOFSDirectory@/Users/jenkins/jenkins-slave/workspace/Lucene-Solr-4.x-MacOSX/solr/build/solr-core/test/J0/org.apache.solr.cloud.BasicDistributedZkTest-1360862409790/jetty3/index.20130214172024829 lockFactory=org.apache.lucene.store.NativeFSLockFactory@2511506e; maxCacheMB=48.0 maxMergeSizeMB=4.0)),segFN=segments_2,generation=2,filenames=[segments_2]
[junit4:junit4]   2> 15067 T3501 C193 P52032 oasc.SolrDeletionPolicy.updateCommits newest commit = 2[segments_2]
[junit4:junit4]   2> 15067 T3501 C193 P52032 oasu.DefaultSolrCoreState.newIndexWriter New IndexWriter is ready to be used.
[junit4:junit4]   2> 15067 T3501 C193 P52032 oasc.CachingDirectoryFactory.close Releasing directory:/Users/jenkins/jenkins-slave/workspace/Lucene-Solr-4.x-MacOSX/solr/build/solr-core/test/J0/./org.apache.solr.cloud.BasicDistributedZkTest-1360862409790/jetty3
[junit4:junit4]   2> 15068 T3501 C193 P52032 oass.SolrIndexSearcher.<init> Opening Searcher@6417125b main
[junit4:junit4]   2> 15070 T3500 oasc.SolrCore.registerSearcher [collection1] Registered new searcher Searcher@6417125b main{StandardDirectoryReader(segments_2:1:nrt)}
[junit4:junit4]   2> 15070 T3500 oasc.CachingDirectoryFactory.close Releasing directory:/Users/jenkins/jenkins-slave/workspace/Lucene-Solr-4.x-MacOSX/solr/build/solr-core/test/J0/./org.apache.solr.cloud.BasicDistributedZkTest-1360862409790/jetty3/index
[junit4:junit4]   2> 15071 T3501 C193 P52032 oasu.DirectUpdateHandler2.commit start commit{,optimize=false,openSearcher=false,waitSearcher=false,expungeDeletes=false,softCommit=false}
[junit4:junit4]   2> 15073 T3501 C193 P52032 oasc.SolrDeletionPolicy.onCommit SolrDeletionPolicy.onCommit: commits:num=2
[junit4:junit4]   2> 		commit{dir=RateLimitedDirectoryWrapper(NRTCachingDirectory(org.apache.lucene.store.NIOFSDirectory@/Users/jenkins/jenkins-slave/workspace/Lucene-Solr-4.x-MacOSX/solr/build/solr-core/test/J0/org.apache.solr.cloud.BasicDistributedZkTest-1360862409790/jetty3/index.20130214172024829 lockFactory=org.apache.lucene.store.NativeFSLockFactory@2511506e; maxCacheMB=48.0 maxMergeSizeMB=4.0)),segFN=segments_2,generation=2,filenames=[segments_2]
[junit4:junit4]   2> 		commit{dir=RateLimitedDirectoryWrapper(NRTCachingDirectory(org.apache.lucene.store.NIOFSDirectory@/Users/jenkins/jenkins-slave/workspace/Lucene-Solr-4.x-MacOSX/solr/build/solr-core/test/J0/org.apache.solr.cloud.BasicDistributedZkTest-1360862409790/jetty3/index.20130214172024829 lockFactory=org.apache.lucene.store.NativeFSLockFactory@2511506e; maxCacheMB=48.0 maxMergeSizeMB=4.0)),segFN=segments_3,generation=3,filenames=[segments_3]
[junit4:junit4]   2> 15073 T3501 C193 P52032 oasc.SolrDeletionPolicy.updateCommits newest commit = 3[segments_3]
[junit4:junit4]   2> 15074 T3501 C193 P52032 oasc.CachingDirectoryFactory.close Releasing directory:/Users/jenkins/jenkins-slave/workspace/Lucene-Solr-4.x-MacOSX/solr/build/solr-core/test/J0/./org.apache.solr.cloud.BasicDistributedZkTest-1360862409790/jetty3
[junit4:junit4]   2> 15074 T3501 C193 P52032 oasu.DirectUpdateHandler2.commit end_commit_flush
[junit4:junit4]   2> 15074 T3501 C193 P52032 oasc.CachingDirectoryFactory.close Releasing directory:/Users/jenkins/jenkins-slave/workspace/Lucene-Solr-4.x-MacOSX/solr/build/solr-core/test/J0/./org.apache.solr.cloud.BasicDistributedZkTest-1360862409790/jetty3/index.20130214172024829
[junit4:junit4]   2> 15075 T3501 C193 P52032 oasc.CachingDirectoryFactory.close Releasing directory:/Users/jenkins/jenkins-slave/workspace/Lucene-Solr-4.x-MacOSX/solr/build/solr-core/test/J0/./org.apache.solr.cloud.BasicDistributedZkTest-1360862409790/jetty3/index
[junit4:junit4]   2> 15075 T3501 C193 P52032 oasc.RecoveryStrategy.replay No replay needed. core=collection1
[junit4:junit4]   2> 15075 T3501 C193 P52032 oasc.RecoveryStrategy.doRecovery Replication Recovery was successful - registering as Active. core=collection1
[junit4:junit4]   2> 15075 T3501 C193 P52032 oasc.ZkController.publish publishing core=collection1 state=active
[junit4:junit4]   2> 15075 T3501 C193 P52032 oasc.ZkController.publish numShards not found on descriptor - reading it from system property
[junit4:junit4]   2> 15077 T3501 C193 P52032 oasc.RecoveryStrategy.doRecovery Finished recovery process. core=collection1
[junit4:junit4]   2> 15223 T3515 oasc.CoreContainer.registerCore registering core: collection1
[junit4:junit4]   2> 15224 T3515 oasc.ZkController.register Register replica - core:collection1 address:http://127.0.0.1:52036 collection:collection1 shard:shard2
[junit4:junit4]   2> 15227 T3515 oasc.ZkController.register We are http://127.0.0.1:52036/collection1/ and leader is http://127.0.0.1:52029/collection1/
[junit4:junit4]   2> 15228 T3515 oasc.ZkController.register No LogReplay needed for core=collection1 baseURL=http://127.0.0.1:52036
[junit4:junit4]   2> 15228 T3515 oasc.ZkController.checkRecovery Core needs to recover:collection1
[junit4:junit4]   2> 15228 T3515 oasu.DefaultSolrCoreState.doRecovery Running recovery - first canceling any ongoing recovery
[junit4:junit4]   2> ASYNC  NEW_CORE C195 name=collection1 org.apache.solr.core.SolrCore@aebd709 url=http://127.0.0.1:52036/collection1 node=127.0.0.1:52036_ C195_STATE=coll:collection1 core:collection1 props:{shard=null, roles=null, state=down, core=collection1, collection=collection1, node_name=127.0.0.1:52036_, base_url=http://127.0.0.1:52036}
[junit4:junit4]   2> 15229 T3519 C195 P52036 oasc.RecoveryStrategy.run Starting recovery process.  core=collection1 recoveringAfterStartup=true
[junit4:junit4]   2> 15230 T3519 C195 P52036 oasc.RecoveryStrategy.doRecovery ###### startupVersions=[]
[junit4:junit4]   2> 15230 T3519 C195 P52036 oasc.ZkController.publish publishing core=collection1 state=recovering
[junit4:junit4]   2> 15230 T3515 oascc.ZkStateReader.updateClusterState Updating cloud state from ZooKeeper... 
[junit4:junit4]   2> 15230 T3519 C195 P52036 oasc.ZkController.publish numShards not found on descriptor - reading it from system property
[junit4:junit4]   2> 15232 T3427 oass.SolrDispatchFilter.init user.dir=/Users/jenkins/jenkins-slave/workspace/Lucene-Solr-4.x-MacOSX/solr/build/solr-core/test/J0
[junit4:junit4]   2> 15232 T3519 C195 P52036 oascsi.HttpClientUtil.createClient Creating new http client, config:maxConnections=128&maxConnectionsPerHost=32&followRedirects=false
[junit4:junit4]   2> 15232 T3427 oass.SolrDispatchFilter.init SolrDispatchFilter.init() done
[junit4:junit4]   2> 15233 T3427 oascsi.HttpClientUtil.createClient Creating new http client, config:maxConnections=128&maxConnectionsPerHost=32&followRedirects=false
[junit4:junit4]   2> 15241 T3427 oascc.ZkStateReader.updateClusterState Updating cloud state from ZooKeeper... 
[junit4:junit4]   2> 15243 T3427 oasc.AbstractDistribZkTestBase.waitForRecoveriesToFinish Wait for recoveries to finish - collection: collection1 failOnTimeout:true timeout (sec):230
[junit4:junit4]   2> 15244 T3427 oascc.ZkStateReader.updateClusterState Updating cloud state from ZooKeeper... 
[junit4:junit4]   2> 15806 T3450 oascc.ZkStateReader.updateClusterState Updating cloud state from ZooKeeper... 
[junit4:junit4]   2> 15807 T3450 oasc.Overseer$ClusterStateUpdater.updateState Update state numShards=2 message={
[junit4:junit4]   2> 	  "operation":"state",
[junit4:junit4]   2> 	  "numShards":"2",
[junit4:junit4]   2> 	  "shard":"shard1",
[junit4:junit4]   2> 	  "roles":null,
[junit4:junit4]   2> 	  "state":"active",
[junit4:junit4]   2> 	  "core":"collection1",
[junit4:junit4]   2> 	  "collection":"collection1",
[junit4:junit4]   2> 	  "node_name":"127.0.0.1:52032_",
[junit4:junit4]   2> 	  "base_url":"http://127.0.0.1:52032"}
[junit4:junit4]   2> 15813 T3450 oasc.Overseer$ClusterStateUpdater.updateState Update state numShards=2 message={
[junit4:junit4]   2> 	  "operation":"state",
[junit4:junit4]   2> 	  "numShards":"2",
[junit4:junit4]   2> 	  "shard":"shard2",
[junit4:junit4]   2> 	  "roles":null,
[junit4:junit4]   2> 	  "state":"recovering",
[junit4:junit4]   2> 	  "core":"collection1",
[junit4:junit4]   2> 	  "collection":"collection1",
[junit4:junit4]   2> 	  "node_name":"127.0.0.1:52036_",
[junit4:junit4]   2> 	  "base_url":"http://127.0.0.1:52036"}
[junit4:junit4]   2> 15819 T3449 oascc.ZkStateReader$2.process A cluster state change: WatchedEvent state:SyncConnected type:NodeDataChanged path:/clusterstate.json, has occurred - updating... (live nodes size: 5)
[junit4:junit4]   2> 15819 T3498 oascc.ZkStateReader$2.process A cluster state change: WatchedEvent state:SyncConnected type:NodeDataChanged path:/clusterstate.json, has occurred - updating... (live nodes size: 5)
[junit4:junit4]   2> 15819 T3514 oascc.ZkStateReader$2.process A cluster state change: WatchedEvent state:SyncConnected type:NodeDataChanged path:/clusterstate.json, has occurred - updating... (live nodes size: 5)
[junit4:junit4]   2> 15819 T3483 oascc.ZkStateReader$2.process A cluster state change: WatchedEvent state:SyncConnected type:NodeDataChanged path:/clusterstate.json, has occurred - updating... (live nodes size: 5)
[junit4:junit4]   2> 15820 T3455 oascc.ZkStateReader$2.process A cluster state change: WatchedEvent state:SyncConnected type:NodeDataChanged path:/clusterstate.json, has occurred - updating... (live nodes size: 5)
[junit4:junit4]   2> 15820 T3468 oascc.ZkStateReader$2.process A cluster state change: WatchedEvent state:SyncConnected type:NodeDataChanged path:/clusterstate.json, has occurred - updating... (live nodes size: 5)
[junit4:junit4]   2> 16247 T3427 oascc.ZkStateReader.updateClusterState Updating cloud state from ZooKeeper... 
[junit4:junit4]   2> 17250 T3427 oascc.ZkStateReader.updateClusterState Updating cloud state from ZooKeeper... 
[junit4:junit4]   2>  C195_STATE=coll:collection1 core:collection1 props:{shard=shard2, roles=null, state=recovering, core=collection1, collection=collection1, node_name=127.0.0.1:52036_, base_url=http://127.0.0.1:52036}
[junit4:junit4]   2> 18247 T3519 C195 P52036 oasc.RecoveryStrategy.doRecovery Attempting to PeerSync from http://127.0.0.1:52029/collection1/ core=collection1 - recoveringAfterStartup=true
[junit4:junit4]   2> 18247 T3519 C195 P52036 oasu.PeerSync.sync PeerSync: core=collection1 url=http://127.0.0.1:52036 START replicas=[http://127.0.0.1:52029/collection1/] nUpdates=100
[junit4:junit4]   2> 18248 T3519 C195 P52036 oasu.PeerSync.sync WARNING no frame of reference to tell of we've missed updates
[junit4:junit4]   2> 18248 T3519 C195 P52036 oasc.RecoveryStrategy.doRecovery PeerSync Recovery was not successful - trying replication. core=collection1
[junit4:junit4]   2> 18248 T3519 C195 P52036 oasc.RecoveryStrategy.doRecovery Starting Replication Recovery. core=collection1
[junit4:junit4]   2> 18249 T3519 C195 P52036 oasc.RecoveryStrategy.doRecovery Begin buffering updates. core=collection1
[junit4:junit4]   2> 18249 T3519 C195 P52036 oasu.UpdateLog.bufferUpdates Starting to buffer updates. FSUpdateLog{state=ACTIVE, tlog=null}
[junit4:junit4]   2> 18249 T3519 C195 P52036 oasc.RecoveryStrategy.replicate Attempting to replicate from http://127.0.0.1:52029/collection1/. core=collection1
[junit4:junit4]   2> 18249 T3519 C195 P52036 oascsi.HttpClientUtil.createClient Creating new http client, config:maxConnections=128&maxConnectionsPerHost=32&followRedirects=false
[junit4:junit4]   2> ASYNC  NEW_CORE C196 name=collection1 org.apache.solr.core.SolrCore@1b8f0830 url=http://127.0.0.1:52029/collection1 node=127.0.0.1:52029_ C196_STATE=coll:collection1 core:collection1 props:{shard=shard2, roles=null, state=active, core=collection1, collection=collection1, node_name=127.0.0.1:52029_, base_url=http://127.0.0.1:52029, leader=true}
[junit4:junit4]   2> 18255 T3476 C196 P52029 REQ /get {getVersions=100&distrib=false&wt=javabin&qt=/get&version=2} status=0 QTime=1 
[junit4:junit4]   2> 18257 T3427 oascc.ZkStateReader.updateClusterState Updating cloud state from ZooKeeper... 
[junit4:junit4]   2> 18257 T3479 C196 P52029 oasu.DirectUpdateHandler2.commit start commit{,optimize=false,openSearcher=false,waitSearcher=true,expungeDeletes=false,softCommit=false}
[junit4:junit4]   2> 18259 T3479 C196 P52029 oasc.CachingDirectoryFactory.close Releasing directory:/Users/jenkins/jenkins-slave/workspace/Lucene-Solr-4.x-MacOSX/solr/build/solr-core/test/J0/./org.apache.solr.cloud.BasicDistributedZkTest-1360862409790/jetty2
[junit4:junit4]   2> 18263 T3479 C196 P52029 oasc.SolrDeletionPolicy.onInit SolrDeletionPolicy.onInit: commits:num=1
[junit4:junit4]   2> 		commit{dir=RateLimitedDirectoryWrapper(NRTCachingDirectory(org.apache.lucene.store.NIOFSDirectory@/Users/jenkins/jenkins-slave/workspace/Lucene-Solr-4.x-MacOSX/solr/build/solr-core/test/J0/org.apache.solr.cloud.BasicDistributedZkTest-1360862409790/jetty2/index lockFactory=org.apache.lucene.store.NativeFSLockFactory@61756f39; maxCacheMB=48.0 maxMergeSizeMB=4.0)),segFN=segments_1,generation=1,filenames=[segments_1]
[junit4:junit4]   2> 18263 T3479 C196 P52029 oasc.SolrDeletionPolicy.updateCommits newest commit = 1[segments_1]
[junit4:junit4]   2> 18266 T3479 C196 P52029 oasc.SolrDeletionPolicy.onCommit SolrDeletionPolicy.onCommit: commits:num=2
[junit4:junit4]   2> 		commit{dir=RateLimitedDirectoryWrapper(NRTCachingDirectory(org.apache.lucene.store.NIOFSDirectory@/Users/jenkins/jenkins-slave/workspace/Lucene-Solr-4.x-MacOSX/solr/build/solr-core/test/J0/org.apache.solr.cloud.BasicDistributedZkTest-1360862409790/jetty2/index lockFactory=org.apache.lucene.store.NativeFSLockFactory@61756f39; maxCacheMB=48.0 maxMergeSizeMB=4.0)),segFN=segments_1,generation=1,filenames=[segments_1]
[junit4:junit4]   2> 		commit{dir=RateLimitedDirectoryWrapper(NRTCachingDirectory(org.apache.lucene.store.NIOFSDirectory@/Users/jenkins/jenkins-slave/workspace/Lucene-Solr-4.x-MacOSX/solr/build/solr-core/test/J0/org.apache.solr.cloud.BasicDistributedZkTest-1360862409790/jetty2/index lockFactory=org.apache.lucene.store.NativeFSLockFactory@61756f39; maxCacheMB=48.0 maxMergeSizeMB=4.0)),segFN=segments_2,generation=2,filenames=[segments_2]
[junit4:junit4]   2> 18266 T3479 C196 P52029 oasc.SolrDeletionPolicy.updateCommits newest commit = 2[segments_2]
[junit4:junit4]   2> 18267 T3479 C196 P52029 oasc.CachingDirectoryFactory.close Releasing directory:/Users/jenkins/jenkins-slave/workspace/Lucene-Solr-4.x-MacOSX/solr/build/solr-core/test/J0/./org.apache.solr.cloud.BasicDistributedZkTest-1360862409790/jetty2
[junit4:junit4]   2> 18268 T3479 C196 P52029 oass.SolrIndexSearcher.<init> Opening Searcher@562f4ec8 realtime
[junit4:junit4]   2> 18268 T3479 C196 P52029 oasu.DirectUpdateHandler2.commit end_commit_flush
[junit4:junit4]   2> 18269 T3479 C196 P52029 /update {waitSearcher=true&openSearcher=false&commit=true&wt=javabin&commit_end_point=true&version=2&softCommit=false} {commit=} 0 12
[junit4:junit4]   2> 18270 T3519 C195 P52036 oash.ReplicationHandler.inform Commits will be reserved for  10000
[junit4:junit4]   2> 18270 T3519 C195 P52036 oash.SnapPuller.<init>  No value set for 'pollInterval'. Timer Task not started.
[junit4:junit4]   2> 18273 T3477 C196 P52029 oash.ReplicationHandler.inform Commits will be reserved for  10000
[junit4:junit4]   2> 18273 T3477 C196 P52029 REQ /replication {command=indexversion&qt=/replication&wt=javabin&version=2} status=0 QTime=1 
[junit4:junit4]   2> 18274 T3519 C195 P52036 oash.SnapPuller.fetchLatestIndex Master's generation: 2
[junit4:junit4]   2> 18274 T3519 C195 P52036 oash.SnapPuller.fetchLatestIndex Slave's generation: 1
[junit4:junit4]   2> 18274 T3519 C195 P52036 oash.SnapPuller.fetchLatestIndex Starting replication process
[junit4:junit4]   2> 18277 T3478 C196 P52029 oasc.CachingDirectoryFactory.close Releasing directory:/Users/jenkins/jenkins-slave/workspace/Lucene-Solr-4.x-MacOSX/solr/build/solr-core/test/J0/./org.apache.solr.cloud.BasicDistributedZkTest-1360862409790/jetty2
[junit4:junit4]   2> 18277 T3478 C196 P52029 oasc.CachingDirectoryFactory.close Releasing directory:/Users/jenkins/jenkins-slave/workspace/Lucene-Solr-4.x-MacOSX/solr/build/solr-core/test/J0/./org.apache.solr.cloud.BasicDistributedZkTest-1360862409790/jetty2/index
[junit4:junit4]   2> 18278 T3478 C196 P52029 REQ /replication {command=filelist&qt=/replication&wt=javabin&generation=2&version=2} status=0 QTime=1 
[junit4:junit4]   2> 18278 T3519 C195 P52036 oash.SnapPuller.fetchLatestIndex Number of files in latest index in master: 1
[junit4:junit4]   2> 18280 T3519 C195 P52036 oasc.CachingDirectoryFactory.get return new directory for /Users/jenkins/jenkins-slave/workspace/Lucene-Solr-4.x-MacOSX/solr/build/solr-core/test/J0/./org.apache.solr.cloud.BasicDistributedZkTest-1360862409790/jetty4/index.20130214172028062 forceNew:false
[junit4:junit4]   2> 18280 T3519 C195 P52036 oasc.CachingDirectoryFactory.close Releasing directory:/Users/jenkins/jenkins-slave/workspace/Lucene-Solr-4.x-MacOSX/solr/build/solr-core/test/J0/./org.apache.solr.cloud.BasicDistributedZkTest-1360862409790/jetty4
[junit4:junit4]   2> 18281 T3519 C195 P52036 oash.SnapPuller.fetchLatestIndex Starting download to RateLimitedDirectoryWrapper(NRTCachingDirectory(org.apache.lucene.store.NIOFSDirectory@/Users/jenkins/jenkins-slave/workspace/Lucene-Solr-4.x-MacOSX/solr/build/solr-core/test/J0/org.apache.solr.cloud.BasicDistributedZkTest-1360862409790/jetty4/index.20130214172028062 lockFactory=org.apache.lucene.store.NativeFSLockFactory@711ad9c8; maxCacheMB=48.0 maxMergeSizeMB=4.0)) fullCopy=true
[junit4:junit4]   2> 18292 T3476 C196 P52029 REQ /replication {file=segments_2&command=filecontent&checksum=true&wt=filestream&qt=/replication&generation=2} status=0 QTime=0 
[junit4:junit4]   2> 18294 T3519 C195 P52036 oasc.CachingDirectoryFactory.close Releasing directory:/Users/jenkins/jenkins-slave/workspace/Lucene-Solr-4.x-MacOSX/solr/build/solr-core/test/J0/./org.apache.solr.cloud.BasicDistributedZkTest-1360862409790/jetty4/index
[junit4:junit4]   2> 18294 T3519 C195 P52036 oash.SnapPuller.fetchLatestIndex Total time taken for download : 0 secs
[junit4:junit4]   2> 18295 T3519 C195 P52036 oash.SnapPuller.modifyIndexProps New index installed. Updating index properties... index=index.20130214172028062
[junit4:junit4]   2> 18296 T3519 C195 P52036 oasc.CachingDirectoryFactory.close Releasing directory:/Users/jenkins/jenkins-slave/workspace/Lucene-Solr-4.x-MacOSX/solr/build/solr-core/test/J0/./org.apache.solr.cloud.BasicDistributedZkTest-1360862409790/jetty4
[junit4:junit4]   2> 18296 T3519 C195 P52036 oasc.CachingDirectoryFactory.close Releasing directory:/Users/jenkins/jenkins-slave/workspace/Lucene-Solr-4.x-MacOSX/solr/build/solr-core/test/J0/./org.apache.solr.cloud.BasicDistributedZkTest-1360862409790/jetty4
[junit4:junit4]   2> 18297 T3519 C195 P52036 oasc.SolrCore.getNewIndexDir New index directory detected: old=./org.apache.solr.cloud.BasicDistributedZkTest-1360862409790/jetty4/index/ new=./org.apache.solr.cloud.BasicDistributedZkTest-1360862409790/jetty4/index.20130214172028062
[junit4:junit4]   2> 18299 T3519 C195 P52036 oasc.SolrDeletionPolicy.onInit SolrDeletionPolicy.onInit: commits:num=1
[junit4:junit4]   2> 		commit{dir=RateLimitedDirectoryWrapper(NRTCachingDirectory(org.apache.lucene.store.NIOFSDirectory@/Users/jenkins/jenkins-slave/workspace/Lucene-Solr-4.x-MacOSX/solr/build/solr-core/test/J0/org.apache.solr.cloud.BasicDistributedZkTest-1360862409790/jetty4/index.20130214172028062 lockFactory=org.apache.lucene.store.NativeFSLockFactory@711ad9c8; maxCacheMB=48.0 maxMergeSizeMB=4.0)),segFN=segments_2,generation=2,filenames=[segments_2]
[junit4:junit4]   2> 18300 T3519 C195 P52036 oasc.SolrDeletionPolicy.updateCommits newest commit = 2[segments_2]
[junit4:junit4]   2> 18301 T3519 C195 P52036 oasc.CachingDirectoryFactory.close Releasing directory:/Users/jenkins/jenkins-slave/workspace/Lucene-Solr-4.x-MacOSX/solr/build/solr-core/test/J0/./org.apache.solr.cloud.BasicDistributedZkTest-1360862409790/jetty4
[junit4:junit4]   2> 18301 T3519 C195 P52036 oasu.DefaultSolrCoreState.newIndexWriter Creating new IndexWriter...
[junit4:junit4]   2> 18302 T3519 C195 P52036 oasu.DefaultSolrCoreState.newIndexWriter Waiting until IndexWriter is unused... core=collection1
[junit4:junit4]   2> 18302 T3519 C195 P52036 oasu.DefaultSolrCoreState.newIndexWriter Rollback old IndexWriter... core=collection1
[junit4:junit4]   2> 18302 T3519 C195 P52036 oasc.CachingDirectoryFactory.close Releasing directory:/Users/jenkins/jenkins-slave/workspace/Lucene-Solr-4.x-MacOSX/solr/build/solr-core/test/J0/./org.apache.solr.cloud.BasicDistributedZkTest-1360862409790/jetty4/index.20130214172028062
[junit4:junit4]   2> 18303 T3519 C195 P52036 oasc.CachingDirectoryFactory.close Releasing directory:/Users/jenkins/jenkins-slave/workspace/Lucene-Solr-4.x-MacOSX/solr/build/solr-core/test/J0/./org.apache.solr.cloud.BasicDistributedZkTest-1360862409790/jetty4
[junit4:junit4]   2> 18304 T3519 C195 P52036 oasc.SolrDeletionPolicy.onInit SolrDeletionPolicy.onInit: commits:num=1
[junit4:junit4]   2> 		commit{dir=RateLimitedDirectoryWrapper(NRTCachingDirectory(org.apache.lucene.store.NIOFSDirectory@/Users/jenkins/jenkins-slave/workspace/Lucene-Solr-4.x-MacOSX/solr/build/solr-core/test/J0/org.apache.solr.cloud.BasicDistributedZkTest-1360862409790/jetty4/index.20130214172028062 lockFactory=org.apache.lucene.store.NativeFSLockFactory@711ad9c8; maxCacheMB=48.0 maxMergeSizeMB=4.0)),segFN=segments_2,generation=2,filenames=[segments_2]
[junit4:junit4]   2> 18304 T3519 C195 P52036 oasc.SolrDeletionPolicy.updateCommits newest commit = 2[segments_2]
[junit4:junit4]   2> 18305 T3519 C195 P52036 oasu.DefaultSolrCoreState.newIndexWriter New IndexWriter is ready to be used.
[junit4:junit4]   2> 18305 T3519 C195 P52036 oasc.CachingDirectoryFactory.close Releasing directory:/Users/jenkins/jenkins-slave/workspace/Lucene-Solr-4.x-MacOSX/solr/build/solr-core/test/J0/./org.apache.solr.cloud.BasicDistributedZkTest-1360862409790/jetty4
[junit4:junit4]   2> 18305 T3519 C195 P52036 oass.SolrIndexSearcher.<init> Opening Searcher@2cdac1b1 main
[junit4:junit4]   2> 18307 T3516 oasc.SolrCore.registerSearcher [collection1] Registered new searcher Searcher@2cdac1b1 main{StandardDirectoryReader(segments_2:1:nrt)}
[junit4:junit4]   2> 18308 T3516 oasc.CachingDirectoryFactory.close Releasing directory:/Users/jenkins/jenkins-slave/workspace/Lucene-Solr-4.x-MacOSX/solr/build/solr-core/test/J0/./org.apache.solr.cloud.BasicDistributedZkTest-1360862409790/jetty4/index
[junit4:junit4]   2> 18308 T3519 C195 P52036 oasu.DirectUpdateHandler2.commit start commit{,optimize=false,openSearcher=false,waitSearcher=false,expungeDeletes=false,softCommit=false}
[junit4:junit4]   2> 18310 T3519 C195 P52036 oasc.SolrDeletionPolicy.onCommit SolrDeletionPolicy.onCommit: commits:num=2
[junit4:junit4]   2> 		commit{dir=RateLimitedDirectoryWrapper(NRTCachingDirectory(org.apache.lucene.store.NIOFSDirectory@/Users/jenkins/jenkins-slave/workspace/Lucene-Solr-4.x-MacOSX/solr/build/solr-core/test/J0/org.apache.solr.cloud.BasicDistributedZkTest-1360862409790/jetty4/index.20130214172028062 lockFactory=org.apache.lucene.store.NativeFSLockFactory@711ad9c8; maxCacheMB=48.0 maxMergeSizeMB=4.0)),segFN=segments_2,generation=2,filenames=[segments_2]
[junit4:junit4]   2> 		commit{dir=RateLimitedDirectoryWrapper(NRTCachingDirectory(org.apache.lucene.store.NIOFSDirectory@/Users/jenkins/jenkins-slave/workspace/Lucene-Solr-4.x-MacOSX/solr/build/solr-core/test/J0/org.apache.solr.cloud.BasicDistributedZkTest-1360862409790/jetty4/index.20130214172028062 lockFactory=org.apache.lucene.store.NativeFSLockFactory@711ad9c8; maxCacheMB=48.0 maxMergeSizeMB=4.0)),segFN=segments_3,generation=3,filenames=[segments_3]
[junit4:junit4]   2> 18310 T3519 C195 P52036 oasc.SolrDeletionPolicy.updateCommits newest commit = 3[segments_3]
[junit4:junit4]   2> 18310 T3519 C195 P52036 oasc.CachingDirectoryFactory.close Releasing directory:/Users/jenkins/jenkins-slave/workspace/Lucene-Solr-4.x-MacOSX/solr/build/solr-core/test/J0/./org.apache.solr.cloud.BasicDistributedZkTest-1360862409790/jetty4
[junit4:junit4]   2> 18311 T3519 C195 P52036 oasu.DirectUpdateHandler2.commit end_commit_flush
[junit4:junit4]   2> 18311 T3519 C195 P52036 oasc.CachingDirectoryFactory.close Releasing directory:/Users/jenkins/jenkins-slave/workspace/Lucene-Solr-4.x-MacOSX/solr/build/solr-core/test/J0/./org.apache.solr.cloud.BasicDistributedZkTest-1360862409790/jetty4/index.20130214172028062
[junit4:junit4]   2> 18311 T3519 C195 P52036 oasc.CachingDirectoryFactory.close Releasing directory:/Users/jenkins/jenkins-slave/workspace/Lucene-Solr-4.x-MacOSX/solr/build/solr-core/test/J0/./org.apache.solr.cloud.BasicDistributedZkTest-1360862409790/jetty4/index
[junit4:junit4]   2> 18311 T3519 C195 P52036 oasc.RecoveryStrategy.replay No replay needed. core=collection1
[junit4:junit4]   2> 18311 T3519 C195 P52036 oasc.RecoveryStrategy.doRecovery Replication Recovery was successful - registering as Active. core=collection1
[junit4:junit4]   2> 18311 T3519 C195 P52036 oasc.ZkController.publish publishing core=collection1 state=active
[junit4:junit4]   2> 18311 T3519 C195 P52036 oasc.ZkController.publish numShards not found on descriptor - reading it from system property
[junit4:junit4]   2> 18313 T3519 C195 P52036 oasc.RecoveryStrategy.doRecovery Finished recovery process. core=collection1
[junit4:junit4]   2> 18835 T3450 oascc.ZkStateReader.updateClusterState Updating cloud state from ZooKeeper... 
[junit4:junit4]   2> 18836 T3450 oasc.Overseer$ClusterStateUpdater.updateState Update state numShards=2 message={
[junit4:junit4]   2> 	  "operation":"state",
[junit4:junit4]   2> 	  "numShards":"2",
[junit4:junit4]   2> 	  "shard":"shard2",
[junit4:junit4]   2> 	  "roles":null,
[junit4:junit4]   2> 	  "state":"active",
[junit4:junit4]   2> 	  "core":"collection1",
[junit4:junit4]   2> 	  "collection":"collection1",
[junit4:junit4]   2> 	  "node_name":"127.0.0.1:52036_",
[junit4:junit4]   2> 	  "base_url":"http://127.0.0.1:52036"}
[junit4:junit4]   2> 18842 T3514 oascc.ZkStateReader$2.process A cluster state change: WatchedEvent state:SyncConnected type:NodeDataChanged path:/clusterstate.json, has occurred - updating... (live nodes size: 5)
[junit4:junit4]   2> 18842 T3449 oascc.ZkStateReader$2.process A cluster state change: WatchedEvent state:SyncConnected type:NodeDataChanged path:/clusterstate.json, has occurred - updating... (live nodes size: 5)
[junit4:junit4]   2> 18843 T3468 oascc.ZkStateReader$2.process A cluster state change: WatchedEvent state:SyncConnected type:NodeDataChanged path:/clusterstate.json, has occurred - updating... (live nodes size: 5)
[junit4:junit4]   2> 18843 T3483 oascc.ZkStateReader$2.process A cluster state change: WatchedEvent state:SyncConnected type:NodeDataChanged path:/clusterstate.json, has occurred - updating... (live nodes size: 5)
[junit4:junit4]   2> 18843 T3498 oascc.ZkStateReader$2.process A cluster state change: WatchedEvent state:SyncConnected type:NodeDataChanged path:/clusterstate.json, has occurred - updating... (live nodes size: 5)
[junit4:junit4]   2> 18843 T3455 oascc.ZkStateReader$2.process A cluster state change: WatchedEvent state:SyncConnected type:NodeDataChanged path:/clusterstate.json, has occurred - updating... (live nodes size: 5)
[junit4:junit4]   2> 19262 T3427 oascc.ZkStateReader.updateClusterState Updating cloud state from ZooKeeper... 
[junit4:junit4]   2> 19264 T3427 oasc.AbstractDistribZkTestBase.waitForRecoveriesToFinish Recoveries finished - collection: collection1
[junit4:junit4]   2> ASYNC  NEW_CORE C197 name=collection1 org.apache.solr.core.SolrCore@368515fa url=http://127.0.0.1:52022/collection1 node=127.0.0.1:52022_ C197_STATE=coll:control_collection core:collection1 props:{shard=shard1, roles=null, state=active, core=collection1, collection=control_collection, node_name=127.0.0.1:52022_, base_url=http://127.0.0.1:52022, leader=true}
[junit4:junit4]   2> 19273 T3440 C197 P52022 oasc.CachingDirectoryFactory.close Releasing directory:/Users/jenkins/jenkins-slave/workspace/Lucene-Solr-4.x-MacOSX/solr/build/solr-core/test/J0/./org.apache.solr.cloud.BasicDistributedZkTest-1360862409790/control/data
[junit4:junit4]   2> 19276 T3440 C197 P52022 oasc.SolrDeletionPolicy.onInit SolrDeletionPolicy.onInit: commits:num=1
[junit4:junit4]   2> 		commit{dir=RateLimitedDirectoryWrapper(NRTCachingDirectory(org.apache.lucene.store.NIOFSDirectory@/Users/jenkins/jenkins-slave/workspace/Lucene-Solr-4.x-MacOSX/solr/build/solr-core/test/J0/org.apache.solr.cloud.BasicDistributedZkTest-1360862409790/control/data/index lockFactory=org.apache.lucene.store.NativeFSLockFactory@1eedd202; maxCacheMB=48.0 maxMergeSizeMB=4.0)),segFN=segments_1,generation=1,filenames=[segments_1]
[junit4:junit4]   2> 19278 T3440 C197 P52022 oasc.SolrDeletionPolicy.updateCommits newest commit = 1[segments_1]
[junit4:junit4]   2> 19279 T3440 C197 P52022 oasc.CachingDirectoryFactory.close Releasing directory:/Users/jenkins/jenkins-slave/workspace/Lucene-Solr-4.x-MacOSX/solr/build/solr-core/test/J0/./org.apache.solr.cloud.BasicDistributedZkTest-1360862409790/control/data
[junit4:junit4]   2> 19279 T3440 C197 P52022 oass.SolrIndexSearcher.<init> Opening Searcher@351020b4 realtime
[junit4:junit4]   2> 19280 T3440 C197 P52022 /update {wt=javabin&version=2} {deleteByQuery=*:* (-1426967682407727104)} 0 9
[junit4:junit4]   2> 19288 T3475 C196 P52029 oasc.CachingDirectoryFactory.close Releasing directory:/Users/jenkins/jenkins-slave/workspace/Lucene-Solr-4.x-MacOSX/solr/build/solr-core/test/J0/./org.apache.solr.cloud.BasicDistributedZkTest-1360862409790/jetty2
[junit4:junit4]   2> 19295 T3463 C194 P52026 oasc.CachingDirectoryFactory.close Releasing directory:/Users/jenkins/jenkins-slave/workspace/Lucene-Solr-4.x-MacOSX/solr/build/solr-core/test/J0/./org.apache.solr.cloud.BasicDistributedZkTest-1360862409790/jetty1
[junit4:junit4]   2>  C195_STATE=coll:collection1 core:collection1 props:{shard=shard2, roles=null, state=active, core=collection1, collection=collection1, node_name=127.0.0.1:52036_, base_url=http://127.0.0.1:52036}
[junit4:junit4]   2> 19303 T3510 C195 P52036 oasc.CachingDirectoryFactory.close Releasing directory:/Users/jenkins/jenkins-slave/workspace/Lucene-Solr-4.x-MacOSX/solr/build/solr-core/test/J0/./org.apache.solr.cloud.BasicDistributedZkTest-1360862409790/jetty4
[junit4:junit4]   2> 19304 T3510 C195 P52036 /update {update.distrib=FROMLEADER&_version_=-1426967682424504320&update.from=http://127.0.0.1:52029/collection1/&wt=javabin&version=2} {deleteByQuery=*:* (-1426967682424504320)} 0 4
[junit4:junit4]   2>  C193_STATE=coll:collection1 core:collection1 props:{shard=shard1, roles=null, state=active, core=collection1, collection=collection1, node_name=127.0.0.1:52032_, base_url=http://127.0.0.1:52032}
[junit4:junit4]   2> 19309 T3494 C193 P52032 oasc.CachingDirectoryFactory.close Releasing directory:/Users/jenkins/jenkins-slave/workspace/Lucene-Solr-4.x-MacOSX/solr/build/solr-core/test/J0/./org.apache.solr.cloud.BasicDistributedZkTest-1360862409790/jetty3
[junit4:junit4]   2> 19311 T3494 C193 P52032 /update {update.distrib=FROMLEADER&_version_=-1426967682430795776&update.from=http://127.0.0.1:52026/collection1/&wt=javabin&version=2} {deleteByQuery=*:* (-1426967682430795776)} 0 4
[junit4:junit4]   2> 19312 T3463 C194 P52026 /update {update.distrib=TOLEADER&wt=javabin&version=2} {deleteByQuery=*:* (-1426967682430795776)} 0 19
[junit4:junit4]   2> 19312 T3475 C196 P52029 /update {wt=javabin&version=2} {deleteByQuery=*:* (-1426967682424504320)} 0 26
[junit4:junit4]   2> 19322 T3442 C197 P52022 /update {wt=javabin&version=2} {add=[1 (1426967682458058752)]} 0 3
[junit4:junit4]   2> 19331 T3489 C193 P52032 /update {distrib.from=http://127.0.0.1:52026/collection1/&update.distrib=FROMLEADER&wt=javabin&version=2} {add=[1 (1426967682464350208)]} 0 2
[junit4:junit4]   2> 19332 T3464 C194 P52026 /update {wt=javabin&version=2} {add=[1 (1426967682464350208)]} 0 8
[junit4:junit4]   2> 19345 T3443 C197 P52022 /update {wt=javabin&version=2} {add=[2 (1426967682484273152)]} 0 2
[junit4:junit4]   2> 19355 T3505 C195 P52036 /update {distrib.from=http://127.0.0.1:52029/collection1/&update.distrib=FROMLEADER&wt=javabin&version=2} {add=[2 (1426967682

[...truncated too long message...]

ng.rules.SystemPropertiesRestoreRule$1.evaluate(SystemPropertiesRestoreRule.java:53)
[junit4:junit4]    > 	at org.apache.lucene.util.AbstractBeforeAfterRule$1.evaluate(AbstractBeforeAfterRule.java:46)
[junit4:junit4]    > 	at org.apache.lucene.util.TestRuleStoreClassName$1.evaluate(TestRuleStoreClassName.java:42)
[junit4:junit4]    > 	at com.carrotsearch.randomizedtesting.rules.SystemPropertiesInvariantRule$1.evaluate(SystemPropertiesInvariantRule.java:55)
[junit4:junit4]    > 	at com.carrotsearch.randomizedtesting.rules.NoShadowingOrOverridesOnMethodsRule$1.evaluate(NoShadowingOrOverridesOnMethodsRule.java:39)
[junit4:junit4]    > 	at com.carrotsearch.randomizedtesting.rules.NoShadowingOrOverridesOnMethodsRule$1.evaluate(NoShadowingOrOverridesOnMethodsRule.java:39)
[junit4:junit4]    > 	at com.carrotsearch.randomizedtesting.rules.StatementAdapter.evaluate(StatementAdapter.java:36)
[junit4:junit4]    > 	at org.apache.lucene.util.TestRuleAssertionsRequired$1.evaluate(TestRuleAssertionsRequired.java:43)
[junit4:junit4]    > 	at org.apache.lucene.util.TestRuleMarkFailure$1.evaluate(TestRuleMarkFailure.java:48)
[junit4:junit4]    > 	at org.apache.lucene.util.TestRuleIgnoreAfterMaxFailures$1.evaluate(TestRuleIgnoreAfterMaxFailures.java:70)
[junit4:junit4]    > 	at org.apache.lucene.util.TestRuleIgnoreTestSuites$1.evaluate(TestRuleIgnoreTestSuites.java:55)
[junit4:junit4]    > 	at com.carrotsearch.randomizedtesting.rules.StatementAdapter.evaluate(StatementAdapter.java:36)
[junit4:junit4]    > 	at com.carrotsearch.randomizedtesting.ThreadLeakControl$StatementRunner.run(ThreadLeakControl.java:358)
[junit4:junit4]    > 	at java.lang.Thread.run(Thread.java:722)
[junit4:junit4]    > Caused by: java.net.SocketException: Invalid argument
[junit4:junit4]    > 	at java.net.SocketInputStream.socketRead0(Native Method)
[junit4:junit4]    > 	at java.net.SocketInputStream.read(SocketInputStream.java:150)
[junit4:junit4]    > 	at java.net.SocketInputStream.read(SocketInputStream.java:121)
[junit4:junit4]    > 	at org.apache.http.impl.io.AbstractSessionInputBuffer.fillBuffer(AbstractSessionInputBuffer.java:166)
[junit4:junit4]    > 	at org.apache.http.impl.io.SocketInputBuffer.fillBuffer(SocketInputBuffer.java:90)
[junit4:junit4]    > 	at org.apache.http.impl.io.AbstractSessionInputBuffer.readLine(AbstractSessionInputBuffer.java:281)
[junit4:junit4]    > 	at org.apache.http.impl.conn.DefaultHttpResponseParser.parseHead(DefaultHttpResponseParser.java:92)
[junit4:junit4]    > 	at org.apache.http.impl.conn.DefaultHttpResponseParser.parseHead(DefaultHttpResponseParser.java:62)
[junit4:junit4]    > 	at org.apache.http.impl.io.AbstractMessageParser.parse(AbstractMessageParser.java:254)
[junit4:junit4]    > 	at org.apache.http.impl.AbstractHttpClientConnection.receiveResponseHeader(AbstractHttpClientConnection.java:289)
[junit4:junit4]    > 	at org.apache.http.impl.conn.DefaultClientConnection.receiveResponseHeader(DefaultClientConnection.java:252)
[junit4:junit4]    > 	at org.apache.http.impl.conn.ManagedClientConnectionImpl.receiveResponseHeader(ManagedClientConnectionImpl.java:191)
[junit4:junit4]    > 	at org.apache.http.protocol.HttpRequestExecutor.doReceiveResponse(HttpRequestExecutor.java:300)
[junit4:junit4]    > 	at org.apache.http.protocol.HttpRequestExecutor.execute(HttpRequestExecutor.java:127)
[junit4:junit4]    > 	at org.apache.http.impl.client.DefaultRequestDirector.tryExecute(DefaultRequestDirector.java:717)
[junit4:junit4]    > 	at org.apache.http.impl.client.DefaultRequestDirector.execute(DefaultRequestDirector.java:522)
[junit4:junit4]    > 	at org.apache.http.impl.client.AbstractHttpClient.execute(AbstractHttpClient.java:906)
[junit4:junit4]    > 	at org.apache.http.impl.client.AbstractHttpClient.execute(AbstractHttpClient.java:805)
[junit4:junit4]    > 	at org.apache.http.impl.client.AbstractHttpClient.execute(AbstractHttpClient.java:784)
[junit4:junit4]    > 	at org.apache.solr.client.solrj.impl.HttpSolrServer.request(HttpSolrServer.java:353)
[junit4:junit4]    > 	... 47 more
[junit4:junit4]   2> 784611 T3427 oas.SolrTestCaseJ4.deleteCore ###deleteCore
[junit4:junit4]   2> NOTE: test params are: codec=Lucene42: {n_f1=PostingsFormat(name=SimpleText), foo_b=PostingsFormat(name=MockSep), foo_d=MockVariableIntBlock(baseBlockSize=87), foo_f=PostingsFormat(name=MockSep), n_tl1=PostingsFormat(name=SimpleText), n_d1=PostingsFormat(name=TestBloomFilteredLucene41Postings), rnd_b=MockVariableIntBlock(baseBlockSize=87), intDefault=PostingsFormat(name=TestBloomFilteredLucene41Postings), n_td1=PostingsFormat(name=SimpleText), timestamp=PostingsFormat(name=TestBloomFilteredLucene41Postings), id=MockVariableIntBlock(baseBlockSize=87), range_facet_sl=PostingsFormat(name=MockSep), range_facet_si=PostingsFormat(name=SimpleText), oddField_s=PostingsFormat(name=MockSep), foo_i=PostingsFormat(name=SimpleText), multiDefault=PostingsFormat(name=SimpleText), n_tf1=PostingsFormat(name=TestBloomFilteredLucene41Postings), n_dt1=PostingsFormat(name=SimpleText), n_ti1=MockVariableIntBlock(baseBlockSize=87), range_facet_l=PostingsFormat(name=TestBloomFilteredLucene41Postings), text=PostingsFormat(name=MockSep), _version_=PostingsFormat(name=TestBloomFilteredLucene41Postings), val_i=MockVariableIntBlock(baseBlockSize=87), SubjectTerms_mfacet=PostingsFormat(name=TestBloomFilteredLucene41Postings), a_t=PostingsFormat(name=TestBloomFilteredLucene41Postings), n_tdt1=PostingsFormat(name=TestBloomFilteredLucene41Postings), other_tl1=PostingsFormat(name=TestBloomFilteredLucene41Postings), n_l1=PostingsFormat(name=TestBloomFilteredLucene41Postings), a_si=PostingsFormat(name=SimpleText)}, docValues:{}, sim=DefaultSimilarity, locale=en_IN, timezone=Etc/Universal
[junit4:junit4]   2> NOTE: Mac OS X 10.8.2 x86_64/Oracle Corporation 1.7.0_10 (64-bit)/cpus=2,threads=1,free=378471968,total=519438336
[junit4:junit4]   2> NOTE: All tests run in this JVM: [EchoParamsTest, UUIDFieldTest, SOLR749Test, OpenExchangeRatesOrgProviderTest, ConvertedLegacyTest, TestFunctionQuery, TestCSVLoader, TestZkChroot, TestComponentsName, BadComponentTest, IndexBasedSpellCheckerTest, AutoCommitTest, ResponseLogComponentTest, TestLuceneMatchVersion, PluginInfoTest, TestNumberUtils, XsltUpdateRequestHandlerTest, SpellCheckCollatorTest, QueryElevationComponentTest, DistributedSpellCheckComponentTest, TestRTGBase, RecoveryZkTest, TestSolr4Spatial, TestValueSourceCache, BasicZkTest, SignatureUpdateProcessorFactoryTest, TestReplicationHandler, TestLFUCache, DistanceFunctionTest, ZkNodePropsTest, TestIndexingPerformance, DisMaxRequestHandlerTest, TestSolrQueryParser, TestQueryTypes, TestStressRecovery, OutputWriterTest, CoreAdminHandlerTest, TestIBSimilarityFactory, DebugComponentTest, TestWriterPerf, LukeRequestHandlerTest, ExternalFileFieldSortTest, TestPropInjectDefaults, QueryEqualityTest, PrimitiveFieldTypeTest, ChaosMonkeySafeLeaderTest, DirectUpdateHandlerOptimizeTest, AlternateDirectoryTest, LeaderElectionIntegrationTest, TestQueryUtils, TestOmitPositions, TestBinaryField, TestIndexSearcher, SpatialFilterTest, TestFaceting, TestAnalyzedSuggestions, MinimalSchemaTest, DistributedQueryElevationComponentTest, ZkSolrClientTest, TestTrie, TermVectorComponentDistributedTest, DateFieldTest, ResourceLoaderTest, DirectUpdateHandlerTest, SuggesterWFSTTest, SortByFunctionTest, TestCharFilters, TestBinaryResponseWriter, PreAnalyzedFieldTest, TestPerFieldSimilarity, TestConfig, PeerSyncTest, FastVectorHighlighterTest, CSVRequestHandlerTest, DOMUtilTest, TestReload, TestCSVResponseWriter, JSONWriterTest, DocumentBuilderTest, TestPhraseSuggestions, OverseerCollectionProcessorTest, TestStressReorder, StatsComponentTest, TestStressLucene, TestRecovery, TestSolrCoreProperties, NumericFieldsTest, TestExtendedDismaxParser, TestJmxMonitoredMap, TimeZoneUtilsTest, TestQuerySenderNoQuery, SoftAutoCommitTest, ClusterStateUpdateTest, BasicFunctionalityTest, TestDistributedSearch, TestReversedWildcardFilterFactory, TestSolrDeletionPolicy2, TestSystemIdResolver, FullSolrCloudDistribCmdsTest, ChaosMonkeyNothingIsSafeTest, XmlUpdateRequestHandlerTest, TestXIncludeConfig, TestGroupingSearch, TestSolrIndexConfig, FieldAnalysisRequestHandlerTest, SchemaVersionSpecificBehaviorTest, TestCollationKeyRangeQueries, TestSolrXMLSerializer, TestCodecSupport, SolrRequestParserTest, TestFiltering, HighlighterTest, SuggesterFSTTest, OverseerTest, TestSuggestSpellingConverter, TestAtomicUpdateErrorCases, CurrencyFieldTest, JsonLoaderTest, TestFuzzyAnalyzedSuggestions, LegacyHTMLStripCharFilterTest, DocumentAnalysisRequestHandlerTest, TestRemoteStreaming, BasicDistributedZkTest]
[junit4:junit4] Completed in 784.86s, 1 test, 1 error <<< FAILURES!

[...truncated 384 lines...]
BUILD FAILED
/Users/jenkins/jenkins-slave/workspace/Lucene-Solr-4.x-MacOSX/build.xml:381: The following error occurred while executing this line:
/Users/jenkins/jenkins-slave/workspace/Lucene-Solr-4.x-MacOSX/build.xml:361: The following error occurred while executing this line:
/Users/jenkins/jenkins-slave/workspace/Lucene-Solr-4.x-MacOSX/build.xml:39: The following error occurred while executing this line:
/Users/jenkins/jenkins-slave/workspace/Lucene-Solr-4.x-MacOSX/solr/build.xml:183: The following error occurred while executing this line:
/Users/jenkins/jenkins-slave/workspace/Lucene-Solr-4.x-MacOSX/solr/common-build.xml:447: The following error occurred while executing this line:
/Users/jenkins/jenkins-slave/workspace/Lucene-Solr-4.x-MacOSX/lucene/common-build.xml:1202: The following error occurred while executing this line:
/Users/jenkins/jenkins-slave/workspace/Lucene-Solr-4.x-MacOSX/lucene/common-build.xml:865: There were test failures: 251 suites, 1043 tests, 1 error, 13 ignored (2 assumptions)

Total time: 74 minutes 32 seconds
Build step 'Invoke Ant' marked build as failure
Archiving artifacts
Recording test results
Description set: Java: 64bit/jdk1.7.0 -XX:+UseConcMarkSweepGC
Email was triggered for: Failure
Sending email for trigger: Failure



Mime
View raw message