lucene-dev mailing list archives

Site index · List index
Message view « Date » · « Thread »
Top « Date » · « Thread »
From Apache Jenkins Server <jenk...@builds.apache.org>
Subject [JENKINS] Lucene-Solr-Tests-trunk-java7 - Build # 3708 - Still Failing
Date Mon, 04 Feb 2013 23:26:43 GMT
Build: https://builds.apache.org/job/Lucene-Solr-Tests-trunk-java7/3708/

1 tests failed.
FAILED:  org.apache.solr.cloud.BasicDistributedZkTest.testDistribSearch

Error Message:
Captured an uncaught exception in thread: Thread[id=935, name=testExecutor-345-thread-1, state=RUNNABLE, group=TGRP-BasicDistributedZkTest]

Stack Trace:
com.carrotsearch.randomizedtesting.UncaughtExceptionError: Captured an uncaught exception in thread: Thread[id=935, name=testExecutor-345-thread-1, state=RUNNABLE, group=TGRP-BasicDistributedZkTest]
Caused by: java.lang.RuntimeException: org.apache.solr.client.solrj.SolrServerException: Timeout occured while waiting response from server at: http://127.0.0.1:30255/sp_ffw/f
	at __randomizedtesting.SeedInfo.seed([715CCD8973136CF0]:0)
	at org.apache.solr.cloud.BasicDistributedZkTest$1.run(BasicDistributedZkTest.java:658)
	at java.util.concurrent.ThreadPoolExecutor.runWorker(ThreadPoolExecutor.java:1110)
	at java.util.concurrent.ThreadPoolExecutor$Worker.run(ThreadPoolExecutor.java:603)
	at java.lang.Thread.run(Thread.java:722)
Caused by: org.apache.solr.client.solrj.SolrServerException: Timeout occured while waiting response from server at: http://127.0.0.1:30255/sp_ffw/f
	at org.apache.solr.client.solrj.impl.HttpSolrServer.request(HttpSolrServer.java:412)
	at org.apache.solr.client.solrj.impl.HttpSolrServer.request(HttpSolrServer.java:181)
	at org.apache.solr.cloud.BasicDistributedZkTest$1.run(BasicDistributedZkTest.java:656)
	... 3 more
Caused by: java.net.SocketTimeoutException: Read timed out
	at java.net.SocketInputStream.socketRead0(Native Method)
	at java.net.SocketInputStream.read(SocketInputStream.java:150)
	at java.net.SocketInputStream.read(SocketInputStream.java:121)
	at org.apache.http.impl.io.AbstractSessionInputBuffer.fillBuffer(AbstractSessionInputBuffer.java:149)
	at org.apache.http.impl.io.SocketInputBuffer.fillBuffer(SocketInputBuffer.java:111)
	at org.apache.http.impl.io.AbstractSessionInputBuffer.readLine(AbstractSessionInputBuffer.java:264)
	at org.apache.http.impl.conn.DefaultResponseParser.parseHead(DefaultResponseParser.java:98)
	at org.apache.http.impl.io.AbstractMessageParser.parse(AbstractMessageParser.java:252)
	at org.apache.http.impl.AbstractHttpClientConnection.receiveResponseHeader(AbstractHttpClientConnection.java:282)
	at org.apache.http.impl.conn.DefaultClientConnection.receiveResponseHeader(DefaultClientConnection.java:247)
	at org.apache.http.impl.conn.AbstractClientConnAdapter.receiveResponseHeader(AbstractClientConnAdapter.java:216)
	at org.apache.http.protocol.HttpRequestExecutor.doReceiveResponse(HttpRequestExecutor.java:298)
	at org.apache.http.protocol.HttpRequestExecutor.execute(HttpRequestExecutor.java:125)
	at org.apache.http.impl.client.DefaultRequestDirector.tryExecute(DefaultRequestDirector.java:647)
	at org.apache.http.impl.client.DefaultRequestDirector.execute(DefaultRequestDirector.java:464)
	at org.apache.http.impl.client.AbstractHttpClient.execute(AbstractHttpClient.java:820)
	at org.apache.http.impl.client.AbstractHttpClient.execute(AbstractHttpClient.java:754)
	at org.apache.http.impl.client.AbstractHttpClient.execute(AbstractHttpClient.java:732)
	at org.apache.solr.client.solrj.impl.HttpSolrServer.request(HttpSolrServer.java:353)
	... 5 more




Build Log:
[...truncated 8817 lines...]
[junit4:junit4] Suite: org.apache.solr.cloud.BasicDistributedZkTest
[junit4:junit4]   2> 0 T428 oas.BaseDistributedSearchTestCase.initHostContext Setting hostContext system property: /sp_ffw/f
[junit4:junit4]   2> 4 T428 oas.SolrTestCaseJ4.setUp ###Starting testDistribSearch
[junit4:junit4]   2> Creating dataDir: /usr/home/hudson/hudson-slave/workspace/Lucene-Solr-Tests-trunk-java7/solr/build/solr-core/test/J0/./solrtest-BasicDistributedZkTest-1360019516837
[junit4:junit4]   2> 11 T428 oasc.ZkTestServer.run STARTING ZK TEST SERVER
[junit4:junit4]   2> 15 T429 oasc.ZkTestServer$ZKServerMain.runFromConfig Starting server
[junit4:junit4]   2> 73 T429 oaz.Environment.logEnv Server environment:zookeeper.version=3.4.5-1392090, built on 09/30/2012 17:52 GMT
[junit4:junit4]   2> 74 T429 oaz.Environment.logEnv Server environment:host.name=lucene.zones.apache.org
[junit4:junit4]   2> 74 T429 oaz.Environment.logEnv Server environment:java.version=1.7.0_09
[junit4:junit4]   2> 74 T429 oaz.Environment.logEnv Server environment:java.vendor=Oracle Corporation
[junit4:junit4]   2> 74 T429 oaz.Environment.logEnv Server environment:java.home=/usr/local/openjdk7/jre
[junit4:junit4]   2> 74 T429 oaz.Environment.logEnv Server environment:java.class.path=/usr/home/hudson/hudson-slave/workspace/Lucene-Solr-Tests-trunk-java7/solr/build/solr-core/classes/test:/usr/home/hudson/hudson-slave/workspace/Lucene-Solr-Tests-trunk-java7/solr/build/solr-test-framework/classes/java:/usr/home/hudson/hudson-slave/workspace/Lucene-Solr-Tests-trunk-java7/solr/build/solr-core/test-files:/usr/home/hudson/hudson-slave/workspace/Lucene-Solr-Tests-trunk-java7/lucene/build/test-framework/classes/java:/usr/home/hudson/hudson-slave/workspace/Lucene-Solr-Tests-trunk-java7/lucene/build/codecs/classes/java:/usr/home/hudson/hudson-slave/workspace/Lucene-Solr-Tests-trunk-java7/solr/build/solr-solrj/classes/java:/usr/home/hudson/hudson-slave/workspace/Lucene-Solr-Tests-trunk-java7/solr/build/solr-core/classes/java:/usr/home/hudson/hudson-slave/workspace/Lucene-Solr-Tests-trunk-java7/lucene/build/analysis/common/lucene-analyzers-common-5.0-SNAPSHOT.jar:/usr/home/hudson/hudson-slave/workspace/Lucene-Solr-Tests-trunk-java7/lucene/build/analysis/kuromoji/lucene-analyzers-kuromoji-5.0-SNAPSHOT.jar:/usr/home/hudson/hudson-slave/workspace/Lucene-Solr-Tests-trunk-java7/lucene/build/analysis/phonetic/lucene-analyzers-phonetic-5.0-SNAPSHOT.jar:/usr/home/hudson/hudson-slave/workspace/Lucene-Solr-Tests-trunk-java7/lucene/build/highlighter/lucene-highlighter-5.0-SNAPSHOT.jar:/usr/home/hudson/hudson-slave/workspace/Lucene-Solr-Tests-trunk-java7/lucene/build/memory/lucene-memory-5.0-SNAPSHOT.jar:/usr/home/hudson/hudson-slave/workspace/Lucene-Solr-Tests-trunk-java7/lucene/build/misc/lucene-misc-5.0-SNAPSHOT.jar:/usr/home/hudson/hudson-slave/workspace/Lucene-Solr-Tests-trunk-java7/lucene/build/spatial/lucene-spatial-5.0-SNAPSHOT.jar:/usr/home/hudson/hudson-slave/workspace/Lucene-Solr-Tests-trunk-java7/lucene/build/suggest/lucene-suggest-5.0-SNAPSHOT.jar:/usr/home/hudson/hudson-slave/workspace/Lucene-Solr-Tests-trunk-java7/lucene/build/grouping/lucene-grouping-5.0-SNAPSHOT.jar:/usr/home/hudson/hudson-slave/workspace/Lucene-Solr-Tests-trunk-java7/lucene/build/queries/lucene-queries-5.0-SNAPSHOT.jar:/usr/home/hudson/hudson-slave/workspace/Lucene-Solr-Tests-trunk-java7/lucene/build/queryparser/lucene-queryparser-5.0-SNAPSHOT.jar:/usr/home/hudson/hudson-slave/workspace/Lucene-Solr-Tests-trunk-java7/solr/core/lib/cglib-nodep-2.2.jar:/usr/home/hudson/hudson-slave/workspace/Lucene-Solr-Tests-trunk-java7/solr/core/lib/commons-cli-1.2.jar:/usr/home/hudson/hudson-slave/workspace/Lucene-Solr-Tests-trunk-java7/solr/core/lib/commons-codec-1.7.jar:/usr/home/hudson/hudson-slave/workspace/Lucene-Solr-Tests-trunk-java7/solr/core/lib/commons-fileupload-1.2.1.jar:/usr/home/hudson/hudson-slave/workspace/Lucene-Solr-Tests-trunk-java7/solr/core/lib/commons-lang-2.6.jar:/usr/home/hudson/hudson-slave/workspace/Lucene-Solr-Tests-trunk-java7/solr/core/lib/easymock-3.0.jar:/usr/home/hudson/hudson-slave/workspace/Lucene-Solr-Tests-trunk-java7/solr/core/lib/guava-13.0.1.jar:/usr/home/hudson/hudson-slave/workspace/Lucene-Solr-Tests-trunk-java7/solr/core/lib/javax.servlet-api-3.0.1.jar:/usr/home/hudson/hudson-slave/workspace/Lucene-Solr-Tests-trunk-java7/solr/core/lib/objenesis-1.2.jar:/usr/home/hudson/hudson-slave/workspace/Lucene-Solr-Tests-trunk-java7/solr/core/lib/spatial4j-0.3.jar:/usr/home/hudson/hudson-slave/workspace/Lucene-Solr-Tests-trunk-java7/solr/solrj/lib/commons-io-2.1.jar:/usr/home/hudson/hudson-slave/workspace/Lucene-Solr-Tests-trunk-java7/solr/solrj/lib/httpclient-4.1.3.jar:/usr/home/hudson/hudson-slave/workspace/Lucene-Solr-Tests-trunk-java7/solr/solrj/lib/httpcore-4.1.4.jar:/usr/home/hudson/hudson-slave/workspace/Lucene-Solr-Tests-trunk-java7/solr/solrj/lib/httpmime-4.1.3.jar:/usr/home/hudson/hudson-slave/workspace/Lucene-Solr-Tests-trunk-java7/solr/solrj/lib/jcl-over-slf4j-1.6.4.jar:/usr/home/hudson/hudson-slave/workspace/Lucene-Solr-Tests-trunk-java7/solr/solrj/lib/slf4j-api-1.6.4.jar:/usr/home/hudson/hudson-slave/workspace/Lucene-Solr-Tests-trunk-java7/solr/solrj/lib/slf4j-jdk14-1.6.4.jar:/usr/home/hudson/hudson-slave/workspace/Lucene-Solr-Tests-trunk-java7/solr/solrj/lib/wstx-asl-3.2.7.jar:/usr/home/hudson/hudson-slave/workspace/Lucene-Solr-Tests-trunk-java7/solr/solrj/lib/zookeeper-3.4.5.jar:/usr/home/hudson/hudson-slave/workspace/Lucene-Solr-Tests-trunk-java7/solr/example/lib/jetty-continuation-8.1.8.v20121106.jar:/usr/home/hudson/hudson-slave/workspace/Lucene-Solr-Tests-trunk-java7/solr/example/lib/jetty-deploy-8.1.8.v20121106.jar:/usr/home/hudson/hudson-slave/workspace/Lucene-Solr-Tests-trunk-java7/solr/example/lib/jetty-http-8.1.8.v20121106.jar:/usr/home/hudson/hudson-slave/workspace/Lucene-Solr-Tests-trunk-java7/solr/example/lib/jetty-io-8.1.8.v20121106.jar:/usr/home/hudson/hudson-slave/workspace/Lucene-Solr-Tests-trunk-java7/solr/example/lib/jetty-jmx-8.1.8.v20121106.jar:/usr/home/hudson/hudson-slave/workspace/Lucene-Solr-Tests-trunk-java7/solr/example/lib/jetty-security-8.1.8.v20121106.jar:/usr/home/hudson/hudson-slave/workspace/Lucene-Solr-Tests-trunk-java7/solr/example/lib/jetty-server-8.1.8.v20121106.jar:/usr/home/hudson/hudson-slave/workspace/Lucene-Solr-Tests-trunk-java7/solr/example/lib/jetty-servlet-8.1.8.v20121106.jar:/usr/home/hudson/hudson-slave/workspace/Lucene-Solr-Tests-trunk-java7/solr/example/lib/jetty-util-8.1.8.v20121106.jar:/usr/home/hudson/hudson-slave/workspace/Lucene-Solr-Tests-trunk-java7/solr/example/lib/jetty-webapp-8.1.8.v20121106.jar:/usr/home/hudson/hudson-slave/workspace/Lucene-Solr-Tests-trunk-java7/solr/example/lib/jetty-xml-8.1.8.v20121106.jar:/usr/home/hudson/hudson-slave/workspace/Lucene-Solr-Tests-trunk-java7/solr/example/lib/servlet-api-3.0.jar:/usr/home/hudson/hudson-slave/workspace/Lucene-Solr-Tests-trunk-java7/solr/example/example-DIH/solr/db/lib/derby-10.9.1.0.jar:/usr/home/hudson/hudson-slave/workspace/Lucene-Solr-Tests-trunk-java7/solr/example/example-DIH/solr/db/lib/hsqldb-1.8.0.10.jar:/usr/home/hudson/hudson-slave/workspace/Lucene-Solr-Tests-trunk-java7/lucene/build/core/classes/java:/usr/home/hudson/hudson-slave/workspace/Lucene-Solr-Tests-trunk-java7/lucene/test-framework/lib/junit-4.10.jar:/usr/home/hudson/hudson-slave/workspace/Lucene-Solr-Tests-trunk-java7/lucene/test-framework/lib/randomizedtesting-runner-2.0.8.jar:/home/hudson/hudson-slave/tools/hudson.tasks.Ant_AntInstallation/ant-1.8.2/lib/ant-launcher.jar:/home/hudson/.ant/lib/ivy-2.2.0.jar:/home/hudson/hudson-slave/tools/hudson.tasks.Ant_AntInstallation/ant-1.8.2/lib/ant-commons-logging.jar:/home/hudson/hudson-slave/tools/hudson.tasks.Ant_AntInstallation/ant-1.8.2/lib/ant-apache-regexp.jar:/home/hudson/hudson-slave/tools/hudson.tasks.Ant_AntInstallation/ant-1.8.2/lib/ant-apache-oro.jar:/home/hudson/hudson-slave/tools/hudson.tasks.Ant_AntInstallation/ant-1.8.2/lib/ant-swing.jar:/home/hudson/hudson-slave/tools/hudson.tasks.Ant_AntInstallation/ant-1.8.2/lib/ant-jdepend.jar:/home/hudson/hudson-slave/tools/hudson.tasks.Ant_AntInstallation/ant-1.8.2/lib/ant-apache-xalan2.jar:/home/hudson/hudson-slave/tools/hudson.tasks.Ant_AntInstallation/ant-1.8.2/lib/ant-apache-bsf.jar:/home/hudson/hudson-slave/tools/hudson.tasks.Ant_AntInstallation/ant-1.8.2/lib/ant-junit4.jar:/home/hudson/hudson-slave/tools/hudson.tasks.Ant_AntInstallation/ant-1.8.2/lib/ant-commons-net.jar:/home/hudson/hudson-slave/tools/hudson.tasks.Ant_AntInstallation/ant-1.8.2/lib/ant-antlr.jar:/home/hudson/hudson-slave/tools/hudson.tasks.Ant_AntInstallation/ant-1.8.2/lib/ant-junit.jar:/home/hudson/hudson-slave/tools/hudson.tasks.Ant_AntInstallation/ant-1.8.2/lib/ant-jmf.jar:/home/hudson/hudson-slave/tools/hudson.tasks.Ant_AntInstallation/ant-1.8.2/lib/ant-netrexx.jar:/home/hudson/hudson-slave/tools/hudson.tasks.Ant_AntInstallation/ant-1.8.2/lib/ant-apache-log4j.jar:/home/hudson/hudson-slave/tools/hudson.tasks.Ant_AntInstallation/ant-1.8.2/lib/ant-apache-resolver.jar:/home/hudson/hudson-slave/tools/hudson.tasks.Ant_AntInstallation/ant-1.8.2/lib/ant.jar:/home/hudson/hudson-slave/tools/hudson.tasks.Ant_AntInstallation/ant-1.8.2/lib/ant-jsch.jar:/home/hudson/hudson-slave/tools/hudson.tasks.Ant_AntInstallation/ant-1.8.2/lib/ant-testutil.jar:/home/hudson/hudson-slave/tools/hudson.tasks.Ant_AntInstallation/ant-1.8.2/lib/ant-apache-bcel.jar:/home/hudson/hudson-slave/tools/hudson.tasks.Ant_AntInstallation/ant-1.8.2/lib/ant-jai.jar:/home/hudson/hudson-slave/tools/hudson.tasks.Ant_AntInstallation/ant-1.8.2/lib/ant-javamail.jar:/usr/local/openjdk7/lib/tools.jar:/home/hudson/.ivy2/cache/com.carrotsearch.randomizedtesting/junit4-ant/jars/junit4-ant-2.0.8.jar
[junit4:junit4]   2> 75 T429 oaz.Environment.logEnv Server environment:java.library.path=/usr/local/openjdk7/jre/lib/amd64/server:/usr/local/openjdk7/jre/lib/amd64:/usr/local/openjdk7/jre/../lib/amd64:/usr/local/openjdk6/jre/lib/amd64/server:/usr/local/openjdk6/jre/lib/amd64:/usr/local/openjdk6/jre/../lib/amd64:/usr/java/packages/lib/amd64:/lib:/usr/lib:/usr/local/lib
[junit4:junit4]   2> 75 T429 oaz.Environment.logEnv Server environment:java.io.tmpdir=.
[junit4:junit4]   2> 75 T429 oaz.Environment.logEnv Server environment:java.compiler=<NA>
[junit4:junit4]   2> 75 T429 oaz.Environment.logEnv Server environment:os.name=FreeBSD
[junit4:junit4]   2> 75 T429 oaz.Environment.logEnv Server environment:os.arch=amd64
[junit4:junit4]   2> 76 T429 oaz.Environment.logEnv Server environment:os.version=9.0-RELEASE
[junit4:junit4]   2> 76 T429 oaz.Environment.logEnv Server environment:user.name=hudson
[junit4:junit4]   2> 76 T429 oaz.Environment.logEnv Server environment:user.home=/home/hudson
[junit4:junit4]   2> 76 T429 oaz.Environment.logEnv Server environment:user.dir=/usr/home/hudson/hudson-slave/workspace/Lucene-Solr-Tests-trunk-java7/solr/build/solr-core/test/J0
[junit4:junit4]   2> 109 T429 oazs.ZooKeeperServer.setTickTime tickTime set to 1000
[junit4:junit4]   2> 109 T429 oazs.ZooKeeperServer.setMinSessionTimeout minSessionTimeout set to -1
[junit4:junit4]   2> 109 T429 oazs.ZooKeeperServer.setMaxSessionTimeout maxSessionTimeout set to -1
[junit4:junit4]   2> 115 T429 oazs.NIOServerCnxnFactory.configure binding to port 0.0.0.0/0.0.0.0:0
[junit4:junit4]   2> 116 T428 oasc.ZkTestServer.run start zk server on port:45780
[junit4:junit4]   2> 179 T428 oaz.Environment.logEnv Client environment:zookeeper.version=3.4.5-1392090, built on 09/30/2012 17:52 GMT
[junit4:junit4]   2> 180 T428 oaz.Environment.logEnv Client environment:host.name=lucene.zones.apache.org
[junit4:junit4]   2> 180 T428 oaz.Environment.logEnv Client environment:java.version=1.7.0_09
[junit4:junit4]   2> 180 T428 oaz.Environment.logEnv Client environment:java.vendor=Oracle Corporation
[junit4:junit4]   2> 180 T428 oaz.Environment.logEnv Client environment:java.home=/usr/local/openjdk7/jre
[junit4:junit4]   2> 181 T428 oaz.Environment.logEnv Client environment:java.class.path=/usr/home/hudson/hudson-slave/workspace/Lucene-Solr-Tests-trunk-java7/solr/build/solr-core/classes/test:/usr/home/hudson/hudson-slave/workspace/Lucene-Solr-Tests-trunk-java7/solr/build/solr-test-framework/classes/java:/usr/home/hudson/hudson-slave/workspace/Lucene-Solr-Tests-trunk-java7/solr/build/solr-core/test-files:/usr/home/hudson/hudson-slave/workspace/Lucene-Solr-Tests-trunk-java7/lucene/build/test-framework/classes/java:/usr/home/hudson/hudson-slave/workspace/Lucene-Solr-Tests-trunk-java7/lucene/build/codecs/classes/java:/usr/home/hudson/hudson-slave/workspace/Lucene-Solr-Tests-trunk-java7/solr/build/solr-solrj/classes/java:/usr/home/hudson/hudson-slave/workspace/Lucene-Solr-Tests-trunk-java7/solr/build/solr-core/classes/java:/usr/home/hudson/hudson-slave/workspace/Lucene-Solr-Tests-trunk-java7/lucene/build/analysis/common/lucene-analyzers-common-5.0-SNAPSHOT.jar:/usr/home/hudson/hudson-slave/workspace/Lucene-Solr-Tests-trunk-java7/lucene/build/analysis/kuromoji/lucene-analyzers-kuromoji-5.0-SNAPSHOT.jar:/usr/home/hudson/hudson-slave/workspace/Lucene-Solr-Tests-trunk-java7/lucene/build/analysis/phonetic/lucene-analyzers-phonetic-5.0-SNAPSHOT.jar:/usr/home/hudson/hudson-slave/workspace/Lucene-Solr-Tests-trunk-java7/lucene/build/highlighter/lucene-highlighter-5.0-SNAPSHOT.jar:/usr/home/hudson/hudson-slave/workspace/Lucene-Solr-Tests-trunk-java7/lucene/build/memory/lucene-memory-5.0-SNAPSHOT.jar:/usr/home/hudson/hudson-slave/workspace/Lucene-Solr-Tests-trunk-java7/lucene/build/misc/lucene-misc-5.0-SNAPSHOT.jar:/usr/home/hudson/hudson-slave/workspace/Lucene-Solr-Tests-trunk-java7/lucene/build/spatial/lucene-spatial-5.0-SNAPSHOT.jar:/usr/home/hudson/hudson-slave/workspace/Lucene-Solr-Tests-trunk-java7/lucene/build/suggest/lucene-suggest-5.0-SNAPSHOT.jar:/usr/home/hudson/hudson-slave/workspace/Lucene-Solr-Tests-trunk-java7/lucene/build/grouping/lucene-grouping-5.0-SNAPSHOT.jar:/usr/home/hudson/hudson-slave/workspace/Lucene-Solr-Tests-trunk-java7/lucene/build/queries/lucene-queries-5.0-SNAPSHOT.jar:/usr/home/hudson/hudson-slave/workspace/Lucene-Solr-Tests-trunk-java7/lucene/build/queryparser/lucene-queryparser-5.0-SNAPSHOT.jar:/usr/home/hudson/hudson-slave/workspace/Lucene-Solr-Tests-trunk-java7/solr/core/lib/cglib-nodep-2.2.jar:/usr/home/hudson/hudson-slave/workspace/Lucene-Solr-Tests-trunk-java7/solr/core/lib/commons-cli-1.2.jar:/usr/home/hudson/hudson-slave/workspace/Lucene-Solr-Tests-trunk-java7/solr/core/lib/commons-codec-1.7.jar:/usr/home/hudson/hudson-slave/workspace/Lucene-Solr-Tests-trunk-java7/solr/core/lib/commons-fileupload-1.2.1.jar:/usr/home/hudson/hudson-slave/workspace/Lucene-Solr-Tests-trunk-java7/solr/core/lib/commons-lang-2.6.jar:/usr/home/hudson/hudson-slave/workspace/Lucene-Solr-Tests-trunk-java7/solr/core/lib/easymock-3.0.jar:/usr/home/hudson/hudson-slave/workspace/Lucene-Solr-Tests-trunk-java7/solr/core/lib/guava-13.0.1.jar:/usr/home/hudson/hudson-slave/workspace/Lucene-Solr-Tests-trunk-java7/solr/core/lib/javax.servlet-api-3.0.1.jar:/usr/home/hudson/hudson-slave/workspace/Lucene-Solr-Tests-trunk-java7/solr/core/lib/objenesis-1.2.jar:/usr/home/hudson/hudson-slave/workspace/Lucene-Solr-Tests-trunk-java7/solr/core/lib/spatial4j-0.3.jar:/usr/home/hudson/hudson-slave/workspace/Lucene-Solr-Tests-trunk-java7/solr/solrj/lib/commons-io-2.1.jar:/usr/home/hudson/hudson-slave/workspace/Lucene-Solr-Tests-trunk-java7/solr/solrj/lib/httpclient-4.1.3.jar:/usr/home/hudson/hudson-slave/workspace/Lucene-Solr-Tests-trunk-java7/solr/solrj/lib/httpcore-4.1.4.jar:/usr/home/hudson/hudson-slave/workspace/Lucene-Solr-Tests-trunk-java7/solr/solrj/lib/httpmime-4.1.3.jar:/usr/home/hudson/hudson-slave/workspace/Lucene-Solr-Tests-trunk-java7/solr/solrj/lib/jcl-over-slf4j-1.6.4.jar:/usr/home/hudson/hudson-slave/workspace/Lucene-Solr-Tests-trunk-java7/solr/solrj/lib/slf4j-api-1.6.4.jar:/usr/home/hudson/hudson-slave/workspace/Lucene-Solr-Tests-trunk-java7/solr/solrj/lib/slf4j-jdk14-1.6.4.jar:/usr/home/hudson/hudson-slave/workspace/Lucene-Solr-Tests-trunk-java7/solr/solrj/lib/wstx-asl-3.2.7.jar:/usr/home/hudson/hudson-slave/workspace/Lucene-Solr-Tests-trunk-java7/solr/solrj/lib/zookeeper-3.4.5.jar:/usr/home/hudson/hudson-slave/workspace/Lucene-Solr-Tests-trunk-java7/solr/example/lib/jetty-continuation-8.1.8.v20121106.jar:/usr/home/hudson/hudson-slave/workspace/Lucene-Solr-Tests-trunk-java7/solr/example/lib/jetty-deploy-8.1.8.v20121106.jar:/usr/home/hudson/hudson-slave/workspace/Lucene-Solr-Tests-trunk-java7/solr/example/lib/jetty-http-8.1.8.v20121106.jar:/usr/home/hudson/hudson-slave/workspace/Lucene-Solr-Tests-trunk-java7/solr/example/lib/jetty-io-8.1.8.v20121106.jar:/usr/home/hudson/hudson-slave/workspace/Lucene-Solr-Tests-trunk-java7/solr/example/lib/jetty-jmx-8.1.8.v20121106.jar:/usr/home/hudson/hudson-slave/workspace/Lucene-Solr-Tests-trunk-java7/solr/example/lib/jetty-security-8.1.8.v20121106.jar:/usr/home/hudson/hudson-slave/workspace/Lucene-Solr-Tests-trunk-java7/solr/example/lib/jetty-server-8.1.8.v20121106.jar:/usr/home/hudson/hudson-slave/workspace/Lucene-Solr-Tests-trunk-java7/solr/example/lib/jetty-servlet-8.1.8.v20121106.jar:/usr/home/hudson/hudson-slave/workspace/Lucene-Solr-Tests-trunk-java7/solr/example/lib/jetty-util-8.1.8.v20121106.jar:/usr/home/hudson/hudson-slave/workspace/Lucene-Solr-Tests-trunk-java7/solr/example/lib/jetty-webapp-8.1.8.v20121106.jar:/usr/home/hudson/hudson-slave/workspace/Lucene-Solr-Tests-trunk-java7/solr/example/lib/jetty-xml-8.1.8.v20121106.jar:/usr/home/hudson/hudson-slave/workspace/Lucene-Solr-Tests-trunk-java7/solr/example/lib/servlet-api-3.0.jar:/usr/home/hudson/hudson-slave/workspace/Lucene-Solr-Tests-trunk-java7/solr/example/example-DIH/solr/db/lib/derby-10.9.1.0.jar:/usr/home/hudson/hudson-slave/workspace/Lucene-Solr-Tests-trunk-java7/solr/example/example-DIH/solr/db/lib/hsqldb-1.8.0.10.jar:/usr/home/hudson/hudson-slave/workspace/Lucene-Solr-Tests-trunk-java7/lucene/build/core/classes/java:/usr/home/hudson/hudson-slave/workspace/Lucene-Solr-Tests-trunk-java7/lucene/test-framework/lib/junit-4.10.jar:/usr/home/hudson/hudson-slave/workspace/Lucene-Solr-Tests-trunk-java7/lucene/test-framework/lib/randomizedtesting-runner-2.0.8.jar:/home/hudson/hudson-slave/tools/hudson.tasks.Ant_AntInstallation/ant-1.8.2/lib/ant-launcher.jar:/home/hudson/.ant/lib/ivy-2.2.0.jar:/home/hudson/hudson-slave/tools/hudson.tasks.Ant_AntInstallation/ant-1.8.2/lib/ant-commons-logging.jar:/home/hudson/hudson-slave/tools/hudson.tasks.Ant_AntInstallation/ant-1.8.2/lib/ant-apache-regexp.jar:/home/hudson/hudson-slave/tools/hudson.tasks.Ant_AntInstallation/ant-1.8.2/lib/ant-apache-oro.jar:/home/hudson/hudson-slave/tools/hudson.tasks.Ant_AntInstallation/ant-1.8.2/lib/ant-swing.jar:/home/hudson/hudson-slave/tools/hudson.tasks.Ant_AntInstallation/ant-1.8.2/lib/ant-jdepend.jar:/home/hudson/hudson-slave/tools/hudson.tasks.Ant_AntInstallation/ant-1.8.2/lib/ant-apache-xalan2.jar:/home/hudson/hudson-slave/tools/hudson.tasks.Ant_AntInstallation/ant-1.8.2/lib/ant-apache-bsf.jar:/home/hudson/hudson-slave/tools/hudson.tasks.Ant_AntInstallation/ant-1.8.2/lib/ant-junit4.jar:/home/hudson/hudson-slave/tools/hudson.tasks.Ant_AntInstallation/ant-1.8.2/lib/ant-commons-net.jar:/home/hudson/hudson-slave/tools/hudson.tasks.Ant_AntInstallation/ant-1.8.2/lib/ant-antlr.jar:/home/hudson/hudson-slave/tools/hudson.tasks.Ant_AntInstallation/ant-1.8.2/lib/ant-junit.jar:/home/hudson/hudson-slave/tools/hudson.tasks.Ant_AntInstallation/ant-1.8.2/lib/ant-jmf.jar:/home/hudson/hudson-slave/tools/hudson.tasks.Ant_AntInstallation/ant-1.8.2/lib/ant-netrexx.jar:/home/hudson/hudson-slave/tools/hudson.tasks.Ant_AntInstallation/ant-1.8.2/lib/ant-apache-log4j.jar:/home/hudson/hudson-slave/tools/hudson.tasks.Ant_AntInstallation/ant-1.8.2/lib/ant-apache-resolver.jar:/home/hudson/hudson-slave/tools/hudson.tasks.Ant_AntInstallation/ant-1.8.2/lib/ant.jar:/home/hudson/hudson-slave/tools/hudson.tasks.Ant_AntInstallation/ant-1.8.2/lib/ant-jsch.jar:/home/hudson/hudson-slave/tools/hudson.tasks.Ant_AntInstallation/ant-1.8.2/lib/ant-testutil.jar:/home/hudson/hudson-slave/tools/hudson.tasks.Ant_AntInstallation/ant-1.8.2/lib/ant-apache-bcel.jar:/home/hudson/hudson-slave/tools/hudson.tasks.Ant_AntInstallation/ant-1.8.2/lib/ant-jai.jar:/home/hudson/hudson-slave/tools/hudson.tasks.Ant_AntInstallation/ant-1.8.2/lib/ant-javamail.jar:/usr/local/openjdk7/lib/tools.jar:/home/hudson/.ivy2/cache/com.carrotsearch.randomizedtesting/junit4-ant/jars/junit4-ant-2.0.8.jar
[junit4:junit4]   2> 182 T428 oaz.Environment.logEnv Client environment:java.library.path=/usr/local/openjdk7/jre/lib/amd64/server:/usr/local/openjdk7/jre/lib/amd64:/usr/local/openjdk7/jre/../lib/amd64:/usr/local/openjdk6/jre/lib/amd64/server:/usr/local/openjdk6/jre/lib/amd64:/usr/local/openjdk6/jre/../lib/amd64:/usr/java/packages/lib/amd64:/lib:/usr/lib:/usr/local/lib
[junit4:junit4]   2> 182 T428 oaz.Environment.logEnv Client environment:java.io.tmpdir=.
[junit4:junit4]   2> 182 T428 oaz.Environment.logEnv Client environment:java.compiler=<NA>
[junit4:junit4]   2> 183 T429 oazsp.FileTxnSnapLog.save Snapshotting: 0x0 to /usr/home/hudson/hudson-slave/workspace/Lucene-Solr-Tests-trunk-java7/solr/build/solr-core/test/J0/./org.apache.solr.cloud.BasicDistributedZkTest-1360019516837/zookeeper/server1/data/version-2/snapshot.0
[junit4:junit4]   2> 183 T428 oaz.Environment.logEnv Client environment:os.name=FreeBSD
[junit4:junit4]   2> 183 T428 oaz.Environment.logEnv Client environment:os.arch=amd64
[junit4:junit4]   2> 183 T428 oaz.Environment.logEnv Client environment:os.version=9.0-RELEASE
[junit4:junit4]   2> 183 T428 oaz.Environment.logEnv Client environment:user.name=hudson
[junit4:junit4]   2> 184 T428 oaz.Environment.logEnv Client environment:user.home=/home/hudson
[junit4:junit4]   2> 184 T428 oaz.Environment.logEnv Client environment:user.dir=/usr/home/hudson/hudson-slave/workspace/Lucene-Solr-Tests-trunk-java7/solr/build/solr-core/test/J0
[junit4:junit4]   2> 187 T428 oaz.ZooKeeper.<init> Initiating client connection, connectString=127.0.0.1:45780 sessionTimeout=10000 watcher=org.apache.solr.common.cloud.ConnectionManager@b2da32d
[junit4:junit4]   2> 246 T428 oascc.ConnectionManager.waitForConnected Waiting for client to connect to ZooKeeper
[junit4:junit4]   2> 263 T432 oaz.ClientCnxn$SendThread.logStartConnect Opening socket connection to server localhost/127.0.0.1:45780. Will not attempt to authenticate using SASL (access denied ("javax.security.auth.AuthPermission" "getLoginConfiguration"))
[junit4:junit4]   2> 266 T432 oaz.ClientCnxn$SendThread.primeConnection Socket connection established to localhost/127.0.0.1:45780, initiating session
[junit4:junit4]   2> 267 T430 oazs.NIOServerCnxnFactory.run Accepted socket connection from /140.211.11.196:21112
[junit4:junit4]   2> 284 T430 oazs.NIOServerCnxn.doIO WARNING Exception causing close of session 0x0 due to java.io.IOException: ZooKeeperServer not running
[junit4:junit4]   2> 285 T430 oazs.NIOServerCnxn.closeSock Closed socket connection for client /140.211.11.196:21112 (no session established for client)
[junit4:junit4]   2> 285 T432 oaz.ClientCnxn$SendThread.run Unable to read additional data from server sessionid 0x0, likely server has closed socket, closing socket connection and attempting reconnect
[junit4:junit4]   2> 2163 T432 oaz.ClientCnxn$SendThread.logStartConnect Opening socket connection to server localhost/127.0.0.1:45780. Will not attempt to authenticate using SASL (access denied ("javax.security.auth.AuthPermission" "getLoginConfiguration"))
[junit4:junit4]   2> 2164 T432 oaz.ClientCnxn$SendThread.primeConnection Socket connection established to localhost/127.0.0.1:45780, initiating session
[junit4:junit4]   2> 2164 T430 oazs.NIOServerCnxnFactory.run Accepted socket connection from /140.211.11.196:19269
[junit4:junit4]   2> 2178 T430 oazs.ZooKeeperServer.processConnectRequest Client attempting to establish new session at /140.211.11.196:19269
[junit4:junit4]   2> 2194 T434 oazsp.FileTxnLog.append Creating new log file: log.1
[junit4:junit4]   2> 2235 T434 oazs.ZooKeeperServer.finishSessionInit Established session 0x13ca77aee720000 with negotiated timeout 10000 for client /140.211.11.196:19269
[junit4:junit4]   2> 2236 T432 oaz.ClientCnxn$SendThread.onConnected Session establishment complete on server localhost/127.0.0.1:45780, sessionid = 0x13ca77aee720000, negotiated timeout = 10000
[junit4:junit4]   2> 2240 T433 oascc.ConnectionManager.process Watcher org.apache.solr.common.cloud.ConnectionManager@b2da32d name:ZooKeeperConnection Watcher:127.0.0.1:45780 got event WatchedEvent state:SyncConnected type:None path:null path:null type:None
[junit4:junit4]   2> 2240 T428 oascc.ConnectionManager.waitForConnected Client is connected to ZooKeeper
[junit4:junit4]   2> 2245 T428 oascc.SolrZkClient.makePath makePath: /solr
[junit4:junit4]   2> 2329 T435 oazs.PrepRequestProcessor.pRequest2Txn Processed session termination for sessionid: 0x13ca77aee720000
[junit4:junit4]   2> 2331 T433 oaz.ClientCnxn$EventThread.run EventThread shut down
[junit4:junit4]   2> 2331 T428 oaz.ZooKeeper.close Session: 0x13ca77aee720000 closed
[junit4:junit4]   2> 2331 T430 oazs.NIOServerCnxn.closeSock Closed socket connection for client /140.211.11.196:19269 which had sessionid 0x13ca77aee720000
[junit4:junit4]   2> 2331 T428 oaz.ZooKeeper.<init> Initiating client connection, connectString=127.0.0.1:45780/solr sessionTimeout=10000 watcher=org.apache.solr.common.cloud.ConnectionManager@79ba1ec8
[junit4:junit4]   2> 2332 T428 oascc.ConnectionManager.waitForConnected Waiting for client to connect to ZooKeeper
[junit4:junit4]   2> 2333 T436 oaz.ClientCnxn$SendThread.logStartConnect Opening socket connection to server localhost/127.0.0.1:45780. Will not attempt to authenticate using SASL (access denied ("javax.security.auth.AuthPermission" "getLoginConfiguration"))
[junit4:junit4]   2> 2333 T436 oaz.ClientCnxn$SendThread.primeConnection Socket connection established to localhost/127.0.0.1:45780, initiating session
[junit4:junit4]   2> 2334 T430 oazs.NIOServerCnxnFactory.run Accepted socket connection from /140.211.11.196:49718
[junit4:junit4]   2> 2334 T430 oazs.ZooKeeperServer.processConnectRequest Client attempting to establish new session at /140.211.11.196:49718
[junit4:junit4]   2> 2336 T434 oazs.ZooKeeperServer.finishSessionInit Established session 0x13ca77aee720001 with negotiated timeout 10000 for client /140.211.11.196:49718
[junit4:junit4]   2> 2336 T436 oaz.ClientCnxn$SendThread.onConnected Session establishment complete on server localhost/127.0.0.1:45780, sessionid = 0x13ca77aee720001, negotiated timeout = 10000
[junit4:junit4]   2> 2337 T437 oascc.ConnectionManager.process Watcher org.apache.solr.common.cloud.ConnectionManager@79ba1ec8 name:ZooKeeperConnection Watcher:127.0.0.1:45780/solr got event WatchedEvent state:SyncConnected type:None path:null path:null type:None
[junit4:junit4]   2> 2337 T428 oascc.ConnectionManager.waitForConnected Client is connected to ZooKeeper
[junit4:junit4]   2> 2343 T428 oascc.SolrZkClient.makePath makePath: /collections/collection1
[junit4:junit4]   2> 2349 T428 oascc.SolrZkClient.makePath makePath: /collections/collection1/shards
[junit4:junit4]   2> 2360 T428 oascc.SolrZkClient.makePath makePath: /collections/control_collection
[junit4:junit4]   2> 2364 T428 oascc.SolrZkClient.makePath makePath: /collections/control_collection/shards
[junit4:junit4]   2> 2369 T428 oasc.AbstractZkTestCase.putConfig put /usr/home/hudson/hudson-slave/workspace/Lucene-Solr-Tests-trunk-java7/solr/build/solr-core/test-files/solr/collection1/conf/solrconfig.xml to /configs/conf1/solrconfig.xml
[junit4:junit4]   2> 2397 T428 oascc.SolrZkClient.makePath makePath: /configs/conf1/solrconfig.xml
[junit4:junit4]   2> 2413 T428 oasc.AbstractZkTestCase.putConfig put /usr/home/hudson/hudson-slave/workspace/Lucene-Solr-Tests-trunk-java7/solr/build/solr-core/test-files/solr/collection1/conf/schema.xml to /configs/conf1/schema.xml
[junit4:junit4]   2> 2414 T428 oascc.SolrZkClient.makePath makePath: /configs/conf1/schema.xml
[junit4:junit4]   2> 2521 T428 oasc.AbstractZkTestCase.putConfig put /usr/home/hudson/hudson-slave/workspace/Lucene-Solr-Tests-trunk-java7/solr/build/solr-core/test-files/solr/collection1/conf/stopwords.txt to /configs/conf1/stopwords.txt
[junit4:junit4]   2> 2522 T428 oascc.SolrZkClient.makePath makePath: /configs/conf1/stopwords.txt
[junit4:junit4]   2> 2528 T428 oasc.AbstractZkTestCase.putConfig put /usr/home/hudson/hudson-slave/workspace/Lucene-Solr-Tests-trunk-java7/solr/build/solr-core/test-files/solr/collection1/conf/protwords.txt to /configs/conf1/protwords.txt
[junit4:junit4]   2> 2529 T428 oascc.SolrZkClient.makePath makePath: /configs/conf1/protwords.txt
[junit4:junit4]   2> 2535 T428 oasc.AbstractZkTestCase.putConfig put /usr/home/hudson/hudson-slave/workspace/Lucene-Solr-Tests-trunk-java7/solr/build/solr-core/test-files/solr/collection1/conf/currency.xml to /configs/conf1/currency.xml
[junit4:junit4]   2> 2535 T428 oascc.SolrZkClient.makePath makePath: /configs/conf1/currency.xml
[junit4:junit4]   2> 2542 T428 oasc.AbstractZkTestCase.putConfig put /usr/home/hudson/hudson-slave/workspace/Lucene-Solr-Tests-trunk-java7/solr/build/solr-core/test-files/solr/collection1/conf/open-exchange-rates.json to /configs/conf1/open-exchange-rates.json
[junit4:junit4]   2> 2542 T428 oascc.SolrZkClient.makePath makePath: /configs/conf1/open-exchange-rates.json
[junit4:junit4]   2> 2549 T428 oasc.AbstractZkTestCase.putConfig put /usr/home/hudson/hudson-slave/workspace/Lucene-Solr-Tests-trunk-java7/solr/build/solr-core/test-files/solr/collection1/conf/mapping-ISOLatin1Accent.txt to /configs/conf1/mapping-ISOLatin1Accent.txt
[junit4:junit4]   2> 2549 T428 oascc.SolrZkClient.makePath makePath: /configs/conf1/mapping-ISOLatin1Accent.txt
[junit4:junit4]   2> 2555 T428 oasc.AbstractZkTestCase.putConfig put /usr/home/hudson/hudson-slave/workspace/Lucene-Solr-Tests-trunk-java7/solr/build/solr-core/test-files/solr/collection1/conf/old_synonyms.txt to /configs/conf1/old_synonyms.txt
[junit4:junit4]   2> 2556 T428 oascc.SolrZkClient.makePath makePath: /configs/conf1/old_synonyms.txt
[junit4:junit4]   2> 2562 T428 oasc.AbstractZkTestCase.putConfig put /usr/home/hudson/hudson-slave/workspace/Lucene-Solr-Tests-trunk-java7/solr/build/solr-core/test-files/solr/collection1/conf/synonyms.txt to /configs/conf1/synonyms.txt
[junit4:junit4]   2> 2563 T428 oascc.SolrZkClient.makePath makePath: /configs/conf1/synonyms.txt
[junit4:junit4]   2> 2569 T435 oazs.PrepRequestProcessor.pRequest2Txn Processed session termination for sessionid: 0x13ca77aee720001
[junit4:junit4]   2> 2570 T437 oaz.ClientCnxn$EventThread.run EventThread shut down
[junit4:junit4]   2> 2570 T428 oaz.ZooKeeper.close Session: 0x13ca77aee720001 closed
[junit4:junit4]   2> 2570 T430 oazs.NIOServerCnxn.closeSock Closed socket connection for client /140.211.11.196:49718 which had sessionid 0x13ca77aee720001
[junit4:junit4]   2> 2769 T428 oejs.Server.doStart jetty-8.1.8.v20121106
[junit4:junit4]   2> 2773 T428 oejs.AbstractConnector.doStart Started SocketConnector@127.0.0.1:64828
[junit4:junit4]   2> 2774 T428 oass.SolrDispatchFilter.init SolrDispatchFilter.init()
[junit4:junit4]   2> 2774 T428 oasc.SolrResourceLoader.locateSolrHome JNDI not configured for solr (NoInitialContextEx)
[junit4:junit4]   2> 2775 T428 oasc.SolrResourceLoader.locateSolrHome using system property solr.solr.home: /usr/home/hudson/hudson-slave/workspace/Lucene-Solr-Tests-trunk-java7/solr/build/solr-core/test/J0/./org.apache.solr.cloud.BasicDistributedZkTest-controljetty-1360019519403
[junit4:junit4]   2> 2775 T428 oasc.CoreContainer$Initializer.initialize looking for solr.xml: /usr/home/hudson/hudson-slave/workspace/Lucene-Solr-Tests-trunk-java7/solr/build/solr-core/test/J0/./org.apache.solr.cloud.BasicDistributedZkTest-controljetty-1360019519403/solr.xml
[junit4:junit4]   2> 2776 T428 oasc.CoreContainer.<init> New CoreContainer 1882182574
[junit4:junit4]   2> 2777 T428 oasc.CoreContainer.load Loading CoreContainer using Solr Home: '/usr/home/hudson/hudson-slave/workspace/Lucene-Solr-Tests-trunk-java7/solr/build/solr-core/test/J0/./org.apache.solr.cloud.BasicDistributedZkTest-controljetty-1360019519403/'
[junit4:junit4]   2> 2777 T428 oasc.SolrResourceLoader.<init> new SolrResourceLoader for directory: '/usr/home/hudson/hudson-slave/workspace/Lucene-Solr-Tests-trunk-java7/solr/build/solr-core/test/J0/./org.apache.solr.cloud.BasicDistributedZkTest-controljetty-1360019519403/'
[junit4:junit4]   2> 2839 T428 oashc.HttpShardHandlerFactory.getParameter Setting socketTimeout to: 60000
[junit4:junit4]   2> 2839 T428 oashc.HttpShardHandlerFactory.getParameter Setting urlScheme to: http://
[junit4:junit4]   2> 2840 T428 oashc.HttpShardHandlerFactory.getParameter Setting connTimeout to: 15000
[junit4:junit4]   2> 2840 T428 oashc.HttpShardHandlerFactory.getParameter Setting maxConnectionsPerHost to: 20
[junit4:junit4]   2> 2841 T428 oashc.HttpShardHandlerFactory.getParameter Setting corePoolSize to: 0
[junit4:junit4]   2> 2841 T428 oashc.HttpShardHandlerFactory.getParameter Setting maximumPoolSize to: 2147483647
[junit4:junit4]   2> 2842 T428 oashc.HttpShardHandlerFactory.getParameter Setting maxThreadIdleTime to: 5
[junit4:junit4]   2> 2842 T428 oashc.HttpShardHandlerFactory.getParameter Setting sizeOfQueue to: -1
[junit4:junit4]   2> 2843 T428 oashc.HttpShardHandlerFactory.getParameter Setting fairnessPolicy to: false
[junit4:junit4]   2> 2843 T428 oascsi.HttpClientUtil.createClient Creating new http client, config:maxConnectionsPerHost=20&maxConnections=10000&socketTimeout=60000&connTimeout=15000&retry=false
[junit4:junit4]   2> 2871 T428 oasc.CoreContainer.load Registering Log Listener
[junit4:junit4]   2> 2895 T428 oasc.CoreContainer.initZooKeeper Zookeeper client=127.0.0.1:45780/solr
[junit4:junit4]   2> 2921 T428 oasc.ZkController.checkChrootPath zkHost includes chroot
[junit4:junit4]   2> 2922 T428 oaz.ZooKeeper.<init> Initiating client connection, connectString=127.0.0.1:45780 sessionTimeout=60000 watcher=org.apache.solr.common.cloud.ConnectionManager@31415815
[junit4:junit4]   2> 2923 T428 oascc.ConnectionManager.waitForConnected Waiting for client to connect to ZooKeeper
[junit4:junit4]   2> 2923 T447 oaz.ClientCnxn$SendThread.logStartConnect Opening socket connection to server localhost/127.0.0.1:45780. Will not attempt to authenticate using SASL (access denied ("javax.security.auth.AuthPermission" "getLoginConfiguration"))
[junit4:junit4]   2> 2924 T447 oaz.ClientCnxn$SendThread.primeConnection Socket connection established to localhost/127.0.0.1:45780, initiating session
[junit4:junit4]   2> 2924 T430 oazs.NIOServerCnxnFactory.run Accepted socket connection from /140.211.11.196:24071
[junit4:junit4]   2> 2925 T430 oazs.ZooKeeperServer.processConnectRequest Client attempting to establish new session at /140.211.11.196:24071
[junit4:junit4]   2> 2926 T434 oazs.ZooKeeperServer.finishSessionInit Established session 0x13ca77aee720002 with negotiated timeout 20000 for client /140.211.11.196:24071
[junit4:junit4]   2> 2926 T447 oaz.ClientCnxn$SendThread.onConnected Session establishment complete on server localhost/127.0.0.1:45780, sessionid = 0x13ca77aee720002, negotiated timeout = 20000
[junit4:junit4]   2> 2927 T448 oascc.ConnectionManager.process Watcher org.apache.solr.common.cloud.ConnectionManager@31415815 name:ZooKeeperConnection Watcher:127.0.0.1:45780 got event WatchedEvent state:SyncConnected type:None path:null path:null type:None
[junit4:junit4]   2> 2927 T428 oascc.ConnectionManager.waitForConnected Client is connected to ZooKeeper
[junit4:junit4]   2> 2929 T435 oazs.PrepRequestProcessor.pRequest2Txn Processed session termination for sessionid: 0x13ca77aee720002
[junit4:junit4]   2> 2930 T448 oaz.ClientCnxn$EventThread.run EventThread shut down
[junit4:junit4]   2> 2930 T430 oazs.NIOServerCnxn.closeSock Closed socket connection for client /140.211.11.196:24071 which had sessionid 0x13ca77aee720002
[junit4:junit4]   2> 2930 T428 oaz.ZooKeeper.close Session: 0x13ca77aee720002 closed
[junit4:junit4]   2> 2936 T428 oascsi.HttpClientUtil.createClient Creating new http client, config:maxConnections=500&maxConnectionsPerHost=16&socketTimeout=60000&connTimeout=15000
[junit4:junit4]   2> 2955 T428 oaz.ZooKeeper.<init> Initiating client connection, connectString=127.0.0.1:45780/solr sessionTimeout=30000 watcher=org.apache.solr.common.cloud.ConnectionManager@56fe2145
[junit4:junit4]   2> 2956 T428 oascc.ConnectionManager.waitForConnected Waiting for client to connect to ZooKeeper
[junit4:junit4]   2> 2957 T449 oaz.ClientCnxn$SendThread.logStartConnect Opening socket connection to server localhost/127.0.0.1:45780. Will not attempt to authenticate using SASL (access denied ("javax.security.auth.AuthPermission" "getLoginConfiguration"))
[junit4:junit4]   2> 2957 T449 oaz.ClientCnxn$SendThread.primeConnection Socket connection established to localhost/127.0.0.1:45780, initiating session
[junit4:junit4]   2> 2958 T430 oazs.NIOServerCnxnFactory.run Accepted socket connection from /140.211.11.196:49673
[junit4:junit4]   2> 2958 T430 oazs.ZooKeeperServer.processConnectRequest Client attempting to establish new session at /140.211.11.196:49673
[junit4:junit4]   2> 2960 T434 oazs.ZooKeeperServer.finishSessionInit Established session 0x13ca77aee720003 with negotiated timeout 20000 for client /140.211.11.196:49673
[junit4:junit4]   2> 2960 T449 oaz.ClientCnxn$SendThread.onConnected Session establishment complete on server localhost/127.0.0.1:45780, sessionid = 0x13ca77aee720003, negotiated timeout = 20000
[junit4:junit4]   2> 2960 T450 oascc.ConnectionManager.process Watcher org.apache.solr.common.cloud.ConnectionManager@56fe2145 name:ZooKeeperConnection Watcher:127.0.0.1:45780/solr got event WatchedEvent state:SyncConnected type:None path:null path:null type:None
[junit4:junit4]   2> 2960 T428 oascc.ConnectionManager.waitForConnected Client is connected to ZooKeeper
[junit4:junit4]   2> 2982 T435 oazs.PrepRequestProcessor.pRequest Got user-level KeeperException when processing sessionid:0x13ca77aee720003 type:create cxid:0x2 zxid:0x1a txntype:-1 reqpath:n/a Error Path:/solr/overseer Error:KeeperErrorCode = NodeExists for /solr/overseer
[junit4:junit4]   2> 2994 T428 oascc.SolrZkClient.makePath makePath: /live_nodes
[junit4:junit4]   2> 2998 T428 oasc.ZkController.createEphemeralLiveNode Register node as live in ZooKeeper:/live_nodes/127.0.0.1:64828_sp_ffw%2Ff
[junit4:junit4]   2> 3004 T435 oazs.PrepRequestProcessor.pRequest Got user-level KeeperException when processing sessionid:0x13ca77aee720003 type:delete cxid:0x7 zxid:0x1c txntype:-1 reqpath:n/a Error Path:/solr/live_nodes/127.0.0.1:64828_sp_ffw%2Ff Error:KeeperErrorCode = NoNode for /solr/live_nodes/127.0.0.1:64828_sp_ffw%2Ff
[junit4:junit4]   2> 3006 T428 oascc.SolrZkClient.makePath makePath: /live_nodes/127.0.0.1:64828_sp_ffw%2Ff
[junit4:junit4]   2> 3012 T428 oascc.SolrZkClient.makePath makePath: /overseer_elect/election
[junit4:junit4]   2> 3047 T435 oazs.PrepRequestProcessor.pRequest Got user-level KeeperException when processing sessionid:0x13ca77aee720003 type:delete cxid:0x15 zxid:0x21 txntype:-1 reqpath:n/a Error Path:/solr/overseer_elect/leader Error:KeeperErrorCode = NoNode for /solr/overseer_elect/leader
[junit4:junit4]   2> 3048 T428 oascc.SolrZkClient.makePath makePath: /overseer_elect/leader
[junit4:junit4]   2> 3053 T428 oasc.Overseer.start Overseer (id=89130239068864515-127.0.0.1:64828_sp_ffw%2Ff-n_0000000000) starting
[junit4:junit4]   2> 3055 T435 oazs.PrepRequestProcessor.pRequest Got user-level KeeperException when processing sessionid:0x13ca77aee720003 type:create cxid:0x1a zxid:0x23 txntype:-1 reqpath:n/a Error Path:/solr/overseer Error:KeeperErrorCode = NodeExists for /solr/overseer
[junit4:junit4]   2> 3086 T435 oazs.PrepRequestProcessor.pRequest Got user-level KeeperException when processing sessionid:0x13ca77aee720003 type:create cxid:0x1b zxid:0x24 txntype:-1 reqpath:n/a Error Path:/solr/overseer Error:KeeperErrorCode = NodeExists for /solr/overseer
[junit4:junit4]   2> 3088 T435 oazs.PrepRequestProcessor.pRequest Got user-level KeeperException when processing sessionid:0x13ca77aee720003 type:create cxid:0x1c zxid:0x25 txntype:-1 reqpath:n/a Error Path:/solr/overseer Error:KeeperErrorCode = NodeExists for /solr/overseer
[junit4:junit4]   2> 3102 T435 oazs.PrepRequestProcessor.pRequest Got user-level KeeperException when processing sessionid:0x13ca77aee720003 type:create cxid:0x1d zxid:0x26 txntype:-1 reqpath:n/a Error Path:/solr/overseer Error:KeeperErrorCode = NodeExists for /solr/overseer
[junit4:junit4]   2> 3104 T452 oasc.OverseerCollectionProcessor.run Process current queue of collection creations
[junit4:junit4]   2> 3115 T428 oascc.SolrZkClient.makePath makePath: /clusterstate.json
[junit4:junit4]   2> 3119 T428 oascc.ZkStateReader.createClusterStateWatchersAndUpdate Updating cluster state from ZooKeeper... 
[junit4:junit4]   2> 3144 T451 oasc.Overseer$ClusterStateUpdater.run Starting to work on the main queue
[junit4:junit4]   2> 3161 T453 oasc.CoreContainer.create Creating SolrCore 'collection1' using instanceDir: /usr/home/hudson/hudson-slave/workspace/Lucene-Solr-Tests-trunk-java7/solr/build/solr-core/test/J0/./org.apache.solr.cloud.BasicDistributedZkTest-controljetty-1360019519403/collection1
[junit4:junit4]   2> 3161 T453 oasc.ZkController.createCollectionZkNode Check for collection zkNode:control_collection
[junit4:junit4]   2> 3162 T453 oasc.ZkController.createCollectionZkNode Collection zkNode exists
[junit4:junit4]   2> 3162 T453 oasc.ZkController.readConfigName Load collection config from:/collections/control_collection
[junit4:junit4]   2> 3165 T453 oasc.SolrResourceLoader.<init> new SolrResourceLoader for directory: '/usr/home/hudson/hudson-slave/workspace/Lucene-Solr-Tests-trunk-java7/solr/build/solr-core/test/J0/./org.apache.solr.cloud.BasicDistributedZkTest-controljetty-1360019519403/collection1/'
[junit4:junit4]   2> 3166 T453 oasc.SolrResourceLoader.replaceClassLoader Adding 'file:/usr/home/hudson/hudson-slave/workspace/Lucene-Solr-Tests-trunk-java7/solr/build/solr-core/test/J0/org.apache.solr.cloud.BasicDistributedZkTest-controljetty-1360019519403/collection1/lib/README' to classloader
[junit4:junit4]   2> 3167 T453 oasc.SolrResourceLoader.replaceClassLoader Adding 'file:/usr/home/hudson/hudson-slave/workspace/Lucene-Solr-Tests-trunk-java7/solr/build/solr-core/test/J0/org.apache.solr.cloud.BasicDistributedZkTest-controljetty-1360019519403/collection1/lib/classes/' to classloader
[junit4:junit4]   2> 3246 T453 oasc.SolrConfig.<init> Using Lucene MatchVersion: LUCENE_50
[junit4:junit4]   2> 3326 T453 oasc.SolrConfig.<init> Loaded SolrConfig: solrconfig.xml
[junit4:junit4]   2> 3427 T453 oass.IndexSchema.readSchema Reading Solr Schema
[junit4:junit4]   2> 3435 T453 oass.IndexSchema.readSchema Schema name=test
[junit4:junit4]   2> 4143 T453 oass.OpenExchangeRatesOrgProvider.init Initialized with rates=open-exchange-rates.json, refreshInterval=1440.
[junit4:junit4]   2> 4156 T453 oass.IndexSchema.readSchema default search field in schema is text
[junit4:junit4]   2> 4160 T453 oass.IndexSchema.readSchema unique key field: id
[junit4:junit4]   2> 4187 T453 oass.FileExchangeRateProvider.reload Reloading exchange rates from file currency.xml
[junit4:junit4]   2> 4194 T453 oass.FileExchangeRateProvider.reload Reloading exchange rates from file currency.xml
[junit4:junit4]   2> 4200 T453 oass.OpenExchangeRatesOrgProvider.reload Reloading exchange rates from open-exchange-rates.json
[junit4:junit4]   2> 4202 T453 oass.OpenExchangeRatesOrgProvider.reload Reloading exchange rates from open-exchange-rates.json
[junit4:junit4]   2> 4204 T453 oasc.SolrCore.<init> [collection1] Opening new SolrCore at /usr/home/hudson/hudson-slave/workspace/Lucene-Solr-Tests-trunk-java7/solr/build/solr-core/test/J0/./org.apache.solr.cloud.BasicDistributedZkTest-controljetty-1360019519403/collection1/, dataDir=./org.apache.solr.cloud.BasicDistributedZkTest-1360019516837/control/data/
[junit4:junit4]   2> 4209 T453 oasc.JmxMonitoredMap.<init> JMX monitoring is enabled. Adding Solr mbeans to JMX Server: com.sun.jmx.mbeanserver.JmxMBeanServer@5925c9a4
[junit4:junit4]   2> 4209 T453 oasc.SolrCore.initDirectoryFactory solr.NRTCachingDirectoryFactory
[junit4:junit4]   2> 4211 T453 oasc.CachingDirectoryFactory.get return new directory for /usr/home/hudson/hudson-slave/workspace/Lucene-Solr-Tests-trunk-java7/solr/build/solr-core/test/J0/./org.apache.solr.cloud.BasicDistributedZkTest-1360019516837/control/data forceNew:false
[junit4:junit4]   2> 4211 T453 oasc.CachingDirectoryFactory.close Releasing directory:/usr/home/hudson/hudson-slave/workspace/Lucene-Solr-Tests-trunk-java7/solr/build/solr-core/test/J0/./org.apache.solr.cloud.BasicDistributedZkTest-1360019516837/control/data
[junit4:junit4]   2> 4212 T453 oasc.SolrCore.getNewIndexDir New index directory detected: old=null new=./org.apache.solr.cloud.BasicDistributedZkTest-1360019516837/control/data/index/
[junit4:junit4]   2> 4212 T453 oasc.SolrCore.initIndex WARNING [collection1] Solr index directory './org.apache.solr.cloud.BasicDistributedZkTest-1360019516837/control/data/index' doesn't exist. Creating new index...
[junit4:junit4]   2> 4213 T453 oasc.CachingDirectoryFactory.get return new directory for /usr/home/hudson/hudson-slave/workspace/Lucene-Solr-Tests-trunk-java7/solr/build/solr-core/test/J0/./org.apache.solr.cloud.BasicDistributedZkTest-1360019516837/control/data/index forceNew:false
[junit4:junit4]   2> 4220 T453 oasc.SolrDeletionPolicy.onCommit SolrDeletionPolicy.onCommit: commits:num=1
[junit4:junit4]   2> 		commit{dir=RateLimitedDirectoryWrapper(NRTCachingDirectory(org.apache.lucene.store.NIOFSDirectory@/usr/home/hudson/hudson-slave/workspace/Lucene-Solr-Tests-trunk-java7/solr/build/solr-core/test/J0/org.apache.solr.cloud.BasicDistributedZkTest-1360019516837/control/data/index lockFactory=org.apache.lucene.store.NativeFSLockFactory@1713586c; maxCacheMB=48.0 maxMergeSizeMB=4.0)),segFN=segments_1,generation=1,filenames=[segments_1]
[junit4:junit4]   2> 4220 T453 oasc.SolrDeletionPolicy.updateCommits newest commit = 1[segments_1]
[junit4:junit4]   2> 4221 T453 oasc.CachingDirectoryFactory.close Releasing directory:/usr/home/hudson/hudson-slave/workspace/Lucene-Solr-Tests-trunk-java7/solr/build/solr-core/test/J0/./org.apache.solr.cloud.BasicDistributedZkTest-1360019516837/control/data/index
[junit4:junit4]   2> 4222 T453 oasc.SolrCore.initWriters created xml: solr.XMLResponseWriter
[junit4:junit4]   2> 4226 T453 oasup.UpdateRequestProcessorChain.init inserting DistributedUpdateProcessorFactory into updateRequestProcessorChain "dedupe"
[junit4:junit4]   2> 4226 T453 oasup.UpdateRequestProcessorChain.init inserting DistributedUpdateProcessorFactory into updateRequestProcessorChain "dedupe-allfields"
[junit4:junit4]   2> 4226 T453 oasup.UpdateRequestProcessorChain.init inserting DistributedUpdateProcessorFactory into updateRequestProcessorChain "stored_sig"
[junit4:junit4]   2> 4227 T453 oasup.UpdateRequestProcessorChain.init inserting DistributedUpdateProcessorFactory into updateRequestProcessorChain "uniq-fields"
[junit4:junit4]   2> 4228 T453 oasup.UpdateRequestProcessorChain.init inserting DistributedUpdateProcessorFactory into updateRequestProcessorChain "distrib-dup-test-chain-implicit"
[junit4:junit4]   2> 4228 T453 oasc.RequestHandlers.initHandlersFromConfig adding lazy requestHandler: solr.ReplicationHandler
[junit4:junit4]   2> 4229 T453 oasc.RequestHandlers.initHandlersFromConfig created /replication: solr.ReplicationHandler
[junit4:junit4]   2> 4229 T453 oasc.RequestHandlers.initHandlersFromConfig created standard: solr.StandardRequestHandler
[junit4:junit4]   2> 4230 T453 oasc.RequestHandlers.initHandlersFromConfig created /get: solr.RealTimeGetHandler
[junit4:junit4]   2> 4230 T453 oasc.RequestHandlers.initHandlersFromConfig created dismax: solr.SearchHandler
[junit4:junit4]   2> 4231 T453 oasc.RequestHandlers.initHandlersFromConfig created mock: org.apache.solr.core.MockQuerySenderListenerReqHandler
[junit4:junit4]   2> 4232 T453 oasc.RequestHandlers.initHandlersFromConfig created /admin/: org.apache.solr.handler.admin.AdminHandlers
[junit4:junit4]   2> 4232 T453 oasc.RequestHandlers.initHandlersFromConfig created defaults: solr.StandardRequestHandler
[junit4:junit4]   2> 4233 T453 oasc.RequestHandlers.initHandlersFromConfig adding lazy requestHandler: solr.StandardRequestHandler
[junit4:junit4]   2> 4233 T453 oasc.RequestHandlers.initHandlersFromConfig created lazy: solr.StandardRequestHandler
[junit4:junit4]   2> 4234 T453 oasc.RequestHandlers.initHandlersFromConfig created /update: solr.UpdateRequestHandler
[junit4:junit4]   2> 4234 T453 oasc.RequestHandlers.initHandlersFromConfig created /terms: org.apache.solr.handler.component.SearchHandler
[junit4:junit4]   2> 4235 T453 oasc.RequestHandlers.initHandlersFromConfig created spellCheckCompRH: org.apache.solr.handler.component.SearchHandler
[junit4:junit4]   2> 4235 T453 oasc.RequestHandlers.initHandlersFromConfig created spellCheckCompRH_Direct: org.apache.solr.handler.component.SearchHandler
[junit4:junit4]   2> 4236 T453 oasc.RequestHandlers.initHandlersFromConfig created spellCheckWithWordbreak: org.apache.solr.handler.component.SearchHandler
[junit4:junit4]   2> 4236 T453 oasc.RequestHandlers.initHandlersFromConfig created spellCheckWithWordbreak_Direct: org.apache.solr.handler.component.SearchHandler
[junit4:junit4]   2> 4237 T453 oasc.RequestHandlers.initHandlersFromConfig created spellCheckCompRH1: org.apache.solr.handler.component.SearchHandler
[junit4:junit4]   2> 4237 T453 oasc.RequestHandlers.initHandlersFromConfig created mltrh: org.apache.solr.handler.component.SearchHandler
[junit4:junit4]   2> 4237 T453 oasc.RequestHandlers.initHandlersFromConfig created tvrh: org.apache.solr.handler.component.SearchHandler
[junit4:junit4]   2> 4238 T453 oasc.RequestHandlers.initHandlersFromConfig created /mlt: solr.MoreLikeThisHandler
[junit4:junit4]   2> 4239 T453 oasc.RequestHandlers.initHandlersFromConfig created /debug/dump: solr.DumpRequestHandler
[junit4:junit4]   2> 4252 T453 oashl.XMLLoader.init xsltCacheLifetimeSeconds=60
[junit4:junit4]   2> 4257 T453 oasc.SolrCore.initDeprecatedSupport WARNING solrconfig.xml uses deprecated <admin/gettableFiles>, Please update your config to use the ShowFileRequestHandler.
[junit4:junit4]   2> 4258 T453 oasc.SolrCore.initDeprecatedSupport WARNING adding ShowFileRequestHandler with hidden files: [SCHEMA.XML, OLD_SYNONYMS.TXT, STOPWORDS.TXT, PROTWORDS.TXT, OPEN-EXCHANGE-RATES.JSON, SYNONYMS.TXT, CURRENCY.XML, MAPPING-ISOLATIN1ACCENT.TXT]
[junit4:junit4]   2> 4261 T453 oasc.CachingDirectoryFactory.close Releasing directory:/usr/home/hudson/hudson-slave/workspace/Lucene-Solr-Tests-trunk-java7/solr/build/solr-core/test/J0/./org.apache.solr.cloud.BasicDistributedZkTest-1360019516837/control/data
[junit4:junit4]   2> 4263 T453 oass.SolrIndexSearcher.<init> Opening Searcher@78d4654e main
[junit4:junit4]   2> 4289 T453 oasu.CommitTracker.<init> Hard AutoCommit: disabled
[junit4:junit4]   2> 4289 T453 oasu.CommitTracker.<init> Soft AutoCommit: disabled
[junit4:junit4]   2> 4290 T453 oashc.SpellCheckComponent.inform Initializing spell checkers
[junit4:junit4]   2> 4309 T453 oass.DirectSolrSpellChecker.init init: {name=direct,classname=DirectSolrSpellChecker,field=lowerfilt,minQueryLength=3}
[junit4:junit4]   2> 4362 T454 oasc.SolrCore.registerSearcher [collection1] Registered new searcher Searcher@78d4654e main{StandardDirectoryReader(segments_1:1)}
[junit4:junit4]   2> 4367 T453 oasc.ZkController.publish publishing core=collection1 state=down
[junit4:junit4]   2> 4368 T453 oasc.ZkController.publish numShards not found on descriptor - reading it from system property
[junit4:junit4]   2> 4369 T435 oazs.PrepRequestProcessor.pRequest Got user-level KeeperException when processing sessionid:0x13ca77aee720003 type:create cxid:0x50 zxid:0x29 txntype:-1 reqpath:n/a Error Path:/solr/overseer/queue Error:KeeperErrorCode = NoNode for /solr/overseer/queue
[junit4:junit4]   2> 4654 T451 oascc.ZkStateReader.updateClusterState Updating cloud state from ZooKeeper... 
[junit4:junit4]   2> 4655 T451 oasc.Overseer$ClusterStateUpdater.updateState Update state numShards=1 message={
[junit4:junit4]   2> 	  "operation":"state",
[junit4:junit4]   2> 	  "numShards":"1",
[junit4:junit4]   2> 	  "shard":null,
[junit4:junit4]   2> 	  "roles":null,
[junit4:junit4]   2> 	  "state":"down",
[junit4:junit4]   2> 	  "core":"collection1",
[junit4:junit4]   2> 	  "collection":"control_collection",
[junit4:junit4]   2> 	  "node_name":"127.0.0.1:64828_sp_ffw%2Ff",
[junit4:junit4]   2> 	  "base_url":"http://127.0.0.1:64828/sp_ffw/f"}
[junit4:junit4]   2> 4656 T451 oasc.Overseer$ClusterStateUpdater.createCollection Create collection control_collection with numShards 1
[junit4:junit4]   2> 4691 T451 oasc.Overseer$ClusterStateUpdater.updateState Assigning new node to shard shard=shard1
[junit4:junit4]   2> 4692 T435 oazs.PrepRequestProcessor.pRequest Got user-level KeeperException when processing sessionid:0x13ca77aee720003 type:create cxid:0x58 zxid:0x2c txntype:-1 reqpath:n/a Error Path:/solr/overseer/queue-work Error:KeeperErrorCode = NoNode for /solr/overseer/queue-work
[junit4:junit4]   2> 4729 T450 oascc.ZkStateReader$2.process A cluster state change: WatchedEvent state:SyncConnected type:NodeDataChanged path:/clusterstate.json, has occurred - updating... (live nodes size: 1)
[junit4:junit4]   2> 5382 T453 oasc.CoreContainer.registerCore registering core: collection1
[junit4:junit4]   2> 5382 T453 oasc.ZkController.register Register replica - core:collection1 address:http://127.0.0.1:64828/sp_ffw/f collection:control_collection shard:shard1
[junit4:junit4]   2> 5393 T453 oascsi.HttpClientUtil.createClient Creating new http client, config:maxConnections=10000&maxConnectionsPerHost=20&connTimeout=30000&socketTimeout=30000&retry=false
[junit4:junit4]   2> 5410 T453 oascc.SolrZkClient.makePath makePath: /collections/control_collection/leader_elect/shard1/election
[junit4:junit4]   2> 5432 T435 oazs.PrepRequestProcessor.pRequest Got user-level KeeperException when processing sessionid:0x13ca77aee720003 type:delete cxid:0x72 zxid:0x36 txntype:-1 reqpath:n/a Error Path:/solr/collections/control_collection/leaders Error:KeeperErrorCode = NoNode for /solr/collections/control_collection/leaders
[junit4:junit4]   2> 5433 T453 oasc.ShardLeaderElectionContext.runLeaderProcess Running the leader process.
[junit4:junit4]   2> 5434 T435 oazs.PrepRequestProcessor.pRequest Got user-level KeeperException when processing sessionid:0x13ca77aee720003 type:create cxid:0x73 zxid:0x37 txntype:-1 reqpath:n/a Error Path:/solr/overseer Error:KeeperErrorCode = NodeExists for /solr/overseer
[junit4:junit4]   2> 5444 T453 oasc.ShardLeaderElectionContext.waitForReplicasToComeUp Enough replicas found to continue.
[junit4:junit4]   2> 5445 T453 oasc.ShardLeaderElectionContext.runLeaderProcess I may be the new leader - try and sync
[junit4:junit4]   2> 5445 T453 oasc.SyncStrategy.sync Sync replicas to http://127.0.0.1:64828/sp_ffw/f/collection1/
[junit4:junit4]   2> 5446 T453 oasc.SyncStrategy.syncReplicas Sync Success - now sync replicas to me
[junit4:junit4]   2> 5446 T453 oasc.SyncStrategy.syncToMe http://127.0.0.1:64828/sp_ffw/f/collection1/ has no replicas
[junit4:junit4]   2> 5446 T453 oasc.ShardLeaderElectionContext.runLeaderProcess I am the new leader: http://127.0.0.1:64828/sp_ffw/f/collection1/
[junit4:junit4]   2> 5446 T453 oascc.SolrZkClient.makePath makePath: /collections/control_collection/leaders/shard1
[junit4:junit4]   2> 5454 T435 oazs.PrepRequestProcessor.pRequest Got user-level KeeperException when processing sessionid:0x13ca77aee720003 type:create cxid:0x7d zxid:0x3b txntype:-1 reqpath:n/a Error Path:/solr/overseer Error:KeeperErrorCode = NodeExists for /solr/overseer
[junit4:junit4]   2> 6236 T451 oascc.ZkStateReader.updateClusterState Updating cloud state from ZooKeeper... 
[junit4:junit4]   2> 6312 T450 oascc.ZkStateReader$2.process A cluster state change: WatchedEvent state:SyncConnected type:NodeDataChanged path:/clusterstate.json, has occurred - updating... (live nodes size: 1)
[junit4:junit4]   2> 6377 T453 oasc.ZkController.register We are http://127.0.0.1:64828/sp_ffw/f/collection1/ and leader is http://127.0.0.1:64828/sp_ffw/f/collection1/
[junit4:junit4]   2> 6381 T453 oasc.ZkController.register No LogReplay needed for core=collection1 baseURL=http://127.0.0.1:64828/sp_ffw/f
[junit4:junit4]   2> 6381 T453 oasc.ZkController.checkRecovery I am the leader, no recovery necessary
[junit4:junit4]   2> 6381 T453 oasc.ZkController.publish publishing core=collection1 state=active
[junit4:junit4]   2> 6382 T453 oasc.ZkController.publish numShards not found on descriptor - reading it from system property
[junit4:junit4]   2> 6385 T453 oascc.ZkStateReader.updateClusterState Updating cloud state from ZooKeeper... 
[junit4:junit4]   2> 6386 T428 oass.SolrDispatchFilter.init user.dir=/usr/home/hudson/hudson-slave/workspace/Lucene-Solr-Tests-trunk-java7/solr/build/solr-core/test/J0
[junit4:junit4]   2> 6387 T428 oass.SolrDispatchFilter.init SolrDispatchFilter.init() done
[junit4:junit4]   2> 6388 T428 oascsi.HttpClientUtil.createClient Creating new http client, config:maxConnections=128&maxConnectionsPerHost=32&followRedirects=false
[junit4:junit4]   2> 6404 T428 oascsi.HttpClientUtil.createClient Creating new http client, config:
[junit4:junit4]   2> 6421 T428 oaz.ZooKeeper.<init> Initiating client connection, connectString=127.0.0.1:45780/solr sessionTimeout=10000 watcher=org.apache.solr.common.cloud.ConnectionManager@771cc1d1
[junit4:junit4]   2> 6422 T428 oascc.ConnectionManager.waitForConnected Waiting for client to connect to ZooKeeper
[junit4:junit4]   2> 6423 T455 oaz.ClientCnxn$SendThread.logStartConnect Opening socket connection to server localhost/127.0.0.1:45780. Will not attempt to authenticate using SASL (access denied ("javax.security.auth.AuthPermission" "getLoginConfiguration"))
[junit4:junit4]   2> 6424 T455 oaz.ClientCnxn$SendThread.primeConnection Socket connection established to localhost/127.0.0.1:45780, initiating session
[junit4:junit4]   2> 6424 T430 oazs.NIOServerCnxnFactory.run Accepted socket connection from /140.211.11.196:29639
[junit4:junit4]   2> 6424 T430 oazs.ZooKeeperServer.processConnectRequest Client attempting to establish new session at /140.211.11.196:29639
[junit4:junit4]   2> 6426 T434 oazs.ZooKeeperServer.finishSessionInit Established session 0x13ca77aee720004 with negotiated timeout 10000 for client /140.211.11.196:29639
[junit4:junit4]   2> 6426 T455 oaz.ClientCnxn$SendThread.onConnected Session establishment complete on server localhost/127.0.0.1:45780, sessionid = 0x13ca77aee720004, negotiated timeout = 10000
[junit4:junit4]   2> 6426 T456 oascc.ConnectionManager.process Watcher org.apache.solr.common.cloud.ConnectionManager@771cc1d1 name:ZooKeeperConnection Watcher:127.0.0.1:45780/solr got event WatchedEvent state:SyncConnected type:None path:null path:null type:None
[junit4:junit4]   2> 6427 T428 oascc.ConnectionManager.waitForConnected Client is connected to ZooKeeper
[junit4:junit4]   2> 6428 T428 oascc.ZkStateReader.createClusterStateWatchersAndUpdate Updating cluster state from ZooKeeper... 
[junit4:junit4]   2> 6433 T428 oasc.ChaosMonkey.monkeyLog monkey: init - expire sessions:true cause connection loss:true
[junit4:junit4]   2> 6622 T428 oejs.Server.doStart jetty-8.1.8.v20121106
[junit4:junit4]   2> 6625 T428 oejs.AbstractConnector.doStart Started SocketConnector@127.0.0.1:58138
[junit4:junit4]   2> 6626 T428 oass.SolrDispatchFilter.init SolrDispatchFilter.init()
[junit4:junit4]   2> 6626 T428 oasc.SolrResourceLoader.locateSolrHome JNDI not configured for solr (NoInitialContextEx)
[junit4:junit4]   2> 6627 T428 oasc.SolrResourceLoader.locateSolrHome using system property solr.solr.home: /usr/home/hudson/hudson-slave/workspace/Lucene-Solr-Tests-trunk-java7/solr/build/solr-core/test/J0/./org.apache.solr.cloud.BasicDistributedZkTest-jetty1-1360019523266
[junit4:junit4]   2> 6627 T428 oasc.CoreContainer$Initializer.initialize looking for solr.xml: /usr/home/hudson/hudson-slave/workspace/Lucene-Solr-Tests-trunk-java7/solr/build/solr-core/test/J0/./org.apache.solr.cloud.BasicDistributedZkTest-jetty1-1360019523266/solr.xml
[junit4:junit4]   2> 6628 T428 oasc.CoreContainer.<init> New CoreContainer 247900808
[junit4:junit4]   2> 6628 T428 oasc.CoreContainer.load Loading CoreContainer using Solr Home: '/usr/home/hudson/hudson-slave/workspace/Lucene-Solr-Tests-trunk-java7/solr/build/solr-core/test/J0/./org.apache.solr.cloud.BasicDistributedZkTest-jetty1-1360019523266/'
[junit4:junit4]   2> 6629 T428 oasc.SolrResourceLoader.<init> new SolrResourceLoader for directory: '/usr/home/hudson/hudson-slave/workspace/Lucene-Solr-Tests-trunk-java7/solr/build/solr-core/test/J0/./org.apache.solr.cloud.BasicDistributedZkTest-jetty1-1360019523266/'
[junit4:junit4]   2> 6689 T428 oashc.HttpShardHandlerFactory.getParameter Setting socketTimeout to: 60000
[junit4:junit4]   2> 6690 T428 oashc.HttpShardHandlerFactory.getParameter Setting urlScheme to: http://
[junit4:junit4]   2> 6691 T428 oashc.HttpShardHandlerFactory.getParameter Setting connTimeout to: 15000
[junit4:junit4]   2> 6691 T428 oashc.HttpShardHandlerFactory.getParameter Setting maxConnectionsPerHost to: 20
[junit4:junit4]   2> 6691 T428 oashc.HttpShardHandlerFactory.getParameter Setting corePoolSize to: 0
[junit4:junit4]   2> 6692 T428 oashc.HttpShardHandlerFactory.getParameter Setting maximumPoolSize to: 2147483647
[junit4:junit4]   2> 6692 T428 oashc.HttpShardHandlerFactory.getParameter Setting maxThreadIdleTime to: 5
[junit4:junit4]   2> 6693 T428 oashc.HttpShardHandlerFactory.getParameter Setting sizeOfQueue to: -1
[junit4:junit4]   2> 6693 T428 oashc.HttpShardHandlerFactory.getParameter Setting fairnessPolicy to: false
[junit4:junit4]   2> 6694 T428 oascsi.HttpClientUtil.createClient Creating new http client, config:maxConnectionsPerHost=20&maxConnections=10000&socketTimeout=60000&connTimeout=15000&retry=false
[junit4:junit4]   2> 6730 T428 oasc.CoreContainer.load Registering Log Listener
[junit4:junit4]   2> 6752 T428 oasc.CoreContainer.initZooKeeper Zookeeper client=127.0.0.1:45780/solr
[junit4:junit4]   2> 6752 T428 oasc.ZkController.checkChrootPath zkHost includes chroot
[junit4:junit4]   2> 6753 T428 oaz.ZooKeeper.<init> Initiating client connection, connectString=127.0.0.1:45780 sessionTimeout=60000 watcher=org.apache.solr.common.cloud.ConnectionManager@e24af2d
[junit4:junit4]   2> 6754 T428 oascc.ConnectionManager.waitForConnected Waiting for client to connect to ZooKeeper
[junit4:junit4]   2> 6755 T466 oaz.ClientCnxn$SendThread.logStartConnect Opening socket connection to server localhost/127.0.0.1:45780. Will not attempt to authenticate using SASL (access denied ("javax.security.auth.AuthPermission" "getLoginConfiguration"))
[junit4:junit4]   2> 6756 T466 oaz.ClientCnxn$SendThread.primeConnection Socket connection established to localhost/127.0.0.1:45780, initiating session
[junit4:junit4]   2> 6756 T430 oazs.NIOServerCnxnFactory.run Accepted socket connection from /140.211.11.196:33189
[junit4:junit4]   2> 6756 T430 oazs.ZooKeeperServer.processConnectRequest Client attempting to establish new session at /140.211.11.196:33189
[junit4:junit4]   2> 6794 T434 oazs.ZooKeeperServer.finishSessionInit Established session 0x13ca77aee720005 with negotiated timeout 20000 for client /140.211.11.196:33189
[junit4:junit4]   2> 6794 T466 oaz.ClientCnxn$SendThread.onConnected Session establishment complete on server localhost/127.0.0.1:45780, sessionid = 0x13ca77aee720005, negotiated timeout = 20000
[junit4:junit4]   2> 6795 T467 oascc.ConnectionManager.process Watcher org.apache.solr.common.cloud.ConnectionManager@e24af2d name:ZooKeeperConnection Watcher:127.0.0.1:45780 got event WatchedEvent state:SyncConnected type:None path:null path:null type:None
[junit4:junit4]   2> 6795 T428 oascc.ConnectionManager.waitForConnected Client is connected to ZooKeeper
[junit4:junit4]   2> 6797 T435 oazs.PrepRequestProcessor.pRequest2Txn Processed session termination for sessionid: 0x13ca77aee720005
[junit4:junit4]   2> 6798 T467 oaz.ClientCnxn$EventThread.run EventThread shut down
[junit4:junit4]   2> 6798 T428 oaz.ZooKeeper.close Session: 0x13ca77aee720005 closed
[junit4:junit4]   2> 6799 T430 oazs.NIOServerCnxn.doIO WARNING caught end of stream exception EndOfStreamException: Unable to read additional data from client sessionid 0x13ca77aee720005, likely client has closed socket
[junit4:junit4]   2> 	at org.apache.zookeeper.server.NIOServerCnxn.doIO(NIOServerCnxn.java:220)
[junit4:junit4]   2> 	at org.apache.zookeeper.server.NIOServerCnxnFactory.run(NIOServerCnxnFactory.java:208)
[junit4:junit4]   2> 	at java.lang.Thread.run(Thread.java:722)
[junit4:junit4]   2> 
[junit4:junit4]   2> 6799 T428 oascsi.HttpClientUtil.createClient Creating new http client, config:maxConnections=500&maxConnectionsPerHost=16&socketTimeout=60000&connTimeout=15000
[junit4:junit4]   2> 6801 T430 oazs.NIOServerCnxn.closeSock Closed socket connection for client /140.211.11.196:33189 which had sessionid 0x13ca77aee720005
[junit4:junit4]   2> 6816 T428 oaz.ZooKeeper.<init> Initiating client connection, connectString=127.0.0.1:45780/solr sessionTimeout=30000 watcher=org.apache.solr.common.cloud.ConnectionManager@3151ee66
[junit4:junit4]   2> 6818 T428 oascc.ConnectionManager.waitForConnected Waiting for client to connect to ZooKeeper
[junit4:junit4]   2> 6818 T468 oaz.ClientCnxn$SendThread.logStartConnect Opening socket connection to server localhost/127.0.0.1:45780. Will not attempt to authenticate using SASL (access denied ("javax.security.auth.AuthPermission" "getLoginConfiguration"))
[junit4:junit4]   2> 6819 T468 oaz.ClientCnxn$SendThread.primeConnection Socket connection established to localhost/127.0.0.1:45780, initiating session
[junit4:junit4]   2> 6819 T430 oazs.NIOServerCnxnFactory.run Accepted socket connection from /140.211.11.196:15764
[junit4:junit4]   2> 6820 T430 oazs.ZooKeeperServer.processConnectRequest Client attempting to establish new session at /140.211.11.196:15764
[junit4:junit4]   2> 6821 T434 oazs.ZooKeeperServer.finishSessionInit Established session 0x13ca77aee720006 with negotiated timeout 20000 for client /140.211.11.196:15764
[junit4:junit4]   2> 6821 T468 oaz.ClientCnxn$SendThread.onConnected Session establishment complete on server localhost/127.0.0.1:45780, sessionid = 0x13ca77aee720006, negotiated timeout = 20000
[junit4:junit4]   2> 6822 T469 oascc.ConnectionManager.process Watcher org.apache.solr.common.cloud.ConnectionManager@3151ee66 name:ZooKeeperConnection Watcher:127.0.0.1:45780/solr got event WatchedEvent state:SyncConnected type:None path:null path:null type:None
[junit4:junit4]   2> 6822 T428 oascc.ConnectionManager.waitForConnected Client is connected to ZooKeeper
[junit4:junit4]   2> 6823 T435 oazs.PrepRequestProcessor.pRequest Got user-level KeeperException when processing sessionid:0x13ca77aee720006 type:create cxid:0x1 zxid:0x49 txntype:-1 reqpath:n/a Error Path:/solr/overseer Error:KeeperErrorCode = NodeExists for /solr/overseer
[junit4:junit4]   2> 6825 T435 oazs.PrepRequestProcessor.pRequest Got user-level KeeperException when processing sessionid:0x13ca77aee720006 type:create cxid:0x2 zxid:0x4a txntype:-1 reqpath:n/a Error Path:/solr/overseer Error:KeeperErrorCode = NodeExists for /solr/overseer
[junit4:junit4]   2> 6833 T428 oasc.ZkController.createEphemeralLiveNode Register node as live in ZooKeeper:/live_nodes/127.0.0.1:58138_sp_ffw%2Ff
[junit4:junit4]   2> 6835 T435 oazs.PrepRequestProcessor.pRequest Got user-level KeeperException when processing sessionid:0x13ca77aee720006 type:delete cxid:0x4 zxid:0x4b txntype:-1 reqpath:n/a Error Path:/solr/live_nodes/127.0.0.1:58138_sp_ffw%2Ff Error:KeeperErrorCode = NoNode for /solr/live_nodes/127.0.0.1:58138_sp_ffw%2Ff
[junit4:junit4]   2> 6836 T428 oascc.SolrZkClient.makePath makePath: /live_nodes/127.0.0.1:58138_sp_ffw%2Ff
[junit4:junit4]   2> 6841 T450 oascc.ZkStateReader$3.process Updating live nodes... (2)
[junit4:junit4]   2> 6841 T450 oascc.ZkStateReader$2.process A cluster state change: WatchedEvent state:SyncConnected type:NodeChildrenChanged path:/live_nodes, has occurred - updating... (live nodes size: 2)
[junit4:junit4]   2> 6841 T456 oascc.ZkStateReader$3.process Updating live nodes... (2)
[junit4:junit4]   2> 6851 T428 oascc.ZkStateReader.createClusterStateWatchersAndUpdate Updating cluster state from ZooKeeper... 
[junit4:junit4]   2> 6859 T470 oasc.CoreContainer.create Creating SolrCore 'collection1' using instanceDir: /usr/home/hudson/hudson-slave/workspace/Lucene-Solr-Tests-trunk-java7/solr/build/solr-core/test/J0/./org.apache.solr.cloud.BasicDistributedZkTest-jetty1-1360019523266/collection1
[junit4:junit4]   2> 6859 T470 oasc.ZkController.createCollectionZkNode Check for collection zkNode:collection1
[junit4:junit4]   2> 6860 T470 oasc.ZkController.createCollectionZkNode Collection zkNode exists
[junit4:junit4]   2> 6861 T470 oasc.ZkController.readConfigName Load collection config from:/collections/collection1
[junit4:junit4]   2> 6863 T470 oasc.SolrResourceLoader.<init> new SolrResourceLoader for directory: '/usr/home/hudson/hudson-slave/workspace/Lucene-Solr-Tests-trunk-java7/solr/build/solr-core/test/J0/./org.apache.solr.cloud.BasicDistributedZkTest-jetty1-1360019523266/collection1/'
[junit4:junit4]   2> 6864 T470 oasc.SolrResourceLoader.replaceClassLoader Adding 'file:/usr/home/hudson/hudson-slave/workspace/Lucene-Solr-Tests-trunk-java7/solr/build/solr-core/test/J0/org.apache.solr.cloud.BasicDistributedZkTest-jetty1-1360019523266/collection1/lib/README' to classloader
[junit4:junit4]   2> 6865 T470 oasc.SolrResourceLoader.replaceClassLoader Adding 'file:/usr/home/hudson/hudson-slave/workspace/Lucene-Solr-Tests-trunk-java7/solr/build/solr-core/test/J0/org.apache.solr.cloud.BasicDistributedZkTest-jetty1-1360019523266/collection1/lib/classes/' to classloader
[junit4:junit4]   2> 6923 T470 oasc.SolrConfig.<init> Using Lucene MatchVersion: LUCENE_50
[junit4:junit4]   2> 6999 T470 oasc.SolrConfig.<init> Loaded SolrConfig: solrconfig.xml
[junit4:junit4]   2> 7100 T470 oass.IndexSchema.readSchema Reading Solr Schema
[junit4:junit4]   2> 7108 T470 oass.IndexSchema.readSchema Schema name=test
[junit4:junit4]   2> 7759 T470 oass.OpenExchangeRatesOrgProvider.init Initialized with rates=open-exchange-rates.json, refreshInterval=1440.
[junit4:junit4]   2> 7771 T470 oass.IndexSchema.readSchema default search field in schema is text
[junit4:junit4]   2> 7776 T470 oass.IndexSchema.readSchema unique key field: id
[junit4:junit4]   2> 7802 T470 oass.FileExchangeRateProvider.reload Reloading exchange rates from file currency.xml
[junit4:junit4]   2> 7808 T470 oass.FileExchangeRateProvider.reload Reloading exchange rates from file currency.xml
[junit4:junit4]   2> 7813 T470 oass.OpenExchangeRatesOrgProvider.reload Reloading exchange rates from open-exchange-rates.json
[junit4:junit4]   2> 7815 T470 oass.OpenExchangeRatesOrgProvider.reload Reloading exchange rates from open-exchange-rates.json
[junit4:junit4]   2> 7817 T470 oasc.SolrCore.<init> [collection1] Opening new SolrCore at /usr/home/hudson/hudson-slave/workspace/Lucene-Solr-Tests-trunk-java7/solr/build/solr-core/test/J0/./org.apache.solr.cloud.BasicDistributedZkTest-jetty1-1360019523266/collection1/, dataDir=./org.apache.solr.cloud.BasicDistributedZkTest-1360019516837/jetty1/
[junit4:junit4]   2> 7817 T470 oasc.JmxMonitoredMap.<init> JMX monitoring is enabled. Adding Solr mbeans to JMX Server: com.sun.jmx.mbeanserver.JmxMBeanServer@5925c9a4
[junit4:junit4]   2> 7818 T470 oasc.SolrCore.initDirectoryFactory solr.NRTCachingDirectoryFactory
[junit4:junit4]   2> 7819 T470 oasc.CachingDirectoryFactory.get return new directory for /usr/home/hudson/hudson-slave/workspace/Lucene-Solr-Tests-trunk-java7/solr/build/solr-core/test/J0/./org.apache.solr.cloud.BasicDistributedZkTest-1360019516837/jetty1 forceNew:false
[junit4:junit4]   2> 7820 T470 oasc.CachingDirectoryFactory.close Releasing directory:/usr/home/hudson/hudson-slave/workspace/Lucene-Solr-Tests-trunk-java7/solr/build/solr-core/test/J0/./org.apache.solr.cloud.BasicDistributedZkTest-1360019516837/jetty1
[junit4:junit4]   2> 7820 T470 oasc.SolrCore.getNewIndexDir New index directory detected: old=null new=./org.apache.solr.cloud.BasicDistributedZkTest-1360019516837/jetty1/index/
[junit4:junit4]   2> 7820 T470 oasc.SolrCore.initIndex WARNING [collection1] Solr index directory './org.apache.solr.cloud.BasicDistributedZkTest-1360019516837/jetty1/index' doesn't exist. Creating new index...
[junit4:junit4]   2> 7822 T470 oasc.CachingDirectoryFactory.get return new directory for /usr/home/hudson/hudson-slave/workspace/Lucene-Solr-Tests-trunk-java7/solr/build/solr-core/test/J0/./org.apache.solr.cloud.BasicDistributedZkTest-1360019516837/jetty1/index forceNew:false
[junit4:junit4]   2> 7828 T470 oasc.SolrDeletionPolicy.onCommit SolrDeletionPolicy.onCommit: commits:num=1
[junit4:junit4]   2> 		commit{dir=RateLimitedDirectoryWrapper(NRTCachingDirectory(org.apache.lucene.store.NIOFSDirectory@/usr/home/hudson/hudson-slave/workspace/Lucene-Solr-Tests-trunk-java7/solr/build/solr-core/test/J0/org.apache.solr.cloud.BasicDistributedZkTest-1360019516837/jetty1/index lockFactory=org.apache.lucene.store.NativeFSLockFactory@3fb6de9f; maxCacheMB=48.0 maxMergeSizeMB=4.0)),segFN=segments_1,generation=1,filenames=[segments_1]
[junit4:junit4]   2> 7829 T470 oasc.SolrDeletionPolicy.updateCommits newest commit = 1[segments_1]
[junit4:junit4]   2> 7830 T470 oasc.CachingDirectoryFactory.close Releasing directory:/usr/home/hudson/hudson-slave/workspace/Lucene-Solr-Tests-trunk-java7/solr/build/solr-core/test/J0/./org.apache.solr.cloud.BasicDistributedZkTest-1360019516837/jetty1/index
[junit4:junit4]   2> 7830 T470 oasc.SolrCore.initWriters created xml: solr.XMLResponseWriter
[junit4:junit4]   2> 7831 T451 oascc.ZkStateReader.updateClusterState Updating cloud state from ZooKeeper... 
[junit4:junit4]   2> 7832 T451 oasc.Overseer$ClusterStateUpdater.updateState Update state numShards=1 message={
[junit4:junit4]   2> 	  "operation":"state",
[junit4:junit4]   2> 	  "numShards":"1",
[junit4:junit4]   2> 	  "shard":"shard1",
[junit4:junit4]   2> 	  "roles":null,
[junit4:junit4]   2> 	  "state":"active",
[junit4:junit4]   2> 	  "core":"collection1",
[junit4:junit4]   2> 	  "collection":"control_collection",
[junit4:junit4]   2> 	  "node_name":"127.0.0.1:64828_sp_ffw%2Ff",
[junit4:junit4]   2> 	  "base_url":"http://127.0.0.1:64828/sp_ffw/f"}
[junit4:junit4]   2> 7832 T470 oasup.UpdateRequestProcessorChain.init inserting DistributedUpdateProcessorFactory into updateRequestProcessorChain "dedupe"
[junit4:junit4]   2> 7833 T470 oasup.UpdateRequestProcessorChain.init inserting DistributedUpdateProcessorFactory into updateRequestProcessorChain "dedupe-allfields"
[junit4:junit4]   2> 7833 T470 oasup.UpdateRequestProcessorChain.init inserting DistributedUpdateProcessorFactory into updateRequestProcessorChain "stored_sig"
[junit4:junit4]   2> 7834 T470 oasup.UpdateRequestProcessorChain.init inserting DistributedUpdateProcessorFactory into updateRequestProcessorChain "uniq-fields"
[junit4:junit4]   2> 7834 T470 oasup.UpdateRequestProcessorChain.init inserting DistributedUpdateProcessorFactory into updateRequestProcessorChain "distrib-dup-test-chain-implicit"
[junit4:junit4]   2> 7835 T470 oasc.RequestHandlers.initHandlersFromConfig adding lazy requestHandler: solr.ReplicationHandler
[junit4:junit4]   2> 7835 T470 oasc.RequestHandlers.initHandlersFromConfig created /replication: solr.ReplicationHandler
[junit4:junit4]   2> 7836 T470 oasc.RequestHandlers.initHandlersFromConfig created standard: solr.StandardRequestHandler
[junit4:junit4]   2> 7836 T470 oasc.RequestHandlers.initHandlersFromConfig created /get: solr.RealTimeGetHandler
[junit4:junit4]   2> 7837 T470 oasc.RequestHandlers.initHandlersFromConfig created dismax: solr.SearchHandler
[junit4:junit4]   2> 7837 T470 oasc.RequestHandlers.initHandlersFromConfig created mock: org.apache.solr.core.MockQuerySenderListenerReqHandler
[junit4:junit4]   2> 7838 T470 oasc.RequestHandlers.initHandlersFromConfig created /admin/: org.apache.solr.handler.admin.AdminHandlers
[junit4:junit4]   2> 7838 T470 oasc.RequestHandlers.initHandlersFromConfig created defaults: solr.StandardRequestHandler
[junit4:junit4]   2> 7839 T470 oasc.RequestHandlers.initHandlersFromConfig adding lazy requestHandler: solr.StandardRequestHandler
[junit4:junit4]   2> 7839 T470 oasc.RequestHandlers.initHandlersFromConfig created lazy: solr.StandardRequestHandler
[junit4:junit4]   2> 7840 T470 oasc.RequestHandlers.initHandlersFromConfig created /update: solr.UpdateRequestHandler
[junit4:junit4]   2> 7840 T470 oasc.RequestHandlers.initHandlersFromConfig created /terms: org.apache.solr.handler.component.SearchHandler
[junit4:junit4]   2> 7841 T470 oasc.RequestHandlers.initHandlersFromConfig created spellCheckCompRH: org.apache.solr.handler.component.SearchHandler
[junit4:junit4]   2> 7842 T470 oasc.RequestHandlers.initHandlersFromConfig created spellCheckCompRH_Direct: org.apache.solr.handler.component.SearchHandler
[junit4:junit4]   2> 7842 T470 oasc.RequestHandlers.initHandlersFromConfig created spellCheckWithWordbreak: org.apache.solr.handler.component.SearchHandler
[junit4:junit4]   2> 7843 T470 oasc.RequestHandlers.initHandlersFromConfig created spellCheckWithWordbreak_Direct: org.apache.solr.handler.component.SearchHandler
[junit4:junit4]   2> 7844 T470 oasc.RequestHandlers.initHandlersFromConfig created spellCheckCompRH1: org.apache.solr.handler.component.SearchHandler
[junit4:junit4]   2> 7844 T470 oasc.RequestHandlers.initHandlersFromConfig created mltrh: org.apache.solr.handler.component.SearchHandler
[junit4:junit4]   2> 7845 T470 oasc.RequestHandlers.initHandlersFromConfig created tvrh: org.apache.solr.handler.component.SearchHandler
[junit4:junit4]   2> 7845 T469 oascc.ZkStateReader$2.process A cluster state change: WatchedEvent state:SyncConnected type:NodeDataChanged path:/clusterstate.json, has occurred - updating... (live nodes size: 2)
[junit4:junit4]   2> 7845 T456 oascc.ZkStateReader$2.process A cluster state change: WatchedEvent state:SyncConnected type:NodeDataChanged path:/clusterstate.json, has occurred - updating... (live nodes size: 2)
[junit4:junit4]   2> 7846 T470 oasc.RequestHandlers.initHandlersFromConfig created /mlt: solr.MoreLikeThisHandler
[junit4:junit4]   2> 7845 T450 oascc.ZkStateReader$2.process A cluster state change: WatchedEvent state:SyncConnected type:NodeDataChanged path:/clusterstate.json, has occurred - updating... (live nodes size: 2)
[junit4:junit4]   2> 7847 T470 oasc.RequestHandlers.initHandlersFromConfig created /debug/dump: solr.DumpRequestHandler
[junit4:junit4]   2> 7860 T470 oashl.XMLLoader.init xsltCacheLifetimeSeconds=60
[junit4:junit4]   2> 7865 T470 oasc.SolrCore.initDeprecatedSupport WARNING solrconfig.xml uses deprecated <admin/gettableFiles>, Please update your config to use the ShowFileRequestHandler.
[junit4:junit4]   2> 7866 T470 oasc.SolrCore.initDeprecatedSupport WARNING adding ShowFileRequestHandler with hidden files: [SCHEMA.XML, OLD_SYNONYMS.TXT, STOPWORDS.TXT, PROTWORDS.TXT, OPEN-EXCHANGE-RATES.JSON, SYNONYMS.TXT, CURRENCY.XML, MAPPING-ISOLATIN1ACCENT.TXT]
[junit4:junit4]   2> 7869 T470 oasc.CachingDirectoryFactory.close Releasing directory:/usr/home/hudson/hudson-slave/workspace/Lucene-Solr-Tests-trunk-java7/solr/build/solr-core/test/J0/./org.apache.solr.cloud.BasicDistributedZkTest-1360019516837/jetty1
[junit4:junit4]   2> 7871 T470 oass.SolrIndexSearcher.<init> Opening Searcher@4f74a09b main
[junit4:junit4]   2> 7872 T470 oasu.CommitTracker.<init> Hard AutoCommit: disabled
[junit4:junit4]   2> 7872 T470 oasu.CommitTracker.<init> Soft AutoCommit: disabled
[junit4:junit4]   2> 7873 T470 oashc.SpellCheckComponent.inform Initializing spell checkers
[junit4:junit4]   2> 7880 T470 oass.DirectSolrSpellChecker.init init: {name=direct,classname=DirectSolrSpellChecker,field=lowerfilt,minQueryLength=3}
[junit4:junit4]   2> 7933 T471 oasc.SolrCore.registerSearcher [collection1] Registered new searcher Searcher@4f74a09b main{StandardDirectoryReader(segments_1:1)}
[junit4:junit4]   2> 7938 T470 oasc.ZkController.publish publishing core=collection1 state=down
[junit4:junit4]   2> 7939 T470 oasc.ZkController.publish numShards not found on descriptor - reading it from system property
[junit4:junit4]   2> 9358 T451 oascc.ZkStateReader.updateClusterState Updating cloud state from ZooKeeper... 
[junit4:junit4]   2> 9359 T451 oasc.Overseer$ClusterStateUpdater.updateState Update state numShards=2 message={
[junit4:junit4]   2> 	  "operation":"state",
[junit4:junit4]   2> 	  "numShards":"2",
[junit4:junit4]   2> 	  "shard":null,
[junit4:junit4]   2> 	  "roles":null,
[junit4:junit4]   2> 	  "state":"down",
[junit4:junit4]   2> 	  "core":"collection1",
[junit4:junit4]   2> 	  "collection":"collection1",
[junit4:junit4]   2> 	  "node_name":"127.0.0.1:58138_sp_ffw%2Ff",
[junit4:junit4]   2> 	  "base_url":"http://127.0.0.1:58138/sp_ffw/f"}
[junit4:junit4]   2> 9359 T451 oasc.Overseer$ClusterStateUpdater.createCollection Create collection collection1 with numShards 2
[junit4:junit4]   2> 9359 T451 oasc.Overseer$ClusterStateUpdater.updateState Assigning new node to shard shard=shard1
[junit4:junit4]   2> 9373 T456 oascc.ZkStateReader$2.process A cluster state change: WatchedEvent state:SyncConnected type:NodeDataChanged path:/clusterstate.json, has occurred - updating... (live nodes size: 2)
[junit4:junit4]   2> 9375 T450 oascc.ZkStateReader$2.process A cluster state change: WatchedEvent state:SyncConnected type:NodeDataChanged path:/clusterstate.json, has occurred - updating... (live nodes size: 2)
[junit4:junit4]   2> 9375 T469 oascc.ZkStateReader$2.process A cluster state change: WatchedEvent state:SyncConnected type:NodeDataChanged path:/clusterstate.json, has occurred - updating... (live nodes size: 2)
[junit4:junit4]   2> 9943 T470 oasc.CoreContainer.registerCore registering core: collection1
[junit4:junit4]   2> 9943 T470 oasc.ZkController.register Register replica - core:collection1 address:http://127.0.0.1:58138/sp_ffw/f collection:collection1 shard:shard1
[junit4:junit4]   2> 9944 T470 oascc.SolrZkClient.makePath makePath: /collections/collection1/leader_elect/shard1/election
[junit4:junit4]   2> 9963 T435 oazs.PrepRequestProcessor.pRequest Got user-level KeeperException when processing sessionid:0x13ca77aee720006 type:delete cxid:0x45 zxid:0x5b txntype:-1 reqpath:n/a Error Path:/solr/collections/collection1/leaders Error:KeeperErrorCode = NoNode for /solr/collections/collection1/leaders
[junit4:junit4]   2> 9964 T470 oasc.ShardLeaderElectionContext.runLeaderProcess Running the leader process.
[junit4:junit4]   2> 9964 T435 oazs.PrepRequestProcessor.pRequest Got user-level KeeperException when processing sessionid:0x13ca77aee720006 type:create cxid:0x46 zxid:0x5c txntype:-1 reqpath:n/a Error Path:/solr/overseer Error:KeeperErrorCode = NodeExists for /solr/overseer
[junit4:junit4]   2> 9975 T470 oasc.ShardLeaderElectionContext.waitForReplicasToComeUp Enough replicas found to continue.
[junit4:junit4]   2> 9975 T470 oasc.ShardLeaderElectionContext.runLeaderProcess I may be the new leader - try and sync
[junit4:junit4]   2> 9975 T470 oasc.SyncStrategy.sync Sync replicas to http://127.0.0.1:58138/sp_ffw/f/collection1/
[junit4:junit4]   2> 9975 T470 oasc.SyncStrategy.syncReplicas Sync Success - now sync replicas to me
[junit4:junit4]   2> 9976 T470 oasc.SyncStrategy.syncToMe http://127.0.0.1:58138/sp_ffw/f/collection1/ has no replicas
[junit4:junit4]   2> 9976 T470 oasc.ShardLeaderElectionContext.runLeaderProcess I am the new leader: http://127.0.0.1:58138/sp_ffw/f/collection1/
[junit4:junit4]   2> 9976 T470 oascc.SolrZkClient.makePath makePath: /collections/collection1/leaders/shard1
[junit4:junit4]   2> 9983 T435 oazs.PrepRequestProcessor.pRequest Got user-level KeeperException when processing sessionid:0x13ca77aee720006 type:create cxid:0x50 zxid:0x60 txntype:-1 reqpath:n/a Error Path:/solr/overseer Error:KeeperErrorCode = NodeExists for /solr/overseer
[junit4:junit4]   2> 10883 T451 oascc.ZkStateReader.updateClusterState Updating cloud state from ZooKeeper... 
[junit4:junit4]   2> 10907 T469 oascc.ZkStateReader$2.process A cluster state change: WatchedEvent state:SyncConnected type:NodeDataChanged path:/clusterstate.json, has occurred - updating... (live nodes size: 2)
[junit4:junit4]   2> 10907 T456 oascc.ZkStateReader$2.process A cluster state change: WatchedEvent state:SyncConnected type:NodeDataChanged path:/clusterstate.json, has occurred - updating... (live nodes size: 2)
[junit4:junit4]   2> 10907 T450 oascc.ZkStateReader$2.process A cluster state change: WatchedEvent state:SyncConnected type:NodeDataChanged path:/clusterstate.json, has occurred - updating... (live nodes size: 2)
[junit4:junit4]   2> 10960 T470 oasc.ZkController.register We are http://127.0.0.1:58138/sp_ffw/f/collection1/ and leader is http://127.0.0.1:58138/sp_ffw/f/collection1/
[junit4:junit4]   2> 10960 T470 oasc.ZkController.register No LogReplay needed for core=collection1 baseURL=http://127.0.0.1:58138/sp_ffw/f
[junit4:junit4]   2> 10960 T470 oasc.ZkController.checkRecovery I am the leader, no recovery necessary
[junit4:junit4]   2> 10960 T470 oasc.ZkController.publish publishing core=collection1 state=active
[junit4:junit4]   2> 10961 T470 oasc.ZkController.publish numShards not found on descriptor - reading it from system property
[junit4:junit4]   2> 10963 T470 oascc.ZkStateReader.updateClusterState Updating cloud state from ZooKeeper... 
[junit4:junit4]   2> 10964 T428 oass.SolrDispatchFilter.init user.dir=/usr/home/hudson/hudson-slave/workspace/Lucene-Solr-Tests-trunk-java7/solr/build/solr-core/test/J0
[junit4:junit4]   2> 10965 T428 oass.SolrDispatchFilter.init SolrDispatchFilter.init() done
[junit4:junit4]   2> 10966 T428 oascsi.HttpClientUtil.createClient Creating new http client, config:maxConnections=128&maxConnectionsPerHost=32&followRedirects=false
[junit4:junit4]   2> 11158 T428 oejs.Server.doStart jetty-8.1.8.v20121106
[junit4:junit4]   2> 11162 T428 oejs.AbstractConnector.doStart Started SocketConnector@127.0.0.1:37419
[junit4:junit4]   2> 11162 T428 oass.SolrDispatchFilter.init SolrDispatchFilter.init()
[junit4:junit4]   2> 11163 T428 oasc.SolrResourceLoader.locateSolrHome JNDI not configured for solr (NoInitialContextEx)
[junit4:junit4]   2> 11163 T428 oasc.SolrResourceLoader.locateSolrHome using system property solr.solr.home: /usr/home/hudson/hudson-slave/workspace/Lucene-Solr-Tests-trunk-java7/solr/build/solr-core/test/J0/./org.apache.solr.cloud.BasicDistributedZkTest-jetty2-1360019527813
[junit4:junit4]   2> 11164 T428 oasc.CoreContainer$Initializer.initialize looking for solr.xml: /usr/home/hudson/hudson-slave/workspace/Lucene-Solr-Tests-trunk-java7/solr/build/solr-core/test/J0/./org.apache.solr.cloud.BasicDistributedZkTest-jetty2-1360019527813/solr.xml
[junit4:junit4]   2> 11164 T428 oasc.CoreContainer.<init> New CoreContainer 157865851
[junit4:junit4]   2> 11165 T428 oasc.CoreContainer.load Loading CoreContainer using Solr Home: '/usr/home/hudson/hudson-slave/workspace/Lucene-Solr-Tests-trunk-java7/solr/build/solr-core/test/J0/./org.apache.solr.cloud.BasicDistributedZkTest-jetty2-1360019527813/'
[junit4:junit4]   2> 11165 T428 oasc.SolrResourceLoader.<init> new SolrResourceLoader for directory: '/usr/home/hudson/hudson-slave/workspace/Lucene-Solr-Tests-trunk-java7/solr/build/solr-core/test/J0/./org.apache.solr.cloud.BasicDistributedZkTest-jetty2-1360019527813/'
[junit4:junit4]   2> 11221 T428 oashc.HttpShardHandlerFactory.getParameter Setting socketTimeout to: 60000
[junit4:junit4]   2> 11221 T428 oashc.HttpShardHandlerFactory.getParameter Setting urlScheme to: http://
[junit4:junit4]   2> 11222 T428 oashc.HttpShardHandlerFactory.getParameter Setting connTimeout to: 15000
[junit4:junit4]   2> 11222 T428 oashc.HttpShardHandlerFactory.getParameter Setting maxConnectionsPerHost to: 20
[junit4:junit4]   2> 11223 T428 oashc.HttpShardHandlerFactory.getParameter Setting corePoolSize to: 0
[junit4:junit4]   2> 11223 T428 oashc.HttpShardHandlerFactory.getParameter Setting maximumPoolSize to: 2147483647
[junit4:junit4]   2> 11224 T428 oashc.HttpShardHandlerFactory.getParameter Setting maxThreadIdleTime to: 5
[junit4:junit4]   2> 11224 T428 oashc.HttpShardHandlerFactory.getParameter Setting sizeOfQueue to: -1
[junit4:junit4]   2> 11224 T428 oashc.HttpShardHandlerFactory.getParameter Setting fairnessPolicy to: false
[junit4:junit4]   2> 11225 T428 oascsi.HttpClientUtil.createClient Creating new http client, config:maxConnectionsPerHost=20&maxConnections=10000&socketTimeout=60000&connTimeout=15000&retry=false
[junit4:junit4]   2> 11246 T428 oasc.CoreContainer.load Registering Log Listener
[junit4:junit4]   2> 11266 T428 oasc.CoreContainer.initZooKeeper Zookeeper client=127.0.0.1:45780/solr
[junit4:junit4]   2> 11267 T428 oasc.ZkController.checkChrootPath zkHost includes chroot
[junit4:junit4]   2> 11267 T428 oaz.ZooKeeper.<init> Initiating client connection, connectString=127.0.0.1:45780 sessionTimeout=60000 watcher=org.apache.solr.common.cloud.ConnectionManager@5bd3155b
[junit4:junit4]   2> 11269 T428 oascc.ConnectionManager.waitForConnected Waiting for client to connect to ZooKeeper
[junit4:junit4]   2> 11269 T481 oaz.ClientCnxn$SendThread.logStartConnect Opening socket connection to server localhost/127.0.0.1:45780. Will not attempt to authenticate using SASL (access denied ("javax.security.auth.AuthPermission" "getLoginConfiguration"))
[junit4:junit4]   2> 11270 T481 oaz.ClientCnxn$SendThread.primeConnection Socket connection established to localhost/127.0.0.1:45780, initiating session
[junit4:junit4]   2> 11270 T430 oazs.NIOServerCnxnFactory.run Accepted socket connection from /140.211.11.196:40216
[junit4:junit4]   2> 11270 T430 oazs.ZooKeeperServer.processConnectRequest Client attempting to establish new session at /140.211.11.196:40216
[junit4:junit4]   2> 11273 T434 oazs.ZooKeeperServer.finishSessionInit Established session 0x13ca77aee720007 with negotiated timeout 20000 for client /140.211.11.196:40216
[junit4:junit4]   2> 11273 T481 oaz.ClientCnxn$SendThread.onConnected Session establishment complete on server localhost/127.0.0.1:45780, sessionid = 0x13ca77aee720007, negotiated timeout = 20000
[junit4:junit4]   2> 11273 T482 oascc.ConnectionManager.process Watcher org.apache.solr.common.cloud.ConnectionManager@5bd3155b name:ZooKeeperConnection Watcher:127.0.0.1:45780 got event WatchedEvent state:SyncConnected type:None path:null path:null type:None
[junit4:junit4]   2> 11273 T428 oascc.ConnectionManager.waitForConnected Client is connected to ZooKeeper
[junit4:junit4]   2> 11275 T435 oazs.PrepRequestProcessor.pRequest2Txn Processed session termination for sessionid: 0x13ca77aee720007
[junit4:junit4]   2> 11286 T482 oaz.ClientCnxn$EventThread.run EventThread shut down
[junit4:junit4]   2> 11286 T430 oazs.NIOServerCnxn.closeSock Closed socket connection for client /140.211.11.196:40216 which had sessionid 0x13ca77aee720007
[junit4:junit4]   2> 11286 T428 oaz.ZooKeeper.close Session: 0x13ca77aee720007 closed
[junit4:junit4]   2> 11287 T428 oascsi.HttpClientUtil.createClient Creating new http client, config:maxConnections=500&maxConnectionsPerHost=16&socketTimeout=60000&connTimeout=15000
[junit4:junit4]   2> 11298 T428 oaz.ZooKeeper.<init> Initiating client connection, connectString=127.0.0.1:45780/solr sessionTimeout=30000 watcher=org.apache.solr.common.cloud.ConnectionManager@152e63d8
[junit4:junit4]   2> 11299 T428 oascc.ConnectionManager.waitForConnected Waiting for client to connect to ZooKeeper
[junit4:junit4]   2> 11300 T483 oaz.ClientCnxn$SendThread.logStartConnect Opening socket connection to server localhost/127.0.0.1:45780. Will not attempt to authenticate using SASL (access denied ("javax.security.auth.AuthPermission" "getLoginConfiguration"))
[junit4:junit4]   2> 11300 T483 oaz.ClientCnxn$SendThread.primeConnection Socket connection established to localhost/127.0.0.1:45780, initiating session
[junit4:junit4]   2> 11300 T430 oazs.NIOServerCnxnFactory.run Accepted socket connection from /140.211.11.196:54741
[junit4:junit4]   2> 11301 T430 oazs.ZooKeeperServer.processConnectRequest Client attempting to establish new session at /140.211.11.196:54741
[junit4:junit4]   2> 11302 T434 oazs.ZooKeeperServer.finishSessionInit Established session 0x13ca77aee720008 with negotiated timeout 20000 for client /140.211.11.196:54741
[junit4:junit4]   2> 11302 T483 oaz.ClientCnxn$SendThread.onConnected Session establishment complete on server localhost/127.0.0.1:45780, sessionid = 0x13ca77aee720008, negotiated timeout = 20000
[junit4:junit4]   2> 11303 T484 oascc.ConnectionManager.process Watcher org.apache.solr.common.cloud.ConnectionManager@152e63d8 name:ZooKeeperConnection Watcher:127.0.0.1:45780/solr got event WatchedEvent state:SyncConnected type:None path:null path:null type:None
[junit4:junit4]   2> 11303 T428 oascc.ConnectionManager.waitForConnected Client is connected to ZooKeeper
[junit4:junit4]   2> 11304 T435 oazs.PrepRequestProcessor.pRequest Got user-level KeeperException when processing sessionid:0x13ca77aee720008 type:create cxid:0x1 zxid:0x6d txntype:-1 reqpath:n/a Error Path:/solr/overseer Error:KeeperErrorCode = NodeExists for /solr/overseer
[junit4:junit4]   2> 11306 T435 oazs.PrepRequestProcessor.pRequest Got user-level KeeperException when processing sessionid:0x13ca77aee720008 type:create cxid:0x2 zxid:0x6e txntype:-1 reqpath:n/a Error Path:/solr/overseer Error:KeeperErrorCode = NodeExists for /solr/overseer
[junit4:junit4]   2> 11313 T428 oasc.ZkController.createEphemeralLiveNode Register node as live in ZooKeeper:/live_nodes/127.0.0.1:37419_sp_ffw%2Ff
[junit4:junit4]   2> 11314 T435 oazs.PrepRequestProcessor.pRequest Got user-level KeeperException when processing sessionid:0x13ca77aee720008 type:delete cxid:0x4 zxid:0x6f txntype:-1 reqpath:n/a Error Path:/solr/live_nodes/127.0.0.1:37419_sp_ffw%2Ff Error:KeeperErrorCode = NoNode for /solr/live_nodes/127.0.0.1:37419_sp_ffw%2Ff
[junit4:junit4]   2> 11315 T428 oascc.SolrZkClient.makePath makePath: /live_nodes/127.0.0.1:37419_sp_ffw%2Ff
[junit4:junit4]   2> 11319 T469 oascc.ZkStateReader$3.process Updating live nodes... (3)
[junit4:junit4]   2> 11320 T456 oascc.ZkStateReader$3.process Updating live nodes... (3)
[junit4:junit4]   2> 11320 T469 oascc.ZkStateReader$2.process A cluster state change: WatchedEvent state:SyncConnected type:NodeChildrenChanged path:/live_nodes, has occurred - updating... (live nodes size: 3)
[junit4:junit4]   2> 11320 T456 oascc.ZkStateReader$2.process A cluster state change: WatchedEvent state:SyncConnected type:NodeChildrenChanged path:/live_nodes, has occurred - updating... (live nodes size: 3)
[junit4:junit4]   2> 11320 T450 oascc.ZkStateReader$3.process Updating live nodes... (3)
[junit4:junit4]   2> 11320 T450 oascc.ZkStateReader$2.process A cluster state change: WatchedEvent state:SyncConnected type:NodeChildrenChanged path:/live_nodes, has occurred - updating... (live nodes size: 3)
[junit4:junit4]   2> 11325 T428 oascc.ZkStateReader.createClusterStateWatchersAndUpdate Updating cluster state from ZooKeeper... 
[junit4:junit4]   2> 11333 T485 oasc.CoreContainer.create Creating SolrCore 'collection1' using instanceDir: /usr/home/hudson/hudson-slave/workspace/Lucene-Solr-Tests-trunk-java7/solr/build/solr-core/test/J0/./org.apache.solr.cloud.BasicDistributedZkTest-jetty2-1360019527813/collection1
[junit4:junit4]   2> 11333 T485 oasc.ZkController.createCollectionZkNode Check for collection zkNode:collection1
[junit4:junit4]   2> 11334 T485 oasc.ZkController.createCollectionZkNode Collection zkNode exists
[junit4:junit4]   2> 11334 T485 oasc.ZkController.readConfigName Load collection config from:/collections/collection1
[junit4:junit4]   2> 11336 T485 oasc.SolrResourceLoader.<init> new SolrResourceLoader for directory: '/usr/home/hudson/hudson-slave/workspace/Lucene-Solr-Tests-trunk-java7/solr/build/solr-core/test/J0/./org.apache.solr.cloud.BasicDistributedZkTest-jetty2-1360019527813/collection1/'
[junit4:junit4]   2> 11338 T485 oasc.SolrResourceLoader.replaceClassLoader Adding 'file:/usr/home/hudson/hudson-slave/workspace/Lucene-Solr-Tests-trunk-java7/solr/build/solr-core/test/J0/org.apache.solr.cloud.BasicDistributedZkTest-jetty2-1360019527813/collection1/lib/README' to classloader
[junit4:junit4]   2> 11338 T485 oasc.SolrResourceLoader.replaceClassLoader Adding 'file:/usr/home/hudson/hudson-slave/workspace/Lucene-Solr-Tests-trunk-java7/solr/build/solr-core/test/J0/org.apache.solr.cloud.BasicDistributedZkTest-jetty2-1360019527813/collection1/lib/classes/' to classloader
[junit4:junit4]   2> 11393 T485 oasc.SolrConfig.<init> Using Lucene MatchVersion: LUCENE_50
[junit4:junit4]   2> 11467 T485 oasc.SolrConfig.<init> Loaded SolrConfig: solrconfig.xml
[junit4:junit4]   2> 11568 T485 oass.IndexSchema.readSchema Reading Solr Schema
[junit4:junit4]   2> 11576 T485 oass.IndexSchema.readSchema Schema name=test
[junit4:junit4]   2> 12240 T485 oass.OpenExchangeRatesOrgProvider.init Initialized with rates=open-exchange-rates.json, refreshInterval=1440.
[junit4:junit4]   2> 12252 T485 oass.IndexSchema.readSchema default search field in schema is text
[junit4:junit4]   2> 12256 T485 oass.IndexSchema.readSchema unique key field: id
[junit4:junit4]   2> 12283 T485 oass.FileExchangeRateProvider.reload Reloading exchange rates from file currency.xml
[junit4:junit4]   2> 12289 T485 oass.FileExchangeRateProvider.reload Reloading exchange rates from file currency.xml
[junit4:junit4]   2> 12294 T485 oass.OpenExchangeRatesOrgProvider.reload Reloading exchange rates from open-exchange-rates.json
[junit4:junit4]   2> 12296 T485 oass.OpenExchangeRatesOrgProvider.reload Reloading exchange rates from open-exchange-rates.json
[junit4:junit4]   2> 12298 T485 oasc.SolrCore.<init> [collection1] Opening new SolrCore at /usr/home/hudson/hudson-slave/workspace/Lucene-Solr-Tests-trunk-java7/solr/build/solr-core/test/J0/./org.apache.solr.cloud.BasicDistributedZkTest-jetty2-1360019527813/collection1/, dataDir=./org.apache.solr.cloud.BasicDistributedZkTest-1360019516837/jetty2/
[junit4:junit4]   2> 12298 T485 oasc.JmxMonitoredMap.<init> JMX monitoring is enabled. Adding Solr mbeans to JMX Server: com.sun.jmx.mbeanserver.JmxMBeanServer@5925c9a4
[junit4:junit4]   2> 12299 T485 oasc.SolrCore.initDirectoryFactory solr.NRTCachingDirectoryFactory
[junit4:junit4]   2> 12299 T485 oasc.CachingDirectoryFactory.get return new directory for /usr/home/hudson/hudson-slave/workspace/Lucene-Solr-Tests-trunk-java7/solr/build/solr-core/test/J0/./org.apache.solr.cloud.BasicDistributedZkTest-1360019516837/jetty2 forceNew:false
[junit4:junit4]   2> 12300 T485 oasc.CachingDirectoryFactory.close Releasing directory:/usr/home/hudson/hudson-slave/workspace/Lucene-Solr-Tests-trunk-java7/solr/build/solr-core/test/J0/./org.apache.solr.cloud.BasicDistributedZkTest-1360019516837/jetty2
[junit4:junit4]   2> 12300 T485 oasc.SolrCore.getNewIndexDir New index directory detected: old=null new=./org.apache.solr.cloud.BasicDistributedZkTest-1360019516837/jetty2/index/
[junit4:junit4]   2> 12301 T485 oasc.SolrCore.initIndex WARNING [collection1] Solr index directory './org.apache.solr.cloud.BasicDistributedZkTest-1360019516837/jetty2/index' doesn't exist. Creating new index...
[junit4:junit4]   2> 12302 T485 oasc.CachingDirectoryFactory.get return new directory for /usr/home/hudson/hudson-slave/workspace/Lucene-Solr-Tests-trunk-java7/solr/build/solr-core/test/J0/./org.apache.solr.cloud.BasicDistributedZkTest-1360019516837/jetty2/index forceNew:false
[junit4:junit4]   2> 12313 T485 oasc.SolrDeletionPolicy.onCommit SolrDeletionPolicy.onCommit: commits:num=1
[junit4:junit4]   2> 		commit{dir=RateLimitedDirectoryWrapper(NRTCachingDirectory(org.apache.lucene.store.NIOFSDirectory@/usr/home/hudson/hudson-slave/workspace/Lucene-Solr-Tests-trunk-java7/solr/build/solr-core/test/J0/org.apache.solr.cloud.BasicDistributedZkTest-1360019516837/jetty2/index lockFactory=org.apache.lucene.store.NativeFSLockFactory@475d785c; maxCacheMB=48.0 maxMergeSizeMB=4.0)),segFN=segments_1,generation=1,filenames=[segments_1]
[junit4:junit4]   2> 12313 T485 oasc.SolrDeletionPolicy.updateCommits newest commit = 1[segments_1]
[junit4:junit4]   2> 12314 T485 oasc.CachingDirectoryFactory.close Releasing directory:/usr/home/hudson/hudson-slave/workspace/Lucene-Solr-Tests-trunk-java7/solr/build/solr-core/test/J0/./org.apache.solr.cloud.BasicDistributedZkTest-1360019516837/jetty2/index
[junit4:junit4]   2> 12315 T485 oasc.SolrCore.initWriters created xml: solr.XMLResponseWriter
[junit4:junit4]   2> 12317 T485 oasup.UpdateRequestProcessorChain.init inserting DistributedUpdateProcessorFactory into updateRequestProcessorChain "dedupe"
[junit4:junit4]   2> 12317 T485 oasup.UpdateRequestProcessorChain.init inserting DistributedUpdateProcessorFactory into updateRequestProcessorChain "dedupe-allfields"
[junit4:junit4]   2> 12317 T485 oasup.UpdateRequestProcessorChain.init inserting DistributedUpdateProcessorFactory into updateRequestProcessorChain "stored_sig"
[junit4:junit4]   2> 12318 T485 oasup.UpdateRequestProcessorChain.init inserting DistributedUpdateProcessorFactory into updateRequestProcessorChain "uniq-fields"
[junit4:junit4]   2> 12319 T485 oasup.UpdateRequestProcessorChain.init inserting DistributedUpdateProcessorFactory into updateRequestProcessorChain "distrib-dup-test-chain-implicit"
[junit4:junit4]   2> 12319 T485 oasc.RequestHandlers.initHandlersFromConfig adding lazy requestHandler: solr.ReplicationHandler
[junit4:junit4]   2> 12319 T485 oasc.RequestHandlers.initHandlersFromConfig created /replication: solr.ReplicationHandler
[junit4:junit4]   2> 12320 T485 oasc.RequestHandlers.initHandlersFromConfig created standard: solr.StandardRequestHandler
[junit4:junit4]   2> 12320 T485 oasc.RequestHandlers.initHandlersFromConfig created /get: solr.RealTimeGetHandler
[junit4:junit4]   2> 12321 T485 oasc.RequestHandlers.initHandlersFromConfig created dismax: solr.SearchHandler
[junit4:junit4]   2> 12322 T485 oasc.RequestHandlers.initHandlersFromConfig created mock: org.apache.solr.core.MockQuerySenderListenerReqHandler
[junit4:junit4]   2> 12322 T485 oasc.RequestHandlers.initHandlersFromConfig created /admin/: org.apache.solr.handler.admin.AdminHandlers
[junit4:junit4]   2> 12323 T485 oasc.RequestHandlers.initHandlersFromConfig created defaults: solr.StandardRequestHandler
[junit4:junit4]   2> 12323 T485 oasc.RequestHandlers.initHandlersFromConfig adding lazy requestHandler: solr.StandardRequestHandler
[junit4:junit4]   2> 12323 T485 oasc.RequestHandlers.initHandlersFromConfig created lazy: solr.StandardRequestHandler
[junit4:junit4]   2> 12324 T485 oasc.RequestHandlers.initHandlersFromConfig created /update: solr.UpdateRequestHandler
[junit4:junit4]   2> 12324 T485 oasc.RequestHandlers.initHandlersFromConfig created /terms: org.apache.solr.handler.component.SearchHandler
[junit4:junit4]   2> 12325 T485 oasc.RequestHandlers.initHandlersFromConfig created spellCheckCompRH: org.apache.solr.handler.component.SearchHandler
[junit4:junit4]   2> 12326 T485 oasc.RequestHandlers.initHandlersFromConfig created spellCheckCompRH_Direct: org.apache.solr.handler.component.SearchHandler
[junit4:junit4]   2> 12326 T485 oasc.RequestHandlers.initHandlersFromConfig created spellCheckWithWordbreak: org.apache.solr.handler.component.SearchHandler
[junit4:junit4]   2> 12327 T485 oasc.RequestHandlers.initHandlersFromConfig created spellCheckWithWordbreak_Direct: org.apache.solr.handler.component.SearchHandler
[junit4:junit4]   2> 12327 T485 oasc.RequestHandlers.initHandlersFromConfig created spellCheckCompRH1: org.apache.solr.handler.component.SearchHandler
[junit4:junit4]   2> 12328 T485 oasc.RequestHandlers.initHandlersFromConfig created mltrh: org.apache.solr.handler.component.SearchHandler
[junit4:junit4]   2> 12328 T485 oasc.RequestHandlers.initHandlersFromConfig created tvrh: org.apache.solr.handler.component.SearchHandler
[junit4:junit4]   2> 12329 T485 oasc.RequestHandlers.initHandlersFromConfig created /mlt: solr.MoreLikeThisHandler
[junit4:junit4]   2> 12330 T485 oasc.RequestHandlers.initHandlersFromConfig created /debug/dump: solr.DumpRequestHandler
[junit4:junit4]   2> 12342 T485 oashl.XMLLoader.init xsltCacheLifetimeSeconds=60
[junit4:junit4]   2> 12347 T485 oasc.SolrCore.initDeprecatedSupport WARNING solrconfig.xml uses deprecated <admin/gettableFiles>, Please update your config to use the ShowFileRequestHandler.
[junit4:junit4]   2> 12348 T485 oasc.SolrCore.initDeprecatedSupport WARNING adding ShowFileRequestHandler with hidden files: [SCHEMA.XML, OLD_SYNONYMS.TXT, STOPWORDS.TXT, PROTWORDS.TXT, OPEN-EXCHANGE-RATES.JSON, SYNONYMS.TXT, CURRENCY.XML, MAPPING-ISOLATIN1ACCENT.TXT]
[junit4:junit4]   2> 12351 T485 oasc.CachingDirectoryFactory.close Releasing directory:/usr/home/hudson/hudson-slave/workspace/Lucene-Solr-Tests-trunk-java7/solr/build/solr-core/test/J0/./org.apache.solr.cloud.BasicDistributedZkTest-1360019516837/jetty2
[junit4:junit4]   2> 12353 T485 oass.SolrIndexSearcher.<init> Opening Searcher@713d0cf main
[junit4:junit4]   2> 12354 T485 oasu.CommitTracker.<init> Hard AutoCommit: disabled
[junit4:junit4]   2> 12354 T485 oasu.CommitTracker.<init> Soft AutoCommit: disabled
[junit4:junit4]   2> 12355 T485 oashc.SpellCheckComponent.inform Initializing spell checkers
[junit4:junit4]   2> 12362 T485 oass.DirectSolrSpellChecker.init init: {name=direct,classname=DirectSolrSpellChecker,field=lowerfilt,minQueryLength=3}
[junit4:junit4]   2> 12414 T486 oasc.SolrCore.registerSearcher [collection1] Registered new searcher Searcher@713d0cf main{StandardDirectoryReader(segments_1:1)}
[junit4:junit4]   2> 12420 T485 oasc.ZkController.publish publishing core=collection1 state=down
[junit4:junit4]   2> 12420 T485 oasc.ZkController.publish numShards not found on descriptor - reading it from system property
[junit4:junit4]   2> 12423 T451 oascc.ZkStateReader.updateClusterState Updating cloud state from ZooKeeper... 
[junit4:junit4]   2> 12424 T451 oasc.Overseer$ClusterStateUpdater.updateState Update state numShards=2 message={
[junit4:junit4]   2> 	  "operation":"state",
[junit4:junit4]   2> 	  "numShards":"2",
[junit4:junit4]   2> 	  "shard":"shard1",
[junit4:junit4]   2> 	  "roles":null,
[junit4:junit4]   2> 	  "state":"active",
[junit4:junit4]   2> 	  "core":"collection1",
[junit4:junit4]   2> 	  "collection":"collection1",
[junit4:junit4]   2> 	  "node_name":"127.0.0.1:58138_sp_ffw%2Ff",
[junit4:junit4]   2> 	  "base_url":"http://127.0.0.1:58138/sp_ffw/f"}
[junit4:junit4]   2> 12435 T451 oasc.Overseer$ClusterStateUpdater.updateState Update state numShards=2 message={
[junit4:junit4]   2> 	  "operation":"state",
[junit4:junit4]   2> 	  "numShards":"2",
[junit4:junit4]   2> 	  "shard":null,
[junit4:junit4]   2> 	  "roles":null,
[junit4:junit4]   2> 	  "state":"down",
[junit4:junit4]   2> 	  "core":"collection1",
[junit4:junit4]   2> 	  "collection":"collection1",
[junit4:junit4]   2> 	  "node_name":"127.0.0.1:37419_sp_ffw%2Ff",
[junit4:junit4]   2> 	  "base_url":"http://127.0.0.1:37419/sp_ffw/f"}
[junit4:junit4]   2> 12435 T451 oasc.Overseer$ClusterStateUpdater.updateState Collection already exists with numShards=2
[junit4:junit4]   2> 12435 T451 oasc.Overseer$ClusterStateUpdater.updateState Assigning new node to shard shard=shard2
[junit4:junit4]   2> 12447 T456 oascc.ZkStateReader$2.process A cluster state change: WatchedEvent state:SyncConnected type:NodeDataChanged path:/clusterstate.json, has occurred - updating... (live nodes size: 3)
[junit4:junit4]   2> 12447 T484 oascc.ZkStateReader$2.process A cluster state change: WatchedEvent state:SyncConnected type:NodeDataChanged path:/clusterstate.json, has occurred - updating... (live nodes size: 3)
[junit4:junit4]   2> 12447 T469 oascc.ZkStateReader$2.process A cluster state change: WatchedEvent state:SyncConnected type:NodeDataChanged path:/clusterstate.json, has occurred - updating... (live nodes size: 3)
[junit4:junit4]   2> 12447 T450 oascc.ZkStateReader$2.process A cluster state change: WatchedEvent state:SyncConnected type:NodeDataChanged path:/clusterstate.json, has occurred - updating... (live nodes size: 3)
[junit4:junit4]   2> 13423 T485 oasc.CoreContainer.registerCore registering core: collection1
[junit4:junit4]   2> 13423 T485 oasc.ZkController.register Register replica - core:collection1 address:http://127.0.0.1:37419/sp_ffw/f collection:collection1 shard:shard2
[junit4:junit4]   2> 13424 T485 oascc.SolrZkClient.makePath makePath: /collections/collection1/leader_elect/shard2/election
[junit4:junit4]   2> 13469 T435 oazs.PrepRequestProcessor.pRequest Got user-level KeeperException when processing sessionid:0x13ca77aee720008 type:delete cxid:0x42 zxid:0x7d txntype:-1 reqpath:n/a Error Path:/solr/collections/collection1/leaders/shard2 Error:KeeperErrorCode = NoNode for /solr/collections/collection1/leaders/shard2
[junit4:junit4]   2> 13470 T485 oasc.ShardLeaderElectionContext.runLeaderProcess Running the leader process.
[junit4:junit4]   2> 13471 T435 oazs.PrepRequestProcessor.pRequest Got user-level KeeperException when processing sessionid:0x13ca77aee720008 type:create cxid:0x43 zxid:0x7e txntype:-1 reqpath:n/a Error Path:/solr/overseer Error:KeeperErrorCode = NodeExists for /solr/overseer
[junit4:junit4]   2> 13481 T485 oasc.ShardLeaderElectionContext.waitForReplicasToComeUp Enough replicas found to continue.
[junit4:junit4]   2> 13481 T485 oasc.ShardLeaderElectionContext.runLeaderProcess I may be the new leader - try and sync
[junit4:junit4]   2> 13481 T485 oasc.SyncStrategy.sync Sync replicas to http://127.0.0.1:37419/sp_ffw/f/collection1/
[junit4:junit4]   2> 13481 T485 oasc.SyncStrategy.syncReplicas Sync Success - now sync replicas to me
[junit4:junit4]   2> 13482 T485 oasc.SyncStrategy.syncToMe http://127.0.0.1:37419/sp_ffw/f/collection1/ has no replicas
[junit4:junit4]   2> 13482 T485 oasc.ShardLeaderElectionContext.runLeaderProcess I am the new leader: http://127.0.0.1:37419/sp_ffw/f/collection1/
[junit4:junit4]   2> 13482 T485 oascc.SolrZkClient.makePath makePath: /collections/collection1/leaders/shard2
[junit4:junit4]   2> 13487 T435 oazs.PrepRequestProcessor.pRequest Got user-level KeeperException when processing sessionid:0x13ca77aee720008 type:create cxid:0x4c zxid:0x81 txntype:-1 reqpath:n/a Error Path:/solr/overseer Error:KeeperErrorCode = NodeExists for /solr/overseer
[junit4:junit4]   2> 13958 T451 oascc.ZkStateReader.updateClusterState Updating cloud state from ZooKeeper... 
[junit4:junit4]   2> 13978 T456 oascc.ZkStateReader$2.process A cluster state change: WatchedEvent state:SyncConnected type:NodeDataChanged path:/clusterstate.json, has occurred - updating... (live nodes size: 3)
[junit4:junit4]   2> 13978 T469 oascc.ZkStateReader$2.process A cluster state change: WatchedEvent state:SyncConnected type:NodeDataChanged path:/clusterstate.json, has occurred - updating... (live nodes size: 3)
[junit4:junit4]   2> 13978 T450 oascc.ZkStateReader$2.process A cluster state change: WatchedEvent state:SyncConnected type:NodeDataChanged path:/clusterstate.json, has occurred - updating... (live nodes size: 3)
[junit4:junit4]   2> 13978 T484 oascc.ZkStateReader$2.process A cluster state change: WatchedEvent state:SyncConnected type:NodeDataChanged path:/clusterstate.json, has occurred - updating... (live nodes size: 3)
[junit4:junit4]   2> 14000 T485 oasc.ZkController.register We are http://127.0.0.1:37419/sp_ffw/f/collection1/ and leader is http://127.0.0.1:37419/sp_ffw/f/collection1/
[junit4:junit4]   2> 14000 T485 oasc.ZkController.register No LogReplay needed for core=collection1 baseURL=http://127.0.0.1:37419/sp_ffw/f
[junit4:junit4]   2> 14000 T485 oasc.ZkController.checkRecovery I am the leader, no recovery necessary
[junit4:junit4]   2> 14000 T485 oasc.ZkController.publish publishing core=collection1 state=active
[junit4:junit4]   2> 14001 T485 oasc.ZkController.publish numShards not found on descriptor - reading it from system property
[junit4:junit4]   2> 14003 T485 oascc.ZkStateReader.updateClusterState Updating cloud state from ZooKeeper... 
[junit4:junit4]   2> 14004 T428 oass.SolrDispatchFilter.init user.dir=/usr/home/hudson/hudson-slave/workspace/Lucene-Solr-Tests-trunk-java7/solr/build/solr-core/test/J0
[junit4:junit4]   2> 14005 T428 oass.SolrDispatchFilter.init SolrDispatchFilter.init() done
[junit4:junit4]   2> 14005 T428 oascsi.HttpClientUtil.createClient Creating new http client, config:maxConnections=128&maxConnectionsPerHost=32&followRedirects=false
[junit4:junit4]   2> 14191 T428 oejs.Server.doStart jetty-8.1.8.v20121106
[junit4:junit4]   2> 14194 T428 oejs.AbstractConnector.doStart Started SocketConnector@127.0.0.1:30255
[junit4:junit4]   2> 14195 T428 oass.SolrDispatchFilter.init SolrDispatchFilter.init()
[junit4:junit4]   2> 14195 T428 oasc.SolrResourceLoader.locateSolrHome JNDI not configured for solr (NoInitialContextEx)
[junit4:junit4]   2> 14196 T428 oasc.SolrResourceLoader.locateSolrHome using system property solr.solr.home: /usr/home/hudson/hudson-slave/workspace/Lucene-Solr-Tests-trunk-java7/solr/build/solr-core/test/J0/./org.apache.solr.cloud.BasicDistributedZkTest-jetty3-1360019530853
[junit4:junit4]   2> 14196 T428 oasc.CoreContainer$Initializer.initialize looking for solr.xml: /usr/home/hudson/hudson-slave/workspace/Lucene-Solr-Tests-trunk-java7/solr/build/solr-core/test/J0/./org.apache.solr.cloud.BasicDistributedZkTest-jetty3-1360019530853/solr.xml
[junit4:junit4]   2> 14197 T428 oasc.CoreContainer.<init> New CoreContainer 363940238
[junit4:junit4]   2> 14197 T428 oasc.CoreContainer.load Loading CoreContainer using Solr Home: '/usr/home/hudson/hudson-slave/workspace/Lucene-Solr-Tests-trunk-java7/solr/build/solr-core/test/J0/./org.apache.solr.cloud.BasicDistributedZkTest-jetty3-1360019530853/'
[junit4:junit4]   2> 14198 T428 oasc.SolrResourceLoader.<init> new SolrResourceLoader for directory: '/usr/home/hudson/hudson-slave/workspace/Lucene-Solr-Tests-trunk-java7/solr/build/solr-core/test/J0/./org.apache.solr.cloud.BasicDistributedZkTest-jetty3-1360019530853/'
[junit4:junit4]   2> 14253 T428 oashc.HttpShardHandlerFactory.getParameter Setting socketTimeout to: 60000
[junit4:junit4]   2> 14253 T428 oashc.HttpShardHandlerFactory.getParameter Setting urlScheme to: http://
[junit4:junit4]   2> 14254 T428 oashc.HttpShardHandlerFactory.getParameter Setting connTimeout to: 15000
[junit4:junit4]   2> 14254 T428 oashc.HttpShardHandlerFactory.getParameter Setting maxConnectionsPerHost to: 20
[junit4:junit4]   2> 14254 T428 oashc.HttpShardHandlerFactory.getParameter Setting corePoolSize to: 0
[junit4:junit4]   2> 14255 T428 oashc.HttpShardHandlerFactory.getParameter Setting maximumPoolSize to: 2147483647
[junit4:junit4]   2> 14255 T428 oashc.HttpShardHandlerFactory.getParameter Setting maxThreadIdleTime to: 5
[junit4:junit4]   2> 14256 T428 oashc.HttpShardHandlerFactory.getParameter Setting sizeOfQueue to: -1
[junit4:junit4]   2> 14256 T428 oashc.HttpShardHandlerFactory.getParameter Setting fairnessPolicy to: false
[junit4:junit4]   2> 14257 T428 oascsi.HttpClientUtil.createClient Creating new http client, config:maxConnectionsPerHost=20&maxConnections=10000&socketTimeout=60000&connTimeout=15000&retry=false
[junit4:junit4]   2> 14280 T428 oasc.CoreContainer.load Registering Log Listener
[junit4:junit4]   2> 14300 T428 oasc.CoreContainer.initZooKeeper Zookeeper client=127.0.0.1:45780/solr
[junit4:junit4]   2> 14301 T428 oasc.ZkController.checkChrootPath zkHost includes chroot
[junit4:junit4]   2> 14301 T428 oaz.ZooKeeper.<init> Initiating client connection, connectString=127.0.0.1:45780 sessionTimeout=60000 watcher=org.apache.solr.common.cloud.ConnectionManager@5c65b07d
[junit4:junit4]   2> 14302 T428 oascc.ConnectionManager.waitForConnected Waiting for client to connect to ZooKeeper
[junit4:junit4]   2> 14303 T496 oaz.ClientCnxn$SendThread.logStartConnect Opening socket connection to server localhost/127.0.0.1:45780. Will not attempt to authenticate using SASL (access denied ("javax.security.auth.AuthPermission" "getLoginConfiguration"))
[junit4:junit4]   2> 14304 T496 oaz.ClientCnxn$SendThread.primeConnection Socket connection established to localhost/127.0.0.1:45780, initiating session
[junit4:junit4]   2> 14304 T430 oazs.NIOServerCnxnFactory.run Accepted socket connection from /140.211.11.196:12017
[junit4:junit4]   2> 14305 T430 oazs.ZooKeeperServer.processConnectRequest Client attempting to establish new session at /140.211.11.196:12017
[junit4:junit4]   2> 14307 T434 oazs.ZooKeeperServer.finishSessionInit Established session 0x13ca77aee720009 with negotiated timeout 20000 for client /140.211.11.196:12017
[junit4:junit4]   2> 14307 T496 oaz.ClientCnxn$SendThread.onConnected Session establishment complete on server localhost/127.0.0.1:45780, sessionid = 0x13ca77aee720009, negotiated timeout = 20000
[junit4:junit4]   2> 14307 T497 oascc.ConnectionManager.process Watcher org.apache.solr.common.cloud.ConnectionManager@5c65b07d name:ZooKeeperConnection Watcher:127.0.0.1:45780 got event WatchedEvent state:SyncConnected type:None path:null path:null type:None
[junit4:junit4]   2> 14307 T428 oascc.ConnectionManager.waitForConnected Client is connected to ZooKeeper
[junit4:junit4]   2> 14309 T435 oazs.PrepRequestProcessor.pRequest2Txn Processed session termination for sessionid: 0x13ca77aee720009
[junit4:junit4]   2> 14322 T497 oaz.ClientCnxn$EventThread.run EventThread shut down
[junit4:junit4]   2> 14322 T430 oazs.NIOServerCnxn.closeSock Closed socket connection for client /140.211.11.196:12017 which had sessionid 0x13ca77aee720009
[junit4:junit4]   2> 14322 T428 oaz.ZooKeeper.close Session: 0x13ca77aee720009 closed
[junit4:junit4]   2> 14323 T428 oascsi.HttpClientUtil.createClient Creating new http client, config:maxConnections=500&maxConnectionsPerHost=16&socketTimeout=60000&connTimeout=15000
[junit4:junit4]   2> 14337 T428 oaz.ZooKeeper.<init> Initiating client connection, connectString=127.0.0.1:45780/solr sessionTimeout=30000 watcher=org.apache.solr.common.cloud.ConnectionManager@21b9d8f4
[junit4:junit4]   2> 14338 T428 oascc.ConnectionManager.waitForConnected Waiting for client to connect to ZooKeeper
[junit4:junit4]   2> 14338 T498 oaz.ClientCnxn$SendThread.logStartConnect Opening socket connection to server localhost/127.0.0.1:45780. Will not attempt to authenticate using SASL (access denied ("javax.security.auth.AuthPermission" "getLoginConfiguration"))
[junit4:junit4]   2> 14338 T498 oaz.ClientCnxn$SendThread.primeConnection Socket connection established to localhost/127.0.0.1:45780, initiating session
[junit4:junit4]   2> 14339 T430 oazs.NIOServerCnxnFactory.run Accepted socket connection from /140.211.11.196:15905
[junit4:junit4]   2> 14339 T430 oazs.ZooKeeperServer.processConnectRequest Client attempting to establish new session at /140.211.11.196:15905
[junit4:junit4]   2> 14340 T434 oazs.ZooKeeperServer.finishSessionInit Established session 0x13ca77aee72000a with negotiated timeout 20000 for client /140.211.11.196:15905
[junit4:junit4]   2> 14340 T498 oaz.ClientCnxn$SendThread.onConnected Session establishment complete on server localhost/127.0.0.1:45780, sessionid = 0x13ca77aee72000a, negotiated timeout = 20000
[junit4:junit4]   2> 14341 T499 oascc.ConnectionManager.process Watcher org.apache.solr.common.cloud.ConnectionManager@21b9d8f4 name:ZooKeeperConnection Watcher:127.0.0.1:45780/solr got event WatchedEvent state:SyncConnected type:None path:null path:null type:None
[junit4:junit4]   2> 14341 T428 oascc.ConnectionManager.waitForConnected Client is connected to ZooKeeper
[junit4:junit4]   2> 14342 T435 oazs.PrepRequestProcessor.pRequest Got user-level KeeperException when processing sessionid:0x13ca77aee72000a type:create cxid:0x1 zxid:0x8e txntype:-1 reqpath:n/a Error Path:/solr/overseer Error:KeeperErrorCode = NodeExists for /solr/overseer
[junit4:junit4]   2> 14344 T435 oazs.PrepRequestProcessor.pRequest Got user-level KeeperException when processing sessionid:0x13ca77aee72000a type:create cxid:0x2 zxid:0x8f txntype:-1 reqpath:n/a Error Path:/solr/overseer Error:KeeperErrorCode = NodeExists for /solr/overseer
[junit4:junit4]   2> 14351 T428 oasc.ZkController.createEphemeralLiveNode Register node as live in ZooKeeper:/live_nodes/127.0.0.1:30255_sp_ffw%2Ff
[junit4:junit4]   2> 14352 T435 oazs.PrepRequestProcessor.pRequest Got user-level KeeperException when processing sessionid:0x13ca77aee72000a type:delete cxid:0x4 zxid:0x90 txntype:-1 reqpath:n/a Error Path:/solr/live_nodes/127.0.0.1:30255_sp_ffw%2Ff Error:KeeperErrorCode = NoNode for /solr/live_nodes/127.0.0.1:30255_sp_ffw%2Ff
[junit4:junit4]   2> 14353 T428 oascc.SolrZkClient.makePath makePath: /live_nodes/127.0.0.1:30255_sp_ffw%2Ff
[junit4:junit4]   2> 14356 T484 oascc.ZkStateReader$2.process A cluster state change: WatchedEvent state:SyncConnected type:NodeChildrenChanged path:/live_nodes, has occurred - updating... (live nodes size: 3)
[junit4:junit4]   2> 14357 T456 oascc.ZkStateReader$3.process Updating live nodes... (4)
[junit4:junit4]   2> 14357 T469 oascc.ZkStateReader$3.process Updating live nodes... (4)
[junit4:junit4]   2> 14357 T456 oascc.ZkStateReader$2.process A cluster state change: WatchedEvent state:SyncConnected type:NodeChildrenChanged path:/live_nodes, has occurred - updating... (live nodes size: 4)
[junit4:junit4]   2> 14357 T450 oascc.ZkStateReader$3.process Updating live nodes... (4)
[junit4:junit4]   2> 14358 T469 oascc.ZkStateReader$2.process A cluster state change: WatchedEvent state:SyncConnected type:NodeChildrenChanged path:/live_nodes, has occurred - updating... (live nodes size: 4)
[junit4:junit4]   2> 14358 T450 oascc.ZkStateReader$2.process A cluster state change: WatchedEvent state:SyncConnected type:NodeChildrenChanged path:/live_nodes, has occurred - updating... (live nodes size: 4)
[junit4:junit4]   2> 14359 T484 oascc.ZkStateReader$3.process Updating live nodes... (4)
[junit4:junit4]   2> 14363 T428 oascc.ZkStateReader.createClusterStateWatchersAndUpdate Updating cluster state from ZooKeeper... 
[junit4:junit4]   2> 14371 T500 oasc.CoreContainer.create Creating SolrCore 'collection1' using instanceDir: /usr/home/hudson/hudson-slave/workspace/Lucene-Solr-Tests-trunk-java7/solr/build/solr-core/test/J0/./org.apache.solr.cloud.BasicDistributedZkTest-jetty3-1360019530853/collection1
[junit4:junit4]   2> 14371 T500 oasc.ZkController.createCollectionZkNode Check for collection zkNode:collection1
[junit4:junit4]   2> 14372 T500 oasc.ZkController.createCollectionZkNode Collection zkNode exists
[junit4:junit4]   2> 14372 T500 oasc.ZkController.readConfigName Load collection config from:/collections/collection1
[junit4:junit4]   2> 14374 T500 oasc.SolrResourceLoader.<init> new SolrResourceLoader for directory: '/usr/home/hudson/hudson-slave/workspace/Lucene-Solr-Tests-trunk-java7/solr/build/solr-core/test/J0/./org.apache.solr.cloud.BasicDistributedZkTest-jetty3-1360019530853/collection1/'
[junit4:junit4]   2> 14376 T500 oasc.SolrResourceLoader.replaceClassLoader Adding 'file:/usr/home/hudson/hudson-slave/workspace/Lucene-Solr-Tests-trunk-java7/solr/build/solr-core/test/J0/org.apache.solr.cloud.BasicDistributedZkTest-jetty3-1360019530853/collection1/lib/README' to classloader
[junit4:junit4]   2> 14376 T500 oasc.SolrResourceLoader.replaceClassLoader Adding 'file:/usr/home/hudson/hudson-slave/workspace/Lucene-Solr-Tests-trunk-java7/solr/build/solr-core/test/J0/org.apache.solr.cloud.BasicDistributedZkTest-jetty3-1360019530853/collection1/lib/classes/' to classloader
[junit4:junit4]   2> 14431 T500 oasc.SolrConfig.<init> Using Lucene MatchVersion: LUCENE_50
[junit4:junit4]   2> 14506 T500 oasc.SolrConfig.<init> Loaded SolrConfig: solrconfig.xml
[junit4:junit4]   2> 14607 T500 oass.IndexSchema.readSchema Reading Solr Schema
[junit4:junit4]   2> 14615 T500 oass.IndexSchema.readSchema Schema name=test
[junit4:junit4]   2> 15272 T500 oass.OpenExchangeRatesOrgProvider.init Initialized with rates=open-exchange-rates.json, refreshInterval=1440.
[junit4:junit4]   2> 15285 T500 oass.IndexSchema.readSchema default search field in schema is text
[junit4:junit4]   2> 15289 T500 oass.IndexSchema.readSchema unique key field: id
[junit4:junit4]   2> 15315 T500 oass.FileExchangeRateProvider.reload Reloading exchange rates from file currency.xml
[junit4:junit4]   2> 15321 T500 oass.FileExchangeRateProvider.reload Reloading exchange rates from file currency.xml
[junit4:junit4]   2> 15326 T500 oass.OpenExchangeRatesOrgProvider.reload Reloading exchange rates from open-exchange-rates.json
[junit4:junit4]   2> 15328 T500 oass.OpenExchangeRatesOrgProvider.reload Reloading exchange rates from open-exchange-rates.json
[junit4:junit4]   2> 15330 T500 oasc.SolrCore.<init> [collection1] Opening new SolrCore at /usr/home/hudson/hudson-slave/workspace/Lucene-Solr-Tests-trunk-java7/solr/build/solr-core/test/J0/./org.apache.solr.cloud.BasicDistributedZkTest-jetty3-1360019530853/collection1/, dataDir=./org.apache.solr.cloud.BasicDistributedZkTest-1360019516837/jetty3/
[junit4:junit4]   2> 15330 T500 oasc.JmxMonitoredMap.<init> JMX monitoring is enabled. Adding Solr mbeans to JMX Server: com.sun.jmx.mbeanserver.JmxMBeanServer@5925c9a4
[junit4:junit4]   2> 15331 T500 oasc.SolrCore.initDirectoryFactory solr.NRTCachingDirectoryFactory
[junit4:junit4]   2> 15331 T500 oasc.CachingDirectoryFactory.get return new directory for /usr/home/hudson/hudson-slave/workspace/Lucene-Solr-Tests-trunk-java7/solr/build/solr-core/test/J0/./org.apache.solr.cloud.BasicDistributedZkTest-1360019516837/jetty3 forceNew:false
[junit4:junit4]   2> 15332 T500 oasc.CachingDirectoryFactory.close Releasing directory:/usr/home/hudson/hudson-slave/workspace/Lucene-Solr-Tests-trunk-java7/solr/build/solr-core/test/J0/./org.apache.solr.cloud.BasicDistributedZkTest-1360019516837/jetty3
[junit4:junit4]   2> 15332 T500 oasc.SolrCore.getNewIndexDir New index directory detected: old=null new=./org.apache.solr.cloud.BasicDistributedZkTest-1360019516837/jetty3/index/
[junit4:junit4]   2> 15333 T500 oasc.SolrCore.initIndex WARNING [collection1] Solr index directory './org.apache.solr.cloud.BasicDistributedZkTest-1360019516837/jetty3/index' doesn't exist. Creating new index...
[junit4:junit4]   2> 15334 T500 oasc.CachingDirectoryFactory.get return new directory for /usr/home/hudson/hudson-slave/workspace/Lucene-Solr-Tests-trunk-java7/solr/build/solr-core/test/J0/./org.apache.solr.cloud.BasicDistributedZkTest-1360019516837/jetty3/index forceNew:false
[junit4:junit4]   2> 15341 T500 oasc.SolrDeletionPolicy.onCommit SolrDeletionPolicy.onCommit: commits:num=1
[junit4:junit4]   2> 		commit{dir=RateLimitedDirectoryWrapper(NRTCachingDirectory(org.apache.lucene.store.NIOFSDirectory@/usr/home/hudson/hudson-slave/workspace/Lucene-Solr-Tests-trunk-java7/solr/build/solr-core/test/J0/org.apache.solr.cloud.BasicDistributedZkTest-1360019516837/jetty3/index lockFactory=org.apache.lucene.store.NativeFSLockFactory@57b3153c; maxCacheMB=48.0 maxMergeSizeMB=4.0)),segFN=segments_1,generation=1,filenames=[segments_1]
[junit4:junit4]   2> 15341 T500 oasc.SolrDeletionPolicy.updateCommits newest commit = 1[segments_1]
[junit4:junit4]   2> 15342 T500 oasc.CachingDirectoryFactory.close Releasing directory:/usr/home/hudson/hudson-slave/workspace/Lucene-Solr-Tests-trunk-java7/solr/build/solr-core/test/J0/./org.apache.solr.cloud.BasicDistributedZkTest-1360019516837/jetty3/index
[junit4:junit4]   2> 15342 T500 oasc.SolrCore.initWriters created xml: solr.XMLResponseWriter
[junit4:junit4]   2> 15345 T500 oasup.UpdateRequestProcessorChain.init inserting DistributedUpdateProcessorFactory into updateRequestProcessorChain "dedupe"
[junit4:junit4]   2> 15345 T500 oasup.UpdateRequestProcessorChain.init inserting DistributedUpdateProcessorFactory into updateRequestProcessorChain "dedupe-allfields"
[junit4:junit4]   2> 15345 T500 oasup.UpdateRequestProcessorChain.init inserting DistributedUpdateProcessorFactory into updateRequestProcessorChain "stored_sig"
[junit4:junit4]   2> 15346 T500 oasup.UpdateRequestProcessorChain.init inserting DistributedUpdateProcessorFactory into updateRequestProcessorChain "uniq-fields"
[junit4:junit4]   2> 15346 T500 oasup.UpdateRequestProcessorChain.init inserting DistributedUpdateProcessorFactory into updateRequestProcessorChain "distrib-dup-test-chain-implicit"
[junit4:junit4]   2> 15347 T500 oasc.RequestHandlers.initHandlersFromConfig adding lazy requestHandler: solr.ReplicationHandler
[junit4:junit4]   2> 15347 T500 oasc.RequestHandlers.initHandlersFromConfig created /replication: solr.ReplicationHandler
[junit4:junit4]   2> 15348 T500 oasc.RequestHandlers.initHandlersFromConfig created standard: solr.StandardRequestHandler
[junit4:junit4]   2> 15348 T500 oasc.RequestHandlers.initHandlersFromConfig created /get: solr.RealTimeGetHandler
[junit4:junit4]   2> 15349 T500 oasc.RequestHandlers.initHandlersFromConfig created dismax: solr.SearchHandler
[junit4:junit4]   2> 15349 T500 oasc.RequestHandlers.initHandlersFromConfig created mock: org.apache.solr.core.MockQuerySenderListenerReqHandler
[junit4:junit4]   2> 15350 T500 oasc.RequestHandlers.initHandlersFromConfig created /admin/: org.apache.solr.handler.admin.AdminHandlers
[junit4:junit4]   2> 15351 T500 oasc.RequestHandlers.initHandlersFromConfig created defaults: solr.StandardRequestHandler
[junit4:junit4]   2> 15351 T500 oasc.RequestHandlers.initHandlersFromConfig adding lazy requestHandler: solr.StandardRequestHandler
[junit4:junit4]   2> 15351 T500 oasc.RequestHandlers.initHandlersFromConfig created lazy: solr.StandardRequestHandler
[junit4:junit4]   2> 15352 T500 oasc.RequestHandlers.initHandlersFromConfig created /update: solr.UpdateRequestHandler
[junit4:junit4]   2> 15352 T500 oasc.RequestHandlers.initHandlersFromConfig created /terms: org.apache.solr.handler.component.SearchHandler
[junit4:junit4]   2> 15353 T500 oasc.RequestHandlers.initHandlersFromConfig created spellCheckCompRH: org.apache.solr.handler.component.SearchHandler
[junit4:junit4]   2> 15353 T500 oasc.RequestHandlers.initHandlersFromConfig created spellCheckCompRH_Direct: org.apache.solr.handler.component.SearchHandler
[junit4:junit4]   2> 15354 T500 oasc.RequestHandlers.initHandlersFromConfig created spellCheckWithWordbreak: org.apache.solr.handler.component.SearchHandler
[junit4:junit4]   2> 15355 T500 oasc.RequestHandlers.initHandlersFromConfig created spellCheckWithWordbreak_Direct: org.apache.solr.handler.component.SearchHandler
[junit4:junit4]   2> 15355 T500 oasc.RequestHandlers.initHandlersFromConfig created spellCheckCompRH1: org.apache.solr.handler.component.SearchHandler
[junit4:junit4]   2> 15356 T500 oasc.RequestHandlers.initHandlersFromConfig created mltrh: org.apache.solr.handler.component.SearchHandler
[junit4:junit4]   2> 15356 T500 oasc.RequestHandlers.initHandlersFromConfig created tvrh: org.apache.solr.handler.component.SearchHandler
[junit4:junit4]   2> 15357 T500 oasc.RequestHandlers.initHandlersFromConfig created /mlt: solr.MoreLikeThisHandler
[junit4:junit4]   2> 15357 T500 oasc.RequestHandlers.initHandlersFromConfig created /debug/dump: solr.DumpRequestHandler
[junit4:junit4]   2> 15370 T500 oashl.XMLLoader.init xsltCacheLifetimeSeconds=60
[junit4:junit4]   2> 15375 T500 oasc.SolrCore.initDeprecatedSupport WARNING solrconfig.xml uses deprecated <admin/gettableFiles>, Please update your config to use the ShowFileRequestHandler.
[junit4:junit4]   2> 15376 T500 oasc.SolrCore.initDeprecatedSupport WARNING adding ShowFileRequestHandler with hidden files: [SCHEMA.XML, OLD_SYNONYMS.TXT, STOPWORDS.TXT, PROTWORDS.TXT, OPEN-EXCHANGE-RATES.JSON, SYNONYMS.TXT, CURRENCY.XML, MAPPING-ISOLATIN1ACCENT.TXT]
[junit4:junit4]   2> 15379 T500 oasc.CachingDirectoryFactory.close Releasing directory:/usr/home/hudson/hudson-slave/workspace/Lucene-Solr-Tests-trunk-java7/solr/build/solr-core/test/J0/./org.apache.solr.cloud.BasicDistributedZkTest-1360019516837/jetty3
[junit4:junit4]   2> 15381 T500 oass.SolrIndexSearcher.<init> Opening Searcher@58c9d231 main
[junit4:junit4]   2> 15382 T500 oasu.CommitTracker.<init> Hard AutoCommit: disabled
[junit4:junit4]   2> 15382 T500 oasu.CommitTracker.<init> Soft AutoCommit: disabled
[junit4:junit4]   2> 15383 T500 oashc.SpellCheckComponent.inform Initializing spell checkers
[junit4:junit4]   2> 15390 T500 oass.DirectSolrSpellChecker.init init: {name=direct,classname=DirectSolrSpellChecker,field=lowerfilt,minQueryLength=3}
[junit4:junit4]   2> 15446 T501 oasc.SolrCore.registerSearcher [collection1] Registered new searcher Searcher@58c9d231 main{StandardDirectoryReader(segments_1:1)}
[junit4:junit4]   2> 15452 T500 oasc.ZkController.publish publishing core=collection1 state=down
[junit4:junit4]   2> 15452 T500 oasc.ZkController.publish numShards not found on descriptor - reading it from system property
[junit4:junit4]   2> 15492 T451 oascc.ZkStateReader.updateClusterState Updating cloud state from ZooKeeper... 
[junit4:junit4]   2> 15494 T451 oasc.Overseer$ClusterStateUpdater.updateState Update state numShards=2 message={
[junit4:junit4]   2> 	  "operation":"state",
[junit4:junit4]   2> 	  "numShards":"2",
[junit4:junit4]   2> 	  "shard":"shard2",
[junit4:junit4]   2> 	  "roles":null,
[junit4:junit4]   2> 	  "state":"active",
[junit4:junit4]   2> 	  "core":"collection1",
[junit4:junit4]   2> 	  "collection":"collection1",
[junit4:junit4]   2> 	  "node_name":"127.0.0.1:37419_sp_ffw%2Ff",
[junit4:junit4]   2> 	  "base_url":"http://127.0.0.1:37419/sp_ffw/f"}
[junit4:junit4]   2> 15499 T451 oasc.Overseer$ClusterStateUpdater.updateState Update state numShards=2 message={
[junit4:junit4]   2> 	  "operation":"state",
[junit4:junit4]   2> 	  "numShards":"2",
[junit4:junit4]   2> 	  "shard":null,
[junit4:junit4]   2> 	  "roles":null,
[junit4:junit4]   2> 	  "state":"down",
[junit4:junit4]   2> 	  "core":"collection1",
[junit4:junit4]   2> 	  "collection":"collection1",
[junit4:junit4]   2> 	  "node_name":"127.0.0.1:30255_sp_ffw%2Ff",
[junit4:junit4]   2> 	  "base_url":"http://127.0.0.1:30255/sp_ffw/f"}
[junit4:junit4]   2> 15499 T451 oasc.Overseer$ClusterStateUpdater.updateState Collection already exists with numShards=2
[junit4:junit4]   2> 15500 T451 oasc.Overseer$ClusterStateUpdater.updateState Assigning new node to shard shard=shard1
[junit4:junit4]   2> 15518 T456 oascc.ZkStateReader$2.process A cluster state change: WatchedEvent state:SyncConnected type:NodeDataChanged path:/clusterstate.json, has occurred - updating... (live nodes size: 4)
[junit4:junit4]   2> 15518 T469 oascc.ZkStateReader$2.process A cluster state change: WatchedEvent state:SyncConnected type:NodeDataChanged path:/clusterstate.json, has occurred - updating... (live nodes size: 4)
[junit4:junit4]   2> 15518 T484 oascc.ZkStateReader$2.process A cluster state change: WatchedEvent state:SyncConnected type:NodeDataChanged path:/clusterstate.json, has occurred - updating... (live nodes size: 4)
[junit4:junit4]   2> 15518 T450 oascc.ZkStateReader$2.process A cluster state change: WatchedEvent state:SyncConnected type:NodeDataChanged path:/clusterstate.json, has occurred - updating... (live nodes size: 4)
[junit4:junit4]   2> 15518 T499 oascc.ZkStateReader$2.process A cluster state change: WatchedEvent state:SyncConnected type:NodeDataChanged path:/clusterstate.json, has occurred - updating... (live nodes size: 4)
[junit4:junit4]   2> 16455 T500 oasc.CoreContainer.registerCore registering core: collection1
[junit4:junit4]   2> 16455 T500 oasc.ZkController.register Register replica - core:collection1 address:http://127.0.0.1:30255/sp_ffw/f collection:collection1 shard:shard1
[junit4:junit4]   2> 16486 T500 oasc.ZkController.register We are http://127.0.0.1:30255/sp_ffw/f/collection1/ and leader is http://127.0.0.1:58138/sp_ffw/f/collection1/
[junit4:junit4]   2> 16486 T500 oasc.ZkController.register No LogReplay needed for core=collection1 baseURL=http://127.0.0.1:30255/sp_ffw/f
[junit4:junit4]   2> 16486 T500 oasc.ZkController.checkRecovery Core needs to recover:collection1
[junit4:junit4]   2> 16487 T500 oasu.DefaultSolrCoreState.doRecovery Running recovery - first canceling any ongoing recovery
[junit4:junit4]   2> ASYNC  NEW_CORE C14 name=collection1 org.apache.solr.core.SolrCore@3e2cc207 url=http://127.0.0.1:30255/sp_ffw/f/collection1 node=127.0.0.1:30255_sp_ffw%2Ff C14_STATE=coll:collection1 core:collection1 props:{shard=null, roles=null, state=down, core=collection1, collection=collection1, node_name=127.0.0.1:30255_sp_ffw%2Ff, base_url=http://127.0.0.1:30255/sp_ffw/f}
[junit4:junit4]   2> 16494 T502 C14 P30255 oasc.RecoveryStrategy.run Starting recovery process.  core=collection1 recoveringAfterStartup=true
[junit4:junit4]   2> 16494 T500 oascc.ZkStateReader.updateClusterState Updating cloud state from ZooKeeper... 
[junit4:junit4]   2> 16495 T502 C14 P30255 oasc.RecoveryStrategy.doRecovery ###### startupVersions=[]
[junit4:junit4]   2> 16495 T502 C14 P30255 oasc.ZkController.publish publishing core=collection1 state=recovering
[junit4:junit4]   2> 16495 T502 C14 P30255 oasc.ZkController.publish numShards not found on descriptor - reading it from system property
[junit4:junit4]   2> 16496 T428 oass.SolrDispatchFilter.init user.dir=/usr/home/hudson/hudson-slave/workspace/Lucene-Solr-Tests-trunk-java7/solr/build/solr-core/test/J0
[junit4:junit4]   2> 16496 T428 oass.SolrDispatchFilter.init SolrDispatchFilter.init() done
[junit4:junit4]   2> 16497 T502 C14 P30255 oascsi.HttpClientUtil.createClient Creating new http client, config:maxConnections=128&maxConnectionsPerHost=32&followRedirects=false
[junit4:junit4]   2> 16497 T428 oascsi.HttpClientUtil.createClient Creating new http client, config:maxConnections=128&maxConnectionsPerHost=32&followRedirects=false
[junit4:junit4]   2> 16694 T428 oejs.Server.doStart jetty-8.1.8.v20121106
[junit4:junit4]   2> 16697 T428 oejs.AbstractConnector.doStart Started SocketConnector@127.0.0.1:55162
[junit4:junit4]   2> 16698 T428 oass.SolrDispatchFilter.init SolrDispatchFilter.init()
[junit4:junit4]   2> 16698 T428 oasc.SolrResourceLoader.locateSolrHome JNDI not configured for solr (NoInitialContextEx)
[junit4:junit4]   2> 16699 T428 oasc.SolrResourceLoader.locateSolrHome using system property solr.solr.home: /usr/home/hudson/hudson-slave/workspace/Lucene-Solr-Tests-trunk-java7/solr/build/solr-core/test/J0/./org.apache.solr.cloud.BasicDistributedZkTest-jetty4-1360019533349
[junit4:junit4]   2> 16699 T428 oasc.CoreContainer$Initializer.initialize looking for solr.xml: /usr/home/hudson/hudson-slave/workspace/Lucene-Solr-Tests-trunk-java7/solr/build/solr-core/test/J0/./org.apache.solr.cloud.BasicDistributedZkTest-jetty4-1360019533349/solr.xml
[junit4:junit4]   2> 16700 T428 oasc.CoreContainer.<init> New CoreContainer 63645884
[junit4:junit4]   2> 16700 T428 oasc.CoreContainer.load Loading CoreContainer using Solr Home: '/usr/home/hudson/hudson-slave/workspace/Lucene-Solr-Tests-trunk-java7/solr/build/solr-core/test/J0/./org.apache.solr.cloud.BasicDistributedZkTest-jetty4-1360019533349/'
[junit4:junit4]   2> 16701 T428 oasc.SolrResourceLoader.<init> new SolrResourceLoader for directory: '/usr/home/hudson/hudson-slave/workspace/Lucene-Solr-Tests-trunk-java7/solr/build/solr-core/test/J0/./org.apache.solr.cloud.BasicDistributedZkTest-jetty4-1360019533349/'
[junit4:junit4]   2> 16769 T428 oashc.HttpShardHandlerFactory.getParameter Setting socketTimeout to: 60000
[junit4:junit4]   2> 16770 T428 oashc.HttpShardHandlerFactory.getParameter Setting urlScheme to: http://
[junit4:junit4]   2> 16770 T428 oashc.HttpShardHandlerFactory.getParameter Setting connTimeout to: 15000
[junit4:junit4]   2> 16771 T428 oashc.HttpShardHandlerFactory.getParameter Setting maxConnectionsPerHost to: 20
[junit4:junit4]   2> 16771 T428 oashc.HttpShardHandlerFactory.getParameter Setting corePoolSize to: 0
[junit4:junit4]   2> 16772 T428 oashc.HttpShardHandlerFactory.getParameter Setting maximumPoolSize to: 2147483647
[junit4:junit4]   2> 16772 T428 oashc.HttpShardHandlerFactory.getParameter Setting maxThreadIdleTime to: 5
[junit4:junit4]   2> 16773 T428 oashc.HttpShardHandlerFactory.getParameter Setting sizeOfQueue to: -1
[junit4:junit4]   2> 16773 T428 oashc.HttpShardHandlerFactory.getParameter Setting fairnessPolicy to: false
[junit4:junit4]   2> 16774 T428 oascsi.HttpClientUtil.createClient Creating new http client, config:maxConnectionsPerHost=20&maxConnections=10000&socketTimeout=60000&connTimeout=15000&retry=false
[junit4:junit4]   2> 16796 T428 oasc.CoreContainer.load Registering Log Listener
[junit4:junit4]   2> 16816 T428 oasc.CoreContainer.initZooKeeper Zookeeper client=127.0.0.1:45780/solr
[junit4:junit4]   2> 16817 T428 oasc.ZkController.checkChrootPath zkHost includes chroot
[junit4:junit4]   2> 16817 T428 oaz.ZooKeeper.<init> Initiating client connection, connectString=127.0.0.1:45780 sessionTimeout=60000 watcher=org.apache.solr.common.cloud.ConnectionManager@3d5bc62e
[junit4:junit4]   2> 16818 T428 oascc.ConnectionManager.waitForConnected Waiting for client to connect to ZooKeeper
[junit4:junit4]   2> 16819 T512 oaz.ClientCnxn$SendThread.logStartConnect Opening socket connection to server localhost/127.0.0.1:45780. Will not attempt to authenticate using SASL (access denied ("javax.security.auth.AuthPermission" "getLoginConfiguration"))
[junit4:junit4]   2> 16820 T512 oaz.ClientCnxn$SendThread.primeConnection Socket connection established to localhost/127.0.0.1:45780, initiating session
[junit4:junit4]   2> 16820 T430 oazs.NIOServerCnxnFactory.run Accepted socket connection from /140.211.11.196:47360
[junit4:junit4]   2> 16821 T430 oazs.ZooKeeperServer.processConnectRequest Client attempting to establish new session at /140.211.11.196:47360
[junit4:junit4]   2> 16855 T434 oazs.ZooKeeperServer.finishSessionInit Established session 0x13ca77aee72000b with negotiated timeout 20000 for client /140.211.11.196:47360
[junit4:junit4]   2> 16856 T512 oaz.ClientCnxn$SendThread.onConnected Session establishment complete on server localhost/127.0.0.1:45780, sessionid = 0x13ca77aee72000b, negotiated timeout = 20000
[junit4:junit4]   2> 16856 T513 oascc.ConnectionManager.process Watcher org.apache.solr.common.cloud.ConnectionManager@3d5bc62e name:ZooKeeperConnection Watcher:127.0.0.1:45780 got event WatchedEvent state:SyncConnected type:None path:null path:null type:None
[junit4:junit4]   2> 16856 T428 oascc.ConnectionManager.waitForConnected Client is connected to ZooKeeper
[junit4:junit4]   2> 16858 T435 oazs.PrepRequestProcessor.pRequest2Txn Processed session termination for sessionid: 0x13ca77aee72000b
[junit4:junit4]   2> 16871 T513 oaz.ClientCnxn$EventThread.run EventThread shut down
[junit4:junit4]   2> 16871 T430 oazs.NIOServerCnxn.closeSock Closed socket connection for client /140.211.11.196:47360 which had sessionid 0x13ca77aee72000b
[junit4:junit4]   2> 16871 T428 oaz.ZooKeeper.close Session: 0x13ca77aee72000b closed
[junit4:junit4]   2> 16872 T428 oascsi.HttpClientUtil.createClient Creating new http client, config:maxConnections=500&maxConnectionsPerHost=16&socketTimeout=60000&connTimeout=15000
[junit4:junit4]   2> 16883 T428 oaz.ZooKeeper.<init> Initiating client connection, connectString=127.0.0.1:45780/solr sessionTimeout=30000 watcher=org.apache.solr.common.cloud.ConnectionManager@3155ba4
[junit4:junit4]   2> 16884 T428 oascc.ConnectionManager.waitForConnected Waiting for client to connect to ZooKeeper
[junit4:junit4]   2> 16884 T514 oaz.ClientCnxn$SendThread.logStartConnect Opening socket connection to server localhost/127.0.0.1:45780. Will not attempt to authenticate using SASL (access denied ("javax.security.auth.AuthPermission" "getLoginConfiguration"))
[junit4:junit4]   2> 16885 T514 oaz.ClientCnxn$SendThread.primeConnection Socket connection established to localhost/127.0.0.1:45780, initiating session
[junit4:junit4]   2> 16885 T430 oazs.NIOServerCnxnFactory.run Accepted socket connection from /140.211.11.196:49058
[junit4:junit4]   2> 16886 T430 oazs.ZooKeeperServer.processConnectRequest Client attempting to establish new session at /140.211.11.196:49058
[junit4:junit4]   2> 16887 T434 oazs.ZooKeeperServer.finishSessionInit Established session 0x13ca77aee72000c with negotiated timeout 20000 for client /140.211.11.196:49058
[junit4:junit4]   2> 16887 T514 oaz.ClientCnxn$SendThread.onConnected Session establishment complete on server localhost/127.0.0.1:45780, sessionid = 0x13ca77aee72000c, negotiated timeout = 20000
[junit4:junit4]   2> 16887 T515 oascc.ConnectionManager.process Watcher org.apache.solr.common.cloud.ConnectionManager@3155ba4 name:ZooKeeperConnection Watcher:127.0.0.1:45780/solr got event WatchedEvent state:SyncConnected type:None path:null path:null type:None
[junit4:junit4]   2> 16888 T428 oascc.ConnectionManager.waitForConnected Client is connected to ZooKeeper
[junit4:junit4]   2> 16889 T435 oazs.PrepRequestProcessor.pRequest Got user-level KeeperException when processing sessionid:0x13ca77aee72000c type:create cxid:0x1 zxid:0xa0 txntype:-1 reqpath:n/a Error Path:/solr/overseer Error:KeeperErrorCode = NodeExists for /solr/overseer
[junit4:junit4]   2> 16890 T435 oazs.PrepRequestProcessor.pRequest Got user-level KeeperException when processing sessionid:0x13ca77aee72000c type:create cxid:0x2 zxid:0xa1 txntype:-1 reqpath:n/a Error Path:/solr/overseer Error:KeeperErrorCode = NodeExists for /solr/overseer
[junit4:junit4]   2> 16898 T428 oasc.ZkController.createEphemeralLiveNode Register node as live in ZooKeeper:/live_nodes/127.0.0.1:55162_sp_ffw%2Ff
[junit4:junit4]   2> 16899 T435 oazs.PrepRequestProcessor.pRequest Got user-level KeeperException when processing sessionid:0x13ca77aee72000c type:delete cxid:0x4 zxid:0xa2 txntype:-1 reqpath:n/a Error Path:/solr/live_nodes/127.0.0.1:55162_sp_ffw%2Ff Error:KeeperErrorCode = NoNode for /solr/live_nodes/127.0.0.1:55162_sp_ffw%2Ff
[junit4:junit4]   2> 16900 T428 oascc.SolrZkClient.makePath makePath: /live_nodes/127.0.0.1:55162_sp_ffw%2Ff
[junit4:junit4]   2> 16904 T484 oascc.ZkStateReader$2.process A cluster state change: WatchedEvent state:SyncConnected type:NodeChildrenChanged path:/live_nodes, has occurred - updating... (live nodes size: 4)
[junit4:junit4]   2> 16905 T456 oascc.ZkStateReader$3.process Updating live nodes... (5)
[junit4:junit4]   2> 16905 T450 oascc.ZkStateReader$3.process Updating live nodes... (5)
[junit4:junit4]   2> 16905 T456 oascc.ZkStateReader$2.process A cluster state change: WatchedEvent state:SyncConnected type:NodeChildrenChanged path:/live_nodes, has occurred - updating... (live nodes size: 5)
[junit4:junit4]   2> 16905 T450 oascc.ZkStateReader$2.process A cluster state change: WatchedEvent state:SyncConnected type:NodeChildrenChanged path:/live_nodes, has occurred - updating... (live nodes size: 5)
[junit4:junit4]   2> 16905 T499 oascc.ZkStateReader$3.process Updating live nodes... (5)
[junit4:junit4]   2> 16905 T469 oascc.ZkStateReader$3.process Updating live nodes... (5)
[junit4:junit4]   2> 16906 T499 oascc.ZkStateReader$2.process A cluster state change: WatchedEvent state:SyncConnected type:NodeChildrenChanged path:/live_nodes, has occurred - updating... (live nodes size: 5)
[junit4:junit4]   2> 16906 T469 oascc.ZkStateReader$2.process A cluster state change: WatchedEvent state:SyncConnected type:NodeChildrenChanged path:/live_nodes, has occurred - updating... (live nodes size: 5)
[junit4:junit4]   2> 16908 T484 oascc.ZkStateReader$3.process Updating live nodes... (5)
[junit4:junit4]   2> 16912 T428 oascc.ZkStateReader.createClusterStateWatchersAndUpdate Updating cluster state from ZooKeeper... 
[junit4:junit4]   2> 16920 T516 oasc.CoreContainer.create Creating SolrCore 'collection1' using instanceDir: /usr/home/hudson/hudson-slave/workspace/Lucene-Solr-Tests-trunk-java7/solr/build/solr-core/test/J0/./org.apache.solr.cloud.BasicDistributedZkTest-jetty4-1360019533349/collection1
[junit4:junit4]   2> 16921 T516 oasc.ZkController.createCollectionZkNode Check for collection zkNode:collection1
[junit4:junit4]   2> 16922 T516 oasc.ZkController.createCollectionZkNode Collection zkNode exists
[junit4:junit4]   2> 16922 T516 oasc.ZkController.readConfigName Load collection config from:/collections/collection1
[junit4:junit4]   2> 16924 T516 oasc.SolrResourceLoader.<init> new SolrResourceLoader for directory: '/usr/home/hudson/hudson-slave/workspace/Lucene-Solr-Tests-trunk-java7/solr/build/solr-core/test/J0/./org.apache.solr.cloud.BasicDistributedZkTest-jetty4-1360019533349/collection1/'
[junit4:junit4]   2> 16925 T516 oasc.SolrResourceLoader.replaceClassLoader Adding 'file:/usr/home/hudson/hudson-slave/workspace/Lucene-Solr-Tests-trunk-java7/solr/build/solr-core/test/J0/org.apache.solr.cloud.BasicDistributedZkTest-jetty4-1360019533349/collection1/lib/README' to classloader
[junit4:junit4]   2> 16926 T516 oasc.SolrResourceLoader.replaceClassLoader Adding 'file:/usr/home/hudson/hudson-slave/workspace/Lucene-Solr-Tests-trunk-java7/solr/build/solr-core/test/J0/org.apache.solr.cloud.BasicDistributedZkTest-jetty4-1360019533349/collection1/lib/classes/' to classloader
[junit4:junit4]   2> 16981 T516 oasc.SolrConfig.<init> Using Lucene MatchVersion: LUCENE_50
[junit4:junit4]   2> 17059 T516 oasc.SolrConfig.<init> Loaded SolrConfig: solrconfig.xml
[junit4:junit4]   2> 17062 T451 oascc.ZkStateReader.updateClusterState Updating cloud state from ZooKeeper... 
[junit4:junit4]   2> 17063 T451 oasc.Overseer$ClusterStateUpdater.updateState Update state numShards=2 message={
[junit4:junit4]   2> 	  "operation":"state",
[junit4:junit4]   2> 	  "numShards":"2",
[junit4:junit4]   2> 	  "shard":"shard1",
[junit4:junit4]   2> 	  "roles":null,
[junit4:junit4]   2> 	  "state":"recovering",
[junit4:junit4]   2> 	  "core":"collection1",
[junit4:junit4]   2> 	  "collection":"collection1",
[junit4:junit4]   2> 	  "node_name":"127.0.0.1:30255_sp_ffw%2Ff",
[junit4:junit4]   2> 	  "base_url":"http://127.0.0.1:30255/sp_ffw/f"}
[junit4:junit4]   2> 17077 T450 oascc.ZkStateReader$2.process A cluster state change: WatchedEvent state:SyncConnected type:NodeDataChanged path:/clusterstate.json, has occurred - updating... (live nodes size: 5)
[junit4:junit4]   2> 17077 T499 oascc.ZkStateReader$2.process A cluster state change: WatchedEvent state:SyncConnected type:NodeDataChanged path:/clusterstate.json, has occurred - updating... (live nodes size: 5)
[junit4:junit4]   2> 17077 T484 oascc.ZkStateReader$2.process A cluster state change: WatchedEvent state:SyncConnected type:NodeDataChanged path:/clusterstate.json, has occurred - updating... (live nodes size: 5)
[junit4:junit4]   2> 17077 T469 oascc.ZkStateReader$2.process A cluster state change: WatchedEvent state:SyncConnected type:NodeDataChanged path:/clusterstate.json, has occurred - updating... (live nodes size: 5)
[junit4:junit4]   2> 17077 T456 oascc.ZkStateReader$2.process A cluster state change: WatchedEvent state:SyncConnected type:NodeDataChanged path:/clusterstate.json, has occurred - updating... (live nodes size: 5)
[junit4:junit4]   2> 17160 T516 oass.IndexSchema.readSchema Reading Solr Schema
[junit4:junit4]   2> 17160 T515 oascc.ZkStateReader$2.process A cluster state change: WatchedEvent state:SyncConnected type:NodeDataChanged path:/clusterstate.json, has occurred - updating... (live nodes size: 5)
[junit4:junit4]   2> 17168 T516 oass.IndexSchema.readSchema Schema name=test
[junit4:junit4]   2> 17833 T516 oass.OpenExchangeRatesOrgProvider.init Initialized with rates=open-exchange-rates.json, refreshInterval=1440.
[junit4:junit4]   2> 17848 T516 oass.IndexSchema.readSchema default search field in schema is text
[junit4:junit4]   2> 17852 T516 oass.IndexSchema.readSchema unique key field: id
[junit4:junit4]   2> 17889 T516 oass.FileExchangeRateProvider.reload Reloading exchange rates from file currency.xml
[junit4:junit4]   2> 17895 T516 oass.FileExchangeRateProvider.reload Reloading exchange rates from file currency.xml
[junit4:junit4]   2> 17902 T516 oass.OpenExchangeRatesOrgProvider.reload Reloading exchange rates from open-exchange-rates.json
[junit4:junit4]   2> 17904 T516 oass.OpenExchangeRatesOrgProvider.reload Reloading exchange rates from open-exchange-rates.json
[junit4:junit4]   2> 17906 T516 oasc.SolrCore.<init> [collection1] Opening new SolrCore at /usr/home/hudson/hudson-slave/workspace/Lucene-Solr-Tests-trunk-java7/solr/build/solr-core/test/J0/./org.apache.solr.cloud.BasicDistributedZkTest-jetty4-1360019533349/collection1/, dataDir=./org.apache.solr.cloud.BasicDistributedZkTest-1360019516837/jetty4/
[junit4:junit4]   2> 17906 T516 oasc.JmxMonitoredMap.<init> JMX monitoring is enabled. Adding Solr mbeans to JMX Server: com.sun.jmx.mbeanserver.JmxMBeanServer@5925c9a4
[junit4:junit4]   2> 17907 T516 oasc.SolrCore.initDirectoryFactory solr.NRTCachingDirectoryFactory
[junit4:junit4]   2> 17908 T516 oasc.CachingDirectoryFactory.get return new directory for /usr/home/hudson/hudson-slave/workspace/Lucene-Solr-Tests-trunk-java7/solr/build/solr-core/test/J0/./org.apache.solr.cloud.BasicDistributedZkTest-1360019516837/jetty4 forceNew:false
[junit4:junit4]   2> 17909 T516 oasc.CachingDirectoryFactory.close Releasing directory:/usr/home/hudson/hudson-slave/workspace/Lucene-Solr-Tests-trunk-java7/solr/build/solr-core/test/J0/./org.apache.solr.cloud.BasicDistributedZkTest-1360019516837/jetty4
[junit4:junit4]   2> 17910 T516 oasc.SolrCore.getNewIndexDir New index directory detected: old=null new=./org.apache.solr.cloud.BasicDistributedZkTest-1360019516837/jetty4/index/
[junit4:junit4]   2> 17911 T516 oasc.SolrCore.initIndex WARNING [collection1] Solr index directory './org.apache.solr.cloud.BasicDistributedZkTest-1360019516837/jetty4/index' doesn't exist. Creating new index...
[junit4:junit4]   2> 17913 T516 oasc.CachingDirectoryFactory.get return new directory for /usr/home/hudson/hudson-slave/workspace/Lucene-Solr-Tests-trunk-java7/solr/build/solr-core/test/J0/./org.apache.solr.cloud.BasicDistributedZkTest-1360019516837/jetty4/index forceNew:false
[junit4:junit4]   2> 17931 T516 oasc.SolrDeletionPolicy.onCommit SolrDeletionPolicy.onCommit: commits:num=1
[junit4:junit4]   2> 		commit{dir=RateLimitedDirectoryWrapper(NRTCachingDirectory(org.apache.lucene.store.NIOFSDirectory@/usr/home/hudson/hudson-slave/workspace/Lucene-Solr-Tests-trunk-java7/solr/build/solr-core/test/J0/org.apache.solr.cloud.BasicDistributedZkTest-1360019516837/jetty4/index lockFactory=org.apache.lucene.store.NativeFSLockFactory@2092ab58; maxCacheMB=48.0 maxMergeSizeMB=4.0)),segFN=segments_1,generation=1,filenames=[segments_1]
[junit4:junit4]   2> 17931 T516 oasc.SolrDeletionPolicy.updateCommits newest commit = 1[segments_1]
[junit4:junit4]   2> 17932 T516 oasc.CachingDirectoryFactory.close Releasing directory:/usr/home/hudson/hudson-slave/workspace/Lucene-Solr-Tests-trunk-java7/solr/build/solr-core/test/J0/./org.apache.solr.cloud.BasicDistributedZkTest-1360019516837/jetty4/index
[junit4:junit4]   2> 17933 T516 oasc.SolrCore.initWriters created xml: solr.XMLResponseWriter
[junit4:junit4]   2> 17935 T516 oasup.UpdateRequestProcessorChain.init inserting DistributedUpdateProcessorFactory into updateRequestProcessorChain "dedupe"
[junit4:junit4]   2> 17935 T516 oasup.UpdateRequestProcessorChain.init inserting DistributedUpdateProcessorFactory into updateRequestProcessorChain "dedupe-allfields"
[junit4:junit4]   2> 17936 T516 oasup.UpdateRequestProcessorChain.init inserting DistributedUpdateProcessorFactory into updateRequestProcessorChain "stored_sig"
[junit4:junit4]   2> 17936 T516 oasup.UpdateRequestProcessorChain.init inserting DistributedUpdateProcessorFactory into updateRequestProcessorChain "uniq-fields"
[junit4:junit4]   2> 17937 T516 oasup.UpdateRequestProcessorChain.init inserting DistributedUpdateProcessorFactory into updateRequestProcessorChain "distrib-dup-test-chain-implicit"
[junit4:junit4]   2> 17937 T516 oasc.RequestHandlers.initHandlersFromConfig adding lazy requestHandler: solr.ReplicationHandler
[junit4:junit4]   2> 17937 T516 oasc.RequestHandlers.initHandlersFromConfig created /replication: solr.ReplicationHandler
[junit4:junit4]   2> 17938 T516 oasc.RequestHandlers.initHandlersFromConfig created standard: solr.StandardRequestHandler
[junit4:junit4]   2> 17939 T516 oasc.RequestHandlers.initHandlersFromConfig created /get: solr.RealTimeGetHandler
[junit4:junit4]   2> 17939 T516 oasc.RequestHandlers.initHandlersFromConfig created dismax: solr.SearchHandler
[junit4:junit4]   2> 17940 T516 oasc.RequestHandlers.initHandlersFromConfig created mock: org.apache.solr.core.MockQuerySenderListenerReqHandler
[junit4:junit4]   2> 17940 T516 oasc.RequestHandlers.initHandlersFromConfig created /admin/: org.apache.solr.handler.admin.AdminHandlers
[junit4:junit4]   2> 17941 T516 oasc.RequestHandlers.initHandlersFromConfig created defaults: solr.StandardRequestHandler
[junit4:junit4]   2> 17941 T516 oasc.RequestHandlers.initHandlersFromConfig adding lazy requestHandler: solr.StandardRequestHandler
[junit4:junit4]   2> 17941 T516 oasc.RequestHandlers.initHandlersFromConfig created lazy: solr.StandardRequestHandler
[junit4:junit4]   2> 17942 T516 oasc.RequestHandlers.initHandlersFromConfig created /update: solr.UpdateRequestHandler
[junit4:junit4]   2> 17943 T516 oasc.RequestHandlers.initHandlersFromConfig created /terms: org.apache.solr.handler.component.SearchHandler
[junit4:junit4]   2> 17943 T516 oasc.RequestHandlers.initHandlersFromConfig created spellCheckCompRH: org.apache.solr.handler.component.SearchHandler
[junit4:junit4]   2> 17944 T516 oasc.RequestHandlers.initHandlersFromConfig created spellCheckCompRH_Direct: org.apache.solr.handler.component.SearchHandler
[junit4:junit4]   2> 17944 T516 oasc.RequestHandlers.initHandlersFromConfig created spellCheckWithWordbreak: org.apache.solr.handler.component.SearchHandler
[junit4:junit4]   2> 17945 T516 oasc.RequestHandlers.initHandlersFromConfig created spellCheckWithWordbreak_Direct: org.apache.solr.handler.component.SearchHandler
[junit4:junit4]   2> 17945 T516 oasc.RequestHandlers.initHandlersFromConfig created spellCheckCompRH1: org.apache.solr.handler.component.SearchHandler
[junit4:junit4]   2> 17946 T516 oasc.RequestHandlers.initHandlersFromConfig created mltrh: org.apache.solr.handler.component.SearchHandler
[junit4:junit4]   2> 17947 T516 oasc.RequestHandlers.initHandlersFromConfig created tvrh: org.apache.solr.handler.component.SearchHandler
[junit4:junit4]   2> 17947 T516 oasc.RequestHandlers.initHandlersFromConfig created /mlt: solr.MoreLikeThisHandler
[junit4:junit4]   2> 17948 T516 oasc.RequestHandlers.initHandlersFromConfig created /debug/dump: solr.DumpRequestHandler
[junit4:junit4]   2> 17969 T516 oashl.XMLLoader.init xsltCacheLifetimeSeconds=60
[junit4:junit4]   2> 17976 T516 oasc.SolrCore.initDeprecatedSupport WARNING solrconfig.xml uses deprecated <admin/gettableFiles>, Please update your config to use the ShowFileRequestHandler.
[junit4:junit4]   2> 17978 T516 oasc.SolrCore.initDeprecatedSupport WARNING adding ShowFileRequestHandler with hidden files: [SCHEMA.XML, OLD_SYNONYMS.TXT, STOPWORDS.TXT, PROTWORDS.TXT, OPEN-EXCHANGE-RATES.JSON, SYNONYMS.TXT, CURRENCY.XML, MAPPING-ISOLATIN1ACCENT.TXT]
[junit4:junit4]   2> 17982 T516 oasc.CachingDirectoryFactory.close Releasing directory:/usr/home/hudson/hudson-slave/workspace/Lucene-Solr-Tests-trunk-java7/solr/build/solr-core/test/J0/./org.apache.solr.cloud.BasicDistributedZkTest-1360019516837/jetty4
[junit4:junit4]   2> 17985 T516 oass.SolrIndexSearcher.<init> Opening Searcher@2b5bd32c main
[junit4:junit4]   2> 17986 T516 oasu.CommitTracker.<init> Hard AutoCommit: disabled
[junit4:junit4]   2> 17986 T516 oasu.CommitTracker.<init> Soft AutoCommit: disabled
[junit4:junit4]   2> 17987 T516 oashc.SpellCheckComponent.inform Initializing spell checkers
[junit4:junit4]   2> 17995 T516 oass.DirectSolrSpellChecker.init init: {name=direct,classname=DirectSolrSpellChecker,field=lowerfilt,minQueryLength=3}
[junit4:junit4]   2> 18048 T517 oasc.SolrCore.registerSearcher [collection1] Registered new searcher Searcher@2b5bd32c main{StandardDirectoryReader(segments_1:1)}
[junit4:junit4]   2> 18054 T516 oasc.ZkController.publish publishing core=collection1 state=down
[junit4:junit4]   2> 18054 T516 oasc.ZkController.publish numShards not found on descriptor - reading it from system property
[junit4:junit4]   2> 18585 T451 oascc.ZkStateReader.updateClusterState Updating cloud state from ZooKeeper... 
[junit4:junit4]   2> 18587 T451 oasc.Overseer$ClusterStateUpdater.updateState Update state numShards=2 message={
[junit4:junit4]   2> 	  "operation":"state",
[junit4:junit4]   2> 	  "numShards":"2",
[junit4:junit4]   2> 	  "shard":null,
[junit4:junit4]   2> 	  "roles":null,
[junit4:junit4]   2> 	  "state":"down",
[junit4:junit4]   2> 	  "core":"collection1",
[junit4:junit4]   2> 	  "collection":"collection1",
[junit4:junit4]   2> 	  "node_name":"127.0.0.1:55162_sp_ffw%2Ff",
[junit4:junit4]   2> 	  "base_url":"http://127.0.0.1:55162/sp_ffw/f"}
[junit4:junit4]   2> 18587 T451 oasc.Overseer$ClusterStateUpdater.updateState Collection already exists with numShards=2
[junit4:junit4]   2> 18587 T451 oasc.Overseer$ClusterStateUpdater.updateState Assigning new node to shard shard=shard2
[junit4:junit4]   2> 18602 T456 oascc.ZkStateReader$2.process A cluster state change: WatchedEvent state:SyncConnected type:NodeDataChanged path:/clusterstate.json, has occurred - updating... (live nodes size: 5)
[junit4:junit4]   2> 18602 T469 oascc.ZkStateReader$2.process A cluster state change: WatchedEvent state:SyncConnected type:NodeDataChanged path:/clusterstate.json, has occurred - updating... (live nodes size: 5)
[junit4:junit4]   2> 18602 T484 oascc.ZkStateReader$2.process A cluster state change: WatchedEvent state:SyncConnected type:NodeDataChanged path:/clusterstate.json, has occurred - updating... (live nodes size: 5)
[junit4:junit4]   2> 18602 T499 oascc.ZkStateReader$2.process A cluster state change: WatchedEvent state:SyncConnected type:NodeDataChanged path:/clusterstate.json, has occurred - updating... (live nodes size: 5)
[junit4:junit4]   2> 18602 T515 oascc.ZkStateReader$2.process A cluster state change: WatchedEvent state:SyncConnected type:NodeDataChanged path:/clusterstate.json, has occurred - updating... (live nodes size: 5)
[junit4:junit4]   2> 18602 T450 oascc.ZkStateReader$2.process A cluster state change: WatchedEvent state:SyncConnected type:NodeDataChanged path:/clusterstate.json, has occurred - updating... (live nodes size: 5)
[junit4:junit4]   2> 19057 T516 oasc.CoreContainer.registerCore registering core: collection1
[junit4:junit4]   2> 19057 T516 oasc.ZkController.register Register replica - core:collection1 address:http://127.0.0.1:55162/sp_ffw/f collection:collection1 shard:shard2
[junit4:junit4]   2> 19062 T516 oasc.ZkController.register We are http://127.0.0.1:55162/sp_ffw/f/collection1/ and leader is http://127.0.0.1:37419/sp_ffw/f/collection1/
[junit4:junit4]   2> 19062 T516 oasc.ZkController.register No LogReplay needed for core=collection1 baseURL=http://127.0.0.1:55162/sp_ffw/f
[junit4:junit4]   2> 19062 T516 oasc.ZkController.checkRecovery Core needs to recover:collection1
[junit4:junit4]   2> 19062 T516 oasu.DefaultSolrCoreState.doRecovery Running recovery - first canceling any ongoing recovery
[junit4:junit4]   2> ASYNC  NEW_CORE C15 name=collection1 org.apache.solr.core.SolrCore@41d5df31 url=http://127.0.0.1:55162/sp_ffw/f/collection1 node=127.0.0.1:55162_sp_ffw%2Ff C15_STATE=coll:collection1 core:collection1 props:{shard=null, roles=null, state=down, core=collection1, collection=collection1, node_name=127.0.0.1:55162_sp_ffw%2Ff, base_url=http://127.0.0.1:55162/sp_ffw/f}
[junit4:junit4]   2> 19063 T518 C15 P55162 oasc.RecoveryStrategy.run Starting recovery process.  core=collection1 recoveringAfterStartup=true
[junit4:junit4]   2> 19063 T518 C15 P55162 oasc.RecoveryStrategy.doRecovery ###### startupVersions=[]
[junit4:junit4]   2> 19064 T516 oascc.ZkStateReader.updateClusterState Updating cloud state from ZooKeeper... 
[junit4:junit4]   2> 19064 T518 C15 P55162 oasc.ZkController.publish publishing core=collection1 state=recovering
[junit4:junit4]   2> 19064 T518 C15 P55162 oasc.ZkController.publish numShards not found on descriptor - reading it from system property
[junit4:junit4]   2> 19065 T428 oass.SolrDispatchFilter.init user.dir=/usr/home/hudson/hudson-slave/workspace/Lucene-Solr-Tests-trunk-java7/solr/build/solr-core/test/J0
[junit4:junit4]   2> 19066 T518 C15 P55162 oascsi.HttpClientUtil.createClient Creating new http client, config:maxConnections=128&maxConnectionsPerHost=32&followRedirects=false
[junit4:junit4]   2> 19066 T428 oass.SolrDispatchFilter.init SolrDispatchFilter.init() done
[junit4:junit4]   2> 19066 T428 oascsi.HttpClientUtil.createClient Creating new http client, config:maxConnections=128&maxConnectionsPerHost=32&followRedirects=false
[junit4:junit4]   2> 19085 T428 oascc.ZkStateReader.updateClusterState Updating cloud state from ZooKeeper... 
[junit4:junit4]   2> 19087 T428 oasc.AbstractDistribZkTestBase.waitForRecoveriesToFinish Wait for recoveries to finish - collection: collection1 failOnTimeout:true timeout (sec):230
[junit4:junit4]   2> 19088 T428 oascc.ZkStateReader.updateClusterState Updating cloud state from ZooKeeper... 
[junit4:junit4]   2>  C14_STATE=coll:collection1 core:collection1 props:{shard=shard1, roles=null, state=recovering, core=collection1, collection=collection1, node_name=127.0.0.1:30255_sp_ffw%2Ff, base_url=http://127.0.0.1:30255/sp_ffw/f}
[junit4:junit4]   2> 19539 T502 C14 P30255 oasc.RecoveryStrategy.doRecovery Attempting to PeerSync from http://127.0.0.1:58138/sp_ffw/f/collection1/ core=collection1 - recoveringAfterStartup=true
[junit4:junit4]   2> 19548 T502 C14 P30255 oascsi.HttpClientUtil.createClient Creating new http client, config:maxConnectionsPerHost=20&maxConnections=10000&connTimeout=30000&socketTimeout=30000&retry=false
[junit4:junit4]   2> 19566 T502 C14 P30255 oasu.PeerSync.sync PeerSync: core=collection1 url=http://127.0.0.1:30255/sp_ffw/f START replicas=[http://127.0.0.1:58138/sp_ffw/f/collection1/] nUpdates=100
[junit4:junit4]   2> 19567 T502 C14 P30255 oasu.PeerSync.sync WARNING no frame of reference to tell of we've missed updates
[junit4:junit4]   2> 19568 T502 C14 P30255 oasc.RecoveryStrategy.doRecovery PeerSync Recovery was not successful - trying replication. core=collection1
[junit4:junit4]   2> 19568 T502 C14 P30255 oasc.RecoveryStrategy.doRecovery Starting Replication Recovery. core=collection1
[junit4:junit4]   2> 19568 T502 C14 P30255 oasc.RecoveryStrategy.doRecovery Begin buffering updates. core=collection1
[junit4:junit4]   2> 19569 T502 C14 P30255 oasu.UpdateLog.bufferUpdates Starting to buffer updates. FSUpdateLog{state=ACTIVE, tlog=null}
[junit4:junit4]   2> 19569 T502 C14 P30255 oasc.RecoveryStrategy.replicate Attempting to replicate from http://127.0.0.1:58138/sp_ffw/f/collection1/. core=collection1
[junit4:junit4]   2> 19569 T502 C14 P30255 oascsi.HttpClientUtil.createClient Creating new http client, config:maxConnections=128&maxConnectionsPerHost=32&followRedirects=false
[junit4:junit4]   2> ASYNC  NEW_CORE C16 name=collection1 org.apache.solr.core.SolrCore@60a5494 url=http://127.0.0.1:58138/sp_ffw/f/collection1 node=127.0.0.1:58138_sp_ffw%2Ff C16_STATE=coll:collection1 core:collection1 props:{shard=shard1, roles=null, state=active, core=collection1, collection=collection1, node_name=127.0.0.1:58138_sp_ffw%2Ff, base_url=http://127.0.0.1:58138/sp_ffw/f, leader=true}
[junit4:junit4]   2> 19580 T460 C16 P58138 REQ /get {getVersions=100&distrib=false&wt=javabin&qt=/get&version=2} status=0 QTime=1 
[junit4:junit4]   2> 19599 T461 C16 P58138 oasu.DirectUpdateHandler2.commit start commit{,optimize=false,openSearcher=false,waitSearcher=true,expungeDeletes=false,softCommit=false}
[junit4:junit4]   2> 19600 T461 C16 P58138 oasc.CachingDirectoryFactory.close Releasing directory:/usr/home/hudson/hudson-slave/workspace/Lucene-Solr-Tests-trunk-java7/solr/build/solr-core/test/J0/./org.apache.solr.cloud.BasicDistributedZkTest-1360019516837/jetty1
[junit4:junit4]   2> 19604 T461 C16 P58138 oasc.SolrDeletionPolicy.onInit SolrDeletionPolicy.onInit: commits:num=1
[junit4:junit4]   2> 		commit{dir=RateLimitedDirectoryWrapper(NRTCachingDirectory(org.apache.lucene.store.NIOFSDirectory@/usr/home/hudson/hudson-slave/workspace/Lucene-Solr-Tests-trunk-java7/solr/build/solr-core/test/J0/org.apache.solr.cloud.BasicDistributedZkTest-1360019516837/jetty1/index lockFactory=org.apache.lucene.store.NativeFSLockFactory@3fb6de9f; maxCacheMB=48.0 maxMergeSizeMB=4.0)),segFN=segments_1,generation=1,filenames=[segments_1]
[junit4:junit4]   2> 19605 T461 C16 P58138 oasc.SolrDeletionPolicy.updateCommits newest commit = 1[segments_1]
[junit4:junit4]   2> 19635 T461 C16 P58138 oasc.SolrDeletionPolicy.onCommit SolrDeletionPolicy.onCommit: commits:num=2
[junit4:junit4]   2> 		commit{dir=RateLimitedDirectoryWrapper(NRTCachingDirectory(org.apache.lucene.store.NIOFSDirectory@/usr/home/hudson/hudson-slave/workspace/Lucene-Solr-Tests-trunk-java7/solr/build/solr-core/test/J0/org.apache.solr.cloud.BasicDistributedZkTest-1360019516837/jetty1/index lockFactory=org.apache.lucene.store.NativeFSLockFactory@3fb6de9f; maxCacheMB=48.0 maxMergeSizeMB=4.0)),segFN=segments_1,generation=1,filenames=[segments_1]
[junit4:junit4]   2> 		commit{dir=RateLimitedDirectoryWrapper(NRTCachingDirectory(org.apache.lucene.store.NIOFSDirectory@/usr/home/hudson/hudson-slave/workspace/Lucene-Solr-Tests-trunk-java7/solr/build/solr-core/test/J0/org.apache.solr.cloud.BasicDistributedZkTest-1360019516837/jetty1/index lockFactory=org.apache.lucene.store.NativeFSLockFactory@3fb6de9f; maxCacheMB=48.0 maxMergeSizeMB=4.0)),segFN=segments_2,generation=2,filenames=[segments_2]
[junit4:junit4]   2> 19635 T461 C16 P58138 oasc.SolrDeletionPolicy.updateCommits newest commit = 2[segments_2]
[junit4:junit4]   2> 19637 T461 C16 P58138 oasc.CachingDirectoryFactory.close Releasing directory:/usr/home/hudson/hudson-slave/workspace/Lucene-Solr-Tests-trunk-java7/solr/build/solr-core/test/J0/./org.apache.solr.cloud.BasicDistributedZkTest-1360019516837/jetty1
[junit4:junit4]   2> 19637 T461 C16 P58138 oass.SolrIndexSearcher.<init> Opening Searcher@7765731d realtime
[junit4:junit4]   2> 19638 T461 C16 P58138 oasu.DirectUpdateHandler2.commit end_commit_flush
[junit4:junit4]   2> 19638 T461 C16 P58138 /update {waitSearcher=true&openSearcher=false&commit=true&wt=javabin&commit_end_point=true&version=2&softCommit=false} {commit=} 0 56
[junit4:junit4]   2> 19696 T502 C14 P30255 oash.ReplicationHandler.inform Commits will be reserved for  10000
[junit4:junit4]   2> 19697 T502 C14 P30255 oascsi.HttpClientUtil.createClient Creating new http client, config:connTimeout=5000&socketTimeout=20000&allowCompression=false&maxConnections=10000&maxConnectionsPerHost=10000
[junit4:junit4]   2> 19723 T502 C14 P30255 oash.SnapPuller.<init>  No value set for 'pollInterval'. Timer Task not started.
[junit4:junit4]   2> 19726 T462 C16 P58138 oash.ReplicationHandler.inform Commits will be reserved for  10000
[junit4:junit4]   2> 19726 T462 C16 P58138 REQ /replication {command=indexversion&qt=/replication&wt=javabin&version=2} status=0 QTime=2 
[junit4:junit4]   2> 19727 T502 C14 P30255 oash.SnapPuller.fetchLatestIndex Master's generation: 2
[junit4:junit4]   2> 19728 T502 C14 P30255 oash.SnapPuller.fetchLatestIndex Slave's generation: 1
[junit4:junit4]   2> 19728 T502 C14 P30255 oash.SnapPuller.fetchLatestIndex Starting replication process
[junit4:junit4]   2> 19731 T462 C16 P58138 oasc.CachingDirectoryFactory.close Releasing directory:/usr/home/hudson/hudson-slave/workspace/Lucene-Solr-Tests-trunk-java7/solr/build/solr-core/test/J0/./org.apache.solr.cloud.BasicDistributedZkTest-1360019516837/jetty1
[junit4:junit4]   2> 19732 T462 C16 P58138 oasc.CachingDirectoryFactory.close Releasing directory:/usr/home/hudson/hudson-slave/workspace/Lucene-Solr-Tests-trunk-java7/solr/build/solr-core/test/J0/./org.apache.solr.cloud.BasicDistributedZkTest-1360019516837/jetty1/index
[junit4:junit4]   2> 19732 T462 C16 P58138 REQ /replication {command=filelist&qt=/replication&wt=javabin&generation=2&version=2} status=0 QTime=2 
[junit4:junit4]   2> 19733 T502 C14 P30255 oash.SnapPuller.fetchLatestIndex Number of files in latest index in master: 1
[junit4:junit4]   2> 19734 T502 C14 P30255 oasc.CachingDirectoryFactory.get return new directory for /usr/home/hudson/hudson-slave/workspace/Lucene-Solr-Tests-trunk-java7/solr/build/solr-core/test/J0/./org.apache.solr.cloud.BasicDistributedZkTest-1360019516837/jetty3/index.20130205001216565 forceNew:false
[junit4:junit4]   2> 19735 T502 C14 P30255 oasc.CachingDirectoryFactory.close Releasing directory:/usr/home/hudson/hudson-slave/workspace/Lucene-Solr-Tests-trunk-java7/solr/build/solr-core/test/J0/./org.apache.solr.cloud.BasicDistributedZkTest-1360019516837/jetty3
[junit4:junit4]   2> 19735 T502 C14 P30255 oash.SnapPuller.fetchLatestIndex Starting download to RateLimitedDirectoryWrapper(NRTCachingDirectory(org.apache.lucene.store.NIOFSDirectory@/usr/home/hudson/hudson-slave/workspace/Lucene-Solr-Tests-trunk-java7/solr/build/solr-core/test/J0/org.apache.solr.cloud.BasicDistributedZkTest-1360019516837/jetty3/index.20130205001216565 lockFactory=org.apache.lucene.store.NativeFSLockFactory@6ffa2f97; maxCacheMB=48.0 maxMergeSizeMB=4.0)) fullCopy=true
[junit4:junit4]   2> 19749 T462 C16 P58138 REQ /replication {file=segments_2&command=filecontent&checksum=true&wt=filestream&qt=/replication&generation=2} status=0 QTime=5 
[junit4:junit4]   2> 19762 T502 C14 P30255 oasc.CachingDirectoryFactory.close Releasing directory:/usr/home/hudson/hudson-slave/workspace/Lucene-Solr-Tests-trunk-java7/solr/build/solr-core/test/J0/./org.apache.solr.cloud.BasicDistributedZkTest-1360019516837/jetty3/index
[junit4:junit4]   2> 19763 T502 C14 P30255 oash.SnapPuller.fetchLatestIndex Total time taken for download : 0 secs
[junit4:junit4]   2> 19764 T502 C14 P30255 oash.SnapPuller.modifyIndexProps New index installed. Updating index properties... index=index.20130205001216565
[junit4:junit4]   2> 19771 T502 C14 P30255 oasc.CachingDirectoryFactory.close Releasing directory:/usr/home/hudson/hudson-slave/workspace/Lucene-Solr-Tests-trunk-java7/solr/build/solr-core/test/J0/./org.apache.solr.cloud.BasicDistributedZkTest-1360019516837/jetty3
[junit4:junit4]   2> 19773 T502 C14 P30255 oasc.CachingDirectoryFactory.close Releasing directory:/usr/home/hudson/hudson-slave/workspace/Lucene-Solr-Tests-trunk-java7/solr/build/solr-core/test/J0/./org.apache.solr.cloud.BasicDistributedZkTest-1360019516837/jetty3
[junit4:junit4]   2> 19773 T502 C14 P30255 oasc.SolrCore.getNewIndexDir New index directory detected: old=./org.apache.solr.cloud.BasicDistributedZkTest-1360019516837/jetty3/index/ new=./org.apache.solr.cloud.BasicDistributedZkTest-1360019516837/jetty3/index.20130205001216565
[junit4:junit4]   2> 19777 T502 C14 P30255 oasc.SolrDeletionPolicy.onInit SolrDeletionPolicy.onInit: commits:num=1
[junit4:junit4]   2> 		commit{dir=RateLimitedDirectoryWrapper(NRTCachingDirectory(org.apache.lucene.store.NIOFSDirectory@/usr/home/hudson/hudson-slave/workspace/Lucene-Solr-Tests-trunk-java7/solr/build/solr-core/test/J0/org.apache.solr.cloud.BasicDistributedZkTest-1360019516837/jetty3/index.20130205001216565 lockFactory=org.apache.lucene.store.NativeFSLockFactory@6ffa2f97; maxCacheMB=48.0 maxMergeSizeMB=4.0)),segFN=segments_2,generation=2,filenames=[segments_2]
[junit4:junit4]   2> 19777 T502 C14 P30255 oasc.SolrDeletionPolicy.updateCommits newest commit = 2[segments_2]
[junit4:junit4]   2> 19779 T502 C14 P30255 oasc.CachingDirectoryFactory.close Releasing directory:/usr/home/hudson/hudson-slave/workspace/Lucene-Solr-Tests-trunk-java7/solr/build/solr-core/test/J0/./org.apache.solr.cloud.BasicDistributedZkTest-1360019516837/jetty3
[junit4:junit4]   2> 19783 T502 C14 P30255 oasu.DefaultSolrCoreState.newIndexWriter Creating new IndexWriter...
[junit4:junit4]   2> 19784 T502 C14 P30255 oasu.DefaultSolrCoreState.newIndexWriter Waiting until IndexWriter is unused... core=collection1
[junit4:junit4]   2> 19784 T502 C14 P30255 oasu.DefaultSolrCoreState.newIndexWriter Rollback old IndexWriter... core=collection1
[junit4:junit4]   2> 19785 T502 C14 P30255 oasc.CachingDirectoryFactory.close Releasing directory:/usr/home/hudson/hudson-slave/workspace/Lucene-Solr-Tests-trunk-java7/solr/build/solr-core/test/J0/./org.apache.solr.cloud.BasicDistributedZkTest-1360019516837/jetty3/index.20130205001216565
[junit4:junit4]   2> 19786 T502 C14 P30255 oasc.CachingDirectoryFactory.close Releasing directory:/usr/home/hudson/hudson-slave/workspace/Lucene-Solr-Tests-trunk-java7/solr/build/solr-core/test/J0/./org.apache.solr.cloud.BasicDistributedZkTest-1360019516837/jetty3
[junit4:junit4]   2> 19789 T502 C14 P30255 oasc.SolrDeletionPolicy.onInit SolrDeletionPolicy.onInit: commits:num=1
[junit4:junit4]   2> 		commit{dir=RateLimitedDirectoryWrapper(NRTCachingDirectory(org.apache.lucene.store.NIOFSDirectory@/usr/home/hudson/hudson-slave/workspace/Lucene-Solr-Tests-trunk-java7/solr/build/solr-core/test/J0/org.apache.solr.cloud.BasicDistributedZkTest-1360019516837/jetty3/index.20130205001216565 lockFactory=org.apache.lucene.store.NativeFSLockFactory@6ffa2f97; maxCacheMB=48.0 maxMergeSizeMB=4.0)),segFN=segments_2,generation=2,filenames=[segments_2]
[junit4:junit4]   2> 19790 T502 C14 P30255 oasc.SolrDeletionPolicy.updateCommits newest commit = 2[segments_2]
[junit4:junit4]   2> 19791 T502 C14 P30255 oasu.DefaultSolrCoreState.newIndexWriter New IndexWriter is ready to be used.
[junit4:junit4]   2> 19791 T502 C14 P30255 oasc.CachingDirectoryFactory.close Releasing directory:/usr/home/hudson/hudson-slave/workspace/Lucene-Solr-Tests-trunk-java7/solr/build/solr-core/test/J0/./org.apache.solr.cloud.BasicDistributedZkTest-1360019516837/jetty3
[junit4:junit4]   2> 19792 T502 C14 P30255 oass.SolrIndexSearcher.<init> Opening Searcher@2dd212cf main
[junit4:junit4]   2> 19793 T501 oasc.SolrCore.registerSearcher [collection1] Registered new searcher Searcher@2dd212cf main{StandardDirectoryReader(segments_2:1:nrt)}
[junit4:junit4]   2> 19794 T501 oasc.CachingDirectoryFactory.close Releasing directory:/usr/home/hudson/hudson-slave/workspace/Lucene-Solr-Tests-trunk-java7/solr/build/solr-core/test/J0/./org.apache.solr.cloud.BasicDistributedZkTest-1360019516837/jetty3/index
[junit4:junit4]   2> 19795 T502 C14 P30255 oasu.DirectUpdateHandler2.commit start commit{,optimize=false,openSearcher=false,waitSearcher=false,expungeDeletes=false,softCommit=false}
[junit4:junit4]   2> 19798 T502 C14 P30255 oasc.SolrDeletionPolicy.onCommit SolrDeletionPolicy.onCommit: commits:num=2
[junit4:junit4]   2> 		commit{dir=RateLimitedDirectoryWrapper(NRTCachingDirectory(org.apache.lucene.store.NIOFSDirectory@/usr/home/hudson/hudson-slave/workspace/Lucene-Solr-Tests-trunk-java7/solr/build/solr-core/test/J0/org.apache.solr.cloud.BasicDistributedZkTest-1360019516837/jetty3/index.20130205001216565 lockFactory=org.apache.lucene.store.NativeFSLockFactory@6ffa2f97; maxCacheMB=48.0 maxMergeSizeMB=4.0)),segFN=segments_2,generation=2,filenames=[segments_2]
[junit4:junit4]   2> 		commit{dir=RateLimitedDirectoryWrapper(NRTCachingDirectory(org.apache.lucene.store.NIOFSDirectory@/usr/home/hudson/hudson-slave/workspace/Lucene-Solr-Tests-trunk-java7/solr/build/solr-core/test/J0/org.apache.solr.cloud.BasicDistributedZkTest-1360019516837/jetty3/index.20130205001216565 lockFactory=org.apache.lucene.store.NativeFSLockFactory@6ffa2f97; maxCacheMB=48.0 maxMergeSizeMB=4.0)),segFN=segments_3,generation=3,filenames=[segments_3]
[junit4:junit4]   2> 19799 T502 C14 P30255 oasc.SolrDeletionPolicy.updateCommits newest commit = 3[segments_3]
[junit4:junit4]   2> 19800 T502 C14 P30255 oasc.CachingDirectoryFactory.close Releasing directory:/usr/home/hudson/hudson-slave/workspace/Lucene-Solr-Tests-trunk-java7/solr/build/solr-core/test/J0/./org.apache.solr.cloud.BasicDistributedZkTest-1360019516837/jetty3
[junit4:junit4]   2> 19800 T502 C14 P30255 oasu.DirectUpdateHandler2.commit end_commit_flush
[junit4:junit4]   2> 19800 T502 C14 P30255 oasc.CachingDirectoryFactory.close Releasing directory:/usr/home/hudson/hudson-slave/workspace/Lucene-Solr-Tests-trunk-java7/solr/build/solr-core/test/J0/./org.apache.solr.cloud.BasicDistributedZkTest-1360019516837/jetty3/index.20130205001216565
[junit4:junit4]   2> 19801 T502 C14 P30255 oasc.CachingDirectoryFactory.close Releasing directory:/usr/home/hudson/hudson-slave/workspace/Lucene-Solr-Tests-trunk-java7/solr/build/solr-core/test/J0/./org.apache.solr.cloud.BasicDistributedZkTest-1360019516837/jetty3/index
[junit4:junit4]   2> 19801 T502 C14 P30255 oasc.RecoveryStrategy.replay No replay needed. core=collection1
[junit4:junit4]   2> 19801 T502 C14 P30255 oasc.RecoveryStrategy.doRecovery Replication Recovery was successful - registering as Active. core=collection1
[junit4:junit4]   2> 19802 T502 C14 P30255 oasc.ZkController.publish publishing core=collection1 state=active
[junit4:junit4]   2> 19802 T502 C14 P30255 oasc.ZkController.publish numShards not found on descriptor - reading it from system property
[junit4:junit4]   2> 19804 T502 C14 P30255 oasc.RecoveryStrategy.doRecovery Finished recovery process. core=collection1
[junit4:junit4]   2> 20092 T428 oascc.ZkStateReader.updateClusterState Updating cloud state from ZooKeeper... 
[junit4:junit4]   2> 20111 T451 oascc.ZkStateReader.updateClusterState Updating cloud state from ZooKeeper... 
[junit4:junit4]   2> 20112 T451 oasc.Overseer$ClusterStateUpdater.updateState Update state numShards=2 message={
[junit4:junit4]   2> 	  "operation":"state",
[junit4:junit4]   2> 	  "numShards":"2",
[junit4:junit4]   2> 	  "shard":"shard2",
[junit4:junit4]   2> 	  "roles":null,
[junit4:junit4]   2> 	  "state":"recovering",
[junit4:junit4]   2> 	  "core":"collection1",
[junit4:junit4]   2> 	  "collection":"collection1",
[junit4:junit4]   2> 	  "node_name":"127.0.0.1:55162_sp_ffw%2Ff",
[junit4:junit4]   2> 	  "base_url":"http://127.0.0.1:55162/sp_ffw/f"}
[junit4:junit4]   2> 20118 T451 oasc.Overseer$ClusterStateUpdater.updateState Update state numShards=2 message={
[junit4:junit4]   2> 	  "operation":"state",
[junit4:junit4]   2> 	  "numShards":"2",
[junit4:junit4]   2> 	  "shard":"shard1",
[junit4:junit4]   2> 	  "roles":null,
[junit4:junit4]   2> 	  "state":"active",
[junit4:junit4]   2> 	  "core":"collection1",
[junit4:junit4]   2> 	  "collection":"collection1",
[junit4:junit4]   2> 	  "node_name":"127.0.0.1:30255_sp_ffw%2Ff",
[junit4:junit4]   2> 	  "base_url":"http://127.0.0.1:30255/sp_ffw/f"}
[junit4:junit4]   2> 20130 T456 oascc.ZkStateReader$2.process A cluster state change: WatchedEvent state:SyncConnected type:NodeDataChanged path:/clusterstate.json, has occurred - updating... (live nodes size: 5)
[junit4:junit4]   2> 20131 T515 oascc.ZkStateReader$2.process A cluster state change: WatchedEvent state:SyncConnected type:NodeDataChanged path:/clusterstate.json, has occurred - updating... (live nodes size: 5)
[junit4:junit4]   2> 20131 T484 oascc.ZkStateReader$2.process A cluster state change: WatchedEvent state:SyncConnected type:NodeDataChanged path:/clusterstate.json, has occurred - updating... (live nodes size: 5)
[junit4:junit4]   2> 20131 T499 oascc.ZkStateReader$2.process A cluster state change: WatchedEvent state:SyncConnected type:NodeDataChanged path:/clusterstate.json, has occurred - updating... (live nodes size: 5)
[junit4:junit4]   2> 20131 T469 oascc.ZkStateReader$2.process A cluster state change: WatchedEvent state:SyncConnected type:NodeDataChanged path:/clusterstate.json, has occurred - updating... (live nodes size: 5)
[junit4:junit4]   2> 20130 T450 oascc.ZkStateReader$2.process A cluster state change: WatchedEvent state:SyncConnected type:NodeDataChanged path:/clusterstate.json, has occurred - updating... (live nodes size: 5)
[junit4:junit4]   2> 21095 T428 oascc.ZkStateReader.updateClusterState Updating cloud state from ZooKeeper... 
[junit4:junit4]   2> 22098 T428 oascc.ZkStateReader.updateClusterState Updating cloud state from ZooKeeper... 
[junit4:junit4]   2>  C15_STATE=coll:collection1 core:collection1 props:{shard=shard2, roles=null, state=recovering, core=collection1, collection=collection1, node_name=127.0.0.1:55162_sp_ffw%2Ff, base_url=http://127.0.0.1:55162/sp_ffw/f}
[junit4:junit4]   2> 23089 T518 C15 P55162 oasc.RecoveryStrategy.doRecovery Attempting to PeerSync from http://127.0.0.1:37419/sp_ffw/f/collection1/ core=collection1 - recoveringAfterStartup=true
[junit4:junit4]   2> 23089 T518 C15 P55162 oasu.PeerSync.sync PeerSync: core=collection1 url=http://127.0.0.1:55162/sp_ffw/f START replicas=[http://127.0.0.1:37419/sp_ffw/f/collection1/] nUpdates=100
[junit4:junit4]   2> 23090 T518 C15 P55162 oasu.PeerSync.sync WARNING no frame of reference to tell of we've missed updates
[junit4:junit4]   2> 23090 T518 C15 P55162 oasc.RecoveryStrategy.doRecovery PeerSync Recovery was not successful - trying replication. core=collection1
[junit4:junit4]   2> 23090 T518 C15 P55162 oasc.RecoveryStrategy.doRecovery Starting Replication Recovery. core=collection1
[junit4:junit4]   2> 23091 T518 C15 P55162 oasc.RecoveryStrategy.doRecovery Begin buffering updates. core=collection1
[junit4:junit4]   2> 23091 T518 C15 P55162 oasu.UpdateLog.bufferUpdates Starting to buffer updates. FSUpdateLog{state=ACTIVE, tlog=null}
[junit4:junit4]   2> 23091 T518 C15 P55162 oasc.RecoveryStrategy.replicate Attempting to replicate from http://127.0.0.1:37419/sp_ffw/f/collection1/. core=collection1
[junit4:junit4]   2> 23092 T518 C15 P55162 oascsi.HttpClientUtil.createClient Creating new http client, config:maxConnections=128&maxConnectionsPerHost=32&followRedirects=false
[junit4:junit4]   2> 23101 T428 oascc.ZkStateReader.updateClusterState Updating cloud state from ZooKeeper... 
[junit4:junit4]   2> ASYNC  NEW_CORE C17 name=collection1 org.apache.solr.core.SolrCore@ab64f2 url=http:

[...truncated too long message...]

.io.SocketInputBuffer.fillBuffer(SocketInputBuffer.java:111)
[junit4:junit4]    > 	at org.apache.http.impl.io.AbstractSessionInputBuffer.readLine(AbstractSessionInputBuffer.java:264)
[junit4:junit4]    > 	at org.apache.http.impl.conn.DefaultResponseParser.parseHead(DefaultResponseParser.java:98)
[junit4:junit4]    > 	at org.apache.http.impl.io.AbstractMessageParser.parse(AbstractMessageParser.java:252)
[junit4:junit4]    > 	at org.apache.http.impl.AbstractHttpClientConnection.receiveResponseHeader(AbstractHttpClientConnection.java:282)
[junit4:junit4]    > 	at org.apache.http.impl.conn.DefaultClientConnection.receiveResponseHeader(DefaultClientConnection.java:247)
[junit4:junit4]    > 	at org.apache.http.impl.conn.AbstractClientConnAdapter.receiveResponseHeader(AbstractClientConnAdapter.java:216)
[junit4:junit4]    > 	at org.apache.http.protocol.HttpRequestExecutor.doReceiveResponse(HttpRequestExecutor.java:298)
[junit4:junit4]    > 	at org.apache.http.protocol.HttpRequestExecutor.execute(HttpRequestExecutor.java:125)
[junit4:junit4]    > 	at org.apache.http.impl.client.DefaultRequestDirector.tryExecute(DefaultRequestDirector.java:647)
[junit4:junit4]    > 	at org.apache.http.impl.client.DefaultRequestDirector.execute(DefaultRequestDirector.java:464)
[junit4:junit4]    > 	at org.apache.http.impl.client.AbstractHttpClient.execute(AbstractHttpClient.java:820)
[junit4:junit4]    > 	at org.apache.http.impl.client.AbstractHttpClient.execute(AbstractHttpClient.java:754)
[junit4:junit4]    > 	at org.apache.http.impl.client.AbstractHttpClient.execute(AbstractHttpClient.java:732)
[junit4:junit4]    > 	at org.apache.solr.client.solrj.impl.HttpSolrServer.request(HttpSolrServer.java:353)
[junit4:junit4]    > 	... 5 more
[junit4:junit4]    > Throwable #2: com.carrotsearch.randomizedtesting.UncaughtExceptionError: Captured an uncaught exception in thread: Thread[id=939, name=testExecutor-345-thread-5, state=RUNNABLE, group=TGRP-BasicDistributedZkTest]
[junit4:junit4]    > Caused by: java.lang.RuntimeException: org.apache.solr.client.solrj.SolrServerException: Timeout occured while waiting response from server at: http://127.0.0.1:30255/sp_ffw/f
[junit4:junit4]    > 	at __randomizedtesting.SeedInfo.seed([715CCD8973136CF0]:0)
[junit4:junit4]    > 	at org.apache.solr.cloud.BasicDistributedZkTest$1.run(BasicDistributedZkTest.java:658)
[junit4:junit4]    > 	at java.util.concurrent.ThreadPoolExecutor.runWorker(ThreadPoolExecutor.java:1110)
[junit4:junit4]    > 	at java.util.concurrent.ThreadPoolExecutor$Worker.run(ThreadPoolExecutor.java:603)
[junit4:junit4]    > 	at java.lang.Thread.run(Thread.java:722)
[junit4:junit4]    > Caused by: org.apache.solr.client.solrj.SolrServerException: Timeout occured while waiting response from server at: http://127.0.0.1:30255/sp_ffw/f
[junit4:junit4]    > 	at org.apache.solr.client.solrj.impl.HttpSolrServer.request(HttpSolrServer.java:412)
[junit4:junit4]    > 	at org.apache.solr.client.solrj.impl.HttpSolrServer.request(HttpSolrServer.java:181)
[junit4:junit4]    > 	at org.apache.solr.cloud.BasicDistributedZkTest$1.run(BasicDistributedZkTest.java:656)
[junit4:junit4]    > 	... 3 more
[junit4:junit4]    > Caused by: java.net.SocketTimeoutException: Read timed out
[junit4:junit4]    > 	at java.net.SocketInputStream.socketRead0(Native Method)
[junit4:junit4]    > 	at java.net.SocketInputStream.read(SocketInputStream.java:150)
[junit4:junit4]    > 	at java.net.SocketInputStream.read(SocketInputStream.java:121)
[junit4:junit4]    > 	at org.apache.http.impl.io.AbstractSessionInputBuffer.fillBuffer(AbstractSessionInputBuffer.java:149)
[junit4:junit4]    > 	at org.apache.http.impl.io.SocketInputBuffer.fillBuffer(SocketInputBuffer.java:111)
[junit4:junit4]    > 	at org.apache.http.impl.io.AbstractSessionInputBuffer.readLine(AbstractSessionInputBuffer.java:264)
[junit4:junit4]    > 	at org.apache.http.impl.conn.DefaultResponseParser.parseHead(DefaultResponseParser.java:98)
[junit4:junit4]    > 	at org.apache.http.impl.io.AbstractMessageParser.parse(AbstractMessageParser.java:252)
[junit4:junit4]    > 	at org.apache.http.impl.AbstractHttpClientConnection.receiveResponseHeader(AbstractHttpClientConnection.java:282)
[junit4:junit4]    > 	at org.apache.http.impl.conn.DefaultClientConnection.receiveResponseHeader(DefaultClientConnection.java:247)
[junit4:junit4]    > 	at org.apache.http.impl.conn.AbstractClientConnAdapter.receiveResponseHeader(AbstractClientConnAdapter.java:216)
[junit4:junit4]    > 	at org.apache.http.protocol.HttpRequestExecutor.doReceiveResponse(HttpRequestExecutor.java:298)
[junit4:junit4]    > 	at org.apache.http.protocol.HttpRequestExecutor.execute(HttpRequestExecutor.java:125)
[junit4:junit4]    > 	at org.apache.http.impl.client.DefaultRequestDirector.tryExecute(DefaultRequestDirector.java:647)
[junit4:junit4]    > 	at org.apache.http.impl.client.DefaultRequestDirector.execute(DefaultRequestDirector.java:464)
[junit4:junit4]    > 	at org.apache.http.impl.client.AbstractHttpClient.execute(AbstractHttpClient.java:820)
[junit4:junit4]    > 	at org.apache.http.impl.client.AbstractHttpClient.execute(AbstractHttpClient.java:754)
[junit4:junit4]    > 	at org.apache.http.impl.client.AbstractHttpClient.execute(AbstractHttpClient.java:732)
[junit4:junit4]    > 	at org.apache.solr.client.solrj.impl.HttpSolrServer.request(HttpSolrServer.java:353)
[junit4:junit4]    > 	... 5 more
[junit4:junit4]   2> 388062 T428 oas.SolrTestCaseJ4.deleteCore ###deleteCore
[junit4:junit4]   2> 388169 T431 oazs.SessionTrackerImpl.run SessionTrackerImpl exited loop!
[junit4:junit4]   2> 388258 T499 oascc.ZkStateReader$2.process WARNING ZooKeeper watch triggered, but Solr cannot talk to ZK
[junit4:junit4]   2> 388258 T499 oascc.ZkStateReader$3.process WARNING ZooKeeper watch triggered, but Solr cannot talk to ZK
[junit4:junit4]   2> 388258 T499 oaz.ClientCnxn$EventThread.run EventThread shut down
[junit4:junit4]   2> 388430 T515 oascc.ZkStateReader$3.process WARNING ZooKeeper watch triggered, but Solr cannot talk to ZK
[junit4:junit4]   2> 388430 T515 oascc.ZkStateReader$2.process A cluster state change: WatchedEvent state:SyncConnected type:NodeChildrenChanged path:/live_nodes, has occurred - updating... (live nodes size: 1)
[junit4:junit4]   2> 388430 T515 oascc.ZkStateReader$2.process WARNING ZooKeeper watch triggered, but Solr cannot talk to ZK
[junit4:junit4]   2> 388430 T515 oaz.ClientCnxn$EventThread.run EventThread shut down
[junit4:junit4]   2> NOTE: test params are: codec=Lucene42: {n_f1=PostingsFormat(name=NestedPulsing), foo_b=PostingsFormat(name=Memory doPackFST= true), cat=Lucene41(blocksize=128), foo_d=Pulsing41(freqCutoff=13 minBlockSize=38 maxBlockSize=83), foo_f=PostingsFormat(name=Memory doPackFST= true), n_tl1=PostingsFormat(name=NestedPulsing), n_d1=Lucene41(blocksize=128), rnd_b=Pulsing41(freqCutoff=13 minBlockSize=38 maxBlockSize=83), intDefault=Lucene41(blocksize=128), n_td1=PostingsFormat(name=NestedPulsing), timestamp=Lucene41(blocksize=128), id=Pulsing41(freqCutoff=13 minBlockSize=38 maxBlockSize=83), range_facet_sl=PostingsFormat(name=Memory doPackFST= true), range_facet_si=PostingsFormat(name=NestedPulsing), oddField_s=PostingsFormat(name=Memory doPackFST= true), sequence_i=PostingsFormat(name=Memory doPackFST= true), name=Pulsing41(freqCutoff=13 minBlockSize=38 maxBlockSize=83), foo_i=PostingsFormat(name=NestedPulsing), regex_dup_B_s=Lucene41(blocksize=128), multiDefault=PostingsFormat(name=NestedPulsing), n_tf1=Lucene41(blocksize=128), n_dt1=PostingsFormat(name=NestedPulsing), genre_s=PostingsFormat(name=Memory doPackFST= true), author_t=PostingsFormat(name=NestedPulsing), n_ti1=Pulsing41(freqCutoff=13 minBlockSize=38 maxBlockSize=83), range_facet_l=Lucene41(blocksize=128), text=PostingsFormat(name=Memory doPackFST= true), _version_=Lucene41(blocksize=128), val_i=Pulsing41(freqCutoff=13 minBlockSize=38 maxBlockSize=83), SubjectTerms_mfacet=Lucene41(blocksize=128), series_t=PostingsFormat(name=NestedPulsing), a_t=Lucene41(blocksize=128), n_tdt1=Lucene41(blocksize=128), regex_dup_A_s=PostingsFormat(name=Memory doPackFST= true), price=PostingsFormat(name=Memory doPackFST= true), other_tl1=Lucene41(blocksize=128), n_l1=Lucene41(blocksize=128), a_si=PostingsFormat(name=NestedPulsing), inStock=PostingsFormat(name=Memory doPackFST= true)}, sim=DefaultSimilarity, locale=et, timezone=ECT
[junit4:junit4]   2> NOTE: FreeBSD 9.0-RELEASE amd64/Oracle Corporation 1.7.0_09 (64-bit)/cpus=16,threads=2,free=327414984,total=475004928
[junit4:junit4]   2> NOTE: All tests run in this JVM: [RequestHandlersTest, TestFiltering, TestRandomFaceting, TestDefaultSimilarityFactory, BinaryUpdateRequestHandlerTest, DistributedSpellCheckComponentTest, TestGroupingSearch, JsonLoaderTest, BasicDistributedZkTest]
[junit4:junit4] Completed on J0 in 388.65s, 1 test, 1 error <<< FAILURES!

[...truncated 582 lines...]
BUILD FAILED
/usr/home/hudson/hudson-slave/workspace/Lucene-Solr-Tests-trunk-java7/build.xml:346: The following error occurred while executing this line:
/usr/home/hudson/hudson-slave/workspace/Lucene-Solr-Tests-trunk-java7/build.xml:39: The following error occurred while executing this line:
/usr/home/hudson/hudson-slave/workspace/Lucene-Solr-Tests-trunk-java7/solr/build.xml:178: The following error occurred while executing this line:
/usr/home/hudson/hudson-slave/workspace/Lucene-Solr-Tests-trunk-java7/solr/common-build.xml:428: The following error occurred while executing this line:
/usr/home/hudson/hudson-slave/workspace/Lucene-Solr-Tests-trunk-java7/lucene/common-build.xml:1176: The following error occurred while executing this line:
/usr/home/hudson/hudson-slave/workspace/Lucene-Solr-Tests-trunk-java7/lucene/common-build.xml:841: There were test failures: 249 suites, 1038 tests, 1 error, 23 ignored (5 assumptions)

Total time: 39 minutes 26 seconds
Build step 'Invoke Ant' marked build as failure
Archiving artifacts
Recording test results
Email was triggered for: Failure
Sending email for trigger: Failure



Mime
View raw message