lucene-dev mailing list archives

Site index · List index
Message view « Date » · « Thread »
Top « Date » · « Thread »
From Policeman Jenkins Server <jenk...@thetaphi.de>
Subject [JENKINS] Lucene-Solr-4.x-MacOSX (64bit/jdk1.7.0) - Build # 200 - Failure!
Date Mon, 11 Feb 2013 19:21:47 GMT
Build: http://jenkins.thetaphi.de/job/Lucene-Solr-4.x-MacOSX/200/
Java: 64bit/jdk1.7.0 -XX:+UseConcMarkSweepGC

1 tests failed.
REGRESSION:  org.apache.solr.cloud.BasicDistributedZkTest.testDistribSearch

Error Message:
Captured an uncaught exception in thread: Thread[id=2596, name=testExecutor-1582-thread-6, state=RUNNABLE, group=TGRP-BasicDistributedZkTest]

Stack Trace:
com.carrotsearch.randomizedtesting.UncaughtExceptionError: Captured an uncaught exception in thread: Thread[id=2596, name=testExecutor-1582-thread-6, state=RUNNABLE, group=TGRP-BasicDistributedZkTest]
Caused by: java.lang.RuntimeException: org.apache.solr.client.solrj.SolrServerException: IOException occured when talking to server at: http://127.0.0.1:51793
	at __randomizedtesting.SeedInfo.seed([8809D9FC444D0118]:0)
	at org.apache.solr.cloud.BasicDistributedZkTest$2.run(BasicDistributedZkTest.java:722)
	at java.util.concurrent.ThreadPoolExecutor.runWorker(ThreadPoolExecutor.java:1110)
	at java.util.concurrent.ThreadPoolExecutor$Worker.run(ThreadPoolExecutor.java:603)
	at java.lang.Thread.run(Thread.java:722)
Caused by: org.apache.solr.client.solrj.SolrServerException: IOException occured when talking to server at: http://127.0.0.1:51793
	at org.apache.solr.client.solrj.impl.HttpSolrServer.request(HttpSolrServer.java:416)
	at org.apache.solr.client.solrj.impl.HttpSolrServer.request(HttpSolrServer.java:181)
	at org.apache.solr.cloud.BasicDistributedZkTest$2.run(BasicDistributedZkTest.java:720)
	... 3 more
Caused by: java.net.SocketException: Invalid argument
	at java.net.SocketInputStream.socketRead0(Native Method)
	at java.net.SocketInputStream.read(SocketInputStream.java:150)
	at java.net.SocketInputStream.read(SocketInputStream.java:121)
	at org.apache.http.impl.io.AbstractSessionInputBuffer.fillBuffer(AbstractSessionInputBuffer.java:149)
	at org.apache.http.impl.io.SocketInputBuffer.fillBuffer(SocketInputBuffer.java:111)
	at org.apache.http.impl.io.AbstractSessionInputBuffer.readLine(AbstractSessionInputBuffer.java:264)
	at org.apache.http.impl.conn.DefaultResponseParser.parseHead(DefaultResponseParser.java:98)
	at org.apache.http.impl.io.AbstractMessageParser.parse(AbstractMessageParser.java:252)
	at org.apache.http.impl.AbstractHttpClientConnection.receiveResponseHeader(AbstractHttpClientConnection.java:282)
	at org.apache.http.impl.conn.DefaultClientConnection.receiveResponseHeader(DefaultClientConnection.java:247)
	at org.apache.http.impl.conn.AbstractClientConnAdapter.receiveResponseHeader(AbstractClientConnAdapter.java:216)
	at org.apache.http.protocol.HttpRequestExecutor.doReceiveResponse(HttpRequestExecutor.java:298)
	at org.apache.http.protocol.HttpRequestExecutor.execute(HttpRequestExecutor.java:125)
	at org.apache.http.impl.client.DefaultRequestDirector.tryExecute(DefaultRequestDirector.java:647)
	at org.apache.http.impl.client.DefaultRequestDirector.execute(DefaultRequestDirector.java:464)
	at org.apache.http.impl.client.AbstractHttpClient.execute(AbstractHttpClient.java:820)
	at org.apache.http.impl.client.AbstractHttpClient.execute(AbstractHttpClient.java:754)
	at org.apache.http.impl.client.AbstractHttpClient.execute(AbstractHttpClient.java:732)
	at org.apache.solr.client.solrj.impl.HttpSolrServer.request(HttpSolrServer.java:353)
	... 5 more




Build Log:
[...truncated 8932 lines...]
[junit4:junit4] Suite: org.apache.solr.cloud.BasicDistributedZkTest
[junit4:junit4]   2> 0 T2267 oas.BaseDistributedSearchTestCase.initHostContext Setting hostContext system property: /
[junit4:junit4]   2> 7 T2267 oas.SolrTestCaseJ4.setUp ###Starting testDistribSearch
[junit4:junit4]   2> Creating dataDir: /Users/jenkins/jenkins-slave/workspace/Lucene-Solr-4.x-MacOSX/solr/build/solr-core/test/J0/./solrtest-BasicDistributedZkTest-1360609476277
[junit4:junit4]   2> 11 T2267 oasc.ZkTestServer.run STARTING ZK TEST SERVER
[junit4:junit4]   2> 12 T2268 oasc.ZkTestServer$ZKServerMain.runFromConfig Starting server
[junit4:junit4]   2> 14 T2268 oazs.ZooKeeperServer.setTickTime tickTime set to 1000
[junit4:junit4]   2> 15 T2268 oazs.ZooKeeperServer.setMinSessionTimeout minSessionTimeout set to -1
[junit4:junit4]   2> 15 T2268 oazs.ZooKeeperServer.setMaxSessionTimeout maxSessionTimeout set to -1
[junit4:junit4]   2> 16 T2268 oazs.NIOServerCnxnFactory.configure binding to port 0.0.0.0/0.0.0.0:0
[junit4:junit4]   2> 17 T2268 oazsp.FileTxnSnapLog.save Snapshotting: 0x0 to /Users/jenkins/jenkins-slave/workspace/Lucene-Solr-4.x-MacOSX/solr/build/solr-core/test/J0/./org.apache.solr.cloud.BasicDistributedZkTest-1360609476277/zookeeper/server1/data/version-2/snapshot.0
[junit4:junit4]   2> 113 T2267 oasc.ZkTestServer.run start zk server on port:51780
[junit4:junit4]   2> 114 T2267 oaz.ZooKeeper.<init> Initiating client connection, connectString=127.0.0.1:51780 sessionTimeout=10000 watcher=org.apache.solr.common.cloud.ConnectionManager@2cea9634
[junit4:junit4]   2> 116 T2273 oaz.ClientCnxn$SendThread.logStartConnect Opening socket connection to server localhost/127.0.0.1:51780. Will not attempt to authenticate using SASL (access denied ("javax.security.auth.AuthPermission" "getLoginConfiguration"))
[junit4:junit4]   2> 116 T2267 oascc.ConnectionManager.waitForConnected Waiting for client to connect to ZooKeeper
[junit4:junit4]   2> 117 T2273 oaz.ClientCnxn$SendThread.primeConnection Socket connection established to localhost/127.0.0.1:51780, initiating session
[junit4:junit4]   2> 118 T2269 oazs.NIOServerCnxnFactory.run Accepted socket connection from /127.0.0.1:51781
[junit4:junit4]   2> 119 T2269 oazs.ZooKeeperServer.processConnectRequest Client attempting to establish new session at /127.0.0.1:51781
[junit4:junit4]   2> 119 T2271 oazsp.FileTxnLog.append Creating new log file: log.1
[junit4:junit4]   2> 123 T2271 oazs.ZooKeeperServer.finishSessionInit Established session 0x13ccaa4febd0000 with negotiated timeout 10000 for client /127.0.0.1:51781
[junit4:junit4]   2> 123 T2273 oaz.ClientCnxn$SendThread.onConnected Session establishment complete on server localhost/127.0.0.1:51780, sessionid = 0x13ccaa4febd0000, negotiated timeout = 10000
[junit4:junit4]   2> 124 T2274 oascc.ConnectionManager.process Watcher org.apache.solr.common.cloud.ConnectionManager@2cea9634 name:ZooKeeperConnection Watcher:127.0.0.1:51780 got event WatchedEvent state:SyncConnected type:None path:null path:null type:None
[junit4:junit4]   2> 124 T2267 oascc.ConnectionManager.waitForConnected Client is connected to ZooKeeper
[junit4:junit4]   2> 125 T2267 oascc.SolrZkClient.makePath makePath: /solr
[junit4:junit4]   2> 130 T2272 oazs.PrepRequestProcessor.pRequest2Txn Processed session termination for sessionid: 0x13ccaa4febd0000
[junit4:junit4]   2> 133 T2269 oazs.NIOServerCnxn.closeSock Closed socket connection for client /127.0.0.1:51781 which had sessionid 0x13ccaa4febd0000
[junit4:junit4]   2> 133 T2274 oaz.ClientCnxn$EventThread.run EventThread shut down
[junit4:junit4]   2> 133 T2267 oaz.ZooKeeper.close Session: 0x13ccaa4febd0000 closed
[junit4:junit4]   2> 134 T2267 oaz.ZooKeeper.<init> Initiating client connection, connectString=127.0.0.1:51780/solr sessionTimeout=10000 watcher=org.apache.solr.common.cloud.ConnectionManager@45ca57a3
[junit4:junit4]   2> 135 T2267 oascc.ConnectionManager.waitForConnected Waiting for client to connect to ZooKeeper
[junit4:junit4]   2> 136 T2275 oaz.ClientCnxn$SendThread.logStartConnect Opening socket connection to server localhost/127.0.0.1:51780. Will not attempt to authenticate using SASL (access denied ("javax.security.auth.AuthPermission" "getLoginConfiguration"))
[junit4:junit4]   2> 136 T2275 oaz.ClientCnxn$SendThread.primeConnection Socket connection established to localhost/127.0.0.1:51780, initiating session
[junit4:junit4]   2> 136 T2269 oazs.NIOServerCnxnFactory.run Accepted socket connection from /127.0.0.1:51782
[junit4:junit4]   2> 137 T2269 oazs.ZooKeeperServer.processConnectRequest Client attempting to establish new session at /127.0.0.1:51782
[junit4:junit4]   2> 139 T2271 oazs.ZooKeeperServer.finishSessionInit Established session 0x13ccaa4febd0001 with negotiated timeout 10000 for client /127.0.0.1:51782
[junit4:junit4]   2> 139 T2275 oaz.ClientCnxn$SendThread.onConnected Session establishment complete on server localhost/127.0.0.1:51780, sessionid = 0x13ccaa4febd0001, negotiated timeout = 10000
[junit4:junit4]   2> 140 T2276 oascc.ConnectionManager.process Watcher org.apache.solr.common.cloud.ConnectionManager@45ca57a3 name:ZooKeeperConnection Watcher:127.0.0.1:51780/solr got event WatchedEvent state:SyncConnected type:None path:null path:null type:None
[junit4:junit4]   2> 140 T2267 oascc.ConnectionManager.waitForConnected Client is connected to ZooKeeper
[junit4:junit4]   2> 141 T2267 oascc.SolrZkClient.makePath makePath: /collections/collection1
[junit4:junit4]   2> 148 T2267 oascc.SolrZkClient.makePath makePath: /collections/collection1/shards
[junit4:junit4]   2> 155 T2267 oascc.SolrZkClient.makePath makePath: /collections/control_collection
[junit4:junit4]   2> 160 T2267 oascc.SolrZkClient.makePath makePath: /collections/control_collection/shards
[junit4:junit4]   2> 168 T2267 oasc.AbstractZkTestCase.putConfig put /Users/jenkins/jenkins-slave/workspace/Lucene-Solr-4.x-MacOSX/solr/build/solr-core/test-files/solr/collection1/conf/solrconfig.xml to /configs/conf1/solrconfig.xml
[junit4:junit4]   2> 170 T2267 oascc.SolrZkClient.makePath makePath: /configs/conf1/solrconfig.xml
[junit4:junit4]   2> 181 T2267 oasc.AbstractZkTestCase.putConfig put /Users/jenkins/jenkins-slave/workspace/Lucene-Solr-4.x-MacOSX/solr/build/solr-core/test-files/solr/collection1/conf/schema.xml to /configs/conf1/schema.xml
[junit4:junit4]   2> 183 T2267 oascc.SolrZkClient.makePath makePath: /configs/conf1/schema.xml
[junit4:junit4]   2> 191 T2267 oasc.AbstractZkTestCase.putConfig put /Users/jenkins/jenkins-slave/workspace/Lucene-Solr-4.x-MacOSX/solr/build/solr-core/test-files/solr/collection1/conf/stopwords.txt to /configs/conf1/stopwords.txt
[junit4:junit4]   2> 192 T2267 oascc.SolrZkClient.makePath makePath: /configs/conf1/stopwords.txt
[junit4:junit4]   2> 199 T2267 oasc.AbstractZkTestCase.putConfig put /Users/jenkins/jenkins-slave/workspace/Lucene-Solr-4.x-MacOSX/solr/build/solr-core/test-files/solr/collection1/conf/protwords.txt to /configs/conf1/protwords.txt
[junit4:junit4]   2> 201 T2267 oascc.SolrZkClient.makePath makePath: /configs/conf1/protwords.txt
[junit4:junit4]   2> 207 T2267 oasc.AbstractZkTestCase.putConfig put /Users/jenkins/jenkins-slave/workspace/Lucene-Solr-4.x-MacOSX/solr/build/solr-core/test-files/solr/collection1/conf/currency.xml to /configs/conf1/currency.xml
[junit4:junit4]   2> 209 T2267 oascc.SolrZkClient.makePath makePath: /configs/conf1/currency.xml
[junit4:junit4]   2> 216 T2267 oasc.AbstractZkTestCase.putConfig put /Users/jenkins/jenkins-slave/workspace/Lucene-Solr-4.x-MacOSX/solr/build/solr-core/test-files/solr/collection1/conf/open-exchange-rates.json to /configs/conf1/open-exchange-rates.json
[junit4:junit4]   2> 217 T2267 oascc.SolrZkClient.makePath makePath: /configs/conf1/open-exchange-rates.json
[junit4:junit4]   2> 232 T2267 oasc.AbstractZkTestCase.putConfig put /Users/jenkins/jenkins-slave/workspace/Lucene-Solr-4.x-MacOSX/solr/build/solr-core/test-files/solr/collection1/conf/mapping-ISOLatin1Accent.txt to /configs/conf1/mapping-ISOLatin1Accent.txt
[junit4:junit4]   2> 233 T2267 oascc.SolrZkClient.makePath makePath: /configs/conf1/mapping-ISOLatin1Accent.txt
[junit4:junit4]   2> 240 T2267 oasc.AbstractZkTestCase.putConfig put /Users/jenkins/jenkins-slave/workspace/Lucene-Solr-4.x-MacOSX/solr/build/solr-core/test-files/solr/collection1/conf/old_synonyms.txt to /configs/conf1/old_synonyms.txt
[junit4:junit4]   2> 241 T2267 oascc.SolrZkClient.makePath makePath: /configs/conf1/old_synonyms.txt
[junit4:junit4]   2> 246 T2267 oasc.AbstractZkTestCase.putConfig put /Users/jenkins/jenkins-slave/workspace/Lucene-Solr-4.x-MacOSX/solr/build/solr-core/test-files/solr/collection1/conf/synonyms.txt to /configs/conf1/synonyms.txt
[junit4:junit4]   2> 247 T2267 oascc.SolrZkClient.makePath makePath: /configs/conf1/synonyms.txt
[junit4:junit4]   2> 254 T2272 oazs.PrepRequestProcessor.pRequest2Txn Processed session termination for sessionid: 0x13ccaa4febd0001
[junit4:junit4]   2> 255 T2269 oazs.NIOServerCnxn.closeSock Closed socket connection for client /127.0.0.1:51782 which had sessionid 0x13ccaa4febd0001
[junit4:junit4]   2> 255 T2276 oaz.ClientCnxn$EventThread.run EventThread shut down
[junit4:junit4]   2> 255 T2267 oaz.ZooKeeper.close Session: 0x13ccaa4febd0001 closed
[junit4:junit4]   2> 453 T2267 oejs.Server.doStart jetty-8.1.8.v20121106
[junit4:junit4]   2> 459 T2267 oejs.AbstractConnector.doStart Started SelectChannelConnector@127.0.0.1:51783
[junit4:junit4]   2> 460 T2267 oass.SolrDispatchFilter.init SolrDispatchFilter.init()
[junit4:junit4]   2> 461 T2267 oasc.SolrResourceLoader.locateSolrHome JNDI not configured for solr (NoInitialContextEx)
[junit4:junit4]   2> 461 T2267 oasc.SolrResourceLoader.locateSolrHome using system property solr.solr.home: /Users/jenkins/jenkins-slave/workspace/Lucene-Solr-4.x-MacOSX/solr/build/solr-core/test/J0/./org.apache.solr.cloud.BasicDistributedZkTest-controljetty-1360609476525
[junit4:junit4]   2> 462 T2267 oasc.CoreContainer$Initializer.initialize looking for solr.xml: /Users/jenkins/jenkins-slave/workspace/Lucene-Solr-4.x-MacOSX/solr/build/solr-core/test/J0/./org.apache.solr.cloud.BasicDistributedZkTest-controljetty-1360609476525/solr.xml
[junit4:junit4]   2> 463 T2267 oasc.CoreContainer.<init> New CoreContainer 1339300838
[junit4:junit4]   2> 463 T2267 oasc.CoreContainer.load Loading CoreContainer using Solr Home: '/Users/jenkins/jenkins-slave/workspace/Lucene-Solr-4.x-MacOSX/solr/build/solr-core/test/J0/./org.apache.solr.cloud.BasicDistributedZkTest-controljetty-1360609476525/'
[junit4:junit4]   2> 464 T2267 oasc.SolrResourceLoader.<init> new SolrResourceLoader for directory: '/Users/jenkins/jenkins-slave/workspace/Lucene-Solr-4.x-MacOSX/solr/build/solr-core/test/J0/./org.apache.solr.cloud.BasicDistributedZkTest-controljetty-1360609476525/'
[junit4:junit4]   2> 496 T2267 oashc.HttpShardHandlerFactory.getParameter Setting socketTimeout to: 60000
[junit4:junit4]   2> 497 T2267 oashc.HttpShardHandlerFactory.getParameter Setting urlScheme to: http://
[junit4:junit4]   2> 497 T2267 oashc.HttpShardHandlerFactory.getParameter Setting connTimeout to: 15000
[junit4:junit4]   2> 498 T2267 oashc.HttpShardHandlerFactory.getParameter Setting maxConnectionsPerHost to: 20
[junit4:junit4]   2> 498 T2267 oashc.HttpShardHandlerFactory.getParameter Setting corePoolSize to: 0
[junit4:junit4]   2> 499 T2267 oashc.HttpShardHandlerFactory.getParameter Setting maximumPoolSize to: 2147483647
[junit4:junit4]   2> 499 T2267 oashc.HttpShardHandlerFactory.getParameter Setting maxThreadIdleTime to: 5
[junit4:junit4]   2> 500 T2267 oashc.HttpShardHandlerFactory.getParameter Setting sizeOfQueue to: -1
[junit4:junit4]   2> 500 T2267 oashc.HttpShardHandlerFactory.getParameter Setting fairnessPolicy to: false
[junit4:junit4]   2> 501 T2267 oascsi.HttpClientUtil.createClient Creating new http client, config:maxConnectionsPerHost=20&maxConnections=10000&socketTimeout=60000&connTimeout=15000&retry=false
[junit4:junit4]   2> 511 T2267 oasc.CoreContainer.load Registering Log Listener
[junit4:junit4]   2> 550 T2267 oasc.CoreContainer.initZooKeeper Zookeeper client=127.0.0.1:51780/solr
[junit4:junit4]   2> 551 T2267 oasc.ZkController.checkChrootPath zkHost includes chroot
[junit4:junit4]   2> 552 T2267 oaz.ZooKeeper.<init> Initiating client connection, connectString=127.0.0.1:51780 sessionTimeout=60000 watcher=org.apache.solr.common.cloud.ConnectionManager@2dde48b6
[junit4:junit4]   2> 553 T2267 oascc.ConnectionManager.waitForConnected Waiting for client to connect to ZooKeeper
[junit4:junit4]   2> 554 T2286 oaz.ClientCnxn$SendThread.logStartConnect Opening socket connection to server localhost/127.0.0.1:51780. Will not attempt to authenticate using SASL (access denied ("javax.security.auth.AuthPermission" "getLoginConfiguration"))
[junit4:junit4]   2> 555 T2286 oaz.ClientCnxn$SendThread.primeConnection Socket connection established to localhost/127.0.0.1:51780, initiating session
[junit4:junit4]   2> 556 T2269 oazs.NIOServerCnxnFactory.run Accepted socket connection from /127.0.0.1:51784
[junit4:junit4]   2> 556 T2269 oazs.ZooKeeperServer.processConnectRequest Client attempting to establish new session at /127.0.0.1:51784
[junit4:junit4]   2> 558 T2271 oazs.ZooKeeperServer.finishSessionInit Established session 0x13ccaa4febd0002 with negotiated timeout 20000 for client /127.0.0.1:51784
[junit4:junit4]   2> 559 T2286 oaz.ClientCnxn$SendThread.onConnected Session establishment complete on server localhost/127.0.0.1:51780, sessionid = 0x13ccaa4febd0002, negotiated timeout = 20000
[junit4:junit4]   2> 559 T2287 oascc.ConnectionManager.process Watcher org.apache.solr.common.cloud.ConnectionManager@2dde48b6 name:ZooKeeperConnection Watcher:127.0.0.1:51780 got event WatchedEvent state:SyncConnected type:None path:null path:null type:None
[junit4:junit4]   2> 560 T2267 oascc.ConnectionManager.waitForConnected Client is connected to ZooKeeper
[junit4:junit4]   2> 562 T2272 oazs.PrepRequestProcessor.pRequest2Txn Processed session termination for sessionid: 0x13ccaa4febd0002
[junit4:junit4]   2> 563 T2269 oazs.NIOServerCnxn.closeSock Closed socket connection for client /127.0.0.1:51784 which had sessionid 0x13ccaa4febd0002
[junit4:junit4]   2> 564 T2287 oaz.ClientCnxn$EventThread.run EventThread shut down
[junit4:junit4]   2> 564 T2267 oaz.ZooKeeper.close Session: 0x13ccaa4febd0002 closed
[junit4:junit4]   2> 565 T2267 oascsi.HttpClientUtil.createClient Creating new http client, config:maxConnections=500&maxConnectionsPerHost=16&socketTimeout=60000&connTimeout=15000
[junit4:junit4]   2> 571 T2267 oaz.ZooKeeper.<init> Initiating client connection, connectString=127.0.0.1:51780/solr sessionTimeout=30000 watcher=org.apache.solr.common.cloud.ConnectionManager@2ccdd74a
[junit4:junit4]   2> 572 T2267 oascc.ConnectionManager.waitForConnected Waiting for client to connect to ZooKeeper
[junit4:junit4]   2> 573 T2288 oaz.ClientCnxn$SendThread.logStartConnect Opening socket connection to server localhost/127.0.0.1:51780. Will not attempt to authenticate using SASL (access denied ("javax.security.auth.AuthPermission" "getLoginConfiguration"))
[junit4:junit4]   2> 574 T2288 oaz.ClientCnxn$SendThread.primeConnection Socket connection established to localhost/127.0.0.1:51780, initiating session
[junit4:junit4]   2> 574 T2269 oazs.NIOServerCnxnFactory.run Accepted socket connection from /127.0.0.1:51785
[junit4:junit4]   2> 575 T2269 oazs.ZooKeeperServer.processConnectRequest Client attempting to establish new session at /127.0.0.1:51785
[junit4:junit4]   2> 576 T2271 oazs.ZooKeeperServer.finishSessionInit Established session 0x13ccaa4febd0003 with negotiated timeout 20000 for client /127.0.0.1:51785
[junit4:junit4]   2> 576 T2288 oaz.ClientCnxn$SendThread.onConnected Session establishment complete on server localhost/127.0.0.1:51780, sessionid = 0x13ccaa4febd0003, negotiated timeout = 20000
[junit4:junit4]   2> 577 T2289 oascc.ConnectionManager.process Watcher org.apache.solr.common.cloud.ConnectionManager@2ccdd74a name:ZooKeeperConnection Watcher:127.0.0.1:51780/solr got event WatchedEvent state:SyncConnected type:None path:null path:null type:None
[junit4:junit4]   2> 577 T2267 oascc.ConnectionManager.waitForConnected Client is connected to ZooKeeper
[junit4:junit4]   2> 581 T2272 oazs.PrepRequestProcessor.pRequest Got user-level KeeperException when processing sessionid:0x13ccaa4febd0003 type:create cxid:0x2 zxid:0x1a txntype:-1 reqpath:n/a Error Path:/solr/overseer Error:KeeperErrorCode = NodeExists for /solr/overseer
[junit4:junit4]   2> 584 T2267 oascc.SolrZkClient.makePath makePath: /live_nodes
[junit4:junit4]   2> 588 T2267 oasc.ZkController.createEphemeralLiveNode Register node as live in ZooKeeper:/live_nodes/127.0.0.1:51783_
[junit4:junit4]   2> 589 T2272 oazs.PrepRequestProcessor.pRequest Got user-level KeeperException when processing sessionid:0x13ccaa4febd0003 type:delete cxid:0x8 zxid:0x1c txntype:-1 reqpath:n/a Error Path:/solr/live_nodes/127.0.0.1:51783_ Error:KeeperErrorCode = NoNode for /solr/live_nodes/127.0.0.1:51783_
[junit4:junit4]   2> 590 T2267 oascc.SolrZkClient.makePath makePath: /live_nodes/127.0.0.1:51783_
[junit4:junit4]   2> 597 T2267 oascc.SolrZkClient.makePath makePath: /overseer_elect/election
[junit4:junit4]   2> 607 T2272 oazs.PrepRequestProcessor.pRequest Got user-level KeeperException when processing sessionid:0x13ccaa4febd0003 type:delete cxid:0x16 zxid:0x21 txntype:-1 reqpath:n/a Error Path:/solr/overseer_elect/leader Error:KeeperErrorCode = NoNode for /solr/overseer_elect/leader
[junit4:junit4]   2> 608 T2267 oascc.SolrZkClient.makePath makePath: /overseer_elect/leader
[junit4:junit4]   2> 614 T2267 oasc.Overseer.start Overseer (id=89168902637813763-127.0.0.1:51783_-n_0000000000) starting
[junit4:junit4]   2> 615 T2272 oazs.PrepRequestProcessor.pRequest Got user-level KeeperException when processing sessionid:0x13ccaa4febd0003 type:create cxid:0x1b zxid:0x23 txntype:-1 reqpath:n/a Error Path:/solr/overseer Error:KeeperErrorCode = NodeExists for /solr/overseer
[junit4:junit4]   2> 617 T2272 oazs.PrepRequestProcessor.pRequest Got user-level KeeperException when processing sessionid:0x13ccaa4febd0003 type:create cxid:0x1c zxid:0x24 txntype:-1 reqpath:n/a Error Path:/solr/overseer Error:KeeperErrorCode = NodeExists for /solr/overseer
[junit4:junit4]   2> 619 T2272 oazs.PrepRequestProcessor.pRequest Got user-level KeeperException when processing sessionid:0x13ccaa4febd0003 type:create cxid:0x1d zxid:0x25 txntype:-1 reqpath:n/a Error Path:/solr/overseer Error:KeeperErrorCode = NodeExists for /solr/overseer
[junit4:junit4]   2> 621 T2272 oazs.PrepRequestProcessor.pRequest Got user-level KeeperException when processing sessionid:0x13ccaa4febd0003 type:create cxid:0x1e zxid:0x26 txntype:-1 reqpath:n/a Error Path:/solr/overseer Error:KeeperErrorCode = NodeExists for /solr/overseer
[junit4:junit4]   2> 623 T2291 oasc.OverseerCollectionProcessor.run Process current queue of collection creations
[junit4:junit4]   2> 625 T2267 oascc.SolrZkClient.makePath makePath: /clusterstate.json
[junit4:junit4]   2> 630 T2267 oascc.ZkStateReader.createClusterStateWatchersAndUpdate Updating cluster state from ZooKeeper... 
[junit4:junit4]   2> 634 T2290 oasc.Overseer$ClusterStateUpdater.run Starting to work on the main queue
[junit4:junit4]   2> 640 T2292 oasc.CoreContainer.create Creating SolrCore 'collection1' using instanceDir: /Users/jenkins/jenkins-slave/workspace/Lucene-Solr-4.x-MacOSX/solr/build/solr-core/test/J0/./org.apache.solr.cloud.BasicDistributedZkTest-controljetty-1360609476525/collection1
[junit4:junit4]   2> 640 T2292 oasc.ZkController.createCollectionZkNode Check for collection zkNode:control_collection
[junit4:junit4]   2> 642 T2292 oasc.ZkController.createCollectionZkNode Collection zkNode exists
[junit4:junit4]   2> 642 T2292 oasc.ZkController.readConfigName Load collection config from:/collections/control_collection
[junit4:junit4]   2> 645 T2292 oasc.SolrResourceLoader.<init> new SolrResourceLoader for directory: '/Users/jenkins/jenkins-slave/workspace/Lucene-Solr-4.x-MacOSX/solr/build/solr-core/test/J0/./org.apache.solr.cloud.BasicDistributedZkTest-controljetty-1360609476525/collection1/'
[junit4:junit4]   2> 646 T2292 oasc.SolrResourceLoader.replaceClassLoader Adding 'file:/Users/jenkins/jenkins-slave/workspace/Lucene-Solr-4.x-MacOSX/solr/build/solr-core/test/J0/org.apache.solr.cloud.BasicDistributedZkTest-controljetty-1360609476525/collection1/lib/classes/' to classloader
[junit4:junit4]   2> 647 T2292 oasc.SolrResourceLoader.replaceClassLoader Adding 'file:/Users/jenkins/jenkins-slave/workspace/Lucene-Solr-4.x-MacOSX/solr/build/solr-core/test/J0/org.apache.solr.cloud.BasicDistributedZkTest-controljetty-1360609476525/collection1/lib/README' to classloader
[junit4:junit4]   2> 704 T2292 oasc.SolrConfig.<init> Using Lucene MatchVersion: LUCENE_42
[junit4:junit4]   2> 771 T2292 oasc.SolrConfig.<init> Loaded SolrConfig: solrconfig.xml
[junit4:junit4]   2> 773 T2292 oass.IndexSchema.readSchema Reading Solr Schema
[junit4:junit4]   2> 779 T2292 oass.IndexSchema.readSchema Schema name=test
[junit4:junit4]   2> 1363 T2292 oass.OpenExchangeRatesOrgProvider.init Initialized with rates=open-exchange-rates.json, refreshInterval=1440.
[junit4:junit4]   2> 1377 T2292 oass.IndexSchema.readSchema default search field in schema is text
[junit4:junit4]   2> 1380 T2292 oass.IndexSchema.readSchema unique key field: id
[junit4:junit4]   2> 1409 T2292 oass.FileExchangeRateProvider.reload Reloading exchange rates from file currency.xml
[junit4:junit4]   2> 1418 T2292 oass.FileExchangeRateProvider.reload Reloading exchange rates from file currency.xml
[junit4:junit4]   2> 1427 T2292 oass.OpenExchangeRatesOrgProvider.reload Reloading exchange rates from open-exchange-rates.json
[junit4:junit4]   2> 1430 T2292 oass.OpenExchangeRatesOrgProvider.reload Reloading exchange rates from open-exchange-rates.json
[junit4:junit4]   2> 1434 T2292 oasc.SolrCore.<init> [collection1] Opening new SolrCore at /Users/jenkins/jenkins-slave/workspace/Lucene-Solr-4.x-MacOSX/solr/build/solr-core/test/J0/./org.apache.solr.cloud.BasicDistributedZkTest-controljetty-1360609476525/collection1/, dataDir=./org.apache.solr.cloud.BasicDistributedZkTest-1360609476277/control/data/
[junit4:junit4]   2> 1434 T2292 oasc.JmxMonitoredMap.<init> JMX monitoring is enabled. Adding Solr mbeans to JMX Server: com.sun.jmx.mbeanserver.JmxMBeanServer@1dfc617e
[junit4:junit4]   2> 1435 T2292 oasc.SolrCore.initDirectoryFactory solr.StandardDirectoryFactory
[junit4:junit4]   2> 1436 T2292 oasc.CachingDirectoryFactory.get return new directory for /Users/jenkins/jenkins-slave/workspace/Lucene-Solr-4.x-MacOSX/solr/build/solr-core/test/J0/./org.apache.solr.cloud.BasicDistributedZkTest-1360609476277/control/data forceNew:false
[junit4:junit4]   2> 1437 T2292 oasc.CachingDirectoryFactory.close Releasing directory:/Users/jenkins/jenkins-slave/workspace/Lucene-Solr-4.x-MacOSX/solr/build/solr-core/test/J0/./org.apache.solr.cloud.BasicDistributedZkTest-1360609476277/control/data
[junit4:junit4]   2> 1438 T2292 oasc.SolrCore.getNewIndexDir New index directory detected: old=null new=./org.apache.solr.cloud.BasicDistributedZkTest-1360609476277/control/data/index/
[junit4:junit4]   2> 1438 T2292 oasc.SolrCore.initIndex WARNING [collection1] Solr index directory './org.apache.solr.cloud.BasicDistributedZkTest-1360609476277/control/data/index' doesn't exist. Creating new index...
[junit4:junit4]   2> 1440 T2292 oasc.CachingDirectoryFactory.get return new directory for /Users/jenkins/jenkins-slave/workspace/Lucene-Solr-4.x-MacOSX/solr/build/solr-core/test/J0/./org.apache.solr.cloud.BasicDistributedZkTest-1360609476277/control/data/index forceNew:false
[junit4:junit4]   2> 1444 T2292 oasc.SolrDeletionPolicy.onCommit SolrDeletionPolicy.onCommit: commits:num=1
[junit4:junit4]   2> 		commit{dir=RateLimitedDirectoryWrapper(org.apache.lucene.store.NIOFSDirectory@/Users/jenkins/jenkins-slave/workspace/Lucene-Solr-4.x-MacOSX/solr/build/solr-core/test/J0/org.apache.solr.cloud.BasicDistributedZkTest-1360609476277/control/data/index lockFactory=org.apache.lucene.store.NativeFSLockFactory@788697e5),segFN=segments_1,generation=1,filenames=[segments_1]
[junit4:junit4]   2> 1445 T2292 oasc.SolrDeletionPolicy.updateCommits newest commit = 1[segments_1]
[junit4:junit4]   2> 1445 T2292 oasc.CachingDirectoryFactory.close Releasing directory:/Users/jenkins/jenkins-slave/workspace/Lucene-Solr-4.x-MacOSX/solr/build/solr-core/test/J0/./org.apache.solr.cloud.BasicDistributedZkTest-1360609476277/control/data/index
[junit4:junit4]   2> 1446 T2292 oasc.SolrCore.initWriters created xml: solr.XMLResponseWriter
[junit4:junit4]   2> 1448 T2292 oasup.UpdateRequestProcessorChain.init inserting DistributedUpdateProcessorFactory into updateRequestProcessorChain "dedupe"
[junit4:junit4]   2> 1449 T2292 oasup.UpdateRequestProcessorChain.init inserting DistributedUpdateProcessorFactory into updateRequestProcessorChain "dedupe-allfields"
[junit4:junit4]   2> 1449 T2292 oasup.UpdateRequestProcessorChain.init inserting DistributedUpdateProcessorFactory into updateRequestProcessorChain "stored_sig"
[junit4:junit4]   2> 1449 T2292 oasup.UpdateRequestProcessorChain.init inserting DistributedUpdateProcessorFactory into updateRequestProcessorChain "uniq-fields"
[junit4:junit4]   2> 1450 T2292 oasup.UpdateRequestProcessorChain.init inserting DistributedUpdateProcessorFactory into updateRequestProcessorChain "distrib-dup-test-chain-implicit"
[junit4:junit4]   2> 1450 T2292 oasc.RequestHandlers.initHandlersFromConfig adding lazy requestHandler: solr.ReplicationHandler
[junit4:junit4]   2> 1451 T2292 oasc.RequestHandlers.initHandlersFromConfig created /replication: solr.ReplicationHandler
[junit4:junit4]   2> 1451 T2292 oasc.RequestHandlers.initHandlersFromConfig created standard: solr.StandardRequestHandler
[junit4:junit4]   2> 1452 T2292 oasc.RequestHandlers.initHandlersFromConfig created /get: solr.RealTimeGetHandler
[junit4:junit4]   2> 1453 T2292 oasc.RequestHandlers.initHandlersFromConfig created dismax: solr.SearchHandler
[junit4:junit4]   2> 1453 T2292 oasc.RequestHandlers.initHandlersFromConfig created mock: org.apache.solr.core.MockQuerySenderListenerReqHandler
[junit4:junit4]   2> 1454 T2292 oasc.RequestHandlers.initHandlersFromConfig created /admin/: org.apache.solr.handler.admin.AdminHandlers
[junit4:junit4]   2> 1455 T2292 oasc.RequestHandlers.initHandlersFromConfig created defaults: solr.StandardRequestHandler
[junit4:junit4]   2> 1455 T2292 oasc.RequestHandlers.initHandlersFromConfig adding lazy requestHandler: solr.StandardRequestHandler
[junit4:junit4]   2> 1456 T2292 oasc.RequestHandlers.initHandlersFromConfig created lazy: solr.StandardRequestHandler
[junit4:junit4]   2> 1456 T2292 oasc.RequestHandlers.initHandlersFromConfig created /update: solr.UpdateRequestHandler
[junit4:junit4]   2> 1457 T2292 oasc.RequestHandlers.initHandlersFromConfig created /terms: org.apache.solr.handler.component.SearchHandler
[junit4:junit4]   2> 1457 T2292 oasc.RequestHandlers.initHandlersFromConfig created spellCheckCompRH: org.apache.solr.handler.component.SearchHandler
[junit4:junit4]   2> 1458 T2292 oasc.RequestHandlers.initHandlersFromConfig created spellCheckCompRH_Direct: org.apache.solr.handler.component.SearchHandler
[junit4:junit4]   2> 1459 T2292 oasc.RequestHandlers.initHandlersFromConfig created spellCheckWithWordbreak: org.apache.solr.handler.component.SearchHandler
[junit4:junit4]   2> 1459 T2292 oasc.RequestHandlers.initHandlersFromConfig created spellCheckWithWordbreak_Direct: org.apache.solr.handler.component.SearchHandler
[junit4:junit4]   2> 1460 T2292 oasc.RequestHandlers.initHandlersFromConfig created spellCheckCompRH1: org.apache.solr.handler.component.SearchHandler
[junit4:junit4]   2> 1461 T2292 oasc.RequestHandlers.initHandlersFromConfig created mltrh: org.apache.solr.handler.component.SearchHandler
[junit4:junit4]   2> 1462 T2292 oasc.RequestHandlers.initHandlersFromConfig created tvrh: org.apache.solr.handler.component.SearchHandler
[junit4:junit4]   2> 1463 T2292 oasc.RequestHandlers.initHandlersFromConfig created /mlt: solr.MoreLikeThisHandler
[junit4:junit4]   2> 1464 T2292 oasc.RequestHandlers.initHandlersFromConfig created /debug/dump: solr.DumpRequestHandler
[junit4:junit4]   2> 1472 T2292 oashl.XMLLoader.init xsltCacheLifetimeSeconds=60
[junit4:junit4]   2> 1478 T2292 oasc.SolrCore.initDeprecatedSupport WARNING solrconfig.xml uses deprecated <admin/gettableFiles>, Please update your config to use the ShowFileRequestHandler.
[junit4:junit4]   2> 1481 T2292 oasc.SolrCore.initDeprecatedSupport WARNING adding ShowFileRequestHandler with hidden files: [SCHEMA.XML, OLD_SYNONYMS.TXT, STOPWORDS.TXT, PROTWORDS.TXT, OPEN-EXCHANGE-RATES.JSON, SYNONYMS.TXT, CURRENCY.XML, MAPPING-ISOLATIN1ACCENT.TXT]
[junit4:junit4]   2> 1484 T2292 oasc.CachingDirectoryFactory.close Releasing directory:/Users/jenkins/jenkins-slave/workspace/Lucene-Solr-4.x-MacOSX/solr/build/solr-core/test/J0/./org.apache.solr.cloud.BasicDistributedZkTest-1360609476277/control/data
[junit4:junit4]   2> 1485 T2292 oass.SolrIndexSearcher.<init> Opening Searcher@781a6bc6 main
[junit4:junit4]   2> 1487 T2292 oasu.CommitTracker.<init> Hard AutoCommit: disabled
[junit4:junit4]   2> 1487 T2292 oasu.CommitTracker.<init> Soft AutoCommit: disabled
[junit4:junit4]   2> 1488 T2292 oashc.SpellCheckComponent.inform Initializing spell checkers
[junit4:junit4]   2> 1494 T2292 oass.DirectSolrSpellChecker.init init: {name=direct,classname=DirectSolrSpellChecker,field=lowerfilt,minQueryLength=3}
[junit4:junit4]   2> 1527 T2293 oasc.SolrCore.registerSearcher [collection1] Registered new searcher Searcher@781a6bc6 main{StandardDirectoryReader(segments_1:1)}
[junit4:junit4]   2> 1534 T2292 oasc.ZkController.publish publishing core=collection1 state=down
[junit4:junit4]   2> 1534 T2292 oasc.ZkController.publish numShards not found on descriptor - reading it from system property
[junit4:junit4]   2> 1535 T2272 oazs.PrepRequestProcessor.pRequest Got user-level KeeperException when processing sessionid:0x13ccaa4febd0003 type:create cxid:0x51 zxid:0x29 txntype:-1 reqpath:n/a Error Path:/solr/overseer/queue Error:KeeperErrorCode = NoNode for /solr/overseer/queue
[junit4:junit4]   2> 2145 T2290 oascc.ZkStateReader.updateClusterState Updating cloud state from ZooKeeper... 
[junit4:junit4]   2> 2146 T2290 oasc.Overseer$ClusterStateUpdater.updateState Update state numShards=1 message={
[junit4:junit4]   2> 	  "operation":"state",
[junit4:junit4]   2> 	  "numShards":"1",
[junit4:junit4]   2> 	  "shard":null,
[junit4:junit4]   2> 	  "roles":null,
[junit4:junit4]   2> 	  "state":"down",
[junit4:junit4]   2> 	  "core":"collection1",
[junit4:junit4]   2> 	  "collection":"control_collection",
[junit4:junit4]   2> 	  "node_name":"127.0.0.1:51783_",
[junit4:junit4]   2> 	  "base_url":"http://127.0.0.1:51783"}
[junit4:junit4]   2> 2146 T2290 oasc.Overseer$ClusterStateUpdater.createCollection Create collection control_collection with numShards 1
[junit4:junit4]   2> 2146 T2290 oasc.Overseer$ClusterStateUpdater.updateState Assigning new node to shard shard=shard1
[junit4:junit4]   2> 2147 T2272 oazs.PrepRequestProcessor.pRequest Got user-level KeeperException when processing sessionid:0x13ccaa4febd0003 type:create cxid:0x59 zxid:0x2c txntype:-1 reqpath:n/a Error Path:/solr/overseer/queue-work Error:KeeperErrorCode = NoNode for /solr/overseer/queue-work
[junit4:junit4]   2> 2155 T2289 oascc.ZkStateReader$2.process A cluster state change: WatchedEvent state:SyncConnected type:NodeDataChanged path:/clusterstate.json, has occurred - updating... (live nodes size: 1)
[junit4:junit4]   2> 2541 T2292 oasc.CoreContainer.registerCore registering core: collection1
[junit4:junit4]   2> 2541 T2292 oasc.ZkController.register Register replica - core:collection1 address:http://127.0.0.1:51783 collection:control_collection shard:shard1
[junit4:junit4]   2> 2542 T2292 oascc.SolrZkClient.makePath makePath: /collections/control_collection/leader_elect/shard1/election
[junit4:junit4]   2> 2554 T2272 oazs.PrepRequestProcessor.pRequest Got user-level KeeperException when processing sessionid:0x13ccaa4febd0003 type:delete cxid:0x73 zxid:0x36 txntype:-1 reqpath:n/a Error Path:/solr/collections/control_collection/leaders Error:KeeperErrorCode = NoNode for /solr/collections/control_collection/leaders
[junit4:junit4]   2> 2555 T2292 oasc.ShardLeaderElectionContext.runLeaderProcess Running the leader process.
[junit4:junit4]   2> 2556 T2272 oazs.PrepRequestProcessor.pRequest Got user-level KeeperException when processing sessionid:0x13ccaa4febd0003 type:create cxid:0x74 zxid:0x37 txntype:-1 reqpath:n/a Error Path:/solr/overseer Error:KeeperErrorCode = NodeExists for /solr/overseer
[junit4:junit4]   2> 2560 T2292 oasc.ShardLeaderElectionContext.waitForReplicasToComeUp Enough replicas found to continue.
[junit4:junit4]   2> 2560 T2292 oasc.ShardLeaderElectionContext.runLeaderProcess I may be the new leader - try and sync
[junit4:junit4]   2> 2560 T2292 oasc.SyncStrategy.sync Sync replicas to http://127.0.0.1:51783/collection1/
[junit4:junit4]   2> 2560 T2292 oasc.SyncStrategy.syncReplicas Sync Success - now sync replicas to me
[junit4:junit4]   2> 2561 T2292 oasc.SyncStrategy.syncToMe http://127.0.0.1:51783/collection1/ has no replicas
[junit4:junit4]   2> 2561 T2292 oasc.ShardLeaderElectionContext.runLeaderProcess I am the new leader: http://127.0.0.1:51783/collection1/
[junit4:junit4]   2> 2561 T2292 oascc.SolrZkClient.makePath makePath: /collections/control_collection/leaders/shard1
[junit4:junit4]   2> 2569 T2272 oazs.PrepRequestProcessor.pRequest Got user-level KeeperException when processing sessionid:0x13ccaa4febd0003 type:create cxid:0x7e zxid:0x3b txntype:-1 reqpath:n/a Error Path:/solr/overseer Error:KeeperErrorCode = NodeExists for /solr/overseer
[junit4:junit4]   2> 3664 T2290 oascc.ZkStateReader.updateClusterState Updating cloud state from ZooKeeper... 
[junit4:junit4]   2> 3682 T2289 oascc.ZkStateReader$2.process A cluster state change: WatchedEvent state:SyncConnected type:NodeDataChanged path:/clusterstate.json, has occurred - updating... (live nodes size: 1)
[junit4:junit4]   2> 3725 T2292 oasc.ZkController.register We are http://127.0.0.1:51783/collection1/ and leader is http://127.0.0.1:51783/collection1/
[junit4:junit4]   2> 3725 T2292 oasc.ZkController.register No LogReplay needed for core=collection1 baseURL=http://127.0.0.1:51783
[junit4:junit4]   2> 3726 T2292 oasc.ZkController.checkRecovery I am the leader, no recovery necessary
[junit4:junit4]   2> 3726 T2292 oasc.ZkController.publish publishing core=collection1 state=active
[junit4:junit4]   2> 3726 T2292 oasc.ZkController.publish numShards not found on descriptor - reading it from system property
[junit4:junit4]   2> 3730 T2292 oascc.ZkStateReader.updateClusterState Updating cloud state from ZooKeeper... 
[junit4:junit4]   2> 3732 T2267 oass.SolrDispatchFilter.init user.dir=/Users/jenkins/jenkins-slave/workspace/Lucene-Solr-4.x-MacOSX/solr/build/solr-core/test/J0
[junit4:junit4]   2> 3733 T2267 oass.SolrDispatchFilter.init SolrDispatchFilter.init() done
[junit4:junit4]   2> 3733 T2267 oascsi.HttpClientUtil.createClient Creating new http client, config:maxConnections=128&maxConnectionsPerHost=32&followRedirects=false
[junit4:junit4]   2> 3740 T2267 oascsi.HttpClientUtil.createClient Creating new http client, config:
[junit4:junit4]   2> 3746 T2267 oaz.ZooKeeper.<init> Initiating client connection, connectString=127.0.0.1:51780/solr sessionTimeout=10000 watcher=org.apache.solr.common.cloud.ConnectionManager@45583476
[junit4:junit4]   2> 3748 T2267 oascc.ConnectionManager.waitForConnected Waiting for client to connect to ZooKeeper
[junit4:junit4]   2> 3749 T2294 oaz.ClientCnxn$SendThread.logStartConnect Opening socket connection to server localhost/127.0.0.1:51780. Will not attempt to authenticate using SASL (access denied ("javax.security.auth.AuthPermission" "getLoginConfiguration"))
[junit4:junit4]   2> 3750 T2294 oaz.ClientCnxn$SendThread.primeConnection Socket connection established to localhost/127.0.0.1:51780, initiating session
[junit4:junit4]   2> 3750 T2269 oazs.NIOServerCnxnFactory.run Accepted socket connection from /127.0.0.1:51786
[junit4:junit4]   2> 3751 T2269 oazs.ZooKeeperServer.processConnectRequest Client attempting to establish new session at /127.0.0.1:51786
[junit4:junit4]   2> 3753 T2271 oazs.ZooKeeperServer.finishSessionInit Established session 0x13ccaa4febd0004 with negotiated timeout 10000 for client /127.0.0.1:51786
[junit4:junit4]   2> 3753 T2294 oaz.ClientCnxn$SendThread.onConnected Session establishment complete on server localhost/127.0.0.1:51780, sessionid = 0x13ccaa4febd0004, negotiated timeout = 10000
[junit4:junit4]   2> 3753 T2295 oascc.ConnectionManager.process Watcher org.apache.solr.common.cloud.ConnectionManager@45583476 name:ZooKeeperConnection Watcher:127.0.0.1:51780/solr got event WatchedEvent state:SyncConnected type:None path:null path:null type:None
[junit4:junit4]   2> 3754 T2267 oascc.ConnectionManager.waitForConnected Client is connected to ZooKeeper
[junit4:junit4]   2> 3757 T2267 oascc.ZkStateReader.createClusterStateWatchersAndUpdate Updating cluster state from ZooKeeper... 
[junit4:junit4]   2> 3762 T2267 oasc.ChaosMonkey.monkeyLog monkey: init - expire sessions:true cause connection loss:true
[junit4:junit4]   2> 3963 T2267 oejs.Server.doStart jetty-8.1.8.v20121106
[junit4:junit4]   2> 3969 T2267 oejs.AbstractConnector.doStart Started SelectChannelConnector@127.0.0.1:51787
[junit4:junit4]   2> 3970 T2267 oass.SolrDispatchFilter.init SolrDispatchFilter.init()
[junit4:junit4]   2> 3970 T2267 oasc.SolrResourceLoader.locateSolrHome JNDI not configured for solr (NoInitialContextEx)
[junit4:junit4]   2> 3971 T2267 oasc.SolrResourceLoader.locateSolrHome using system property solr.solr.home: /Users/jenkins/jenkins-slave/workspace/Lucene-Solr-4.x-MacOSX/solr/build/solr-core/test/J0/./org.apache.solr.cloud.BasicDistributedZkTest-jetty1-1360609480030
[junit4:junit4]   2> 3971 T2267 oasc.CoreContainer$Initializer.initialize looking for solr.xml: /Users/jenkins/jenkins-slave/workspace/Lucene-Solr-4.x-MacOSX/solr/build/solr-core/test/J0/./org.apache.solr.cloud.BasicDistributedZkTest-jetty1-1360609480030/solr.xml
[junit4:junit4]   2> 3972 T2267 oasc.CoreContainer.<init> New CoreContainer 767736196
[junit4:junit4]   2> 3973 T2267 oasc.CoreContainer.load Loading CoreContainer using Solr Home: '/Users/jenkins/jenkins-slave/workspace/Lucene-Solr-4.x-MacOSX/solr/build/solr-core/test/J0/./org.apache.solr.cloud.BasicDistributedZkTest-jetty1-1360609480030/'
[junit4:junit4]   2> 3973 T2267 oasc.SolrResourceLoader.<init> new SolrResourceLoader for directory: '/Users/jenkins/jenkins-slave/workspace/Lucene-Solr-4.x-MacOSX/solr/build/solr-core/test/J0/./org.apache.solr.cloud.BasicDistributedZkTest-jetty1-1360609480030/'
[junit4:junit4]   2> 4017 T2267 oashc.HttpShardHandlerFactory.getParameter Setting socketTimeout to: 60000
[junit4:junit4]   2> 4018 T2267 oashc.HttpShardHandlerFactory.getParameter Setting urlScheme to: http://
[junit4:junit4]   2> 4018 T2267 oashc.HttpShardHandlerFactory.getParameter Setting connTimeout to: 15000
[junit4:junit4]   2> 4019 T2267 oashc.HttpShardHandlerFactory.getParameter Setting maxConnectionsPerHost to: 20
[junit4:junit4]   2> 4020 T2267 oashc.HttpShardHandlerFactory.getParameter Setting corePoolSize to: 0
[junit4:junit4]   2> 4020 T2267 oashc.HttpShardHandlerFactory.getParameter Setting maximumPoolSize to: 2147483647
[junit4:junit4]   2> 4021 T2267 oashc.HttpShardHandlerFactory.getParameter Setting maxThreadIdleTime to: 5
[junit4:junit4]   2> 4021 T2267 oashc.HttpShardHandlerFactory.getParameter Setting sizeOfQueue to: -1
[junit4:junit4]   2> 4022 T2267 oashc.HttpShardHandlerFactory.getParameter Setting fairnessPolicy to: false
[junit4:junit4]   2> 4022 T2267 oascsi.HttpClientUtil.createClient Creating new http client, config:maxConnectionsPerHost=20&maxConnections=10000&socketTimeout=60000&connTimeout=15000&retry=false
[junit4:junit4]   2> 4054 T2267 oasc.CoreContainer.load Registering Log Listener
[junit4:junit4]   2> 4075 T2267 oasc.CoreContainer.initZooKeeper Zookeeper client=127.0.0.1:51780/solr
[junit4:junit4]   2> 4076 T2267 oasc.ZkController.checkChrootPath zkHost includes chroot
[junit4:junit4]   2> 4077 T2267 oaz.ZooKeeper.<init> Initiating client connection, connectString=127.0.0.1:51780 sessionTimeout=60000 watcher=org.apache.solr.common.cloud.ConnectionManager@74f082f1
[junit4:junit4]   2> 4079 T2267 oascc.ConnectionManager.waitForConnected Waiting for client to connect to ZooKeeper
[junit4:junit4]   2> 4080 T2305 oaz.ClientCnxn$SendThread.logStartConnect Opening socket connection to server localhost/127.0.0.1:51780. Will not attempt to authenticate using SASL (access denied ("javax.security.auth.AuthPermission" "getLoginConfiguration"))
[junit4:junit4]   2> 4081 T2305 oaz.ClientCnxn$SendThread.primeConnection Socket connection established to localhost/127.0.0.1:51780, initiating session
[junit4:junit4]   2> 4082 T2269 oazs.NIOServerCnxnFactory.run Accepted socket connection from /127.0.0.1:51788
[junit4:junit4]   2> 4082 T2269 oazs.ZooKeeperServer.processConnectRequest Client attempting to establish new session at /127.0.0.1:51788
[junit4:junit4]   2> 4084 T2271 oazs.ZooKeeperServer.finishSessionInit Established session 0x13ccaa4febd0005 with negotiated timeout 20000 for client /127.0.0.1:51788
[junit4:junit4]   2> 4084 T2305 oaz.ClientCnxn$SendThread.onConnected Session establishment complete on server localhost/127.0.0.1:51780, sessionid = 0x13ccaa4febd0005, negotiated timeout = 20000
[junit4:junit4]   2> 4084 T2306 oascc.ConnectionManager.process Watcher org.apache.solr.common.cloud.ConnectionManager@74f082f1 name:ZooKeeperConnection Watcher:127.0.0.1:51780 got event WatchedEvent state:SyncConnected type:None path:null path:null type:None
[junit4:junit4]   2> 4085 T2267 oascc.ConnectionManager.waitForConnected Client is connected to ZooKeeper
[junit4:junit4]   2> 4088 T2272 oazs.PrepRequestProcessor.pRequest2Txn Processed session termination for sessionid: 0x13ccaa4febd0005
[junit4:junit4]   2> 4089 T2269 oazs.NIOServerCnxn.closeSock Closed socket connection for client /127.0.0.1:51788 which had sessionid 0x13ccaa4febd0005
[junit4:junit4]   2> 4090 T2306 oaz.ClientCnxn$EventThread.run EventThread shut down
[junit4:junit4]   2> 4089 T2267 oaz.ZooKeeper.close Session: 0x13ccaa4febd0005 closed
[junit4:junit4]   2> 4091 T2267 oascsi.HttpClientUtil.createClient Creating new http client, config:maxConnections=500&maxConnectionsPerHost=16&socketTimeout=60000&connTimeout=15000
[junit4:junit4]   2> 4098 T2267 oaz.ZooKeeper.<init> Initiating client connection, connectString=127.0.0.1:51780/solr sessionTimeout=30000 watcher=org.apache.solr.common.cloud.ConnectionManager@20ebbaa
[junit4:junit4]   2> 4100 T2307 oaz.ClientCnxn$SendThread.logStartConnect Opening socket connection to server localhost/127.0.0.1:51780. Will not attempt to authenticate using SASL (access denied ("javax.security.auth.AuthPermission" "getLoginConfiguration"))
[junit4:junit4]   2> 4101 T2307 oaz.ClientCnxn$SendThread.primeConnection Socket connection established to localhost/127.0.0.1:51780, initiating session
[junit4:junit4]   2> 4102 T2269 oazs.NIOServerCnxnFactory.run Accepted socket connection from /127.0.0.1:51789
[junit4:junit4]   2> 4103 T2269 oazs.ZooKeeperServer.processConnectRequest Client attempting to establish new session at /127.0.0.1:51789
[junit4:junit4]   2> 4103 T2267 oascc.ConnectionManager.waitForConnected Waiting for client to connect to ZooKeeper
[junit4:junit4]   2> 4105 T2271 oazs.ZooKeeperServer.finishSessionInit Established session 0x13ccaa4febd0006 with negotiated timeout 20000 for client /127.0.0.1:51789
[junit4:junit4]   2> 4106 T2307 oaz.ClientCnxn$SendThread.onConnected Session establishment complete on server localhost/127.0.0.1:51780, sessionid = 0x13ccaa4febd0006, negotiated timeout = 20000
[junit4:junit4]   2> 4106 T2308 oascc.ConnectionManager.process Watcher org.apache.solr.common.cloud.ConnectionManager@20ebbaa name:ZooKeeperConnection Watcher:127.0.0.1:51780/solr got event WatchedEvent state:SyncConnected type:None path:null path:null type:None
[junit4:junit4]   2> 4107 T2267 oascc.ConnectionManager.waitForConnected Client is connected to ZooKeeper
[junit4:junit4]   2> 4109 T2272 oazs.PrepRequestProcessor.pRequest Got user-level KeeperException when processing sessionid:0x13ccaa4febd0006 type:create cxid:0x1 zxid:0x49 txntype:-1 reqpath:n/a Error Path:/solr/overseer Error:KeeperErrorCode = NodeExists for /solr/overseer
[junit4:junit4]   2> 4111 T2272 oazs.PrepRequestProcessor.pRequest Got user-level KeeperException when processing sessionid:0x13ccaa4febd0006 type:create cxid:0x2 zxid:0x4a txntype:-1 reqpath:n/a Error Path:/solr/overseer Error:KeeperErrorCode = NodeExists for /solr/overseer
[junit4:junit4]   2> 4114 T2267 oascc.ZkStateReader.createClusterStateWatchersAndUpdate Updating cluster state from ZooKeeper... 
[junit4:junit4]   2> 4120 T2267 oasc.ZkController.createEphemeralLiveNode Register node as live in ZooKeeper:/live_nodes/127.0.0.1:51787_
[junit4:junit4]   2> 4122 T2272 oazs.PrepRequestProcessor.pRequest Got user-level KeeperException when processing sessionid:0x13ccaa4febd0006 type:delete cxid:0x9 zxid:0x4b txntype:-1 reqpath:n/a Error Path:/solr/live_nodes/127.0.0.1:51787_ Error:KeeperErrorCode = NoNode for /solr/live_nodes/127.0.0.1:51787_
[junit4:junit4]   2> 4123 T2267 oascc.SolrZkClient.makePath makePath: /live_nodes/127.0.0.1:51787_
[junit4:junit4]   2> 4128 T2289 oascc.ZkStateReader$2.process A cluster state change: WatchedEvent state:SyncConnected type:NodeChildrenChanged path:/live_nodes, has occurred - updating... (live nodes size: 1)
[junit4:junit4]   2> 4132 T2308 oascc.ZkStateReader$3.process Updating live nodes... (2)
[junit4:junit4]   2> 4137 T2289 oascc.ZkStateReader$3.process Updating live nodes... (2)
[junit4:junit4]   2> 4148 T2295 oascc.ZkStateReader$3.process Updating live nodes... (2)
[junit4:junit4]   2> 4148 T2309 oasc.CoreContainer.create Creating SolrCore 'collection1' using instanceDir: /Users/jenkins/jenkins-slave/workspace/Lucene-Solr-4.x-MacOSX/solr/build/solr-core/test/J0/./org.apache.solr.cloud.BasicDistributedZkTest-jetty1-1360609480030/collection1
[junit4:junit4]   2> 4148 T2309 oasc.ZkController.createCollectionZkNode Check for collection zkNode:collection1
[junit4:junit4]   2> 4150 T2309 oasc.ZkController.createCollectionZkNode Collection zkNode exists
[junit4:junit4]   2> 4150 T2309 oasc.ZkController.readConfigName Load collection config from:/collections/collection1
[junit4:junit4]   2> 4152 T2309 oasc.SolrResourceLoader.<init> new SolrResourceLoader for directory: '/Users/jenkins/jenkins-slave/workspace/Lucene-Solr-4.x-MacOSX/solr/build/solr-core/test/J0/./org.apache.solr.cloud.BasicDistributedZkTest-jetty1-1360609480030/collection1/'
[junit4:junit4]   2> 4153 T2309 oasc.SolrResourceLoader.replaceClassLoader Adding 'file:/Users/jenkins/jenkins-slave/workspace/Lucene-Solr-4.x-MacOSX/solr/build/solr-core/test/J0/org.apache.solr.cloud.BasicDistributedZkTest-jetty1-1360609480030/collection1/lib/classes/' to classloader
[junit4:junit4]   2> 4153 T2309 oasc.SolrResourceLoader.replaceClassLoader Adding 'file:/Users/jenkins/jenkins-slave/workspace/Lucene-Solr-4.x-MacOSX/solr/build/solr-core/test/J0/org.apache.solr.cloud.BasicDistributedZkTest-jetty1-1360609480030/collection1/lib/README' to classloader
[junit4:junit4]   2> 4201 T2309 oasc.SolrConfig.<init> Using Lucene MatchVersion: LUCENE_42
[junit4:junit4]   2> 4271 T2309 oasc.SolrConfig.<init> Loaded SolrConfig: solrconfig.xml
[junit4:junit4]   2> 4273 T2309 oass.IndexSchema.readSchema Reading Solr Schema
[junit4:junit4]   2> 4281 T2309 oass.IndexSchema.readSchema Schema name=test
[junit4:junit4]   2> 4822 T2309 oass.OpenExchangeRatesOrgProvider.init Initialized with rates=open-exchange-rates.json, refreshInterval=1440.
[junit4:junit4]   2> 4831 T2309 oass.IndexSchema.readSchema default search field in schema is text
[junit4:junit4]   2> 4834 T2309 oass.IndexSchema.readSchema unique key field: id
[junit4:junit4]   2> 4859 T2309 oass.FileExchangeRateProvider.reload Reloading exchange rates from file currency.xml
[junit4:junit4]   2> 4864 T2309 oass.FileExchangeRateProvider.reload Reloading exchange rates from file currency.xml
[junit4:junit4]   2> 4870 T2309 oass.OpenExchangeRatesOrgProvider.reload Reloading exchange rates from open-exchange-rates.json
[junit4:junit4]   2> 4872 T2309 oass.OpenExchangeRatesOrgProvider.reload Reloading exchange rates from open-exchange-rates.json
[junit4:junit4]   2> 4874 T2309 oasc.SolrCore.<init> [collection1] Opening new SolrCore at /Users/jenkins/jenkins-slave/workspace/Lucene-Solr-4.x-MacOSX/solr/build/solr-core/test/J0/./org.apache.solr.cloud.BasicDistributedZkTest-jetty1-1360609480030/collection1/, dataDir=./org.apache.solr.cloud.BasicDistributedZkTest-1360609476277/jetty1/
[junit4:junit4]   2> 4875 T2309 oasc.JmxMonitoredMap.<init> JMX monitoring is enabled. Adding Solr mbeans to JMX Server: com.sun.jmx.mbeanserver.JmxMBeanServer@1dfc617e
[junit4:junit4]   2> 4875 T2309 oasc.SolrCore.initDirectoryFactory solr.StandardDirectoryFactory
[junit4:junit4]   2> 4876 T2309 oasc.CachingDirectoryFactory.get return new directory for /Users/jenkins/jenkins-slave/workspace/Lucene-Solr-4.x-MacOSX/solr/build/solr-core/test/J0/./org.apache.solr.cloud.BasicDistributedZkTest-1360609476277/jetty1 forceNew:false
[junit4:junit4]   2> 4877 T2309 oasc.CachingDirectoryFactory.close Releasing directory:/Users/jenkins/jenkins-slave/workspace/Lucene-Solr-4.x-MacOSX/solr/build/solr-core/test/J0/./org.apache.solr.cloud.BasicDistributedZkTest-1360609476277/jetty1
[junit4:junit4]   2> 4877 T2309 oasc.SolrCore.getNewIndexDir New index directory detected: old=null new=./org.apache.solr.cloud.BasicDistributedZkTest-1360609476277/jetty1/index/
[junit4:junit4]   2> 4877 T2309 oasc.SolrCore.initIndex WARNING [collection1] Solr index directory './org.apache.solr.cloud.BasicDistributedZkTest-1360609476277/jetty1/index' doesn't exist. Creating new index...
[junit4:junit4]   2> 4879 T2309 oasc.CachingDirectoryFactory.get return new directory for /Users/jenkins/jenkins-slave/workspace/Lucene-Solr-4.x-MacOSX/solr/build/solr-core/test/J0/./org.apache.solr.cloud.BasicDistributedZkTest-1360609476277/jetty1/index forceNew:false
[junit4:junit4]   2> 4883 T2309 oasc.SolrDeletionPolicy.onCommit SolrDeletionPolicy.onCommit: commits:num=1
[junit4:junit4]   2> 		commit{dir=RateLimitedDirectoryWrapper(org.apache.lucene.store.NIOFSDirectory@/Users/jenkins/jenkins-slave/workspace/Lucene-Solr-4.x-MacOSX/solr/build/solr-core/test/J0/org.apache.solr.cloud.BasicDistributedZkTest-1360609476277/jetty1/index lockFactory=org.apache.lucene.store.NativeFSLockFactory@49548fe8),segFN=segments_1,generation=1,filenames=[segments_1]
[junit4:junit4]   2> 4884 T2309 oasc.SolrDeletionPolicy.updateCommits newest commit = 1[segments_1]
[junit4:junit4]   2> 4884 T2309 oasc.CachingDirectoryFactory.close Releasing directory:/Users/jenkins/jenkins-slave/workspace/Lucene-Solr-4.x-MacOSX/solr/build/solr-core/test/J0/./org.apache.solr.cloud.BasicDistributedZkTest-1360609476277/jetty1/index
[junit4:junit4]   2> 4885 T2309 oasc.SolrCore.initWriters created xml: solr.XMLResponseWriter
[junit4:junit4]   2> 4888 T2309 oasup.UpdateRequestProcessorChain.init inserting DistributedUpdateProcessorFactory into updateRequestProcessorChain "dedupe"
[junit4:junit4]   2> 4888 T2309 oasup.UpdateRequestProcessorChain.init inserting DistributedUpdateProcessorFactory into updateRequestProcessorChain "dedupe-allfields"
[junit4:junit4]   2> 4889 T2309 oasup.UpdateRequestProcessorChain.init inserting DistributedUpdateProcessorFactory into updateRequestProcessorChain "stored_sig"
[junit4:junit4]   2> 4889 T2309 oasup.UpdateRequestProcessorChain.init inserting DistributedUpdateProcessorFactory into updateRequestProcessorChain "uniq-fields"
[junit4:junit4]   2> 4890 T2309 oasup.UpdateRequestProcessorChain.init inserting DistributedUpdateProcessorFactory into updateRequestProcessorChain "distrib-dup-test-chain-implicit"
[junit4:junit4]   2> 4890 T2309 oasc.RequestHandlers.initHandlersFromConfig adding lazy requestHandler: solr.ReplicationHandler
[junit4:junit4]   2> 4891 T2309 oasc.RequestHandlers.initHandlersFromConfig created /replication: solr.ReplicationHandler
[junit4:junit4]   2> 4892 T2309 oasc.RequestHandlers.initHandlersFromConfig created standard: solr.StandardRequestHandler
[junit4:junit4]   2> 4892 T2309 oasc.RequestHandlers.initHandlersFromConfig created /get: solr.RealTimeGetHandler
[junit4:junit4]   2> 4893 T2309 oasc.RequestHandlers.initHandlersFromConfig created dismax: solr.SearchHandler
[junit4:junit4]   2> 4893 T2309 oasc.RequestHandlers.initHandlersFromConfig created mock: org.apache.solr.core.MockQuerySenderListenerReqHandler
[junit4:junit4]   2> 4894 T2309 oasc.RequestHandlers.initHandlersFromConfig created /admin/: org.apache.solr.handler.admin.AdminHandlers
[junit4:junit4]   2> 4894 T2309 oasc.RequestHandlers.initHandlersFromConfig created defaults: solr.StandardRequestHandler
[junit4:junit4]   2> 4895 T2309 oasc.RequestHandlers.initHandlersFromConfig adding lazy requestHandler: solr.StandardRequestHandler
[junit4:junit4]   2> 4895 T2309 oasc.RequestHandlers.initHandlersFromConfig created lazy: solr.StandardRequestHandler
[junit4:junit4]   2> 4896 T2309 oasc.RequestHandlers.initHandlersFromConfig created /update: solr.UpdateRequestHandler
[junit4:junit4]   2> 4896 T2309 oasc.RequestHandlers.initHandlersFromConfig created /terms: org.apache.solr.handler.component.SearchHandler
[junit4:junit4]   2> 4897 T2309 oasc.RequestHandlers.initHandlersFromConfig created spellCheckCompRH: org.apache.solr.handler.component.SearchHandler
[junit4:junit4]   2> 4898 T2309 oasc.RequestHandlers.initHandlersFromConfig created spellCheckCompRH_Direct: org.apache.solr.handler.component.SearchHandler
[junit4:junit4]   2> 4898 T2309 oasc.RequestHandlers.initHandlersFromConfig created spellCheckWithWordbreak: org.apache.solr.handler.component.SearchHandler
[junit4:junit4]   2> 4899 T2309 oasc.RequestHandlers.initHandlersFromConfig created spellCheckWithWordbreak_Direct: org.apache.solr.handler.component.SearchHandler
[junit4:junit4]   2> 4900 T2309 oasc.RequestHandlers.initHandlersFromConfig created spellCheckCompRH1: org.apache.solr.handler.component.SearchHandler
[junit4:junit4]   2> 4900 T2309 oasc.RequestHandlers.initHandlersFromConfig created mltrh: org.apache.solr.handler.component.SearchHandler
[junit4:junit4]   2> 4901 T2309 oasc.RequestHandlers.initHandlersFromConfig created tvrh: org.apache.solr.handler.component.SearchHandler
[junit4:junit4]   2> 4902 T2309 oasc.RequestHandlers.initHandlersFromConfig created /mlt: solr.MoreLikeThisHandler
[junit4:junit4]   2> 4902 T2309 oasc.RequestHandlers.initHandlersFromConfig created /debug/dump: solr.DumpRequestHandler
[junit4:junit4]   2> 4909 T2309 oashl.XMLLoader.init xsltCacheLifetimeSeconds=60
[junit4:junit4]   2> 4912 T2309 oasc.SolrCore.initDeprecatedSupport WARNING solrconfig.xml uses deprecated <admin/gettableFiles>, Please update your config to use the ShowFileRequestHandler.
[junit4:junit4]   2> 4913 T2309 oasc.SolrCore.initDeprecatedSupport WARNING adding ShowFileRequestHandler with hidden files: [SCHEMA.XML, OLD_SYNONYMS.TXT, STOPWORDS.TXT, PROTWORDS.TXT, OPEN-EXCHANGE-RATES.JSON, SYNONYMS.TXT, CURRENCY.XML, MAPPING-ISOLATIN1ACCENT.TXT]
[junit4:junit4]   2> 4916 T2309 oasc.CachingDirectoryFactory.close Releasing directory:/Users/jenkins/jenkins-slave/workspace/Lucene-Solr-4.x-MacOSX/solr/build/solr-core/test/J0/./org.apache.solr.cloud.BasicDistributedZkTest-1360609476277/jetty1
[junit4:junit4]   2> 4917 T2309 oass.SolrIndexSearcher.<init> Opening Searcher@7f22789f main
[junit4:junit4]   2> 4919 T2309 oasu.CommitTracker.<init> Hard AutoCommit: disabled
[junit4:junit4]   2> 4919 T2309 oasu.CommitTracker.<init> Soft AutoCommit: disabled
[junit4:junit4]   2> 4919 T2309 oashc.SpellCheckComponent.inform Initializing spell checkers
[junit4:junit4]   2> 4925 T2309 oass.DirectSolrSpellChecker.init init: {name=direct,classname=DirectSolrSpellChecker,field=lowerfilt,minQueryLength=3}
[junit4:junit4]   2> 4956 T2310 oasc.SolrCore.registerSearcher [collection1] Registered new searcher Searcher@7f22789f main{StandardDirectoryReader(segments_1:1)}
[junit4:junit4]   2> 4963 T2309 oasc.ZkController.publish publishing core=collection1 state=down
[junit4:junit4]   2> 4963 T2309 oasc.ZkController.publish numShards not found on descriptor - reading it from system property
[junit4:junit4]   2> 5195 T2290 oascc.ZkStateReader.updateClusterState Updating cloud state from ZooKeeper... 
[junit4:junit4]   2> 5196 T2290 oasc.Overseer$ClusterStateUpdater.updateState Update state numShards=1 message={
[junit4:junit4]   2> 	  "operation":"state",
[junit4:junit4]   2> 	  "numShards":"1",
[junit4:junit4]   2> 	  "shard":"shard1",
[junit4:junit4]   2> 	  "roles":null,
[junit4:junit4]   2> 	  "state":"active",
[junit4:junit4]   2> 	  "core":"collection1",
[junit4:junit4]   2> 	  "collection":"control_collection",
[junit4:junit4]   2> 	  "node_name":"127.0.0.1:51783_",
[junit4:junit4]   2> 	  "base_url":"http://127.0.0.1:51783"}
[junit4:junit4]   2> 5203 T2290 oasc.Overseer$ClusterStateUpdater.updateState Update state numShards=2 message={
[junit4:junit4]   2> 	  "operation":"state",
[junit4:junit4]   2> 	  "numShards":"2",
[junit4:junit4]   2> 	  "shard":null,
[junit4:junit4]   2> 	  "roles":null,
[junit4:junit4]   2> 	  "state":"down",
[junit4:junit4]   2> 	  "core":"collection1",
[junit4:junit4]   2> 	  "collection":"collection1",
[junit4:junit4]   2> 	  "node_name":"127.0.0.1:51787_",
[junit4:junit4]   2> 	  "base_url":"http://127.0.0.1:51787"}
[junit4:junit4]   2> 5203 T2290 oasc.Overseer$ClusterStateUpdater.createCollection Create collection collection1 with numShards 2
[junit4:junit4]   2> 5203 T2290 oasc.Overseer$ClusterStateUpdater.updateState Assigning new node to shard shard=shard1
[junit4:junit4]   2> 5210 T2295 oascc.ZkStateReader$2.process A cluster state change: WatchedEvent state:SyncConnected type:NodeDataChanged path:/clusterstate.json, has occurred - updating... (live nodes size: 2)
[junit4:junit4]   2> 5210 T2289 oascc.ZkStateReader$2.process A cluster state change: WatchedEvent state:SyncConnected type:NodeDataChanged path:/clusterstate.json, has occurred - updating... (live nodes size: 2)
[junit4:junit4]   2> 5210 T2308 oascc.ZkStateReader$2.process A cluster state change: WatchedEvent state:SyncConnected type:NodeDataChanged path:/clusterstate.json, has occurred - updating... (live nodes size: 2)
[junit4:junit4]   2> 5967 T2309 oasc.CoreContainer.registerCore registering core: collection1
[junit4:junit4]   2> 5967 T2309 oasc.ZkController.register Register replica - core:collection1 address:http://127.0.0.1:51787 collection:collection1 shard:shard1
[junit4:junit4]   2> 5968 T2309 oascc.SolrZkClient.makePath makePath: /collections/collection1/leader_elect/shard1/election
[junit4:junit4]   2> 5980 T2272 oazs.PrepRequestProcessor.pRequest Got user-level KeeperException when processing sessionid:0x13ccaa4febd0006 type:delete cxid:0x45 zxid:0x5a txntype:-1 reqpath:n/a Error Path:/solr/collections/collection1/leaders Error:KeeperErrorCode = NoNode for /solr/collections/collection1/leaders
[junit4:junit4]   2> 5981 T2309 oasc.ShardLeaderElectionContext.runLeaderProcess Running the leader process.
[junit4:junit4]   2> 5981 T2272 oazs.PrepRequestProcessor.pRequest Got user-level KeeperException when processing sessionid:0x13ccaa4febd0006 type:create cxid:0x46 zxid:0x5b txntype:-1 reqpath:n/a Error Path:/solr/overseer Error:KeeperErrorCode = NodeExists for /solr/overseer
[junit4:junit4]   2> 5984 T2309 oasc.ShardLeaderElectionContext.waitForReplicasToComeUp Enough replicas found to continue.
[junit4:junit4]   2> 5984 T2309 oasc.ShardLeaderElectionContext.runLeaderProcess I may be the new leader - try and sync
[junit4:junit4]   2> 5985 T2309 oasc.SyncStrategy.sync Sync replicas to http://127.0.0.1:51787/collection1/
[junit4:junit4]   2> 5985 T2309 oasc.SyncStrategy.syncReplicas Sync Success - now sync replicas to me
[junit4:junit4]   2> 5985 T2309 oasc.SyncStrategy.syncToMe http://127.0.0.1:51787/collection1/ has no replicas
[junit4:junit4]   2> 5985 T2309 oasc.ShardLeaderElectionContext.runLeaderProcess I am the new leader: http://127.0.0.1:51787/collection1/
[junit4:junit4]   2> 5986 T2309 oascc.SolrZkClient.makePath makePath: /collections/collection1/leaders/shard1
[junit4:junit4]   2> 5993 T2272 oazs.PrepRequestProcessor.pRequest Got user-level KeeperException when processing sessionid:0x13ccaa4febd0006 type:create cxid:0x50 zxid:0x5f txntype:-1 reqpath:n/a Error Path:/solr/overseer Error:KeeperErrorCode = NodeExists for /solr/overseer
[junit4:junit4]   2> 6724 T2290 oascc.ZkStateReader.updateClusterState Updating cloud state from ZooKeeper... 
[junit4:junit4]   2> 6741 T2295 oascc.ZkStateReader$2.process A cluster state change: WatchedEvent state:SyncConnected type:NodeDataChanged path:/clusterstate.json, has occurred - updating... (live nodes size: 2)
[junit4:junit4]   2> 6741 T2289 oascc.ZkStateReader$2.process A cluster state change: WatchedEvent state:SyncConnected type:NodeDataChanged path:/clusterstate.json, has occurred - updating... (live nodes size: 2)
[junit4:junit4]   2> 6741 T2308 oascc.ZkStateReader$2.process A cluster state change: WatchedEvent state:SyncConnected type:NodeDataChanged path:/clusterstate.json, has occurred - updating... (live nodes size: 2)
[junit4:junit4]   2> 6786 T2309 oasc.ZkController.register We are http://127.0.0.1:51787/collection1/ and leader is http://127.0.0.1:51787/collection1/
[junit4:junit4]   2> 6787 T2309 oasc.ZkController.register No LogReplay needed for core=collection1 baseURL=http://127.0.0.1:51787
[junit4:junit4]   2> 6787 T2309 oasc.ZkController.checkRecovery I am the leader, no recovery necessary
[junit4:junit4]   2> 6787 T2309 oasc.ZkController.publish publishing core=collection1 state=active
[junit4:junit4]   2> 6787 T2309 oasc.ZkController.publish numShards not found on descriptor - reading it from system property
[junit4:junit4]   2> 6790 T2309 oascc.ZkStateReader.updateClusterState Updating cloud state from ZooKeeper... 
[junit4:junit4]   2> 6792 T2267 oass.SolrDispatchFilter.init user.dir=/Users/jenkins/jenkins-slave/workspace/Lucene-Solr-4.x-MacOSX/solr/build/solr-core/test/J0
[junit4:junit4]   2> 6792 T2267 oass.SolrDispatchFilter.init SolrDispatchFilter.init() done
[junit4:junit4]   2> 6793 T2267 oascsi.HttpClientUtil.createClient Creating new http client, config:maxConnections=128&maxConnectionsPerHost=32&followRedirects=false
[junit4:junit4]   2> 6982 T2267 oejs.Server.doStart jetty-8.1.8.v20121106
[junit4:junit4]   2> 6988 T2267 oejs.AbstractConnector.doStart Started SelectChannelConnector@127.0.0.1:51790
[junit4:junit4]   2> 6989 T2267 oass.SolrDispatchFilter.init SolrDispatchFilter.init()
[junit4:junit4]   2> 6990 T2267 oasc.SolrResourceLoader.locateSolrHome JNDI not configured for solr (NoInitialContextEx)
[junit4:junit4]   2> 6991 T2267 oasc.SolrResourceLoader.locateSolrHome using system property solr.solr.home: /Users/jenkins/jenkins-slave/workspace/Lucene-Solr-4.x-MacOSX/solr/build/solr-core/test/J0/./org.apache.solr.cloud.BasicDistributedZkTest-jetty2-1360609483066
[junit4:junit4]   2> 6992 T2267 oasc.CoreContainer$Initializer.initialize looking for solr.xml: /Users/jenkins/jenkins-slave/workspace/Lucene-Solr-4.x-MacOSX/solr/build/solr-core/test/J0/./org.apache.solr.cloud.BasicDistributedZkTest-jetty2-1360609483066/solr.xml
[junit4:junit4]   2> 6993 T2267 oasc.CoreContainer.<init> New CoreContainer 516747976
[junit4:junit4]   2> 6994 T2267 oasc.CoreContainer.load Loading CoreContainer using Solr Home: '/Users/jenkins/jenkins-slave/workspace/Lucene-Solr-4.x-MacOSX/solr/build/solr-core/test/J0/./org.apache.solr.cloud.BasicDistributedZkTest-jetty2-1360609483066/'
[junit4:junit4]   2> 6994 T2267 oasc.SolrResourceLoader.<init> new SolrResourceLoader for directory: '/Users/jenkins/jenkins-slave/workspace/Lucene-Solr-4.x-MacOSX/solr/build/solr-core/test/J0/./org.apache.solr.cloud.BasicDistributedZkTest-jetty2-1360609483066/'
[junit4:junit4]   2> 7044 T2267 oashc.HttpShardHandlerFactory.getParameter Setting socketTimeout to: 60000
[junit4:junit4]   2> 7045 T2267 oashc.HttpShardHandlerFactory.getParameter Setting urlScheme to: http://
[junit4:junit4]   2> 7046 T2267 oashc.HttpShardHandlerFactory.getParameter Setting connTimeout to: 15000
[junit4:junit4]   2> 7046 T2267 oashc.HttpShardHandlerFactory.getParameter Setting maxConnectionsPerHost to: 20
[junit4:junit4]   2> 7047 T2267 oashc.HttpShardHandlerFactory.getParameter Setting corePoolSize to: 0
[junit4:junit4]   2> 7047 T2267 oashc.HttpShardHandlerFactory.getParameter Setting maximumPoolSize to: 2147483647
[junit4:junit4]   2> 7047 T2267 oashc.HttpShardHandlerFactory.getParameter Setting maxThreadIdleTime to: 5
[junit4:junit4]   2> 7048 T2267 oashc.HttpShardHandlerFactory.getParameter Setting sizeOfQueue to: -1
[junit4:junit4]   2> 7048 T2267 oashc.HttpShardHandlerFactory.getParameter Setting fairnessPolicy to: false
[junit4:junit4]   2> 7049 T2267 oascsi.HttpClientUtil.createClient Creating new http client, config:maxConnectionsPerHost=20&maxConnections=10000&socketTimeout=60000&connTimeout=15000&retry=false
[junit4:junit4]   2> 7062 T2267 oasc.CoreContainer.load Registering Log Listener
[junit4:junit4]   2> 7083 T2267 oasc.CoreContainer.initZooKeeper Zookeeper client=127.0.0.1:51780/solr
[junit4:junit4]   2> 7084 T2267 oasc.ZkController.checkChrootPath zkHost includes chroot
[junit4:junit4]   2> 7085 T2267 oaz.ZooKeeper.<init> Initiating client connection, connectString=127.0.0.1:51780 sessionTimeout=60000 watcher=org.apache.solr.common.cloud.ConnectionManager@3f45b52d
[junit4:junit4]   2> 7086 T2267 oascc.ConnectionManager.waitForConnected Waiting for client to connect to ZooKeeper
[junit4:junit4]   2> 7086 T2320 oaz.ClientCnxn$SendThread.logStartConnect Opening socket connection to server localhost/127.0.0.1:51780. Will not attempt to authenticate using SASL (access denied ("javax.security.auth.AuthPermission" "getLoginConfiguration"))
[junit4:junit4]   2> 7088 T2320 oaz.ClientCnxn$SendThread.primeConnection Socket connection established to localhost/127.0.0.1:51780, initiating session
[junit4:junit4]   2> 7088 T2269 oazs.NIOServerCnxnFactory.run Accepted socket connection from /127.0.0.1:51791
[junit4:junit4]   2> 7089 T2269 oazs.ZooKeeperServer.processConnectRequest Client attempting to establish new session at /127.0.0.1:51791
[junit4:junit4]   2> 7090 T2271 oazs.ZooKeeperServer.finishSessionInit Established session 0x13ccaa4febd0007 with negotiated timeout 20000 for client /127.0.0.1:51791
[junit4:junit4]   2> 7090 T2320 oaz.ClientCnxn$SendThread.onConnected Session establishment complete on server localhost/127.0.0.1:51780, sessionid = 0x13ccaa4febd0007, negotiated timeout = 20000
[junit4:junit4]   2> 7090 T2321 oascc.ConnectionManager.process Watcher org.apache.solr.common.cloud.ConnectionManager@3f45b52d name:ZooKeeperConnection Watcher:127.0.0.1:51780 got event WatchedEvent state:SyncConnected type:None path:null path:null type:None
[junit4:junit4]   2> 7091 T2267 oascc.ConnectionManager.waitForConnected Client is connected to ZooKeeper
[junit4:junit4]   2> 7094 T2272 oazs.PrepRequestProcessor.pRequest2Txn Processed session termination for sessionid: 0x13ccaa4febd0007
[junit4:junit4]   2> 7095 T2269 oazs.NIOServerCnxn.closeSock Closed socket connection for client /127.0.0.1:51791 which had sessionid 0x13ccaa4febd0007
[junit4:junit4]   2> 7095 T2267 oaz.ZooKeeper.close Session: 0x13ccaa4febd0007 closed
[junit4:junit4]   2> 7095 T2321 oaz.ClientCnxn$EventThread.run EventThread shut down
[junit4:junit4]   2> 7096 T2267 oascsi.HttpClientUtil.createClient Creating new http client, config:maxConnections=500&maxConnectionsPerHost=16&socketTimeout=60000&connTimeout=15000
[junit4:junit4]   2> 7104 T2267 oaz.ZooKeeper.<init> Initiating client connection, connectString=127.0.0.1:51780/solr sessionTimeout=30000 watcher=org.apache.solr.common.cloud.ConnectionManager@22b36de5
[junit4:junit4]   2> 7105 T2267 oascc.ConnectionManager.waitForConnected Waiting for client to connect to ZooKeeper
[junit4:junit4]   2> 7106 T2322 oaz.ClientCnxn$SendThread.logStartConnect Opening socket connection to server localhost/127.0.0.1:51780. Will not attempt to authenticate using SASL (access denied ("javax.security.auth.AuthPermission" "getLoginConfiguration"))
[junit4:junit4]   2> 7107 T2322 oaz.ClientCnxn$SendThread.primeConnection Socket connection established to localhost/127.0.0.1:51780, initiating session
[junit4:junit4]   2> 7108 T2269 oazs.NIOServerCnxnFactory.run Accepted socket connection from /127.0.0.1:51792
[junit4:junit4]   2> 7109 T2269 oazs.ZooKeeperServer.processConnectRequest Client attempting to establish new session at /127.0.0.1:51792
[junit4:junit4]   2> 7110 T2271 oazs.ZooKeeperServer.finishSessionInit Established session 0x13ccaa4febd0008 with negotiated timeout 20000 for client /127.0.0.1:51792
[junit4:junit4]   2> 7110 T2322 oaz.ClientCnxn$SendThread.onConnected Session establishment complete on server localhost/127.0.0.1:51780, sessionid = 0x13ccaa4febd0008, negotiated timeout = 20000
[junit4:junit4]   2> 7111 T2323 oascc.ConnectionManager.process Watcher org.apache.solr.common.cloud.ConnectionManager@22b36de5 name:ZooKeeperConnection Watcher:127.0.0.1:51780/solr got event WatchedEvent state:SyncConnected type:None path:null path:null type:None
[junit4:junit4]   2> 7112 T2267 oascc.ConnectionManager.waitForConnected Client is connected to ZooKeeper
[junit4:junit4]   2> 7114 T2272 oazs.PrepRequestProcessor.pRequest Got user-level KeeperException when processing sessionid:0x13ccaa4febd0008 type:create cxid:0x1 zxid:0x6c txntype:-1 reqpath:n/a Error Path:/solr/overseer Error:KeeperErrorCode = NodeExists for /solr/overseer
[junit4:junit4]   2> 7116 T2272 oazs.PrepRequestProcessor.pRequest Got user-level KeeperException when processing sessionid:0x13ccaa4febd0008 type:create cxid:0x2 zxid:0x6d txntype:-1 reqpath:n/a Error Path:/solr/overseer Error:KeeperErrorCode = NodeExists for /solr/overseer
[junit4:junit4]   2> 7119 T2267 oascc.ZkStateReader.createClusterStateWatchersAndUpdate Updating cluster state from ZooKeeper... 
[junit4:junit4]   2> 7123 T2267 oasc.ZkController.createEphemeralLiveNode Register node as live in ZooKeeper:/live_nodes/127.0.0.1:51790_
[junit4:junit4]   2> 7124 T2272 oazs.PrepRequestProcessor.pRequest Got user-level KeeperException when processing sessionid:0x13ccaa4febd0008 type:delete cxid:0x9 zxid:0x6e txntype:-1 reqpath:n/a Error Path:/solr/live_nodes/127.0.0.1:51790_ Error:KeeperErrorCode = NoNode for /solr/live_nodes/127.0.0.1:51790_
[junit4:junit4]   2> 7125 T2267 oascc.SolrZkClient.makePath makePath: /live_nodes/127.0.0.1:51790_
[junit4:junit4]   2> 7129 T2295 oascc.ZkStateReader$2.process A cluster state change: WatchedEvent state:SyncConnected type:NodeChildrenChanged path:/live_nodes, has occurred - updating... (live nodes size: 2)
[junit4:junit4]   2> 7129 T2289 oascc.ZkStateReader$2.process A cluster state change: WatchedEvent state:SyncConnected type:NodeChildrenChanged path:/live_nodes, has occurred - updating... (live nodes size: 2)
[junit4:junit4]   2> 7129 T2308 oascc.ZkStateReader$2.process A cluster state change: WatchedEvent state:SyncConnected type:NodeChildrenChanged path:/live_nodes, has occurred - updating... (live nodes size: 2)
[junit4:junit4]   2> 7132 T2323 oascc.ZkStateReader$3.process Updating live nodes... (3)
[junit4:junit4]   2> 7135 T2295 oascc.ZkStateReader$3.process Updating live nodes... (3)
[junit4:junit4]   2> 7136 T2308 oascc.ZkStateReader$3.process Updating live nodes... (3)
[junit4:junit4]   2> 7136 T2289 oascc.ZkStateReader$3.process Updating live nodes... (3)
[junit4:junit4]   2> 7145 T2324 oasc.CoreContainer.create Creating SolrCore 'collection1' using instanceDir: /Users/jenkins/jenkins-slave/workspace/Lucene-Solr-4.x-MacOSX/solr/build/solr-core/test/J0/./org.apache.solr.cloud.BasicDistributedZkTest-jetty2-1360609483066/collection1
[junit4:junit4]   2> 7145 T2324 oasc.ZkController.createCollectionZkNode Check for collection zkNode:collection1
[junit4:junit4]   2> 7146 T2324 oasc.ZkController.createCollectionZkNode Collection zkNode exists
[junit4:junit4]   2> 7147 T2324 oasc.ZkController.readConfigName Load collection config from:/collections/collection1
[junit4:junit4]   2> 7149 T2324 oasc.SolrResourceLoader.<init> new SolrResourceLoader for directory: '/Users/jenkins/jenkins-slave/workspace/Lucene-Solr-4.x-MacOSX/solr/build/solr-core/test/J0/./org.apache.solr.cloud.BasicDistributedZkTest-jetty2-1360609483066/collection1/'
[junit4:junit4]   2> 7150 T2324 oasc.SolrResourceLoader.replaceClassLoader Adding 'file:/Users/jenkins/jenkins-slave/workspace/Lucene-Solr-4.x-MacOSX/solr/build/solr-core/test/J0/org.apache.solr.cloud.BasicDistributedZkTest-jetty2-1360609483066/collection1/lib/classes/' to classloader
[junit4:junit4]   2> 7151 T2324 oasc.SolrResourceLoader.replaceClassLoader Adding 'file:/Users/jenkins/jenkins-slave/workspace/Lucene-Solr-4.x-MacOSX/solr/build/solr-core/test/J0/org.apache.solr.cloud.BasicDistributedZkTest-jetty2-1360609483066/collection1/lib/README' to classloader
[junit4:junit4]   2> 7207 T2324 oasc.SolrConfig.<init> Using Lucene MatchVersion: LUCENE_42
[junit4:junit4]   2> 7284 T2324 oasc.SolrConfig.<init> Loaded SolrConfig: solrconfig.xml
[junit4:junit4]   2> 7285 T2324 oass.IndexSchema.readSchema Reading Solr Schema
[junit4:junit4]   2> 7290 T2324 oass.IndexSchema.readSchema Schema name=test
[junit4:junit4]   2> 7835 T2324 oass.OpenExchangeRatesOrgProvider.init Initialized with rates=open-exchange-rates.json, refreshInterval=1440.
[junit4:junit4]   2> 7844 T2324 oass.IndexSchema.readSchema default search field in schema is text
[junit4:junit4]   2> 7848 T2324 oass.IndexSchema.readSchema unique key field: id
[junit4:junit4]   2> 7875 T2324 oass.FileExchangeRateProvider.reload Reloading exchange rates from file currency.xml
[junit4:junit4]   2> 7881 T2324 oass.FileExchangeRateProvider.reload Reloading exchange rates from file currency.xml
[junit4:junit4]   2> 7886 T2324 oass.OpenExchangeRatesOrgProvider.reload Reloading exchange rates from open-exchange-rates.json
[junit4:junit4]   2> 7888 T2324 oass.OpenExchangeRatesOrgProvider.reload Reloading exchange rates from open-exchange-rates.json
[junit4:junit4]   2> 7890 T2324 oasc.SolrCore.<init> [collection1] Opening new SolrCore at /Users/jenkins/jenkins-slave/workspace/Lucene-Solr-4.x-MacOSX/solr/build/solr-core/test/J0/./org.apache.solr.cloud.BasicDistributedZkTest-jetty2-1360609483066/collection1/, dataDir=./org.apache.solr.cloud.BasicDistributedZkTest-1360609476277/jetty2/
[junit4:junit4]   2> 7891 T2324 oasc.JmxMonitoredMap.<init> JMX monitoring is enabled. Adding Solr mbeans to JMX Server: com.sun.jmx.mbeanserver.JmxMBeanServer@1dfc617e
[junit4:junit4]   2> 7891 T2324 oasc.SolrCore.initDirectoryFactory solr.StandardDirectoryFactory
[junit4:junit4]   2> 7892 T2324 oasc.CachingDirectoryFactory.get return new directory for /Users/jenkins/jenkins-slave/workspace/Lucene-Solr-4.x-MacOSX/solr/build/solr-core/test/J0/./org.apache.solr.cloud.BasicDistributedZkTest-1360609476277/jetty2 forceNew:false
[junit4:junit4]   2> 7893 T2324 oasc.CachingDirectoryFactory.close Releasing directory:/Users/jenkins/jenkins-slave/workspace/Lucene-Solr-4.x-MacOSX/solr/build/solr-core/test/J0/./org.apache.solr.cloud.BasicDistributedZkTest-1360609476277/jetty2
[junit4:junit4]   2> 7893 T2324 oasc.SolrCore.getNewIndexDir New index directory detected: old=null new=./org.apache.solr.cloud.BasicDistributedZkTest-1360609476277/jetty2/index/
[junit4:junit4]   2> 7893 T2324 oasc.SolrCore.initIndex WARNING [collection1] Solr index directory './org.apache.solr.cloud.BasicDistributedZkTest-1360609476277/jetty2/index' doesn't exist. Creating new index...
[junit4:junit4]   2> 7894 T2324 oasc.CachingDirectoryFactory.get return new directory for /Users/jenkins/jenkins-slave/workspace/Lucene-Solr-4.x-MacOSX/solr/build/solr-core/test/J0/./org.apache.solr.cloud.BasicDistributedZkTest-1360609476277/jetty2/index forceNew:false
[junit4:junit4]   2> 7898 T2324 oasc.SolrDeletionPolicy.onCommit SolrDeletionPolicy.onCommit: commits:num=1
[junit4:junit4]   2> 		commit{dir=RateLimitedDirectoryWrapper(org.apache.lucene.store.NIOFSDirectory@/Users/jenkins/jenkins-slave/workspace/Lucene-Solr-4.x-MacOSX/solr/build/solr-core/test/J0/org.apache.solr.cloud.BasicDistributedZkTest-1360609476277/jetty2/index lockFactory=org.apache.lucene.store.NativeFSLockFactory@a8d5d0),segFN=segments_1,generation=1,filenames=[segments_1]
[junit4:junit4]   2> 7899 T2324 oasc.SolrDeletionPolicy.updateCommits newest commit = 1[segments_1]
[junit4:junit4]   2> 7899 T2324 oasc.CachingDirectoryFactory.close Releasing directory:/Users/jenkins/jenkins-slave/workspace/Lucene-Solr-4.x-MacOSX/solr/build/solr-core/test/J0/./org.apache.solr.cloud.BasicDistributedZkTest-1360609476277/jetty2/index
[junit4:junit4]   2> 7900 T2324 oasc.SolrCore.initWriters created xml: solr.XMLResponseWriter
[junit4:junit4]   2> 7902 T2324 oasup.UpdateRequestProcessorChain.init inserting DistributedUpdateProcessorFactory into updateRequestProcessorChain "dedupe"
[junit4:junit4]   2> 7903 T2324 oasup.UpdateRequestProcessorChain.init inserting DistributedUpdateProcessorFactory into updateRequestProcessorChain "dedupe-allfields"
[junit4:junit4]   2> 7903 T2324 oasup.UpdateRequestProcessorChain.init inserting DistributedUpdateProcessorFactory into updateRequestProcessorChain "stored_sig"
[junit4:junit4]   2> 7903 T2324 oasup.UpdateRequestProcessorChain.init inserting DistributedUpdateProcessorFactory into updateRequestProcessorChain "uniq-fields"
[junit4:junit4]   2> 7904 T2324 oasup.UpdateRequestProcessorChain.init inserting DistributedUpdateProcessorFactory into updateRequestProcessorChain "distrib-dup-test-chain-implicit"
[junit4:junit4]   2> 7904 T2324 oasc.RequestHandlers.initHandlersFromConfig adding lazy requestHandler: solr.ReplicationHandler
[junit4:junit4]   2> 7905 T2324 oasc.RequestHandlers.initHandlersFromConfig created /replication: solr.ReplicationHandler
[junit4:junit4]   2> 7906 T2324 oasc.RequestHandlers.initHandlersFromConfig created standard: solr.StandardRequestHandler
[junit4:junit4]   2> 7907 T2324 oasc.RequestHandlers.initHandlersFromConfig created /get: solr.RealTimeGetHandler
[junit4:junit4]   2> 7908 T2324 oasc.RequestHandlers.initHandlersFromConfig created dismax: solr.SearchHandler
[junit4:junit4]   2> 7908 T2324 oasc.RequestHandlers.initHandlersFromConfig created mock: org.apache.solr.core.MockQuerySenderListenerReqHandler
[junit4:junit4]   2> 7909 T2324 oasc.RequestHandlers.initHandlersFromConfig created /admin/: org.apache.solr.handler.admin.AdminHandlers
[junit4:junit4]   2> 7910 T2324 oasc.RequestHandlers.initHandlersFromConfig created defaults: solr.StandardRequestHandler
[junit4:junit4]   2> 7910 T2324 oasc.RequestHandlers.initHandlersFromConfig adding lazy requestHandler: solr.StandardRequestHandler
[junit4:junit4]   2> 7910 T2324 oasc.RequestHandlers.initHandlersFromConfig created lazy: solr.StandardRequestHandler
[junit4:junit4]   2> 7911 T2324 oasc.RequestHandlers.initHandlersFromConfig created /update: solr.UpdateRequestHandler
[junit4:junit4]   2> 7912 T2324 oasc.RequestHandlers.initHandlersFromConfig created /terms: org.apache.solr.handler.component.SearchHandler
[junit4:junit4]   2> 7913 T2324 oasc.RequestHandlers.initHandlersFromConfig created spellCheckCompRH: org.apache.solr.handler.component.SearchHandler
[junit4:junit4]   2> 7914 T2324 oasc.RequestHandlers.initHandlersFromConfig created spellCheckCompRH_Direct: org.apache.solr.handler.component.SearchHandler
[junit4:junit4]   2> 7915 T2324 oasc.RequestHandlers.initHandlersFromConfig created spellCheckWithWordbreak: org.apache.solr.handler.component.SearchHandler
[junit4:junit4]   2> 7917 T2324 oasc.RequestHandlers.initHandlersFromConfig created spellCheckWithWordbreak_Direct: org.apache.solr.handler.component.SearchHandler
[junit4:junit4]   2> 7918 T2324 oasc.RequestHandlers.initHandlersFromConfig created spellCheckCompRH1: org.apache.solr.handler.component.SearchHandler
[junit4:junit4]   2> 7919 T2324 oasc.RequestHandlers.initHandlersFromConfig created mltrh: org.apache.solr.handler.component.SearchHandler
[junit4:junit4]   2> 7920 T2324 oasc.RequestHandlers.initHandlersFromConfig created tvrh: org.apache.solr.handler.component.SearchHandler
[junit4:junit4]   2> 7921 T2324 oasc.RequestHandlers.initHandlersFromConfig created /mlt: solr.MoreLikeThisHandler
[junit4:junit4]   2> 7922 T2324 oasc.RequestHandlers.initHandlersFromConfig created /debug/dump: solr.DumpRequestHandler
[junit4:junit4]   2> 7932 T2324 oashl.XMLLoader.init xsltCacheLifetimeSeconds=60
[junit4:junit4]   2> 7935 T2324 oasc.SolrCore.initDeprecatedSupport WARNING solrconfig.xml uses deprecated <admin/gettableFiles>, Please update your config to use the ShowFileRequestHandler.
[junit4:junit4]   2> 7937 T2324 oasc.SolrCore.initDeprecatedSupport WARNING adding ShowFileRequestHandler with hidden files: [SCHEMA.XML, OLD_SYNONYMS.TXT, STOPWORDS.TXT, PROTWORDS.TXT, OPEN-EXCHANGE-RATES.JSON, SYNONYMS.TXT, CURRENCY.XML, MAPPING-ISOLATIN1ACCENT.TXT]
[junit4:junit4]   2> 7940 T2324 oasc.CachingDirectoryFactory.close Releasing directory:/Users/jenkins/jenkins-slave/workspace/Lucene-Solr-4.x-MacOSX/solr/build/solr-core/test/J0/./org.apache.solr.cloud.BasicDistributedZkTest-1360609476277/jetty2
[junit4:junit4]   2> 7941 T2324 oass.SolrIndexSearcher.<init> Opening Searcher@536eb4d3 main
[junit4:junit4]   2> 7942 T2324 oasu.CommitTracker.<init> Hard AutoCommit: disabled
[junit4:junit4]   2> 7942 T2324 oasu.CommitTracker.<init> Soft AutoCommit: disabled
[junit4:junit4]   2> 7943 T2324 oashc.SpellCheckComponent.inform Initializing spell checkers
[junit4:junit4]   2> 7948 T2324 oass.DirectSolrSpellChecker.init init: {name=direct,classname=DirectSolrSpellChecker,field=lowerfilt,minQueryLength=3}
[junit4:junit4]   2> 7976 T2325 oasc.SolrCore.registerSearcher [collection1] Registered new searcher Searcher@536eb4d3 main{StandardDirectoryReader(segments_1:1)}
[junit4:junit4]   2> 7982 T2324 oasc.ZkController.publish publishing core=collection1 state=down
[junit4:junit4]   2> 7983 T2324 oasc.ZkController.publish numShards not found on descriptor - reading it from system property
[junit4:junit4]   2> 8255 T2290 oascc.ZkStateReader.updateClusterState Updating cloud state from ZooKeeper... 
[junit4:junit4]   2> 8257 T2290 oasc.Overseer$ClusterStateUpdater.updateState Update state numShards=2 message={
[junit4:junit4]   2> 	  "operation":"state",
[junit4:junit4]   2> 	  "numShards":"2",
[junit4:junit4]   2> 	  "shard":"shard1",
[junit4:junit4]   2> 	  "roles":null,
[junit4:junit4]   2> 	  "state":"active",
[junit4:junit4]   2> 	  "core":"collection1",
[junit4:junit4]   2> 	  "collection":"collection1",
[junit4:junit4]   2> 	  "node_name":"127.0.0.1:51787_",
[junit4:junit4]   2> 	  "base_url":"http://127.0.0.1:51787"}
[junit4:junit4]   2> 8264 T2290 oasc.Overseer$ClusterStateUpdater.updateState Update state numShards=2 message={
[junit4:junit4]   2> 	  "operation":"state",
[junit4:junit4]   2> 	  "numShards":"2",
[junit4:junit4]   2> 	  "shard":null,
[junit4:junit4]   2> 	  "roles":null,
[junit4:junit4]   2> 	  "state":"down",
[junit4:junit4]   2> 	  "core":"collection1",
[junit4:junit4]   2> 	  "collection":"collection1",
[junit4:junit4]   2> 	  "node_name":"127.0.0.1:51790_",
[junit4:junit4]   2> 	  "base_url":"http://127.0.0.1:51790"}
[junit4:junit4]   2> 8264 T2290 oasc.Overseer$ClusterStateUpdater.updateState Collection already exists with numShards=2
[junit4:junit4]   2> 8265 T2290 oasc.Overseer$ClusterStateUpdater.updateState Assigning new node to shard shard=shard2
[junit4:junit4]   2> 8270 T2295 oascc.ZkStateReader$2.process A cluster state change: WatchedEvent state:SyncConnected type:NodeDataChanged path:/clusterstate.json, has occurred - updating... (live nodes size: 3)
[junit4:junit4]   2> 8271 T2308 oascc.ZkStateReader$2.process A cluster state change: WatchedEvent state:SyncConnected type:NodeDataChanged path:/clusterstate.json, has occurred - updating... (live nodes size: 3)
[junit4:junit4]   2> 8271 T2323 oascc.ZkStateReader$2.process A cluster state change: WatchedEvent state:SyncConnected type:NodeDataChanged path:/clusterstate.json, has occurred - updating... (live nodes size: 3)
[junit4:junit4]   2> 8271 T2289 oascc.ZkStateReader$2.process A cluster state change: WatchedEvent state:SyncConnected type:NodeDataChanged path:/clusterstate.json, has occurred - updating... (live nodes size: 3)
[junit4:junit4]   2> 8986 T2324 oasc.CoreContainer.registerCore registering core: collection1
[junit4:junit4]   2> 8987 T2324 oasc.ZkController.register Register replica - core:collection1 address:http://127.0.0.1:51790 collection:collection1 shard:shard2
[junit4:junit4]   2> 8988 T2324 oascc.SolrZkClient.makePath makePath: /collections/collection1/leader_elect/shard2/election
[junit4:junit4]   2> 8999 T2272 oazs.PrepRequestProcessor.pRequest Got user-level KeeperException when processing sessionid:0x13ccaa4febd0008 type:delete cxid:0x44 zxid:0x7c txntype:-1 reqpath:n/a Error Path:/solr/collections/collection1/leaders/shard2 Error:KeeperErrorCode = NoNode for /solr/collections/collection1/leaders/shard2
[junit4:junit4]   2> 9000 T2324 oasc.ShardLeaderElectionContext.runLeaderProcess Running the leader process.
[junit4:junit4]   2> 9000 T2272 oazs.PrepRequestProcessor.pRequest Got user-level KeeperException when processing sessionid:0x13ccaa4febd0008 type:create cxid:0x45 zxid:0x7d txntype:-1 reqpath:n/a Error Path:/solr/overseer Error:KeeperErrorCode = NodeExists for /solr/overseer
[junit4:junit4]   2> 9003 T2324 oasc.ShardLeaderElectionContext.waitForReplicasToComeUp Enough replicas found to continue.
[junit4:junit4]   2> 9004 T2324 oasc.ShardLeaderElectionContext.runLeaderProcess I may be the new leader - try and sync
[junit4:junit4]   2> 9004 T2324 oasc.SyncStrategy.sync Sync replicas to http://127.0.0.1:51790/collection1/
[junit4:junit4]   2> 9004 T2324 oasc.SyncStrategy.syncReplicas Sync Success - now sync replicas to me
[junit4:junit4]   2> 9004 T2324 oasc.SyncStrategy.syncToMe http://127.0.0.1:51790/collection1/ has no replicas
[junit4:junit4]   2> 9005 T2324 oasc.ShardLeaderElectionContext.runLeaderProcess I am the new leader: http://127.0.0.1:51790/collection1/
[junit4:junit4]   2> 9005 T2324 oascc.SolrZkClient.makePath makePath: /collections/collection1/leaders/shard2
[junit4:junit4]   2> 9011 T2272 oazs.PrepRequestProcessor.pRequest Got user-level KeeperException when processing sessionid:0x13ccaa4febd0008 type:create cxid:0x4e zxid:0x80 txntype:-1 reqpath:n/a Error Path:/solr/overseer Error:KeeperErrorCode = NodeExists for /solr/overseer
[junit4:junit4]   2> 9787 T2290 oascc.ZkStateReader.updateClusterState Updating cloud state from ZooKeeper... 
[junit4:junit4]   2> 9800 T2289 oascc.ZkStateReader$2.process A cluster state change: WatchedEvent state:SyncConnected type:NodeDataChanged path:/clusterstate.json, has occurred - updating... (live nodes size: 3)
[junit4:junit4]   2> 9801 T2308 oascc.ZkStateReader$2.process A cluster state change: WatchedEvent state:SyncConnected type:NodeDataChanged path:/clusterstate.json, has occurred - updating... (live nodes size: 3)
[junit4:junit4]   2> 9801 T2323 oascc.ZkStateReader$2.process A cluster state change: WatchedEvent state:SyncConnected type:NodeDataChanged path:/clusterstate.json, has occurred - updating... (live nodes size: 3)
[junit4:junit4]   2> 9801 T2295 oascc.ZkStateReader$2.process A cluster state change: WatchedEvent state:SyncConnected type:NodeDataChanged path:/clusterstate.json, has occurred - updating... (live nodes size: 3)
[junit4:junit4]   2> 9840 T2324 oasc.ZkController.register We are http://127.0.0.1:51790/collection1/ and leader is http://127.0.0.1:51790/collection1/
[junit4:junit4]   2> 9841 T2324 oasc.ZkController.register No LogReplay needed for core=collection1 baseURL=http://127.0.0.1:51790
[junit4:junit4]   2> 9841 T2324 oasc.ZkController.checkRecovery I am the leader, no recovery necessary
[junit4:junit4]   2> 9841 T2324 oasc.ZkController.publish publishing core=collection1 state=active
[junit4:junit4]   2> 9841 T2324 oasc.ZkController.publish numShards not found on descriptor - reading it from system property
[junit4:junit4]   2> 9844 T2324 oascc.ZkStateReader.updateClusterState Updating cloud state from ZooKeeper... 
[junit4:junit4]   2> 9846 T2267 oass.SolrDispatchFilter.init user.dir=/Users/jenkins/jenkins-slave/workspace/Lucene-Solr-4.x-MacOSX/solr/build/solr-core/test/J0
[junit4:junit4]   2> 9847 T2267 oass.SolrDispatchFilter.init SolrDispatchFilter.init() done
[junit4:junit4]   2> 9847 T2267 oascsi.HttpClientUtil.createClient Creating new http client, config:maxConnections=128&maxConnectionsPerHost=32&followRedirects=false
[junit4:junit4]   2> 10044 T2267 oejs.Server.doStart jetty-8.1.8.v20121106
[junit4:junit4]   2> 10048 T2267 oejs.AbstractConnector.doStart Started SelectChannelConnector@127.0.0.1:51793
[junit4:junit4]   2> 10049 T2267 oass.SolrDispatchFilter.init SolrDispatchFilter.init()
[junit4:junit4]   2> 10050 T2267 oasc.SolrResourceLoader.locateSolrHome JNDI not configured for solr (NoInitialContextEx)
[junit4:junit4]   2> 10050 T2267 oasc.SolrResourceLoader.locateSolrHome using system property solr.solr.home: /Users/jenkins/jenkins-slave/workspace/Lucene-Solr-4.x-MacOSX/solr/build/solr-core/test/J0/./org.apache.solr.cloud.BasicDistributedZkTest-jetty3-1360609486121
[junit4:junit4]   2> 10051 T2267 oasc.CoreContainer$Initializer.initialize looking for solr.xml: /Users/jenkins/jenkins-slave/workspace/Lucene-Solr-4.x-MacOSX/solr/build/solr-core/test/J0/./org.apache.solr.cloud.BasicDistributedZkTest-jetty3-1360609486121/solr.xml
[junit4:junit4]   2> 10051 T2267 oasc.CoreContainer.<init> New CoreContainer 1261485473
[junit4:junit4]   2> 10052 T2267 oasc.CoreContainer.load Loading CoreContainer using Solr Home: '/Users/jenkins/jenkins-slave/workspace/Lucene-Solr-4.x-MacOSX/solr/build/solr-core/test/J0/./org.apache.solr.cloud.BasicDistributedZkTest-jetty3-1360609486121/'
[junit4:junit4]   2> 10053 T2267 oasc.SolrResourceLoader.<init> new SolrResourceLoader for directory: '/Users/jenkins/jenkins-slave/workspace/Lucene-Solr-4.x-MacOSX/solr/build/solr-core/test/J0/./org.apache.solr.cloud.BasicDistributedZkTest-jetty3-1360609486121/'
[junit4:junit4]   2> 10096 T2267 oashc.HttpShardHandlerFactory.getParameter Setting socketTimeout to: 60000
[junit4:junit4]   2> 10096 T2267 oashc.HttpShardHandlerFactory.getParameter Setting urlScheme to: http://
[junit4:junit4]   2> 10099 T2267 oashc.HttpShardHandlerFactory.getParameter Setting connTimeout to: 15000
[junit4:junit4]   2> 10099 T2267 oashc.HttpShardHandlerFactory.getParameter Setting maxConnectionsPerHost to: 20
[junit4:junit4]   2> 10100 T2267 oashc.HttpShardHandlerFactory.getParameter Setting corePoolSize to: 0
[junit4:junit4]   2> 10101 T2267 oashc.HttpShardHandlerFactory.getParameter Setting maximumPoolSize to: 2147483647
[junit4:junit4]   2> 10102 T2267 oashc.HttpShardHandlerFactory.getParameter Setting maxThreadIdleTime to: 5
[junit4:junit4]   2> 10102 T2267 oashc.HttpShardHandlerFactory.getParameter Setting sizeOfQueue to: -1
[junit4:junit4]   2> 10103 T2267 oashc.HttpShardHandlerFactory.getParameter Setting fairnessPolicy to: false
[junit4:junit4]   2> 10104 T2267 oascsi.HttpClientUtil.createClient Creating new http client, config:maxConnectionsPerHost=20&maxConnections=10000&socketTimeout=60000&connTimeout=15000&retry=false
[junit4:junit4]   2> 10119 T2267 oasc.CoreContainer.load Registering Log Listener
[junit4:junit4]   2> 10136 T2267 oasc.CoreContainer.initZooKeeper Zookeeper client=127.0.0.1:51780/solr
[junit4:junit4]   2> 10137 T2267 oasc.ZkController.checkChrootPath zkHost includes chroot
[junit4:junit4]   2> 10138 T2267 oaz.ZooKeeper.<init> Initiating client connection, connectString=127.0.0.1:51780 sessionTimeout=60000 watcher=org.apache.solr.common.cloud.ConnectionManager@972a6df
[junit4:junit4]   2> 10139 T2267 oascc.ConnectionManager.waitForConnected Waiting for client to connect to ZooKeeper
[junit4:junit4]   2> 10140 T2335 oaz.ClientCnxn$SendThread.logStartConnect Opening socket connection to server localhost/127.0.0.1:51780. Will not attempt to authenticate using SASL (access denied ("javax.security.auth.AuthPermission" "getLoginConfiguration"))
[junit4:junit4]   2> 10141 T2335 oaz.ClientCnxn$SendThread.primeConnection Socket connection established to localhost/127.0.0.1:51780, initiating session
[junit4:junit4]   2> 10142 T2269 oazs.NIOServerCnxnFactory.run Accepted socket connection from /127.0.0.1:51794
[junit4:junit4]   2> 10142 T2269 oazs.ZooKeeperServer.processConnectRequest Client attempting to establish new session at /127.0.0.1:51794
[junit4:junit4]   2> 10143 T2271 oazs.ZooKeeperServer.finishSessionInit Established session 0x13ccaa4febd0009 with negotiated timeout 20000 for client /127.0.0.1:51794
[junit4:junit4]   2> 10144 T2335 oaz.ClientCnxn$SendThread.onConnected Session establishment complete on server localhost/127.0.0.1:51780, sessionid = 0x13ccaa4febd0009, negotiated timeout = 20000
[junit4:junit4]   2> 10144 T2336 oascc.ConnectionManager.process Watcher org.apache.solr.common.cloud.ConnectionManager@972a6df name:ZooKeeperConnection Watcher:127.0.0.1:51780 got event WatchedEvent state:SyncConnected type:None path:null path:null type:None
[junit4:junit4]   2> 10144 T2267 oascc.ConnectionManager.waitForConnected Client is connected to ZooKeeper
[junit4:junit4]   2> 10147 T2272 oazs.PrepRequestProcessor.pRequest2Txn Processed session termination for sessionid: 0x13ccaa4febd0009
[junit4:junit4]   2> 10148 T2269 oazs.NIOServerCnxn.closeSock Closed socket connection for client /127.0.0.1:51794 which had sessionid 0x13ccaa4febd0009
[junit4:junit4]   2> 10148 T2267 oaz.ZooKeeper.close Session: 0x13ccaa4febd0009 closed
[junit4:junit4]   2> 10149 T2336 oaz.ClientCnxn$EventThread.run EventThread shut down
[junit4:junit4]   2> 10149 T2267 oascsi.HttpClientUtil.createClient Creating new http client, config:maxConnections=500&maxConnectionsPerHost=16&socketTimeout=60000&connTimeout=15000
[junit4:junit4]   2> 10155 T2267 oaz.ZooKeeper.<init> Initiating client connection, connectString=127.0.0.1:51780/solr sessionTimeout=30000 watcher=org.apache.solr.common.cloud.ConnectionManager@4e5fb40c
[junit4:junit4]   2> 10156 T2267 oascc.ConnectionManager.waitForConnected Waiting for client to connect to ZooKeeper
[junit4:junit4]   2> 10156 T2337 oaz.ClientCnxn$SendThread.logStartConnect Opening socket connection to server localhost/127.0.0.1:51780. Will not attempt to authenticate using SASL (access denied ("javax.security.auth.AuthPermission" "getLoginConfiguration"))
[junit4:junit4]   2> 10157 T2337 oaz.ClientCnxn$SendThread.primeConnection Socket connection established to localhost/127.0.0.1:51780, initiating session
[junit4:junit4]   2> 10157 T2269 oazs.NIOServerCnxnFactory.run Accepted socket connection from /127.0.0.1:51795
[junit4:junit4]   2> 10158 T2269 oazs.ZooKeeperServer.processConnectRequest Client attempting to establish new session at /127.0.0.1:51795
[junit4:junit4]   2> 10159 T2271 oazs.ZooKeeperServer.finishSessionInit Established session 0x13ccaa4febd000a with negotiated timeout 20000 for client /127.0.0.1:51795
[junit4:junit4]   2> 10159 T2337 oaz.ClientCnxn$SendThread.onConnected Session establishment complete on server localhost/127.0.0.1:51780, sessionid = 0x13ccaa4febd000a, negotiated timeout = 20000
[junit4:junit4]   2> 10159 T2338 oascc.ConnectionManager.process Watcher org.apache.solr.common.cloud.ConnectionManager@4e5fb40c name:ZooKeeperConnection Watcher:127.0.0.1:51780/solr got event WatchedEvent state:SyncConnected type:None path:null path:null type:None
[junit4:junit4]   2> 10160 T2267 oascc.ConnectionManager.waitForConnected Client is connected to ZooKeeper
[junit4:junit4]   2> 10161 T2272 oazs.PrepRequestProcessor.pRequest Got user-level KeeperException when processing sessionid:0x13ccaa4febd000a type:create cxid:0x1 zxid:0x8d txntype:-1 reqpath:n/a Error Path:/solr/overseer Error:KeeperErrorCode = NodeExists for /solr/overseer
[junit4:junit4]   2> 10163 T2272 oazs.PrepRequestProcessor.pRequest Got user-level KeeperException when processing sessionid:0x13ccaa4febd000a type:create cxid:0x2 zxid:0x8e txntype:-1 reqpath:n/a Error Path:/solr/overseer Error:KeeperErrorCode = NodeExists for /solr/overseer
[junit4:junit4]   2> 10166 T2267 oascc.ZkStateReader.createClusterStateWatchersAndUpdate Updating cluster state from ZooKeeper... 
[junit4:junit4]   2> 10170 T2267 oasc.ZkController.createEphemeralLiveNode Register node as live in ZooKeeper:/live_nodes/127.0.0.1:51793_
[junit4:junit4]   2> 10171 T2272 oazs.PrepRequestProcessor.pRequest Got user-level KeeperException when processing sessionid:0x13ccaa4febd000a type:delete cxid:0x9 zxid:0x8f txntype:-1 reqpath:n/a Error Path:/solr/live_nodes/127.0.0.1:51793_ Error:KeeperErrorCode = NoNode for /solr/live_nodes/127.0.0.1:51793_
[junit4:junit4]   2> 10172 T2267 oascc.SolrZkClient.makePath makePath: /live_nodes/127.0.0.1:51793_
[junit4:junit4]   2> 10177 T2308 oascc.ZkStateReader$2.process A cluster state change: WatchedEvent state:SyncConnected type:NodeChildrenChanged path:/live_nodes, has occurred - updating... (live nodes size: 3)
[junit4:junit4]   2> 10177 T2289 oascc.ZkStateReader$2.process A cluster state change: WatchedEvent state:SyncConnected type:NodeChildrenChanged path:/live_nodes, has occurred - updating... (live nodes size: 3)
[junit4:junit4]   2> 10177 T2295 oascc.ZkStateReader$2.process A cluster state change: WatchedEvent state:SyncConnected type:NodeChildrenChanged path:/live_nodes, has occurred - updating... (live nodes size: 3)
[junit4:junit4]   2> 10178 T2323 oascc.ZkStateReader$2.process A cluster state change: WatchedEvent state:SyncConnected type:NodeChildrenChanged path:/live_nodes, has occurred - updating... (live nodes size: 3)
[junit4:junit4]   2> 10180 T2338 oascc.ZkStateReader$3.process Updating live nodes... (4)
[junit4:junit4]   2> 10184 T2323 oascc.ZkStateReader$3.process Updating live nodes... (4)
[junit4:junit4]   2> 10184 T2295 oascc.ZkStateReader$3.process Updating live nodes... (4)
[junit4:junit4]   2> 10184 T2289 oascc.ZkStateReader$3.process Updating live nodes... (4)
[junit4:junit4]   2> 10185 T2308 oascc.ZkStateReader$3.process Updating live nodes... (4)
[junit4:junit4]   2> 10193 T2339 oasc.CoreContainer.create Creating SolrCore 'collection1' using instanceDir: /Users/jenkins/jenkins-slave/workspace/Lucene-Solr-4.x-MacOSX/solr/build/solr-core/test/J0/./org.apache.solr.cloud.BasicDistributedZkTest-jetty3-1360609486121/collection1
[junit4:junit4]   2> 10193 T2339 oasc.ZkController.createCollectionZkNode Check for collection zkNode:collection1
[junit4:junit4]   2> 10194 T2339 oasc.ZkController.createCollectionZkNode Collection zkNode exists
[junit4:junit4]   2> 10195 T2339 oasc.ZkController.readConfigName Load collection config from:/collections/collection1
[junit4:junit4]   2> 10197 T2339 oasc.SolrResourceLoader.<init> new SolrResourceLoader for directory: '/Users/jenkins/jenkins-slave/workspace/Lucene-Solr-4.x-MacOSX/solr/build/solr-core/test/J0/./org.apache.solr.cloud.BasicDistributedZkTest-jetty3-1360609486121/collection1/'
[junit4:junit4]   2> 10198 T2339 oasc.SolrResourceLoader.replaceClassLoader Adding 'file:/Users/jenkins/jenkins-slave/workspace/Lucene-Solr-4.x-MacOSX/solr/build/solr-core/test/J0/org.apache.solr.cloud.BasicDistributedZkTest-jetty3-1360609486121/collection1/lib/classes/' to classloader
[junit4:junit4]   2> 10198 T2339 oasc.SolrResourceLoader.replaceClassLoader Adding 'file:/Users/jenkins/jenkins-slave/workspace/Lucene-Solr-4.x-MacOSX/solr/build/solr-core/test/J0/org.apache.solr.cloud.BasicDistributedZkTest-jetty3-1360609486121/collection1/lib/README' to classloader
[junit4:junit4]   2> 10245 T2339 oasc.SolrConfig.<init> Using Lucene MatchVersion: LUCENE_42
[junit4:junit4]   2> 10314 T2339 oasc.SolrConfig.<init> Loaded SolrConfig: solrconfig.xml
[junit4:junit4]   2> 10315 T2339 oass.IndexSchema.readSchema Reading Solr Schema
[junit4:junit4]   2> 10321 T2339 oass.IndexSchema.readSchema Schema name=test
[junit4:junit4]   2> 10902 T2339 oass.OpenExchangeRatesOrgProvider.init Initialized with rates=open-exchange-rates.json, refreshInterval=1440.
[junit4:junit4]   2> 10913 T2339 oass.IndexSchema.readSchema default search field in schema is text
[junit4:junit4]   2> 10916 T2339 oass.IndexSchema.readSchema unique key field: id
[junit4:junit4]   2> 10940 T2339 oass.FileExchangeRateProvider.reload Reloading exchange rates from file currency.xml
[junit4:junit4]   2> 10945 T2339 oass.FileExchangeRateProvider.reload Reloading exchange rates from file currency.xml
[junit4:junit4]   2> 10951 T2339 oass.OpenExchangeRatesOrgProvider.reload Reloading exchange rates from open-exchange-rates.json
[junit4:junit4]   2> 10953 T2339 oass.OpenExchangeRatesOrgProvider.reload Reloading exchange rates from open-exchange-rates.json
[junit4:junit4]   2> 10955 T2339 oasc.SolrCore.<init> [collection1] Opening new SolrCore at /Users/jenkins/jenkins-slave/workspace/Lucene-Solr-4.x-MacOSX/solr/build/solr-core/test/J0/./org.apache.solr.cloud.BasicDistributedZkTest-jetty3-1360609486121/collection1/, dataDir=./org.apache.solr.cloud.BasicDistributedZkTest-1360609476277/jetty3/
[junit4:junit4]   2> 10956 T2339 oasc.JmxMonitoredMap.<init> JMX monitoring is enabled. Adding Solr mbeans to JMX Server: com.sun.jmx.mbeanserver.JmxMBeanServer@1dfc617e
[junit4:junit4]   2> 10956 T2339 oasc.SolrCore.initDirectoryFactory solr.StandardDirectoryFactory
[junit4:junit4]   2> 10957 T2339 oasc.CachingDirectoryFactory.get return new directory for /Users/jenkins/jenkins-slave/workspace/Lucene-Solr-4.x-MacOSX/solr/build/solr-core/test/J0/./org.apache.solr.cloud.BasicDistributedZkTest-1360609476277/jetty3 forceNew:false
[junit4:junit4]   2> 10957 T2339 oasc.CachingDirectoryFactory.close Releasing directory:/Users/jenkins/jenkins-slave/workspace/Lucene-Solr-4.x-MacOSX/solr/build/solr-core/test/J0/./org.apache.solr.cloud.BasicDistributedZkTest-1360609476277/jetty3
[junit4:junit4]   2> 10958 T2339 oasc.SolrCore.getNewIndexDir New index directory detected: old=null new=./org.apache.solr.cloud.BasicDistributedZkTest-1360609476277/jetty3/index/
[junit4:junit4]   2> 10958 T2339 oasc.SolrCore.initIndex WARNING [collection1] Solr index directory './org.apache.solr.cloud.BasicDistributedZkTest-1360609476277/jetty3/index' doesn't exist. Creating new index...
[junit4:junit4]   2> 10959 T2339 oasc.CachingDirectoryFactory.get return new directory for /Users/jenkins/jenkins-slave/workspace/Lucene-Solr-4.x-MacOSX/solr/build/solr-core/test/J0/./org.apache.solr.cloud.BasicDistributedZkTest-1360609476277/jetty3/index forceNew:false
[junit4:junit4]   2> 10962 T2339 oasc.SolrDeletionPolicy.onCommit SolrDeletionPolicy.onCommit: commits:num=1
[junit4:junit4]   2> 		commit{dir=RateLimitedDirectoryWrapper(org.apache.lucene.store.NIOFSDirectory@/Users/jenkins/jenkins-slave/workspace/Lucene-Solr-4.x-MacOSX/solr/build/solr-core/test/J0/org.apache.solr.cloud.BasicDistributedZkTest-1360609476277/jetty3/index lockFactory=org.apache.lucene.store.NativeFSLockFactory@1d4e3f0c),segFN=segments_1,generation=1,filenames=[segments_1]
[junit4:junit4]   2> 10963 T2339 oasc.SolrDeletionPolicy.updateCommits newest commit = 1[segments_1]
[junit4:junit4]   2> 10963 T2339 oasc.CachingDirectoryFactory.close Releasing directory:/Users/jenkins/jenkins-slave/workspace/Lucene-Solr-4.x-MacOSX/solr/build/solr-core/test/J0/./org.apache.solr.cloud.BasicDistributedZkTest-1360609476277/jetty3/index
[junit4:junit4]   2> 10964 T2339 oasc.SolrCore.initWriters created xml: solr.XMLResponseWriter
[junit4:junit4]   2> 10965 T2339 oasup.UpdateRequestProcessorChain.init inserting DistributedUpdateProcessorFactory into updateRequestProcessorChain "dedupe"
[junit4:junit4]   2> 10966 T2339 oasup.UpdateRequestProcessorChain.init inserting DistributedUpdateProcessorFactory into updateRequestProcessorChain "dedupe-allfields"
[junit4:junit4]   2> 10966 T2339 oasup.UpdateRequestProcessorChain.init inserting DistributedUpdateProcessorFactory into updateRequestProcessorChain "stored_sig"
[junit4:junit4]   2> 10966 T2339 oasup.UpdateRequestProcessorChain.init inserting DistributedUpdateProcessorFactory into updateRequestProcessorChain "uniq-fields"
[junit4:junit4]   2> 10967 T2339 oasup.UpdateRequestProcessorChain.init inserting DistributedUpdateProcessorFactory into updateRequestProcessorChain "distrib-dup-test-chain-implicit"
[junit4:junit4]   2> 10967 T2339 oasc.RequestHandlers.initHandlersFromConfig adding lazy requestHandler: solr.ReplicationHandler
[junit4:junit4]   2> 10967 T2339 oasc.RequestHandlers.initHandlersFromConfig created /replication: solr.ReplicationHandler
[junit4:junit4]   2> 10968 T2339 oasc.RequestHandlers.initHandlersFromConfig created standard: solr.StandardRequestHandler
[junit4:junit4]   2> 10969 T2339 oasc.RequestHandlers.initHandlersFromConfig created /get: solr.RealTimeGetHandler
[junit4:junit4]   2> 10969 T2339 oasc.RequestHandlers.initHandlersFromConfig created dismax: solr.SearchHandler
[junit4:junit4]   2> 10970 T2339 oasc.RequestHandlers.initHandlersFromConfig created mock: org.apache.solr.core.MockQuerySenderListenerReqHandler
[junit4:junit4]   2> 10970 T2339 oasc.RequestHandlers.initHandlersFromConfig created /admin/: org.apache.solr.handler.admin.AdminHandlers
[junit4:junit4]   2> 10970 T2339 oasc.RequestHandlers.initHandlersFromConfig created defaults: solr.StandardRequestHandler
[junit4:junit4]   2> 10971 T2339 oasc.RequestHandlers.initHandlersFromConfig adding lazy requestHandler: solr.StandardRequestHandler
[junit4:junit4]   2> 10971 T2339 oasc.RequestHandlers.initHandlersFromConfig created lazy: solr.StandardRequestHandler
[junit4:junit4]   2> 10972 T2339 oasc.RequestHandlers.initHandlersFromConfig created /update: solr.UpdateRequestHandler
[junit4:junit4]   2> 10972 T2339 oasc.RequestHandlers.initHandlersFromConfig created /terms: org.apache.solr.handler.component.SearchHandler
[junit4:junit4]   2> 10973 T2339 oasc.RequestHandlers.initHandlersFromConfig created spellCheckCompRH: org.apache.solr.handler.component.SearchHandler
[junit4:junit4]   2> 10973 T2339 oasc.RequestHandlers.initHandlersFromConfig created spellCheckCompRH_Direct: org.apache.solr.handler.component.SearchHandler
[junit4:junit4]   2> 10974 T2339 oasc.RequestHandlers.initHandlersFromConfig created spellCheckWithWordbreak: org.apache.solr.handler.component.SearchHandler
[junit4:junit4]   2> 10975 T2339 oasc.RequestHandlers.initHandlersFromConfig created spellCheckWithWordbreak_Direct: org.apache.solr.handler.component.SearchHandler
[junit4:junit4]   2> 10975 T2339 oasc.RequestHandlers.initHandlersFromConfig created spellCheckCompRH1: org.apache.solr.handler.component.SearchHandler
[junit4:junit4]   2> 10976 T2339 oasc.RequestHandlers.initHandlersFromConfig created mltrh: org.apache.solr.handler.component.SearchHandler
[junit4:junit4]   2> 10976 T2339 oasc.RequestHandlers.initHandlersFromConfig created tvrh: org.apache.solr.handler.component.SearchHandler
[junit4:junit4]   2> 10977 T2339 oasc.RequestHandlers.initHandlersFromConfig created /mlt: solr.MoreLikeThisHandler
[junit4:junit4]   2> 10978 T2339 oasc.RequestHandlers.initHandlersFromConfig created /debug/dump: solr.DumpRequestHandler
[junit4:junit4]   2> 10985 T2339 oashl.XMLLoader.init xsltCacheLifetimeSeconds=60
[junit4:junit4]   2> 10988 T2339 oasc.SolrCore.initDeprecatedSupport WARNING solrconfig.xml uses deprecated <admin/gettableFiles>, Please update your config to use the ShowFileRequestHandler.
[junit4:junit4]   2> 10990 T2339 oasc.SolrCore.initDeprecatedSupport WARNING adding ShowFileRequestHandler with hidden files: [SCHEMA.XML, OLD_SYNONYMS.TXT, STOPWORDS.TXT, PROTWORDS.TXT, OPEN-EXCHANGE-RATES.JSON, SYNONYMS.TXT, CURRENCY.XML, MAPPING-ISOLATIN1ACCENT.TXT]
[junit4:junit4]   2> 10992 T2339 oasc.CachingDirectoryFactory.close Releasing directory:/Users/jenkins/jenkins-slave/workspace/Lucene-Solr-4.x-MacOSX/solr/build/solr-core/test/J0/./org.apache.solr.cloud.BasicDistributedZkTest-1360609476277/jetty3
[junit4:junit4]   2> 10994 T2339 oass.SolrIndexSearcher.<init> Opening Searcher@3867577d main
[junit4:junit4]   2> 10995 T2339 oasu.CommitTracker.<init> Hard AutoCommit: disabled
[junit4:junit4]   2> 10995 T2339 oasu.CommitTracker.<init> Soft AutoCommit: disabled
[junit4:junit4]   2> 10996 T2339 oashc.SpellCheckComponent.inform Initializing spell checkers
[junit4:junit4]   2> 11001 T2339 oass.DirectSolrSpellChecker.init init: {name=direct,classname=DirectSolrSpellChecker,field=lowerfilt,minQueryLength=3}
[junit4:junit4]   2> 11034 T2340 oasc.SolrCore.registerSearcher [collection1] Registered new searcher Searcher@3867577d main{StandardDirectoryReader(segments_1:1)}
[junit4:junit4]   2> 11040 T2339 oasc.ZkController.publish publishing core=collection1 state=down
[junit4:junit4]   2> 11040 T2339 oasc.ZkController.publish numShards not found on descriptor - reading it from system property
[junit4:junit4]   2> 11315 T2290 oascc.ZkStateReader.updateClusterState Updating cloud state from ZooKeeper... 
[junit4:junit4]   2> 11316 T2290 oasc.Overseer$ClusterStateUpdater.updateState Update state numShards=2 message={
[junit4:junit4]   2> 	  "operation":"state",
[junit4:junit4]   2> 	  "numShards":"2",
[junit4:junit4]   2> 	  "shard":"shard2",
[junit4:junit4]   2> 	  "roles":null,
[junit4:junit4]   2> 	  "state":"active",
[junit4:junit4]   2> 	  "core":"collection1",
[junit4:junit4]   2> 	  "collection":"collection1",
[junit4:junit4]   2> 	  "node_name":"127.0.0.1:51790_",
[junit4:junit4]   2> 	  "base_url":"http://127.0.0.1:51790"}
[junit4:junit4]   2> 11322 T2290 oasc.Overseer$ClusterStateUpdater.updateState Update state numShards=2 message={
[junit4:junit4]   2> 	  "operation":"state",
[junit4:junit4]   2> 	  "numShards":"2",
[junit4:junit4]   2> 	  "shard":null,
[junit4:junit4]   2> 	  "roles":null,
[junit4:junit4]   2> 	  "state":"down",
[junit4:junit4]   2> 	  "core":"collection1",
[junit4:junit4]   2> 	  "collection":"collection1",
[junit4:junit4]   2> 	  "node_name":"127.0.0.1:51793_",
[junit4:junit4]   2> 	  "base_url":"http://127.0.0.1:51793"}
[junit4:junit4]   2> 11322 T2290 oasc.Overseer$ClusterStateUpdater.updateState Collection already exists with numShards=2
[junit4:junit4]   2> 11322 T2290 oasc.Overseer$ClusterStateUpdater.updateState Assigning new node to shard shard=shard1
[junit4:junit4]   2> 11329 T2289 oascc.ZkStateReader$2.process A cluster state change: WatchedEvent state:SyncConnected type:NodeDataChanged path:/clusterstate.json, has occurred - updating... (live nodes size: 4)
[junit4:junit4]   2> 11329 T2308 oascc.ZkStateReader$2.process A cluster state change: WatchedEvent state:SyncConnected type:NodeDataChanged path:/clusterstate.json, has occurred - updating... (live nodes size: 4)
[junit4:junit4]   2> 11329 T2295 oascc.ZkStateReader$2.process A cluster state change: WatchedEvent state:SyncConnected type:NodeDataChanged path:/clusterstate.json, has occurred - updating... (live nodes size: 4)
[junit4:junit4]   2> 11329 T2338 oascc.ZkStateReader$2.process A cluster state change: WatchedEvent state:SyncConnected type:NodeDataChanged path:/clusterstate.json, has occurred - updating... (live nodes size: 4)
[junit4:junit4]   2> 11330 T2323 oascc.ZkStateReader$2.process A cluster state change: WatchedEvent state:SyncConnected type:NodeDataChanged path:/clusterstate.json, has occurred - updating... (live nodes size: 4)
[junit4:junit4]   2> 12046 T2339 oasc.CoreContainer.registerCore registering core: collection1
[junit4:junit4]   2> 12047 T2339 oasc.ZkController.register Register replica - core:collection1 address:http://127.0.0.1:51793 collection:collection1 shard:shard1
[junit4:junit4]   2> 12064 T2339 oasc.ZkController.register We are http://127.0.0.1:51793/collection1/ and leader is http://127.0.0.1:51787/collection1/
[junit4:junit4]   2> 12064 T2339 oasc.ZkController.register No LogReplay needed for core=collection1 baseURL=http://127.0.0.1:51793
[junit4:junit4]   2> 12065 T2339 oasc.ZkController.checkRecovery Core needs to recover:collection1
[junit4:junit4]   2> 12065 T2339 oasu.DefaultSolrCoreState.doRecovery Running recovery - first canceling any ongoing recovery
[junit4:junit4]   2> ASYNC  NEW_CORE C175 name=collection1 org.apache.solr.core.SolrCore@40aed43a url=http://127.0.0.1:51793/collection1 node=127.0.0.1:51793_ C175_STATE=coll:collection1 core:collection1 props:{shard=null, roles=null, state=down, core=collection1, collection=collection1, node_name=127.0.0.1:51793_, base_url=http://127.0.0.1:51793}
[junit4:junit4]   2> 12068 T2341 C175 P51793 oasc.RecoveryStrategy.run Starting recovery process.  core=collection1 recoveringAfterStartup=true
[junit4:junit4]   2> 12069 T2341 C175 P51793 oasc.RecoveryStrategy.doRecovery ###### startupVersions=[]
[junit4:junit4]   2> 12068 T2339 oascc.ZkStateReader.updateClusterState Updating cloud state from ZooKeeper... 
[junit4:junit4]   2> 12069 T2341 C175 P51793 oasc.ZkController.publish publishing core=collection1 state=recovering
[junit4:junit4]   2> 12070 T2341 C175 P51793 oasc.ZkController.publish numShards not found on descriptor - reading it from system property
[junit4:junit4]   2> 12072 T2341 C175 P51793 oascsi.HttpClientUtil.createClient Creating new http client, config:maxConnections=128&maxConnectionsPerHost=32&followRedirects=false
[junit4:junit4]   2> 12071 T2267 oass.SolrDispatchFilter.init user.dir=/Users/jenkins/jenkins-slave/workspace/Lucene-Solr-4.x-MacOSX/solr/build/solr-core/test/J0
[junit4:junit4]   2> 12072 T2267 oass.SolrDispatchFilter.init SolrDispatchFilter.init() done
[junit4:junit4]   2> 12073 T2267 oascsi.HttpClientUtil.createClient Creating new http client, config:maxConnections=128&maxConnectionsPerHost=32&followRedirects=false
[junit4:junit4]   2> 12381 T2267 oejs.Server.doStart jetty-8.1.8.v20121106
[junit4:junit4]   2> 12387 T2267 oejs.AbstractConnector.doStart Started SelectChannelConnector@127.0.0.1:51797
[junit4:junit4]   2> 12389 T2267 oass.SolrDispatchFilter.init SolrDispatchFilter.init()
[junit4:junit4]   2> 12390 T2267 oasc.SolrResourceLoader.locateSolrHome JNDI not configured for solr (NoInitialContextEx)
[junit4:junit4]   2> 12391 T2267 oasc.SolrResourceLoader.locateSolrHome using system property solr.solr.home: /Users/jenkins/jenkins-slave/workspace/Lucene-Solr-4.x-MacOSX/solr/build/solr-core/test/J0/./org.apache.solr.cloud.BasicDistributedZkTest-jetty4-1360609488350
[junit4:junit4]   2> 12392 T2267 oasc.CoreContainer$Initializer.initialize looking for solr.xml: /Users/jenkins/jenkins-slave/workspace/Lucene-Solr-4.x-MacOSX/solr/build/solr-core/test/J0/./org.apache.solr.cloud.BasicDistributedZkTest-jetty4-1360609488350/solr.xml
[junit4:junit4]   2> 12392 T2267 oasc.CoreContainer.<init> New CoreContainer 401229782
[junit4:junit4]   2> 12394 T2267 oasc.CoreContainer.load Loading CoreContainer using Solr Home: '/Users/jenkins/jenkins-slave/workspace/Lucene-Solr-4.x-MacOSX/solr/build/solr-core/test/J0/./org.apache.solr.cloud.BasicDistributedZkTest-jetty4-1360609488350/'
[junit4:junit4]   2> 12394 T2267 oasc.SolrResourceLoader.<init> new SolrResourceLoader for directory: '/Users/jenkins/jenkins-slave/workspace/Lucene-Solr-4.x-MacOSX/solr/build/solr-core/test/J0/./org.apache.solr.cloud.BasicDistributedZkTest-jetty4-1360609488350/'
[junit4:junit4]   2> 12468 T2267 oashc.HttpShardHandlerFactory.getParameter Setting socketTimeout to: 60000
[junit4:junit4]   2> 12469 T2267 oashc.HttpShardHandlerFactory.getParameter Setting urlScheme to: http://
[junit4:junit4]   2> 12470 T2267 oashc.HttpShardHandlerFactory.getParameter Setting connTimeout to: 15000
[junit4:junit4]   2> 12470 T2267 oashc.HttpShardHandlerFactory.getParameter Setting maxConnectionsPerHost to: 20
[junit4:junit4]   2> 12471 T2267 oashc.HttpShardHandlerFactory.getParameter Setting corePoolSize to: 0
[junit4:junit4]   2> 12472 T2267 oashc.HttpShardHandlerFactory.getParameter Setting maximumPoolSize to: 2147483647
[junit4:junit4]   2> 12473 T2267 oashc.HttpShardHandlerFactory.getParameter Setting maxThreadIdleTime to: 5
[junit4:junit4]   2> 12475 T2267 oashc.HttpShardHandlerFactory.getParameter Setting sizeOfQueue to: -1
[junit4:junit4]   2> 12475 T2267 oashc.HttpShardHandlerFactory.getParameter Setting fairnessPolicy to: false
[junit4:junit4]   2> 12476 T2267 oascsi.HttpClientUtil.createClient Creating new http client, config:maxConnectionsPerHost=20&maxConnections=10000&socketTimeout=60000&connTimeout=15000&retry=false
[junit4:junit4]   2> 12499 T2267 oasc.CoreContainer.load Registering Log Listener
[junit4:junit4]   2> 12532 T2267 oasc.CoreContainer.initZooKeeper Zookeeper client=127.0.0.1:51780/solr
[junit4:junit4]   2> 12533 T2267 oasc.ZkController.checkChrootPath zkHost includes chroot
[junit4:junit4]   2> 12533 T2267 oaz.ZooKeeper.<init> Initiating client connection, connectString=127.0.0.1:51780 sessionTimeout=60000 watcher=org.apache.solr.common.cloud.ConnectionManager@49a33c9b
[junit4:junit4]   2> 12535 T2267 oascc.ConnectionManager.waitForConnected Waiting for client to connect to ZooKeeper
[junit4:junit4]   2> 12536 T2351 oaz.ClientCnxn$SendThread.logStartConnect Opening socket connection to server localhost/127.0.0.1:51780. Will not attempt to authenticate using SASL (access denied ("javax.security.auth.AuthPermission" "getLoginConfiguration"))
[junit4:junit4]   2> 12538 T2351 oaz.ClientCnxn$SendThread.primeConnection Socket connection established to localhost/127.0.0.1:51780, initiating session
[junit4:junit4]   2> 12539 T2269 oazs.NIOServerCnxnFactory.run Accepted socket connection from /127.0.0.1:51798
[junit4:junit4]   2> 12540 T2269 oazs.ZooKeeperServer.processConnectRequest Client attempting to establish new session at /127.0.0.1:51798
[junit4:junit4]   2> 12560 T2271 oazs.ZooKeeperServer.finishSessionInit Established session 0x13ccaa4febd000b with negotiated timeout 20000 for client /127.0.0.1:51798
[junit4:junit4]   2> 12560 T2351 oaz.ClientCnxn$SendThread.onConnected Session establishment complete on server localhost/127.0.0.1:51780, sessionid = 0x13ccaa4febd000b, negotiated timeout = 20000
[junit4:junit4]   2> 12561 T2352 oascc.ConnectionManager.process Watcher org.apache.solr.common.cloud.ConnectionManager@49a33c9b name:ZooKeeperConnection Watcher:127.0.0.1:51780 got event WatchedEvent state:SyncConnected type:None path:null path:null type:None
[junit4:junit4]   2> 12561 T2267 oascc.ConnectionManager.waitForConnected Client is connected to ZooKeeper
[junit4:junit4]   2> 12564 T2272 oazs.PrepRequestProcessor.pRequest2Txn Processed session termination for sessionid: 0x13ccaa4febd000b
[junit4:junit4]   2> 12565 T2267 oaz.ZooKeeper.close Session: 0x13ccaa4febd000b closed
[junit4:junit4]   2> 12566 T2267 oascsi.HttpClientUtil.createClient Creating new http client, config:maxConnections=500&maxConnectionsPerHost=16&socketTimeout=60000&connTimeout=15000
[junit4:junit4]   2> 12572 T2269 oazs.NIOServerCnxn.closeSock Closed socket connection for client /127.0.0.1:51798 which had sessionid 0x13ccaa4febd000b
[junit4:junit4]   2> 12573 T2352 oaz.ClientCnxn$EventThread.run EventThread shut down
[junit4:junit4]   2> 12587 T2267 oaz.ZooKeeper.<init> Initiating client connection, connectString=127.0.0.1:51780/solr sessionTimeout=30000 watcher=org.apache.solr.common.cloud.ConnectionManager@37708dc5
[junit4:junit4]   2> 12591 T2353 oaz.ClientCnxn$SendThread.logStartConnect Opening socket connection to server localhost/127.0.0.1:51780. Will not attempt to authenticate using SASL (access denied ("javax.security.auth.AuthPermission" "getLoginConfiguration"))
[junit4:junit4]   2> 12592 T2353 oaz.ClientCnxn$SendThread.primeConnection Socket connection established to localhost/127.0.0.1:51780, initiating session
[junit4:junit4]   2> 12593 T2267 oascc.ConnectionManager.waitForConnected Waiting for client to connect to ZooKeeper
[junit4:junit4]   2> 12595 T2269 oazs.NIOServerCnxnFactory.run Accepted socket connection from /127.0.0.1:51799
[junit4:junit4]   2> 12596 T2269 oazs.ZooKeeperServer.processConnectRequest Client attempting to establish new session at /127.0.0.1:51799
[junit4:junit4]   2> 12599 T2271 oazs.ZooKeeperServer.finishSessionInit Established session 0x13ccaa4febd000c with negotiated timeout 20000 for client /127.0.0.1:51799
[junit4:junit4]   2> 12599 T2353 oaz.ClientCnxn$SendThread.onConnected Session establishment complete on server localhost/127.0.0.1:51780, sessionid = 0x13ccaa4febd000c, negotiated timeout = 20000
[junit4:junit4]   2> 12600 T2354 oascc.ConnectionManager.process Watcher org.apache.solr.common.cloud.ConnectionManager@37708dc5 name:ZooKeeperConnection Watcher:127.0.0.1:51780/solr got event WatchedEvent state:SyncConnected type:None path:null path:null type:None
[junit4:junit4]   2> 12601 T2267 oascc.ConnectionManager.waitForConnected Client is connected to ZooKeeper
[junit4:junit4]   2> 12605 T2272 oazs.PrepRequestProcessor.pRequest Got user-level KeeperException when processing sessionid:0x13ccaa4febd000c type:create cxid:0x1 zxid:0x9f txntype:-1 reqpath:n/a Error Path:/solr/overseer Error:KeeperErrorCode = NodeExists for /solr/overseer
[junit4:junit4]   2> 12608 T2272 oazs.PrepRequestProcessor.pRequest Got user-level KeeperException when processing sessionid:0x13ccaa4febd000c type:create cxid:0x2 zxid:0xa0 txntype:-1 reqpath:n/a Error Path:/solr/overseer Error:KeeperErrorCode = NodeExists for /solr/overseer
[junit4:junit4]   2> 12612 T2267 oascc.ZkStateReader.createClusterStateWatchersAndUpdate Updating cluster state from ZooKeeper... 
[junit4:junit4]   2> 12619 T2267 oasc.ZkController.createEphemeralLiveNode Register node as live in ZooKeeper:/live_nodes/127.0.0.1:51797_
[junit4:junit4]   2> 12621 T2272 oazs.PrepRequestProcessor.pRequest Got user-level KeeperException when processing sessionid:0x13ccaa4febd000c type:delete cxid:0x9 zxid:0xa1 txntype:-1 reqpath:n/a Error Path:/solr/live_nodes/127.0.0.1:51797_ Error:KeeperErrorCode = NoNode for /solr/live_nodes/127.0.0.1:51797_
[junit4:junit4]   2> 12623 T2267 oascc.SolrZkClient.makePath makePath: /live_nodes/127.0.0.1:51797_
[junit4:junit4]   2> 12629 T2308 oascc.ZkStateReader$2.process A cluster state change: WatchedEvent state:SyncConnected type:NodeChildrenChanged path:/live_nodes, has occurred - updating... (live nodes size: 4)
[junit4:junit4]   2> 12630 T2323 oascc.ZkStateReader$2.process A cluster state change: WatchedEvent state:SyncConnected type:NodeChildrenChanged path:/live_nodes, has occurred - updating... (live nodes size: 4)
[junit4:junit4]   2> 12630 T2295 oascc.ZkStateReader$2.process A cluster state change: WatchedEvent state:SyncConnected type:NodeChildrenChanged path:/live_nodes, has occurred - updating... (live nodes size: 4)
[junit4:junit4]   2> 12630 T2289 oascc.ZkStateReader$2.process A cluster state change: WatchedEvent state:SyncConnected type:NodeChildrenChanged path:/live_nodes, has occurred - updating... (live nodes size: 4)
[junit4:junit4]   2> 12635 T2338 oascc.ZkStateReader$3.process Updating live nodes... (5)
[junit4:junit4]   2> 12636 T2338 oascc.ZkStateReader$2.process A cluster state change: WatchedEvent state:SyncConnected type:NodeChildrenChanged path:/live_nodes, has occurred - updating... (live nodes size: 5)
[junit4:junit4]   2> 12641 T2354 oascc.ZkStateReader$3.process Updating live nodes... (5)
[junit4:junit4]   2> 12642 T2295 oascc.ZkStateReader$3.process Updating live nodes... (5)
[junit4:junit4]   2> 12642 T2308 oascc.ZkStateReader$3.process Updating live nodes... (5)
[junit4:junit4]   2> 12643 T2323 oascc.ZkStateReader$3.process Updating live nodes... (5)
[junit4:junit4]   2> 12644 T2289 oascc.ZkStateReader$3.process Updating live nodes... (5)
[junit4:junit4]   2> 12660 T2355 oasc.CoreContainer.create Creating SolrCore 'collection1' using instanceDir: /Users/jenkins/jenkins-slave/workspace/Lucene-Solr-4.x-MacOSX/solr/build/solr-core/test/J0/./org.apache.solr.cloud.BasicDistributedZkTest-jetty4-1360609488350/collection1
[junit4:junit4]   2> 12661 T2355 oasc.ZkController.createCollectionZkNode Check for collection zkNode:collection1
[junit4:junit4]   2> 12662 T2355 oasc.ZkController.createCollectionZkNode Collection zkNode exists
[junit4:junit4]   2> 12662 T2355 oasc.ZkController.readConfigName Load collection config from:/collections/collection1
[junit4:junit4]   2> 12666 T2355 oasc.SolrResourceLoader.<init> new SolrResourceLoader for directory: '/Users/jenkins/jenkins-slave/workspace/Lucene-Solr-4.x-MacOSX/solr/build/solr-core/test/J0/./org.apache.solr.cloud.BasicDistributedZkTest-jetty4-1360609488350/collection1/'
[junit4:junit4]   2> 12668 T2355 oasc.SolrResourceLoader.replaceClassLoader Adding 'file:/Users/jenkins/jenkins-slave/workspace/Lucene-Solr-4.x-MacOSX/solr/build/solr-core/test/J0/org.apache.solr.cloud.BasicDistributedZkTest-jetty4-1360609488350/collection1/lib/classes/' to classloader
[junit4:junit4]   2> 12669 T2355 oasc.SolrResourceLoader.replaceClassLoader Adding 'file:/Users/jenkins/jenkins-slave/workspace/Lucene-Solr-4.x-MacOSX/solr/build/solr-core/test/J0/org.apache.solr.cloud.BasicDistributedZkTest-jetty4-1360609488350/collection1/lib/README' to classloader
[junit4:junit4]   2> 12759 T2355 oasc.SolrConfig.<init> Using Lucene MatchVersion: LUCENE_42
[junit4:junit4]   2> 12848 T2290 oascc.ZkStateReader.updateClusterState Updating cloud state from ZooKeeper... 
[junit4:junit4]   2> 12849 T2290 oasc.Overseer$ClusterStateUpdater.updateState Update state numShards=2 message={
[junit4:junit4]   2> 	  "operation":"state",
[junit4:junit4]   2> 	  "numShards":"2",
[junit4:junit4]   2> 	  "shard":"shard1",
[junit4:junit4]   2> 	  "roles":null,
[junit4:junit4]   2> 	  "state":"recovering",
[junit4:junit4]   2> 	  "core":"collection1",
[junit4:junit4]   2> 	  "collection":"collection1",
[junit4:junit4]   2> 	  "node_name":"127.0.0.1:51793_",
[junit4:junit4]   2> 	  "base_url":"http://127.0.0.1:51793"}
[junit4:junit4]   2> 12860 T2289 oascc.ZkStateReader$2.process A cluster state change: WatchedEvent state:SyncConnected type:NodeDataChanged path:/clusterstate.json, has occurred - updating... (live nodes size: 5)
[junit4:junit4]   2> 12861 T2308 oascc.ZkStateReader$2.process A cluster state change: WatchedEvent state:SyncConnected type:NodeDataChanged path:/clusterstate.json, has occurred - updating... (live nodes size: 5)
[junit4:junit4]   2> 12861 T2338 oascc.ZkStateReader$2.process A cluster state change: WatchedEvent state:SyncConnected type:NodeDataChanged path:/clusterstate.json, has occurred - updating... (live nodes size: 5)
[junit4:junit4]   2> 12866 T2323 oascc.ZkStateReader$2.process A cluster state change: WatchedEvent state:SyncConnected type:NodeDataChanged path:/clusterstate.json, has occurred - updating... (live nodes size: 5)
[junit4:junit4]   2> 12866 T2354 oascc.ZkStateReader$2.process A cluster state change: WatchedEvent state:SyncConnected type:NodeDataChanged path:/clusterstate.json, has occurred - updating... (live nodes size: 5)
[junit4:junit4]   2> 12874 T2295 oascc.ZkStateReader$2.process A cluster state change: WatchedEvent state:SyncConnected type:NodeDataChanged path:/clusterstate.json, has occurred - updating... (live nodes size: 5)
[junit4:junit4]   2> 12887 T2355 oasc.SolrConfig.<init> Loaded SolrConfig: solrconfig.xml
[junit4:junit4]   2> 12889 T2355 oass.IndexSchema.readSchema Reading Solr Schema
[junit4:junit4]   2> 12900 T2355 oass.IndexSchema.readSchema Schema name=test
[junit4:junit4]   2> 13618 T2355 oass.OpenExchangeRatesOrgProvider.init Initialized with rates=open-exchange-rates.json, refreshInterval=1440.
[junit4:junit4]   2> 13626 T2355 oass.IndexSchema.readSchema default search field in schema is text
[junit4:junit4]   2> 13630 T2355 oass.IndexSchema.readSchema unique key field: id
[junit4:junit4]   2> 13658 T2355 oass.FileExchangeRateProvider.reload Reloading exchange rates from file currency.xml
[junit4:junit4]   2> 13666 T2355 oass.FileExchangeRateProvider.reload Reloading exchange rates from file currency.xml
[junit4:junit4]   2> 13672 T2355 oass.OpenExchangeRatesOrgProvider.reload Reloading exchange rates from open-exchange-rates.json
[junit4:junit4]   2> 13676 T2355 oass.OpenExchangeRatesOrgProvider.reload Reloading exchange rates from open-exchange-rates.json
[junit4:junit4]   2> 13679 T2355 oasc.SolrCore.<init> [collection1] Opening new SolrCore at /Users/jenkins/jenkins-slave/workspace/Lucene-Solr-4.x-MacOSX/solr/build/solr-core/test/J0/./org.apache.solr.cloud.BasicDistributedZkTest-jetty4-1360609488350/collection1/, dataDir=./org.apache.solr.cloud.BasicDistributedZkTest-1360609476277/jetty4/
[junit4:junit4]   2> 13679 T2355 oasc.JmxMonitoredMap.<init> JMX monitoring is enabled. Adding Solr mbeans to JMX Server: com.sun.jmx.mbeanserver.JmxMBeanServer@1dfc617e
[junit4:junit4]   2> 13680 T2355 oasc.SolrCore.initDirectoryFactory solr.StandardDirectoryFactory
[junit4:junit4]   2> 13681 T2355 oasc.CachingDirectoryFactory.get return new directory for /Users/jenkins/jenkins-slave/workspace/Lucene-Solr-4.x-MacOSX/solr/build/solr-core/test/J0/./org.apache.solr.cloud.BasicDistributedZkTest-1360609476277/jetty4 forceNew:false
[junit4:junit4]   2> 13681 T2355 oasc.CachingDirectoryFactory.close Releasing directory:/Users/jenkins/jenkins-slave/workspace/Lucene-Solr-4.x-MacOSX/solr/build/solr-core/test/J0/./org.apache.solr.cloud.BasicDistributedZkTest-1360609476277/jetty4
[junit4:junit4]   2> 13681 T2355 oasc.SolrCore.getNewIndexDir New index directory detected: old=null new=./org.apache.solr.cloud.BasicDistributedZkTest-1360609476277/jetty4/index/
[junit4:junit4]   2> 13682 T2355 oasc.SolrCore.initIndex WARNING [collection1] Solr index directory './org.apache.solr.cloud.BasicDistributedZkTest-1360609476277/jetty4/index' doesn't exist. Creating new index...
[junit4:junit4]   2> 13684 T2355 oasc.CachingDirectoryFactory.get return new directory for /Users/jenkins/jenkins-slave/workspace/Lucene-Solr-4.x-MacOSX/solr/build/solr-core/test/J0/./org.apache.solr.cloud.BasicDistributedZkTest-1360609476277/jetty4/index forceNew:false
[junit4:junit4]   2> 13689 T2355 oasc.SolrDeletionPolicy.onCommit SolrDeletionPolicy.onCommit: commits:num=1
[junit4:junit4]   2> 		commit{dir=RateLimitedDirectoryWrapper(org.apache.lucene.store.NIOFSDirectory@/Users/jenkins/jenkins-slave/workspace/Lucene-Solr-4.x-MacOSX/solr/build/solr-core/test/J0/org.apache.solr.cloud.BasicDistributedZkTest-1360609476277/jetty4/index lockFactory=org.apache.lucene.store.NativeFSLockFactory@34fc9590),segFN=segments_1,generation=1,filenames=[segments_1]
[junit4:junit4]   2> 13689 T2355 oasc.SolrDeletionPolicy.updateCommits newest commit = 1[segments_1]
[junit4:junit4]   2> 13690 T2355 oasc.CachingDirectoryFactory.close Releasing directory:/Users/jenkins/jenkins-slave/workspace/Lucene-Solr-4.x-MacOSX/solr/build/solr-core/test/J0/./org.apache.solr.cloud.BasicDistributedZkTest-1360609476277/jetty4/index
[junit4:junit4]   2> 13690 T2355 oasc.SolrCore.initWriters created xml: solr.XMLResponseWriter
[junit4:junit4]   2> 13693 T2355 oasup.UpdateRequestProcessorChain.init inserting DistributedUpdateProcessorFactory into updateRequestProcessorChain "dedupe"
[junit4:junit4]   2> 13693 T2355 oasup.UpdateRequestProcessorChain.init inserting DistributedUpdateProcessorFactory into updateRequestProcessorChain "dedupe-allfields"
[junit4:junit4]   2> 13694 T2355 oasup.UpdateRequestProcessorChain.init inserting DistributedUpdateProcessorFactory into updateRequestProcessorChain "stored_sig"
[junit4:junit4]   2> 13695 T2355 oasup.UpdateRequestProcessorChain.init inserting DistributedUpdateProcessorFactory into updateRequestProcessorChain "uniq-fields"
[junit4:junit4]   2> 13696 T2355 oasup.UpdateRequestProcessorChain.init inserting DistributedUpdateProcessorFactory into updateRequestProcessorChain "distrib-dup-test-chain-implicit"
[junit4:junit4]   2> 13696 T2355 oasc.RequestHandlers.initHandlersFromConfig adding lazy requestHandler: solr.ReplicationHandler
[junit4:junit4]   2> 13697 T2355 oasc.RequestHandlers.initHandlersFromConfig created /replication: solr.ReplicationHandler
[junit4:junit4]   2> 13698 T2355 oasc.RequestHandlers.initHandlersFromConfig created standard: solr.StandardRequestHandler
[junit4:junit4]   2> 13698 T2355 oasc.RequestHandlers.initHandlersFromConfig created /get: solr.RealTimeGetHandler
[junit4:junit4]   2> 13699 T2355 oasc.RequestHandlers.initHandlersFromConfig created dismax: solr.SearchHandler
[junit4:junit4]   2> 13700 T2355 oasc.RequestHandlers.initHandlersFromConfig created mock: org.apache.solr.core.MockQuerySenderListenerReqHandler
[junit4:junit4]   2> 13701 T2355 oasc.RequestHandlers.initHandlersFromConfig created /admin/: org.apache.solr.handler.admin.AdminHandlers
[junit4:junit4]   2> 13701 T2355 oasc.RequestHandlers.initHandlersFromConfig created defaults: solr.StandardRequestHandler
[junit4:junit4]   2> 13702 T2355 oasc.RequestHandlers.initHandlersFromConfig adding lazy requestHandler: solr.StandardRequestHandler
[junit4:junit4]   2> 13702 T2355 oasc.RequestHandlers.initHandlersFromConfig created lazy: solr.StandardRequestHandler
[junit4:junit4]   2> 13703 T2355 oasc.RequestHandlers.initHandlersFromConfig created /update: solr.UpdateRequestHandler
[junit4:junit4]   2> 13703 T2355 oasc.RequestHandlers.initHandlersFromConfig created /terms: org.apache.solr.handler.component.SearchHandler
[junit4:junit4]   2> 13704 T2355 oasc.RequestHandlers.initHandlersFromConfig created spellCheckCompRH: org.apache.solr.handler.component.SearchHandler
[junit4:junit4]   2> 13705 T2355 oasc.RequestHandlers.initHandlersFromConfig created spellCheckCompRH_Direct: org.apache.solr.handler.component.SearchHandler
[junit4:junit4]   2> 13705 T2355 oasc.RequestHandlers.initHandlersFromConfig created spellCheckWithWordbreak: org.apache.solr.handler.component.SearchHandler
[junit4:junit4]   2> 13706 T2355 oasc.RequestHandlers.initHandlersFromConfig created spellCheckWithWordbreak_Direct: org.apache.solr.handler.component.SearchHandler
[junit4:junit4]   2> 13707 T2355 oasc.RequestHandlers.initHandlersFromConfig created spellCheckCompRH1: org.apache.solr.handler.component.SearchHandler
[junit4:junit4]   2> 13707 T2355 oasc.RequestHandlers.initHandlersFromConfig created mltrh: org.apache.solr.handler.component.SearchHandler
[junit4:junit4]   2> 13708 T2355 oasc.RequestHandlers.initHandlersFromConfig created tvrh: org.apache.solr.handler.component.SearchHandler
[junit4:junit4]   2> 13709 T2355 oasc.RequestHandlers.initHandlersFromConfig created /mlt: solr.MoreLikeThisHandler
[junit4:junit4]   2> 13709 T2355 oasc.RequestHandlers.initHandlersFromConfig created /debug/dump: solr.DumpRequestHandler
[junit4:junit4]   2> 13717 T2355 oashl.XMLLoader.init xsltCacheLifetimeSeconds=60
[junit4:junit4]   2> 13721 T2355 oasc.SolrCore.initDeprecatedSupport WARNING solrconfig.xml uses deprecated <admin/gettableFiles>, Please update your config to use the ShowFileRequestHandler.
[junit4:junit4]   2> 13723 T2355 oasc.SolrCore.initDeprecatedSupport WARNING adding ShowFileRequestHandler with hidden files: [SCHEMA.XML, OLD_SYNONYMS.TXT, STOPWORDS.TXT, PROTWORDS.TXT, OPEN-EXCHANGE-RATES.JSON, SYNONYMS.TXT, CURRENCY.XML, MAPPING-ISOLATIN1ACCENT.TXT]
[junit4:junit4]   2> 13726 T2355 oasc.CachingDirectoryFactory.close Releasing directory:/Users/jenkins/jenkins-slave/workspace/Lucene-Solr-4.x-MacOSX/solr/build/solr-core/test/J0/./org.apache.solr.cloud.BasicDistributedZkTest-1360609476277/jetty4
[junit4:junit4]   2> 13727 T2355 oass.SolrIndexSearcher.<init> Opening Searcher@399f8a5b main
[junit4:junit4]   2> 13728 T2355 oasu.CommitTracker.<init> Hard AutoCommit: disabled
[junit4:junit4]   2> 13729 T2355 oasu.CommitTracker.<init> Soft AutoCommit: disabled
[junit4:junit4]   2> 13729 T2355 oashc.SpellCheckComponent.inform Initializing spell checkers
[junit4:junit4]   2> 13736 T2355 oass.DirectSolrSpellChecker.init init: {name=direct,classname=DirectSolrSpellChecker,field=lowerfilt,minQueryLength=3}
[junit4:junit4]   2> 13773 T2356 oasc.SolrCore.registerSearcher [collection1] Registered new searcher Searcher@399f8a5b main{StandardDirectoryReader(segments_1:1)}
[junit4:junit4]   2> 13781 T2355 oasc.ZkController.publish publishing core=collection1 state=down
[junit4:junit4]   2> 13781 T2355 oasc.ZkController.publish numShards not found on descriptor - reading it from system property
[junit4:junit4]   2> 14379 T2290 oascc.ZkStateReader.updateClusterState Updating cloud state from ZooKeeper... 
[junit4:junit4]   2> 14381 T2290 oasc.Overseer$ClusterStateUpdater.updateState Update state numShards=2 message={
[junit4:junit4]   2> 	  "operation":"state",
[junit4:junit4]   2> 	  "numShards":"2",
[junit4:junit4]   2> 	  "shard":null,
[junit4:junit4]   2> 	  "roles":null,
[junit4:junit4]   2> 	  "state":"down",
[junit4:junit4]   2> 	  "core":"collection1",
[junit4:junit4]   2> 	  "collection":"collection1",
[junit4:junit4]   2> 	  "node_name":"127.0.0.1:51797_",
[junit4:junit4]   2> 	  "base_url":"http://127.0.0.1:51797"}
[junit4:junit4]   2> 14381 T2290 oasc.Overseer$ClusterStateUpdater.updateState Collection already exists with numShards=2
[junit4:junit4]   2> 14381 T2290 oasc.Overseer$ClusterStateUpdater.updateState Assigning new node to shard shard=shard2
[junit4:junit4]   2> 14391 T2289 oascc.ZkStateReader$2.process A cluster state change: WatchedEvent state:SyncConnected type:NodeDataChanged path:/clusterstate.json, has occurred - updating... (live nodes size: 5)
[junit4:junit4]   2> 14391 T2354 oascc.ZkStateReader$2.process A cluster state change: WatchedEvent state:SyncConnected type:NodeDataChanged path:/clusterstate.json, has occurred - updating... (live nodes size: 5)
[junit4:junit4]   2> 14391 T2308 oascc.ZkStateReader$2.process A cluster state change: WatchedEvent state:SyncConnected type:NodeDataChanged path:/clusterstate.json, has occurred - updating... (live nodes size: 5)
[junit4:junit4]   2> 14392 T2295 oascc.ZkStateReader$2.process A cluster state change: WatchedEvent state:SyncConnected type:NodeDataChanged path:/clusterstate.json, has occurred - updating... (live nodes size: 5)
[junit4:junit4]   2> 14392 T2338 oascc.ZkStateReader$2.process A cluster state change: WatchedEvent state:SyncConnected type:NodeDataChanged path:/clusterstate.json, has occurred - updating... (live nodes size: 5)
[junit4:junit4]   2> 14392 T2323 oascc.ZkStateReader$2.process A cluster state change: WatchedEvent state:SyncConnected type:NodeDataChanged path:/clusterstate.json, has occurred - updating... (live nodes size: 5)
[junit4:junit4]   2> 14786 T2355 oasc.CoreContainer.registerCore registering core: collection1
[junit4:junit4]   2> 14787 T2355 oasc.ZkController.register Register replica - core:collection1 address:http://127.0.0.1:51797 collection:collection1 shard:shard2
[junit4:junit4]   2> 14798 T2355 oasc.ZkController.register We are http://127.0.0.1:51797/collection1/ and leader is http://127.0.0.1:51790/collection1/
[junit4:junit4]   2> 14799 T2355 oasc.ZkController.register No LogReplay needed for core=collection1 baseURL=http://127.0.0.1:51797
[junit4:junit4]   2> 14799 T2355 oasc.ZkController.checkRecovery Core needs to recover:collection1
[junit4:junit4]   2> 14800 T2355 oasu.DefaultSolrCoreState.doRecovery Running recovery - first canceling any ongoing recovery
[junit4:junit4]   2> ASYNC  NEW_CORE C176 name=collection1 org.apache.solr.core.SolrCore@31e02fb8 url=http://127.0.0.1:51797/collection1 node=127.0.0.1:51797_ C176_STATE=coll:collection1 core:collection1 props:{shard=null, roles=null, state=down, core=collection1, collection=collection1, node_name=127.0.0.1:51797_, base_url=http://127.0.0.1:51797}
[junit4:junit4]   2> 14803 T2357 C176 P51797 oasc.RecoveryStrategy.run Starting recovery process.  core=collection1 recoveringAfterStartup=true
[junit4:junit4]   2> 14803 T2355 oascc.ZkStateReader.updateClusterState Updating cloud state from ZooKeeper... 
[junit4:junit4]   2> 14804 T2357 C176 P51797 oasc.RecoveryStrategy.doRecovery ###### startupVersions=[]
[junit4:junit4]   2> 14804 T2357 C176 P51797 oasc.ZkController.publish publishing core=collection1 state=recovering
[junit4:junit4]   2> 14805 T2357 C176 P51797 oasc.ZkController.publish numShards not found on descriptor - reading it from system property
[junit4:junit4]   2> 14806 T2267 oass.SolrDispatchFilter.init user.dir=/Users/jenkins/jenkins-slave/workspace/Lucene-Solr-4.x-MacOSX/solr/build/solr-core/test/J0
[junit4:junit4]   2> 14807 T2267 oass.SolrDispatchFilter.init SolrDispatchFilter.init() done
[junit4:junit4]   2> 14807 T2357 C176 P51797 oascsi.HttpClientUtil.createClient Creating new http client, config:maxConnections=128&maxConnectionsPerHost=32&followRedirects=false
[junit4:junit4]   2> 14808 T2267 oascsi.HttpClientUtil.createClient Creating new http client, config:maxConnections=128&maxConnectionsPerHost=32&followRedirects=false
[junit4:junit4]   2> 14834 T2267 oascc.ZkStateReader.updateClusterState Updating cloud state from ZooKeeper... 
[junit4:junit4]   2> 14836 T2267 oasc.AbstractDistribZkTestBase.waitForRecoveriesToFinish Wait for recoveries to finish - collection: collection1 failOnTimeout:true timeout (sec):230
[junit4:junit4]   2> 14838 T2267 oascc.ZkStateReader.updateClusterState Updating cloud state from ZooKeeper... 
[junit4:junit4]   2>  C175_STATE=coll:collection1 core:collection1 props:{shard=shard1, roles=null, state=recovering, core=collection1, collection=collection1, node_name=127.0.0.1:51793_, base_url=http://127.0.0.1:51793}
[junit4:junit4]   2> 15091 T2341 C175 P51793 oasc.RecoveryStrategy.doRecovery Attempting to PeerSync from http://127.0.0.1:51787/collection1/ core=collection1 - recoveringAfterStartup=true
[junit4:junit4]   2> 15091 T2341 C175 P51793 oasu.PeerSync.sync PeerSync: core=collection1 url=http://127.0.0.1:51793 START replicas=[http://127.0.0.1:51787/collection1/] nUpdates=100
[junit4:junit4]   2> 15092 T2341 C175 P51793 oasu.PeerSync.sync WARNING no frame of reference to tell of we've missed updates
[junit4:junit4]   2> 15093 T2341 C175 P51793 oasc.RecoveryStrategy.doRecovery PeerSync Recovery was not successful - trying replication. core=collection1
[junit4:junit4]   2> 15093 T2341 C175 P51793 oasc.RecoveryStrategy.doRecovery Starting Replication Recovery. core=collection1
[junit4:junit4]   2> 15093 T2341 C175 P51793 oasc.RecoveryStrategy.doRecovery Begin buffering updates. core=collection1
[junit4:junit4]   2> 15093 T2341 C175 P51793 oasu.UpdateLog.bufferUpdates Starting to buffer updates. FSUpdateLog{state=ACTIVE, tlog=null}
[junit4:junit4]   2> 15094 T2341 C175 P51793 oasc.RecoveryStrategy.replicate Attempting to replicate from http://127.0.0.1:51787/collection1/. core=collection1
[junit4:junit4]   2> 15094 T2341 C175 P51793 oascsi.HttpClientUtil.createClient Creating new http client, config:maxConnections=128&maxConnectionsPerHost=32&followRedirects=false
[junit4:junit4]   2> ASYNC  NEW_CORE C177 name=collection1 org.apache.solr.core.SolrCore@11706ff7 url=http://127.0.0.1:51787/collection1 node=127.0.0.1:51787_ C177_STATE=coll:collection1 core:collection1 props:{shard=shard1, roles=null, state=active, core=collection1, collection=collection1, node_name=127.0.0.1:51787_, base_url=http://127.0.0.1:51787, leader=true}
[junit4:junit4]   2> 15104 T2304 C177 P51787 oasu.DirectUpdateHandler2.commit start commit{,optimize=false,openSearcher=false,waitSearcher=true,expungeDeletes=false,softCommit=false}
[junit4:junit4]   2> 15106 T2304 C177 P51787 oasc.CachingDirectoryFactory.close Releasing directory:/Users/jenkins/jenkins-slave/workspace/Lucene-Solr-4.x-MacOSX/solr/build/solr-core/test/J0/./org.apache.solr.cloud.BasicDistributedZkTest-1360609476277/jetty1
[junit4:junit4]   2> 15109 T2304 C177 P51787 oasc.SolrDeletionPolicy.onInit SolrDeletionPolicy.onInit: commits:num=1
[junit4:junit4]   2> 		commit{dir=RateLimitedDirectoryWrapper(org.apache.lucene.store.NIOFSDirectory@/Users/jenkins/jenkins-slave/workspace/Lucene-Solr-4.x-MacOSX/solr/build/solr-core/test/J0/org.apache.solr.cloud.BasicDistributedZkTest-1360609476277/jetty1/index lockFactory=org.apache.lucene.store.NativeFSLockFactory@49548fe8),segFN=segments_1,generation=1,filenames=[segments_1]
[junit4:junit4]   2> 15110 T2301 C177 P51787 REQ /get {getVersions=100&distrib=false&wt=javabin&qt=/get&version=2} status=0 QTime=1 
[junit4:junit4]   2> 15110 T2304 C177 P51787 oasc.SolrDeletionPolicy.updateCommits newest commit = 1[segments_1]
[junit4:junit4]   2> 15113 T2304 C177 P51787 oasc.SolrDeletionPolicy.onCommit SolrDeletionPolicy.onCommit: commits:num=2
[junit4:junit4]   2> 		commit{dir=RateLimitedDirectoryWrapper(org.apache.lucene.store.NIOFSDirectory@/Users/jenkins/jenkins-slave/workspace/Lucene-Solr-4.x-MacOSX/solr/build/solr-core/test/J0/org.apache.solr.cloud.BasicDistributedZkTest-1360609476277/jetty1/index lockFactory=org.apache.lucene.store.NativeFSLockFactory@49548fe8),segFN=segments_1,generation=1,filenames=[segments_1]
[junit4:junit4]   2> 		commit{dir=RateLimitedDirectoryWrapper(org.apache.lucene.store.NIOFSDirectory@/Users/jenkins/jenkins-slave/workspace/Lucene-Solr-4.x-MacOSX/solr/build/solr-core/test/J0/org.apache.solr.cloud.BasicDistributedZkTest-1360609476277/jetty1/index lockFactory=org.apache.lucene.store.NativeFSLockFactory@49548fe8),segFN=segments_2,generation=2,filenames=[segments_2]
[junit4:junit4]   2> 15114 T2304 C177 P51787 oasc.SolrDeletionPolicy.updateCommits newest commit = 2[segments_2]
[junit4:junit4]   2> 15115 T2304 C177 P51787 oasc.CachingDirectoryFactory.close Releasing directory:/Users/jenkins/jenkins-slave/workspace/Lucene-Solr-4.x-MacOSX/solr/build/solr-core/test/J0/./org.apache.solr.cloud.BasicDistributedZkTest-1360609476277/jetty1
[junit4:junit4]   2> 15115 T2304 C177 P51787 oass.SolrIndexSearcher.<init> Opening Searcher@6b91e50b realtime
[junit4:junit4]   2> 15115 T2304 C177 P51787 oasu.DirectUpdateHandler2.commit end_commit_flush
[junit4:junit4]   2> 15116 T2304 C177 P51787 /update {waitSearcher=true&openSearcher=false&commit=true&wt=javabin&commit_end_point=true&version=2&softCommit=false} {commit=} 0 12
[junit4:junit4]   2> 15117 T2341 C175 P51793 oash.ReplicationHandler.inform Commits will be reserved for  10000
[junit4:junit4]   2> 15118 T2341 C175 P51793 oash.SnapPuller.<init>  No value set for 'pollInterval'. Timer Task not started.
[junit4:junit4]   2> 15121 T2302 C177 P51787 oash.ReplicationHandler.inform Commits will be reserved for  10000
[junit4:junit4]   2> 15122 T2302 C177 P51787 REQ /replication {command=indexversion&qt=/replication&wt=javabin&version=2} status=0 QTime=2 
[junit4:junit4]   2> 15122 T2341 C175 P51793 oash.SnapPuller.fetchLatestIndex Master's generation: 2
[junit4:junit4]   2> 15123 T2341 C175 P51793 oash.SnapPuller.fetchLatestIndex Slave's generation: 1
[junit4:junit4]   2> 15123 T2341 C175 P51793 oash.SnapPuller.fetchLatestIndex Starting replication process
[junit4:junit4]   2> 15125 T2303 C177 P51787 oasc.CachingDirectoryFactory.close Releasing directory:/Users/jenkins/jenkins-slave/workspace/Lucene-Solr-4.x-MacOSX/solr/build/solr-core/test/J0/./org.apache.solr.cloud.BasicDistributedZkTest-1360609476277/jetty1
[junit4:junit4]   2> 15126 T2303 C177 P51787 oasc.CachingDirectoryFactory.close Releasing directory:/Users/jenkins/jenkins-slave/workspace/Lucene-Solr-4.x-MacOSX/solr/build/solr-core/test/J0/./org.apache.solr.cloud.BasicDistributedZkTest-1360609476277/jetty1/index
[junit4:junit4]   2> 15127 T2303 C177 P51787 REQ /replication {command=filelist&qt=/replication&wt=javabin&generation=2&version=2} status=0 QTime=2 
[junit4:junit4]   2> 15127 T2341 C175 P51793 oash.SnapPuller.fetchLatestIndex Number of files in latest index in master: 1
[junit4:junit4]   2> 15129 T2341 C175 P51793 oasc.CachingDirectoryFactory.get return new directory for /Users/jenkins/jenkins-slave/workspace/Lucene-Solr-4.x-MacOSX/solr/build/solr-core/test/J0/./org.apache.solr.cloud.BasicDistributedZkTest-1360609476277/jetty3/index.20130211170451395 forceNew:false
[junit4:junit4]   2> 15129 T2341 C175 P51793 oasc.CachingDirectoryFactory.close Releasing directory:/Users/jenkins/jenkins-slave/workspace/Lucene-Solr-4.x-MacOSX/solr/build/solr-core/test/J0/./org.apache.solr.cloud.BasicDistributedZkTest-1360609476277/jetty3
[junit4:junit4]   2> 15130 T2341 C175 P51793 oash.SnapPuller.fetchLatestIndex Starting download to RateLimitedDirectoryWrapper(org.apache.lucene.store.NIOFSDirectory@/Users/jenkins/jenkins-slave/workspace/Lucene-Solr-4.x-MacOSX/solr/build/solr-core/test/J0/org.apache.solr.cloud.BasicDistributedZkTest-1360609476277/jetty3/index.20130211170451395 lockFactory=org.apache.lucene.store.NativeFSLockFactory@39ac2537) fullCopy=true
[junit4:junit4]   2> 15133 T2301 C177 P51787 REQ /replication {file=segments_2&command=filecontent&checksum=true&wt=filestream&qt=/replication&generation=2} status=0 QTime=0 
[junit4:junit4]   2> 15135 T2341 C175 P51793 oasc.CachingDirectoryFactory.close Releasing directory:/Users/jenkins/jenkins-slave/workspace/Lucene-Solr-4.x-MacOSX/solr/build/solr-core/test/J0/./org.apache.solr.cloud.BasicDistributedZkTest-1360609476277/jetty3/index
[junit4:junit4]   2> 15136 T2341 C175 P51793 oash.SnapPuller.fetchLatestIndex Total time taken for download : 0 secs
[junit4:junit4]   2> 15136 T2341 C175 P51793 oash.SnapPuller.modifyIndexProps New index installed. Updating index properties... index=index.20130211170451395
[junit4:junit4]   2> 15137 T2341 C175 P51793 oasc.CachingDirectoryFactory.close Releasing directory:/Users/jenkins/jenkins-slave/workspace/Lucene-Solr-4.x-MacOSX/solr/build/solr-core/test/J0/./org.apache.solr.cloud.BasicDistributedZkTest-1360609476277/jetty3
[junit4:junit4]   2> 15137 T2341 C175 P51793 oasc.CachingDirectoryFactory.close Releasing directory:/Users/jenkins/jenkins-slave/workspace/Lucene-Solr-4.x-MacOSX/solr/build/solr-core/test/J0/./org.apache.solr.cloud.BasicDistributedZkTest-1360609476277/jetty3
[junit4:junit4]   2> 15138 T2341 C175 P51793 oasc.SolrCore.getNewIndexDir New index directory detected: old=./org.apache.solr.cloud.BasicDistributedZkTest-1360609476277/jetty3/index/ new=./org.apache.solr.cloud.BasicDistributedZkTest-1360609476277/jetty3/index.20130211170451395
[junit4:junit4]   2> 15140 T2341 C175 P51793 oasc.SolrDeletionPolicy.onInit SolrDeletionPolicy.onInit: commits:num=1
[junit4:junit4]   2> 		commit{dir=RateLimitedDirectoryWrapper(org.apache.lucene.store.NIOFSDirectory@/Users/jenkins/jenkins-slave/workspace/Lucene-Solr-4.x-MacOSX/solr/build/solr-core/test/J0/org.apache.solr.cloud.BasicDistributedZkTest-1360609476277/jetty3/index.20130211170451395 lockFactory=org.apache.lucene.store.NativeFSLockFactory@39ac2537),segFN=segments_2,generation=2,filenames=[segments_2]
[junit4:junit4]   2> 15140 T2341 C175 P51793 oasc.SolrDeletionPolicy.updateCommits newest commit = 2[segments_2]
[junit4:junit4]   2> 15141 T2341 C175 P51793 oasc.CachingDirectoryFactory.close Releasing directory:/Users/jenkins/jenkins-slave/workspace/Lucene-Solr-4.x-MacOSX/solr/build/solr-core/test/J0/./org.apache.solr.cloud.BasicDistributedZkTest-1360609476277/jetty3
[junit4:junit4]   2> 15141 T2341 C175 P51793 oasu.DefaultSolrCoreState.newIndexWriter Creating new IndexWriter...
[junit4:junit4]   2> 15141 T2341 C175 P51793 oasu.DefaultSolrCoreState.newIndexWriter Waiting until IndexWriter is unused... core=collection1
[junit4:junit4]   2> 15142 T2341 C175 P51793 oasu.DefaultSolrCoreState.newIndexWriter Rollback old IndexWriter... core=collection1
[junit4:junit4]   2> 15142 T2341 C175 P51793 oasc.CachingDirectoryFactory.close Releasing directory:/Users/jenkins/jenkins-slave/workspace/Lucene-Solr-4.x-MacOSX/solr/build/solr-core/test/J0/./org.apache.solr.cloud.BasicDistributedZkTest-1360609476277/jetty3/index.20130211170451395
[junit4:junit4]   2> 15142 T2341 C175 P51793 oasc.CachingDirectoryFactory.close Releasing directory:/Users/jenkins/jenkins-slave/workspace/Lucene-Solr-4.x-MacOSX/solr/build/solr-core/test/J0/./org.apache.solr.cloud.BasicDistributedZkTest-1360609476277/jetty3
[junit4:junit4]   2> 15144 T2341 C175 P51793 oasc.SolrDeletionPolicy.onInit SolrDeletionPolicy.onInit: commits:num=1
[junit4:junit4]   2> 		commit{dir=RateLimitedDirectoryWrapper(org.apache.lucene.store.NIOFSDirectory@/Users/jenkins/jenkins-slave/workspace/Lucene-Solr-4.x-MacOSX/solr/build/solr-core/test/J0/org.apache.solr.cloud.BasicDistributedZkTest-1360609476277/jetty3/index.20130211170451395 lockFactory=org.apache.lucene.store.NativeFSLockFactory@39ac2537),segFN=segments_2,generation=2,filenames=[segments_2]
[junit4:junit4]   2> 15144 T2341 C175 P51793 oasc.SolrDeletionPolicy.updateCommits newest commit = 2[segments_2]
[junit4:junit4]   2> 15145 T2341 C175 P51793 oasu.DefaultSolrCoreState.newIndexWriter New IndexWriter is ready to be used.
[junit4:junit4]   2> 15145 T2341 C175 P51793 oasc.CachingDirectoryFactory.close Releasing directory:/Users/jenkins/jenkins-slave/workspace/Lucene-Solr-4.x-MacOSX/solr/build/solr-core/test/J0/./org.apache.solr.cloud.BasicDistributedZkTest-1360609476277/jetty3
[junit4:junit4]   2> 15146 T2341 C175 P51793 oass.SolrIndexSearcher.<init> Opening Searcher@32461148 main
[junit4:junit4]   2> 15147 T2340 oasc.SolrCore.registerSearcher [collection1] Registered new searcher Searcher@32461148 main{StandardDirectoryReader(segments_2:1:nrt)}
[junit4:junit4]   2> 15147 T2340 oasc.CachingDirectoryFactory.close Releasing directory:/Users/jenkins/jenkins-slave/workspace/Lucene-Solr-4.x-MacOSX/solr/build/solr-core/test/J0/./org.apache.solr.cloud.BasicDistributedZkTest-1360609476277/jetty3/index
[junit4:junit4]   2> 15148 T2341 C175 P51793 oasu.DirectUpdateHandler2.commit start commit{,optimize=false,openSearcher=false,waitSearcher=false,expungeDeletes=false,softCommit=false}
[junit4:junit4]   2> 15149 T2341 C175 P51793 oasc.SolrDeletionPolicy.onCommit SolrDeletionPolicy.onCommit: commits:num=2
[junit4:junit4]   2> 		commit{dir=RateLimitedDirectoryWrapper(org.apache.lucene.store.NIOFSDirectory@/Users/jenkins/jenkins-slave/workspace/Lucene-Solr-4.x-MacOSX/solr/build/solr-core/test/J0/org.apache.solr.cloud.BasicDistributedZkTest-1360609476277/jetty3/index.20130211170451395 lockFactory=org.apache.lucene.store.NativeFSLockFactory@39ac2537),segFN=segments_2,generation=2,filenames=[segments_2]
[junit4:junit4]   2> 		commit{dir=RateLimitedDirectoryWrapper(org.apache.lucene.store.NIOFSDirectory@/Users/jenkins/jenkins-slave/workspace/Lucene-Solr-4.x-MacOSX/solr/build/solr-core/test/J0/org.apache.solr.cloud.BasicDistributedZkTest-1360609476277/jetty3/index.20130211170451395 lockFactory=org.apache.lucene.store.NativeFSLockFactory@39ac2537),segFN=segments_3,generation=3,filenames=[segments_3]
[junit4:junit4]   2> 15149 T2341 C175 P51793 oasc.SolrDeletionPolicy.updateCommits newest commit = 3[segments_3]
[junit4:junit4]   2> 15150 T2341 C175 P51793 oasc.CachingDirectoryFactory.close Releasing directory:/Users/jenkins/jenkins-slave/workspace/Lucene-Solr-4.x-MacOSX/solr/build/solr-core/test/J0/./org.apache.solr.cloud.BasicDistributedZkTest-1360609476277/jetty3
[junit4:junit4]   2> 15150 T2341 C175 P51793 oasu.DirectUpdateHandler2.commit end_commit_flush
[junit4:junit4]   2> 15150 T2341 C175 P51793 oasc.CachingDirectoryFactory.close Releasing directory:/Users/jenkins/jenkins-slave/workspace/Lucene-Solr-4.x-MacOSX/solr/build/solr-core/test/J0/./org.apache.solr.cloud.BasicDistributedZkTest-1360609476277/jetty3/index.20130211170451395
[junit4:junit4]   2> 15150 T2341 C175 P51793 oasc.CachingDirectoryFactory.close Releasing directory:/Users/jenkins/jenkins-slave/workspace/Lucene-Solr-4.x-MacOSX/solr/build/solr-core/test/J0/./org.apache.solr.cloud.BasicDistributedZkTest-1360609476277/jetty3/index
[junit4:junit4]   2> 15151 T2341 C175 P51793 oasc.RecoveryStrategy.replay No replay needed. core=collection1
[junit4:junit4]   2> 15151 T2341 C175 P51793 oasc.RecoveryStrategy.doRecovery Replication Recovery was successful - registering as Active. core=collection1
[junit4:junit4]   2> 15151 T2341 C175 P51793 oasc.ZkController.publish publishing core=collection1 state=active
[junit4:junit4]   2> 15151 T2341 C175 P51793 oasc.ZkController.publish numShards not found on descriptor - reading it from system property
[junit4:junit4]   2> 15153 T2341 C175 P51793 oasc.RecoveryStrategy.doRecovery Finished recovery process. core=collection1
[junit4:junit4]   2> 15845 T2267 oascc.ZkStateReader.updateClusterState Updating cloud state from ZooKeeper... 
[junit4:junit4]   2> 15908 T2290 oascc.ZkStateReader.updateClusterState Updating cloud state from ZooKeeper... 
[junit4:junit4]   2> 15910 T2290 oasc.Overseer$ClusterStateUpdater.updateState Update state numShards=2 message={
[junit4:junit4]   2> 	  "operation":"state",
[junit4:junit4]   2> 	  "numShards":"2",
[junit4:junit4]   2> 	  "shard":"shard2",
[junit4:junit4]   2> 	  "roles":null,
[junit4:junit4]   2> 	  "state":"recovering",
[junit4:junit4]   2> 	  "core":"collection1",
[junit4:junit4]   2> 	  "collection":"collection1",
[junit4:junit4]   2> 	  "node_name":"127.0.0.1:51797_",
[junit4:junit4]   2> 	  "base_url":"http://127.0.0.1:51797"}
[junit4:junit4]   2> 15922 T2290 oasc.Overseer$ClusterStateUpdater.updateState Update state numShards=2 message={
[junit4:junit4]   2> 	  "operation":"state",
[junit4:junit4]   2> 	  "numShards":"2",
[junit4:junit4]   2> 	  "shard":"shard1",
[junit4:junit4]   2> 	  "roles":null,
[junit4:junit4]   2> 	  "state":"active",
[junit4:junit4]   2> 	  "core":"collection1",
[junit4:junit4]   2> 	  "collection":"collection1",
[junit4:junit4]   2> 	  "node_name":"127.0.0.1:51793_",
[junit4:junit4]   2> 	  "base_url":"http://127.0.0.1:51793"}
[junit4:junit4]   2> 15936 T2289 oascc.ZkStateReader$2.process A cluster state change: WatchedEvent state:SyncConnected type:NodeDataChanged path:/clusterstate.json, has occurred - updating... (live nodes size: 5)
[junit4:junit4]   2> 15936 T2308 oascc.ZkStateReader$2.process A cluster state change: WatchedEvent state:SyncConnected type:NodeDataChanged path:/clusterstate.json, has occurred - updating... (live nodes size: 5)
[junit4:junit4]   2> 15938 T2323 oascc.ZkStateReader$2.process A cluster state change: WatchedEvent state:SyncConnected type:NodeDataChanged path:/clusterstate.json, has occurred - updating... (live nodes size: 5)
[junit4:junit4]   2> 15939 T2295 oascc.ZkStateReader$2.process A cluster state change: WatchedEvent state:SyncConnected type:NodeDataChanged path:/clusterstate.json, has occurred - updating... (live nodes size: 5)
[junit4:junit4]   2> 15939 T2338 oascc.ZkStateReader$2.process A cluster state change: WatchedEvent state:SyncConnected type:NodeDataChanged path:/clusterstate.json, has occurred - updating... (live nodes size: 5)
[junit4:junit4]   2> 15939 T2354 oascc.ZkStateReader$2.process A cluster state change: WatchedEvent state:SyncConnected type:NodeDataChanged path:/clusterstate.json, has occurred - updating... (live nodes size: 5)
[junit4:junit4]   2> 16852 T2267 oascc.ZkStateReader.updateClusterState Updating cloud state from ZooKeeper... 
[junit4:junit4]   2> 17856 T2267 oascc.ZkStateReader.updateClusterState Updating cloud state from ZooKeeper... 
[junit4:junit4]   2>  C176_STATE=coll:collection1 core:collection1 props:{shard=shard2, roles=null, state=recovering, core=collection1, collection=collection1, node_name=127.0.0.1:51797_, base_url=http://127.0.0.1:51797}
[junit4:junit4]   2> 18839 T2357 C176 P51797 oasc.RecoveryStrategy.doRecovery Attempting to PeerSync from http://127.0.0.1:51790/collection1/ core=collection1 - recoveringAfterStartup=true
[junit4:junit4]   2> 18840 T2357 C176 P51797 oasu.PeerSync.sync PeerSync: core=collection1 url=http://127.0.0.1:51797 START replicas=[http://127.0.0.1:51790/collection1/] nUpdates=100
[junit4:junit4]   2> 18840 T2357 C176 P51797 oasu.PeerSync.sync WARNING no frame of reference to tell of we've missed updates
[junit4:junit4]   2> 18841 T2357 C176 P51797 oasc.RecoveryStrategy.doRecovery PeerSync Recovery was not successful - trying replication. core=collection1
[junit4:junit4]   2> 18842 T2357 C176 P51797 oasc.RecoveryStrategy.doRecovery Starting Replication Recovery. core=collection1
[junit4:junit4]   2> 18842 T2357 C176 P51797 oasc.RecoveryStrategy.doRecovery Begin buffering updates. core=collection1
[junit4:junit4]   2> 18842 T2357 C176 P51797 oasu.UpdateLog.bufferUpdates Starting to buffer updates. FSUpdateLog{state=ACTIVE, tlog=null}
[junit4:junit4]   2> 18842 T2357 C176 P51797 oasc.RecoveryStrategy.replicate Attempting to replicate from http://127.0.0.1:51790/collection1/. core=collection1
[junit4:junit4]   2> 18843 T2357 C176 P51797 oascsi.HttpClientUtil.createClient Creating new http client, config:maxConnections=128&maxConnectionsPerHost=32&followRedirects=false
[junit4:junit4]   2> ASYNC  NEW_CORE C178 name=collection1 org.apache.solr.core.SolrCore@3e4565cd url=http://127.0.0.1:51790/collection1 node=127.0.0.1:51790_ C178_STATE=coll:collection1 core:collection1 props:{shard=shard2, roles=null, state=active, core=collection1, collection=collection1, node_name=127.0.0.1:51790_, base_url=http://127.0.0.1:51790, leader=true}
[junit4:junit4]   2> 18852 T2315 C178 P51790 REQ /get {getVersions=100&distrib=false&wt=javabin&qt=/get&version=2} status=0 QTime=0 
[junit4:junit4]   2> 18854 T2316 C178 P51790 oasu.DirectUpdateHandler2.commit start commit{,optimize=false,openSearcher=false,waitSearcher=true,expungeDeletes=false,softCommit=false}
[junit4:junit4]   2> 18855 T2316 C178 P51790 oasc.CachingDirectoryFactory.close Releasing directory:/Users/jenkins/jenkins-slave/workspace/Lucene-Solr-4.x-MacOSX/solr/build/solr-core/test/J0/./org.apache.solr.cloud.BasicDistributedZkTest-1360609476277/jetty2
[junit4:junit4]   2> 18858 T2316 C178 P51790 oasc.SolrDeletionPolicy.onInit SolrDeletionPolicy.onInit: commits:num=1
[junit4:junit4]   2> 		commit{dir=RateLimitedDirectoryWrapper(org.apache.lucene.store.NIOFSDirectory@/Users/jenkins/jenkins-slave/workspace/Lucene-Solr-4.x-MacOSX/solr/build/solr-core/test/J0/org.apache.solr.cloud.BasicDistributedZkTest-1360609476277/jetty2/index lockFactory=org.apache.lucene.store.NativeFSLockFactory@a8d5d0),segFN=segments_1,generation=1,filenames=[segments_1]
[junit4:junit4]   2> 18859 T2316 C178 P51790 oasc.SolrDeletionPolicy.updateCommits newest commit = 1[segments_1]
[junit4:junit4]   2> 18860 T2267 oascc.ZkStateReader.updateClusterState Updating cloud state from ZooKeeper... 
[junit4:junit4]   2> 18863 T2316 C178 P51790 oasc.SolrDeletionPolicy.onCommit SolrDeletionPolicy.onCommit: commits:num=2
[junit4:junit4]   2> 		commit{dir=RateLimitedDirectoryWrapper(org.apache.lucene.store.NIOFSDirectory@/Users/jenkins/jenkins-slave/workspace/Lucene-Solr-4.x-MacOSX/solr/build/solr-core/test/J0/org.apache.solr.cloud.BasicDistributedZkTest-1360609476277/jetty2/index lockFactory=org.apache.lucene.store.NativeFSLockFactory@a8d5d0),segFN=segments_1,generation=1,filenames=[segments_1]
[junit4:junit4]   2> 		commit{dir=RateLimitedDirectoryWrapper(org.apache.lucene.store.NIOFSDirectory@/Users/jenkins/jenkins-slave/workspace/Lucene-Solr-4.x-MacOSX/solr/build/solr-core/test/J0/org.apache.solr.cloud.BasicDistributedZkTest-1360609476277/jetty2/index lockFactory=org.apache.lucene.store.NativeFSLockFactory@a8d5d0),segFN=segments_2,generation=2,filenames=[segments_2]
[junit4:junit4]   2> 18863 T2316 C178 P51790 oasc.SolrDeletionPolicy.updateCommits newest commit = 2[segments_2]
[junit4:junit4]   2> 18864 T2316 C178 P51790 oasc.CachingDirectoryFactory.close Releasing directory:/Users/jenkins/jenkins-slave/workspace/Lucene-Solr-4.x-MacOSX/solr/build/solr-core/test/J0/./org.apache.solr.cloud.BasicDistributedZkTest-1360609476277/jetty2
[junit4:junit4]   2> 18864 T2316 C178 P51790 oass.SolrIndexSearcher.<init> Opening Searcher@5f550d70 realtime
[junit4:junit4]   2> 18865 T2316 C178 P51790 oasu.DirectUpdateHandler2.commit end_commit_flush
[junit4:junit4]   2> 18865 T2316 C178 P51790 /update {waitSearcher=true&openSearcher=false&commit=true&wt=javabin&commit_end_point=true&version=2&softCommit=false} {commit=} 0 11
[junit4:junit4]   2> 18867 T2357 C176 P51797 oash.ReplicationHandler.inform Commits will be reserved for  10000
[junit4:junit4]   2> 18867 T2357 C176 P51797 oash.SnapPuller.<init>  No value set for 'pollInterval'. Timer Task not started.
[junit4:junit4]   2> 18870 T2318 C178 P51790 oash.ReplicationHandler.inform Commits will be reserved for  10000
[junit4:junit4]   2> 18870 T2318 C178 P51790 REQ /replication {command=indexversion&qt=/replication&wt=javabin&version=2} status=0 QTime=1 
[junit4:junit4]   2> 18871 T2357 C176 P51797 oash.SnapPuller.fetchLatestIndex Master's generation: 2
[junit4:junit4]   2> 18872 T2357 C176 P51797 oash.SnapPuller.fetchLatestIndex Slave's generation: 1
[junit4:junit4]   2> 18872 T2357 C176 P51797 oash.SnapPuller.fetchLatestIndex Starting replication process
[junit4:junit4]   2> 18875 T2319 C178 P51790 oasc.CachingDirectoryFactory.close Releasing directory:/Users/jenkins/jenkins-slave/workspace/Lucene-Solr-4.x-MacOSX/solr/build/solr-core/test/J0/./org.apache.solr.cloud.BasicDistributedZkTest-1360609476277/jetty2
[junit4:junit4]   2> 18876 T2319 C178 P51790 oasc.CachingDirectoryFactory.close Releasing directory:/Users/jenkins/jenkins-slave/workspace/Lucene-Solr-4.x-MacOSX/solr/build/solr-core/test/J0/./org.apache.solr.cloud.BasicDistributedZkTest-1360609476277/jetty2/index
[junit4:junit4]   2> 18876 T2319 C178 P51790 REQ /replication {command=filelist&qt=/replication&wt=javabin&generation=2&version=2} status=0 QTime=1 
[junit4:junit4]   2> 18877 T2357 C176 P51797 oash.SnapPuller.fetchLatestIndex Number of files in latest index in master: 1
[junit4:junit4]   2> 18879 T2357 C176 P51797 oasc.CachingDirectoryFactory.get return new directory for /Users/jenkins/jenkins-slave/workspace/Lucene-Solr-4.x-MacOSX/solr/build/solr-core/test/J0/./org.apache.solr.cloud.BasicDistributedZkTest-1360609476277/jetty4/index.20130211170455145 forceNew:false
[junit4:junit4]   2> 18879 T2357 C176 P51797 oasc.CachingDirectoryFactory.close Releasing directory:/Users/jenkins/jenkins-slave/workspace/Lucene-Solr-4.x-MacOSX/solr/build/solr-core/test/J0/./org.apache.solr.cloud.BasicDistributedZkTest-1360609476277/jetty4
[junit4:junit4]   2> 18880 T2357 C176 P51797 oash.SnapPuller.fetchLatestIndex Starting download to RateLimitedDirectoryWrapper(org.apache.lucene.store.NIOFSDirectory@/Users/jenkins/jenkins-slave/workspace/Lucene-Solr-4.x-MacOSX/solr/build/solr-core/test/J0/org.apache.solr.cloud.BasicDistributedZkTest-1360609476277/jetty4/index.20130211170455145 lockFactory=org.apache.lucene.store.NativeFSLockFactory@4e396d7) fullCopy=true
[junit4:junit4]   2> 18883 T2315 C178 P51790 REQ /replication {file=segments_2&command=filecontent&checksum=true&wt=filestream&qt=/replication&generation=2} status=0 QTime=0 
[junit4:junit4]   2> 18886 T2357 C176 P51797 oasc.CachingDirectoryFactory.close Releasing directory:/Users/jenkins/jenkins-slave/workspace/Lucene-Solr-4.x-MacOSX/solr/build/solr-core/test/J0/./org.apache.solr.cloud.BasicDistributedZkTest-1360609476277/jetty4/index
[junit4:junit4]   2> 18886 T2357 C176 P51797 oash.SnapPuller.fetchLatestIndex Total time taken for download : 0 secs
[junit4:junit4]   2> 18887 T2357 C176 P51797 oash.SnapPuller.modifyIndexProps New index installed. Updating index properties... index=index.20130211170455145
[junit4:junit4]   2> 18888 T2357 C176 P51797 oasc.CachingDirectoryFactory.close Releasing directory:/Users/jenkins/jenkins-slave/workspace/Lucene-Solr-4.x-MacOSX/solr/build/solr-core/test/J0/./org.apache.solr.cloud.BasicDistributedZkTest-1360609476277/jetty4
[junit4:junit4]   2> 18889 T2357 C176 P51797 oasc.CachingDirectoryFactory.close Releasing directory:/Users/jenkins/jenkins-slave/workspace/Lucene-Solr-4.x-MacOSX/solr/build/solr-core/test/J0/./org.apache.solr.cloud.BasicDistributedZkTest-1360609476277/jetty4
[junit4:junit4]   2> 18889 T2357 C176 P51797 oasc.SolrCore.getNewIndexDir New index directory detected: old=./org.apache.solr.cloud.BasicDistributedZkTest-1360609476277/jetty4/index/ new=./org.apache.solr.cloud.BasicDistributedZkTest-1360609476277/jetty4/index.20130211170455145
[junit4:junit4]   2> 18892 T2357 C176 P51797 oasc.SolrDeletionPolicy.onInit SolrDeletionPolicy.onInit: commits:num=1
[junit4:junit4]   2> 		commit{dir=RateLimitedDirectoryWrapper(org.apache.lucene.store.NIOFSDirectory@/Users/jenkins/jenkins-slave/workspace/Lucene-Solr-4.x-MacOSX/solr/build/solr-core/test/J0/org.apache.solr.cloud.BasicDistributedZkTest-1360609476277/jetty4/index.20130211170455145 lockFactory=org.apache.lucene.store.NativeFSLockFactory@4e396d7),segFN=segments_2,generation=2,filenames=[segments_2]
[junit4:junit4]   2> 18893 T2357 C176 P51797 oasc.SolrDeletionPolicy.updateCommits newest commit = 2[segments_2]
[junit4:junit4]   2> 18895 T2357 C176 P51797 oasc.CachingDirectoryFactory.close Releasing directory:/Users/jenkins/jenkins-slave/workspace/Lucene-Solr-4.x-MacOSX/solr/build/solr-core/test/J0/./org.apache.solr.cloud.BasicDistributedZkTest-1360609476277/jetty4
[junit4:junit4]   2> 18895 T2357 C176 P51797 oasu.DefaultSolrCoreState.newIndexWriter Creating new IndexWriter...
[junit4:junit4]   2> 18895 T2357 C176 P51797 oasu.DefaultSolrCoreState.newIndexWriter Waiting until IndexWriter is unused... core=collection1
[junit4:junit4]   2> 18896 T2357 C176 P51797 oasu.DefaultSolrCoreState.newIndexWriter Rollback old IndexWriter... core=collection1
[junit4:junit4]   2> 18896 T2357 C176 P51797 oasc.CachingDirectoryFactory.close Releasing directory:/Users/jenkins/jenkins-slave/workspace/Lucene-Solr-4.x-MacOSX/solr/build/solr-core/test/J0/./org.apache.solr.cloud.BasicDistributedZkTest-1360609476277/jetty4/index.20130211170455145
[junit4:junit4]   2> 18897 T2357 C176 P51797 oasc.CachingDirectoryFactory.close Releasing directory:/Users/jenkins/jenkins-slave/workspace/Lucene-Solr-4.x-MacOSX/solr/build/solr-core/test/J0/./org.apache.solr.cloud.BasicDistributedZkTest-1360609476277/jetty4
[junit4:junit4]   2> 18900 T2357 C176 P51797 oasc.SolrDeletionPolicy.onInit SolrDeletionPolicy.onInit: commits:num=1
[junit4:junit4]   2> 		commit{dir=RateLimitedDirectoryWrapper(org.apache.lucene.store.NIOFSDirectory@/Users/jenkins/jenkins-slave/workspace/Lucene-Solr-4.x-MacOSX/solr/build/solr-core/test/J0/org.apache.solr.cloud.BasicDistributedZkTest-1360609476277/jetty4/index.20130211170455145 lockFactory=org.apache.lucene.store.NativeFSLockFactory@4e396d7),segFN=segments_2,generation=2,filenames=[segments_2]
[junit4:junit4]   2> 18901 T2357 C176 P51797 oasc.SolrDeletionPolicy.updateCommits newest commit = 2[segments_2]
[junit4:junit4]   2> 18901 T2357 C176 P51797 oasu.DefaultSolrCoreState.newIndexWriter New IndexWriter is ready to be used.
[junit4:junit4]   2> 18902 T2357 C176 P51797 oasc.CachingDirectoryFactory.close Releasing directory:/Users/jenkins/jenkins-slave/workspace/Lucene-Solr-4.x-MacOSX/solr/build/solr-core/test/J0/./org.apache.solr.cloud.BasicDistributedZkTest-1360609476277/jetty4
[junit4:junit4]   2> 18902 T2357 C176 P51797 oass.SolrIndexSearcher.<init> Opening Searcher@2a281872 main
[junit4:junit4]   2> 18904 T2356 oasc.SolrCore.registerSearcher [collection1] Registered new searcher Searcher@2a281872 main{StandardDirectoryReader(segments_2:1:nrt)}
[junit4:junit4]   2> 18905 T2356 oasc.CachingDirectoryFactory.close Releasing directory:/Users/jenkins/jenkins-slave/workspace/Lucene-Solr-4.x-MacOSX/solr/build/solr-core/test/J0/./org.apache.solr.cloud.BasicDistributedZkTest-1360609476277/jetty4/index
[junit4:junit4]   2> 18905 T2357 C176 P51797 oasu.DirectUpdateHandler2.commit start commit{,optimize=false,openSearcher=false,waitSearcher=false,expungeDeletes=false,softCommit=false}
[junit4:junit4]   2> 18907 T2357 C176 P51797 oasc.SolrDeletionPolicy.onCommit SolrDeletionPolicy.onCommit: commits:num=2
[junit4:junit4]   2> 		commit{dir=RateLimitedDirectoryWrapper(org.apache.lucene.store.NIOFSDirectory@/Users/jenkins/jenkins-slave/workspace/Lucene-Solr-4.x-MacOSX/solr/build/solr-core/test/J0/org.apache.solr.cloud.BasicDistributedZkTest-1360609476277/jetty4/index.20130211170455145 lockFactory=org.apache.lucene.store.NativeFSLockFactory@4e396d7),segFN=segments_2,generation=2,filenames=[segments_2]
[junit4:junit4]   2> 		commit{dir=RateLimitedDirectoryWrapper(org.apache.lucene.store.NIOFSDirectory@/Users/jenkins/jenkins-slave/workspace/Lucene-Solr-4.x-MacOSX/solr/build/solr-core/test/J0/org.apache.solr.cloud.BasicDistributedZkTest-1360609476277/jetty4/index.20130211170455145 lockFactory=org.apache.lucene.store.NativeFSLockFactory@4e396d7),segFN=segments_3,generation=3,filenames=[segments_3]
[junit4:junit4]   2> 18908 T2357 C176 P51797 oasc.SolrDeletionPolicy.updateCommits newest commit = 3[segments_3]
[junit4:junit4]   2> 18908 T2357 C176 P51797 oasc.CachingDirectoryFactory.close Releasing directory:/Users/jenkins/jenkins-slave/workspace/Lucene-Solr-4.x-MacOSX/solr/build/solr-core/test/J0/./org.apache.solr.cloud.BasicDistributedZkTest-1360609476277/jetty4
[junit4:junit4]   2> 18909 T2357 C176 P51797 oasu.DirectUpdateHandler2.commit end_commit_flush
[junit4:junit4]   2> 18909 T2357 C176 P51797 oasc.CachingDirectoryFactory.close Releasing directory:/Users/jenkins/jenkins-slave/workspace/Lucene-Solr-4.x-MacOSX/solr/build/solr-core/test/J0/./org.apache.solr.cloud.BasicDistributedZkTest-1360609476277/jetty4/index.20130211170455145
[junit4:junit4]   2> 18909 T2357 C176 P51797 oasc.CachingDirectoryFactory.close Releasing directory:/Users/jenkins/jenkins-slave/workspace/Lucene-Solr-4.x-MacOSX/solr/build/solr-core/test/J0/./org.apache.solr.cloud.BasicDistributedZkTest-1360609476277/jetty4/index
[junit4:junit4]   2> 18909 T2357 C176 P51797 oasc.RecoveryStrategy.replay No replay needed. core=collection1
[junit4:junit4]   2> 18910 T2357 C176 P51797 oasc.RecoveryStrategy.doRecovery Replication Recovery was successful - registering as Active. core=collection1
[junit4:junit4]   2> 18910 T2357 C176 P51797 oasc.ZkController.publish publishing core=collection1 state=active
[junit4:junit4]   2> 18910 T2357 C176 P51797 oasc.ZkController.publish numShards not found on descriptor - reading it from system property
[junit4:junit4]   2> 18912 T2357 C176 P51797 oasc.RecoveryStrategy.doRecovery Finished recovery process. core=collection1
[junit4:junit4]   2> 18988 T2290 oascc.ZkStateReader.updateClusterState Updating cloud state from ZooKeeper... 
[junit4:junit4]   2> 18992 T2290 oasc.Overseer$ClusterStateUpdater.updateState Update state numShards=2 message={
[junit4:junit4]   2> 	  "operation":"state",
[junit4:junit4]   2> 	  "numShards":"2",
[junit4:junit4]   2> 	  "shard":"shard2",
[junit4:junit4]   2> 	  "roles":null,
[junit4:junit4]   2> 	  "state":"active",
[junit4:junit4]   2> 	  "core":"collection1",
[junit4:junit4]   2> 	  "collection":"collection1",
[junit4:junit4]   2> 	  "node_name":"127.0.0.1:51797_",
[junit4:junit4]   2> 	  "base_url":"http://127.0.0.1:51797"}
[junit4:junit4]   2> 19013 T2308 oascc.ZkStateReader$2.process A cluster state change: WatchedEvent state:SyncConnected type:NodeDataChanged path:/clusterstate.json, has occurred - updating... (live nodes size: 5)
[junit4:junit4]   2> 19014 T2289 oascc.ZkStateReader$2.process A cluster state change: WatchedEvent state:SyncConnected type:NodeDataChanged path:/clusterstate.json, has occurred - updating... (live nodes size: 5)
[junit4:junit4]   2> 19017 T2323 oascc.ZkStateReader$2.process A cluster state change: WatchedEvent state:SyncConnected type:NodeDataChanged path:/clusterstate.json, has occurred - updating... (live nodes size: 5)
[junit4:junit4]   2> 19017 T2295 oascc.ZkStateReader$2.process A cluster state change: WatchedEvent state:SyncConnected type:NodeDataChanged path:/clusterstate.json, has occurred - updating... (live nodes size: 5)
[junit4:junit4]   2> 19018 T2354 oascc.ZkStateReader$2.process A cluster state change: WatchedEvent state:SyncConnected type:NodeDataChanged path:/clusterstate.json, has occurred - updating... (live nodes size: 5)
[junit4:junit4]   2> 19018 T2338 oascc.ZkStateReader$2.process A cluster state change: WatchedEvent state:SyncConnected type:NodeDataChanged path:/clusterstate.json, has occurred - updating... (live nodes size: 5)
[junit4:junit4]   2> 19872 T2267 oascc.ZkStateReader.updateClusterState Updating cloud state from ZooKeeper... 
[junit4:junit4]   2> 19873 T2267 oasc.AbstractDistribZkTestBase.waitForRecoveriesToFinish Recoveries finished - collection: collection1
[junit4:junit4]   2> ASYNC  NEW_CORE C179 name=collection1 org.apache.solr.core.SolrCore@59f42cf2 url=http://127.0.0.1:51783/collection1 node=127.0.0.1:51783_ C179_STATE=coll:control_collection core:collection1 props:{shard=shard1, roles=null, state=active, core=collection1, collection=control_collection, node_name=127.0.0.1:51783_, base_url=http://127.0.0.1:51783, leader=true}
[junit4:junit4]   2> 19890 T2280 C179 P51783 oasc.CachingDirectoryFactory.close Releasing directory:/Users/jenkins/jenkins-slave/workspace/Lucene-Solr-4.x-MacOSX/solr/build/solr-core/test/J0/./org.apache.solr.cloud.BasicDistributedZkTest-1360609476277/control/data
[junit4:junit4]   2> 19892 T2280 C179 P51783 oasc.SolrDeletionPolicy.onInit SolrDeletionPolicy.onInit: commits:num=1
[junit4:junit4]   2> 		commit{dir=RateLimitedDirectoryWrapper(org.apache.lucene.store.NIOFSDirectory@/Users/jenkins/jenkins-slave/workspace/Lucene-Solr-4.x-MacOSX/solr/build/solr-core/test/J0/org.apache.solr.cloud.BasicDistributedZkTest-1360609476277/control/data/index lockFactory=org.apache.lucene.store.NativeFSLockFactory@788697e5),segFN=segments_1,generation=1,filenames=[segments_1]
[junit4:junit4]   2> 19893 T2280 C179 P51783 oasc.SolrDeletionPolicy.updateCommits newest commit = 1[segments_1]
[junit4:junit4]   2> 19894 T2280 C179 P51783 oasc.CachingDirectoryFactory.close Releasing directory:/Users/jenkins/jenkins-slave/workspace/Lucene-Solr-4.x-MacOSX/solr/build/solr-core/test/J0/./org.apache.solr.cloud.BasicDistributedZkTest-1360609476277/control/data
[junit4:junit4]   2> 19894 T2280 C179 P51783 oass.SolrIndexSearcher.<init> Opening Searcher@1ce06dce realtime
[junit4:junit4]   2> 19895 T2280 C179 P51783 /update {wt=javabin&version=2} {deleteByQuery=*:* (-1426702463041273856)} 0 7
[junit4:junit4]   2> 19899 T2317 C178 P51790 oasc.CachingDirectoryFactory.close Releasing directory:/Users/jenkins/jenkins-slave/workspace/Lucene-Solr-4.x-MacOSX/solr/build/solr-core/test/J0/./org.apache.solr.cloud.BasicDistributedZkTest-1360609476277/jetty2
[junit4:junit4]   2> 19905 T2301 C177 P51787 oasc.CachingDirectoryFactory.close Releasing directory:/Users/jenkins/jenkins-slave/workspace/Lucene-Solr-4.x-MacOSX/solr/build/solr-core/test/J0/./org.apache.solr.cloud.BasicDistributedZkTest-1360609476277/jetty1
[junit4:junit4]   2>  C176_STATE=coll:collection1 core:collection1 props:{shard=shard2, roles=null, state=active, core=collection1, collection=collection1, node_name=127.0.0.1:51797_, base_url=http://127.0.0.1:51797}
[junit4:junit4]   2> 19913 T2350 C176 P51797 oasc.CachingDirectoryFactory.close Releasing directory:/Users/jenkins/jenkins-slave/workspace/Lucene-Solr-4.x-MacOSX/solr/build/solr-core/test/J0/./org.apache.solr.cloud.BasicDistributedZkTest-1360609476277/jetty4
[junit4:junit4]   2> 19914 T2350 C176 P51797 /update {update.distrib=FROMLEADER&_version_=-1426702463049662464&update.from=http://127.0.0.1:51790/collection1/&wt=javabin&version=2} {deleteByQuery=*:* (-1426702463049662464)} 0 3
[junit4:junit4]   2>  C175_STATE=coll:collection1 core:collection1 props:{shard=shard1, roles=null, state=active, core=collection1, collection=collection1, node_name=127.0.0.1:51793_, base_url=http://127.0.0.1:51793}
[junit4:junit4]   2> 19915 T2332 C175 P51793 oasc.CachingDirectoryFactory.close Releasing directory:/Users/jenkins/jenkins-slave/workspace/Lucene-Solr-4.x-MacOSX/solr/build/solr-core/test/J0/./org.apache.solr.cloud.BasicDistributedZkTest-1360609476277/jetty3
[junit4:junit4]   2> 19917 T2332 C175 P51793 /update {update.distrib=FROMLEADER&_version_=-1426702463055953920&update.from=http://127.0.0.1:51787/collection1/&wt=javabin&version=2} {deleteByQuery=*:* (-1426702463055953920)} 0 4
[junit4:junit4]   2> 19917 T2301 C177 P51787 /update {update.distrib=TOLEADER&wt=javabin&version=2} {deleteByQuery=*:* (-1426702463055953920)} 0 14
[junit4:junit4]   2> 19918 T2317 C178 P51790 /update {wt=javabin&version=2} {deleteByQuery=*:* (-1426702463049662464)} 0 21
[junit4:junit4]   2> 19925 T2281 C179 P51783 /update {wt=javabin&version=2} {add=[1 (1426702463075876864)]} 0 3
[junit4:junit4]   2> 19940 T2333 C175 P51793 /update {distrib.from=http://127.0.0.1:51787/collection1/&update.distrib=FROMLEADER&wt=javabin&version=2} {add=[1 (1426702463085314048)]} 0 3
[junit4:junit4]   2> 19941 T2299 C177 P51787 /update {distrib.from=http://127.0.0.1:51790/collection1/&update.distrib=TOLEADER&wt=javabin&version=2} {add=[1 (1426702463085314048)]} 0 10
[junit4:junit4]   2> 19942 T2318 C178 P51790 /update {wt=javabin&version=2} {add=[1]} 0 14
[junit4:junit4]   2> 19950 T2282 C179 P51783 /update {wt=javabin&version=2} {add=[2 (1426702463102091264)]} 0 3
[junit4:junit4]   2> 19963 T2345 C176 P51797 /update {distrib.from=http://127.0.0.1:51790/collection1/&update.distrib=FROMLEADER&wt=javabin&version=2} {add=[2 (1426702463108382720)]} 0 2
[junit4:junit4]   2> 19964 T2319 C178 P51790 /update {wt=javabin&version=2} {add=[2 (1426702463108382720)]} 0 11
[junit4:junit4]   2> 19969 T2283 C179 P51783 /update {wt=javabin&version=2} {add=[3 (1426702463123062784)]} 0 2
[junit4:junit4]   2> 19983 T2346 C176 P51797 /update {distrib.from=http://127.0.0.1:51790/collection1/&update.distrib=FROMLEADER&wt=javabin&version=2} {add=[3 (1426702463130402816)]} 0 3
[junit4:junit4]   2> 19984 T2315 C178 P51790 /update {distrib.from=http://127.0.0.1:51787/collection1/&update.distrib=TOLEADER&wt=javabin&version=2} {add=[3 (1426702463130402816)]} 0 10
[junit4:junit4]   2> 19985 T2304 C177 P51787 /update {wt=javabin&version=2} {add=[3]} 0 13
[junit4:junit4]   2> 19994 T2284 C179 P51783 /update {wt=javabin&version=2} {add=[4 (1426702463149277184)]} 0 3
[junit4:junit4]   2> 20004 T2334 C175 P51793 /update {distrib.from=http://127.0.0.1:51787/collection1/&update.distrib=FROMLEADER&wt=javabin&version=2} {add=[4 (1426702463155568640)]} 0 2
[junit4:junit4]   2> 20004 T2302 C177 P51787 /update {wt=javabin&version=2} {add=[4 (1426702463155568640)]} 0 6
[junit4:junit4]   2> 20009 T2285 C179 P51783 /update {wt=javabin&version=2} {add=[5 (1426702463166054400)]} 0 2
[junit4:junit4]   2> 20024 T2347 C176 P51797 /update {distrib.from=http://127.0.0.1:51790/collection1/&update.distrib=FROMLEADER&wt=javabin&version=2} {add=[5 (1426702463176540160)]} 0 2
[junit4:junit4]   2> 20025 T2314 C178 P51790 /update {distrib.from=http://127.0.0.1:51787/collection1/&update.distrib=TOLEADER&wt=javabin&version=2} {add=[5 (1426702463176540160)]} 0 7
[junit4:junit4]   2> 20026 T2303 C177 P51787 /update {wt=javabin&version=2} {add=[5]} 0 12
[junit4:junit4]   2> 20033 T2280 C179 P51783 /update {wt=javabin&version=2} {add=[6 (1426702463191220224)]} 0 2
[junit4:junit4]   2> 20042 T2349 C176 P51797 /update {distrib.from=http://127.0.0.1:51790/collection1/&update.distrib=FROMLEADER&wt=javabin&version=2} {add=[6 (1426702463195414528)]} 0 2
[junit4:junit4]   2> 20043 T2316 C178 P51790 /update {wt=javabin&version=2} {add=[6 (1426702463195414528)]} 0 7
[junit4:junit4]   2> 20047 T2281 C179 P51783 /update {wt=javabin&version=2} {add=[7 (1426702463204851712)]} 0 2
[junit4:junit4]   2> 20061 T2350 C176 P51797 /update {distrib.from=http://127.0.0.1:51790/collection1/&update.distrib=FROMLEADER&wt=javabin&version=2} {add=[7 (1426702463210094592)]} 0 2
[junit4:junit4]   2> 20062 T2317 C178 P51790 /update {wt=javabin&version=2} {add=[7 (1426702463210094592)]} 0 12
[junit4:junit4]   2> 20071 T2282 C179 P51783 /update {wt=javabin&version=2} {add=[8 (1426702463231066112)]} 0 2
[junit4:junit4]   2> 20099 T2329 C175 P51793 /update {distrib.from=http://127.0.0.1:51787/collection1/&update.distrib=FROMLEADER&wt=javabin&version=2} {add=[8 (1426702463244697600)]} 0 7
[junit4:junit4]   2> 20102 T2301 C177 P51787 /update {distrib.from=http://127.0.0.1:51790/collection1/&update.distrib=TOLEADER&wt=javabin&version=2} {add=[8 (1426702463244697600)]} 0 19
[junit4:junit4]   2> 20104 T2318 C178 P51790 /update {wt=javabin&version=2} {add=[8]} 0 24
[junit4:junit4]   2> 20115 T2283 C179 P51783 /update {wt=javabin&version=2} {add=[9 (1426702463273009152)]} 0 6
[junit4:junit4]   2> 20134 T2345 C176 P51797 /update {distrib.from=http://127.0.0.1:51790/collection1/&update.distrib=FROMLEADER&wt=javabin&version=2} {add=[9 (1426702463285592064)]} 0 3
[junit4:junit4]   2> 20135 T2315 C178 P51790 /update {wt=javabin&version=2} {add=[9 (1426702463285592064)]} 0 14
[junit4:junit4]   2> 20174 T2284 C179 P51783 /update {wt=javabin&version=2} {add=[10 (1426702463306563584)]} 0 33
[junit4:junit4]   2> 20186 T2331 C175 P51793 /update {distrib.from=http://127.0.0.1:51787/collection1/&update.distrib=FROMLEADER&wt=javabin&version=2} {add=[10 (1426702463346409472)]} 0 3
[junit4:junit4]   2> 20187 T2299 C177 P51787 /update {distrib.from=http://127.0.0.1:51790/collection1/&update.distrib=TOLEADER&wt=javabin&version=2} {add=[10 (1426702463346409472)]} 0 8
[junit4:junit4]   2> 20187 T2314 C178 P51790 /update {wt=javabin&version=2} {add=[10]} 0 10
[junit4:junit4]   2> 20195 T2280 C179 P51783 /update {wt=javabin&version=2} {add=[11 (1426702463356895232)]} 0 5
[junit4:junit4]   2> 20208 T2332 C175 P51793 /update {distrib.from=http://127.0.0.1:51787/collection1/&update.distrib=FROMLEADER&wt=javabin&version=2} {add=[11 (1426702463368429568)]} 0 3
[junit4:junit4]   2> 20209 T2304 C177 P51787 /update {distrib.from=http://127.0.0.1:51790/collection1/&update.distrib=TOLEADER&wt=javabin&version=2} {add=[11 (1426702463368429568)]} 0 8
[junit4:junit4]   2> 20209 T2316 C178 P51790 /update {wt=javabin&version=2} {add=[11]} 0 11
[junit4:junit4]   2> 20215 T2281 C179 P51783 /update {wt=javabin&version=2} {add=[12 (1426702463381012480)]} 0 2
[junit4:junit4]   2> 20224 T2333 C175 P

[...truncated too long message...]

net.SocketInputStream.read(SocketInputStream.java:121)
[junit4:junit4]    > 	at org.apache.http.impl.io.AbstractSessionInputBuffer.fillBuffer(AbstractSessionInputBuffer.java:149)
[junit4:junit4]    > 	at org.apache.http.impl.io.SocketInputBuffer.fillBuffer(SocketInputBuffer.java:111)
[junit4:junit4]    > 	at org.apache.http.impl.io.AbstractSessionInputBuffer.readLine(AbstractSessionInputBuffer.java:264)
[junit4:junit4]    > 	at org.apache.http.impl.conn.DefaultResponseParser.parseHead(DefaultResponseParser.java:98)
[junit4:junit4]    > 	at org.apache.http.impl.io.AbstractMessageParser.parse(AbstractMessageParser.java:252)
[junit4:junit4]    > 	at org.apache.http.impl.AbstractHttpClientConnection.receiveResponseHeader(AbstractHttpClientConnection.java:282)
[junit4:junit4]    > 	at org.apache.http.impl.conn.DefaultClientConnection.receiveResponseHeader(DefaultClientConnection.java:247)
[junit4:junit4]    > 	at org.apache.http.impl.conn.AbstractClientConnAdapter.receiveResponseHeader(AbstractClientConnAdapter.java:216)
[junit4:junit4]    > 	at org.apache.http.protocol.HttpRequestExecutor.doReceiveResponse(HttpRequestExecutor.java:298)
[junit4:junit4]    > 	at org.apache.http.protocol.HttpRequestExecutor.execute(HttpRequestExecutor.java:125)
[junit4:junit4]    > 	at org.apache.http.impl.client.DefaultRequestDirector.tryExecute(DefaultRequestDirector.java:647)
[junit4:junit4]    > 	at org.apache.http.impl.client.DefaultRequestDirector.execute(DefaultRequestDirector.java:464)
[junit4:junit4]    > 	at org.apache.http.impl.client.AbstractHttpClient.execute(AbstractHttpClient.java:820)
[junit4:junit4]    > 	at org.apache.http.impl.client.AbstractHttpClient.execute(AbstractHttpClient.java:754)
[junit4:junit4]    > 	at org.apache.http.impl.client.AbstractHttpClient.execute(AbstractHttpClient.java:732)
[junit4:junit4]    > 	at org.apache.solr.client.solrj.impl.HttpSolrServer.request(HttpSolrServer.java:353)
[junit4:junit4]    > 	... 5 more
[junit4:junit4]    > Throwable #3: com.carrotsearch.randomizedtesting.UncaughtExceptionError: Captured an uncaught exception in thread: Thread[id=2592, name=testExecutor-1582-thread-2, state=RUNNABLE, group=TGRP-BasicDistributedZkTest]
[junit4:junit4]    > Caused by: java.lang.RuntimeException: org.apache.solr.client.solrj.SolrServerException: IOException occured when talking to server at: http://127.0.0.1:51793
[junit4:junit4]    > 	at __randomizedtesting.SeedInfo.seed([8809D9FC444D0118]:0)
[junit4:junit4]    > 	at org.apache.solr.cloud.BasicDistributedZkTest$2.run(BasicDistributedZkTest.java:722)
[junit4:junit4]    > 	at java.util.concurrent.ThreadPoolExecutor.runWorker(ThreadPoolExecutor.java:1110)
[junit4:junit4]    > 	at java.util.concurrent.ThreadPoolExecutor$Worker.run(ThreadPoolExecutor.java:603)
[junit4:junit4]    > 	at java.lang.Thread.run(Thread.java:722)
[junit4:junit4]    > Caused by: org.apache.solr.client.solrj.SolrServerException: IOException occured when talking to server at: http://127.0.0.1:51793
[junit4:junit4]    > 	at org.apache.solr.client.solrj.impl.HttpSolrServer.request(HttpSolrServer.java:416)
[junit4:junit4]    > 	at org.apache.solr.client.solrj.impl.HttpSolrServer.request(HttpSolrServer.java:181)
[junit4:junit4]    > 	at org.apache.solr.cloud.BasicDistributedZkTest$2.run(BasicDistributedZkTest.java:720)
[junit4:junit4]    > 	... 3 more
[junit4:junit4]    > Caused by: java.net.SocketException: Invalid argument
[junit4:junit4]    > 	at java.net.SocketInputStream.socketRead0(Native Method)
[junit4:junit4]    > 	at java.net.SocketInputStream.read(SocketInputStream.java:150)
[junit4:junit4]    > 	at java.net.SocketInputStream.read(SocketInputStream.java:121)
[junit4:junit4]    > 	at org.apache.http.impl.io.AbstractSessionInputBuffer.fillBuffer(AbstractSessionInputBuffer.java:149)
[junit4:junit4]    > 	at org.apache.http.impl.io.SocketInputBuffer.fillBuffer(SocketInputBuffer.java:111)
[junit4:junit4]    > 	at org.apache.http.impl.io.AbstractSessionInputBuffer.readLine(AbstractSessionInputBuffer.java:264)
[junit4:junit4]    > 	at org.apache.http.impl.conn.DefaultResponseParser.parseHead(DefaultResponseParser.java:98)
[junit4:junit4]    > 	at org.apache.http.impl.io.AbstractMessageParser.parse(AbstractMessageParser.java:252)
[junit4:junit4]    > 	at org.apache.http.impl.AbstractHttpClientConnection.receiveResponseHeader(AbstractHttpClientConnection.java:282)
[junit4:junit4]    > 	at org.apache.http.impl.conn.DefaultClientConnection.receiveResponseHeader(DefaultClientConnection.java:247)
[junit4:junit4]    > 	at org.apache.http.impl.conn.AbstractClientConnAdapter.receiveResponseHeader(AbstractClientConnAdapter.java:216)
[junit4:junit4]    > 	at org.apache.http.protocol.HttpRequestExecutor.doReceiveResponse(HttpRequestExecutor.java:298)
[junit4:junit4]    > 	at org.apache.http.protocol.HttpRequestExecutor.execute(HttpRequestExecutor.java:125)
[junit4:junit4]    > 	at org.apache.http.impl.client.DefaultRequestDirector.tryExecute(DefaultRequestDirector.java:647)
[junit4:junit4]    > 	at org.apache.http.impl.client.DefaultRequestDirector.execute(DefaultRequestDirector.java:464)
[junit4:junit4]    > 	at org.apache.http.impl.client.AbstractHttpClient.execute(AbstractHttpClient.java:820)
[junit4:junit4]    > 	at org.apache.http.impl.client.AbstractHttpClient.execute(AbstractHttpClient.java:754)
[junit4:junit4]    > 	at org.apache.http.impl.client.AbstractHttpClient.execute(AbstractHttpClient.java:732)
[junit4:junit4]    > 	at org.apache.solr.client.solrj.impl.HttpSolrServer.request(HttpSolrServer.java:353)
[junit4:junit4]    > 	... 5 more
[junit4:junit4]   2> 205684 T2267 oas.SolrTestCaseJ4.deleteCore ###deleteCore
[junit4:junit4]   2> NOTE: test params are: codec=Asserting, sim=RandomSimilarityProvider(queryNorm=false,coord=no): {}, locale=sr_ME, timezone=Etc/GMT+2
[junit4:junit4]   2> NOTE: Mac OS X 10.8.2 x86_64/Oracle Corporation 1.7.0_10 (64-bit)/cpus=2,threads=1,free=45189152,total=207126528
[junit4:junit4]   2> NOTE: All tests run in this JVM: [TestPHPSerializedResponseWriter, SchemaVersionSpecificBehaviorTest, TestSearchPerf, SolrCoreCheckLockOnStartupTest, PrimUtilsTest, PeerSyncTest, TestExtendedDismaxParser, TestPartialUpdateDeduplication, BinaryUpdateRequestHandlerTest, TestQuerySenderListener, OpenExchangeRatesOrgProviderTest, FileBasedSpellCheckerTest, TimeZoneUtilsTest, HighlighterConfigTest, SuggesterFSTTest, ShardRoutingTest, NumericFieldsTest, LukeRequestHandlerTest, PreAnalyzedFieldTest, SignatureUpdateProcessorFactoryTest, TestLMJelinekMercerSimilarityFactory, TestDocSet, RAMDirectoryFactoryTest, TestPostingsSolrHighlighter, MBeansHandlerTest, JSONWriterTest, LeaderElectionTest, TestLuceneMatchVersion, TermsComponentTest, SpellingQueryConverterTest, TestReversedWildcardFilterFactory, FileUtilsTest, TestPerFieldSimilarity, SpellCheckComponentTest, ReturnFieldsTest, ZkSolrClientTest, AnalysisAfterCoreReloadTest, BadComponentTest, ExternalFileFieldSortTest, TestUpdate, BasicFunctionalityTest, CoreContainerCoreInitFailuresTest, CircularListTest, SolrIndexSplitterTest, TestCharFilters, TestBM25SimilarityFactory, TestSolrDeletionPolicy2, TestSurroundQueryParser, XmlUpdateRequestHandlerTest, ResponseLogComponentTest, TestFastOutputStream, TestSystemIdResolver, TestMergePolicyConfig, SpellCheckCollatorTest, StandardRequestHandlerTest, TestJoin, TestCollationField, AutoCommitTest, PolyFieldTest, TestRandomFaceting, DisMaxRequestHandlerTest, MinimalSchemaTest, TestPropInjectDefaults, TestQueryUtils, RequiredFieldsTest, UpdateParamsTest, SystemInfoHandlerTest, SimpleFacetsTest, TestComponentsName, TestElisionMultitermQuery, UUIDFieldTest, SoftAutoCommitTest, TestLazyCores, UniqFieldsUpdateProcessorFactoryTest, TestReplicationHandler, DateFieldTest, TestQuerySenderNoQuery, BasicDistributedZk2Test, CollectionsAPIDistributedZkTest, TestRangeQuery, TestAtomicUpdateErrorCases, IndexSchemaRuntimeFieldTest, TestStressReorder, PathHierarchyTokenizerFactoryTest, TestXIncludeConfig, ClusterStateUpdateTest, SuggesterTest, FieldAnalysisRequestHandlerTest, NotRequiredUniqueKeyTest, TestAnalyzedSuggestions, ZkCLITest, TestRealTimeGet, TestWriterPerf, LoggingHandlerTest, TestDistributedSearch, TestZkChroot, TestUtils, MoreLikeThisHandlerTest, StatelessScriptUpdateProcessorFactoryTest, TestIndexingPerformance, DocumentBuilderTest, HighlighterTest, DocumentAnalysisRequestHandlerTest, SpatialFilterTest, TestStressRecovery, TestReload, BasicZkTest, DateMathParserTest, TestSolrCoreProperties, DirectUpdateHandlerOptimizeTest, TermVectorComponentDistributedTest, IndexBasedSpellCheckerTest, DirectSolrConnectionTest, BasicDistributedZkTest]
[junit4:junit4] Completed in 206.20s, 1 test, 1 error <<< FAILURES!

[...truncated 405 lines...]
BUILD FAILED
/Users/jenkins/jenkins-slave/workspace/Lucene-Solr-4.x-MacOSX/build.xml:381: The following error occurred while executing this line:
/Users/jenkins/jenkins-slave/workspace/Lucene-Solr-4.x-MacOSX/build.xml:361: The following error occurred while executing this line:
/Users/jenkins/jenkins-slave/workspace/Lucene-Solr-4.x-MacOSX/build.xml:39: The following error occurred while executing this line:
/Users/jenkins/jenkins-slave/workspace/Lucene-Solr-4.x-MacOSX/solr/build.xml:183: The following error occurred while executing this line:
/Users/jenkins/jenkins-slave/workspace/Lucene-Solr-4.x-MacOSX/solr/common-build.xml:447: The following error occurred while executing this line:
/Users/jenkins/jenkins-slave/workspace/Lucene-Solr-4.x-MacOSX/lucene/common-build.xml:1202: The following error occurred while executing this line:
/Users/jenkins/jenkins-slave/workspace/Lucene-Solr-4.x-MacOSX/lucene/common-build.xml:865: There were test failures: 251 suites, 1043 tests, 1 error, 13 ignored (2 assumptions)

Total time: 61 minutes 57 seconds
Build step 'Invoke Ant' marked build as failure
Archiving artifacts
Recording test results
Description set: Java: 64bit/jdk1.7.0 -XX:+UseConcMarkSweepGC
Email was triggered for: Failure
Sending email for trigger: Failure



Mime
View raw message