lucene-dev mailing list archives

Site index · List index
Message view « Date » · « Thread »
Top « Date » · « Thread »
From Policeman Jenkins Server <jenk...@thetaphi.de>
Subject [JENKINS] Lucene-Solr-4.x-Linux (32bit/jdk1.7.0_15) - Build # 4470 - Still Failing!
Date Wed, 27 Feb 2013 03:41:54 GMT
Build: http://jenkins.thetaphi.de/job/Lucene-Solr-4.x-Linux/4470/
Java: 32bit/jdk1.7.0_15 -client -XX:+UseSerialGC

4 tests failed.
FAILED:  org.apache.solr.schema.DocValuesMultiTest.testDocValues

Error Message:
Error opening new searcher

Stack Trace:
org.apache.solr.common.SolrException: Error opening new searcher
	at __randomizedtesting.SeedInfo.seed([ABD4CDDB66739931:B3F87F23C48FFFA]:0)
	at org.apache.solr.core.SolrCore.openNewSearcher(SolrCore.java:1415)
	at org.apache.solr.schema.DocValuesMultiTest.testDocValues(DocValuesMultiTest.java:51)
	at sun.reflect.NativeMethodAccessorImpl.invoke0(Native Method)
	at sun.reflect.NativeMethodAccessorImpl.invoke(NativeMethodAccessorImpl.java:57)
	at sun.reflect.DelegatingMethodAccessorImpl.invoke(DelegatingMethodAccessorImpl.java:43)
	at java.lang.reflect.Method.invoke(Method.java:601)
	at com.carrotsearch.randomizedtesting.RandomizedRunner.invoke(RandomizedRunner.java:1559)
	at com.carrotsearch.randomizedtesting.RandomizedRunner.access$600(RandomizedRunner.java:79)
	at com.carrotsearch.randomizedtesting.RandomizedRunner$6.evaluate(RandomizedRunner.java:737)
	at com.carrotsearch.randomizedtesting.RandomizedRunner$7.evaluate(RandomizedRunner.java:773)
	at com.carrotsearch.randomizedtesting.RandomizedRunner$8.evaluate(RandomizedRunner.java:787)
	at com.carrotsearch.randomizedtesting.rules.SystemPropertiesRestoreRule$1.evaluate(SystemPropertiesRestoreRule.java:53)
	at org.apache.lucene.util.TestRuleSetupTeardownChained$1.evaluate(TestRuleSetupTeardownChained.java:50)
	at org.apache.lucene.util.TestRuleFieldCacheSanity$1.evaluate(TestRuleFieldCacheSanity.java:51)
	at org.apache.lucene.util.AbstractBeforeAfterRule$1.evaluate(AbstractBeforeAfterRule.java:46)
	at com.carrotsearch.randomizedtesting.rules.SystemPropertiesInvariantRule$1.evaluate(SystemPropertiesInvariantRule.java:55)
	at org.apache.lucene.util.TestRuleThreadAndTestName$1.evaluate(TestRuleThreadAndTestName.java:49)
	at org.apache.lucene.util.TestRuleIgnoreAfterMaxFailures$1.evaluate(TestRuleIgnoreAfterMaxFailures.java:70)
	at org.apache.lucene.util.TestRuleMarkFailure$1.evaluate(TestRuleMarkFailure.java:48)
	at com.carrotsearch.randomizedtesting.rules.StatementAdapter.evaluate(StatementAdapter.java:36)
	at com.carrotsearch.randomizedtesting.ThreadLeakControl$StatementRunner.run(ThreadLeakControl.java:358)
	at com.carrotsearch.randomizedtesting.ThreadLeakControl.forkTimeoutingTask(ThreadLeakControl.java:782)
	at com.carrotsearch.randomizedtesting.ThreadLeakControl$3.evaluate(ThreadLeakControl.java:442)
	at com.carrotsearch.randomizedtesting.RandomizedRunner.runSingleTest(RandomizedRunner.java:746)
	at com.carrotsearch.randomizedtesting.RandomizedRunner$3.evaluate(RandomizedRunner.java:648)
	at com.carrotsearch.randomizedtesting.RandomizedRunner$4.evaluate(RandomizedRunner.java:682)
	at com.carrotsearch.randomizedtesting.RandomizedRunner$5.evaluate(RandomizedRunner.java:693)
	at com.carrotsearch.randomizedtesting.rules.StatementAdapter.evaluate(StatementAdapter.java:36)
	at com.carrotsearch.randomizedtesting.rules.SystemPropertiesRestoreRule$1.evaluate(SystemPropertiesRestoreRule.java:53)
	at org.apache.lucene.util.AbstractBeforeAfterRule$1.evaluate(AbstractBeforeAfterRule.java:46)
	at org.apache.lucene.util.TestRuleStoreClassName$1.evaluate(TestRuleStoreClassName.java:42)
	at com.carrotsearch.randomizedtesting.rules.SystemPropertiesInvariantRule$1.evaluate(SystemPropertiesInvariantRule.java:55)
	at com.carrotsearch.randomizedtesting.rules.NoShadowingOrOverridesOnMethodsRule$1.evaluate(NoShadowingOrOverridesOnMethodsRule.java:39)
	at com.carrotsearch.randomizedtesting.rules.NoShadowingOrOverridesOnMethodsRule$1.evaluate(NoShadowingOrOverridesOnMethodsRule.java:39)
	at com.carrotsearch.randomizedtesting.rules.StatementAdapter.evaluate(StatementAdapter.java:36)
	at org.apache.lucene.util.TestRuleAssertionsRequired$1.evaluate(TestRuleAssertionsRequired.java:43)
	at org.apache.lucene.util.TestRuleMarkFailure$1.evaluate(TestRuleMarkFailure.java:48)
	at org.apache.lucene.util.TestRuleIgnoreAfterMaxFailures$1.evaluate(TestRuleIgnoreAfterMaxFailures.java:70)
	at org.apache.lucene.util.TestRuleIgnoreTestSuites$1.evaluate(TestRuleIgnoreTestSuites.java:55)
	at com.carrotsearch.randomizedtesting.rules.StatementAdapter.evaluate(StatementAdapter.java:36)
	at com.carrotsearch.randomizedtesting.ThreadLeakControl$StatementRunner.run(ThreadLeakControl.java:358)
	at java.lang.Thread.run(Thread.java:722)
Caused by: java.lang.UnsupportedOperationException: Lucene 4.0 does not support SortedSet docvalues
	at org.apache.lucene.codecs.lucene40.Lucene40DocValuesWriter.addSortedSetField(Lucene40DocValuesWriter.java:498)
	at org.apache.lucene.index.SortedSetDocValuesWriter.flush(SortedSetDocValuesWriter.java:161)
	at org.apache.lucene.index.DocValuesProcessor.flush(DocValuesProcessor.java:82)
	at org.apache.lucene.index.TwoStoredFieldsConsumers.flush(TwoStoredFieldsConsumers.java:42)
	at org.apache.lucene.index.DocFieldProcessor.flush(DocFieldProcessor.java:80)
	at org.apache.lucene.index.DocumentsWriterPerThread.flush(DocumentsWriterPerThread.java:493)
	at org.apache.lucene.index.DocumentsWriter.doFlush(DocumentsWriter.java:422)
	at org.apache.lucene.index.DocumentsWriter.flushAllThreads(DocumentsWriter.java:559)
	at org.apache.lucene.index.IndexWriter.getReader(IndexWriter.java:357)
	at org.apache.lucene.index.StandardDirectoryReader.doOpenIfChanged(StandardDirectoryReader.java:257)
	at org.apache.lucene.index.DirectoryReader.openIfChanged(DirectoryReader.java:249)
	at org.apache.solr.core.SolrCore.openNewSearcher(SolrCore.java:1353)
	... 41 more


FAILED:  org.apache.solr.schema.DocValuesMultiTest.testFloatDocValuesMatch

Error Message:
java.lang.UnsupportedOperationException: Lucene 4.0 does not support SortedSet docvalues

Stack Trace:
org.apache.solr.common.SolrException: java.lang.UnsupportedOperationException: Lucene 4.0 does not support SortedSet docvalues
	at __randomizedtesting.SeedInfo.seed([ABD4CDDB66739931:C07FA1D2FED2C84D]:0)
	at org.apache.solr.util.TestHarness.update(TestHarness.java:266)
	at org.apache.solr.util.TestHarness.checkUpdateStatus(TestHarness.java:312)
	at org.apache.solr.util.TestHarness.validateUpdate(TestHarness.java:282)
	at org.apache.solr.SolrTestCaseJ4.checkUpdateU(SolrTestCaseJ4.java:472)
	at org.apache.solr.SolrTestCaseJ4.assertU(SolrTestCaseJ4.java:451)
	at org.apache.solr.SolrTestCaseJ4.assertU(SolrTestCaseJ4.java:445)
	at org.apache.solr.schema.DocValuesMultiTest.testFloatDocValuesMatch(DocValuesMultiTest.java:129)
	at sun.reflect.NativeMethodAccessorImpl.invoke0(Native Method)
	at sun.reflect.NativeMethodAccessorImpl.invoke(NativeMethodAccessorImpl.java:57)
	at sun.reflect.DelegatingMethodAccessorImpl.invoke(DelegatingMethodAccessorImpl.java:43)
	at java.lang.reflect.Method.invoke(Method.java:601)
	at com.carrotsearch.randomizedtesting.RandomizedRunner.invoke(RandomizedRunner.java:1559)
	at com.carrotsearch.randomizedtesting.RandomizedRunner.access$600(RandomizedRunner.java:79)
	at com.carrotsearch.randomizedtesting.RandomizedRunner$6.evaluate(RandomizedRunner.java:737)
	at com.carrotsearch.randomizedtesting.RandomizedRunner$7.evaluate(RandomizedRunner.java:773)
	at com.carrotsearch.randomizedtesting.RandomizedRunner$8.evaluate(RandomizedRunner.java:787)
	at com.carrotsearch.randomizedtesting.rules.SystemPropertiesRestoreRule$1.evaluate(SystemPropertiesRestoreRule.java:53)
	at org.apache.lucene.util.TestRuleSetupTeardownChained$1.evaluate(TestRuleSetupTeardownChained.java:50)
	at org.apache.lucene.util.TestRuleFieldCacheSanity$1.evaluate(TestRuleFieldCacheSanity.java:51)
	at org.apache.lucene.util.AbstractBeforeAfterRule$1.evaluate(AbstractBeforeAfterRule.java:46)
	at com.carrotsearch.randomizedtesting.rules.SystemPropertiesInvariantRule$1.evaluate(SystemPropertiesInvariantRule.java:55)
	at org.apache.lucene.util.TestRuleThreadAndTestName$1.evaluate(TestRuleThreadAndTestName.java:49)
	at org.apache.lucene.util.TestRuleIgnoreAfterMaxFailures$1.evaluate(TestRuleIgnoreAfterMaxFailures.java:70)
	at org.apache.lucene.util.TestRuleMarkFailure$1.evaluate(TestRuleMarkFailure.java:48)
	at com.carrotsearch.randomizedtesting.rules.StatementAdapter.evaluate(StatementAdapter.java:36)
	at com.carrotsearch.randomizedtesting.ThreadLeakControl$StatementRunner.run(ThreadLeakControl.java:358)
	at com.carrotsearch.randomizedtesting.ThreadLeakControl.forkTimeoutingTask(ThreadLeakControl.java:782)
	at com.carrotsearch.randomizedtesting.ThreadLeakControl$3.evaluate(ThreadLeakControl.java:442)
	at com.carrotsearch.randomizedtesting.RandomizedRunner.runSingleTest(RandomizedRunner.java:746)
	at com.carrotsearch.randomizedtesting.RandomizedRunner$3.evaluate(RandomizedRunner.java:648)
	at com.carrotsearch.randomizedtesting.RandomizedRunner$4.evaluate(RandomizedRunner.java:682)
	at com.carrotsearch.randomizedtesting.RandomizedRunner$5.evaluate(RandomizedRunner.java:693)
	at com.carrotsearch.randomizedtesting.rules.StatementAdapter.evaluate(StatementAdapter.java:36)
	at com.carrotsearch.randomizedtesting.rules.SystemPropertiesRestoreRule$1.evaluate(SystemPropertiesRestoreRule.java:53)
	at org.apache.lucene.util.AbstractBeforeAfterRule$1.evaluate(AbstractBeforeAfterRule.java:46)
	at org.apache.lucene.util.TestRuleStoreClassName$1.evaluate(TestRuleStoreClassName.java:42)
	at com.carrotsearch.randomizedtesting.rules.SystemPropertiesInvariantRule$1.evaluate(SystemPropertiesInvariantRule.java:55)
	at com.carrotsearch.randomizedtesting.rules.NoShadowingOrOverridesOnMethodsRule$1.evaluate(NoShadowingOrOverridesOnMethodsRule.java:39)
	at com.carrotsearch.randomizedtesting.rules.NoShadowingOrOverridesOnMethodsRule$1.evaluate(NoShadowingOrOverridesOnMethodsRule.java:39)
	at com.carrotsearch.randomizedtesting.rules.StatementAdapter.evaluate(StatementAdapter.java:36)
	at org.apache.lucene.util.TestRuleAssertionsRequired$1.evaluate(TestRuleAssertionsRequired.java:43)
	at org.apache.lucene.util.TestRuleMarkFailure$1.evaluate(TestRuleMarkFailure.java:48)
	at org.apache.lucene.util.TestRuleIgnoreAfterMaxFailures$1.evaluate(TestRuleIgnoreAfterMaxFailures.java:70)
	at org.apache.lucene.util.TestRuleIgnoreTestSuites$1.evaluate(TestRuleIgnoreTestSuites.java:55)
	at com.carrotsearch.randomizedtesting.rules.StatementAdapter.evaluate(StatementAdapter.java:36)
	at com.carrotsearch.randomizedtesting.ThreadLeakControl$StatementRunner.run(ThreadLeakControl.java:358)
	at java.lang.Thread.run(Thread.java:722)
Caused by: java.lang.UnsupportedOperationException: Lucene 4.0 does not support SortedSet docvalues
	at org.apache.lucene.codecs.lucene40.Lucene40DocValuesWriter.addSortedSetField(Lucene40DocValuesWriter.java:498)
	at org.apache.lucene.index.SortedSetDocValuesWriter.flush(SortedSetDocValuesWriter.java:161)
	at org.apache.lucene.index.DocValuesProcessor.flush(DocValuesProcessor.java:82)
	at org.apache.lucene.index.TwoStoredFieldsConsumers.flush(TwoStoredFieldsConsumers.java:42)
	at org.apache.lucene.index.DocFieldProcessor.flush(DocFieldProcessor.java:80)
	at org.apache.lucene.index.DocumentsWriterPerThread.flush(DocumentsWriterPerThread.java:493)
	at org.apache.lucene.index.DocumentsWriter.doFlush(DocumentsWriter.java:422)
	at org.apache.lucene.index.DocumentsWriter.flushAllThreads(DocumentsWriter.java:559)
	at org.apache.lucene.index.IndexWriter.prepareCommitInternal(IndexWriter.java:2683)
	at org.apache.lucene.index.IndexWriter.commitInternal(IndexWriter.java:2827)
	at org.apache.lucene.index.IndexWriter.commit(IndexWriter.java:2807)
	at org.apache.solr.update.DirectUpdateHandler2.commit(DirectUpdateHandler2.java:541)
	at org.apache.solr.update.processor.RunUpdateProcessor.processCommit(RunUpdateProcessorFactory.java:95)
	at org.apache.solr.update.processor.UpdateRequestProcessor.processCommit(UpdateRequestProcessor.java:64)
	at org.apache.solr.update.processor.DistributedUpdateProcessor.processCommit(DistributedUpdateProcessor.java:1055)
	at org.apache.solr.update.processor.LogUpdateProcessor.processCommit(LogUpdateProcessorFactory.java:157)
	at org.apache.solr.handler.loader.XMLLoader.processUpdate(XMLLoader.java:266)
	at org.apache.solr.handler.loader.XMLLoader.load(XMLLoader.java:173)
	at org.apache.solr.handler.UpdateRequestHandler$1.load(UpdateRequestHandler.java:92)
	at org.apache.solr.handler.ContentStreamHandlerBase.handleRequestBody(ContentStreamHandlerBase.java:74)
	at org.apache.solr.handler.RequestHandlerBase.handleRequest(RequestHandlerBase.java:135)
	at org.apache.solr.core.SolrCore.execute(SolrCore.java:1808)
	at org.apache.solr.servlet.DirectSolrConnection.request(DirectSolrConnection.java:131)
	at org.apache.solr.util.TestHarness.update(TestHarness.java:262)
	... 46 more


FAILED:  org.apache.solr.schema.DocValuesMultiTest.testDocValuesFacetingSimple

Error Message:
java.lang.UnsupportedOperationException: Lucene 4.0 does not support SortedSet docvalues

Stack Trace:
org.apache.solr.common.SolrException: java.lang.UnsupportedOperationException: Lucene 4.0 does not support SortedSet docvalues
	at __randomizedtesting.SeedInfo.seed([ABD4CDDB66739931:80A54839FFBE98E5]:0)
	at org.apache.solr.util.TestHarness.update(TestHarness.java:266)
	at org.apache.solr.util.TestHarness.checkUpdateStatus(TestHarness.java:312)
	at org.apache.solr.util.TestHarness.validateUpdate(TestHarness.java:282)
	at org.apache.solr.SolrTestCaseJ4.checkUpdateU(SolrTestCaseJ4.java:472)
	at org.apache.solr.SolrTestCaseJ4.assertU(SolrTestCaseJ4.java:451)
	at org.apache.solr.SolrTestCaseJ4.assertU(SolrTestCaseJ4.java:445)
	at org.apache.solr.schema.DocValuesMultiTest.testDocValuesFacetingSimple(DocValuesMultiTest.java:157)
	at sun.reflect.NativeMethodAccessorImpl.invoke0(Native Method)
	at sun.reflect.NativeMethodAccessorImpl.invoke(NativeMethodAccessorImpl.java:57)
	at sun.reflect.DelegatingMethodAccessorImpl.invoke(DelegatingMethodAccessorImpl.java:43)
	at java.lang.reflect.Method.invoke(Method.java:601)
	at com.carrotsearch.randomizedtesting.RandomizedRunner.invoke(RandomizedRunner.java:1559)
	at com.carrotsearch.randomizedtesting.RandomizedRunner.access$600(RandomizedRunner.java:79)
	at com.carrotsearch.randomizedtesting.RandomizedRunner$6.evaluate(RandomizedRunner.java:737)
	at com.carrotsearch.randomizedtesting.RandomizedRunner$7.evaluate(RandomizedRunner.java:773)
	at com.carrotsearch.randomizedtesting.RandomizedRunner$8.evaluate(RandomizedRunner.java:787)
	at com.carrotsearch.randomizedtesting.rules.SystemPropertiesRestoreRule$1.evaluate(SystemPropertiesRestoreRule.java:53)
	at org.apache.lucene.util.TestRuleSetupTeardownChained$1.evaluate(TestRuleSetupTeardownChained.java:50)
	at org.apache.lucene.util.TestRuleFieldCacheSanity$1.evaluate(TestRuleFieldCacheSanity.java:51)
	at org.apache.lucene.util.AbstractBeforeAfterRule$1.evaluate(AbstractBeforeAfterRule.java:46)
	at com.carrotsearch.randomizedtesting.rules.SystemPropertiesInvariantRule$1.evaluate(SystemPropertiesInvariantRule.java:55)
	at org.apache.lucene.util.TestRuleThreadAndTestName$1.evaluate(TestRuleThreadAndTestName.java:49)
	at org.apache.lucene.util.TestRuleIgnoreAfterMaxFailures$1.evaluate(TestRuleIgnoreAfterMaxFailures.java:70)
	at org.apache.lucene.util.TestRuleMarkFailure$1.evaluate(TestRuleMarkFailure.java:48)
	at com.carrotsearch.randomizedtesting.rules.StatementAdapter.evaluate(StatementAdapter.java:36)
	at com.carrotsearch.randomizedtesting.ThreadLeakControl$StatementRunner.run(ThreadLeakControl.java:358)
	at com.carrotsearch.randomizedtesting.ThreadLeakControl.forkTimeoutingTask(ThreadLeakControl.java:782)
	at com.carrotsearch.randomizedtesting.ThreadLeakControl$3.evaluate(ThreadLeakControl.java:442)
	at com.carrotsearch.randomizedtesting.RandomizedRunner.runSingleTest(RandomizedRunner.java:746)
	at com.carrotsearch.randomizedtesting.RandomizedRunner$3.evaluate(RandomizedRunner.java:648)
	at com.carrotsearch.randomizedtesting.RandomizedRunner$4.evaluate(RandomizedRunner.java:682)
	at com.carrotsearch.randomizedtesting.RandomizedRunner$5.evaluate(RandomizedRunner.java:693)
	at com.carrotsearch.randomizedtesting.rules.StatementAdapter.evaluate(StatementAdapter.java:36)
	at com.carrotsearch.randomizedtesting.rules.SystemPropertiesRestoreRule$1.evaluate(SystemPropertiesRestoreRule.java:53)
	at org.apache.lucene.util.AbstractBeforeAfterRule$1.evaluate(AbstractBeforeAfterRule.java:46)
	at org.apache.lucene.util.TestRuleStoreClassName$1.evaluate(TestRuleStoreClassName.java:42)
	at com.carrotsearch.randomizedtesting.rules.SystemPropertiesInvariantRule$1.evaluate(SystemPropertiesInvariantRule.java:55)
	at com.carrotsearch.randomizedtesting.rules.NoShadowingOrOverridesOnMethodsRule$1.evaluate(NoShadowingOrOverridesOnMethodsRule.java:39)
	at com.carrotsearch.randomizedtesting.rules.NoShadowingOrOverridesOnMethodsRule$1.evaluate(NoShadowingOrOverridesOnMethodsRule.java:39)
	at com.carrotsearch.randomizedtesting.rules.StatementAdapter.evaluate(StatementAdapter.java:36)
	at org.apache.lucene.util.TestRuleAssertionsRequired$1.evaluate(TestRuleAssertionsRequired.java:43)
	at org.apache.lucene.util.TestRuleMarkFailure$1.evaluate(TestRuleMarkFailure.java:48)
	at org.apache.lucene.util.TestRuleIgnoreAfterMaxFailures$1.evaluate(TestRuleIgnoreAfterMaxFailures.java:70)
	at org.apache.lucene.util.TestRuleIgnoreTestSuites$1.evaluate(TestRuleIgnoreTestSuites.java:55)
	at com.carrotsearch.randomizedtesting.rules.StatementAdapter.evaluate(StatementAdapter.java:36)
	at com.carrotsearch.randomizedtesting.ThreadLeakControl$StatementRunner.run(ThreadLeakControl.java:358)
	at java.lang.Thread.run(Thread.java:722)
Caused by: java.lang.UnsupportedOperationException: Lucene 4.0 does not support SortedSet docvalues
	at org.apache.lucene.codecs.lucene40.Lucene40DocValuesWriter.addSortedSetField(Lucene40DocValuesWriter.java:498)
	at org.apache.lucene.index.SortedSetDocValuesWriter.flush(SortedSetDocValuesWriter.java:161)
	at org.apache.lucene.index.DocValuesProcessor.flush(DocValuesProcessor.java:82)
	at org.apache.lucene.index.TwoStoredFieldsConsumers.flush(TwoStoredFieldsConsumers.java:42)
	at org.apache.lucene.index.DocFieldProcessor.flush(DocFieldProcessor.java:80)
	at org.apache.lucene.index.DocumentsWriterPerThread.flush(DocumentsWriterPerThread.java:493)
	at org.apache.lucene.index.DocumentsWriter.doFlush(DocumentsWriter.java:422)
	at org.apache.lucene.index.DocumentsWriter.flushAllThreads(DocumentsWriter.java:559)
	at org.apache.lucene.index.IndexWriter.prepareCommitInternal(IndexWriter.java:2683)
	at org.apache.lucene.index.IndexWriter.commitInternal(IndexWriter.java:2827)
	at org.apache.lucene.index.IndexWriter.commit(IndexWriter.java:2807)
	at org.apache.solr.update.DirectUpdateHandler2.commit(DirectUpdateHandler2.java:541)
	at org.apache.solr.update.processor.RunUpdateProcessor.processCommit(RunUpdateProcessorFactory.java:95)
	at org.apache.solr.update.processor.UpdateRequestProcessor.processCommit(UpdateRequestProcessor.java:64)
	at org.apache.solr.update.processor.DistributedUpdateProcessor.processCommit(DistributedUpdateProcessor.java:1055)
	at org.apache.solr.update.processor.LogUpdateProcessor.processCommit(LogUpdateProcessorFactory.java:157)
	at org.apache.solr.handler.loader.XMLLoader.processUpdate(XMLLoader.java:266)
	at org.apache.solr.handler.loader.XMLLoader.load(XMLLoader.java:173)
	at org.apache.solr.handler.UpdateRequestHandler$1.load(UpdateRequestHandler.java:92)
	at org.apache.solr.handler.ContentStreamHandlerBase.handleRequestBody(ContentStreamHandlerBase.java:74)
	at org.apache.solr.handler.RequestHandlerBase.handleRequest(RequestHandlerBase.java:135)
	at org.apache.solr.core.SolrCore.execute(SolrCore.java:1808)
	at org.apache.solr.servlet.DirectSolrConnection.request(DirectSolrConnection.java:131)
	at org.apache.solr.util.TestHarness.update(TestHarness.java:262)
	... 46 more


FAILED:  org.apache.solr.schema.DocValuesMultiTest.testStringDocValuesMatch

Error Message:
java.lang.UnsupportedOperationException: Lucene 4.0 does not support SortedSet docvalues

Stack Trace:
org.apache.solr.common.SolrException: java.lang.UnsupportedOperationException: Lucene 4.0 does not support SortedSet docvalues
	at __randomizedtesting.SeedInfo.seed([ABD4CDDB66739931:C16B188DB7B9C581]:0)
	at org.apache.solr.util.TestHarness.update(TestHarness.java:266)
	at org.apache.solr.util.TestHarness.checkUpdateStatus(TestHarness.java:312)
	at org.apache.solr.util.TestHarness.validateUpdate(TestHarness.java:282)
	at org.apache.solr.SolrTestCaseJ4.checkUpdateU(SolrTestCaseJ4.java:472)
	at org.apache.solr.SolrTestCaseJ4.assertU(SolrTestCaseJ4.java:451)
	at org.apache.solr.SolrTestCaseJ4.assertU(SolrTestCaseJ4.java:445)
	at org.apache.solr.schema.DocValuesMultiTest.testStringDocValuesMatch(DocValuesMultiTest.java:83)
	at sun.reflect.NativeMethodAccessorImpl.invoke0(Native Method)
	at sun.reflect.NativeMethodAccessorImpl.invoke(NativeMethodAccessorImpl.java:57)
	at sun.reflect.DelegatingMethodAccessorImpl.invoke(DelegatingMethodAccessorImpl.java:43)
	at java.lang.reflect.Method.invoke(Method.java:601)
	at com.carrotsearch.randomizedtesting.RandomizedRunner.invoke(RandomizedRunner.java:1559)
	at com.carrotsearch.randomizedtesting.RandomizedRunner.access$600(RandomizedRunner.java:79)
	at com.carrotsearch.randomizedtesting.RandomizedRunner$6.evaluate(RandomizedRunner.java:737)
	at com.carrotsearch.randomizedtesting.RandomizedRunner$7.evaluate(RandomizedRunner.java:773)
	at com.carrotsearch.randomizedtesting.RandomizedRunner$8.evaluate(RandomizedRunner.java:787)
	at com.carrotsearch.randomizedtesting.rules.SystemPropertiesRestoreRule$1.evaluate(SystemPropertiesRestoreRule.java:53)
	at org.apache.lucene.util.TestRuleSetupTeardownChained$1.evaluate(TestRuleSetupTeardownChained.java:50)
	at org.apache.lucene.util.TestRuleFieldCacheSanity$1.evaluate(TestRuleFieldCacheSanity.java:51)
	at org.apache.lucene.util.AbstractBeforeAfterRule$1.evaluate(AbstractBeforeAfterRule.java:46)
	at com.carrotsearch.randomizedtesting.rules.SystemPropertiesInvariantRule$1.evaluate(SystemPropertiesInvariantRule.java:55)
	at org.apache.lucene.util.TestRuleThreadAndTestName$1.evaluate(TestRuleThreadAndTestName.java:49)
	at org.apache.lucene.util.TestRuleIgnoreAfterMaxFailures$1.evaluate(TestRuleIgnoreAfterMaxFailures.java:70)
	at org.apache.lucene.util.TestRuleMarkFailure$1.evaluate(TestRuleMarkFailure.java:48)
	at com.carrotsearch.randomizedtesting.rules.StatementAdapter.evaluate(StatementAdapter.java:36)
	at com.carrotsearch.randomizedtesting.ThreadLeakControl$StatementRunner.run(ThreadLeakControl.java:358)
	at com.carrotsearch.randomizedtesting.ThreadLeakControl.forkTimeoutingTask(ThreadLeakControl.java:782)
	at com.carrotsearch.randomizedtesting.ThreadLeakControl$3.evaluate(ThreadLeakControl.java:442)
	at com.carrotsearch.randomizedtesting.RandomizedRunner.runSingleTest(RandomizedRunner.java:746)
	at com.carrotsearch.randomizedtesting.RandomizedRunner$3.evaluate(RandomizedRunner.java:648)
	at com.carrotsearch.randomizedtesting.RandomizedRunner$4.evaluate(RandomizedRunner.java:682)
	at com.carrotsearch.randomizedtesting.RandomizedRunner$5.evaluate(RandomizedRunner.java:693)
	at com.carrotsearch.randomizedtesting.rules.StatementAdapter.evaluate(StatementAdapter.java:36)
	at com.carrotsearch.randomizedtesting.rules.SystemPropertiesRestoreRule$1.evaluate(SystemPropertiesRestoreRule.java:53)
	at org.apache.lucene.util.AbstractBeforeAfterRule$1.evaluate(AbstractBeforeAfterRule.java:46)
	at org.apache.lucene.util.TestRuleStoreClassName$1.evaluate(TestRuleStoreClassName.java:42)
	at com.carrotsearch.randomizedtesting.rules.SystemPropertiesInvariantRule$1.evaluate(SystemPropertiesInvariantRule.java:55)
	at com.carrotsearch.randomizedtesting.rules.NoShadowingOrOverridesOnMethodsRule$1.evaluate(NoShadowingOrOverridesOnMethodsRule.java:39)
	at com.carrotsearch.randomizedtesting.rules.NoShadowingOrOverridesOnMethodsRule$1.evaluate(NoShadowingOrOverridesOnMethodsRule.java:39)
	at com.carrotsearch.randomizedtesting.rules.StatementAdapter.evaluate(StatementAdapter.java:36)
	at org.apache.lucene.util.TestRuleAssertionsRequired$1.evaluate(TestRuleAssertionsRequired.java:43)
	at org.apache.lucene.util.TestRuleMarkFailure$1.evaluate(TestRuleMarkFailure.java:48)
	at org.apache.lucene.util.TestRuleIgnoreAfterMaxFailures$1.evaluate(TestRuleIgnoreAfterMaxFailures.java:70)
	at org.apache.lucene.util.TestRuleIgnoreTestSuites$1.evaluate(TestRuleIgnoreTestSuites.java:55)
	at com.carrotsearch.randomizedtesting.rules.StatementAdapter.evaluate(StatementAdapter.java:36)
	at com.carrotsearch.randomizedtesting.ThreadLeakControl$StatementRunner.run(ThreadLeakControl.java:358)
	at java.lang.Thread.run(Thread.java:722)
Caused by: java.lang.UnsupportedOperationException: Lucene 4.0 does not support SortedSet docvalues
	at org.apache.lucene.codecs.lucene40.Lucene40DocValuesWriter.addSortedSetField(Lucene40DocValuesWriter.java:498)
	at org.apache.lucene.index.SortedSetDocValuesWriter.flush(SortedSetDocValuesWriter.java:161)
	at org.apache.lucene.index.DocValuesProcessor.flush(DocValuesProcessor.java:82)
	at org.apache.lucene.index.TwoStoredFieldsConsumers.flush(TwoStoredFieldsConsumers.java:42)
	at org.apache.lucene.index.DocFieldProcessor.flush(DocFieldProcessor.java:80)
	at org.apache.lucene.index.DocumentsWriterPerThread.flush(DocumentsWriterPerThread.java:493)
	at org.apache.lucene.index.DocumentsWriter.doFlush(DocumentsWriter.java:422)
	at org.apache.lucene.index.DocumentsWriter.flushAllThreads(DocumentsWriter.java:559)
	at org.apache.lucene.index.IndexWriter.prepareCommitInternal(IndexWriter.java:2683)
	at org.apache.lucene.index.IndexWriter.commitInternal(IndexWriter.java:2827)
	at org.apache.lucene.index.IndexWriter.commit(IndexWriter.java:2807)
	at org.apache.solr.update.DirectUpdateHandler2.commit(DirectUpdateHandler2.java:541)
	at org.apache.solr.update.processor.RunUpdateProcessor.processCommit(RunUpdateProcessorFactory.java:95)
	at org.apache.solr.update.processor.UpdateRequestProcessor.processCommit(UpdateRequestProcessor.java:64)
	at org.apache.solr.update.processor.DistributedUpdateProcessor.processCommit(DistributedUpdateProcessor.java:1055)
	at org.apache.solr.update.processor.LogUpdateProcessor.processCommit(LogUpdateProcessorFactory.java:157)
	at org.apache.solr.handler.loader.XMLLoader.processUpdate(XMLLoader.java:266)
	at org.apache.solr.handler.loader.XMLLoader.load(XMLLoader.java:173)
	at org.apache.solr.handler.UpdateRequestHandler$1.load(UpdateRequestHandler.java:92)
	at org.apache.solr.handler.ContentStreamHandlerBase.handleRequestBody(ContentStreamHandlerBase.java:74)
	at org.apache.solr.handler.RequestHandlerBase.handleRequest(RequestHandlerBase.java:135)
	at org.apache.solr.core.SolrCore.execute(SolrCore.java:1808)
	at org.apache.solr.servlet.DirectSolrConnection.request(DirectSolrConnection.java:131)
	at org.apache.solr.util.TestHarness.update(TestHarness.java:262)
	... 46 more




Build Log:
[...truncated 9583 lines...]
[junit4:junit4] Suite: org.apache.solr.schema.DocValuesMultiTest
[junit4:junit4]   2> 0 T2454 oas.SolrTestCaseJ4.initCore ####initCore
[junit4:junit4]   2> Creating dataDir: /mnt/ssd/jenkins/workspace/Lucene-Solr-4.x-Linux/solr/build/solr-core/test/J0/./solrtest-DocValuesMultiTest-1361936457536
[junit4:junit4]   2> 1 T2454 oasc.SolrResourceLoader.<init> new SolrResourceLoader for directory: '/mnt/ssd/jenkins/workspace/Lucene-Solr-4.x-Linux/solr/build/solr-core/test-files/solr/collection1/'
[junit4:junit4]   2> 1 T2454 oasc.SolrResourceLoader.replaceClassLoader Adding 'file:/mnt/ssd/jenkins/workspace/Lucene-Solr-4.x-Linux/solr/build/solr-core/test-files/solr/collection1/lib/README' to classloader
[junit4:junit4]   2> 2 T2454 oasc.SolrResourceLoader.replaceClassLoader Adding 'file:/mnt/ssd/jenkins/workspace/Lucene-Solr-4.x-Linux/solr/build/solr-core/test-files/solr/collection1/lib/classes/' to classloader
[junit4:junit4]   2> 28 T2454 oasc.SolrConfig.<init> Using Lucene MatchVersion: LUCENE_42
[junit4:junit4]   2> 63 T2454 oasc.SolrConfig.<init> Loaded SolrConfig: solrconfig-basic.xml
[junit4:junit4]   2> 64 T2454 oass.IndexSchema.readSchema Reading Solr Schema
[junit4:junit4]   2> 66 T2454 oass.IndexSchema.readSchema Schema name=schema-docValuesMulti
[junit4:junit4]   2> 92 T2454 oass.IndexSchema.readSchema unique key field: id
[junit4:junit4]   2> 93 T2454 oasc.SolrResourceLoader.locateSolrHome JNDI not configured for solr (NoInitialContextEx)
[junit4:junit4]   2> 94 T2454 oasc.SolrResourceLoader.locateSolrHome using system property solr.solr.home: /mnt/ssd/jenkins/workspace/Lucene-Solr-4.x-Linux/solr/build/solr-core/test-files/solr
[junit4:junit4]   2> 94 T2454 oasc.SolrResourceLoader.<init> new SolrResourceLoader for directory: '/mnt/ssd/jenkins/workspace/Lucene-Solr-4.x-Linux/solr/build/solr-core/test-files/solr/'
[junit4:junit4]   2> 101 T2454 oasc.CoreContainer.<init> New CoreContainer 25236398
[junit4:junit4]   2> 101 T2454 oasc.SolrCore.<init> [collection1] Opening new SolrCore at /mnt/ssd/jenkins/workspace/Lucene-Solr-4.x-Linux/solr/build/solr-core/test-files/solr/collection1/, dataDir=/mnt/ssd/jenkins/workspace/Lucene-Solr-4.x-Linux/solr/build/solr-core/test/J0/./solrtest-DocValuesMultiTest-1361936457536/
[junit4:junit4]   2> 102 T2454 oasc.SolrCore.<init> JMX monitoring not detected for core: collection1
[junit4:junit4]   2> 102 T2454 oasc.SolrCore.initDirectoryFactory org.apache.solr.core.MockDirectoryFactory
[junit4:junit4]   2> 102 T2454 oasc.CachingDirectoryFactory.get return new directory for /mnt/ssd/jenkins/workspace/Lucene-Solr-4.x-Linux/solr/build/solr-core/test/J0/./solrtest-DocValuesMultiTest-1361936457536 forceNew:false
[junit4:junit4]   2> 103 T2454 oasc.CachingDirectoryFactory.close Releasing directory:/mnt/ssd/jenkins/workspace/Lucene-Solr-4.x-Linux/solr/build/solr-core/test/J0/./solrtest-DocValuesMultiTest-1361936457536
[junit4:junit4]   2> 103 T2454 oasc.SolrCore.getNewIndexDir New index directory detected: old=null new=/mnt/ssd/jenkins/workspace/Lucene-Solr-4.x-Linux/solr/build/solr-core/test/J0/./solrtest-DocValuesMultiTest-1361936457536/index/
[junit4:junit4]   2> 103 T2454 oasc.SolrCore.initIndex WARNING [collection1] Solr index directory '/mnt/ssd/jenkins/workspace/Lucene-Solr-4.x-Linux/solr/build/solr-core/test/J0/./solrtest-DocValuesMultiTest-1361936457536/index' doesn't exist. Creating new index...
[junit4:junit4]   2> 104 T2454 oasc.CachingDirectoryFactory.get return new directory for /mnt/ssd/jenkins/workspace/Lucene-Solr-4.x-Linux/solr/build/solr-core/test/J0/./solrtest-DocValuesMultiTest-1361936457536/index forceNew:false
[junit4:junit4]   2> 104 T2454 oasc.SolrDeletionPolicy.onCommit SolrDeletionPolicy.onCommit: commits:num=1
[junit4:junit4]   2> 		commit{dir=MockDirWrapper(org.apache.lucene.store.RAMDirectory@16cbaef lockFactory=org.apache.lucene.store.NativeFSLockFactory@bd7e7c),segFN=segments_1,generation=1,filenames=[segments_1]
[junit4:junit4]   2> 105 T2454 oasc.SolrDeletionPolicy.updateCommits newest commit = 1[segments_1]
[junit4:junit4]   2> 105 T2454 oasc.CachingDirectoryFactory.close Releasing directory:/mnt/ssd/jenkins/workspace/Lucene-Solr-4.x-Linux/solr/build/solr-core/test/J0/./solrtest-DocValuesMultiTest-1361936457536/index
[junit4:junit4]   2> 106 T2454 oasc.RequestHandlers.initHandlersFromConfig created standard: solr.StandardRequestHandler
[junit4:junit4]   2> 108 T2454 oasc.CachingDirectoryFactory.close Releasing directory:/mnt/ssd/jenkins/workspace/Lucene-Solr-4.x-Linux/solr/build/solr-core/test/J0/./solrtest-DocValuesMultiTest-1361936457536
[junit4:junit4]   2> 108 T2454 oass.SolrIndexSearcher.<init> Opening Searcher@1934b84 main
[junit4:junit4]   2> 108 T2454 oasu.CommitTracker.<init> Hard AutoCommit: disabled
[junit4:junit4]   2> 109 T2454 oasu.CommitTracker.<init> Soft AutoCommit: disabled
[junit4:junit4]   2> 109 T2455 oasc.SolrCore.registerSearcher [collection1] Registered new searcher Searcher@1934b84 main{StandardDirectoryReader(segments_1:1)}
[junit4:junit4]   2> 109 T2454 oasc.CoreContainer.registerCore registering core: collection1
[junit4:junit4]   2> 111 T2454 oas.SolrTestCaseJ4.initCore ####initCore end
[junit4:junit4]   2> 114 T2454 oas.SolrTestCaseJ4.setUp ###Starting testDocValues
[junit4:junit4]   2> ASYNC  NEW_CORE C152 name=collection1 org.apache.solr.core.SolrCore@19d82b2
[junit4:junit4]   2> 117 T2454 C152 oasu.DirectUpdateHandler2.deleteAll [collection1] REMOVING ALL DOCUMENTS FROM INDEX
[junit4:junit4]   2> 117 T2454 C152 oasc.CachingDirectoryFactory.close Releasing directory:/mnt/ssd/jenkins/workspace/Lucene-Solr-4.x-Linux/solr/build/solr-core/test/J0/./solrtest-DocValuesMultiTest-1361936457536
[junit4:junit4]   2> 118 T2454 C152 oasc.SolrDeletionPolicy.onInit SolrDeletionPolicy.onInit: commits:num=1
[junit4:junit4]   2> 		commit{dir=MockDirWrapper(org.apache.lucene.store.RAMDirectory@16cbaef lockFactory=org.apache.lucene.store.NativeFSLockFactory@bd7e7c),segFN=segments_1,generation=1,filenames=[segments_1]
[junit4:junit4]   2> 118 T2454 C152 oasc.SolrDeletionPolicy.updateCommits newest commit = 1[segments_1]
[junit4:junit4]   2> 118 T2454 C152 UPDATE [collection1] webapp=null path=null params={} {deleteByQuery=*:*} 0 2
[junit4:junit4]   2> 127 T2454 C152 UPDATE [collection1] webapp=null path=null params={} {add=[1]} 0 2
[junit4:junit4]   2> 128 T2454 oasc.CachingDirectoryFactory.close Releasing directory:/mnt/ssd/jenkins/workspace/Lucene-Solr-4.x-Linux/solr/build/solr-core/test/J0/./solrtest-DocValuesMultiTest-1361936457536
[junit4:junit4]   2> 132 T2454 oas.SolrTestCaseJ4.tearDown ###Ending testDocValues
[junit4:junit4]   2> NOTE: reproduce with: ant test  -Dtestcase=DocValuesMultiTest -Dtests.method=testDocValues -Dtests.seed=ABD4CDDB66739931 -Dtests.multiplier=3 -Dtests.slow=true -Dtests.locale=ar_OM -Dtests.timezone=Etc/GMT-13 -Dtests.file.encoding=US-ASCII
[junit4:junit4] ERROR   0.04s J0 | DocValuesMultiTest.testDocValues <<<
[junit4:junit4]    > Throwable #1: org.apache.solr.common.SolrException: Error opening new searcher
[junit4:junit4]    > 	at __randomizedtesting.SeedInfo.seed([ABD4CDDB66739931:B3F87F23C48FFFA]:0)
[junit4:junit4]    > 	at org.apache.solr.core.SolrCore.openNewSearcher(SolrCore.java:1415)
[junit4:junit4]    > 	at org.apache.solr.schema.DocValuesMultiTest.testDocValues(DocValuesMultiTest.java:51)
[junit4:junit4]    > 	at sun.reflect.NativeMethodAccessorImpl.invoke0(Native Method)
[junit4:junit4]    > 	at sun.reflect.NativeMethodAccessorImpl.invoke(NativeMethodAccessorImpl.java:57)
[junit4:junit4]    > 	at sun.reflect.DelegatingMethodAccessorImpl.invoke(DelegatingMethodAccessorImpl.java:43)
[junit4:junit4]    > 	at java.lang.reflect.Method.invoke(Method.java:601)
[junit4:junit4]    > 	at com.carrotsearch.randomizedtesting.RandomizedRunner.invoke(RandomizedRunner.java:1559)
[junit4:junit4]    > 	at com.carrotsearch.randomizedtesting.RandomizedRunner.access$600(RandomizedRunner.java:79)
[junit4:junit4]    > 	at com.carrotsearch.randomizedtesting.RandomizedRunner$6.evaluate(RandomizedRunner.java:737)
[junit4:junit4]    > 	at com.carrotsearch.randomizedtesting.RandomizedRunner$7.evaluate(RandomizedRunner.java:773)
[junit4:junit4]    > 	at com.carrotsearch.randomizedtesting.RandomizedRunner$8.evaluate(RandomizedRunner.java:787)
[junit4:junit4]    > 	at com.carrotsearch.randomizedtesting.rules.SystemPropertiesRestoreRule$1.evaluate(SystemPropertiesRestoreRule.java:53)
[junit4:junit4]    > 	at org.apache.lucene.util.TestRuleSetupTeardownChained$1.evaluate(TestRuleSetupTeardownChained.java:50)
[junit4:junit4]    > 	at org.apache.lucene.util.TestRuleFieldCacheSanity$1.evaluate(TestRuleFieldCacheSanity.java:51)
[junit4:junit4]    > 	at org.apache.lucene.util.AbstractBeforeAfterRule$1.evaluate(AbstractBeforeAfterRule.java:46)
[junit4:junit4]    > 	at com.carrotsearch.randomizedtesting.rules.SystemPropertiesInvariantRule$1.evaluate(SystemPropertiesInvariantRule.java:55)
[junit4:junit4]    > 	at org.apache.lucene.util.TestRuleThreadAndTestName$1.evaluate(TestRuleThreadAndTestName.java:49)
[junit4:junit4]    > 	at org.apache.lucene.util.TestRuleIgnoreAfterMaxFailures$1.evaluate(TestRuleIgnoreAfterMaxFailures.java:70)
[junit4:junit4]    > 	at org.apache.lucene.util.TestRuleMarkFailure$1.evaluate(TestRuleMarkFailure.java:48)
[junit4:junit4]    > 	at com.carrotsearch.randomizedtesting.rules.StatementAdapter.evaluate(StatementAdapter.java:36)
[junit4:junit4]    > 	at com.carrotsearch.randomizedtesting.ThreadLeakControl$StatementRunner.run(ThreadLeakControl.java:358)
[junit4:junit4]    > 	at com.carrotsearch.randomizedtesting.ThreadLeakControl.forkTimeoutingTask(ThreadLeakControl.java:782)
[junit4:junit4]    > 	at com.carrotsearch.randomizedtesting.ThreadLeakControl$3.evaluate(ThreadLeakControl.java:442)
[junit4:junit4]    > 	at com.carrotsearch.randomizedtesting.RandomizedRunner.runSingleTest(RandomizedRunner.java:746)
[junit4:junit4]    > 	at com.carrotsearch.randomizedtesting.RandomizedRunner$3.evaluate(RandomizedRunner.java:648)
[junit4:junit4]    > 	at com.carrotsearch.randomizedtesting.RandomizedRunner$4.evaluate(RandomizedRunner.java:682)
[junit4:junit4]    > 	at com.carrotsearch.randomizedtesting.RandomizedRunner$5.evaluate(RandomizedRunner.java:693)
[junit4:junit4]    > 	at com.carrotsearch.randomizedtesting.rules.StatementAdapter.evaluate(StatementAdapter.java:36)
[junit4:junit4]    > 	at com.carrotsearch.randomizedtesting.rules.SystemPropertiesRestoreRule$1.evaluate(SystemPropertiesRestoreRule.java:53)
[junit4:junit4]    > 	at org.apache.lucene.util.AbstractBeforeAfterRule$1.evaluate(AbstractBeforeAfterRule.java:46)
[junit4:junit4]    > 	at org.apache.lucene.util.TestRuleStoreClassName$1.evaluate(TestRuleStoreClassName.java:42)
[junit4:junit4]    > 	at com.carrotsearch.randomizedtesting.rules.SystemPropertiesInvariantRule$1.evaluate(SystemPropertiesInvariantRule.java:55)
[junit4:junit4]    > 	at com.carrotsearch.randomizedtesting.rules.NoShadowingOrOverridesOnMethodsRule$1.evaluate(NoShadowingOrOverridesOnMethodsRule.java:39)
[junit4:junit4]    > 	at com.carrotsearch.randomizedtesting.rules.NoShadowingOrOverridesOnMethodsRule$1.evaluate(NoShadowingOrOverridesOnMethodsRule.java:39)
[junit4:junit4]    > 	at com.carrotsearch.randomizedtesting.rules.StatementAdapter.evaluate(StatementAdapter.java:36)
[junit4:junit4]    > 	at org.apache.lucene.util.TestRuleAssertionsRequired$1.evaluate(TestRuleAssertionsRequired.java:43)
[junit4:junit4]    > 	at org.apache.lucene.util.TestRuleMarkFailure$1.evaluate(TestRuleMarkFailure.java:48)
[junit4:junit4]    > 	at org.apache.lucene.util.TestRuleIgnoreAfterMaxFailures$1.evaluate(TestRuleIgnoreAfterMaxFailures.java:70)
[junit4:junit4]    > 	at org.apache.lucene.util.TestRuleIgnoreTestSuites$1.evaluate(TestRuleIgnoreTestSuites.java:55)
[junit4:junit4]    > 	at com.carrotsearch.randomizedtesting.rules.StatementAdapter.evaluate(StatementAdapter.java:36)
[junit4:junit4]    > 	at com.carrotsearch.randomizedtesting.ThreadLeakControl$StatementRunner.run(ThreadLeakControl.java:358)
[junit4:junit4]    > 	at java.lang.Thread.run(Thread.java:722)
[junit4:junit4]    > Caused by: java.lang.UnsupportedOperationException: Lucene 4.0 does not support SortedSet docvalues
[junit4:junit4]    > 	at org.apache.lucene.codecs.lucene40.Lucene40DocValuesWriter.addSortedSetField(Lucene40DocValuesWriter.java:498)
[junit4:junit4]    > 	at org.apache.lucene.index.SortedSetDocValuesWriter.flush(SortedSetDocValuesWriter.java:161)
[junit4:junit4]    > 	at org.apache.lucene.index.DocValuesProcessor.flush(DocValuesProcessor.java:82)
[junit4:junit4]    > 	at org.apache.lucene.index.TwoStoredFieldsConsumers.flush(TwoStoredFieldsConsumers.java:42)
[junit4:junit4]    > 	at org.apache.lucene.index.DocFieldProcessor.flush(DocFieldProcessor.java:80)
[junit4:junit4]    > 	at org.apache.lucene.index.DocumentsWriterPerThread.flush(DocumentsWriterPerThread.java:493)
[junit4:junit4]    > 	at org.apache.lucene.index.DocumentsWriter.doFlush(DocumentsWriter.java:422)
[junit4:junit4]    > 	at org.apache.lucene.index.DocumentsWriter.flushAllThreads(DocumentsWriter.java:559)
[junit4:junit4]    > 	at org.apache.lucene.index.IndexWriter.getReader(IndexWriter.java:357)
[junit4:junit4]    > 	at org.apache.lucene.index.StandardDirectoryReader.doOpenIfChanged(StandardDirectoryReader.java:257)
[junit4:junit4]    > 	at org.apache.lucene.index.DirectoryReader.openIfChanged(DirectoryReader.java:249)
[junit4:junit4]    > 	at org.apache.solr.core.SolrCore.openNewSearcher(SolrCore.java:1353)
[junit4:junit4]    > 	... 41 more
[junit4:junit4]   2> 156 T2454 oas.SolrTestCaseJ4.setUp ###Starting testFloatDocValuesMatch
[junit4:junit4]   2> 160 T2454 C152 oasu.DirectUpdateHandler2.deleteAll [collection1] REMOVING ALL DOCUMENTS FROM INDEX
[junit4:junit4]   2> 160 T2454 C152 UPDATE [collection1] webapp=null path=null params={} {deleteByQuery=*:*} 0 1
[junit4:junit4]   2> 164 T2454 C152 UPDATE [collection1] webapp=null path=null params={} {add=[1]} 0 0
[junit4:junit4]   2> 168 T2454 C152 UPDATE [collection1] webapp=null path=null params={} {add=[2]} 0 0
[junit4:junit4]   2> 172 T2454 C152 UPDATE [collection1] webapp=null path=null params={} {add=[3]} 0 0
[junit4:junit4]   2> 176 T2454 C152 UPDATE [collection1] webapp=null path=null params={} {add=[4]} 0 0
[junit4:junit4]   2> 180 T2454 C152 oasu.DirectUpdateHandler2.commit start commit{,optimize=false,openSearcher=true,waitSearcher=true,expungeDeletes=false,softCommit=false,prepareCommit=false}
[junit4:junit4]   2> 180 T2454 C152 UPDATE [collection1] webapp=null path=null params={} {} 0 0
[junit4:junit4]   2> 181 T2454 C152 oasc.SolrException.log SEVERE java.lang.UnsupportedOperationException: Lucene 4.0 does not support SortedSet docvalues
[junit4:junit4]   2> 		at org.apache.lucene.codecs.lucene40.Lucene40DocValuesWriter.addSortedSetField(Lucene40DocValuesWriter.java:498)
[junit4:junit4]   2> 		at org.apache.lucene.index.SortedSetDocValuesWriter.flush(SortedSetDocValuesWriter.java:161)
[junit4:junit4]   2> 		at org.apache.lucene.index.DocValuesProcessor.flush(DocValuesProcessor.java:82)
[junit4:junit4]   2> 		at org.apache.lucene.index.TwoStoredFieldsConsumers.flush(TwoStoredFieldsConsumers.java:42)
[junit4:junit4]   2> 		at org.apache.lucene.index.DocFieldProcessor.flush(DocFieldProcessor.java:80)
[junit4:junit4]   2> 		at org.apache.lucene.index.DocumentsWriterPerThread.flush(DocumentsWriterPerThread.java:493)
[junit4:junit4]   2> 		at org.apache.lucene.index.DocumentsWriter.doFlush(DocumentsWriter.java:422)
[junit4:junit4]   2> 		at org.apache.lucene.index.DocumentsWriter.flushAllThreads(DocumentsWriter.java:559)
[junit4:junit4]   2> 		at org.apache.lucene.index.IndexWriter.prepareCommitInternal(IndexWriter.java:2683)
[junit4:junit4]   2> 		at org.apache.lucene.index.IndexWriter.commitInternal(IndexWriter.java:2827)
[junit4:junit4]   2> 		at org.apache.lucene.index.IndexWriter.commit(IndexWriter.java:2807)
[junit4:junit4]   2> 		at org.apache.solr.update.DirectUpdateHandler2.commit(DirectUpdateHandler2.java:541)
[junit4:junit4]   2> 		at org.apache.solr.update.processor.RunUpdateProcessor.processCommit(RunUpdateProcessorFactory.java:95)
[junit4:junit4]   2> 		at org.apache.solr.update.processor.UpdateRequestProcessor.processCommit(UpdateRequestProcessor.java:64)
[junit4:junit4]   2> 		at org.apache.solr.update.processor.DistributedUpdateProcessor.processCommit(DistributedUpdateProcessor.java:1055)
[junit4:junit4]   2> 		at org.apache.solr.update.processor.LogUpdateProcessor.processCommit(LogUpdateProcessorFactory.java:157)
[junit4:junit4]   2> 		at org.apache.solr.handler.loader.XMLLoader.processUpdate(XMLLoader.java:266)
[junit4:junit4]   2> 		at org.apache.solr.handler.loader.XMLLoader.load(XMLLoader.java:173)
[junit4:junit4]   2> 		at org.apache.solr.handler.UpdateRequestHandler$1.load(UpdateRequestHandler.java:92)
[junit4:junit4]   2> 		at org.apache.solr.handler.ContentStreamHandlerBase.handleRequestBody(ContentStreamHandlerBase.java:74)
[junit4:junit4]   2> 		at org.apache.solr.handler.RequestHandlerBase.handleRequest(RequestHandlerBase.java:135)
[junit4:junit4]   2> 		at org.apache.solr.core.SolrCore.execute(SolrCore.java:1808)
[junit4:junit4]   2> 		at org.apache.solr.servlet.DirectSolrConnection.request(DirectSolrConnection.java:131)
[junit4:junit4]   2> 		at org.apache.solr.util.TestHarness.update(TestHarness.java:262)
[junit4:junit4]   2> 		at org.apache.solr.util.TestHarness.checkUpdateStatus(TestHarness.java:312)
[junit4:junit4]   2> 		at org.apache.solr.util.TestHarness.validateUpdate(TestHarness.java:282)
[junit4:junit4]   2> 		at org.apache.solr.SolrTestCaseJ4.checkUpdateU(SolrTestCaseJ4.java:472)
[junit4:junit4]   2> 		at org.apache.solr.SolrTestCaseJ4.assertU(SolrTestCaseJ4.java:451)
[junit4:junit4]   2> 		at org.apache.solr.SolrTestCaseJ4.assertU(SolrTestCaseJ4.java:445)
[junit4:junit4]   2> 		at org.apache.solr.schema.DocValuesMultiTest.testFloatDocValuesMatch(DocValuesMultiTest.java:129)
[junit4:junit4]   2> 		at sun.reflect.NativeMethodAccessorImpl.invoke0(Native Method)
[junit4:junit4]   2> 		at sun.reflect.NativeMethodAccessorImpl.invoke(NativeMethodAccessorImpl.java:57)
[junit4:junit4]   2> 		at sun.reflect.DelegatingMethodAccessorImpl.invoke(DelegatingMethodAccessorImpl.java:43)
[junit4:junit4]   2> 		at java.lang.reflect.Method.invoke(Method.java:601)
[junit4:junit4]   2> 		at com.carrotsearch.randomizedtesting.RandomizedRunner.invoke(RandomizedRunner.java:1559)
[junit4:junit4]   2> 		at com.carrotsearch.randomizedtesting.RandomizedRunner.access$600(RandomizedRunner.java:79)
[junit4:junit4]   2> 		at com.carrotsearch.randomizedtesting.RandomizedRunner$6.evaluate(RandomizedRunner.java:737)
[junit4:junit4]   2> 		at com.carrotsearch.randomizedtesting.RandomizedRunner$7.evaluate(RandomizedRunner.java:773)
[junit4:junit4]   2> 		at com.carrotsearch.randomizedtesting.RandomizedRunner$8.evaluate(RandomizedRunner.java:787)
[junit4:junit4]   2> 		at com.carrotsearch.randomizedtesting.rules.SystemPropertiesRestoreRule$1.evaluate(SystemPropertiesRestoreRule.java:53)
[junit4:junit4]   2> 		at org.apache.lucene.util.TestRuleSetupTeardownChained$1.evaluate(TestRuleSetupTeardownChained.java:50)
[junit4:junit4]   2> 		at org.apache.lucene.util.TestRuleFieldCacheSanity$1.evaluate(TestRuleFieldCacheSanity.java:51)
[junit4:junit4]   2> 		at org.apache.lucene.util.AbstractBeforeAfterRule$1.evaluate(AbstractBeforeAfterRule.java:46)
[junit4:junit4]   2> 		at com.carrotsearch.randomizedtesting.rules.SystemPropertiesInvariantRule$1.evaluate(SystemPropertiesInvariantRule.java:55)
[junit4:junit4]   2> 		at org.apache.lucene.util.TestRuleThreadAndTestName$1.evaluate(TestRuleThreadAndTestName.java:49)
[junit4:junit4]   2> 		at org.apache.lucene.util.TestRuleIgnoreAfterMaxFailures$1.evaluate(TestRuleIgnoreAfterMaxFailures.java:70)
[junit4:junit4]   2> 		at org.apache.lucene.util.TestRuleMarkFailure$1.evaluate(TestRuleMarkFailure.java:48)
[junit4:junit4]   2> 		at com.carrotsearch.randomizedtesting.rules.StatementAdapter.evaluate(StatementAdapter.java:36)
[junit4:junit4]   2> 		at com.carrotsearch.randomizedtesting.ThreadLeakControl$StatementRunner.run(ThreadLeakControl.java:358)
[junit4:junit4]   2> 		at com.carrotsearch.randomizedtesting.ThreadLeakControl.forkTimeoutingTask(ThreadLeakControl.java:782)
[junit4:junit4]   2> 		at com.carrotsearch.randomizedtesting.ThreadLeakControl$3.evaluate(ThreadLeakControl.java:442)
[junit4:junit4]   2> 		at com.carrotsearch.randomizedtesting.RandomizedRunner.runSingleTest(RandomizedRunner.java:746)
[junit4:junit4]   2> 		at com.carrotsearch.randomizedtesting.RandomizedRunner$3.evaluate(RandomizedRunner.java:648)
[junit4:junit4]   2> 		at com.carrotsearch.randomizedtesting.RandomizedRunner$4.evaluate(RandomizedRunner.java:682)
[junit4:junit4]   2> 		at com.carrotsearch.randomizedtesting.RandomizedRunner$5.evaluate(RandomizedRunner.java:693)
[junit4:junit4]   2> 		at com.carrotsearch.randomizedtesting.rules.StatementAdapter.evaluate(StatementAdapter.java:36)
[junit4:junit4]   2> 		at com.carrotsearch.randomizedtesting.rules.SystemPropertiesRestoreRule$1.evaluate(SystemPropertiesRestoreRule.java:53)
[junit4:junit4]   2> 		at org.apache.lucene.util.AbstractBeforeAfterRule$1.evaluate(AbstractBeforeAfterRule.java:46)
[junit4:junit4]   2> 		at org.apache.lucene.util.TestRuleStoreClassName$1.evaluate(TestRuleStoreClassName.java:42)
[junit4:junit4]   2> 		at com.carrotsearch.randomizedtesting.rules.SystemPropertiesInvariantRule$1.evaluate(SystemPropertiesInvariantRule.java:55)
[junit4:junit4]   2> 		at com.carrotsearch.randomizedtesting.rules.NoShadowingOrOverridesOnMethodsRule$1.evaluate(NoShadowingOrOverridesOnMethodsRule.java:39)
[junit4:junit4]   2> 		at com.carrotsearch.randomizedtesting.rules.NoShadowingOrOverridesOnMethodsRule$1.evaluate(NoShadowingOrOverridesOnMethodsRule.java:39)
[junit4:junit4]   2> 		at com.carrotsearch.randomizedtesting.rules.StatementAdapter.evaluate(StatementAdapter.java:36)
[junit4:junit4]   2> 		at org.apache.lucene.util.TestRuleAssertionsRequired$1.evaluate(TestRuleAssertionsRequired.java:43)
[junit4:junit4]   2> 		at org.apache.lucene.util.TestRuleMarkFailure$1.evaluate(TestRuleMarkFailure.java:48)
[junit4:junit4]   2> 		at org.apache.lucene.util.TestRuleIgnoreAfterMaxFailures$1.evaluate(TestRuleIgnoreAfterMaxFailures.java:70)
[junit4:junit4]   2> 		at org.apache.lucene.util.TestRuleIgnoreTestSuites$1.evaluate(TestRuleIgnoreTestSuites.java:55)
[junit4:junit4]   2> 		at com.carrotsearch.randomizedtesting.rules.StatementAdapter.evaluate(StatementAdapter.java:36)
[junit4:junit4]   2> 		at com.carrotsearch.randomizedtesting.ThreadLeakControl$StatementRunner.run(ThreadLeakControl.java:358)
[junit4:junit4]   2> 		at java.lang.Thread.run(Thread.java:722)
[junit4:junit4]   2> 	
[junit4:junit4]   2> 182 T2454 oas.SolrTestCaseJ4.tearDown ###Ending testFloatDocValuesMatch
[junit4:junit4]   2> NOTE: reproduce with: ant test  -Dtestcase=DocValuesMultiTest -Dtests.method=testFloatDocValuesMatch -Dtests.seed=ABD4CDDB66739931 -Dtests.multiplier=3 -Dtests.slow=true -Dtests.locale=ar_OM -Dtests.timezone=Etc/GMT-13 -Dtests.file.encoding=US-ASCII
[junit4:junit4] ERROR   0.03s J0 | DocValuesMultiTest.testFloatDocValuesMatch <<<
[junit4:junit4]    > Throwable #1: org.apache.solr.common.SolrException: java.lang.UnsupportedOperationException: Lucene 4.0 does not support SortedSet docvalues
[junit4:junit4]    > 	at __randomizedtesting.SeedInfo.seed([ABD4CDDB66739931:C07FA1D2FED2C84D]:0)
[junit4:junit4]    > 	at org.apache.solr.util.TestHarness.update(TestHarness.java:266)
[junit4:junit4]    > 	at org.apache.solr.util.TestHarness.checkUpdateStatus(TestHarness.java:312)
[junit4:junit4]    > 	at org.apache.solr.util.TestHarness.validateUpdate(TestHarness.java:282)
[junit4:junit4]    > 	at org.apache.solr.SolrTestCaseJ4.checkUpdateU(SolrTestCaseJ4.java:472)
[junit4:junit4]    > 	at org.apache.solr.SolrTestCaseJ4.assertU(SolrTestCaseJ4.java:451)
[junit4:junit4]    > 	at org.apache.solr.SolrTestCaseJ4.assertU(SolrTestCaseJ4.java:445)
[junit4:junit4]    > 	at org.apache.solr.schema.DocValuesMultiTest.testFloatDocValuesMatch(DocValuesMultiTest.java:129)
[junit4:junit4]    > 	at sun.reflect.NativeMethodAccessorImpl.invoke0(Native Method)
[junit4:junit4]    > 	at sun.reflect.NativeMethodAccessorImpl.invoke(NativeMethodAccessorImpl.java:57)
[junit4:junit4]    > 	at sun.reflect.DelegatingMethodAccessorImpl.invoke(DelegatingMethodAccessorImpl.java:43)
[junit4:junit4]    > 	at java.lang.reflect.Method.invoke(Method.java:601)
[junit4:junit4]    > 	at com.carrotsearch.randomizedtesting.RandomizedRunner.invoke(RandomizedRunner.java:1559)
[junit4:junit4]    > 	at com.carrotsearch.randomizedtesting.RandomizedRunner.access$600(RandomizedRunner.java:79)
[junit4:junit4]    > 	at com.carrotsearch.randomizedtesting.RandomizedRunner$6.evaluate(RandomizedRunner.java:737)
[junit4:junit4]    > 	at com.carrotsearch.randomizedtesting.RandomizedRunner$7.evaluate(RandomizedRunner.java:773)
[junit4:junit4]    > 	at com.carrotsearch.randomizedtesting.RandomizedRunner$8.evaluate(RandomizedRunner.java:787)
[junit4:junit4]    > 	at com.carrotsearch.randomizedtesting.rules.SystemPropertiesRestoreRule$1.evaluate(SystemPropertiesRestoreRule.java:53)
[junit4:junit4]    > 	at org.apache.lucene.util.TestRuleSetupTeardownChained$1.evaluate(TestRuleSetupTeardownChained.java:50)
[junit4:junit4]    > 	at org.apache.lucene.util.TestRuleFieldCacheSanity$1.evaluate(TestRuleFieldCacheSanity.java:51)
[junit4:junit4]    > 	at org.apache.lucene.util.AbstractBeforeAfterRule$1.evaluate(AbstractBeforeAfterRule.java:46)
[junit4:junit4]    > 	at com.carrotsearch.randomizedtesting.rules.SystemPropertiesInvariantRule$1.evaluate(SystemPropertiesInvariantRule.java:55)
[junit4:junit4]    > 	at org.apache.lucene.util.TestRuleThreadAndTestName$1.evaluate(TestRuleThreadAndTestName.java:49)
[junit4:junit4]    > 	at org.apache.lucene.util.TestRuleIgnoreAfterMaxFailures$1.evaluate(TestRuleIgnoreAfterMaxFailures.java:70)
[junit4:junit4]    > 	at org.apache.lucene.util.TestRuleMarkFailure$1.evaluate(TestRuleMarkFailure.java:48)
[junit4:junit4]    > 	at com.carrotsearch.randomizedtesting.rules.StatementAdapter.evaluate(StatementAdapter.java:36)
[junit4:junit4]    > 	at com.carrotsearch.randomizedtesting.ThreadLeakControl$StatementRunner.run(ThreadLeakControl.java:358)
[junit4:junit4]    > 	at com.carrotsearch.randomizedtesting.ThreadLeakControl.forkTimeoutingTask(ThreadLeakControl.java:782)
[junit4:junit4]    > 	at com.carrotsearch.randomizedtesting.ThreadLeakControl$3.evaluate(ThreadLeakControl.java:442)
[junit4:junit4]    > 	at com.carrotsearch.randomizedtesting.RandomizedRunner.runSingleTest(RandomizedRunner.java:746)
[junit4:junit4]    > 	at com.carrotsearch.randomizedtesting.RandomizedRunner$3.evaluate(RandomizedRunner.java:648)
[junit4:junit4]    > 	at com.carrotsearch.randomizedtesting.RandomizedRunner$4.evaluate(RandomizedRunner.java:682)
[junit4:junit4]    > 	at com.carrotsearch.randomizedtesting.RandomizedRunner$5.evaluate(RandomizedRunner.java:693)
[junit4:junit4]    > 	at com.carrotsearch.randomizedtesting.rules.StatementAdapter.evaluate(StatementAdapter.java:36)
[junit4:junit4]    > 	at com.carrotsearch.randomizedtesting.rules.SystemPropertiesRestoreRule$1.evaluate(SystemPropertiesRestoreRule.java:53)
[junit4:junit4]    > 	at org.apache.lucene.util.AbstractBeforeAfterRule$1.evaluate(AbstractBeforeAfterRule.java:46)
[junit4:junit4]    > 	at org.apache.lucene.util.TestRuleStoreClassName$1.evaluate(TestRuleStoreClassName.java:42)
[junit4:junit4]    > 	at com.carrotsearch.randomizedtesting.rules.SystemPropertiesInvariantRule$1.evaluate(SystemPropertiesInvariantRule.java:55)
[junit4:junit4]    > 	at com.carrotsearch.randomizedtesting.rules.NoShadowingOrOverridesOnMethodsRule$1.evaluate(NoShadowingOrOverridesOnMethodsRule.java:39)
[junit4:junit4]    > 	at com.carrotsearch.randomizedtesting.rules.NoShadowingOrOverridesOnMethodsRule$1.evaluate(NoShadowingOrOverridesOnMethodsRule.java:39)
[junit4:junit4]    > 	at com.carrotsearch.randomizedtesting.rules.StatementAdapter.evaluate(StatementAdapter.java:36)
[junit4:junit4]    > 	at org.apache.lucene.util.TestRuleAssertionsRequired$1.evaluate(TestRuleAssertionsRequired.java:43)
[junit4:junit4]    > 	at org.apache.lucene.util.TestRuleMarkFailure$1.evaluate(TestRuleMarkFailure.java:48)
[junit4:junit4]    > 	at org.apache.lucene.util.TestRuleIgnoreAfterMaxFailures$1.evaluate(TestRuleIgnoreAfterMaxFailures.java:70)
[junit4:junit4]    > 	at org.apache.lucene.util.TestRuleIgnoreTestSuites$1.evaluate(TestRuleIgnoreTestSuites.java:55)
[junit4:junit4]    > 	at com.carrotsearch.randomizedtesting.rules.StatementAdapter.evaluate(StatementAdapter.java:36)
[junit4:junit4]    > 	at com.carrotsearch.randomizedtesting.ThreadLeakControl$StatementRunner.run(ThreadLeakControl.java:358)
[junit4:junit4]    > 	at java.lang.Thread.run(Thread.java:722)
[junit4:junit4]    > Caused by: java.lang.UnsupportedOperationException: Lucene 4.0 does not support SortedSet docvalues
[junit4:junit4]    > 	at org.apache.lucene.codecs.lucene40.Lucene40DocValuesWriter.addSortedSetField(Lucene40DocValuesWriter.java:498)
[junit4:junit4]    > 	at org.apache.lucene.index.SortedSetDocValuesWriter.flush(SortedSetDocValuesWriter.java:161)
[junit4:junit4]    > 	at org.apache.lucene.index.DocValuesProcessor.flush(DocValuesProcessor.java:82)
[junit4:junit4]    > 	at org.apache.lucene.index.TwoStoredFieldsConsumers.flush(TwoStoredFieldsConsumers.java:42)
[junit4:junit4]    > 	at org.apache.lucene.index.DocFieldProcessor.flush(DocFieldProcessor.java:80)
[junit4:junit4]    > 	at org.apache.lucene.index.DocumentsWriterPerThread.flush(DocumentsWriterPerThread.java:493)
[junit4:junit4]    > 	at org.apache.lucene.index.DocumentsWriter.doFlush(DocumentsWriter.java:422)
[junit4:junit4]    > 	at org.apache.lucene.index.DocumentsWriter.flushAllThreads(DocumentsWriter.java:559)
[junit4:junit4]    > 	at org.apache.lucene.index.IndexWriter.prepareCommitInternal(IndexWriter.java:2683)
[junit4:junit4]    > 	at org.apache.lucene.index.IndexWriter.commitInternal(IndexWriter.java:2827)
[junit4:junit4]    > 	at org.apache.lucene.index.IndexWriter.commit(IndexWriter.java:2807)
[junit4:junit4]    > 	at org.apache.solr.update.DirectUpdateHandler2.commit(DirectUpdateHandler2.java:541)
[junit4:junit4]    > 	at org.apache.solr.update.processor.RunUpdateProcessor.processCommit(RunUpdateProcessorFactory.java:95)
[junit4:junit4]    > 	at org.apache.solr.update.processor.UpdateRequestProcessor.processCommit(UpdateRequestProcessor.java:64)
[junit4:junit4]    > 	at org.apache.solr.update.processor.DistributedUpdateProcessor.processCommit(DistributedUpdateProcessor.java:1055)
[junit4:junit4]    > 	at org.apache.solr.update.processor.LogUpdateProcessor.processCommit(LogUpdateProcessorFactory.java:157)
[junit4:junit4]    > 	at org.apache.solr.handler.loader.XMLLoader.processUpdate(XMLLoader.java:266)
[junit4:junit4]    > 	at org.apache.solr.handler.loader.XMLLoader.load(XMLLoader.java:173)
[junit4:junit4]    > 	at org.apache.solr.handler.UpdateRequestHandler$1.load(UpdateRequestHandler.java:92)
[junit4:junit4]    > 	at org.apache.solr.handler.ContentStreamHandlerBase.handleRequestBody(ContentStreamHandlerBase.java:74)
[junit4:junit4]    > 	at org.apache.solr.handler.RequestHandlerBase.handleRequest(RequestHandlerBase.java:135)
[junit4:junit4]    > 	at org.apache.solr.core.SolrCore.execute(SolrCore.java:1808)
[junit4:junit4]    > 	at org.apache.solr.servlet.DirectSolrConnection.request(DirectSolrConnection.java:131)
[junit4:junit4]    > 	at org.apache.solr.util.TestHarness.update(TestHarness.java:262)
[junit4:junit4]    > 	... 46 more
[junit4:junit4]   2> 190 T2454 oas.SolrTestCaseJ4.setUp ###Starting testDocValuesFacetingSimple
[junit4:junit4]   2> 194 T2454 C152 oasu.DirectUpdateHandler2.deleteAll [collection1] REMOVING ALL DOCUMENTS FROM INDEX
[junit4:junit4]   2> 194 T2454 C152 UPDATE [collection1] webapp=null path=null params={} {deleteByQuery=*:*} 0 1
[junit4:junit4]   2> 199 T2454 C152 UPDATE [collection1] webapp=null path=null params={} {add=[0]} 0 1
[junit4:junit4]   2> 203 T2454 C152 UPDATE [collection1] webapp=null path=null params={} {add=[1]} 0 0
[junit4:junit4]   2> 209 T2454 C152 UPDATE [collection1] webapp=null path=null params={} {add=[2]} 0 1
[junit4:junit4]   2> 213 T2454 C152 UPDATE [collection1] webapp=null path=null params={} {add=[3]} 0 0
[junit4:junit4]   2> 219 T2454 C152 UPDATE [collection1] webapp=null path=null params={} {add=[4]} 0 1
[junit4:junit4]   2> 224 T2454 C152 UPDATE [collection1] webapp=null path=null params={} {add=[5]} 0 0
[junit4:junit4]   2> 228 T2454 C152 UPDATE [collection1] webapp=null path=null params={} {add=[6]} 0 0
[junit4:junit4]   2> 233 T2454 C152 UPDATE [collection1] webapp=null path=null params={} {add=[7]} 0 1
[junit4:junit4]   2> 237 T2454 C152 UPDATE [collection1] webapp=null path=null params={} {add=[8]} 0 0
[junit4:junit4]   2> 241 T2454 C152 UPDATE [collection1] webapp=null path=null params={} {add=[9]} 0 0
[junit4:junit4]   2> 245 T2454 C152 UPDATE [collection1] webapp=null path=null params={} {add=[10]} 0 0
[junit4:junit4]   2> 258 T2454 C152 UPDATE [collection1] webapp=null path=null params={} {add=[11]} 0 0
[junit4:junit4]   2> 265 T2454 C152 UPDATE [collection1] webapp=null path=null params={} {add=[12]} 0 1
[junit4:junit4]   2> 271 T2454 C152 UPDATE [collection1] webapp=null path=null params={} {add=[13]} 0 0
[junit4:junit4]   2> 276 T2454 C152 UPDATE [collection1] webapp=null path=null params={} {add=[14]} 0 1
[junit4:junit4]   2> 279 T2454 C152 UPDATE [collection1] webapp=null path=null params={} {add=[15]} 0 0
[junit4:junit4]   2> 283 T2454 C152 UPDATE [collection1] webapp=null path=null params={} {add=[16]} 0 0
[junit4:junit4]   2> 287 T2454 C152 UPDATE [collection1] webapp=null path=null params={} {add=[17]} 0 0
[junit4:junit4]   2> 291 T2454 C152 UPDATE [collection1] webapp=null path=null params={} {add=[18]} 0 0
[junit4:junit4]   2> 295 T2454 C152 UPDATE [collection1] webapp=null path=null params={} {add=[19]} 0 0
[junit4:junit4]   2> 299 T2454 C152 UPDATE [collection1] webapp=null path=null params={} {add=[20]} 0 0
[junit4:junit4]   2> 303 T2454 C152 UPDATE [collection1] webapp=null path=null params={} {add=[21]} 0 0
[junit4:junit4]   2> 307 T2454 C152 UPDATE [collection1] webapp=null path=null params={} {add=[22]} 0 1
[junit4:junit4]   2> 311 T2454 C152 UPDATE [collection1] webapp=null path=null params={} {add=[23]} 0 1
[junit4:junit4]   2> 314 T2454 C152 UPDATE [collection1] webapp=null path=null params={} {add=[24]} 0 0
[junit4:junit4]   2> 318 T2454 C152 UPDATE [collection1] webapp=null path=null params={} {add=[25]} 0 0
[junit4:junit4]   2> 322 T2454 C152 UPDATE [collection1] webapp=null path=null params={} {add=[26]} 0 0
[junit4:junit4]   2> 326 T2454 C152 UPDATE [collection1] webapp=null path=null params={} {add=[27]} 0 0
[junit4:junit4]   2> 330 T2454 C152 UPDATE [collection1] webapp=null path=null params={} {add=[28]} 0 0
[junit4:junit4]   2> 334 T2454 C152 UPDATE [collection1] webapp=null path=null params={} {add=[29]} 0 0
[junit4:junit4]   2> 346 T2454 C152 UPDATE [collection1] webapp=null path=null params={} {add=[30]} 0 0
[junit4:junit4]   2> 350 T2454 C152 UPDATE [collection1] webapp=null path=null params={} {add=[31]} 0 0
[junit4:junit4]   2> 354 T2454 C152 UPDATE [collection1] webapp=null path=null params={} {add=[32]} 0 0
[junit4:junit4]   2> 358 T2454 C152 UPDATE [collection1] webapp=null path=null params={} {add=[33]} 0 0
[junit4:junit4]   2> 362 T2454 C152 UPDATE [collection1] webapp=null path=null params={} {add=[34]} 0 0
[junit4:junit4]   2> 366 T2454 C152 UPDATE [collection1] webapp=null path=null params={} {add=[35]} 0 0
[junit4:junit4]   2> 370 T2454 C152 UPDATE [collection1] webapp=null path=null params={} {add=[36]} 0 0
[junit4:junit4]   2> 374 T2454 C152 UPDATE [collection1] webapp=null path=null params={} {add=[37]} 0 0
[junit4:junit4]   2> 378 T2454 C152 UPDATE [collection1] webapp=null path=null params={} {add=[38]} 0 0
[junit4:junit4]   2> 382 T2454 C152 UPDATE [collection1] webapp=null path=null params={} {add=[39]} 0 0
[junit4:junit4]   2> 386 T2454 C152 UPDATE [collection1] webapp=null path=null params={} {add=[40]} 0 1
[junit4:junit4]   2> 390 T2454 C152 UPDATE [collection1] webapp=null path=null params={} {add=[41]} 0 1
[junit4:junit4]   2> 393 T2454 C152 UPDATE [collection1] webapp=null path=null params={} {add=[42]} 0 0
[junit4:junit4]   2> 397 T2454 C152 UPDATE [collection1] webapp=null path=null params={} {add=[43]} 0 0
[junit4:junit4]   2> 401 T2454 C152 UPDATE [collection1] webapp=null path=null params={} {add=[44]} 0 0
[junit4:junit4]   2> 405 T2454 C152 UPDATE [collection1] webapp=null path=null params={} {add=[45]} 0 0
[junit4:junit4]   2> 409 T2454 C152 UPDATE [collection1] webapp=null path=null params={} {add=[46]} 0 1
[junit4:junit4]   2> 412 T2454 C152 UPDATE [collection1] webapp=null path=null params={} {add=[47]} 0 0
[junit4:junit4]   2> 416 T2454 C152 UPDATE [collection1] webapp=null path=null params={} {add=[48]} 0 0
[junit4:junit4]   2> 429 T2454 C152 UPDATE [collection1] webapp=null path=null params={} {add=[49]} 0 0
[junit4:junit4]   2> 433 T2454 C152 UPDATE [collection1] webapp=null path=null params={} {add=[10000]} 0 0
[junit4:junit4]   2> 437 T2454 C152 UPDATE [collection1] webapp=null path=null params={} {add=[10001]} 0 0
[junit4:junit4]   2> 441 T2454 C152 UPDATE [collection1] webapp=null path=null params={} {add=[10002]} 0 0
[junit4:junit4]   2> 445 T2454 C152 UPDATE [collection1] webapp=null path=null params={} {add=[10003]} 0 1
[junit4:junit4]   2> 449 T2454 C152 UPDATE [collection1] webapp=null path=null params={} {add=[10004]} 0 1
[junit4:junit4]   2> 452 T2454 C152 UPDATE [collection1] webapp=null path=null params={} {add=[10005]} 0 0
[junit4:junit4]   2> 456 T2454 C152 UPDATE [collection1] webapp=null path=null params={} {add=[10006]} 0 0
[junit4:junit4]   2> 460 T2454 C152 UPDATE [collection1] webapp=null path=null params={} {add=[10007]} 0 0
[junit4:junit4]   2> 464 T2454 C152 UPDATE [collection1] webapp=null path=null params={} {add=[10008]} 0 0
[junit4:junit4]   2> 468 T2454 C152 UPDATE [collection1] webapp=null path=null params={} {add=[10009]} 0 0
[junit4:junit4]   2> 473 T2454 C152 UPDATE [collection1] webapp=null path=null params={} {add=[100010]} 0 0
[junit4:junit4]   2> 477 T2454 C152 UPDATE [collection1] webapp=null path=null params={} {add=[100011]} 0 0
[junit4:junit4]   2> 481 T2454 C152 UPDATE [collection1] webapp=null path=null params={} {add=[100012]} 0 1
[junit4:junit4]   2> 485 T2454 C152 UPDATE [collection1] webapp=null path=null params={} {add=[100013]} 0 1
[junit4:junit4]   2> 489 T2454 C152 UPDATE [collection1] webapp=null path=null params={} {add=[100014]} 0 0
[junit4:junit4]   2> 494 T2454 C152 UPDATE [collection1] webapp=null path=null params={} {add=[100015]} 0 0
[junit4:junit4]   2> 498 T2454 C152 UPDATE [collection1] webapp=null path=null params={} {add=[100016]} 0 0
[junit4:junit4]   2> 504 T2454 C152 UPDATE [collection1] webapp=null path=null params={} {add=[100017]} 0 1
[junit4:junit4]   2> 510 T2454 C152 UPDATE [collection1] webapp=null path=null params={} {add=[100018]} 0 1
[junit4:junit4]   2> 524 T2454 C152 UPDATE [collection1] webapp=null path=null params={} {add=[100019]} 0 0
[junit4:junit4]   2> 528 T2454 C152 UPDATE [collection1] webapp=null path=null params={} {add=[100020]} 0 0
[junit4:junit4]   2> 532 T2454 C152 UPDATE [collection1] webapp=null path=null params={} {add=[100021]} 0 0
[junit4:junit4]   2> 537 T2454 C152 UPDATE [collection1] webapp=null path=null params={} {add=[100022]} 0 1
[junit4:junit4]   2> 540 T2454 C152 UPDATE [collection1] webapp=null path=null params={} {add=[100023]} 0 0
[junit4:junit4]   2> 544 T2454 C152 UPDATE [collection1] webapp=null path=null params={} {add=[100024]} 0 0
[junit4:junit4]   2> 548 T2454 C152 UPDATE [collection1] webapp=null path=null params={} {add=[100025]} 0 0
[junit4:junit4]   2> 552 T2454 C152 UPDATE [collection1] webapp=null path=null params={} {add=[100026]} 0 0
[junit4:junit4]   2> 556 T2454 C152 UPDATE [collection1] webapp=null path=null params={} {add=[100027]} 0 0
[junit4:junit4]   2> 560 T2454 C152 UPDATE [collection1] webapp=null path=null params={} {add=[100028]} 0 0
[junit4:junit4]   2> 564 T2454 C152 UPDATE [collection1] webapp=null path=null params={} {add=[100029]} 0 0
[junit4:junit4]   2> 568 T2454 C152 UPDATE [collection1] webapp=null path=null params={} {add=[100030]} 0 0
[junit4:junit4]   2> 572 T2454 C152 UPDATE [collection1] webapp=null path=null params={} {add=[100031]} 0 0
[junit4:junit4]   2> 576 T2454 C152 UPDATE [collection1] webapp=null path=null params={} {add=[100032]} 0 0
[junit4:junit4]   2> 580 T2454 C152 UPDATE [collection1] webapp=null path=null params={} {add=[100033]} 0 0
[junit4:junit4]   2> 584 T2454 C152 UPDATE [collection1] webapp=null path=null params={} {add=[100034]} 0 0
[junit4:junit4]   2> 588 T2454 C152 UPDATE [collection1] webapp=null path=null params={} {add=[100035]} 0 0
[junit4:junit4]   2> 592 T2454 C152 UPDATE [collection1] webapp=null path=null params={} {add=[100036]} 0 0
[junit4:junit4]   2> 596 T2454 C152 UPDATE [collection1] webapp=null path=null params={} {add=[100037]} 0 0
[junit4:junit4]   2> 607 T2454 C152 UPDATE [collection1] webapp=null path=null params={} {add=[100038]} 0 0
[junit4:junit4]   2> 611 T2454 C152 UPDATE [collection1] webapp=null path=null params={} {add=[100039]} 0 0
[junit4:junit4]   2> 616 T2454 C152 UPDATE [collection1] webapp=null path=null params={} {add=[100040]} 0 1
[junit4:junit4]   2> 620 T2454 C152 UPDATE [collection1] webapp=null path=null params={} {add=[100041]} 0 1
[junit4:junit4]   2> 623 T2454 C152 UPDATE [collection1] webapp=null path=null params={} {add=[100042]} 0 0
[junit4:junit4]   2> 627 T2454 C152 UPDATE [collection1] webapp=null path=null params={} {add=[100043]} 0 0
[junit4:junit4]   2> 631 T2454 C152 UPDATE [collection1] webapp=null path=null params={} {add=[100044]} 0 0
[junit4:junit4]   2> 635 T2454 C152 UPDATE [collection1] webapp=null path=null params={} {add=[100045]} 0 0
[junit4:junit4]   2> 640 T2454 C152 UPDATE [collection1] webapp=null path=null params={} {add=[100046]} 0 1
[junit4:junit4]   2> 644 T2454 C152 UPDATE [collection1] webapp=null path=null params={} {add=[100047]} 0 1
[junit4:junit4]   2> 648 T2454 C152 UPDATE [collection1] webapp=null path=null params={} {add=[100048]} 0 0
[junit4:junit4]   2> 652 T2454 C152 UPDATE [collection1] webapp=null path=null params={} {add=[100049]} 0 0
[junit4:junit4]   2> 656 T2454 C152 oasu.DirectUpdateHandler2.commit start commit{,optimize=false,openSearcher=true,waitSearcher=true,expungeDeletes=false,softCommit=false,prepareCommit=false}
[junit4:junit4]   2> 657 T2454 C152 UPDATE [collection1] webapp=null path=null params={} {} 0 1
[junit4:junit4]   2> 657 T2454 C152 oasc.SolrException.log SEVERE java.lang.UnsupportedOperationException: Lucene 4.0 does not support SortedSet docvalues
[junit4:junit4]   2> 		at org.apache.lucene.codecs.lucene40.Lucene40DocValuesWriter.addSortedSetField(Lucene40DocValuesWriter.java:498)
[junit4:junit4]   2> 		at org.apache.lucene.index.SortedSetDocValuesWriter.flush(SortedSetDocValuesWriter.java:161)
[junit4:junit4]   2> 		at org.apache.lucene.index.DocValuesProcessor.flush(DocValuesProcessor.java:82)
[junit4:junit4]   2> 		at org.apache.lucene.index.TwoStoredFieldsConsumers.flush(TwoStoredFieldsConsumers.java:42)
[junit4:junit4]   2> 		at org.apache.lucene.index.DocFieldProcessor.flush(DocFieldProcessor.java:80)
[junit4:junit4]   2> 		at org.apache.lucene.index.DocumentsWriterPerThread.flush(DocumentsWriterPerThread.java:493)
[junit4:junit4]   2> 		at org.apache.lucene.index.DocumentsWriter.doFlush(DocumentsWriter.java:422)
[junit4:junit4]   2> 		at org.apache.lucene.index.DocumentsWriter.flushAllThreads(DocumentsWriter.java:559)
[junit4:junit4]   2> 		at org.apache.lucene.index.IndexWriter.prepareCommitInternal(IndexWriter.java:2683)
[junit4:junit4]   2> 		at org.apache.lucene.index.IndexWriter.commitInternal(IndexWriter.java:2827)
[junit4:junit4]   2> 		at org.apache.lucene.index.IndexWriter.commit(IndexWriter.java:2807)
[junit4:junit4]   2> 		at org.apache.solr.update.DirectUpdateHandler2.commit(DirectUpdateHandler2.java:541)
[junit4:junit4]   2> 		at org.apache.solr.update.processor.RunUpdateProcessor.processCommit(RunUpdateProcessorFactory.java:95)
[junit4:junit4]   2> 		at org.apache.solr.update.processor.UpdateRequestProcessor.processCommit(UpdateRequestProcessor.java:64)
[junit4:junit4]   2> 		at org.apache.solr.update.processor.DistributedUpdateProcessor.processCommit(DistributedUpdateProcessor.java:1055)
[junit4:junit4]   2> 		at org.apache.solr.update.processor.LogUpdateProcessor.processCommit(LogUpdateProcessorFactory.java:157)
[junit4:junit4]   2> 		at org.apache.solr.handler.loader.XMLLoader.processUpdate(XMLLoader.java:266)
[junit4:junit4]   2> 		at org.apache.solr.handler.loader.XMLLoader.load(XMLLoader.java:173)
[junit4:junit4]   2> 		at org.apache.solr.handler.UpdateRequestHandler$1.load(UpdateRequestHandler.java:92)
[junit4:junit4]   2> 		at org.apache.solr.handler.ContentStreamHandlerBase.handleRequestBody(ContentStreamHandlerBase.java:74)
[junit4:junit4]   2> 		at org.apache.solr.handler.RequestHandlerBase.handleRequest(RequestHandlerBase.java:135)
[junit4:junit4]   2> 		at org.apache.solr.core.SolrCore.execute(SolrCore.java:1808)
[junit4:junit4]   2> 		at org.apache.solr.servlet.DirectSolrConnection.request(DirectSolrConnection.java:131)
[junit4:junit4]   2> 		at org.apache.solr.util.TestHarness.update(TestHarness.java:262)
[junit4:junit4]   2> 		at org.apache.solr.util.TestHarness.checkUpdateStatus(TestHarness.java:312)
[junit4:junit4]   2> 		at org.apache.solr.util.TestHarness.validateUpdate(TestHarness.java:282)
[junit4:junit4]   2> 		at org.apache.solr.SolrTestCaseJ4.checkUpdateU(SolrTestCaseJ4.java:472)
[junit4:junit4]   2> 		at org.apache.solr.SolrTestCaseJ4.assertU(SolrTestCaseJ4.java:451)
[junit4:junit4]   2> 		at org.apache.solr.SolrTestCaseJ4.assertU(SolrTestCaseJ4.java:445)
[junit4:junit4]   2> 		at org.apache.solr.schema.DocValuesMultiTest.testDocValuesFacetingSimple(DocValuesMultiTest.java:157)
[junit4:junit4]   2> 		at sun.reflect.NativeMethodAccessorImpl.invoke0(Native Method)
[junit4:junit4]   2> 		at sun.reflect.NativeMethodAccessorImpl.invoke(NativeMethodAccessorImpl.java:57)
[junit4:junit4]   2> 		at sun.reflect.DelegatingMethodAccessorImpl.invoke(DelegatingMethodAccessorImpl.java:43)
[junit4:junit4]   2> 		at java.lang.reflect.Method.invoke(Method.java:601)
[junit4:junit4]   2> 		at com.carrotsearch.randomizedtesting.RandomizedRunner.invoke(RandomizedRunner.java:1559)
[junit4:junit4]   2> 		at com.carrotsearch.randomizedtesting.RandomizedRunner.access$600(RandomizedRunner.java:79)
[junit4:junit4]   2> 		at com.carrotsearch.randomizedtesting.RandomizedRunner$6.evaluate(RandomizedRunner.java:737)
[junit4:junit4]   2> 		at com.carrotsearch.randomizedtesting.RandomizedRunner$7.evaluate(RandomizedRunner.java:773)
[junit4:junit4]   2> 		at com.carrotsearch.randomizedtesting.RandomizedRunner$8.evaluate(RandomizedRunner.java:787)
[junit4:junit4]   2> 		at com.carrotsearch.randomizedtesting.rules.SystemPropertiesRestoreRule$1.evaluate(SystemPropertiesRestoreRule.java:53)
[junit4:junit4]   2> 		at org.apache.lucene.util.TestRuleSetupTeardownChained$1.evaluate(TestRuleSetupTeardownChained.java:50)
[junit4:junit4]   2> 		at org.apache.lucene.util.TestRuleFieldCacheSanity$1.evaluate(TestRuleFieldCacheSanity.java:51)
[junit4:junit4]   2> 		at org.apache.lucene.util.AbstractBeforeAfterRule$1.evaluate(AbstractBeforeAfterRule.java:46)
[junit4:junit4]   2> 		at com.carrotsearch.randomizedtesting.rules.SystemPropertiesInvariantRule$1.evaluate(SystemPropertiesInvariantRule.java:55)
[junit4:junit4]   2> 		at org.apache.lucene.util.TestRuleThreadAndTestName$1.evaluate(TestRuleThreadAndTestName.java:49)
[junit4:junit4]   2> 		at org.apache.lucene.util.TestRuleIgnoreAfterMaxFailures$1.evaluate(TestRuleIgnoreAfterMaxFailures.java:70)
[junit4:junit4]   2> 		at org.apache.lucene.util.TestRuleMarkFailure$1.evaluate(TestRuleMarkFailure.java:48)
[junit4:junit4]   2> 		at com.carrotsearch.randomizedtesting.rules.StatementAdapter.evaluate(StatementAdapter.java:36)
[junit4:junit4]   2> 		at com.carrotsearch.randomizedtesting.ThreadLeakControl$StatementRunner.run(ThreadLeakControl.java:358)
[junit4:junit4]   2> 		at com.carrotsearch.randomizedtesting.ThreadLeakControl.forkTimeoutingTask(ThreadLeakControl.java:782)
[junit4:junit4]   2> 		at com.carrotsearch.randomizedtesting.ThreadLeakControl$3.evaluate(ThreadLeakControl.java:442)
[junit4:junit4]   2> 		at com.carrotsearch.randomizedtesting.RandomizedRunner.runSingleTest(RandomizedRunner.java:746)
[junit4:junit4]   2> 		at com.carrotsearch.randomizedtesting.RandomizedRunner$3.evaluate(RandomizedRunner.java:648)
[junit4:junit4]   2> 		at com.carrotsearch.randomizedtesting.RandomizedRunner$4.evaluate(RandomizedRunner.java:682)
[junit4:junit4]   2> 		at com.carrotsearch.randomizedtesting.RandomizedRunner$5.evaluate(RandomizedRunner.java:693)
[junit4:junit4]   2> 		at com.carrotsearch.randomizedtesting.rules.StatementAdapter.evaluate(StatementAdapter.java:36)
[junit4:junit4]   2> 		at com.carrotsearch.randomizedtesting.rules.SystemPropertiesRestoreRule$1.evaluate(SystemPropertiesRestoreRule.java:53)
[junit4:junit4]   2> 		at org.apache.lucene.util.AbstractBeforeAfterRule$1.evaluate(AbstractBeforeAfterRule.java:46)
[junit4:junit4]   2> 		at org.apache.lucene.util.TestRuleStoreClassName$1.evaluate(TestRuleStoreClassName.java:42)
[junit4:junit4]   2> 		at com.carrotsearch.randomizedtesting.rules.SystemPropertiesInvariantRule$1.evaluate(SystemPropertiesInvariantRule.java:55)
[junit4:junit4]   2> 		at com.carrotsearch.randomizedtesting.rules.NoShadowingOrOverridesOnMethodsRule$1.evaluate(NoShadowingOrOverridesOnMethodsRule.java:39)
[junit4:junit4]   2> 		at com.carrotsearch.randomizedtesting.rules.NoShadowingOrOverridesOnMethodsRule$1.evaluate(NoShadowingOrOverridesOnMethodsRule.java:39)
[junit4:junit4]   2> 		at com.carrotsearch.randomizedtesting.rules.StatementAdapter.evaluate(StatementAdapter.java:36)
[junit4:junit4]   2> 		at org.apache.lucene.util.TestRuleAssertionsRequired$1.evaluate(TestRuleAssertionsRequired.java:43)
[junit4:junit4]   2> 		at org.apache.lucene.util.TestRuleMarkFailure$1.evaluate(TestRuleMarkFailure.java:48)
[junit4:junit4]   2> 		at org.apache.lucene.util.TestRuleIgnoreAfterMaxFailures$1.evaluate(TestRuleIgnoreAfterMaxFailures.java:70)
[junit4:junit4]   2> 		at org.apache.lucene.util.TestRuleIgnoreTestSuites$1.evaluate(TestRuleIgnoreTestSuites.java:55)
[junit4:junit4]   2> 		at com.carrotsearch.randomizedtesting.rules.StatementAdapter.evaluate(StatementAdapter.java:36)
[junit4:junit4]   2> 		at com.carrotsearch.randomizedtesting.ThreadLeakControl$StatementRunner.run(ThreadLeakControl.java:358)
[junit4:junit4]   2> 		at java.lang.Thread.run(Thread.java:722)
[junit4:junit4]   2> 	
[junit4:junit4]   2> 659 T2454 oas.SolrTestCaseJ4.tearDown ###Ending testDocValuesFacetingSimple
[junit4:junit4]   2> NOTE: reproduce with: ant test  -Dtestcase=DocValuesMultiTest -Dtests.method=testDocValuesFacetingSimple -Dtests.seed=ABD4CDDB66739931 -Dtests.multiplier=3 -Dtests.slow=true -Dtests.locale=ar_OM -Dtests.timezone=Etc/GMT-13 -Dtests.file.encoding=US-ASCII
[junit4:junit4] ERROR   0.48s J0 | DocValuesMultiTest.testDocValuesFacetingSimple <<<
[junit4:junit4]    > Throwable #1: org.apache.solr.common.SolrException: java.lang.UnsupportedOperationException: Lucene 4.0 does not support SortedSet docvalues
[junit4:junit4]    > 	at __randomizedtesting.SeedInfo.seed([ABD4CDDB66739931:80A54839FFBE98E5]:0)
[junit4:junit4]    > 	at org.apache.solr.util.TestHarness.update(TestHarness.java:266)
[junit4:junit4]    > 	at org.apache.solr.util.TestHarness.checkUpdateStatus(TestHarness.java:312)
[junit4:junit4]    > 	at org.apache.solr.util.TestHarness.validateUpdate(TestHarness.java:282)
[junit4:junit4]    > 	at org.apache.solr.SolrTestCaseJ4.checkUpdateU(SolrTestCaseJ4.java:472)
[junit4:junit4]    > 	at org.apache.solr.SolrTestCaseJ4.assertU(SolrTestCaseJ4.java:451)
[junit4:junit4]    > 	at org.apache.solr.SolrTestCaseJ4.assertU(SolrTestCaseJ4.java:445)
[junit4:junit4]    > 	at org.apache.solr.schema.DocValuesMultiTest.testDocValuesFacetingSimple(DocValuesMultiTest.java:157)
[junit4:junit4]    > 	at sun.reflect.NativeMethodAccessorImpl.invoke0(Native Method)
[junit4:junit4]    > 	at sun.reflect.NativeMethodAccessorImpl.invoke(NativeMethodAccessorImpl.java:57)
[junit4:junit4]    > 	at sun.reflect.DelegatingMethodAccessorImpl.invoke(DelegatingMethodAccessorImpl.java:43)
[junit4:junit4]    > 	at java.lang.reflect.Method.invoke(Method.java:601)
[junit4:junit4]    > 	at com.carrotsearch.randomizedtesting.RandomizedRunner.invoke(RandomizedRunner.java:1559)
[junit4:junit4]    > 	at com.carrotsearch.randomizedtesting.RandomizedRunner.access$600(RandomizedRunner.java:79)
[junit4:junit4]    > 	at com.carrotsearch.randomizedtesting.RandomizedRunner$6.evaluate(RandomizedRunner.java:737)
[junit4:junit4]    > 	at com.carrotsearch.randomizedtesting.RandomizedRunner$7.evaluate(RandomizedRunner.java:773)
[junit4:junit4]    > 	at com.carrotsearch.randomizedtesting.RandomizedRunner$8.evaluate(RandomizedRunner.java:787)
[junit4:junit4]    > 	at com.carrotsearch.randomizedtesting.rules.SystemPropertiesRestoreRule$1.evaluate(SystemPropertiesRestoreRule.java:53)
[junit4:junit4]    > 	at org.apache.lucene.util.TestRuleSetupTeardownChained$1.evaluate(TestRuleSetupTeardownChained.java:50)
[junit4:junit4]    > 	at org.apache.lucene.util.TestRuleFieldCacheSanity$1.evaluate(TestRuleFieldCacheSanity.java:51)
[junit4:junit4]    > 	at org.apache.lucene.util.AbstractBeforeAfterRule$1.evaluate(AbstractBeforeAfterRule.java:46)
[junit4:junit4]    > 	at com.carrotsearch.randomizedtesting.rules.SystemPropertiesInvariantRule$1.evaluate(SystemPropertiesInvariantRule.java:55)
[junit4:junit4]    > 	at org.apache.lucene.util.TestRuleThreadAndTestName$1.evaluate(TestRuleThreadAndTestName.java:49)
[junit4:junit4]    > 	at org.apache.lucene.util.TestRuleIgnoreAfterMaxFailures$1.evaluate(TestRuleIgnoreAfterMaxFailures.java:70)
[junit4:junit4]    > 	at org.apache.lucene.util.TestRuleMarkFailure$1.evaluate(TestRuleMarkFailure.java:48)
[junit4:junit4]    > 	at com.carrotsearch.randomizedtesting.rules.StatementAdapter.evaluate(StatementAdapter.java:36)
[junit4:junit4]    > 	at com.carrotsearch.randomizedtesting.ThreadLeakControl$StatementRunner.run(ThreadLeakControl.java:358)
[junit4:junit4]    > 	at com.carrotsearch.randomizedtesting.ThreadLeakControl.forkTimeoutingTask(ThreadLeakControl.java:782)
[junit4:junit4]    > 	at com.carrotsearch.randomizedtesting.ThreadLeakControl$3.evaluate(ThreadLeakControl.java:442)
[junit4:junit4]    > 	at com.carrotsearch.randomizedtesting.RandomizedRunner.runSingleTest(RandomizedRunner.java:746)
[junit4:junit4]    > 	at com.carrotsearch.randomizedtesting.RandomizedRunner$3.evaluate(RandomizedRunner.java:648)
[junit4:junit4]    > 	at com.carrotsearch.randomizedtesting.RandomizedRunner$4.evaluate(RandomizedRunner.java:682)
[junit4:junit4]    > 	at com.carrotsearch.randomizedtesting.RandomizedRunner$5.evaluate(RandomizedRunner.java:693)
[junit4:junit4]    > 	at com.carrotsearch.randomizedtesting.rules.StatementAdapter.evaluate(StatementAdapter.java:36)
[junit4:junit4]    > 	at com.carrotsearch.randomizedtesting.rules.SystemPropertiesRestoreRule$1.evaluate(SystemPropertiesRestoreRule.java:53)
[junit4:junit4]    > 	at org.apache.lucene.util.AbstractBeforeAfterRule$1.evaluate(AbstractBeforeAfterRule.java:46)
[junit4:junit4]    > 	at org.apache.lucene.util.TestRuleStoreClassName$1.evaluate(TestRuleStoreClassName.java:42)
[junit4:junit4]    > 	at com.carrotsearch.randomizedtesting.rules.SystemPropertiesInvariantRule$1.evaluate(SystemPropertiesInvariantRule.java:55)
[junit4:junit4]    > 	at com.carrotsearch.randomizedtesting.rules.NoShadowingOrOverridesOnMethodsRule$1.evaluate(NoShadowingOrOverridesOnMethodsRule.java:39)
[junit4:junit4]    > 	at com.carrotsearch.randomizedtesting.rules.NoShadowingOrOverridesOnMethodsRule$1.evaluate(NoShadowingOrOverridesOnMethodsRule.java:39)
[junit4:junit4]    > 	at com.carrotsearch.randomizedtesting.rules.StatementAdapter.evaluate(StatementAdapter.java:36)
[junit4:junit4]    > 	at org.apache.lucene.util.TestRuleAssertionsRequired$1.evaluate(TestRuleAssertionsRequired.java:43)
[junit4:junit4]    > 	at org.apache.lucene.util.TestRuleMarkFailure$1.evaluate(TestRuleMarkFailure.java:48)
[junit4:junit4]    > 	at org.apache.lucene.util.TestRuleIgnoreAfterMaxFailures$1.evaluate(TestRuleIgnoreAfterMaxFailures.java:70)
[junit4:junit4]    > 	at org.apache.lucene.util.TestRuleIgnoreTestSuites$1.evaluate(TestRuleIgnoreTestSuites.java:55)
[junit4:junit4]    > 	at com.carrotsearch.randomizedtesting.rules.StatementAdapter.evaluate(StatementAdapter.java:36)
[junit4:junit4]    > 	at com.carrotsearch.randomizedtesting.ThreadLeakControl$StatementRunner.run(ThreadLeakControl.java:358)
[junit4:junit4]    > 	at java.lang.Thread.run(Thread.java:722)
[junit4:junit4]    > Caused by: java.lang.UnsupportedOperationException: Lucene 4.0 does not support SortedSet docvalues
[junit4:junit4]    > 	at org.apache.lucene.codecs.lucene40.Lucene40DocValuesWriter.addSortedSetField(Lucene40DocValuesWriter.java:498)
[junit4:junit4]    > 	at org.apache.lucene.index.SortedSetDocValuesWriter.flush(SortedSetDocValuesWriter.java:161)
[junit4:junit4]    > 	at org.apache.lucene.index.DocValuesProcessor.flush(DocValuesProcessor.java:82)
[junit4:junit4]    > 	at org.apache.lucene.index.TwoStoredFieldsConsumers.flush(TwoStoredFieldsConsumers.java:42)
[junit4:junit4]    > 	at org.apache.lucene.index.DocFieldProcessor.flush(DocFieldProcessor.java:80)
[junit4:junit4]    > 	at org.apache.lucene.index.DocumentsWriterPerThread.flush(DocumentsWriterPerThread.java:493)
[junit4:junit4]    > 	at org.apache.lucene.index.DocumentsWriter.doFlush(DocumentsWriter.java:422)
[junit4:junit4]    > 	at org.apache.lucene.index.DocumentsWriter.flushAllThreads(DocumentsWriter.java:559)
[junit4:junit4]    > 	at org.apache.lucene.index.IndexWriter.prepareCommitInternal(IndexWriter.java:2683)
[junit4:junit4]    > 	at org.apache.lucene.index.IndexWriter.commitInternal(IndexWriter.java:2827)
[junit4:junit4]    > 	at org.apache.lucene.index.IndexWriter.commit(IndexWriter.java:2807)
[junit4:junit4]    > 	at org.apache.solr.update.DirectUpdateHandler2.commit(DirectUpdateHandler2.java:541)
[junit4:junit4]    > 	at org.apache.solr.update.processor.RunUpdateProcessor.processCommit(RunUpdateProcessorFactory.java:95)
[junit4:junit4]    > 	at org.apache.solr.update.processor.UpdateRequestProcessor.processCommit(UpdateRequestProcessor.java:64)
[junit4:junit4]    > 	at org.apache.solr.update.processor.DistributedUpdateProcessor.processCommit(DistributedUpdateProcessor.java:1055)
[junit4:junit4]    > 	at org.apache.solr.update.processor.LogUpdateProcessor.processCommit(LogUpdateProcessorFactory.java:157)
[junit4:junit4]    > 	at org.apache.solr.handler.loader.XMLLoader.processUpdate(XMLLoader.java:266)
[junit4:junit4]    > 	at org.apache.solr.handler.loader.XMLLoader.load(XMLLoader.java:173)
[junit4:junit4]    > 	at org.apache.solr.handler.UpdateRequestHandler$1.load(UpdateRequestHandler.java:92)
[junit4:junit4]    > 	at org.apache.solr.handler.ContentStreamHandlerBase.handleRequestBody(ContentStreamHandlerBase.java:74)
[junit4:junit4]    > 	at org.apache.solr.handler.RequestHandlerBase.handleRequest(RequestHandlerBase.java:135)
[junit4:junit4]    > 	at org.apache.solr.core.SolrCore.execute(SolrCore.java:1808)
[junit4:junit4]    > 	at org.apache.solr.servlet.DirectSolrConnection.request(DirectSolrConnection.java:131)
[junit4:junit4]    > 	at org.apache.solr.util.TestHarness.update(TestHarness.java:262)
[junit4:junit4]    > 	... 46 more
[junit4:junit4]   2> 667 T2454 oas.SolrTestCaseJ4.setUp ###Starting testStringDocValuesMatch
[junit4:junit4]   2> 670 T2454 C152 oasu.DirectUpdateHandler2.deleteAll [collection1] REMOVING ALL DOCUMENTS FROM INDEX
[junit4:junit4]   2> 671 T2454 C152 UPDATE [collection1] webapp=null path=null params={} {deleteByQuery=*:*} 0 1
[junit4:junit4]   2> 675 T2454 C152 UPDATE [collection1] webapp=null path=null params={} {add=[1]} 0 0
[junit4:junit4]   2> 679 T2454 C152 UPDATE [collection1] webapp=null path=null params={} {add=[2]} 0 0
[junit4:junit4]   2> 683 T2454 C152 UPDATE [collection1] webapp=null path=null params={} {add=[3]} 0 0
[junit4:junit4]   2> 687 T2454 C152 UPDATE [collection1] webapp=null path=null params={} {add=[4]} 0 0
[junit4:junit4]   2> 691 T2454 C152 UPDATE [collection1] webapp=null path=null params={} {add=[5]} 0 0
[junit4:junit4]   2> 702 T2454 C152 oasu.DirectUpdateHandler2.commit start commit{,optimize=false,openSearcher=true,waitSearcher=true,expungeDeletes=false,softCommit=false,prepareCommit=false}
[junit4:junit4]   2> 703 T2454 C152 UPDATE [collection1] webapp=null path=null params={} {} 0 1
[junit4:junit4]   2> 703 T2454 C152 oasc.SolrException.log SEVERE java.lang.UnsupportedOperationException: Lucene 4.0 does not support SortedSet docvalues
[junit4:junit4]   2> 		at org.apache.lucene.codecs.lucene40.Lucene40DocValuesWriter.addSortedSetField(Lucene40DocValuesWriter.java:498)
[junit4:junit4]   2> 		at org.apache.lucene.index.SortedSetDocValuesWriter.flush(SortedSetDocValuesWriter.java:161)
[junit4:junit4]   2> 		at org.apache.lucene.index.DocValuesProcessor.flush(DocValuesProcessor.java:82)
[junit4:junit4]   2> 		at org.apache.lucene.index.TwoStoredFieldsConsumers.flush(TwoStoredFieldsConsumers.java:42)
[junit4:junit4]   2> 		at org.apache.lucene.index.DocFieldProcessor.flush(DocFieldProcessor.java:80)
[junit4:junit4]   2> 		at org.apache.lucene.index.DocumentsWriterPerThread.flush(DocumentsWriterPerThread.java:493)
[junit4:junit4]   2> 		at org.apache.lucene.index.DocumentsWriter.doFlush(DocumentsWriter.java:422)
[junit4:junit4]   2> 		at org.apache.lucene.index.DocumentsWriter.flushAllThreads(DocumentsWriter.java:559)
[junit4:junit4]   2> 		at org.apache.lucene.index.IndexWriter.prepareCommitInternal(IndexWriter.java:2683)
[junit4:junit4]   2> 		at org.apache.lucene.index.IndexWriter.commitInternal(IndexWriter.java:2827)
[junit4:junit4]   2> 		at org.apache.lucene.index.IndexWriter.commit(IndexWriter.java:2807)
[junit4:junit4]   2> 		at org.apache.solr.update.DirectUpdateHandler2.commit(DirectUpdateHandler2.java:541)
[junit4:junit4]   2> 		at org.apache.solr.update.processor.RunUpdateProcessor.processCommit(RunUpdateProcessorFactory.java:95)
[junit4:junit4]   2> 		at org.apache.solr.update.processor.UpdateRequestProcessor.processCommit(UpdateRequestProcessor.java:64)
[junit4:junit4]   2> 		at org.apache.solr.update.processor.DistributedUpdateProcessor.processCommit(DistributedUpdateProcessor.java:1055)
[junit4:junit4]   2> 		at org.apache.solr.update.processor.LogUpdateProcessor.processCommit(LogUpdateProcessorFactory.java:157)
[junit4:junit4]   2> 		at org.apache.solr.handler.loader.XMLLoader.processUpdate(XMLLoader.java:266)
[junit4:junit4]   2> 		at org.apache.solr.handler.loader.XMLLoader.load(XMLLoader.java:173)
[junit4:junit4]   2> 		at org.apache.solr.handler.UpdateRequestHandler$1.load(UpdateRequestHandler.java:92)
[junit4:junit4]   2> 		at org.apache.solr.handler.ContentStreamHandlerBase.handleRequestBody(ContentStreamHandlerBase.java:74)
[junit4:junit4]   2> 		at org.apache.solr.handler.RequestHandlerBase.handleRequest(RequestHandlerBase.java:135)
[junit4:junit4]   2> 		at org.apache.solr.core.SolrCore.execute(SolrCore.java:1808)
[junit4:junit4]   2> 		at org.apache.solr.servlet.DirectSolrConnection.request(DirectSolrConnection.java:131)
[junit4:junit4]   2> 		at org.apache.solr.util.TestHarness.update(TestHarness.java:262)
[junit4:junit4]   2> 		at org.apache.solr.util.TestHarness.checkUpdateStatus(TestHarness.java:312)
[junit4:junit4]   2> 		at org.apache.solr.util.TestHarness.validateUpdate(TestHarness.java:282)
[junit4:junit4]   2> 		at org.apache.solr.SolrTestCaseJ4.checkUpdateU(SolrTestCaseJ4.java:472)
[junit4:junit4]   2> 		at org.apache.solr.SolrTestCaseJ4.assertU(SolrTestCaseJ4.java:451)
[junit4:junit4]   2> 		at org.apache.solr.SolrTestCaseJ4.assertU(SolrTestCaseJ4.java:445)
[junit4:junit4]   2> 		at org.apache.solr.schema.DocValuesMultiTest.testStringDocValuesMatch(DocValuesMultiTest.java:83)
[junit4:junit4]   2> 		at sun.reflect.NativeMethodAccessorImpl.invoke0(Native Method)
[junit4:junit4]   2> 		at sun.reflect.NativeMethodAccessorImpl.invoke(NativeMethodAccessorImpl.java:57)
[junit4:junit4]   2> 		at sun.reflect.DelegatingMethodAccessorImpl.invoke(DelegatingMethodAccessorImpl.java:43)
[junit4:junit4]   2> 		at java.lang.reflect.Method.invoke(Method.java:601)
[junit4:junit4]   2> 		at com.carrotsearch.randomizedtesting.RandomizedRunner.invoke(RandomizedRunner.java:1559)
[junit4:junit4]   2> 		at com.carrotsearch.randomizedtesting.RandomizedRunner.access$600(RandomizedRunner.java:79)
[junit4:junit4]   2> 		at com.carrotsearch.randomizedtesting.RandomizedRunner$6.evaluate(RandomizedRunner.java:737)
[junit4:junit4]   2> 		at com.carrotsearch.randomizedtesting.RandomizedRunner$7.evaluate(RandomizedRunner.java:773)
[junit4:junit4]   2> 		at com.carrotsearch.randomizedtesting.RandomizedRunner$8.evaluate(RandomizedRunner.java:787)
[junit4:junit4]   2> 		at com.carrotsearch.randomizedtesting.rules.SystemPropertiesRestoreRule$1.evaluate(SystemPropertiesRestoreRule.java:53)
[junit4:junit4]   2> 		at org.apache.lucene.util.TestRuleSetupTeardownChained$1.evaluate(TestRuleSetupTeardownChained.java:50)
[junit4:junit4]   2> 		at org.apache.lucene.util.TestRuleFieldCacheSanity$1.evaluate(TestRuleFieldCacheSanity.java:51)
[junit4:junit4]   2> 		at org.apache.lucene.util.AbstractBeforeAfterRule$1.evaluate(AbstractBeforeAfterRule.java:46)
[junit4:junit4]   2> 		at com.carrotsearch.randomizedtesting.rules.SystemPropertiesInvariantRule$1.evaluate(SystemPropertiesInvariantRule.java:55)
[junit4:junit4]   2> 		at org.apache.lucene.util.TestRuleThreadAndTestName$1.evaluate(TestRuleThreadAndTestName.java:49)
[junit4:junit4]   2> 		at org.apache.lucene.util.TestRuleIgnoreAfterMaxFailures$1.evaluate(TestRuleIgnoreAfterMaxFailures.java:70)
[junit4:junit4]   2> 		at org.apache.lucene.util.TestRuleMarkFailure$1.evaluate(TestRuleMarkFailure.java:48)
[junit4:junit4]   2> 		at com.carrotsearch.randomizedtesting.rules.StatementAdapter.evaluate(StatementAdapter.java:36)
[junit4:junit4]   2> 		at com.carrotsearch.randomizedtesting.ThreadLeakControl$StatementRunner.run(ThreadLeakControl.java:358)
[junit4:junit4]   2> 		at com.carrotsearch.randomizedtesting.ThreadLeakControl.forkTimeoutingTask(ThreadLeakControl.java:782)
[junit4:junit4]   2> 		at com.carrotsearch.randomizedtesting.ThreadLeakControl$3.evaluate(ThreadLeakControl.java:442)
[junit4:junit4]   2> 		at com.carrotsearch.randomizedtesting.RandomizedRunner.runSingleTest(RandomizedRunner.java:746)
[junit4:junit4]   2> 		at com.carrotsearch.randomizedtesting.RandomizedRunner$3.evaluate(RandomizedRunner.java:648)
[junit4:junit4]   2> 		at com.carrotsearch.randomizedtesting.RandomizedRunner$4.evaluate(RandomizedRunner.java:682)
[junit4:junit4]   2> 		at com.carrotsearch.randomizedtesting.RandomizedRunner$5.evaluate(RandomizedRunner.java:693)
[junit4:junit4]   2> 		at com.carrotsearch.randomizedtesting.rules.StatementAdapter.evaluate(StatementAdapter.java:36)
[junit4:junit4]   2> 		at com.carrotsearch.randomizedtesting.rules.SystemPropertiesRestoreRule$1.evaluate(SystemPropertiesRestoreRule.java:53)
[junit4:junit4]   2> 		at org.apache.lucene.util.AbstractBeforeAfterRule$1.evaluate(AbstractBeforeAfterRule.java:46)
[junit4:junit4]   2> 		at org.apache.lucene.util.TestRuleStoreClassName$1.evaluate(TestRuleStoreClassName.java:42)
[junit4:junit4]   2> 		at com.carrotsearch.randomizedtesting.rules.SystemPropertiesInvariantRule$1.evaluate(SystemPropertiesInvariantRule.java:55)
[junit4:junit4]   2> 		at com.carrotsearch.randomizedtesting.rules.NoShadowingOrOverridesOnMethodsRule$1.evaluate(NoShadowingOrOverridesOnMethodsRule.java:39)
[junit4:junit4]   2> 		at com.carrotsearch.randomizedtesting.rules.NoShadowingOrOverridesOnMethodsRule$1.evaluate(NoShadowingOrOverridesOnMethodsRule.java:39)
[junit4:junit4]   2> 		at com.carrotsearch.randomizedtesting.rules.StatementAdapter.evaluate(StatementAdapter.java:36)
[junit4:junit4]   2> 		at org.apache.lucene.util.TestRuleAssertionsRequired$1.evaluate(TestRuleAssertionsRequired.java:43)
[junit4:junit4]   2> 		at org.apache.lucene.util.TestRuleMarkFailure$1.evaluate(TestRuleMarkFailure.java:48)
[junit4:junit4]   2> 		at org.apache.lucene.util.TestRuleIgnoreAfterMaxFailures$1.evaluate(TestRuleIgnoreAfterMaxFailures.java:70)
[junit4:junit4]   2> 		at org.apache.lucene.util.TestRuleIgnoreTestSuites$1.evaluate(TestRuleIgnoreTestSuites.java:55)
[junit4:junit4]   2> 		at com.carrotsearch.randomizedtesting.rules.StatementAdapter.evaluate(StatementAdapter.java:36)
[junit4:junit4]   2> 		at com.carrotsearch.randomizedtesting.ThreadLeakControl$StatementRunner.run(ThreadLeakControl.java:358)
[junit4:junit4]   2> 		at java.lang.Thread.run(Thread.java:722)
[junit4:junit4]   2> 	
[junit4:junit4]   2> 705 T2454 oas.SolrTestCaseJ4.tearDown ###Ending testStringDocValuesMatch
[junit4:junit4]   2> NOTE: reproduce with: ant test  -Dtestcase=DocValuesMultiTest -Dtests.method=testStringDocValuesMatch -Dtests.seed=ABD4CDDB66739931 -Dtests.multiplier=3 -Dtests.slow=true -Dtests.locale=ar_OM -Dtests.timezone=Etc/GMT-13 -Dtests.file.encoding=US-ASCII
[junit4:junit4] ERROR   0.05s J0 | DocValuesMultiTest.testStringDocValuesMatch <<<
[junit4:junit4]    > Throwable #1: org.apache.solr.common.SolrException: java.lang.UnsupportedOperationException: Lucene 4.0 does not support SortedSet docvalues
[junit4:junit4]    > 	at __randomizedtesting.SeedInfo.seed([ABD4CDDB66739931:C16B188DB7B9C581]:0)
[junit4:junit4]    > 	at org.apache.solr.util.TestHarness.update(TestHarness.java:266)
[junit4:junit4]    > 	at org.apache.solr.util.TestHarness.checkUpdateStatus(TestHarness.java:312)
[junit4:junit4]    > 	at org.apache.solr.util.TestHarness.validateUpdate(TestHarness.java:282)
[junit4:junit4]    > 	at org.apache.solr.SolrTestCaseJ4.checkUpdateU(SolrTestCaseJ4.java:472)
[junit4:junit4]    > 	at org.apache.solr.SolrTestCaseJ4.assertU(SolrTestCaseJ4.java:451)
[junit4:junit4]    > 	at org.apache.solr.SolrTestCaseJ4.assertU(SolrTestCaseJ4.java:445)
[junit4:junit4]    > 	at org.apache.solr.schema.DocValuesMultiTest.testStringDocValuesMatch(DocValuesMultiTest.java:83)
[junit4:junit4]    > 	at sun.reflect.NativeMethodAccessorImpl.invoke0(Native Method)
[junit4:junit4]    > 	at sun.reflect.NativeMethodAccessorImpl.invoke(NativeMethodAccessorImpl.java:57)
[junit4:junit4]    > 	at sun.reflect.DelegatingMethodAccessorImpl.invoke(DelegatingMethodAccessorImpl.java:43)
[junit4:junit4]    > 	at java.lang.reflect.Method.invoke(Method.java:601)
[junit4:junit4]    > 	at com.carrotsearch.randomizedtesting.RandomizedRunner.invoke(RandomizedRunner.java:1559)
[junit4:junit4]    > 	at com.carrotsearch.randomizedtesting.RandomizedRunner.access$600(RandomizedRunner.java:79)
[junit4:junit4]    > 	at com.carrotsearch.randomizedtesting.RandomizedRunner$6.evaluate(RandomizedRunner.java:737)
[junit4:junit4]    > 	at com.carrotsearch.randomizedtesting.RandomizedRunner$7.evaluate(RandomizedRunner.java:773)
[junit4:junit4]    > 	at com.carrotsearch.randomizedtesting.RandomizedRunner$8.evaluate(RandomizedRunner.java:787)
[junit4:junit4]    > 	at com.carrotsearch.randomizedtesting.rules.SystemPropertiesRestoreRule$1.evaluate(SystemPropertiesRestoreRule.java:53)
[junit4:junit4]    > 	at org.apache.lucene.util.TestRuleSetupTeardownChained$1.evaluate(TestRuleSetupTeardownChained.java:50)
[junit4:junit4]    > 	at org.apache.lucene.util.TestRuleFieldCacheSanity$1.evaluate(TestRuleFieldCacheSanity.java:51)
[junit4:junit4]    > 	at org.apache.lucene.util.AbstractBeforeAfterRule$1.evaluate(AbstractBeforeAfterRule.java:46)
[junit4:junit4]    > 	at com.carrotsearch.randomizedtesting.rules.SystemPropertiesInvariantRule$1.evaluate(SystemPropertiesInvariantRule.java:55)
[junit4:junit4]    > 	at org.apache.lucene.util.TestRuleThreadAndTestName$1.evaluate(TestRuleThreadAndTestName.java:49)
[junit4:junit4]    > 	at org.apache.lucene.util.TestRuleIgnoreAfterMaxFailures$1.evaluate(TestRuleIgnoreAfterMaxFailures.java:70)
[junit4:junit4]    > 	at org.apache.lucene.util.TestRuleMarkFailure$1.evaluate(TestRuleMarkFailure.java:48)
[junit4:junit4]    > 	at com.carrotsearch.randomizedtesting.rules.StatementAdapter.evaluate(StatementAdapter.java:36)
[junit4:junit4]    > 	at com.carrotsearch.randomizedtesting.ThreadLeakControl$StatementRunner.run(ThreadLeakControl.java:358)
[junit4:junit4]    > 	at com.carrotsearch.randomizedtesting.ThreadLeakControl.forkTimeoutingTask(ThreadLeakControl.java:782)
[junit4:junit4]    > 	at com.carrotsearch.randomizedtesting.ThreadLeakControl$3.evaluate(ThreadLeakControl.java:442)
[junit4:junit4]    > 	at com.carrotsearch.randomizedtesting.RandomizedRunner.runSingleTest(RandomizedRunner.java:746)
[junit4:junit4]    > 	at com.carrotsearch.randomizedtesting.RandomizedRunner$3.evaluate(RandomizedRunner.java:648)
[junit4:junit4]    > 	at com.carrotsearch.randomizedtesting.RandomizedRunner$4.evaluate(RandomizedRunner.java:682)
[junit4:junit4]    > 	at com.carrotsearch.randomizedtesting.RandomizedRunner$5.evaluate(RandomizedRunner.java:693)
[junit4:junit4]    > 	at com.carrotsearch.randomizedtesting.rules.StatementAdapter.evaluate(StatementAdapter.java:36)
[junit4:junit4]    > 	at com.carrotsearch.randomizedtesting.rules.SystemPropertiesRestoreRule$1.evaluate(SystemPropertiesRestoreRule.java:53)
[junit4:junit4]    > 	at org.apache.lucene.util.AbstractBeforeAfterRule$1.evaluate(AbstractBeforeAfterRule.java:46)
[junit4:junit4]    > 	at org.apache.lucene.util.TestRuleStoreClassName$1.evaluate(TestRuleStoreClassName.java:42)
[junit4:junit4]    > 	at com.carrotsearch.randomizedtesting.rules.SystemPropertiesInvariantRule$1.evaluate(SystemPropertiesInvariantRule.java:55)
[junit4:junit4]    > 	at com.carrotsearch.randomizedtesting.rules.NoShadowingOrOverridesOnMethodsRule$1.evaluate(NoShadowingOrOverridesOnMethodsRule.java:39)
[junit4:junit4]    > 	at com.carrotsearch.randomizedtesting.rules.NoShadowingOrOverridesOnMethodsRule$1.evaluate(NoShadowingOrOverridesOnMethodsRule.java:39)
[junit4:junit4]    > 	at com.carrotsearch.randomizedtesting.rules.StatementAdapter.evaluate(StatementAdapter.java:36)
[junit4:junit4]    > 	at org.apache.lucene.util.TestRuleAssertionsRequired$1.evaluate(TestRuleAssertionsRequired.java:43)
[junit4:junit4]    > 	at org.apache.lucene.util.TestRuleMarkFailure$1.evaluate(TestRuleMarkFailure.java:48)
[junit4:junit4]    > 	at org.apache.lucene.util.TestRuleIgnoreAfterMaxFailures$1.evaluate(TestRuleIgnoreAfterMaxFailures.java:70)
[junit4:junit4]    > 	at org.apache.lucene.util.TestRuleIgnoreTestSuites$1.evaluate(TestRuleIgnoreTestSuites.java:55)
[junit4:junit4]    > 	at com.carrotsearch.randomizedtesting.rules.StatementAdapter.evaluate(StatementAdapter.java:36)
[junit4:junit4]    > 	at com.carrotsearch.randomizedtesting.ThreadLeakControl$StatementRunner.run(ThreadLeakControl.java:358)
[junit4:junit4]    > 	at java.lang.Thread.run(Thread.java:722)
[junit4:junit4]    > Caused by: java.lang.UnsupportedOperationException: Lucene 4.0 does not support SortedSet docvalues
[junit4:junit4]    > 	at org.apache.lucene.codecs.lucene40.Lucene40DocValuesWriter.addSortedSetField(Lucene40DocValuesWriter.java:498)
[junit4:junit4]    > 	at org.apache.lucene.index.SortedSetDocValuesWriter.flush(SortedSetDocValuesWriter.java:161)
[junit4:junit4]    > 	at org.apache.lucene.index.DocValuesProcessor.flush(DocValuesProcessor.java:82)
[junit4:junit4]    > 	at org.apache.lucene.index.TwoStoredFieldsConsumers.flush(TwoStoredFieldsConsumers.java:42)
[junit4:junit4]    > 	at org.apache.lucene.index.DocFieldProcessor.flush(DocFieldProcessor.java:80)
[junit4:junit4]    > 	at org.apache.lucene.index.DocumentsWriterPerThread.flush(DocumentsWriterPerThread.java:493)
[junit4:junit4]    > 	at org.apache.lucene.index.DocumentsWriter.doFlush(DocumentsWriter.java:422)
[junit4:junit4]    > 	at org.apache.lucene.index.DocumentsWriter.flushAllThreads(DocumentsWriter.java:559)
[junit4:junit4]    > 	at org.apache.lucene.index.IndexWriter.prepareCommitInternal(IndexWriter.java:2683)
[junit4:junit4]    > 	at org.apache.lucene.index.IndexWriter.commitInternal(IndexWriter.java:2827)
[junit4:junit4]    > 	at org.apache.lucene.index.IndexWriter.commit(IndexWriter.java:2807)
[junit4:junit4]    > 	at org.apache.solr.update.DirectUpdateHandler2.commit(DirectUpdateHandler2.java:541)
[junit4:junit4]    > 	at org.apache.solr.update.processor.RunUpdateProcessor.processCommit(RunUpdateProcessorFactory.java:95)
[junit4:junit4]    > 	at org.apache.solr.update.processor.UpdateRequestProcessor.processCommit(UpdateRequestProcessor.java:64)
[junit4:junit4]    > 	at org.apache.solr.update.processor.DistributedUpdateProcessor.processCommit(DistributedUpdateProcessor.java:1055)
[junit4:junit4]    > 	at org.apache.solr.update.processor.LogUpdateProcessor.processCommit(LogUpdateProcessorFactory.java:157)
[junit4:junit4]    > 	at org.apache.solr.handler.loader.XMLLoader.processUpdate(XMLLoader.java:266)
[junit4:junit4]    > 	at org.apache.solr.handler.loader.XMLLoader.load(XMLLoader.java:173)
[junit4:junit4]    > 	at org.apache.solr.handler.UpdateRequestHandler$1.load(UpdateRequestHandler.java:92)
[junit4:junit4]    > 	at org.apache.solr.handler.ContentStreamHandlerBase.handleRequestBody(ContentStreamHandlerBase.java:74)
[junit4:junit4]    > 	at org.apache.solr.handler.RequestHandlerBase.handleRequest(RequestHandlerBase.java:135)
[junit4:junit4]    > 	at org.apache.solr.core.SolrCore.execute(SolrCore.java:1808)
[junit4:junit4]    > 	at org.apache.solr.servlet.DirectSolrConnection.request(DirectSolrConnection.java:131)
[junit4:junit4]    > 	at org.apache.solr.util.TestHarness.update(TestHarness.java:262)
[junit4:junit4]    > 	... 46 more
[junit4:junit4]   2> 711 T2454 oas.SolrTestCaseJ4.deleteCore ###deleteCore
[junit4:junit4]   2> 711 T2454 oasc.CoreContainer.shutdown Shutting down CoreContainer instance=25236398
[junit4:junit4]   2> 711 T2454 oasc.SolrCore.close [collection1]  CLOSING SolrCore org.apache.solr.core.SolrCore@19d82b2
[junit4:junit4]   2> 712 T2454 oasu.DirectUpdateHandler2.close closing DirectUpdateHandler2{commits=3,autocommits=0,soft autocommits=0,optimizes=0,rollbacks=0,expungeDeletes=0,docsPending=110,adds=0,deletesById=0,deletesByQuery=0,errors=3,cumulative_adds=110,cumulative_deletesById=0,cumulative_deletesByQuery=4,cumulative_errors=0}
[junit4:junit4]   2> 712 T2454 oasu.SolrCoreState.decrefSolrCoreState Closing SolrCoreState
[junit4:junit4]   2> 712 T2454 oasu.DefaultSolrCoreState.closeIndexWriter SolrCoreState ref count has reached 0 - closing IndexWriter
[junit4:junit4]   2> 712 T2454 oasu.DefaultSolrCoreState.closeIndexWriter closing IndexWriter with IndexWriterCloser
[junit4:junit4]   2> 713 T2454 C152 oasc.SolrDeletionPolicy.onCommit SolrDeletionPolicy.onCommit: commits:num=2
[junit4:junit4]   2> 		commit{dir=MockDirWrapper(org.apache.lucene.store.RAMDirectory@16cbaef lockFactory=org.apache.lucene.store.NativeFSLockFactory@bd7e7c),segFN=segments_1,generation=1,filenames=[segments_1]
[junit4:junit4]   2> 		commit{dir=MockDirWrapper(org.apache.lucene.store.RAMDirectory@16cbaef lockFactory=org.apache.lucene.store.NativeFSLockFactory@bd7e7c),segFN=segments_2,generation=2,filenames=[segments_2]
[junit4:junit4]   2> 713 T2454 C152 oasc.SolrDeletionPolicy.updateCommits newest commit = 2[segments_2]
[junit4:junit4]   2> 714 T2454 C152 oasc.CachingDirectoryFactory.close Releasing directory:/mnt/ssd/jenkins/workspace/Lucene-Solr-4.x-Linux/solr/build/solr-core/test/J0/./solrtest-DocValuesMultiTest-1361936457536/index
[junit4:junit4]   2> 714 T2454 oasc.SolrCore.closeSearcher [collection1] Closing main searcher on request.
[junit4:junit4]   2> 714 T2454 oasc.CachingDirectoryFactory.close Releasing directory:/mnt/ssd/jenkins/workspace/Lucene-Solr-4.x-Linux/solr/build/solr-core/test/J0/./solrtest-DocValuesMultiTest-1361936457536/index
[junit4:junit4]   2> 714 T2454 oasc.CachingDirectoryFactory.close Closing directory when closing factory:/mnt/ssd/jenkins/workspace/Lucene-Solr-4.x-Linux/solr/build/solr-core/test/J0/./solrtest-DocValuesMultiTest-1361936457536
[junit4:junit4]   2> 715 T2454 oasc.CachingDirectoryFactory.closeDirectory Closing directory:/mnt/ssd/jenkins/workspace/Lucene-Solr-4.x-Linux/solr/build/solr-core/test/J0/./solrtest-DocValuesMultiTest-1361936457536
[junit4:junit4]   2> 715 T2454 oasc.CachingDirectoryFactory.close Closing directory when closing factory:/mnt/ssd/jenkins/workspace/Lucene-Solr-4.x-Linux/solr/build/solr-core/test/J0/./solrtest-DocValuesMultiTest-1361936457536/index
[junit4:junit4]   2> 715 T2454 oasc.CachingDirectoryFactory.closeDirectory Closing directory:/mnt/ssd/jenkins/workspace/Lucene-Solr-4.x-Linux/solr/build/solr-core/test/J0/./solrtest-DocValuesMultiTest-1361936457536/index
[junit4:junit4]   2> NOTE: test params are: codec=Appending, sim=DefaultSimilarity, locale=ar_OM, timezone=Etc/GMT-13
[junit4:junit4]   2> NOTE: Linux 3.2.0-38-generic i386/Oracle Corporation 1.7.0_15 (32-bit)/cpus=8,threads=1,free=55606824,total=163299328
[junit4:junit4]   2> NOTE: All tests run in this JVM: [TestGroupingSearch, RequestHandlersTest, TestCollationKeyRangeQueries, CircularListTest, TermsComponentTest, TestStressRecovery, BinaryUpdateRequestHandlerTest, TestFastWriter, TestQuerySenderNoQuery, PathHierarchyTokenizerFactoryTest, ZkCLITest, CoreAdminHandlerTest, NoCacheHeaderTest, PreAnalyzedFieldTest, DistanceFunctionTest, TestPerFieldSimilarity, CopyFieldTest, TestRandomFaceting, FastVectorHighlighterTest, MoreLikeThisHandlerTest, OverseerCollectionProcessorTest, TestSearchPerf, BasicDistributedZkTest, DistributedSpellCheckComponentTest, LeaderElectionIntegrationTest, SimplePostToolTest, SolrRequestParserTest, CSVRequestHandlerTest, ResourceLoaderTest, TestCoreContainer, TestExtendedDismaxParser, TestIndexSearcher, TestFiltering, TestBinaryResponseWriter, SortByFunctionTest, TestSystemIdResolver, UpdateRequestProcessorFactoryTest, TestRangeQuery, RegexBoostProcessorTest, TestPseudoReturnFields, DateMathParserTest, TestSolrIndexConfig, ClusterStateUpdateTest, ScriptEngineTest, NotRequiredUniqueKeyTest, WordBreakSolrSpellCheckerTest, TestJmxMonitoredMap, ShardRoutingTest, SuggesterWFSTTest, FieldAnalysisRequestHandlerTest, QueryElevationComponentTest, DateFieldTest, TestLuceneMatchVersion, ShardRoutingCustomTest, AlternateDirectoryTest, SimpleFacetsTest, TestQueryTypes, LoggingHandlerTest, DirectSolrConnectionTest, UniqFieldsUpdateProcessorFactoryTest, TestNumberUtils, DistributedTermsComponentTest, TestRecovery, TestJoin, BadComponentTest, HighlighterConfigTest, SOLR749Test, DefaultValueUpdateProcessorTest, TestCollationField, IndexReaderFactoryTest, MultiTermTest, TestConfig, TestBM25SimilarityFactory, TestLMDirichletSimilarityFactory, TestLMJelinekMercerSimilarityFactory, TestDefaultSimilarityFactory, TestFastLRUCache, PluginInfoTest, TestSuggestSpellingConverter, TestLRUCache, ChaosMonkeySafeLeaderTest, SyncSliceTest, CoreContainerCoreInitFailuresTest, TestLazyCores, TermVectorComponentDistributedTest, DocValuesMultiTest]
[junit4:junit4] Completed on J0 in 0.73s, 4 tests, 4 errors <<< FAILURES!

[...truncated 66 lines...]
BUILD FAILED
/mnt/ssd/jenkins/workspace/Lucene-Solr-4.x-Linux/build.xml:381: The following error occurred while executing this line:
/mnt/ssd/jenkins/workspace/Lucene-Solr-4.x-Linux/build.xml:361: The following error occurred while executing this line:
/mnt/ssd/jenkins/workspace/Lucene-Solr-4.x-Linux/build.xml:39: The following error occurred while executing this line:
/mnt/ssd/jenkins/workspace/Lucene-Solr-4.x-Linux/solr/build.xml:183: The following error occurred while executing this line:
/mnt/ssd/jenkins/workspace/Lucene-Solr-4.x-Linux/solr/common-build.xml:447: The following error occurred while executing this line:
/mnt/ssd/jenkins/workspace/Lucene-Solr-4.x-Linux/lucene/common-build.xml:1202: The following error occurred while executing this line:
/mnt/ssd/jenkins/workspace/Lucene-Solr-4.x-Linux/lucene/common-build.xml:865: There were test failures: 258 suites, 1078 tests, 4 errors, 8 ignored (3 assumptions)

Total time: 40 minutes 24 seconds
Build step 'Invoke Ant' marked build as failure
Archiving artifacts
Recording test results
Description set: Java: 32bit/jdk1.7.0_15 -client -XX:+UseSerialGC
Email was triggered for: Failure
Sending email for trigger: Failure



Mime
View raw message