lucene-dev mailing list archives

Site index · List index
Message view « Date » · « Thread »
Top « Date » · « Thread »
From Policeman Jenkins Server <jenk...@thetaphi.de>
Subject [JENKINS] Lucene-Solr-trunk-Linux (64bit/jdk1.8.0-ea-b65) - Build # 4445 - Still Failing!
Date Sat, 23 Feb 2013 18:10:50 GMT
Build: http://jenkins.thetaphi.de/job/Lucene-Solr-trunk-Linux/4445/
Java: 64bit/jdk1.8.0-ea-b65 -XX:+UseSerialGC

1 tests failed.
REGRESSION:  org.apache.solr.cloud.UnloadDistributedZkTest.testDistribSearch

Error Message:
Still found shard

Stack Trace:
java.lang.AssertionError: Still found shard
	at __randomizedtesting.SeedInfo.seed([1790C2D5AB933494:96764CCDDCCC54A8]:0)
	at org.junit.Assert.fail(Assert.java:93)
	at org.apache.solr.cloud.UnloadDistributedZkTest.testUnloadShardAndCollection(UnloadDistributedZkTest.java:120)
	at org.apache.solr.cloud.UnloadDistributedZkTest.doTest(UnloadDistributedZkTest.java:73)
	at org.apache.solr.BaseDistributedSearchTestCase.testDistribSearch(BaseDistributedSearchTestCase.java:794)
	at sun.reflect.NativeMethodAccessorImpl.invoke0(Native Method)
	at sun.reflect.NativeMethodAccessorImpl.invoke(NativeMethodAccessorImpl.java:57)
	at sun.reflect.DelegatingMethodAccessorImpl.invoke(DelegatingMethodAccessorImpl.java:43)
	at java.lang.reflect.Method.invoke(Method.java:474)
	at com.carrotsearch.randomizedtesting.RandomizedRunner.invoke(RandomizedRunner.java:1559)
	at com.carrotsearch.randomizedtesting.RandomizedRunner.access$600(RandomizedRunner.java:79)
	at com.carrotsearch.randomizedtesting.RandomizedRunner$6.evaluate(RandomizedRunner.java:737)
	at com.carrotsearch.randomizedtesting.RandomizedRunner$7.evaluate(RandomizedRunner.java:773)
	at com.carrotsearch.randomizedtesting.RandomizedRunner$8.evaluate(RandomizedRunner.java:787)
	at com.carrotsearch.randomizedtesting.rules.SystemPropertiesRestoreRule$1.evaluate(SystemPropertiesRestoreRule.java:53)
	at org.apache.lucene.util.TestRuleSetupTeardownChained$1.evaluate(TestRuleSetupTeardownChained.java:50)
	at org.apache.lucene.util.TestRuleFieldCacheSanity$1.evaluate(TestRuleFieldCacheSanity.java:51)
	at org.apache.lucene.util.AbstractBeforeAfterRule$1.evaluate(AbstractBeforeAfterRule.java:46)
	at com.carrotsearch.randomizedtesting.rules.SystemPropertiesInvariantRule$1.evaluate(SystemPropertiesInvariantRule.java:55)
	at org.apache.lucene.util.TestRuleThreadAndTestName$1.evaluate(TestRuleThreadAndTestName.java:49)
	at org.apache.lucene.util.TestRuleIgnoreAfterMaxFailures$1.evaluate(TestRuleIgnoreAfterMaxFailures.java:70)
	at org.apache.lucene.util.TestRuleMarkFailure$1.evaluate(TestRuleMarkFailure.java:48)
	at com.carrotsearch.randomizedtesting.rules.StatementAdapter.evaluate(StatementAdapter.java:36)
	at com.carrotsearch.randomizedtesting.ThreadLeakControl$StatementRunner.run(ThreadLeakControl.java:358)
	at com.carrotsearch.randomizedtesting.ThreadLeakControl.forkTimeoutingTask(ThreadLeakControl.java:782)
	at com.carrotsearch.randomizedtesting.ThreadLeakControl$3.evaluate(ThreadLeakControl.java:442)
	at com.carrotsearch.randomizedtesting.RandomizedRunner.runSingleTest(RandomizedRunner.java:746)
	at com.carrotsearch.randomizedtesting.RandomizedRunner$3.evaluate(RandomizedRunner.java:648)
	at com.carrotsearch.randomizedtesting.RandomizedRunner$4.evaluate(RandomizedRunner.java:682)
	at com.carrotsearch.randomizedtesting.RandomizedRunner$5.evaluate(RandomizedRunner.java:693)
	at com.carrotsearch.randomizedtesting.rules.StatementAdapter.evaluate(StatementAdapter.java:36)
	at com.carrotsearch.randomizedtesting.rules.SystemPropertiesRestoreRule$1.evaluate(SystemPropertiesRestoreRule.java:53)
	at org.apache.lucene.util.AbstractBeforeAfterRule$1.evaluate(AbstractBeforeAfterRule.java:46)
	at org.apache.lucene.util.TestRuleStoreClassName$1.evaluate(TestRuleStoreClassName.java:42)
	at com.carrotsearch.randomizedtesting.rules.SystemPropertiesInvariantRule$1.evaluate(SystemPropertiesInvariantRule.java:55)
	at com.carrotsearch.randomizedtesting.rules.NoShadowingOrOverridesOnMethodsRule$1.evaluate(NoShadowingOrOverridesOnMethodsRule.java:39)
	at com.carrotsearch.randomizedtesting.rules.NoShadowingOrOverridesOnMethodsRule$1.evaluate(NoShadowingOrOverridesOnMethodsRule.java:39)
	at com.carrotsearch.randomizedtesting.rules.StatementAdapter.evaluate(StatementAdapter.java:36)
	at org.apache.lucene.util.TestRuleAssertionsRequired$1.evaluate(TestRuleAssertionsRequired.java:43)
	at org.apache.lucene.util.TestRuleMarkFailure$1.evaluate(TestRuleMarkFailure.java:48)
	at org.apache.lucene.util.TestRuleIgnoreAfterMaxFailures$1.evaluate(TestRuleIgnoreAfterMaxFailures.java:70)
	at org.apache.lucene.util.TestRuleIgnoreTestSuites$1.evaluate(TestRuleIgnoreTestSuites.java:55)
	at com.carrotsearch.randomizedtesting.rules.StatementAdapter.evaluate(StatementAdapter.java:36)
	at com.carrotsearch.randomizedtesting.ThreadLeakControl$StatementRunner.run(ThreadLeakControl.java:358)
	at java.lang.Thread.run(Thread.java:722)




Build Log:
[...truncated 8830 lines...]
[junit4:junit4] Suite: org.apache.solr.cloud.UnloadDistributedZkTest
[junit4:junit4]   2> 52 T12 oas.BaseDistributedSearchTestCase.initHostContext Setting hostContext system property: /
[junit4:junit4]   2> 87 T12 oas.SolrTestCaseJ4.setUp ###Starting testDistribSearch
[junit4:junit4]   2> Creating dataDir: /mnt/ssd/jenkins/workspace/Lucene-Solr-trunk-Linux/solr/build/solr-core/test/J1/./solrtest-UnloadDistributedZkTest-1361642189188
[junit4:junit4]   2> 92 T12 oasc.ZkTestServer.run STARTING ZK TEST SERVER
[junit4:junit4]   2> 95 T13 oasc.ZkTestServer$ZKServerMain.runFromConfig Starting server
[junit4:junit4]   2> 128 T13 oaz.Environment.logEnv Server environment:zookeeper.version=3.4.5-1392090, built on 09/30/2012 17:52 GMT
[junit4:junit4]   2> 129 T13 oaz.Environment.logEnv Server environment:host.name=serv1
[junit4:junit4]   2> 129 T13 oaz.Environment.logEnv Server environment:java.version=1.8.0-ea
[junit4:junit4]   2> 130 T13 oaz.Environment.logEnv Server environment:java.vendor=Oracle Corporation
[junit4:junit4]   2> 130 T13 oaz.Environment.logEnv Server environment:java.home=/var/lib/jenkins/tools/java/64bit/jdk1.8.0-ea-b65/jre
[junit4:junit4]   2> 131 T13 oaz.Environment.logEnv Server environment:java.class.path=/mnt/ssd/jenkins/workspace/Lucene-Solr-trunk-Linux/solr/build/solr-core/classes/test:/mnt/ssd/jenkins/workspace/Lucene-Solr-trunk-Linux/solr/build/solr-test-framework/classes/java:/mnt/ssd/jenkins/workspace/Lucene-Solr-trunk-Linux/solr/build/solr-core/test-files:/mnt/ssd/jenkins/workspace/Lucene-Solr-trunk-Linux/lucene/build/test-framework/classes/java:/mnt/ssd/jenkins/workspace/Lucene-Solr-trunk-Linux/lucene/build/codecs/classes/java:/mnt/ssd/jenkins/workspace/Lucene-Solr-trunk-Linux/solr/build/solr-solrj/classes/java:/mnt/ssd/jenkins/workspace/Lucene-Solr-trunk-Linux/solr/build/solr-core/classes/java:/mnt/ssd/jenkins/workspace/Lucene-Solr-trunk-Linux/lucene/build/analysis/common/lucene-analyzers-common-5.0-SNAPSHOT.jar:/mnt/ssd/jenkins/workspace/Lucene-Solr-trunk-Linux/lucene/build/analysis/kuromoji/lucene-analyzers-kuromoji-5.0-SNAPSHOT.jar:/mnt/ssd/jenkins/workspace/Lucene-Solr-trunk-Linux/lucene/build/analysis/phonetic/lucene-analyzers-phonetic-5.0-SNAPSHOT.jar:/mnt/ssd/jenkins/workspace/Lucene-Solr-trunk-Linux/lucene/build/highlighter/lucene-highlighter-5.0-SNAPSHOT.jar:/mnt/ssd/jenkins/workspace/Lucene-Solr-trunk-Linux/lucene/build/memory/lucene-memory-5.0-SNAPSHOT.jar:/mnt/ssd/jenkins/workspace/Lucene-Solr-trunk-Linux/lucene/build/misc/lucene-misc-5.0-SNAPSHOT.jar:/mnt/ssd/jenkins/workspace/Lucene-Solr-trunk-Linux/lucene/build/spatial/lucene-spatial-5.0-SNAPSHOT.jar:/mnt/ssd/jenkins/workspace/Lucene-Solr-trunk-Linux/lucene/build/suggest/lucene-suggest-5.0-SNAPSHOT.jar:/mnt/ssd/jenkins/workspace/Lucene-Solr-trunk-Linux/lucene/build/grouping/lucene-grouping-5.0-SNAPSHOT.jar:/mnt/ssd/jenkins/workspace/Lucene-Solr-trunk-Linux/lucene/build/queries/lucene-queries-5.0-SNAPSHOT.jar:/mnt/ssd/jenkins/workspace/Lucene-Solr-trunk-Linux/lucene/build/queryparser/lucene-queryparser-5.0-SNAPSHOT.jar:/mnt/ssd/jenkins/workspace/Lucene-Solr-trunk-Linux/solr/core/lib/cglib-nodep-2.2.jar:/mnt/ssd/jenkins/workspace/Lucene-Solr-trunk-Linux/solr/core/lib/commons-cli-1.2.jar:/mnt/ssd/jenkins/workspace/Lucene-Solr-trunk-Linux/solr/core/lib/commons-codec-1.7.jar:/mnt/ssd/jenkins/workspace/Lucene-Solr-trunk-Linux/solr/core/lib/commons-fileupload-1.2.1.jar:/mnt/ssd/jenkins/workspace/Lucene-Solr-trunk-Linux/solr/core/lib/commons-lang-2.6.jar:/mnt/ssd/jenkins/workspace/Lucene-Solr-trunk-Linux/solr/core/lib/easymock-3.0.jar:/mnt/ssd/jenkins/workspace/Lucene-Solr-trunk-Linux/solr/core/lib/guava-13.0.1.jar:/mnt/ssd/jenkins/workspace/Lucene-Solr-trunk-Linux/solr/core/lib/javax.servlet-api-3.0.1.jar:/mnt/ssd/jenkins/workspace/Lucene-Solr-trunk-Linux/solr/core/lib/objenesis-1.2.jar:/mnt/ssd/jenkins/workspace/Lucene-Solr-trunk-Linux/solr/core/lib/spatial4j-0.3.jar:/mnt/ssd/jenkins/workspace/Lucene-Solr-trunk-Linux/solr/solrj/lib/commons-io-2.1.jar:/mnt/ssd/jenkins/workspace/Lucene-Solr-trunk-Linux/solr/solrj/lib/httpclient-4.2.3.jar:/mnt/ssd/jenkins/workspace/Lucene-Solr-trunk-Linux/solr/solrj/lib/httpcore-4.2.2.jar:/mnt/ssd/jenkins/workspace/Lucene-Solr-trunk-Linux/solr/solrj/lib/httpmime-4.2.3.jar:/mnt/ssd/jenkins/workspace/Lucene-Solr-trunk-Linux/solr/solrj/lib/jcl-over-slf4j-1.6.4.jar:/mnt/ssd/jenkins/workspace/Lucene-Solr-trunk-Linux/solr/solrj/lib/slf4j-api-1.6.4.jar:/mnt/ssd/jenkins/workspace/Lucene-Solr-trunk-Linux/solr/solrj/lib/slf4j-jdk14-1.6.4.jar:/mnt/ssd/jenkins/workspace/Lucene-Solr-trunk-Linux/solr/solrj/lib/wstx-asl-3.2.7.jar:/mnt/ssd/jenkins/workspace/Lucene-Solr-trunk-Linux/solr/solrj/lib/zookeeper-3.4.5.jar:/mnt/ssd/jenkins/workspace/Lucene-Solr-trunk-Linux/solr/example/lib/jetty-continuation-8.1.8.v20121106.jar:/mnt/ssd/jenkins/workspace/Lucene-Solr-trunk-Linux/solr/example/lib/jetty-deploy-8.1.8.v20121106.jar:/mnt/ssd/jenkins/workspace/Lucene-Solr-trunk-Linux/solr/example/lib/jetty-http-8.1.8.v20121106.jar:/mnt/ssd/jenkins/workspace/Lucene-Solr-trunk-Linux/solr/example/lib/jetty-io-8.1.8.v20121106.jar:/mnt/ssd/jenkins/workspace/Lucene-Solr-trunk-Linux/solr/example/lib/jetty-jmx-8.1.8.v20121106.jar:/mnt/ssd/jenkins/workspace/Lucene-Solr-trunk-Linux/solr/example/lib/jetty-security-8.1.8.v20121106.jar:/mnt/ssd/jenkins/workspace/Lucene-Solr-trunk-Linux/solr/example/lib/jetty-server-8.1.8.v20121106.jar:/mnt/ssd/jenkins/workspace/Lucene-Solr-trunk-Linux/solr/example/lib/jetty-servlet-8.1.8.v20121106.jar:/mnt/ssd/jenkins/workspace/Lucene-Solr-trunk-Linux/solr/example/lib/jetty-util-8.1.8.v20121106.jar:/mnt/ssd/jenkins/workspace/Lucene-Solr-trunk-Linux/solr/example/lib/jetty-webapp-8.1.8.v20121106.jar:/mnt/ssd/jenkins/workspace/Lucene-Solr-trunk-Linux/solr/example/lib/jetty-xml-8.1.8.v20121106.jar:/mnt/ssd/jenkins/workspace/Lucene-Solr-trunk-Linux/solr/example/lib/servlet-api-3.0.jar:/mnt/ssd/jenkins/workspace/Lucene-Solr-trunk-Linux/solr/example/example-DIH/solr/db/lib/derby-10.9.1.0.jar:/mnt/ssd/jenkins/workspace/Lucene-Solr-trunk-Linux/solr/example/example-DIH/solr/db/lib/hsqldb-1.8.0.10.jar:/mnt/ssd/jenkins/workspace/Lucene-Solr-trunk-Linux/lucene/build/core/classes/java:/mnt/ssd/jenkins/workspace/Lucene-Solr-trunk-Linux/lucene/test-framework/lib/junit-4.10.jar:/mnt/ssd/jenkins/workspace/Lucene-Solr-trunk-Linux/lucene/test-framework/lib/randomizedtesting-runner-2.0.8.jar:/var/lib/jenkins/tools/hudson.tasks.Ant_AntInstallation/ANT_1.8.2/lib/ant-launcher.jar:/var/lib/jenkins/.ant/lib/ivy-2.3.0.jar:/var/lib/jenkins/tools/hudson.tasks.Ant_AntInstallation/ANT_1.8.2/lib/ant-jai.jar:/var/lib/jenkins/tools/hudson.tasks.Ant_AntInstallation/ANT_1.8.2/lib/ant-swing.jar:/var/lib/jenkins/tools/hudson.tasks.Ant_AntInstallation/ANT_1.8.2/lib/ant-apache-oro.jar:/var/lib/jenkins/tools/hudson.tasks.Ant_AntInstallation/ANT_1.8.2/lib/ant-jmf.jar:/var/lib/jenkins/tools/hudson.tasks.Ant_AntInstallation/ANT_1.8.2/lib/ant-apache-xalan2.jar:/var/lib/jenkins/tools/hudson.tasks.Ant_AntInstallation/ANT_1.8.2/lib/ant-javamail.jar:/var/lib/jenkins/tools/hudson.tasks.Ant_AntInstallation/ANT_1.8.2/lib/ant-apache-resolver.jar:/var/lib/jenkins/tools/hudson.tasks.Ant_AntInstallation/ANT_1.8.2/lib/ant-testutil.jar:/var/lib/jenkins/tools/hudson.tasks.Ant_AntInstallation/ANT_1.8.2/lib/ant-commons-logging.jar:/var/lib/jenkins/tools/hudson.tasks.Ant_AntInstallation/ANT_1.8.2/lib/ant-apache-log4j.jar:/var/lib/jenkins/tools/hudson.tasks.Ant_AntInstallation/ANT_1.8.2/lib/ant-junit.jar:/var/lib/jenkins/tools/hudson.tasks.Ant_AntInstallation/ANT_1.8.2/lib/ant-jsch.jar:/var/lib/jenkins/tools/hudson.tasks.Ant_AntInstallation/ANT_1.8.2/lib/ant-commons-net.jar:/var/lib/jenkins/tools/hudson.tasks.Ant_AntInstallation/ANT_1.8.2/lib/ant-apache-bsf.jar:/var/lib/jenkins/tools/hudson.tasks.Ant_AntInstallation/ANT_1.8.2/lib/ant-jdepend.jar:/var/lib/jenkins/tools/hudson.tasks.Ant_AntInstallation/ANT_1.8.2/lib/ant-netrexx.jar:/var/lib/jenkins/tools/hudson.tasks.Ant_AntInstallation/ANT_1.8.2/lib/ant-apache-regexp.jar:/var/lib/jenkins/tools/hudson.tasks.Ant_AntInstallation/ANT_1.8.2/lib/ant-junit4.jar:/var/lib/jenkins/tools/hudson.tasks.Ant_AntInstallation/ANT_1.8.2/lib/ant.jar:/var/lib/jenkins/tools/hudson.tasks.Ant_AntInstallation/ANT_1.8.2/lib/ant-apache-bcel.jar:/var/lib/jenkins/tools/hudson.tasks.Ant_AntInstallation/ANT_1.8.2/lib/ant-antlr.jar:/var/lib/jenkins/tools/java/64bit/jdk1.8.0-ea-b65/lib/tools.jar:/var/lib/jenkins/.ivy2/cache/com.carrotsearch.randomizedtesting/junit4-ant/jars/junit4-ant-2.0.8.jar
[junit4:junit4]   2> 133 T13 oaz.Environment.logEnv Server environment:java.library.path=/var/lib/jenkins/tools/java/64bit/jdk1.8.0-ea-b65/jre/lib/amd64/server:/var/lib/jenkins/tools/java/64bit/jdk1.8.0-ea-b65/jre/lib/amd64:/var/lib/jenkins/tools/java/64bit/jdk1.8.0-ea-b65/jre/../lib/amd64:/usr/lib/jvm/j2sdk1.6-sun/jre/lib/amd64/server:/usr/lib/jvm/j2sdk1.6-sun/jre/lib/amd64:/usr/lib/jvm/j2sdk1.6-sun/jre/../lib/amd64:/usr/java/packages/lib/amd64:/usr/lib64:/lib64:/lib:/usr/lib
[junit4:junit4]   2> 134 T13 oaz.Environment.logEnv Server environment:java.io.tmpdir=.
[junit4:junit4]   2> 134 T13 oaz.Environment.logEnv Server environment:java.compiler=<NA>
[junit4:junit4]   2> 135 T13 oaz.Environment.logEnv Server environment:os.name=Linux
[junit4:junit4]   2> 135 T13 oaz.Environment.logEnv Server environment:os.arch=amd64
[junit4:junit4]   2> 136 T13 oaz.Environment.logEnv Server environment:os.version=3.2.0-38-generic
[junit4:junit4]   2> 136 T13 oaz.Environment.logEnv Server environment:user.name=jenkins
[junit4:junit4]   2> 137 T13 oaz.Environment.logEnv Server environment:user.home=/var/lib/jenkins
[junit4:junit4]   2> 137 T13 oaz.Environment.logEnv Server environment:user.dir=/mnt/ssd/jenkins/workspace/Lucene-Solr-trunk-Linux/solr/build/solr-core/test/J1
[junit4:junit4]   2> 154 T13 oazs.ZooKeeperServer.setTickTime tickTime set to 1000
[junit4:junit4]   2> 155 T13 oazs.ZooKeeperServer.setMinSessionTimeout minSessionTimeout set to -1
[junit4:junit4]   2> 156 T13 oazs.ZooKeeperServer.setMaxSessionTimeout maxSessionTimeout set to -1
[junit4:junit4]   2> 166 T13 oazs.NIOServerCnxnFactory.configure binding to port 0.0.0.0/0.0.0.0:0
[junit4:junit4]   2> 195 T12 oasc.ZkTestServer.run start zk server on port:44589
[junit4:junit4]   2> 208 T13 oazsp.FileTxnSnapLog.save Snapshotting: 0x0 to /mnt/ssd/jenkins/workspace/Lucene-Solr-trunk-Linux/solr/build/solr-core/test/J1/./org.apache.solr.cloud.UnloadDistributedZkTest-1361642189188/zookeeper/server1/data/version-2/snapshot.0
[junit4:junit4]   2> 216 T12 oaz.Environment.logEnv Client environment:zookeeper.version=3.4.5-1392090, built on 09/30/2012 17:52 GMT
[junit4:junit4]   2> 216 T12 oaz.Environment.logEnv Client environment:host.name=serv1
[junit4:junit4]   2> 217 T12 oaz.Environment.logEnv Client environment:java.version=1.8.0-ea
[junit4:junit4]   2> 218 T12 oaz.Environment.logEnv Client environment:java.vendor=Oracle Corporation
[junit4:junit4]   2> 218 T12 oaz.Environment.logEnv Client environment:java.home=/var/lib/jenkins/tools/java/64bit/jdk1.8.0-ea-b65/jre
[junit4:junit4]   2> 219 T12 oaz.Environment.logEnv Client environment:java.class.path=/mnt/ssd/jenkins/workspace/Lucene-Solr-trunk-Linux/solr/build/solr-core/classes/test:/mnt/ssd/jenkins/workspace/Lucene-Solr-trunk-Linux/solr/build/solr-test-framework/classes/java:/mnt/ssd/jenkins/workspace/Lucene-Solr-trunk-Linux/solr/build/solr-core/test-files:/mnt/ssd/jenkins/workspace/Lucene-Solr-trunk-Linux/lucene/build/test-framework/classes/java:/mnt/ssd/jenkins/workspace/Lucene-Solr-trunk-Linux/lucene/build/codecs/classes/java:/mnt/ssd/jenkins/workspace/Lucene-Solr-trunk-Linux/solr/build/solr-solrj/classes/java:/mnt/ssd/jenkins/workspace/Lucene-Solr-trunk-Linux/solr/build/solr-core/classes/java:/mnt/ssd/jenkins/workspace/Lucene-Solr-trunk-Linux/lucene/build/analysis/common/lucene-analyzers-common-5.0-SNAPSHOT.jar:/mnt/ssd/jenkins/workspace/Lucene-Solr-trunk-Linux/lucene/build/analysis/kuromoji/lucene-analyzers-kuromoji-5.0-SNAPSHOT.jar:/mnt/ssd/jenkins/workspace/Lucene-Solr-trunk-Linux/lucene/build/analysis/phonetic/lucene-analyzers-phonetic-5.0-SNAPSHOT.jar:/mnt/ssd/jenkins/workspace/Lucene-Solr-trunk-Linux/lucene/build/highlighter/lucene-highlighter-5.0-SNAPSHOT.jar:/mnt/ssd/jenkins/workspace/Lucene-Solr-trunk-Linux/lucene/build/memory/lucene-memory-5.0-SNAPSHOT.jar:/mnt/ssd/jenkins/workspace/Lucene-Solr-trunk-Linux/lucene/build/misc/lucene-misc-5.0-SNAPSHOT.jar:/mnt/ssd/jenkins/workspace/Lucene-Solr-trunk-Linux/lucene/build/spatial/lucene-spatial-5.0-SNAPSHOT.jar:/mnt/ssd/jenkins/workspace/Lucene-Solr-trunk-Linux/lucene/build/suggest/lucene-suggest-5.0-SNAPSHOT.jar:/mnt/ssd/jenkins/workspace/Lucene-Solr-trunk-Linux/lucene/build/grouping/lucene-grouping-5.0-SNAPSHOT.jar:/mnt/ssd/jenkins/workspace/Lucene-Solr-trunk-Linux/lucene/build/queries/lucene-queries-5.0-SNAPSHOT.jar:/mnt/ssd/jenkins/workspace/Lucene-Solr-trunk-Linux/lucene/build/queryparser/lucene-queryparser-5.0-SNAPSHOT.jar:/mnt/ssd/jenkins/workspace/Lucene-Solr-trunk-Linux/solr/core/lib/cglib-nodep-2.2.jar:/mnt/ssd/jenkins/workspace/Lucene-Solr-trunk-Linux/solr/core/lib/commons-cli-1.2.jar:/mnt/ssd/jenkins/workspace/Lucene-Solr-trunk-Linux/solr/core/lib/commons-codec-1.7.jar:/mnt/ssd/jenkins/workspace/Lucene-Solr-trunk-Linux/solr/core/lib/commons-fileupload-1.2.1.jar:/mnt/ssd/jenkins/workspace/Lucene-Solr-trunk-Linux/solr/core/lib/commons-lang-2.6.jar:/mnt/ssd/jenkins/workspace/Lucene-Solr-trunk-Linux/solr/core/lib/easymock-3.0.jar:/mnt/ssd/jenkins/workspace/Lucene-Solr-trunk-Linux/solr/core/lib/guava-13.0.1.jar:/mnt/ssd/jenkins/workspace/Lucene-Solr-trunk-Linux/solr/core/lib/javax.servlet-api-3.0.1.jar:/mnt/ssd/jenkins/workspace/Lucene-Solr-trunk-Linux/solr/core/lib/objenesis-1.2.jar:/mnt/ssd/jenkins/workspace/Lucene-Solr-trunk-Linux/solr/core/lib/spatial4j-0.3.jar:/mnt/ssd/jenkins/workspace/Lucene-Solr-trunk-Linux/solr/solrj/lib/commons-io-2.1.jar:/mnt/ssd/jenkins/workspace/Lucene-Solr-trunk-Linux/solr/solrj/lib/httpclient-4.2.3.jar:/mnt/ssd/jenkins/workspace/Lucene-Solr-trunk-Linux/solr/solrj/lib/httpcore-4.2.2.jar:/mnt/ssd/jenkins/workspace/Lucene-Solr-trunk-Linux/solr/solrj/lib/httpmime-4.2.3.jar:/mnt/ssd/jenkins/workspace/Lucene-Solr-trunk-Linux/solr/solrj/lib/jcl-over-slf4j-1.6.4.jar:/mnt/ssd/jenkins/workspace/Lucene-Solr-trunk-Linux/solr/solrj/lib/slf4j-api-1.6.4.jar:/mnt/ssd/jenkins/workspace/Lucene-Solr-trunk-Linux/solr/solrj/lib/slf4j-jdk14-1.6.4.jar:/mnt/ssd/jenkins/workspace/Lucene-Solr-trunk-Linux/solr/solrj/lib/wstx-asl-3.2.7.jar:/mnt/ssd/jenkins/workspace/Lucene-Solr-trunk-Linux/solr/solrj/lib/zookeeper-3.4.5.jar:/mnt/ssd/jenkins/workspace/Lucene-Solr-trunk-Linux/solr/example/lib/jetty-continuation-8.1.8.v20121106.jar:/mnt/ssd/jenkins/workspace/Lucene-Solr-trunk-Linux/solr/example/lib/jetty-deploy-8.1.8.v20121106.jar:/mnt/ssd/jenkins/workspace/Lucene-Solr-trunk-Linux/solr/example/lib/jetty-http-8.1.8.v20121106.jar:/mnt/ssd/jenkins/workspace/Lucene-Solr-trunk-Linux/solr/example/lib/jetty-io-8.1.8.v20121106.jar:/mnt/ssd/jenkins/workspace/Lucene-Solr-trunk-Linux/solr/example/lib/jetty-jmx-8.1.8.v20121106.jar:/mnt/ssd/jenkins/workspace/Lucene-Solr-trunk-Linux/solr/example/lib/jetty-security-8.1.8.v20121106.jar:/mnt/ssd/jenkins/workspace/Lucene-Solr-trunk-Linux/solr/example/lib/jetty-server-8.1.8.v20121106.jar:/mnt/ssd/jenkins/workspace/Lucene-Solr-trunk-Linux/solr/example/lib/jetty-servlet-8.1.8.v20121106.jar:/mnt/ssd/jenkins/workspace/Lucene-Solr-trunk-Linux/solr/example/lib/jetty-util-8.1.8.v20121106.jar:/mnt/ssd/jenkins/workspace/Lucene-Solr-trunk-Linux/solr/example/lib/jetty-webapp-8.1.8.v20121106.jar:/mnt/ssd/jenkins/workspace/Lucene-Solr-trunk-Linux/solr/example/lib/jetty-xml-8.1.8.v20121106.jar:/mnt/ssd/jenkins/workspace/Lucene-Solr-trunk-Linux/solr/example/lib/servlet-api-3.0.jar:/mnt/ssd/jenkins/workspace/Lucene-Solr-trunk-Linux/solr/example/example-DIH/solr/db/lib/derby-10.9.1.0.jar:/mnt/ssd/jenkins/workspace/Lucene-Solr-trunk-Linux/solr/example/example-DIH/solr/db/lib/hsqldb-1.8.0.10.jar:/mnt/ssd/jenkins/workspace/Lucene-Solr-trunk-Linux/lucene/build/core/classes/java:/mnt/ssd/jenkins/workspace/Lucene-Solr-trunk-Linux/lucene/test-framework/lib/junit-4.10.jar:/mnt/ssd/jenkins/workspace/Lucene-Solr-trunk-Linux/lucene/test-framework/lib/randomizedtesting-runner-2.0.8.jar:/var/lib/jenkins/tools/hudson.tasks.Ant_AntInstallation/ANT_1.8.2/lib/ant-launcher.jar:/var/lib/jenkins/.ant/lib/ivy-2.3.0.jar:/var/lib/jenkins/tools/hudson.tasks.Ant_AntInstallation/ANT_1.8.2/lib/ant-jai.jar:/var/lib/jenkins/tools/hudson.tasks.Ant_AntInstallation/ANT_1.8.2/lib/ant-swing.jar:/var/lib/jenkins/tools/hudson.tasks.Ant_AntInstallation/ANT_1.8.2/lib/ant-apache-oro.jar:/var/lib/jenkins/tools/hudson.tasks.Ant_AntInstallation/ANT_1.8.2/lib/ant-jmf.jar:/var/lib/jenkins/tools/hudson.tasks.Ant_AntInstallation/ANT_1.8.2/lib/ant-apache-xalan2.jar:/var/lib/jenkins/tools/hudson.tasks.Ant_AntInstallation/ANT_1.8.2/lib/ant-javamail.jar:/var/lib/jenkins/tools/hudson.tasks.Ant_AntInstallation/ANT_1.8.2/lib/ant-apache-resolver.jar:/var/lib/jenkins/tools/hudson.tasks.Ant_AntInstallation/ANT_1.8.2/lib/ant-testutil.jar:/var/lib/jenkins/tools/hudson.tasks.Ant_AntInstallation/ANT_1.8.2/lib/ant-commons-logging.jar:/var/lib/jenkins/tools/hudson.tasks.Ant_AntInstallation/ANT_1.8.2/lib/ant-apache-log4j.jar:/var/lib/jenkins/tools/hudson.tasks.Ant_AntInstallation/ANT_1.8.2/lib/ant-junit.jar:/var/lib/jenkins/tools/hudson.tasks.Ant_AntInstallation/ANT_1.8.2/lib/ant-jsch.jar:/var/lib/jenkins/tools/hudson.tasks.Ant_AntInstallation/ANT_1.8.2/lib/ant-commons-net.jar:/var/lib/jenkins/tools/hudson.tasks.Ant_AntInstallation/ANT_1.8.2/lib/ant-apache-bsf.jar:/var/lib/jenkins/tools/hudson.tasks.Ant_AntInstallation/ANT_1.8.2/lib/ant-jdepend.jar:/var/lib/jenkins/tools/hudson.tasks.Ant_AntInstallation/ANT_1.8.2/lib/ant-netrexx.jar:/var/lib/jenkins/tools/hudson.tasks.Ant_AntInstallation/ANT_1.8.2/lib/ant-apache-regexp.jar:/var/lib/jenkins/tools/hudson.tasks.Ant_AntInstallation/ANT_1.8.2/lib/ant-junit4.jar:/var/lib/jenkins/tools/hudson.tasks.Ant_AntInstallation/ANT_1.8.2/lib/ant.jar:/var/lib/jenkins/tools/hudson.tasks.Ant_AntInstallation/ANT_1.8.2/lib/ant-apache-bcel.jar:/var/lib/jenkins/tools/hudson.tasks.Ant_AntInstallation/ANT_1.8.2/lib/ant-antlr.jar:/var/lib/jenkins/tools/java/64bit/jdk1.8.0-ea-b65/lib/tools.jar:/var/lib/jenkins/.ivy2/cache/com.carrotsearch.randomizedtesting/junit4-ant/jars/junit4-ant-2.0.8.jar
[junit4:junit4]   2> 222 T12 oaz.Environment.logEnv Client environment:java.library.path=/var/lib/jenkins/tools/java/64bit/jdk1.8.0-ea-b65/jre/lib/amd64/server:/var/lib/jenkins/tools/java/64bit/jdk1.8.0-ea-b65/jre/lib/amd64:/var/lib/jenkins/tools/java/64bit/jdk1.8.0-ea-b65/jre/../lib/amd64:/usr/lib/jvm/j2sdk1.6-sun/jre/lib/amd64/server:/usr/lib/jvm/j2sdk1.6-sun/jre/lib/amd64:/usr/lib/jvm/j2sdk1.6-sun/jre/../lib/amd64:/usr/java/packages/lib/amd64:/usr/lib64:/lib64:/lib:/usr/lib
[junit4:junit4]   2> 222 T12 oaz.Environment.logEnv Client environment:java.io.tmpdir=.
[junit4:junit4]   2> 223 T12 oaz.Environment.logEnv Client environment:java.compiler=<NA>
[junit4:junit4]   2> 223 T12 oaz.Environment.logEnv Client environment:os.name=Linux
[junit4:junit4]   2> 224 T12 oaz.Environment.logEnv Client environment:os.arch=amd64
[junit4:junit4]   2> 225 T12 oaz.Environment.logEnv Client environment:os.version=3.2.0-38-generic
[junit4:junit4]   2> 225 T12 oaz.Environment.logEnv Client environment:user.name=jenkins
[junit4:junit4]   2> 226 T12 oaz.Environment.logEnv Client environment:user.home=/var/lib/jenkins
[junit4:junit4]   2> 227 T12 oaz.Environment.logEnv Client environment:user.dir=/mnt/ssd/jenkins/workspace/Lucene-Solr-trunk-Linux/solr/build/solr-core/test/J1
[junit4:junit4]   2> 229 T12 oaz.ZooKeeper.<init> Initiating client connection, connectString=127.0.0.1:44589 sessionTimeout=10000 watcher=org.apache.solr.common.cloud.ConnectionManager@17c34b3c
[junit4:junit4]   2> 302 T12 oascc.ConnectionManager.waitForConnected Waiting for client to connect to ZooKeeper
[junit4:junit4]   2> 306 T18 oaz.ClientCnxn$SendThread.logStartConnect Opening socket connection to server localhost.localdomain/127.0.0.1:44589. Will not attempt to authenticate using SASL (access denied ("javax.security.auth.AuthPermission" "getLoginConfiguration"))
[junit4:junit4]   2> 310 T18 oaz.ClientCnxn$SendThread.primeConnection Socket connection established to localhost.localdomain/127.0.0.1:44589, initiating session
[junit4:junit4]   2> 1320 T14 oazs.NIOServerCnxnFactory.run Accepted socket connection from /127.0.0.1:54347
[junit4:junit4]   2> 1330 T14 oazs.ZooKeeperServer.processConnectRequest Client attempting to establish new session at /127.0.0.1:54347
[junit4:junit4]   2> 1335 T16 oazsp.FileTxnLog.append Creating new log file: log.1
[junit4:junit4]   2> 1350 T16 oazs.ZooKeeperServer.finishSessionInit Established session 0x13d0832f20a0000 with negotiated timeout 10000 for client /127.0.0.1:54347
[junit4:junit4]   2> 1351 T18 oaz.ClientCnxn$SendThread.onConnected Session establishment complete on server localhost.localdomain/127.0.0.1:44589, sessionid = 0x13d0832f20a0000, negotiated timeout = 10000
[junit4:junit4]   2> 1355 T19 oascc.ConnectionManager.process Watcher org.apache.solr.common.cloud.ConnectionManager@17c34b3c name:ZooKeeperConnection Watcher:127.0.0.1:44589 got event WatchedEvent state:SyncConnected type:None path:null path:null type:None
[junit4:junit4]   2> 1356 T12 oascc.ConnectionManager.waitForConnected Client is connected to ZooKeeper
[junit4:junit4]   2> 1357 T12 oascc.SolrZkClient.makePath makePath: /solr
[junit4:junit4]   2> 1380 T17 oazs.PrepRequestProcessor.pRequest2Txn Processed session termination for sessionid: 0x13d0832f20a0000
[junit4:junit4]   2> 1381 T19 oaz.ClientCnxn$EventThread.run EventThread shut down
[junit4:junit4]   2> 1381 T12 oaz.ZooKeeper.close Session: 0x13d0832f20a0000 closed
[junit4:junit4]   2> 1382 T14 oazs.NIOServerCnxn.closeSock Closed socket connection for client /127.0.0.1:54347 which had sessionid 0x13d0832f20a0000
[junit4:junit4]   2> 1382 T12 oaz.ZooKeeper.<init> Initiating client connection, connectString=127.0.0.1:44589/solr sessionTimeout=10000 watcher=org.apache.solr.common.cloud.ConnectionManager@f5ba5a5
[junit4:junit4]   2> 1384 T12 oascc.ConnectionManager.waitForConnected Waiting for client to connect to ZooKeeper
[junit4:junit4]   2> 1384 T20 oaz.ClientCnxn$SendThread.logStartConnect Opening socket connection to server localhost.localdomain/127.0.0.1:44589. Will not attempt to authenticate using SASL (access denied ("javax.security.auth.AuthPermission" "getLoginConfiguration"))
[junit4:junit4]   2> 1385 T20 oaz.ClientCnxn$SendThread.primeConnection Socket connection established to localhost.localdomain/127.0.0.1:44589, initiating session
[junit4:junit4]   2> 1386 T14 oazs.NIOServerCnxnFactory.run Accepted socket connection from /127.0.0.1:54348
[junit4:junit4]   2> 1386 T14 oazs.ZooKeeperServer.processConnectRequest Client attempting to establish new session at /127.0.0.1:54348
[junit4:junit4]   2> 1388 T16 oazs.ZooKeeperServer.finishSessionInit Established session 0x13d0832f20a0001 with negotiated timeout 10000 for client /127.0.0.1:54348
[junit4:junit4]   2> 1388 T20 oaz.ClientCnxn$SendThread.onConnected Session establishment complete on server localhost.localdomain/127.0.0.1:44589, sessionid = 0x13d0832f20a0001, negotiated timeout = 10000
[junit4:junit4]   2> 1389 T21 oascc.ConnectionManager.process Watcher org.apache.solr.common.cloud.ConnectionManager@f5ba5a5 name:ZooKeeperConnection Watcher:127.0.0.1:44589/solr got event WatchedEvent state:SyncConnected type:None path:null path:null type:None
[junit4:junit4]   2> 1389 T12 oascc.ConnectionManager.waitForConnected Client is connected to ZooKeeper
[junit4:junit4]   2> 1397 T12 oascc.SolrZkClient.makePath makePath: /collections/collection1
[junit4:junit4]   2> 1411 T12 oascc.SolrZkClient.makePath makePath: /collections/collection1/shards
[junit4:junit4]   2> 1416 T12 oascc.SolrZkClient.makePath makePath: /collections/control_collection
[junit4:junit4]   2> 1426 T12 oascc.SolrZkClient.makePath makePath: /collections/control_collection/shards
[junit4:junit4]   2> 1431 T12 oasc.AbstractZkTestCase.putConfig put /mnt/ssd/jenkins/workspace/Lucene-Solr-trunk-Linux/solr/build/solr-core/test-files/solr/collection1/conf/solrconfig-tlog.xml to /configs/conf1/solrconfig.xml
[junit4:junit4]   2> 1444 T12 oascc.SolrZkClient.makePath makePath: /configs/conf1/solrconfig.xml
[junit4:junit4]   2> 1451 T12 oasc.AbstractZkTestCase.putConfig put /mnt/ssd/jenkins/workspace/Lucene-Solr-trunk-Linux/solr/build/solr-core/test-files/solr/collection1/conf/schema.xml to /configs/conf1/schema.xml
[junit4:junit4]   2> 1454 T12 oascc.SolrZkClient.makePath makePath: /configs/conf1/schema.xml
[junit4:junit4]   2> 1463 T12 oasc.AbstractZkTestCase.putConfig put /mnt/ssd/jenkins/workspace/Lucene-Solr-trunk-Linux/solr/build/solr-core/test-files/solr/collection1/conf/stopwords.txt to /configs/conf1/stopwords.txt
[junit4:junit4]   2> 1464 T12 oascc.SolrZkClient.makePath makePath: /configs/conf1/stopwords.txt
[junit4:junit4]   2> 1471 T12 oasc.AbstractZkTestCase.putConfig put /mnt/ssd/jenkins/workspace/Lucene-Solr-trunk-Linux/solr/build/solr-core/test-files/solr/collection1/conf/protwords.txt to /configs/conf1/protwords.txt
[junit4:junit4]   2> 1472 T12 oascc.SolrZkClient.makePath makePath: /configs/conf1/protwords.txt
[junit4:junit4]   2> 1476 T12 oasc.AbstractZkTestCase.putConfig put /mnt/ssd/jenkins/workspace/Lucene-Solr-trunk-Linux/solr/build/solr-core/test-files/solr/collection1/conf/currency.xml to /configs/conf1/currency.xml
[junit4:junit4]   2> 1477 T12 oascc.SolrZkClient.makePath makePath: /configs/conf1/currency.xml
[junit4:junit4]   2> 1494 T12 oasc.AbstractZkTestCase.putConfig put /mnt/ssd/jenkins/workspace/Lucene-Solr-trunk-Linux/solr/build/solr-core/test-files/solr/collection1/conf/open-exchange-rates.json to /configs/conf1/open-exchange-rates.json
[junit4:junit4]   2> 1495 T12 oascc.SolrZkClient.makePath makePath: /configs/conf1/open-exchange-rates.json
[junit4:junit4]   2> 1500 T12 oasc.AbstractZkTestCase.putConfig put /mnt/ssd/jenkins/workspace/Lucene-Solr-trunk-Linux/solr/build/solr-core/test-files/solr/collection1/conf/mapping-ISOLatin1Accent.txt to /configs/conf1/mapping-ISOLatin1Accent.txt
[junit4:junit4]   2> 1502 T12 oascc.SolrZkClient.makePath makePath: /configs/conf1/mapping-ISOLatin1Accent.txt
[junit4:junit4]   2> 1515 T12 oasc.AbstractZkTestCase.putConfig put /mnt/ssd/jenkins/workspace/Lucene-Solr-trunk-Linux/solr/build/solr-core/test-files/solr/collection1/conf/old_synonyms.txt to /configs/conf1/old_synonyms.txt
[junit4:junit4]   2> 1516 T12 oascc.SolrZkClient.makePath makePath: /configs/conf1/old_synonyms.txt
[junit4:junit4]   2> 1534 T12 oasc.AbstractZkTestCase.putConfig put /mnt/ssd/jenkins/workspace/Lucene-Solr-trunk-Linux/solr/build/solr-core/test-files/solr/collection1/conf/synonyms.txt to /configs/conf1/synonyms.txt
[junit4:junit4]   2> 1535 T12 oascc.SolrZkClient.makePath makePath: /configs/conf1/synonyms.txt
[junit4:junit4]   2> 1540 T17 oazs.PrepRequestProcessor.pRequest2Txn Processed session termination for sessionid: 0x13d0832f20a0001
[junit4:junit4]   2> 1541 T14 oazs.NIOServerCnxn.closeSock Closed socket connection for client /127.0.0.1:54348 which had sessionid 0x13d0832f20a0001
[junit4:junit4]   2> 1541 T21 oaz.ClientCnxn$EventThread.run EventThread shut down
[junit4:junit4]   2> 1541 T12 oaz.ZooKeeper.close Session: 0x13d0832f20a0001 closed
[junit4:junit4]   2> 1758 T12 oejs.Server.doStart jetty-8.1.8.v20121106
[junit4:junit4]   2> 1870 T12 oejs.AbstractConnector.doStart Started SelectChannelConnector@127.0.0.1:52315
[junit4:junit4]   2> 1889 T12 oass.SolrDispatchFilter.init SolrDispatchFilter.init()
[junit4:junit4]   2> 1935 T12 oasc.SolrResourceLoader.locateSolrHome JNDI not configured for solr (NoInitialContextEx)
[junit4:junit4]   2> 1936 T12 oasc.SolrResourceLoader.locateSolrHome using system property solr.solr.home: /mnt/ssd/jenkins/workspace/Lucene-Solr-trunk-Linux/solr/build/solr-core/test/J1/./org.apache.solr.cloud.UnloadDistributedZkTest-controljetty-1361642190642
[junit4:junit4]   2> 1949 T12 oasc.CoreContainer$Initializer.initialize looking for solr.xml: /mnt/ssd/jenkins/workspace/Lucene-Solr-trunk-Linux/solr/build/solr-core/test/J1/./org.apache.solr.cloud.UnloadDistributedZkTest-controljetty-1361642190642/solr.xml
[junit4:junit4]   2> 1952 T12 oasc.CoreContainer.<init> New CoreContainer 778294389
[junit4:junit4]   2> 1953 T12 oasc.CoreContainer.load Loading CoreContainer using Solr Home: '/mnt/ssd/jenkins/workspace/Lucene-Solr-trunk-Linux/solr/build/solr-core/test/J1/./org.apache.solr.cloud.UnloadDistributedZkTest-controljetty-1361642190642/'
[junit4:junit4]   2> 1954 T12 oasc.SolrResourceLoader.<init> new SolrResourceLoader for directory: '/mnt/ssd/jenkins/workspace/Lucene-Solr-trunk-Linux/solr/build/solr-core/test/J1/./org.apache.solr.cloud.UnloadDistributedZkTest-controljetty-1361642190642/'
[junit4:junit4]   2> 2174 T12 oashc.HttpShardHandlerFactory.getParameter Setting socketTimeout to: 120000
[junit4:junit4]   2> 2174 T12 oashc.HttpShardHandlerFactory.getParameter Setting urlScheme to: http://
[junit4:junit4]   2> 2175 T12 oashc.HttpShardHandlerFactory.getParameter Setting connTimeout to: 15000
[junit4:junit4]   2> 2175 T12 oashc.HttpShardHandlerFactory.getParameter Setting maxConnectionsPerHost to: 20
[junit4:junit4]   2> 2176 T12 oashc.HttpShardHandlerFactory.getParameter Setting corePoolSize to: 0
[junit4:junit4]   2> 2176 T12 oashc.HttpShardHandlerFactory.getParameter Setting maximumPoolSize to: 2147483647
[junit4:junit4]   2> 2176 T12 oashc.HttpShardHandlerFactory.getParameter Setting maxThreadIdleTime to: 5
[junit4:junit4]   2> 2177 T12 oashc.HttpShardHandlerFactory.getParameter Setting sizeOfQueue to: -1
[junit4:junit4]   2> 2177 T12 oashc.HttpShardHandlerFactory.getParameter Setting fairnessPolicy to: false
[junit4:junit4]   2> 2190 T12 oascsi.HttpClientUtil.createClient Creating new http client, config:maxConnectionsPerHost=20&maxConnections=10000&socketTimeout=120000&connTimeout=15000&retry=false
[junit4:junit4]   2> 2660 T12 oasc.CoreContainer.load Registering Log Listener
[junit4:junit4]   2> 2711 T12 oasc.CoreContainer.initZooKeeper Zookeeper client=127.0.0.1:44589/solr
[junit4:junit4]   2> 2723 T12 oasc.ZkController.checkChrootPath zkHost includes chroot
[junit4:junit4]   2> 2723 T12 oaz.ZooKeeper.<init> Initiating client connection, connectString=127.0.0.1:44589 sessionTimeout=60000 watcher=org.apache.solr.common.cloud.ConnectionManager@5740ad63
[junit4:junit4]   2> 2726 T12 oascc.ConnectionManager.waitForConnected Waiting for client to connect to ZooKeeper
[junit4:junit4]   2> 2726 T32 oaz.ClientCnxn$SendThread.logStartConnect Opening socket connection to server localhost.localdomain/127.0.0.1:44589. Will not attempt to authenticate using SASL (access denied ("javax.security.auth.AuthPermission" "getLoginConfiguration"))
[junit4:junit4]   2> 2727 T32 oaz.ClientCnxn$SendThread.primeConnection Socket connection established to localhost.localdomain/127.0.0.1:44589, initiating session
[junit4:junit4]   2> 2727 T14 oazs.NIOServerCnxnFactory.run Accepted socket connection from /127.0.0.1:54349
[junit4:junit4]   2> 2728 T14 oazs.ZooKeeperServer.processConnectRequest Client attempting to establish new session at /127.0.0.1:54349
[junit4:junit4]   2> 2730 T16 oazs.ZooKeeperServer.finishSessionInit Established session 0x13d0832f20a0002 with negotiated timeout 20000 for client /127.0.0.1:54349
[junit4:junit4]   2> 2730 T32 oaz.ClientCnxn$SendThread.onConnected Session establishment complete on server localhost.localdomain/127.0.0.1:44589, sessionid = 0x13d0832f20a0002, negotiated timeout = 20000
[junit4:junit4]   2> 2733 T33 oascc.ConnectionManager.process Watcher org.apache.solr.common.cloud.ConnectionManager@5740ad63 name:ZooKeeperConnection Watcher:127.0.0.1:44589 got event WatchedEvent state:SyncConnected type:None path:null path:null type:None
[junit4:junit4]   2> 2734 T12 oascc.ConnectionManager.waitForConnected Client is connected to ZooKeeper
[junit4:junit4]   2> 2737 T17 oazs.PrepRequestProcessor.pRequest2Txn Processed session termination for sessionid: 0x13d0832f20a0002
[junit4:junit4]   2> 2738 T14 oazs.NIOServerCnxn.closeSock Closed socket connection for client /127.0.0.1:54349 which had sessionid 0x13d0832f20a0002
[junit4:junit4]   2> 2739 T12 oaz.ZooKeeper.close Session: 0x13d0832f20a0002 closed
[junit4:junit4]   2> 2742 T12 oascsi.HttpClientUtil.createClient Creating new http client, config:maxConnections=500&maxConnectionsPerHost=16&socketTimeout=120000&connTimeout=15000
[junit4:junit4]   2> 2747 T33 oaz.ClientCnxn$EventThread.run EventThread shut down
[junit4:junit4]   2> 2754 T12 oaz.ZooKeeper.<init> Initiating client connection, connectString=127.0.0.1:44589/solr sessionTimeout=30000 watcher=org.apache.solr.common.cloud.ConnectionManager@459c8c0a
[junit4:junit4]   2> 2757 T12 oascc.ConnectionManager.waitForConnected Waiting for client to connect to ZooKeeper
[junit4:junit4]   2> 2757 T34 oaz.ClientCnxn$SendThread.logStartConnect Opening socket connection to server localhost.localdomain/127.0.0.1:44589. Will not attempt to authenticate using SASL (access denied ("javax.security.auth.AuthPermission" "getLoginConfiguration"))
[junit4:junit4]   2> 2758 T34 oaz.ClientCnxn$SendThread.primeConnection Socket connection established to localhost.localdomain/127.0.0.1:44589, initiating session
[junit4:junit4]   2> 2758 T14 oazs.NIOServerCnxnFactory.run Accepted socket connection from /127.0.0.1:54350
[junit4:junit4]   2> 2759 T14 oazs.ZooKeeperServer.processConnectRequest Client attempting to establish new session at /127.0.0.1:54350
[junit4:junit4]   2> 2761 T16 oazs.ZooKeeperServer.finishSessionInit Established session 0x13d0832f20a0003 with negotiated timeout 20000 for client /127.0.0.1:54350
[junit4:junit4]   2> 2761 T34 oaz.ClientCnxn$SendThread.onConnected Session establishment complete on server localhost.localdomain/127.0.0.1:44589, sessionid = 0x13d0832f20a0003, negotiated timeout = 20000
[junit4:junit4]   2> 2761 T35 oascc.ConnectionManager.process Watcher org.apache.solr.common.cloud.ConnectionManager@459c8c0a name:ZooKeeperConnection Watcher:127.0.0.1:44589/solr got event WatchedEvent state:SyncConnected type:None path:null path:null type:None
[junit4:junit4]   2> 2762 T12 oascc.ConnectionManager.waitForConnected Client is connected to ZooKeeper
[junit4:junit4]   2> 2771 T17 oazs.PrepRequestProcessor.pRequest Got user-level KeeperException when processing sessionid:0x13d0832f20a0003 type:create cxid:0x2 zxid:0x1a txntype:-1 reqpath:n/a Error Path:/solr/overseer Error:KeeperErrorCode = NodeExists for /solr/overseer
[junit4:junit4]   2> 2777 T12 oascc.SolrZkClient.makePath makePath: /live_nodes
[junit4:junit4]   2> 2781 T12 oasc.ZkController.createEphemeralLiveNode Register node as live in ZooKeeper:/live_nodes/127.0.0.1:52315_
[junit4:junit4]   2> 2784 T17 oazs.PrepRequestProcessor.pRequest Got user-level KeeperException when processing sessionid:0x13d0832f20a0003 type:delete cxid:0x8 zxid:0x1c txntype:-1 reqpath:n/a Error Path:/solr/live_nodes/127.0.0.1:52315_ Error:KeeperErrorCode = NoNode for /solr/live_nodes/127.0.0.1:52315_
[junit4:junit4]   2> 2786 T12 oascc.SolrZkClient.makePath makePath: /live_nodes/127.0.0.1:52315_
[junit4:junit4]   2> 2796 T12 oascc.SolrZkClient.makePath makePath: /overseer_elect/election
[junit4:junit4]   2> 2807 T17 oazs.PrepRequestProcessor.pRequest Got user-level KeeperException when processing sessionid:0x13d0832f20a0003 type:delete cxid:0x16 zxid:0x21 txntype:-1 reqpath:n/a Error Path:/solr/overseer_elect/leader Error:KeeperErrorCode = NoNode for /solr/overseer_elect/leader
[junit4:junit4]   2> 2808 T12 oascc.SolrZkClient.makePath makePath: /overseer_elect/leader
[junit4:junit4]   2> 2811 T12 oasc.Overseer.start Overseer (id=89236582519406595-127.0.0.1:52315_-n_0000000000) starting
[junit4:junit4]   2> 2812 T17 oazs.PrepRequestProcessor.pRequest Got user-level KeeperException when processing sessionid:0x13d0832f20a0003 type:create cxid:0x1b zxid:0x23 txntype:-1 reqpath:n/a Error Path:/solr/overseer Error:KeeperErrorCode = NodeExists for /solr/overseer
[junit4:junit4]   2> 2817 T17 oazs.PrepRequestProcessor.pRequest Got user-level KeeperException when processing sessionid:0x13d0832f20a0003 type:create cxid:0x1c zxid:0x24 txntype:-1 reqpath:n/a Error Path:/solr/overseer Error:KeeperErrorCode = NodeExists for /solr/overseer
[junit4:junit4]   2> 2818 T17 oazs.PrepRequestProcessor.pRequest Got user-level KeeperException when processing sessionid:0x13d0832f20a0003 type:create cxid:0x1d zxid:0x25 txntype:-1 reqpath:n/a Error Path:/solr/overseer Error:KeeperErrorCode = NodeExists for /solr/overseer
[junit4:junit4]   2> 2824 T17 oazs.PrepRequestProcessor.pRequest Got user-level KeeperException when processing sessionid:0x13d0832f20a0003 type:create cxid:0x1e zxid:0x26 txntype:-1 reqpath:n/a Error Path:/solr/overseer Error:KeeperErrorCode = NodeExists for /solr/overseer
[junit4:junit4]   2> 2826 T37 oasc.OverseerCollectionProcessor.run Process current queue of collection creations
[junit4:junit4]   2> 2826 T12 oascc.SolrZkClient.makePath makePath: /clusterstate.json
[junit4:junit4]   2> 2829 T12 oascc.ZkStateReader.createClusterStateWatchersAndUpdate Updating cluster state from ZooKeeper... 
[junit4:junit4]   2> 2842 T36 oasc.Overseer$ClusterStateUpdater.run Starting to work on the main queue
[junit4:junit4]   2> 2869 T38 oasc.CoreContainer.create Creating SolrCore 'collection1' using instanceDir: /mnt/ssd/jenkins/workspace/Lucene-Solr-trunk-Linux/solr/build/solr-core/test/J1/./org.apache.solr.cloud.UnloadDistributedZkTest-controljetty-1361642190642/collection1
[junit4:junit4]   2> 2869 T38 oasc.ZkController.createCollectionZkNode Check for collection zkNode:control_collection
[junit4:junit4]   2> 2870 T38 oasc.ZkController.createCollectionZkNode Collection zkNode exists
[junit4:junit4]   2> 2870 T38 oasc.ZkController.readConfigName Load collection config from:/collections/control_collection
[junit4:junit4]   2> 2872 T38 oasc.SolrResourceLoader.<init> new SolrResourceLoader for directory: '/mnt/ssd/jenkins/workspace/Lucene-Solr-trunk-Linux/solr/build/solr-core/test/J1/./org.apache.solr.cloud.UnloadDistributedZkTest-controljetty-1361642190642/collection1/'
[junit4:junit4]   2> 2873 T38 oasc.SolrResourceLoader.replaceClassLoader Adding 'file:/mnt/ssd/jenkins/workspace/Lucene-Solr-trunk-Linux/solr/build/solr-core/test/J1/org.apache.solr.cloud.UnloadDistributedZkTest-controljetty-1361642190642/collection1/lib/README' to classloader
[junit4:junit4]   2> 2873 T38 oasc.SolrResourceLoader.replaceClassLoader Adding 'file:/mnt/ssd/jenkins/workspace/Lucene-Solr-trunk-Linux/solr/build/solr-core/test/J1/org.apache.solr.cloud.UnloadDistributedZkTest-controljetty-1361642190642/collection1/lib/classes/' to classloader
[junit4:junit4]   2> 2944 T38 oasc.SolrConfig.<init> Using Lucene MatchVersion: LUCENE_50
[junit4:junit4]   2> 3080 T38 oasc.SolrConfig.<init> Loaded SolrConfig: solrconfig.xml
[junit4:junit4]   2> 3094 T38 oass.IndexSchema.readSchema Reading Solr Schema
[junit4:junit4]   2> 3155 T38 oass.IndexSchema.readSchema Schema name=test
[junit4:junit4]   2> 4093 T38 oass.OpenExchangeRatesOrgProvider.init Initialized with rates=open-exchange-rates.json, refreshInterval=1440.
[junit4:junit4]   2> 4104 T38 oass.IndexSchema.readSchema default search field in schema is text
[junit4:junit4]   2> 4107 T38 oass.IndexSchema.readSchema unique key field: id
[junit4:junit4]   2> 4265 T38 oass.FileExchangeRateProvider.reload Reloading exchange rates from file currency.xml
[junit4:junit4]   2> 4271 T38 oass.FileExchangeRateProvider.reload Reloading exchange rates from file currency.xml
[junit4:junit4]   2> 4276 T38 oass.OpenExchangeRatesOrgProvider.reload Reloading exchange rates from open-exchange-rates.json
[junit4:junit4]   2> 4281 T38 oass.OpenExchangeRatesOrgProvider.reload Reloading exchange rates from open-exchange-rates.json
[junit4:junit4]   2> 4307 T38 oasc.SolrCore.<init> [collection1] Opening new SolrCore at /mnt/ssd/jenkins/workspace/Lucene-Solr-trunk-Linux/solr/build/solr-core/test/J1/./org.apache.solr.cloud.UnloadDistributedZkTest-controljetty-1361642190642/collection1/, dataDir=./org.apache.solr.cloud.UnloadDistributedZkTest-1361642189188/control/data/
[junit4:junit4]   2> 4310 T38 oasc.JmxMonitoredMap.<init> JMX monitoring is enabled. Adding Solr mbeans to JMX Server: com.sun.jmx.mbeanserver.JmxMBeanServer@4ba7cde3
[junit4:junit4]   2> 4369 T38 oasc.SolrCore.initDirectoryFactory org.apache.solr.core.MockDirectoryFactory
[junit4:junit4]   2> 4400 T38 oasc.CachingDirectoryFactory.get return new directory for /mnt/ssd/jenkins/workspace/Lucene-Solr-trunk-Linux/solr/build/solr-core/test/J1/./org.apache.solr.cloud.UnloadDistributedZkTest-1361642189188/control/data forceNew:false
[junit4:junit4]   2> 4400 T38 oasc.CachingDirectoryFactory.close Releasing directory:/mnt/ssd/jenkins/workspace/Lucene-Solr-trunk-Linux/solr/build/solr-core/test/J1/./org.apache.solr.cloud.UnloadDistributedZkTest-1361642189188/control/data
[junit4:junit4]   2> 4400 T38 oasc.SolrCore.getNewIndexDir New index directory detected: old=null new=./org.apache.solr.cloud.UnloadDistributedZkTest-1361642189188/control/data/index/
[junit4:junit4]   2> 4401 T38 oasc.SolrCore.initIndex WARNING [collection1] Solr index directory './org.apache.solr.cloud.UnloadDistributedZkTest-1361642189188/control/data/index' doesn't exist. Creating new index...
[junit4:junit4]   2> 4410 T38 oasc.CachingDirectoryFactory.get return new directory for /mnt/ssd/jenkins/workspace/Lucene-Solr-trunk-Linux/solr/build/solr-core/test/J1/./org.apache.solr.cloud.UnloadDistributedZkTest-1361642189188/control/data/index forceNew:false
[junit4:junit4]   2> 4508 T38 oasc.SolrDeletionPolicy.onCommit SolrDeletionPolicy.onCommit: commits:num=1
[junit4:junit4]   2> 		commit{dir=MockDirWrapper(org.apache.lucene.store.RAMDirectory@23bda414 lockFactory=org.apache.lucene.store.NativeFSLockFactory@a1f84da),segFN=segments_1,generation=1,filenames=[segments_1]
[junit4:junit4]   2> 4508 T38 oasc.SolrDeletionPolicy.updateCommits newest commit = 1[segments_1]
[junit4:junit4]   2> 4509 T38 oasc.CachingDirectoryFactory.close Releasing directory:/mnt/ssd/jenkins/workspace/Lucene-Solr-trunk-Linux/solr/build/solr-core/test/J1/./org.apache.solr.cloud.UnloadDistributedZkTest-1361642189188/control/data/index
[junit4:junit4]   2> 4701 T38 oasup.UpdateRequestProcessorChain.init inserting DistributedUpdateProcessorFactory into updateRequestProcessorChain "dedupe"
[junit4:junit4]   2> 4702 T38 oasup.UpdateRequestProcessorChain.init inserting DistributedUpdateProcessorFactory into updateRequestProcessorChain "stored_sig"
[junit4:junit4]   2> 4722 T38 oasup.UpdateRequestProcessorChain.init inserting DistributedUpdateProcessorFactory into updateRequestProcessorChain "distrib-dup-test-chain-implicit"
[junit4:junit4]   2> 4733 T38 oasc.RequestHandlers.initHandlersFromConfig created standard: solr.StandardRequestHandler
[junit4:junit4]   2> 4738 T38 oasc.RequestHandlers.initHandlersFromConfig created /get: solr.RealTimeGetHandler
[junit4:junit4]   2> 4738 T38 oasc.RequestHandlers.initHandlersFromConfig adding lazy requestHandler: solr.ReplicationHandler
[junit4:junit4]   2> 4739 T38 oasc.RequestHandlers.initHandlersFromConfig created /replication: solr.ReplicationHandler
[junit4:junit4]   2> 4746 T38 oasc.RequestHandlers.initHandlersFromConfig created /update: solr.UpdateRequestHandler
[junit4:junit4]   2> 4747 T38 oasc.RequestHandlers.initHandlersFromConfig created /admin/: org.apache.solr.handler.admin.AdminHandlers
[junit4:junit4]   2> 4814 T38 oashl.XMLLoader.init xsltCacheLifetimeSeconds=60
[junit4:junit4]   2> 4820 T38 oasc.CachingDirectoryFactory.close Releasing directory:/mnt/ssd/jenkins/workspace/Lucene-Solr-trunk-Linux/solr/build/solr-core/test/J1/./org.apache.solr.cloud.UnloadDistributedZkTest-1361642189188/control/data
[junit4:junit4]   2> 4834 T38 oass.SolrIndexSearcher.<init> Opening Searcher@7e9237f3 main
[junit4:junit4]   2> 4851 T38 oasu.UpdateHandler.clearLog Clearing tlog files, tlogDir=./org.apache.solr.cloud.UnloadDistributedZkTest-1361642189188/control/data/tlog
[junit4:junit4]   2> 4857 T38 oasu.CommitTracker.<init> Hard AutoCommit: disabled
[junit4:junit4]   2> 4857 T38 oasu.CommitTracker.<init> Soft AutoCommit: disabled
[junit4:junit4]   2> 4895 T38 oasc.CachingDirectoryFactory.close Releasing directory:/mnt/ssd/jenkins/workspace/Lucene-Solr-trunk-Linux/solr/build/solr-core/test/J1/./org.apache.solr.cloud.UnloadDistributedZkTest-1361642189188/control/data
[junit4:junit4]   2> 4897 T39 oasc.SolrCore.registerSearcher [collection1] Registered new searcher Searcher@7e9237f3 main{StandardDirectoryReader(segments_1:1)}
[junit4:junit4]   2> 4899 T38 oasc.ZkController.publish publishing core=collection1 state=down
[junit4:junit4]   2> 4899 T38 oasc.ZkController.publish numShards not found on descriptor - reading it from system property
[junit4:junit4]   2> 4900 T17 oazs.PrepRequestProcessor.pRequest Got user-level KeeperException when processing sessionid:0x13d0832f20a0003 type:create cxid:0x53 zxid:0x29 txntype:-1 reqpath:n/a Error Path:/solr/overseer/queue Error:KeeperErrorCode = NoNode for /solr/overseer/queue
[junit4:junit4]   2> 5850 T36 oascc.ZkStateReader.updateClusterState Updating cloud state from ZooKeeper... 
[junit4:junit4]   2> 5852 T36 oasc.Overseer$ClusterStateUpdater.updateState Update state numShards=1 message={
[junit4:junit4]   2> 	  "numShards":"1",
[junit4:junit4]   2> 	  "core":"collection1",
[junit4:junit4]   2> 	  "collection":"control_collection",
[junit4:junit4]   2> 	  "operation":"state",
[junit4:junit4]   2> 	  "shard":null,
[junit4:junit4]   2> 	  "node_name":"127.0.0.1:52315_",
[junit4:junit4]   2> 	  "roles":null,
[junit4:junit4]   2> 	  "base_url":"http://127.0.0.1:52315",
[junit4:junit4]   2> 	  "state":"down"}
[junit4:junit4]   2> 5852 T36 oasc.Overseer$ClusterStateUpdater.createCollection Create collection control_collection with numShards 1
[junit4:junit4]   2> 5860 T36 oasc.Overseer$ClusterStateUpdater.updateState Assigning new node to shard shard=shard1
[junit4:junit4]   2> 5861 T17 oazs.PrepRequestProcessor.pRequest Got user-level KeeperException when processing sessionid:0x13d0832f20a0003 type:create cxid:0x5b zxid:0x2c txntype:-1 reqpath:n/a Error Path:/solr/overseer/queue-work Error:KeeperErrorCode = NoNode for /solr/overseer/queue-work
[junit4:junit4]   2> 5872 T35 oascc.ZkStateReader$2.process A cluster state change: WatchedEvent state:SyncConnected type:NodeDataChanged path:/clusterstate.json, has occurred - updating... (live nodes size: 1)
[junit4:junit4]   2> 5903 T38 oasc.CoreContainer.registerCore registering core: collection1
[junit4:junit4]   2> 5903 T38 oasc.ZkController.register Register replica - core:collection1 address:http://127.0.0.1:52315 collection:control_collection shard:shard1
[junit4:junit4]   2> 5907 T38 oascsi.HttpClientUtil.createClient Creating new http client, config:maxConnections=10000&maxConnectionsPerHost=20&connTimeout=30000&socketTimeout=30000&retry=false
[junit4:junit4]   2> 5912 T38 oascc.SolrZkClient.makePath makePath: /collections/control_collection/leader_elect/shard1/election
[junit4:junit4]   2> 5919 T17 oazs.PrepRequestProcessor.pRequest Got user-level KeeperException when processing sessionid:0x13d0832f20a0003 type:delete cxid:0x75 zxid:0x36 txntype:-1 reqpath:n/a Error Path:/solr/collections/control_collection/leaders Error:KeeperErrorCode = NoNode for /solr/collections/control_collection/leaders
[junit4:junit4]   2> 5920 T38 oasc.ShardLeaderElectionContext.runLeaderProcess Running the leader process.
[junit4:junit4]   2> 5920 T17 oazs.PrepRequestProcessor.pRequest Got user-level KeeperException when processing sessionid:0x13d0832f20a0003 type:create cxid:0x76 zxid:0x37 txntype:-1 reqpath:n/a Error Path:/solr/overseer Error:KeeperErrorCode = NodeExists for /solr/overseer
[junit4:junit4]   2> 5922 T38 oasc.ShardLeaderElectionContext.waitForReplicasToComeUp Enough replicas found to continue.
[junit4:junit4]   2> 5923 T38 oasc.ShardLeaderElectionContext.runLeaderProcess I may be the new leader - try and sync
[junit4:junit4]   2> 5923 T38 oasc.SyncStrategy.sync Sync replicas to http://127.0.0.1:52315/collection1/
[junit4:junit4]   2> 5923 T38 oasc.SyncStrategy.syncReplicas Sync Success - now sync replicas to me
[junit4:junit4]   2> 5924 T38 oasc.SyncStrategy.syncToMe http://127.0.0.1:52315/collection1/ has no replicas
[junit4:junit4]   2> 5924 T38 oasc.ShardLeaderElectionContext.runLeaderProcess I am the new leader: http://127.0.0.1:52315/collection1/
[junit4:junit4]   2> 5924 T38 oascc.SolrZkClient.makePath makePath: /collections/control_collection/leaders/shard1
[junit4:junit4]   2> 5928 T17 oazs.PrepRequestProcessor.pRequest Got user-level KeeperException when processing sessionid:0x13d0832f20a0003 type:create cxid:0x80 zxid:0x3b txntype:-1 reqpath:n/a Error Path:/solr/overseer Error:KeeperErrorCode = NodeExists for /solr/overseer
[junit4:junit4]   2> 7377 T36 oascc.ZkStateReader.updateClusterState Updating cloud state from ZooKeeper... 
[junit4:junit4]   2> 7385 T35 oascc.ZkStateReader$2.process A cluster state change: WatchedEvent state:SyncConnected type:NodeDataChanged path:/clusterstate.json, has occurred - updating... (live nodes size: 1)
[junit4:junit4]   2> 7484 T38 oasc.ZkController.register We are http://127.0.0.1:52315/collection1/ and leader is http://127.0.0.1:52315/collection1/
[junit4:junit4]   2> 7485 T38 oasc.ZkController.register No LogReplay needed for core=collection1 baseURL=http://127.0.0.1:52315
[junit4:junit4]   2> 7486 T38 oasc.ZkController.checkRecovery I am the leader, no recovery necessary
[junit4:junit4]   2> 7486 T38 oasc.ZkController.publish publishing core=collection1 state=active
[junit4:junit4]   2> 7486 T38 oasc.ZkController.publish numShards not found on descriptor - reading it from system property
[junit4:junit4]   2> 7490 T38 oascc.ZkStateReader.updateClusterState Updating cloud state from ZooKeeper... 
[junit4:junit4]   2> 7493 T12 oass.SolrDispatchFilter.init user.dir=/mnt/ssd/jenkins/workspace/Lucene-Solr-trunk-Linux/solr/build/solr-core/test/J1
[junit4:junit4]   2> 7494 T12 oass.SolrDispatchFilter.init SolrDispatchFilter.init() done
[junit4:junit4]   2> 7514 T12 oascsi.HttpClientUtil.createClient Creating new http client, config:maxConnections=128&maxConnectionsPerHost=32&followRedirects=false
[junit4:junit4]   2> 7524 T12 oascsi.HttpClientUtil.createClient Creating new http client, config:
[junit4:junit4]   2> 7527 T12 oaz.ZooKeeper.<init> Initiating client connection, connectString=127.0.0.1:44589/solr sessionTimeout=10000 watcher=org.apache.solr.common.cloud.ConnectionManager@fd551eb
[junit4:junit4]   2> 7528 T12 oascc.ConnectionManager.waitForConnected Waiting for client to connect to ZooKeeper
[junit4:junit4]   2> 7529 T40 oaz.ClientCnxn$SendThread.logStartConnect Opening socket connection to server localhost.localdomain/127.0.0.1:44589. Will not attempt to authenticate using SASL (access denied ("javax.security.auth.AuthPermission" "getLoginConfiguration"))
[junit4:junit4]   2> 7530 T40 oaz.ClientCnxn$SendThread.primeConnection Socket connection established to localhost.localdomain/127.0.0.1:44589, initiating session
[junit4:junit4]   2> 7530 T14 oazs.NIOServerCnxnFactory.run Accepted socket connection from /127.0.0.1:54354
[junit4:junit4]   2> 7530 T14 oazs.ZooKeeperServer.processConnectRequest Client attempting to establish new session at /127.0.0.1:54354
[junit4:junit4]   2> 7532 T16 oazs.ZooKeeperServer.finishSessionInit Established session 0x13d0832f20a0004 with negotiated timeout 10000 for client /127.0.0.1:54354
[junit4:junit4]   2> 7532 T40 oaz.ClientCnxn$SendThread.onConnected Session establishment complete on server localhost.localdomain/127.0.0.1:44589, sessionid = 0x13d0832f20a0004, negotiated timeout = 10000
[junit4:junit4]   2> 7534 T41 oascc.ConnectionManager.process Watcher org.apache.solr.common.cloud.ConnectionManager@fd551eb name:ZooKeeperConnection Watcher:127.0.0.1:44589/solr got event WatchedEvent state:SyncConnected type:None path:null path:null type:None
[junit4:junit4]   2> 7534 T12 oascc.ConnectionManager.waitForConnected Client is connected to ZooKeeper
[junit4:junit4]   2> 7536 T12 oascc.ZkStateReader.createClusterStateWatchersAndUpdate Updating cluster state from ZooKeeper... 
[junit4:junit4]   2> 7540 T12 oasc.ChaosMonkey.monkeyLog monkey: init - expire sessions:true cause connection loss:true
[junit4:junit4]   2> 7610 T12 oejs.Server.doStart jetty-8.1.8.v20121106
[junit4:junit4]   2> 7613 T12 oejs.AbstractConnector.doStart Started SelectChannelConnector@127.0.0.1:33214
[junit4:junit4]   2> 7614 T12 oass.SolrDispatchFilter.init SolrDispatchFilter.init()
[junit4:junit4]   2> 7615 T12 oasc.SolrResourceLoader.locateSolrHome JNDI not configured for solr (NoInitialContextEx)
[junit4:junit4]   2> 7615 T12 oasc.SolrResourceLoader.locateSolrHome using system property solr.solr.home: /mnt/ssd/jenkins/workspace/Lucene-Solr-trunk-Linux/solr/build/solr-core/test/J1/./org.apache.solr.cloud.UnloadDistributedZkTest-jetty1-1361642196640
[junit4:junit4]   2> 7616 T12 oasc.CoreContainer$Initializer.initialize looking for solr.xml: /mnt/ssd/jenkins/workspace/Lucene-Solr-trunk-Linux/solr/build/solr-core/test/J1/./org.apache.solr.cloud.UnloadDistributedZkTest-jetty1-1361642196640/solr.xml
[junit4:junit4]   2> 7616 T12 oasc.CoreContainer.<init> New CoreContainer 1635326178
[junit4:junit4]   2> 7617 T12 oasc.CoreContainer.load Loading CoreContainer using Solr Home: '/mnt/ssd/jenkins/workspace/Lucene-Solr-trunk-Linux/solr/build/solr-core/test/J1/./org.apache.solr.cloud.UnloadDistributedZkTest-jetty1-1361642196640/'
[junit4:junit4]   2> 7618 T12 oasc.SolrResourceLoader.<init> new SolrResourceLoader for directory: '/mnt/ssd/jenkins/workspace/Lucene-Solr-trunk-Linux/solr/build/solr-core/test/J1/./org.apache.solr.cloud.UnloadDistributedZkTest-jetty1-1361642196640/'
[junit4:junit4]   2> 7642 T12 oashc.HttpShardHandlerFactory.getParameter Setting socketTimeout to: 120000
[junit4:junit4]   2> 7642 T12 oashc.HttpShardHandlerFactory.getParameter Setting urlScheme to: http://
[junit4:junit4]   2> 7643 T12 oashc.HttpShardHandlerFactory.getParameter Setting connTimeout to: 15000
[junit4:junit4]   2> 7643 T12 oashc.HttpShardHandlerFactory.getParameter Setting maxConnectionsPerHost to: 20
[junit4:junit4]   2> 7643 T12 oashc.HttpShardHandlerFactory.getParameter Setting corePoolSize to: 0
[junit4:junit4]   2> 7644 T12 oashc.HttpShardHandlerFactory.getParameter Setting maximumPoolSize to: 2147483647
[junit4:junit4]   2> 7644 T12 oashc.HttpShardHandlerFactory.getParameter Setting maxThreadIdleTime to: 5
[junit4:junit4]   2> 7645 T12 oashc.HttpShardHandlerFactory.getParameter Setting sizeOfQueue to: -1
[junit4:junit4]   2> 7645 T12 oashc.HttpShardHandlerFactory.getParameter Setting fairnessPolicy to: false
[junit4:junit4]   2> 7646 T12 oascsi.HttpClientUtil.createClient Creating new http client, config:maxConnectionsPerHost=20&maxConnections=10000&socketTimeout=120000&connTimeout=15000&retry=false
[junit4:junit4]   2> 7656 T12 oasc.CoreContainer.load Registering Log Listener
[junit4:junit4]   2> 7665 T12 oasc.CoreContainer.initZooKeeper Zookeeper client=127.0.0.1:44589/solr
[junit4:junit4]   2> 7666 T12 oasc.ZkController.checkChrootPath zkHost includes chroot
[junit4:junit4]   2> 7666 T12 oaz.ZooKeeper.<init> Initiating client connection, connectString=127.0.0.1:44589 sessionTimeout=60000 watcher=org.apache.solr.common.cloud.ConnectionManager@379420f7
[junit4:junit4]   2> 7667 T12 oascc.ConnectionManager.waitForConnected Waiting for client to connect to ZooKeeper
[junit4:junit4]   2> 7671 T51 oaz.ClientCnxn$SendThread.logStartConnect Opening socket connection to server localhost.localdomain/127.0.0.1:44589. Will not attempt to authenticate using SASL (access denied ("javax.security.auth.AuthPermission" "getLoginConfiguration"))
[junit4:junit4]   2> 7671 T51 oaz.ClientCnxn$SendThread.primeConnection Socket connection established to localhost.localdomain/127.0.0.1:44589, initiating session
[junit4:junit4]   2> 7671 T14 oazs.NIOServerCnxnFactory.run Accepted socket connection from /127.0.0.1:54355
[junit4:junit4]   2> 7672 T14 oazs.ZooKeeperServer.processConnectRequest Client attempting to establish new session at /127.0.0.1:54355
[junit4:junit4]   2> 7677 T16 oazs.ZooKeeperServer.finishSessionInit Established session 0x13d0832f20a0005 with negotiated timeout 20000 for client /127.0.0.1:54355
[junit4:junit4]   2> 7677 T51 oaz.ClientCnxn$SendThread.onConnected Session establishment complete on server localhost.localdomain/127.0.0.1:44589, sessionid = 0x13d0832f20a0005, negotiated timeout = 20000
[junit4:junit4]   2> 7678 T52 oascc.ConnectionManager.process Watcher org.apache.solr.common.cloud.ConnectionManager@379420f7 name:ZooKeeperConnection Watcher:127.0.0.1:44589 got event WatchedEvent state:SyncConnected type:None path:null path:null type:None
[junit4:junit4]   2> 7679 T12 oascc.ConnectionManager.waitForConnected Client is connected to ZooKeeper
[junit4:junit4]   2> 7680 T17 oazs.PrepRequestProcessor.pRequest2Txn Processed session termination for sessionid: 0x13d0832f20a0005
[junit4:junit4]   2> 7681 T14 oazs.NIOServerCnxn.closeSock Closed socket connection for client /127.0.0.1:54355 which had sessionid 0x13d0832f20a0005
[junit4:junit4]   2> 7681 T52 oaz.ClientCnxn$EventThread.run EventThread shut down
[junit4:junit4]   2> 7681 T12 oaz.ZooKeeper.close Session: 0x13d0832f20a0005 closed
[junit4:junit4]   2> 7682 T12 oascsi.HttpClientUtil.createClient Creating new http client, config:maxConnections=500&maxConnectionsPerHost=16&socketTimeout=120000&connTimeout=15000
[junit4:junit4]   2> 7685 T12 oaz.ZooKeeper.<init> Initiating client connection, connectString=127.0.0.1:44589/solr sessionTimeout=30000 watcher=org.apache.solr.common.cloud.ConnectionManager@449416b
[junit4:junit4]   2> 7686 T53 oaz.ClientCnxn$SendThread.logStartConnect Opening socket connection to server localhost.localdomain/127.0.0.1:44589. Will not attempt to authenticate using SASL (access denied ("javax.security.auth.AuthPermission" "getLoginConfiguration"))
[junit4:junit4]   2> 7687 T14 oazs.NIOServerCnxnFactory.run Accepted socket connection from /127.0.0.1:54356
[junit4:junit4]   2> 7688 T53 oaz.ClientCnxn$SendThread.primeConnection Socket connection established to localhost.localdomain/127.0.0.1:44589, initiating session
[junit4:junit4]   2> 7688 T14 oazs.ZooKeeperServer.processConnectRequest Client attempting to establish new session at /127.0.0.1:54356
[junit4:junit4]   2> 7689 T16 oazs.ZooKeeperServer.finishSessionInit Established session 0x13d0832f20a0006 with negotiated timeout 20000 for client /127.0.0.1:54356
[junit4:junit4]   2> 7690 T53 oaz.ClientCnxn$SendThread.onConnected Session establishment complete on server localhost.localdomain/127.0.0.1:44589, sessionid = 0x13d0832f20a0006, negotiated timeout = 20000
[junit4:junit4]   2> 7692 T12 oascc.ConnectionManager.waitForConnected Waiting for client to connect to ZooKeeper
[junit4:junit4]   2> 7694 T54 oascc.ConnectionManager.process Watcher org.apache.solr.common.cloud.ConnectionManager@449416b name:ZooKeeperConnection Watcher:127.0.0.1:44589/solr got event WatchedEvent state:SyncConnected type:None path:null path:null type:None
[junit4:junit4]   2> 7695 T12 oascc.ConnectionManager.waitForConnected Client is connected to ZooKeeper
[junit4:junit4]   2> 7700 T17 oazs.PrepRequestProcessor.pRequest Got user-level KeeperException when processing sessionid:0x13d0832f20a0006 type:create cxid:0x1 zxid:0x49 txntype:-1 reqpath:n/a Error Path:/solr/overseer Error:KeeperErrorCode = NodeExists for /solr/overseer
[junit4:junit4]   2> 7704 T17 oazs.PrepRequestProcessor.pRequest Got user-level KeeperException when processing sessionid:0x13d0832f20a0006 type:create cxid:0x2 zxid:0x4a txntype:-1 reqpath:n/a Error Path:/solr/overseer Error:KeeperErrorCode = NodeExists for /solr/overseer
[junit4:junit4]   2> 7707 T12 oascc.ZkStateReader.createClusterStateWatchersAndUpdate Updating cluster state from ZooKeeper... 
[junit4:junit4]   2> 8711 T12 oasc.ZkController.createEphemeralLiveNode Register node as live in ZooKeeper:/live_nodes/127.0.0.1:33214_
[junit4:junit4]   2> 8712 T17 oazs.PrepRequestProcessor.pRequest Got user-level KeeperException when processing sessionid:0x13d0832f20a0006 type:delete cxid:0x9 zxid:0x4b txntype:-1 reqpath:n/a Error Path:/solr/live_nodes/127.0.0.1:33214_ Error:KeeperErrorCode = NoNode for /solr/live_nodes/127.0.0.1:33214_
[junit4:junit4]   2> 8713 T12 oascc.SolrZkClient.makePath makePath: /live_nodes/127.0.0.1:33214_
[junit4:junit4]   2> 8716 T35 oascc.ZkStateReader$2.process A cluster state change: WatchedEvent state:SyncConnected type:NodeChildrenChanged path:/live_nodes, has occurred - updating... (live nodes size: 1)
[junit4:junit4]   2> 8717 T41 oascc.ZkStateReader$3.process Updating live nodes... (2)
[junit4:junit4]   2> 8718 T54 oascc.ZkStateReader$3.process Updating live nodes... (2)
[junit4:junit4]   2> 8718 T35 oascc.ZkStateReader$3.process Updating live nodes... (2)
[junit4:junit4]   2> 8734 T55 oasc.CoreContainer.create Creating SolrCore 'collection1' using instanceDir: /mnt/ssd/jenkins/workspace/Lucene-Solr-trunk-Linux/solr/build/solr-core/test/J1/./org.apache.solr.cloud.UnloadDistributedZkTest-jetty1-1361642196640/collection1
[junit4:junit4]   2> 8735 T55 oasc.ZkController.createCollectionZkNode Check for collection zkNode:collection1
[junit4:junit4]   2> 8736 T55 oasc.ZkController.createCollectionZkNode Collection zkNode exists
[junit4:junit4]   2> 8736 T55 oasc.ZkController.readConfigName Load collection config from:/collections/collection1
[junit4:junit4]   2> 8738 T55 oasc.SolrResourceLoader.<init> new SolrResourceLoader for directory: '/mnt/ssd/jenkins/workspace/Lucene-Solr-trunk-Linux/solr/build/solr-core/test/J1/./org.apache.solr.cloud.UnloadDistributedZkTest-jetty1-1361642196640/collection1/'
[junit4:junit4]   2> 8739 T55 oasc.SolrResourceLoader.replaceClassLoader Adding 'file:/mnt/ssd/jenkins/workspace/Lucene-Solr-trunk-Linux/solr/build/solr-core/test/J1/org.apache.solr.cloud.UnloadDistributedZkTest-jetty1-1361642196640/collection1/lib/README' to classloader
[junit4:junit4]   2> 8739 T55 oasc.SolrResourceLoader.replaceClassLoader Adding 'file:/mnt/ssd/jenkins/workspace/Lucene-Solr-trunk-Linux/solr/build/solr-core/test/J1/org.apache.solr.cloud.UnloadDistributedZkTest-jetty1-1361642196640/collection1/lib/classes/' to classloader
[junit4:junit4]   2> 8786 T55 oasc.SolrConfig.<init> Using Lucene MatchVersion: LUCENE_50
[junit4:junit4]   2> 8834 T55 oasc.SolrConfig.<init> Loaded SolrConfig: solrconfig.xml
[junit4:junit4]   2> 8836 T55 oass.IndexSchema.readSchema Reading Solr Schema
[junit4:junit4]   2> 8892 T55 oass.IndexSchema.readSchema Schema name=test
[junit4:junit4]   2> 8961 T36 oascc.ZkStateReader.updateClusterState Updating cloud state from ZooKeeper... 
[junit4:junit4]   2> 8963 T36 oasc.Overseer$ClusterStateUpdater.updateState Update state numShards=1 message={
[junit4:junit4]   2> 	  "numShards":"1",
[junit4:junit4]   2> 	  "core":"collection1",
[junit4:junit4]   2> 	  "collection":"control_collection",
[junit4:junit4]   2> 	  "operation":"state",
[junit4:junit4]   2> 	  "shard":"shard1",
[junit4:junit4]   2> 	  "node_name":"127.0.0.1:52315_",
[junit4:junit4]   2> 	  "roles":null,
[junit4:junit4]   2> 	  "base_url":"http://127.0.0.1:52315",
[junit4:junit4]   2> 	  "state":"active"}
[junit4:junit4]   2> 8985 T35 oascc.ZkStateReader$2.process A cluster state change: WatchedEvent state:SyncConnected type:NodeDataChanged path:/clusterstate.json, has occurred - updating... (live nodes size: 2)
[junit4:junit4]   2> 8992 T41 oascc.ZkStateReader$2.process A cluster state change: WatchedEvent state:SyncConnected type:NodeDataChanged path:/clusterstate.json, has occurred - updating... (live nodes size: 2)
[junit4:junit4]   2> 8993 T54 oascc.ZkStateReader$2.process A cluster state change: WatchedEvent state:SyncConnected type:NodeDataChanged path:/clusterstate.json, has occurred - updating... (live nodes size: 2)
[junit4:junit4]   2> 9279 T55 oass.OpenExchangeRatesOrgProvider.init Initialized with rates=open-exchange-rates.json, refreshInterval=1440.
[junit4:junit4]   2> 9290 T55 oass.IndexSchema.readSchema default search field in schema is text
[junit4:junit4]   2> 9294 T55 oass.IndexSchema.readSchema unique key field: id
[junit4:junit4]   2> 9326 T55 oass.FileExchangeRateProvider.reload Reloading exchange rates from file currency.xml
[junit4:junit4]   2> 9331 T55 oass.FileExchangeRateProvider.reload Reloading exchange rates from file currency.xml
[junit4:junit4]   2> 9336 T55 oass.OpenExchangeRatesOrgProvider.reload Reloading exchange rates from open-exchange-rates.json
[junit4:junit4]   2> 9340 T55 oass.OpenExchangeRatesOrgProvider.reload Reloading exchange rates from open-exchange-rates.json
[junit4:junit4]   2> 9343 T55 oasc.SolrCore.<init> [collection1] Opening new SolrCore at /mnt/ssd/jenkins/workspace/Lucene-Solr-trunk-Linux/solr/build/solr-core/test/J1/./org.apache.solr.cloud.UnloadDistributedZkTest-jetty1-1361642196640/collection1/, dataDir=./org.apache.solr.cloud.UnloadDistributedZkTest-1361642189188/jetty1/
[junit4:junit4]   2> 9343 T55 oasc.JmxMonitoredMap.<init> JMX monitoring is enabled. Adding Solr mbeans to JMX Server: com.sun.jmx.mbeanserver.JmxMBeanServer@4ba7cde3
[junit4:junit4]   2> 9344 T55 oasc.SolrCore.initDirectoryFactory org.apache.solr.core.MockDirectoryFactory
[junit4:junit4]   2> 9345 T55 oasc.CachingDirectoryFactory.get return new directory for /mnt/ssd/jenkins/workspace/Lucene-Solr-trunk-Linux/solr/build/solr-core/test/J1/./org.apache.solr.cloud.UnloadDistributedZkTest-1361642189188/jetty1 forceNew:false
[junit4:junit4]   2> 9345 T55 oasc.CachingDirectoryFactory.close Releasing directory:/mnt/ssd/jenkins/workspace/Lucene-Solr-trunk-Linux/solr/build/solr-core/test/J1/./org.apache.solr.cloud.UnloadDistributedZkTest-1361642189188/jetty1
[junit4:junit4]   2> 9346 T55 oasc.SolrCore.getNewIndexDir New index directory detected: old=null new=./org.apache.solr.cloud.UnloadDistributedZkTest-1361642189188/jetty1/index/
[junit4:junit4]   2> 9346 T55 oasc.SolrCore.initIndex WARNING [collection1] Solr index directory './org.apache.solr.cloud.UnloadDistributedZkTest-1361642189188/jetty1/index' doesn't exist. Creating new index...
[junit4:junit4]   2> 9347 T55 oasc.CachingDirectoryFactory.get return new directory for /mnt/ssd/jenkins/workspace/Lucene-Solr-trunk-Linux/solr/build/solr-core/test/J1/./org.apache.solr.cloud.UnloadDistributedZkTest-1361642189188/jetty1/index forceNew:false
[junit4:junit4]   2> 9349 T55 oasc.SolrDeletionPolicy.onCommit SolrDeletionPolicy.onCommit: commits:num=1
[junit4:junit4]   2> 		commit{dir=MockDirWrapper(org.apache.lucene.store.RAMDirectory@372bd7d6 lockFactory=org.apache.lucene.store.NativeFSLockFactory@33527e25),segFN=segments_1,generation=1,filenames=[segments_1]
[junit4:junit4]   2> 9350 T55 oasc.SolrDeletionPolicy.updateCommits newest commit = 1[segments_1]
[junit4:junit4]   2> 9350 T55 oasc.CachingDirectoryFactory.close Releasing directory:/mnt/ssd/jenkins/workspace/Lucene-Solr-trunk-Linux/solr/build/solr-core/test/J1/./org.apache.solr.cloud.UnloadDistributedZkTest-1361642189188/jetty1/index
[junit4:junit4]   2> 9354 T55 oasup.UpdateRequestProcessorChain.init inserting DistributedUpdateProcessorFactory into updateRequestProcessorChain "dedupe"
[junit4:junit4]   2> 9354 T55 oasup.UpdateRequestProcessorChain.init inserting DistributedUpdateProcessorFactory into updateRequestProcessorChain "stored_sig"
[junit4:junit4]   2> 9355 T55 oasup.UpdateRequestProcessorChain.init inserting DistributedUpdateProcessorFactory into updateRequestProcessorChain "distrib-dup-test-chain-implicit"
[junit4:junit4]   2> 9357 T55 oasc.RequestHandlers.initHandlersFromConfig created standard: solr.StandardRequestHandler
[junit4:junit4]   2> 9359 T55 oasc.RequestHandlers.initHandlersFromConfig created /get: solr.RealTimeGetHandler
[junit4:junit4]   2> 9359 T55 oasc.RequestHandlers.initHandlersFromConfig adding lazy requestHandler: solr.ReplicationHandler
[junit4:junit4]   2> 9360 T55 oasc.RequestHandlers.initHandlersFromConfig created /replication: solr.ReplicationHandler
[junit4:junit4]   2> 9361 T55 oasc.RequestHandlers.initHandlersFromConfig created /update: solr.UpdateRequestHandler
[junit4:junit4]   2> 9362 T55 oasc.RequestHandlers.initHandlersFromConfig created /admin/: org.apache.solr.handler.admin.AdminHandlers
[junit4:junit4]   2> 9389 T55 oashl.XMLLoader.init xsltCacheLifetimeSeconds=60
[junit4:junit4]   2> 9394 T55 oasc.CachingDirectoryFactory.close Releasing directory:/mnt/ssd/jenkins/workspace/Lucene-Solr-trunk-Linux/solr/build/solr-core/test/J1/./org.apache.solr.cloud.UnloadDistributedZkTest-1361642189188/jetty1
[junit4:junit4]   2> 9395 T55 oass.SolrIndexSearcher.<init> Opening Searcher@4b71bffb main
[junit4:junit4]   2> 9395 T55 oasu.UpdateHandler.clearLog Clearing tlog files, tlogDir=./org.apache.solr.cloud.UnloadDistributedZkTest-1361642189188/jetty1/tlog
[junit4:junit4]   2> 9396 T55 oasu.CommitTracker.<init> Hard AutoCommit: disabled
[junit4:junit4]   2> 9396 T55 oasu.CommitTracker.<init> Soft AutoCommit: disabled
[junit4:junit4]   2> 9414 T56 oasc.SolrCore.registerSearcher [collection1] Registered new searcher Searcher@4b71bffb main{StandardDirectoryReader(segments_1:1)}
[junit4:junit4]   2> 9419 T55 oasc.ZkController.publish publishing core=collection1 state=down
[junit4:junit4]   2> 9420 T55 oasc.ZkController.publish numShards not found on descriptor - reading it from system property
[junit4:junit4]   2> 10497 T36 oascc.ZkStateReader.updateClusterState Updating cloud state from ZooKeeper... 
[junit4:junit4]   2> 10499 T36 oasc.Overseer$ClusterStateUpdater.updateState Update state numShards=2 message={
[junit4:junit4]   2> 	  "numShards":"2",
[junit4:junit4]   2> 	  "core":"collection1",
[junit4:junit4]   2> 	  "collection":"collection1",
[junit4:junit4]   2> 	  "operation":"state",
[junit4:junit4]   2> 	  "shard":null,
[junit4:junit4]   2> 	  "node_name":"127.0.0.1:33214_",
[junit4:junit4]   2> 	  "roles":null,
[junit4:junit4]   2> 	  "base_url":"http://127.0.0.1:33214",
[junit4:junit4]   2> 	  "state":"down"}
[junit4:junit4]   2> 10499 T36 oasc.Overseer$ClusterStateUpdater.createCollection Create collection collection1 with numShards 2
[junit4:junit4]   2> 10499 T36 oasc.Overseer$ClusterStateUpdater.updateState Assigning new node to shard shard=shard2
[junit4:junit4]   2> 10506 T35 oascc.ZkStateReader$2.process A cluster state change: WatchedEvent state:SyncConnected type:NodeDataChanged path:/clusterstate.json, has occurred - updating... (live nodes size: 2)
[junit4:junit4]   2> 10506 T41 oascc.ZkStateReader$2.process A cluster state change: WatchedEvent state:SyncConnected type:NodeDataChanged path:/clusterstate.json, has occurred - updating... (live nodes size: 2)
[junit4:junit4]   2> 10506 T54 oascc.ZkStateReader$2.process A cluster state change: WatchedEvent state:SyncConnected type:NodeDataChanged path:/clusterstate.json, has occurred - updating... (live nodes size: 2)
[junit4:junit4]   2> 11425 T55 oasc.CoreContainer.registerCore registering core: collection1
[junit4:junit4]   2> 11426 T55 oasc.ZkController.register Register replica - core:collection1 address:http://127.0.0.1:33214 collection:collection1 shard:shard2
[junit4:junit4]   2> 11427 T55 oascc.SolrZkClient.makePath makePath: /collections/collection1/leader_elect/shard2/election
[junit4:junit4]   2> 11486 T17 oazs.PrepRequestProcessor.pRequest Got user-level KeeperException when processing sessionid:0x13d0832f20a0006 type:delete cxid:0x46 zxid:0x5b txntype:-1 reqpath:n/a Error Path:/solr/collections/collection1/leaders Error:KeeperErrorCode = NoNode for /solr/collections/collection1/leaders
[junit4:junit4]   2> 11487 T55 oasc.ShardLeaderElectionContext.runLeaderProcess Running the leader process.
[junit4:junit4]   2> 11488 T17 oazs.PrepRequestProcessor.pRequest Got user-level KeeperException when processing sessionid:0x13d0832f20a0006 type:create cxid:0x47 zxid:0x5c txntype:-1 reqpath:n/a Error Path:/solr/overseer Error:KeeperErrorCode = NodeExists for /solr/overseer
[junit4:junit4]   2> 11490 T55 oasc.ShardLeaderElectionContext.waitForReplicasToComeUp Enough replicas found to continue.
[junit4:junit4]   2> 11491 T55 oasc.ShardLeaderElectionContext.runLeaderProcess I may be the new leader - try and sync
[junit4:junit4]   2> 11491 T55 oasc.SyncStrategy.sync Sync replicas to http://127.0.0.1:33214/collection1/
[junit4:junit4]   2> 11492 T55 oasc.SyncStrategy.syncReplicas Sync Success - now sync replicas to me
[junit4:junit4]   2> 11492 T55 oasc.SyncStrategy.syncToMe http://127.0.0.1:33214/collection1/ has no replicas
[junit4:junit4]   2> 11493 T55 oasc.ShardLeaderElectionContext.runLeaderProcess I am the new leader: http://127.0.0.1:33214/collection1/
[junit4:junit4]   2> 11493 T55 oascc.SolrZkClient.makePath makePath: /collections/collection1/leaders/shard2
[junit4:junit4]   2> 11502 T17 oazs.PrepRequestProcessor.pRequest Got user-level KeeperException when processing sessionid:0x13d0832f20a0006 type:create cxid:0x51 zxid:0x60 txntype:-1 reqpath:n/a Error Path:/solr/overseer Error:KeeperErrorCode = NodeExists for /solr/overseer
[junit4:junit4]   2> 12012 T36 oascc.ZkStateReader.updateClusterState Updating cloud state from ZooKeeper... 
[junit4:junit4]   2> 12021 T35 oascc.ZkStateReader$2.process A cluster state change: WatchedEvent state:SyncConnected type:NodeDataChanged path:/clusterstate.json, has occurred - updating... (live nodes size: 2)
[junit4:junit4]   2> 12021 T41 oascc.ZkStateReader$2.process A cluster state change: WatchedEvent state:SyncConnected type:NodeDataChanged path:/clusterstate.json, has occurred - updating... (live nodes size: 2)
[junit4:junit4]   2> 12021 T54 oascc.ZkStateReader$2.process A cluster state change: WatchedEvent state:SyncConnected type:NodeDataChanged path:/clusterstate.json, has occurred - updating... (live nodes size: 2)
[junit4:junit4]   2> 12056 T55 oasc.ZkController.register We are http://127.0.0.1:33214/collection1/ and leader is http://127.0.0.1:33214/collection1/
[junit4:junit4]   2> 12056 T55 oasc.ZkController.register No LogReplay needed for core=collection1 baseURL=http://127.0.0.1:33214
[junit4:junit4]   2> 12057 T55 oasc.ZkController.checkRecovery I am the leader, no recovery necessary
[junit4:junit4]   2> 12057 T55 oasc.ZkController.publish publishing core=collection1 state=active
[junit4:junit4]   2> 12057 T55 oasc.ZkController.publish numShards not found on descriptor - reading it from system property
[junit4:junit4]   2> 12060 T55 oascc.ZkStateReader.updateClusterState Updating cloud state from ZooKeeper... 
[junit4:junit4]   2> 12061 T12 oass.SolrDispatchFilter.init user.dir=/mnt/ssd/jenkins/workspace/Lucene-Solr-trunk-Linux/solr/build/solr-core/test/J1
[junit4:junit4]   2> 12062 T12 oass.SolrDispatchFilter.init SolrDispatchFilter.init() done
[junit4:junit4]   2> 12063 T12 oascsi.HttpClientUtil.createClient Creating new http client, config:maxConnections=128&maxConnectionsPerHost=32&followRedirects=false
[junit4:junit4]   2> 12152 T12 oejs.Server.doStart jetty-8.1.8.v20121106
[junit4:junit4]   2> 12157 T12 oejs.AbstractConnector.doStart Started SelectChannelConnector@127.0.0.1:50157
[junit4:junit4]   2> 12158 T12 oass.SolrDispatchFilter.init SolrDispatchFilter.init()
[junit4:junit4]   2> 12159 T12 oasc.SolrResourceLoader.locateSolrHome JNDI not configured for solr (NoInitialContextEx)
[junit4:junit4]   2> 12159 T12 oasc.SolrResourceLoader.locateSolrHome using system property solr.solr.home: /mnt/ssd/jenkins/workspace/Lucene-Solr-trunk-Linux/solr/build/solr-core/test/J1/./org.apache.solr.cloud.UnloadDistributedZkTest-jetty2-1361642201169
[junit4:junit4]   2> 12159 T12 oasc.CoreContainer$Initializer.initialize looking for solr.xml: /mnt/ssd/jenkins/workspace/Lucene-Solr-trunk-Linux/solr/build/solr-core/test/J1/./org.apache.solr.cloud.UnloadDistributedZkTest-jetty2-1361642201169/solr.xml
[junit4:junit4]   2> 12160 T12 oasc.CoreContainer.<init> New CoreContainer 1409127481
[junit4:junit4]   2> 12160 T12 oasc.CoreContainer.load Loading CoreContainer using Solr Home: '/mnt/ssd/jenkins/workspace/Lucene-Solr-trunk-Linux/solr/build/solr-core/test/J1/./org.apache.solr.cloud.UnloadDistributedZkTest-jetty2-1361642201169/'
[junit4:junit4]   2> 12161 T12 oasc.SolrResourceLoader.<init> new SolrResourceLoader for directory: '/mnt/ssd/jenkins/workspace/Lucene-Solr-trunk-Linux/solr/build/solr-core/test/J1/./org.apache.solr.cloud.UnloadDistributedZkTest-jetty2-1361642201169/'
[junit4:junit4]   2> 12187 T12 oashc.HttpShardHandlerFactory.getParameter Setting socketTimeout to: 120000
[junit4:junit4]   2> 12188 T12 oashc.HttpShardHandlerFactory.getParameter Setting urlScheme to: http://
[junit4:junit4]   2> 12188 T12 oashc.HttpShardHandlerFactory.getParameter Setting connTimeout to: 15000
[junit4:junit4]   2> 12189 T12 oashc.HttpShardHandlerFactory.getParameter Setting maxConnectionsPerHost to: 20
[junit4:junit4]   2> 12189 T12 oashc.HttpShardHandlerFactory.getParameter Setting corePoolSize to: 0
[junit4:junit4]   2> 12190 T12 oashc.HttpShardHandlerFactory.getParameter Setting maximumPoolSize to: 2147483647
[junit4:junit4]   2> 12190 T12 oashc.HttpShardHandlerFactory.getParameter Setting maxThreadIdleTime to: 5
[junit4:junit4]   2> 12191 T12 oashc.HttpShardHandlerFactory.getParameter Setting sizeOfQueue to: -1
[junit4:junit4]   2> 12191 T12 oashc.HttpShardHandlerFactory.getParameter Setting fairnessPolicy to: false
[junit4:junit4]   2> 12192 T12 oascsi.HttpClientUtil.createClient Creating new http client, config:maxConnectionsPerHost=20&maxConnections=10000&socketTimeout=120000&connTimeout=15000&retry=false
[junit4:junit4]   2> 12201 T12 oasc.CoreContainer.load Registering Log Listener
[junit4:junit4]   2> 12215 T12 oasc.CoreContainer.initZooKeeper Zookeeper client=127.0.0.1:44589/solr
[junit4:junit4]   2> 12216 T12 oasc.ZkController.checkChrootPath zkHost includes chroot
[junit4:junit4]   2> 12216 T12 oaz.ZooKeeper.<init> Initiating client connection, connectString=127.0.0.1:44589 sessionTimeout=60000 watcher=org.apache.solr.common.cloud.ConnectionManager@45311006
[junit4:junit4]   2> 12218 T66 oaz.ClientCnxn$SendThread.logStartConnect Opening socket connection to server localhost.localdomain/127.0.0.1:44589. Will not attempt to authenticate using SASL (access denied ("javax.security.auth.AuthPermission" "getLoginConfiguration"))
[junit4:junit4]   2> 12225 T12 oascc.ConnectionManager.waitForConnected Waiting for client to connect to ZooKeeper
[junit4:junit4]   2> 12226 T66 oaz.ClientCnxn$SendThread.primeConnection Socket connection established to localhost.localdomain/127.0.0.1:44589, initiating session
[junit4:junit4]   2> 12226 T14 oazs.NIOServerCnxnFactory.run Accepted socket connection from /127.0.0.1:54357
[junit4:junit4]   2> 12227 T14 oazs.ZooKeeperServer.processConnectRequest Client attempting to establish new session at /127.0.0.1:54357
[junit4:junit4]   2> 12228 T16 oazs.ZooKeeperServer.finishSessionInit Established session 0x13d0832f20a0007 with negotiated timeout 20000 for client /127.0.0.1:54357
[junit4:junit4]   2> 12228 T66 oaz.ClientCnxn$SendThread.onConnected Session establishment complete on server localhost.localdomain/127.0.0.1:44589, sessionid = 0x13d0832f20a0007, negotiated timeout = 20000
[junit4:junit4]   2> 12230 T67 oascc.ConnectionManager.process Watcher org.apache.solr.common.cloud.ConnectionManager@45311006 name:ZooKeeperConnection Watcher:127.0.0.1:44589 got event WatchedEvent state:SyncConnected type:None path:null path:null type:None
[junit4:junit4]   2> 12231 T12 oascc.ConnectionManager.waitForConnected Client is connected to ZooKeeper
[junit4:junit4]   2> 12233 T17 oazs.PrepRequestProcessor.pRequest2Txn Processed session termination for sessionid: 0x13d0832f20a0007
[junit4:junit4]   2> 12233 T12 oaz.ZooKeeper.close Session: 0x13d0832f20a0007 closed
[junit4:junit4]   2> 12234 T67 oaz.ClientCnxn$EventThread.run EventThread shut down
[junit4:junit4]   2> 12234 T14 oazs.NIOServerCnxn.closeSock Closed socket connection for client /127.0.0.1:54357 which had sessionid 0x13d0832f20a0007
[junit4:junit4]   2> 12234 T12 oascsi.HttpClientUtil.createClient Creating new http client, config:maxConnections=500&maxConnectionsPerHost=16&socketTimeout=120000&connTimeout=15000
[junit4:junit4]   2> 12238 T12 oaz.ZooKeeper.<init> Initiating client connection, connectString=127.0.0.1:44589/solr sessionTimeout=30000 watcher=org.apache.solr.common.cloud.ConnectionManager@1f502455
[junit4:junit4]   2> 12240 T68 oaz.ClientCnxn$SendThread.logStartConnect Opening socket connection to server localhost.localdomain/127.0.0.1:44589. Will not attempt to authenticate using SASL (access denied ("javax.security.auth.AuthPermission" "getLoginConfiguration"))
[junit4:junit4]   2> 12240 T68 oaz.ClientCnxn$SendThread.primeConnection Socket connection established to localhost.localdomain/127.0.0.1:44589, initiating session
[junit4:junit4]   2> 12241 T14 oazs.NIOServerCnxnFactory.run Accepted socket connection from /127.0.0.1:54358
[junit4:junit4]   2> 12241 T14 oazs.ZooKeeperServer.processConnectRequest Client attempting to establish new session at /127.0.0.1:54358
[junit4:junit4]   2> 12241 T12 oascc.ConnectionManager.waitForConnected Waiting for client to connect to ZooKeeper
[junit4:junit4]   2> 12242 T16 oazs.ZooKeeperServer.finishSessionInit Established session 0x13d0832f20a0008 with negotiated timeout 20000 for client /127.0.0.1:54358
[junit4:junit4]   2> 12245 T68 oaz.ClientCnxn$SendThread.onConnected Session establishment complete on server localhost.localdomain/127.0.0.1:44589, sessionid = 0x13d0832f20a0008, negotiated timeout = 20000
[junit4:junit4]   2> 12245 T69 oascc.ConnectionManager.process Watcher org.apache.solr.common.cloud.ConnectionManager@1f502455 name:ZooKeeperConnection Watcher:127.0.0.1:44589/solr got event WatchedEvent state:SyncConnected type:None path:null path:null type:None
[junit4:junit4]   2> 12246 T12 oascc.ConnectionManager.waitForConnected Client is connected to ZooKeeper
[junit4:junit4]   2> 12247 T17 oazs.PrepRequestProcessor.pRequest Got user-level KeeperException when processing sessionid:0x13d0832f20a0008 type:create cxid:0x1 zxid:0x6d txntype:-1 reqpath:n/a Error Path:/solr/overseer Error:KeeperErrorCode = NodeExists for /solr/overseer
[junit4:junit4]   2> 12248 T17 oazs.PrepRequestProcessor.pRequest Got user-level KeeperException when processing sessionid:0x13d0832f20a0008 type:create cxid:0x2 zxid:0x6e txntype:-1 reqpath:n/a Error Path:/solr/overseer Error:KeeperErrorCode = NodeExists for /solr/overseer
[junit4:junit4]   2> 12252 T12 oascc.ZkStateReader.createClusterStateWatchersAndUpdate Updating cluster state from ZooKeeper... 
[junit4:junit4]   2> 13256 T12 oasc.ZkController.createEphemeralLiveNode Register node as live in ZooKeeper:/live_nodes/127.0.0.1:50157_
[junit4:junit4]   2> 13257 T17 oazs.PrepRequestProcessor.pRequest Got user-level KeeperException when processing sessionid:0x13d0832f20a0008 type:delete cxid:0x9 zxid:0x6f txntype:-1 reqpath:n/a Error Path:/solr/live_nodes/127.0.0.1:50157_ Error:KeeperErrorCode = NoNode for /solr/live_nodes/127.0.0.1:50157_
[junit4:junit4]   2> 13258 T12 oascc.SolrZkClient.makePath makePath: /live_nodes/127.0.0.1:50157_
[junit4:junit4]   2> 13260 T54 oascc.ZkStateReader$2.process A cluster state change: WatchedEvent state:SyncConnected type:NodeChildrenChanged path:/live_nodes, has occurred - updating... (live nodes size: 2)
[junit4:junit4]   2> 13260 T35 oascc.ZkStateReader$2.process A cluster state change: WatchedEvent state:SyncConnected type:NodeChildrenChanged path:/live_nodes, has occurred - updating... (live nodes size: 2)
[junit4:junit4]   2> 13261 T69 oascc.ZkStateReader$3.process Updating live nodes... (3)
[junit4:junit4]   2> 13261 T41 oascc.ZkStateReader$2.process A cluster state change: WatchedEvent state:SyncConnected type:NodeChildrenChanged path:/live_nodes, has occurred - updating... (live nodes size: 2)
[junit4:junit4]   2> 13263 T54 oascc.ZkStateReader$3.process Updating live nodes... (3)
[junit4:junit4]   2> 13265 T41 oascc.ZkStateReader$3.process Updating live nodes... (3)
[junit4:junit4]   2> 13265 T35 oascc.ZkStateReader$3.process Updating live nodes... (3)
[junit4:junit4]   2> 13271 T70 oasc.CoreContainer.create Creating SolrCore 'collection1' using instanceDir: /mnt/ssd/jenkins/workspace/Lucene-Solr-trunk-Linux/solr/build/solr-core/test/J1/./org.apache.solr.cloud.UnloadDistributedZkTest-jetty2-1361642201169/collection1
[junit4:junit4]   2> 13272 T70 oasc.ZkController.createCollectionZkNode Check for collection zkNode:collection1
[junit4:junit4]   2> 13273 T70 oasc.ZkController.createCollectionZkNode Collection zkNode exists
[junit4:junit4]   2> 13273 T70 oasc.ZkController.readConfigName Load collection config from:/collections/collection1
[junit4:junit4]   2> 13275 T70 oasc.SolrResourceLoader.<init> new SolrResourceLoader for directory: '/mnt/ssd/jenkins/workspace/Lucene-Solr-trunk-Linux/solr/build/solr-core/test/J1/./org.apache.solr.cloud.UnloadDistributedZkTest-jetty2-1361642201169/collection1/'
[junit4:junit4]   2> 13276 T70 oasc.SolrResourceLoader.replaceClassLoader Adding 'file:/mnt/ssd/jenkins/workspace/Lucene-Solr-trunk-Linux/solr/build/solr-core/test/J1/org.apache.solr.cloud.UnloadDistributedZkTest-jetty2-1361642201169/collection1/lib/README' to classloader
[junit4:junit4]   2> 13276 T70 oasc.SolrResourceLoader.replaceClassLoader Adding 'file:/mnt/ssd/jenkins/workspace/Lucene-Solr-trunk-Linux/solr/build/solr-core/test/J1/org.apache.solr.cloud.UnloadDistributedZkTest-jetty2-1361642201169/collection1/lib/classes/' to classloader
[junit4:junit4]   2> 13324 T70 oasc.SolrConfig.<init> Using Lucene MatchVersion: LUCENE_50
[junit4:junit4]   2> 13365 T70 oasc.SolrConfig.<init> Loaded SolrConfig: solrconfig.xml
[junit4:junit4]   2> 13366 T70 oass.IndexSchema.readSchema Reading Solr Schema
[junit4:junit4]   2> 13375 T70 oass.IndexSchema.readSchema Schema name=test
[junit4:junit4]   2> 13528 T36 oascc.ZkStateReader.updateClusterState Updating cloud state from ZooKeeper... 
[junit4:junit4]   2> 13530 T36 oasc.Overseer$ClusterStateUpdater.updateState Update state numShards=2 message={
[junit4:junit4]   2> 	  "numShards":"2",
[junit4:junit4]   2> 	  "core":"collection1",
[junit4:junit4]   2> 	  "collection":"collection1",
[junit4:junit4]   2> 	  "operation":"state",
[junit4:junit4]   2> 	  "shard":"shard2",
[junit4:junit4]   2> 	  "node_name":"127.0.0.1:33214_",
[junit4:junit4]   2> 	  "roles":null,
[junit4:junit4]   2> 	  "base_url":"http://127.0.0.1:33214",
[junit4:junit4]   2> 	  "state":"active"}
[junit4:junit4]   2> 13538 T54 oascc.ZkStateReader$2.process A cluster state change: WatchedEvent state:SyncConnected type:NodeDataChanged path:/clusterstate.json, has occurred - updating... (live nodes size: 3)
[junit4:junit4]   2> 13539 T69 oascc.ZkStateReader$2.process A cluster state change: WatchedEvent state:SyncConnected type:NodeDataChanged path:/clusterstate.json, has occurred - updating... (live nodes size: 3)
[junit4:junit4]   2> 13538 T41 oascc.ZkStateReader$2.process A cluster state change: WatchedEvent state:SyncConnected type:NodeDataChanged path:/clusterstate.json, has occurred - updating... (live nodes size: 3)
[junit4:junit4]   2> 13539 T35 oascc.ZkStateReader$2.process A cluster state change: WatchedEvent state:SyncConnected type:NodeDataChanged path:/clusterstate.json, has occurred - updating... (live nodes size: 3)
[junit4:junit4]   2> 13725 T70 oass.OpenExchangeRatesOrgProvider.init Initialized with rates=open-exchange-rates.json, refreshInterval=1440.
[junit4:junit4]   2> 13734 T70 oass.IndexSchema.readSchema default search field in schema is text
[junit4:junit4]   2> 13738 T70 oass.IndexSchema.readSchema unique key field: id
[junit4:junit4]   2> 13763 T70 oass.FileExchangeRateProvider.reload Reloading exchange rates from file currency.xml
[junit4:junit4]   2> 13769 T70 oass.FileExchangeRateProvider.reload Reloading exchange rates from file currency.xml
[junit4:junit4]   2> 13773 T70 oass.OpenExchangeRatesOrgProvider.reload Reloading exchange rates from open-exchange-rates.json
[junit4:junit4]   2> 13775 T70 oass.OpenExchangeRatesOrgProvider.reload Reloading exchange rates from open-exchange-rates.json
[junit4:junit4]   2> 13776 T70 oasc.SolrCore.<init> [collection1] Opening new SolrCore at /mnt/ssd/jenkins/workspace/Lucene-Solr-trunk-Linux/solr/build/solr-core/test/J1/./org.apache.solr.cloud.UnloadDistributedZkTest-jetty2-1361642201169/collection1/, dataDir=./org.apache.solr.cloud.UnloadDistributedZkTest-1361642189188/jetty2/
[junit4:junit4]   2> 13777 T70 oasc.JmxMonitoredMap.<init> JMX monitoring is enabled. Adding Solr mbeans to JMX Server: com.sun.jmx.mbeanserver.JmxMBeanServer@4ba7cde3
[junit4:junit4]   2> 13779 T70 oasc.SolrCore.initDirectoryFactory org.apache.solr.core.MockDirectoryFactory
[junit4:junit4]   2> 13779 T70 oasc.CachingDirectoryFactory.get return new directory for /mnt/ssd/jenkins/workspace/Lucene-Solr-trunk-Linux/solr/build/solr-core/test/J1/./org.apache.solr.cloud.UnloadDistributedZkTest-1361642189188/jetty2 forceNew:false
[junit4:junit4]   2> 13779 T70 oasc.CachingDirectoryFactory.close Releasing directory:/mnt/ssd/jenkins/workspace/Lucene-Solr-trunk-Linux/solr/build/solr-core/test/J1/./org.apache.solr.cloud.UnloadDistributedZkTest-1361642189188/jetty2
[junit4:junit4]   2> 13780 T70 oasc.SolrCore.getNewIndexDir New index directory detected: old=null new=./org.apache.solr.cloud.UnloadDistributedZkTest-1361642189188/jetty2/index/
[junit4:junit4]   2> 13780 T70 oasc.SolrCore.initIndex WARNING [collection1] Solr index directory './org.apache.solr.cloud.UnloadDistributedZkTest-1361642189188/jetty2/index' doesn't exist. Creating new index...
[junit4:junit4]   2> 13781 T70 oasc.CachingDirectoryFactory.get return new directory for /mnt/ssd/jenkins/workspace/Lucene-Solr-trunk-Linux/solr/build/solr-core/test/J1/./org.apache.solr.cloud.UnloadDistributedZkTest-1361642189188/jetty2/index forceNew:false
[junit4:junit4]   2> 13782 T70 oasc.SolrDeletionPolicy.onCommit SolrDeletionPolicy.onCommit: commits:num=1
[junit4:junit4]   2> 		commit{dir=MockDirWrapper(org.apache.lucene.store.RAMDirectory@6e0c7dc6 lockFactory=org.apache.lucene.store.NativeFSLockFactory@3f02ae),segFN=segments_1,generation=1,filenames=[segments_1]
[junit4:junit4]   2> 13783 T70 oasc.SolrDeletionPolicy.updateCommits newest commit = 1[segments_1]
[junit4:junit4]   2> 13783 T70 oasc.CachingDirectoryFactory.close Releasing directory:/mnt/ssd/jenkins/workspace/Lucene-Solr-trunk-Linux/solr/build/solr-core/test/J1/./org.apache.solr.cloud.UnloadDistributedZkTest-1361642189188/jetty2/index
[junit4:junit4]   2> 13785 T70 oasup.UpdateRequestProcessorChain.init inserting DistributedUpdateProcessorFactory into updateRequestProcessorChain "dedupe"
[junit4:junit4]   2> 13785 T70 oasup.UpdateRequestProcessorChain.init inserting DistributedUpdateProcessorFactory into updateRequestProcessorChain "stored_sig"
[junit4:junit4]   2> 13786 T70 oasup.UpdateRequestProcessorChain.init inserting DistributedUpdateProcessorFactory into updateRequestProcessorChain "distrib-dup-test-chain-implicit"
[junit4:junit4]   2> 13786 T70 oasc.RequestHandlers.initHandlersFromConfig created standard: solr.StandardRequestHandler
[junit4:junit4]   2> 13792 T70 oasc.RequestHandlers.initHandlersFromConfig created /get: solr.RealTimeGetHandler
[junit4:junit4]   2> 13792 T70 oasc.RequestHandlers.initHandlersFromConfig adding lazy requestHandler: solr.ReplicationHandler
[junit4:junit4]   2> 13792 T70 oasc.RequestHandlers.initHandlersFromConfig created /replication: solr.ReplicationHandler
[junit4:junit4]   2> 13793 T70 oasc.RequestHandlers.initHandlersFromConfig created /update: solr.UpdateRequestHandler
[junit4:junit4]   2> 13794 T70 oasc.RequestHandlers.initHandlersFromConfig created /admin/: org.apache.solr.handler.admin.AdminHandlers
[junit4:junit4]   2> 13797 T70 oashl.XMLLoader.init xsltCacheLifetimeSeconds=60
[junit4:junit4]   2> 13800 T70 oasc.CachingDirectoryFactory.close Releasing directory:/mnt/ssd/jenkins/workspace/Lucene-Solr-trunk-Linux/solr/build/solr-core/test/J1/./org.apache.solr.cloud.UnloadDistributedZkTest-1361642189188/jetty2
[junit4:junit4]   2> 13800 T70 oass.SolrIndexSearcher.<init> Opening Searcher@2725d7bb main
[junit4:junit4]   2> 13800 T70 oasu.UpdateHandler.clearLog Clearing tlog files, tlogDir=./org.apache.solr.cloud.UnloadDistributedZkTest-1361642189188/jetty2/tlog
[junit4:junit4]   2> 13801 T70 oasu.CommitTracker.<init> Hard AutoCommit: disabled
[junit4:junit4]   2> 13801 T70 oasu.CommitTracker.<init> Soft AutoCommit: disabled
[junit4:junit4]   2> 13809 T71 oasc.SolrCore.registerSearcher [collection1] Registered new searcher Searcher@2725d7bb main{StandardDirectoryReader(segments_1:1)}
[junit4:junit4]   2> 13812 T70 oasc.ZkController.publish publishing core=collection1 state=down
[junit4:junit4]   2> 13813 T70 oasc.ZkController.publish numShards not found on descriptor - reading it from system property
[junit4:junit4]   2> 15046 T36 oascc.ZkStateReader.updateClusterState Updating cloud state from ZooKeeper... 
[junit4:junit4]   2> 15047 T36 oasc.Overseer$ClusterStateUpdater.updateState Update state numShards=2 message={
[junit4:junit4]   2> 	  "numShards":"2",
[junit4:junit4]   2> 	  "core":"collection1",
[junit4:junit4]   2> 	  "collection":"collection1",
[junit4:junit4]   2> 	  "operation":"state",
[junit4:junit4]   2> 	  "shard":null,
[junit4:junit4]   2> 	  "node_name":"127.0.0.1:50157_",
[junit4:junit4]   2> 	  "roles":null,
[junit4:junit4]   2> 	  "base_url":"http://127.0.0.1:50157",
[junit4:junit4]   2> 	  "state":"down"}
[junit4:junit4]   2> 15047 T36 oasc.Overseer$ClusterStateUpdater.updateState Collection already exists with numShards=2
[junit4:junit4]   2> 15048 T36 oasc.Overseer$ClusterStateUpdater.updateState Assigning new node to shard shard=shard1
[junit4:junit4]   2> 15053 T54 oascc.ZkStateReader$2.process A cluster state change: WatchedEvent state:SyncConnected type:NodeDataChanged path:/clusterstate.json, has occurred - updating... (live nodes size: 3)
[junit4:junit4]   2> 15053 T35 oascc.ZkStateReader$2.process A cluster state change: WatchedEvent state:SyncConnected type:NodeDataChanged path:/clusterstate.json, has occurred - updating... (live nodes size: 3)
[junit4:junit4]   2> 15053 T41 oascc.ZkStateReader$2.process A cluster state change: WatchedEvent state:SyncConnected type:NodeDataChanged path:/clusterstate.json, has occurred - updating... (live nodes size: 3)
[junit4:junit4]   2> 15053 T69 oascc.ZkStateReader$2.process A cluster state change: WatchedEvent state:SyncConnected type:NodeDataChanged path:/clusterstate.json, has occurred - updating... (live nodes size: 3)
[junit4:junit4]   2> 15814 T70 oasc.CoreContainer.registerCore registering core: collection1
[junit4:junit4]   2> 15815 T70 oasc.ZkController.register Register replica - core:collection1 address:http://127.0.0.1:50157 collection:collection1 shard:shard1
[junit4:junit4]   2> 15816 T70 oascc.SolrZkClient.makePath makePath: /collections/collection1/leader_elect/shard1/election
[junit4:junit4]   2> 15822 T17 oazs.PrepRequestProcessor.pRequest Got user-level KeeperException when processing sessionid:0x13d0832f20a0008 type:delete cxid:0x45 zxid:0x7e txntype:-1 reqpath:n/a Error Path:/solr/collections/collection1/leaders/shard1 Error:KeeperErrorCode = NoNode for /solr/collections/collection1/leaders/shard1
[junit4:junit4]   2> 15824 T70 oasc.ShardLeaderElectionContext.runLeaderProcess Running the leader process.
[junit4:junit4]   2> 15824 T17 oazs.PrepRequestProcessor.pRequest Got user-level KeeperException when processing sessionid:0x13d0832f20a0008 type:create cxid:0x46 zxid:0x7f txntype:-1 reqpath:n/a Error Path:/solr/overseer Error:KeeperErrorCode = NodeExists for /solr/overseer
[junit4:junit4]   2> 15826 T70 oasc.ShardLeaderElectionContext.waitForReplicasToComeUp Enough replicas found to continue.
[junit4:junit4]   2> 15826 T70 oasc.ShardLeaderElectionContext.runLeaderProcess I may be the new leader - try and sync
[junit4:junit4]   2> 15826 T70 oasc.SyncStrategy.sync Sync replicas to http://127.0.0.1:50157/collection1/
[junit4:junit4]   2> 15827 T70 oasc.SyncStrategy.syncReplicas Sync Success - now sync replicas to me
[junit4:junit4]   2> 15827 T70 oasc.SyncStrategy.syncToMe http://127.0.0.1:50157/collection1/ has no replicas
[junit4:junit4]   2> 15827 T70 oasc.ShardLeaderElectionContext.runLeaderProcess I am the new leader: http://127.0.0.1:50157/collection1/
[junit4:junit4]   2> 15827 T70 oascc.SolrZkClient.makePath makePath: /collections/collection1/leaders/shard1
[junit4:junit4]   2> 15832 T17 oazs.PrepRequestProcessor.pRequest Got user-level KeeperException when processing sessionid:0x13d0832f20a0008 type:create cxid:0x4f zxid:0x82 txntype:-1 reqpath:n/a Error Path:/solr/overseer Error:KeeperErrorCode = NodeExists for /solr/overseer
[junit4:junit4]   2> 16558 T36 oascc.ZkStateReader.updateClusterState Updating cloud state from ZooKeeper... 
[junit4:junit4]   2> 16564 T69 oascc.ZkStateReader$2.process A cluster state change: WatchedEvent state:SyncConnected type:NodeDataChanged path:/clusterstate.json, has occurred - updating... (live nodes size: 3)
[junit4:junit4]   2> 16564 T41 oascc.ZkStateReader$2.process A cluster state change: WatchedEvent state:SyncConnected type:NodeDataChanged path:/clusterstate.json, has occurred - updating... (live nodes size: 3)
[junit4:junit4]   2> 16564 T35 oascc.ZkStateReader$2.process A cluster state change: WatchedEvent state:SyncConnected type:NodeDataChanged path:/clusterstate.json, has occurred - updating... (live nodes size: 3)
[junit4:junit4]   2> 16565 T54 oascc.ZkStateReader$2.process A cluster state change: WatchedEvent state:SyncConnected type:NodeDataChanged path:/clusterstate.json, has occurred - updating... (live nodes size: 3)
[junit4:junit4]   2> 16585 T70 oasc.ZkController.register We are http://127.0.0.1:50157/collection1/ and leader is http://127.0.0.1:50157/collection1/
[junit4:junit4]   2> 16585 T70 oasc.ZkController.register No LogReplay needed for core=collection1 baseURL=http://127.0.0.1:50157
[junit4:junit4]   2> 16585 T70 oasc.ZkController.checkRecovery I am the leader, no recovery necessary
[junit4:junit4]   2> 16585 T70 oasc.ZkController.publish publishing core=collection1 state=active
[junit4:junit4]   2> 16586 T70 oasc.ZkController.publish numShards not found on descriptor - reading it from system property
[junit4:junit4]   2> 16589 T70 oascc.ZkStateReader.updateClusterState Updating cloud state from ZooKeeper... 
[junit4:junit4]   2> 16590 T12 oass.SolrDispatchFilter.init user.dir=/mnt/ssd/jenkins/workspace/Lucene-Solr-trunk-Linux/solr/build/solr-core/test/J1
[junit4:junit4]   2> 16590 T12 oass.SolrDispatchFilter.init SolrDispatchFilter.init() done
[junit4:junit4]   2> 16591 T12 oascsi.HttpClientUtil.createClient Creating new http client, config:maxConnections=128&maxConnectionsPerHost=32&followRedirects=false
[junit4:junit4]   2> 16646 T12 oejs.Server.doStart jetty-8.1.8.v20121106
[junit4:junit4]   2> 16649 T12 oejs.AbstractConnector.doStart Started SelectChannelConnector@127.0.0.1:50956
[junit4:junit4]   2> 16649 T12 oass.SolrDispatchFilter.init SolrDispatchFilter.init()
[junit4:junit4]   2> 16650 T12 oasc.SolrResourceLoader.locateSolrHome JNDI not configured for solr (NoInitialContextEx)
[junit4:junit4]   2> 16650 T12 oasc.SolrResourceLoader.locateSolrHome using system property solr.solr.home: /mnt/ssd/jenkins/workspace/Lucene-Solr-trunk-Linux/solr/build/solr-core/test/J1/./org.apache.solr.cloud.UnloadDistributedZkTest-jetty3-1361642205696
[junit4:junit4]   2> 16650 T12 oasc.CoreContainer$Initializer.initialize looking for solr.xml: /mnt/ssd/jenkins/workspace/Lucene-Solr-trunk-Linux/solr/build/solr-core/test/J1/./org.apache.solr.cloud.UnloadDistributedZkTest-jetty3-1361642205696/solr.xml
[junit4:junit4]   2> 16650 T12 oasc.CoreContainer.<init> New CoreContainer 710302007
[junit4:junit4]   2> 16651 T12 oasc.CoreContainer.load Loading CoreContainer using Solr Home: '/mnt/ssd/jenkins/workspace/Lucene-Solr-trunk-Linux/solr/build/solr-core/test/J1/./org.apache.solr.cloud.UnloadDistributedZkTest-jetty3-1361642205696/'
[junit4:junit4]   2> 16651 T12 oasc.SolrResourceLoader.<init> new SolrResourceLoader for directory: '/mnt/ssd/jenkins/workspace/Lucene-Solr-trunk-Linux/solr/build/solr-core/test/J1/./org.apache.solr.cloud.UnloadDistributedZkTest-jetty3-1361642205696/'
[junit4:junit4]   2> 16669 T12 oashc.HttpShardHandlerFactory.getParameter Setting socketTimeout to: 120000
[junit4:junit4]   2> 16669 T12 oashc.HttpShardHandlerFactory.getParameter Setting urlScheme to: http://
[junit4:junit4]   2> 16670 T12 oashc.HttpShardHandlerFactory.getParameter Setting connTimeout to: 15000
[junit4:junit4]   2> 16670 T12 oashc.HttpShardHandlerFactory.getParameter Setting maxConnectionsPerHost to: 20
[junit4:junit4]   2> 16670 T12 oashc.HttpShardHandlerFactory.getParameter Setting corePoolSize to: 0
[junit4:junit4]   2> 16670 T12 oashc.HttpShardHandlerFactory.getParameter Setting maximumPoolSize to: 2147483647
[junit4:junit4]   2> 16671 T12 oashc.HttpShardHandlerFactory.getParameter Setting maxThreadIdleTime to: 5
[junit4:junit4]   2> 16671 T12 oashc.HttpShardHandlerFactory.getParameter Setting sizeOfQueue to: -1
[junit4:junit4]   2> 16671 T12 oashc.HttpShardHandlerFactory.getParameter Setting fairnessPolicy to: false
[junit4:junit4]   2> 16672 T12 oascsi.HttpClientUtil.createClient Creating new http client, config:maxConnectionsPerHost=20&maxConnections=10000&socketTimeout=120000&connTimeout=15000&retry=false
[junit4:junit4]   2> 16677 T12 oasc.CoreContainer.load Registering Log Listener
[junit4:junit4]   2> 16685 T12 oasc.CoreContainer.initZooKeeper Zookeeper client=127.0.0.1:44589/solr
[junit4:junit4]   2> 16686 T12 oasc.ZkController.checkChrootPath zkHost includes chroot
[junit4:junit4]   2> 16686 T12 oaz.ZooKeeper.<init> Initiating client connection, connectString=127.0.0.1:44589 sessionTimeout=60000 watcher=org.apache.solr.common.cloud.ConnectionManager@eda532c
[junit4:junit4]   2> 16687 T12 oascc.ConnectionManager.waitForConnected Waiting for client to connect to ZooKeeper
[junit4:junit4]   2> 16687 T81 oaz.ClientCnxn$SendThread.logStartConnect Opening socket connection to server localhost.localdomain/127.0.0.1:44589. Will not attempt to authenticate using SASL (access denied ("javax.security.auth.AuthPermission" "getLoginConfiguration"))
[junit4:junit4]   2> 16688 T81 oaz.ClientCnxn$SendThread.primeConnection Socket connection established to localhost.localdomain/127.0.0.1:44589, initiating session
[junit4:junit4]   2> 16688 T14 oazs.NIOServerCnxnFactory.run Accepted socket connection from /127.0.0.1:54359
[junit4:junit4]   2> 16688 T14 oazs.ZooKeeperServer.processConnectRequest Client attempting to establish new session at /127.0.0.1:54359
[junit4:junit4]   2> 16689 T16 oazs.ZooKeeperServer.finishSessionInit Established session 0x13d0832f20a0009 with negotiated timeout 20000 for client /127.0.0.1:54359
[junit4:junit4]   2> 16689 T81 oaz.ClientCnxn$SendThread.onConnected Session establishment complete on server localhost.localdomain/127.0.0.1:44589, sessionid = 0x13d0832f20a0009, negotiated timeout = 20000
[junit4:junit4]   2> 16689 T82 oascc.ConnectionManager.process Watcher org.apache.solr.common.cloud.ConnectionManager@eda532c name:ZooKeeperConnection Watcher:127.0.0.1:44589 got event WatchedEvent state:SyncConnected type:None path:null path:null type:None
[junit4:junit4]   2> 16690 T12 oascc.ConnectionManager.waitForConnected Client is connected to ZooKeeper
[junit4:junit4]   2> 16691 T17 oazs.PrepRequestProcessor.pRequest2Txn Processed session termination for sessionid: 0x13d0832f20a0009
[junit4:junit4]   2> 16691 T82 oaz.ClientCnxn$EventThread.run EventThread shut down
[junit4:junit4]   2> 16691 T14 oazs.NIOServerCnxn.closeSock Closed socket connection for client /127.0.0.1:54359 which had sessionid 0x13d0832f20a0009
[junit4:junit4]   2> 16691 T12 oaz.ZooKeeper.close Session: 0x13d0832f20a0009 closed
[junit4:junit4]   2> 16692 T12 oascsi.HttpClientUtil.createClient Creating new http client, config:maxConnections=500&maxConnectionsPerHost=16&socketTimeout=120000&connTimeout=15000
[junit4:junit4]   2> 16694 T12 oaz.ZooKeeper.<init> Initiating client connection, connectString=127.0.0.1:44589/solr sessionTimeout=30000 watcher=org.apache.solr.common.cloud.ConnectionManager@1247df10
[junit4:junit4]   2> 16695 T12 oascc.ConnectionManager.waitForConnected Waiting for client to connect to ZooKeeper
[junit4:junit4]   2> 16695 T83 oaz.ClientCnxn$SendThread.logStartConnect Opening socket connection to server localhost.localdomain/127.0.0.1:44589. Will not attempt to authenticate using SASL (access denied ("javax.security.auth.AuthPermission" "getLoginConfiguration"))
[junit4:junit4]   2> 16695 T83 oaz.ClientCnxn$SendThread.primeConnection Socket connection established to localhost.localdomain/127.0.0.1:44589, initiating session
[junit4:junit4]   2> 16696 T14 oazs.NIOServerCnxnFactory.run Accepted socket connection from /127.0.0.1:54360
[junit4:junit4]   2> 16696 T14 oazs.ZooKeeperServer.processConnectRequest Client attempting to establish new session at /127.0.0.1:54360
[junit4:junit4]   2> 16697 T16 oazs.ZooKeeperServer.finishSessionInit Established session 0x13d0832f20a000a with negotiated timeout 20000 for client /127.0.0.1:54360
[junit4:junit4]   2> 16697 T83 oaz.ClientCnxn$SendThread.onConnected Session establishment complete on server localhost.localdomain/127.0.0.1:44589, sessionid = 0x13d0832f20a000a, negotiated timeout = 20000
[junit4:junit4]   2> 16697 T84 oascc.ConnectionManager.process Watcher org.apache.solr.common.cloud.ConnectionManager@1247df10 name:ZooKeeperConnection Watcher:127.0.0.1:44589/solr got event WatchedEvent state:SyncConnected type:None path:null path:null type:None
[junit4:junit4]   2> 16697 T12 oascc.ConnectionManager.waitForConnected Client is connected to ZooKeeper
[junit4:junit4]   2> 16698 T17 oazs.PrepRequestProcessor.pRequest Got user-level KeeperException when processing sessionid:0x13d0832f20a000a type:create cxid:0x1 zxid:0x8f txntype:-1 reqpath:n/a Error Path:/solr/overseer Error:KeeperErrorCode = NodeExists for /solr/overseer
[junit4:junit4]   2> 16699 T17 oazs.PrepRequestProcessor.pRequest Got user-level KeeperException when processing sessionid:0x13d0832f20a000a type:create cxid:0x2 zxid:0x90 txntype:-1 reqpath:n/a Error Path:/solr/overseer Error:KeeperErrorCode = NodeExists for /solr/overseer
[junit4:junit4]   2> 16700 T12 oascc.ZkStateReader.createClusterStateWatchersAndUpdate Updating cluster state from ZooKeeper... 
[junit4:junit4]   2> 17702 T12 oasc.ZkController.createEphemeralLiveNode Register node as live in ZooKeeper:/live_nodes/127.0.0.1:50956_
[junit4:junit4]   2> 17703 T17 oazs.PrepRequestProcessor.pRequest Got user-level KeeperException when processing sessionid:0x13d0832f20a000a type:delete cxid:0x9 zxid:0x91 txntype:-1 reqpath:n/a Error Path:/solr/live_nodes/127.0.0.1:50956_ Error:KeeperErrorCode = NoNode for /solr/live_nodes/127.0.0.1:50956_
[junit4:junit4]   2> 17703 T12 oascc.SolrZkClient.makePath makePath: /live_nodes/127.0.0.1:50956_
[junit4:junit4]   2> 17705 T41 oascc.ZkStateReader$2.process A cluster state change: WatchedEvent state:SyncConnected type:NodeChildrenChanged path:/live_nodes, has occurred - updating... (live nodes size: 3)
[junit4:junit4]   2> 17705 T35 oascc.ZkStateReader$2.process A cluster state change: WatchedEvent state:SyncConnected type:NodeChildrenChanged path:/live_nodes, has occurred - updating... (live nodes size: 3)
[junit4:junit4]   2> 17705 T54 oascc.ZkStateReader$2.process A cluster state change: WatchedEvent state:SyncConnected type:NodeChildrenChanged path:/live_nodes, has occurred - updating... (live nodes size: 3)
[junit4:junit4]   2> 17705 T69 oascc.ZkStateReader$2.process A cluster state change: WatchedEvent state:SyncConnected type:NodeChildrenChanged path:/live_nodes, has occurred - updating... (live nodes size: 3)
[junit4:junit4]   2> 17706 T84 oascc.ZkStateReader$3.process Updating live nodes... (4)
[junit4:junit4]   2> 17708 T69 oascc.ZkStateReader$3.process Updating live nodes... (4)
[junit4:junit4]   2> 17708 T41 oascc.ZkStateReader$3.process Updating live nodes... (4)
[junit4:junit4]   2> 17712 T54 oascc.ZkStateReader$3.process Updating live nodes... (4)
[junit4:junit4]   2> 17712 T35 oascc.ZkStateReader$3.process Updating live nodes... (4)
[junit4:junit4]   2> 17720 T85 oasc.CoreContainer.create Creating SolrCore 'collection1' using instanceDir: /mnt/ssd/jenkins/workspace/Lucene-Solr-trunk-Linux/solr/build/solr-core/test/J1/./org.apache.solr.cloud.UnloadDistributedZkTest-jetty3-1361642205696/collection1
[junit4:junit4]   2> 17720 T85 oasc.ZkController.createCollectionZkNode Check for collection zkNode:collection1
[junit4:junit4]   2> 17721 T85 oasc.ZkController.createCollectionZkNode Collection zkNode exists
[junit4:junit4]   2> 17721 T85 oasc.ZkController.readConfigName Load collection config from:/collections/collection1
[junit4:junit4]   2> 17722 T85 oasc.SolrResourceLoader.<init> new SolrResourceLoader for directory: '/mnt/ssd/jenkins/workspace/Lucene-Solr-trunk-Linux/solr/build/solr-core/test/J1/./org.apache.solr.cloud.UnloadDistributedZkTest-jetty3-1361642205696/collection1/'
[junit4:junit4]   2> 17723 T85 oasc.SolrResourceLoader.replaceClassLoader Adding 'file:/mnt/ssd/jenkins/workspace/Lucene-Solr-trunk-Linux/solr/build/solr-core/test/J1/org.apache.solr.cloud.UnloadDistributedZkTest-jetty3-1361642205696/collection1/lib/README' to classloader
[junit4:junit4]   2> 17723 T85 oasc.SolrResourceLoader.replaceClassLoader Adding 'file:/mnt/ssd/jenkins/workspace/Lucene-Solr-trunk-Linux/solr/build/solr-core/test/J1/org.apache.solr.cloud.UnloadDistributedZkTest-jetty3-1361642205696/collection1/lib/classes/' to classloader
[junit4:junit4]   2> 17756 T85 oasc.SolrConfig.<init> Using Lucene MatchVersion: LUCENE_50
[junit4:junit4]   2> 17796 T85 oasc.SolrConfig.<init> Loaded SolrConfig: solrconfig.xml
[junit4:junit4]   2> 17797 T85 oass.IndexSchema.readSchema Reading Solr Schema
[junit4:junit4]   2> 17807 T85 oass.IndexSchema.readSchema Schema name=test
[junit4:junit4]   2> 18077 T36 oascc.ZkStateReader.updateClusterState Updating cloud state from ZooKeeper... 
[junit4:junit4]   2> 18078 T36 oasc.Overseer$ClusterStateUpdater.updateState Update state numShards=2 message={
[junit4:junit4]   2> 	  "numShards":"2",
[junit4:junit4]   2> 	  "core":"collection1",
[junit4:junit4]   2> 	  "collection":"collection1",
[junit4:junit4]   2> 	  "operation":"state",
[junit4:junit4]   2> 	  "shard":"shard1",
[junit4:junit4]   2> 	  "node_name":"127.0.0.1:50157_",
[junit4:junit4]   2> 	  "roles":null,
[junit4:junit4]   2> 	  "base_url":"http://127.0.0.1:50157",
[junit4:junit4]   2> 	  "state":"active"}
[junit4:junit4]   2> 18082 T54 oascc.ZkStateReader$2.process A cluster state change: WatchedEvent state:SyncConnected type:NodeDataChanged path:/clusterstate.json, has occurred - updating... (live nodes size: 4)
[junit4:junit4]   2> 18082 T35 oascc.ZkStateReader$2.process A cluster state change: WatchedEvent state:SyncConnected type:NodeDataChanged path:/clusterstate.json, has occurred - updating... (live nodes size: 4)
[junit4:junit4]   2> 18083 T41 oascc.ZkStateReader$2.process A cluster state change: WatchedEvent state:SyncConnected type:NodeDataChanged path:/clusterstate.json, has occurred - updating... (live nodes size: 4)
[junit4:junit4]   2> 18082 T69 oascc.ZkStateReader$2.process A cluster state change: WatchedEvent state:SyncConnected type:NodeDataChanged path:/clusterstate.json, has occurred - updating... (live nodes size: 4)
[junit4:junit4]   2> 18082 T84 oascc.ZkStateReader$2.process A cluster state change: WatchedEvent state:SyncConnected type:NodeDataChanged path:/clusterstate.json, has occurred - updating... (live nodes size: 4)
[junit4:junit4]   2> 18150 T85 oass.OpenExchangeRatesOrgProvider.init Initialized with rates=open-exchange-rates.json, refreshInterval=1440.
[junit4:junit4]   2> 18157 T85 oass.IndexSchema.readSchema default search field in schema is text
[junit4:junit4]   2> 18159 T85 oass.IndexSchema.readSchema unique key field: id
[junit4:junit4]   2> 18177 T85 oass.FileExchangeRateProvider.reload Reloading exchange rates from file currency.xml
[junit4:junit4]   2> 18180 T85 oass.FileExchangeRateProvider.reload Reloading exchange rates from file currency.xml
[junit4:junit4]   2> 18183 T85 oass.OpenExchangeRatesOrgProvider.reload Reloading exchange rates from open-exchange-rates.json
[junit4:junit4]   2> 18185 T85 oass.OpenExchangeRatesOrgProvider.reload Reloading exchange rates from open-exchange-rates.json
[junit4:junit4]   2> 18186 T85 oasc.SolrCore.<init> [collection1] Opening new SolrCore at /mnt/ssd/jenkins/workspace/Lucene-Solr-trunk-Linux/solr/build/solr-core/test/J1/./org.apache.solr.cloud.UnloadDistributedZkTest-jetty3-1361642205696/collection1/, dataDir=./org.apache.solr.cloud.UnloadDistributedZkTest-1361642189188/jetty3/
[junit4:junit4]   2> 18186 T85 oasc.JmxMonitoredMap.<init> JMX monitoring is enabled. Adding Solr mbeans to JMX Server: com.sun.jmx.mbeanserver.JmxMBeanServer@4ba7cde3
[junit4:junit4]   2> 18186 T85 oasc.SolrCore.initDirectoryFactory org.apache.solr.core.MockDirectoryFactory
[junit4:junit4]   2> 18187 T85 oasc.CachingDirectoryFactory.get return new directory for /mnt/ssd/jenkins/workspace/Lucene-Solr-trunk-Linux/solr/build/solr-core/test/J1/./org.apache.solr.cloud.UnloadDistributedZkTest-1361642189188/jetty3 forceNew:false
[junit4:junit4]   2> 18187 T85 oasc.CachingDirectoryFactory.close Releasing directory:/mnt/ssd/jenkins/workspace/Lucene-Solr-trunk-Linux/solr/build/solr-core/test/J1/./org.apache.solr.cloud.UnloadDistributedZkTest-1361642189188/jetty3
[junit4:junit4]   2> 18187 T85 oasc.SolrCore.getNewIndexDir New index directory detected: old=null new=./org.apache.solr.cloud.UnloadDistributedZkTest-1361642189188/jetty3/index/
[junit4:junit4]   2> 18188 T85 oasc.SolrCore.initIndex WARNING [collection1] Solr index directory './org.apache.solr.cloud.UnloadDistributedZkTest-1361642189188/jetty3/index' doesn't exist. Creating new index...
[junit4:junit4]   2> 18188 T85 oasc.CachingDirectoryFactory.get return new directory for /mnt/ssd/jenkins/workspace/Lucene-Solr-trunk-Linux/solr/build/solr-core/test/J1/./org.apache.solr.cloud.UnloadDistributedZkTest-1361642189188/jetty3/index forceNew:false
[junit4:junit4]   2> 18190 T85 oasc.SolrDeletionPolicy.onCommit SolrDeletionPolicy.onCommit: commits:num=1
[junit4:junit4]   2> 		commit{dir=MockDirWrapper(org.apache.lucene.store.RAMDirectory@163221ba lockFactory=org.apache.lucene.store.NativeFSLockFactory@153d4e5a),segFN=segments_1,generation=1,filenames=[segments_1]
[junit4:junit4]   2> 18190 T85 oasc.SolrDeletionPolicy.updateCommits newest commit = 1[segments_1]
[junit4:junit4]   2> 18190 T85 oasc.CachingDirectoryFactory.close Releasing directory:/mnt/ssd/jenkins/workspace/Lucene-Solr-trunk-Linux/solr/build/solr-core/test/J1/./org.apache.solr.cloud.UnloadDistributedZkTest-1361642189188/jetty3/index
[junit4:junit4]   2> 18193 T85 oasup.UpdateRequestProcessorChain.init inserting DistributedUpdateProcessorFactory into updateRequestProcessorChain "dedupe"
[junit4:junit4]   2> 18193 T85 oasup.UpdateRequestProcessorChain.init inserting DistributedUpdateProcessorFactory into updateRequestProcessorChain "stored_sig"
[junit4:junit4]   2> 18194 T85 oasup.UpdateRequestProcessorChain.init inserting DistributedUpdateProcessorFactory into updateRequestProcessorChain "distrib-dup-test-chain-implicit"
[junit4:junit4]   2> 18195 T85 oasc.RequestHandlers.initHandlersFromConfig created standard: solr.StandardRequestHandler
[junit4:junit4]   2> 18195 T85 oasc.RequestHandlers.initHandlersFromConfig created /get: solr.RealTimeGetHandler
[junit4:junit4]   2> 18196 T85 oasc.RequestHandlers.initHandlersFromConfig adding lazy requestHandler: solr.ReplicationHandler
[junit4:junit4]   2> 18196 T85 oasc.RequestHandlers.initHandlersFromConfig created /replication: solr.ReplicationHandler
[junit4:junit4]   2> 18197 T85 oasc.RequestHandlers.initHandlersFromConfig created /update: solr.UpdateRequestHandler
[junit4:junit4]   2> 18197 T85 oasc.RequestHandlers.initHandlersFromConfig created /admin/: org.apache.solr.handler.admin.AdminHandlers
[junit4:junit4]   2> 18200 T85 oashl.XMLLoader.init xsltCacheLifetimeSeconds=60
[junit4:junit4]   2> 18202 T85 oasc.CachingDirectoryFactory.close Releasing directory:/mnt/ssd/jenkins/workspace/Lucene-Solr-trunk-Linux/solr/build/solr-core/test/J1/./org.apache.solr.cloud.UnloadDistributedZkTest-1361642189188/jetty3
[junit4:junit4]   2> 18202 T85 oass.SolrIndexSearcher.<init> Opening Searcher@5efff410 main
[junit4:junit4]   2> 18202 T85 oasu.UpdateHandler.clearLog Clearing tlog files, tlogDir=./org.apache.solr.cloud.UnloadDistributedZkTest-1361642189188/jetty3/tlog
[junit4:junit4]   2> 18203 T85 oasu.CommitTracker.<init> Hard AutoCommit: disabled
[junit4:junit4]   2> 18203 T85 oasu.CommitTracker.<init> Soft AutoCommit: disabled
[junit4:junit4]   2> 18209 T86 oasc.SolrCore.registerSearcher [collection1] Registered new searcher Searcher@5efff410 main{StandardDirectoryReader(segments_1:1)}
[junit4:junit4]   2> 18211 T85 oasc.ZkController.publish publishing core=collection1 state=down
[junit4:junit4]   2> 18211 T85 oasc.ZkController.publish numShards not found on descriptor - reading it from system property
[junit4:junit4]   2> 19587 T36 oascc.ZkStateReader.updateClusterState Updating cloud state from ZooKeeper... 
[junit4:junit4]   2> 19588 T36 oasc.Overseer$ClusterStateUpdater.updateState Update state numShards=2 message={
[junit4:junit4]   2> 	  "numShards":"2",
[junit4:junit4]   2> 	  "core":"collection1",
[junit4:junit4]   2> 	  "collection":"collection1",
[junit4:junit4]   2> 	  "operation":"state",
[junit4:junit4]   2> 	  "shard":null,
[junit4:junit4]   2> 	  "node_name":"127.0.0.1:50956_",
[junit4:junit4]   2> 	  "roles":null,
[junit4:junit4]   2> 	  "base_url":"http://127.0.0.1:50956",
[junit4:junit4]   2> 	  "state":"down"}
[junit4:junit4]   2> 19589 T36 oasc.Overseer$ClusterStateUpdater.updateState Collection already exists with numShards=2
[junit4:junit4]   2> 19589 T36 oasc.Overseer$ClusterStateUpdater.updateState Assigning new node to shard shard=shard2
[junit4:junit4]   2> 19594 T41 oascc.ZkStateReader$2.process A cluster state change: WatchedEvent state:SyncConnected type:NodeDataChanged path:/clusterstate.json, has occurred - updating... (live nodes size: 4)
[junit4:junit4]   2> 19594 T69 oascc.ZkStateReader$2.process A cluster state change: WatchedEvent state:SyncConnected type:NodeDataChanged path:/clusterstate.json, has occurred - updating... (live nodes size: 4)
[junit4:junit4]   2> 19594 T84 oascc.ZkStateReader$2.process A cluster state change: WatchedEvent state:SyncConnected type:NodeDataChanged path:/clusterstate.json, has occurred - updating... (live nodes size: 4)
[junit4:junit4]   2> 19594 T54 oascc.ZkStateReader$2.process A cluster state change: WatchedEvent state:SyncConnected type:NodeDataChanged path:/clusterstate.json, has occurred - updating... (live nodes size: 4)
[junit4:junit4]   2> 19594 T35 oascc.ZkStateReader$2.process A cluster state change: WatchedEvent state:SyncConnected type:NodeDataChanged path:/clusterstate.json, has occurred - updating... (live nodes size: 4)
[junit4:junit4]   2> 20213 T85 oasc.CoreContainer.registerCore registering core: collection1
[junit4:junit4]   2> 20214 T85 oasc.ZkController.register Register replica - core:collection1 address:http://127.0.0.1:50956 collection:collection1 shard:shard2
[junit4:junit4]   2> 20217 T85 oasc.ZkController.register We are http://127.0.0.1:50956/collection1/ and leader is http://127.0.0.1:33214/collection1/
[junit4:junit4]   2> 20218 T85 oasc.ZkController.register No LogReplay needed for core=collection1 baseURL=http://127.0.0.1:50956
[junit4:junit4]   2> 20218 T85 oasc.ZkController.checkRecovery Core needs to recover:collection1
[junit4:junit4]   2> 20218 T85 oasu.DefaultSolrCoreState.doRecovery Running recovery - first canceling any ongoing recovery
[junit4:junit4]   2> 20223 T85 oascc.ZkStateReader.updateClusterState Updating cloud state from ZooKeeper... 
[junit4:junit4]   2> 20224 T12 oass.SolrDispatchFilter.init user.dir=/mnt/ssd/jenkins/workspace/Lucene-Solr-trunk-Linux/solr/build/solr-core/test/J1
[junit4:junit4]   2> 20224 T12 oass.SolrDispatchFilter.init SolrDispatchFilter.init() done
[junit4:junit4]   2> 20225 T12 oascsi.HttpClientUtil.createClient Creating new http client, config:maxConnections=128&maxConnectionsPerHost=32&followRedirects=false
[junit4:junit4]   2> ASYNC  NEW_CORE C0 name=collection1 org.apache.solr.core.SolrCore@21082033 url=http://127.0.0.1:50956/collection1 node=127.0.0.1:50956_ C0_STATE=coll:collection1 core:collection1 props:{core=collection1, collection=collection1, shard=null, node_name=127.0.0.1:50956_, roles=null, base_url=http://127.0.0.1:50956, state=down}
[junit4:junit4]   2> 20226 T87 C0 P50956 oasc.RecoveryStrategy.run Starting recovery process.  core=collection1 recoveringAfterStartup=true
[junit4:junit4]   2> 20228 T87 C0 P50956 oasc.RecoveryStrategy.doRecovery ###### startupVersions=[]
[junit4:junit4]   2> 20228 T87 C0 P50956 oasc.ZkController.publish publishing core=collection1 state=recovering
[junit4:junit4]   2> 20228 T87 C0 P50956 oasc.ZkController.publish numShards not found on descriptor - reading it from system property
[junit4:junit4]   2> 20231 T87 C0 P50956 oascsi.HttpClientUtil.createClient Creating new http client, config:maxConnections=128&maxConnectionsPerHost=32&followRedirects=false
[junit4:junit4]   2> 20308 T12 oejs.Server.doStart jetty-8.1.8.v20121106
[junit4:junit4]   2> 20332 T12 oejs.AbstractConnector.doStart Started SelectChannelConnector@127.0.0.1:39683
[junit4:junit4]   2> 20333 T12 oass.SolrDispatchFilter.init SolrDispatchFilter.init()
[junit4:junit4]   2> 20334 T12 oasc.SolrResourceLoader.locateSolrHome JNDI not configured for solr (NoInitialContextEx)
[junit4:junit4]   2> 20334 T12 oasc.SolrResourceLoader.locateSolrHome using system property solr.solr.home: /mnt/ssd/jenkins/workspace/Lucene-Solr-trunk-Linux/solr/build/solr-core/test/J1/./org.apache.solr.cloud.UnloadDistributedZkTest-jetty4-1361642209328
[junit4:junit4]   2> 20335 T12 oasc.CoreContainer$Initializer.initialize looking for solr.xml: /mnt/ssd/jenkins/workspace/Lucene-Solr-trunk-Linux/solr/build/solr-core/test/J1/./org.apache.solr.cloud.UnloadDistributedZkTest-jetty4-1361642209328/solr.xml
[junit4:junit4]   2> 20335 T12 oasc.CoreContainer.<init> New CoreContainer 391556414
[junit4:junit4]   2> 20336 T12 oasc.CoreContainer.load Loading CoreContainer using Solr Home: '/mnt/ssd/jenkins/workspace/Lucene-Solr-trunk-Linux/solr/build/solr-core/test/J1/./org.apache.solr.cloud.UnloadDistributedZkTest-jetty4-1361642209328/'
[junit4:junit4]   2> 20336 T12 oasc.SolrResourceLoader.<init> new SolrResourceLoader for directory: '/mnt/ssd/jenkins/workspace/Lucene-Solr-trunk-Linux/solr/build/solr-core/test/J1/./org.apache.solr.cloud.UnloadDistributedZkTest-jetty4-1361642209328/'
[junit4:junit4]   2> 20370 T12 oashc.HttpShardHandlerFactory.getParameter Setting socketTimeout to: 120000
[junit4:junit4]   2> 20371 T12 oashc.HttpShardHandlerFactory.getParameter Setting urlScheme to: http://
[junit4:junit4]   2> 20371 T12 oashc.HttpShardHandlerFactory.getParameter Setting connTimeout to: 15000
[junit4:junit4]   2> 20372 T12 oashc.HttpShardHandlerFactory.getParameter Setting maxConnectionsPerHost to: 20
[junit4:junit4]   2> 20372 T12 oashc.HttpShardHandlerFactory.getParameter Setting corePoolSize to: 0
[junit4:junit4]   2> 20372 T12 oashc.HttpShardHandlerFactory.getParameter Setting maximumPoolSize to: 2147483647
[junit4:junit4]   2> 20373 T12 oashc.HttpShardHandlerFactory.getParameter Setting maxThreadIdleTime to: 5
[junit4:junit4]   2> 20373 T12 oashc.HttpShardHandlerFactory.getParameter Setting sizeOfQueue to: -1
[junit4:junit4]   2> 20373 T12 oashc.HttpShardHandlerFactory.getParameter Setting fairnessPolicy to: false
[junit4:junit4]   2> 20373 T12 oascsi.HttpClientUtil.createClient Creating new http client, config:maxConnectionsPerHost=20&maxConnections=10000&socketTimeout=120000&connTimeout=15000&retry=false
[junit4:junit4]   2> 20379 T12 oasc.CoreContainer.load Registering Log Listener
[junit4:junit4]   2> 20387 T12 oasc.CoreContainer.initZooKeeper Zookeeper client=127.0.0.1:44589/solr
[junit4:junit4]   2> 20388 T12 oasc.ZkController.checkChrootPath zkHost includes chroot
[junit4:junit4]   2> 20388 T12 oaz.ZooKeeper.<init> Initiating client connection, connectString=127.0.0.1:44589 sessionTimeout=60000 watcher=org.apache.solr.common.cloud.ConnectionManager@30b078b0
[junit4:junit4]   2> 20389 T12 oascc.ConnectionManager.waitForConnected Waiting for client to connect to ZooKeeper
[junit4:junit4]   2> 20389 T97 oaz.ClientCnxn$SendThread.logStartConnect Opening socket connection to server localhost.localdomain/127.0.0.1:44589. Will not attempt to authenticate using SASL (access denied ("javax.security.auth.AuthPermission" "getLoginConfiguration"))
[junit4:junit4]   2> 20390 T97 oaz.ClientCnxn$SendThread.primeConnection Socket connection established to localhost.localdomain/127.0.0.1:44589, initiating session
[junit4:junit4]   2> 20390 T14 oazs.NIOServerCnxnFactory.run Accepted socket connection from /127.0.0.1:54378
[junit4:junit4]   2> 20390 T14 oazs.ZooKeeperServer.processConnectRequest Client attempting to establish new session at /127.0.0.1:54378
[junit4:junit4]   2> 20391 T16 oazs.ZooKeeperServer.finishSessionInit Established session 0x13d0832f20a000b with negotiated timeout 20000 for client /127.0.0.1:54378
[junit4:junit4]   2> 20391 T97 oaz.ClientCnxn$SendThread.onConnected Session establishment complete on server localhost.localdomain/127.0.0.1:44589, sessionid = 0x13d0832f20a000b, negotiated timeout = 20000
[junit4:junit4]   2> 20391 T98 oascc.ConnectionManager.process Watcher org.apache.solr.common.cloud.ConnectionManager@30b078b0 name:ZooKeeperConnection Watcher:127.0.0.1:44589 got event WatchedEvent state:SyncConnected type:None path:null path:null type:None
[junit4:junit4]   2> 20392 T12 oascc.ConnectionManager.waitForConnected Client is connected to ZooKeeper
[junit4:junit4]   2> 20393 T17 oazs.PrepRequestProcessor.pRequest2Txn Processed session termination for sessionid: 0x13d0832f20a000b
[junit4:junit4]   2> 20394 T12 oaz.ZooKeeper.close Session: 0x13d0832f20a000b closed
[junit4:junit4]   2> 20394 T98 oaz.ClientCnxn$EventThread.run EventThread shut down
[junit4:junit4]   2> 20394 T14 oazs.NIOServerCnxn.closeSock Closed socket connection for client /127.0.0.1:54378 which had sessionid 0x13d0832f20a000b
[junit4:junit4]   2> 20394 T12 oascsi.HttpClientUtil.createClient Creating new http client, config:maxConnections=500&maxConnectionsPerHost=16&socketTimeout=120000&connTimeout=15000
[junit4:junit4]   2> 20397 T12 oaz.ZooKeeper.<init> Initiating client connection, connectString=127.0.0.1:44589/solr sessionTimeout=30000 watcher=org.apache.solr.common.cloud.ConnectionManager@343523e2
[junit4:junit4]   2> 20398 T12 oascc.ConnectionManager.waitForConnected Waiting for client to connect to ZooKeeper
[junit4:junit4]   2> 20399 T99 oaz.ClientCnxn$SendThread.logStartConnect Opening socket connection to server localhost.localdomain/127.0.0.1:44589. Will not attempt to authenticate using SASL (access denied ("javax.security.auth.AuthPermission" "getLoginConfiguration"))
[junit4:junit4]   2> 20399 T99 oaz.ClientCnxn$SendThread.primeConnection Socket connection established to localhost.localdomain/127.0.0.1:44589, initiating session
[junit4:junit4]   2> 20399 T14 oazs.NIOServerCnxnFactory.run Accepted socket connection from /127.0.0.1:54379
[junit4:junit4]   2> 20400 T14 oazs.ZooKeeperServer.processConnectRequest Client attempting to establish new session at /127.0.0.1:54379
[junit4:junit4]   2> 20401 T16 oazs.ZooKeeperServer.finishSessionInit Established session 0x13d0832f20a000c with negotiated timeout 20000 for client /127.0.0.1:54379
[junit4:junit4]   2> 20401 T99 oaz.ClientCnxn$SendThread.onConnected Session establishment complete on server localhost.localdomain/127.0.0.1:44589, sessionid = 0x13d0832f20a000c, negotiated timeout = 20000
[junit4:junit4]   2> 20401 T100 oascc.ConnectionManager.process Watcher org.apache.solr.common.cloud.ConnectionManager@343523e2 name:ZooKeeperConnection Watcher:127.0.0.1:44589/solr got event WatchedEvent state:SyncConnected type:None path:null path:null type:None
[junit4:junit4]   2> 20401 T12 oascc.ConnectionManager.waitForConnected Client is connected to ZooKeeper
[junit4:junit4]   2> 20402 T17 oazs.PrepRequestProcessor.pRequest Got user-level KeeperException when processing sessionid:0x13d0832f20a000c type:create cxid:0x1 zxid:0xa2 txntype:-1 reqpath:n/a Error Path:/solr/overseer Error:KeeperErrorCode = NodeExists for /solr/overseer
[junit4:junit4]   2> 20403 T17 oazs.PrepRequestProcessor.pRequest Got user-level KeeperException when processing sessionid:0x13d0832f20a000c type:create cxid:0x2 zxid:0xa3 txntype:-1 reqpath:n/a Error Path:/solr/overseer Error:KeeperErrorCode = NodeExists for /solr/overseer
[junit4:junit4]   2> 20404 T12 oascc.ZkStateReader.createClusterStateWatchersAndUpdate Updating cluster state from ZooKeeper... 
[junit4:junit4]   2> 21106 T36 oascc.ZkStateReader.updateClusterState Updating cloud state from ZooKeeper... 
[junit4:junit4]   2> 21108 T36 oasc.Overseer$ClusterStateUpdater.updateState Update state numShards=2 message={
[junit4:junit4]   2> 	  "numShards":"2",
[junit4:junit4]   2> 	  "core":"collection1",
[junit4:junit4]   2> 	  "collection":"collection1",
[junit4:junit4]   2> 	  "operation":"state",
[junit4:junit4]   2> 	  "shard":"shard2",
[junit4:junit4]   2> 	  "node_name":"127.0.0.1:50956_",
[junit4:junit4]   2> 	  "roles":null,
[junit4:junit4]   2> 	  "base_url":"http://127.0.0.1:50956",
[junit4:junit4]   2> 	  "state":"recovering"}
[junit4:junit4]   2> 21149 T41 oascc.ZkStateReader$2.process A cluster state change: WatchedEvent state:SyncConnected type:NodeDataChanged path:/clusterstate.json, has occurred - updating... (live nodes size: 4)
[junit4:junit4]   2> 21149 T54 oascc.ZkStateReader$2.process A cluster state change: WatchedEvent state:SyncConnected type:NodeDataChanged path:/clusterstate.json, has occurred - updating... (live nodes size: 4)
[junit4:junit4]   2> 21149 T35 oascc.ZkStateReader$2.process A cluster state change: WatchedEvent state:SyncConnected type:NodeDataChanged path:/clusterstate.json, has occurred - updating... (live nodes size: 4)
[junit4:junit4]   2> 21149 T84 oascc.ZkStateReader$2.process A cluster state change: WatchedEvent state:SyncConnected type:NodeDataChanged path:/clusterstate.json, has occurred - updating... (live nodes size: 4)
[junit4:junit4]   2> 21149 T100 oascc.ZkStateReader$2.process A cluster state change: WatchedEvent state:SyncConnected type:NodeDataChanged path:/clusterstate.json, has occurred - updating... (live nodes size: 4)
[junit4:junit4]   2> 21149 T69 oascc.ZkStateReader$2.process A cluster state change: WatchedEvent state:SyncConnected type:NodeDataChanged path:/clusterstate.json, has occurred - updating... (live nodes size: 4)
[junit4:junit4]   2> 21406 T12 oasc.ZkController.createEphemeralLiveNode Register node as live in ZooKeeper:/live_nodes/127.0.0.1:39683_
[junit4:junit4]   2> 21407 T17 oazs.PrepRequestProcessor.pRequest Got user-level KeeperException when processing sessionid:0x13d0832f20a000c type:delete cxid:0xb zxid:0xa8 txntype:-1 reqpath:n/a Error Path:/solr/live_nodes/127.0.0.1:39683_ Error:KeeperErrorCode = NoNode for /solr/live_nodes/127.0.0.1:39683_
[junit4:junit4]   2> 21408 T12 oascc.SolrZkClient.makePath makePath: /live_nodes/127.0.0.1:39683_
[junit4:junit4]   2> 21410 T54 oascc.ZkStateReader$2.process A cluster state change: WatchedEvent state:SyncConnected type:NodeChildrenChanged path:/live_nodes, has occurred - updating... (live nodes size: 4)
[junit4:junit4]   2> 21410 T69 oascc.ZkStateReader$2.process A cluster state change: WatchedEvent state:SyncConnected type:NodeChildrenChanged path:/live_nodes, has occurred - updating... (live nodes size: 4)
[junit4:junit4]   2> 21410 T84 oascc.ZkStateReader$2.process A cluster state change: WatchedEvent state:SyncConnected type:NodeChildrenChanged path:/live_nodes, has occurred - updating... (live nodes size: 4)
[junit4:junit4]   2> 21410 T41 oascc.ZkStateReader$2.process A cluster state change: WatchedEvent state:SyncConnected type:NodeChildrenChanged path:/live_nodes, has occurred - updating... (live nodes size: 4)
[junit4:junit4]   2> 21411 T35 oascc.ZkStateReader$3.process Updating live nodes... (5)
[junit4:junit4]   2> 21411 T35 oascc.ZkStateReader$2.process A cluster state change: WatchedEvent state:SyncConnected type:NodeChildrenChanged path:/live_nodes, has occurred - updating... (live nodes size: 5)
[junit4:junit4]   2> 21410 T100 oascc.ZkStateReader$3.process Updating live nodes... (5)
[junit4:junit4]   2> 21412 T100 oascc.ZkStateReader$2.process A cluster state change: WatchedEvent state:SyncConnected type:NodeChildrenChanged path:/live_nodes, has occurred - updating... (live nodes size: 5)
[junit4:junit4]   2> 21413 T54 oascc.ZkStateReader$3.process Updating live nodes... (5)
[junit4:junit4]   2> 21413 T69 oascc.ZkStateReader$3.process Updating live nodes... (5)
[junit4:junit4]   2> 21413 T84 oascc.ZkStateReader$3.process Updating live nodes... (5)
[junit4:junit4]   2> 21415 T41 oascc.ZkStateReader$3.process Updating live nodes... (5)
[junit4:junit4]   2> 21423 T101 oasc.CoreContainer.create Creating SolrCore 'collection1' using instanceDir: /mnt/ssd/jenkins/workspace/Lucene-Solr-trunk-Linux/solr/build/solr-core/test/J1/./org.apache.solr.cloud.UnloadDistributedZkTest-jetty4-1361642209328/collection1
[junit4:junit4]   2> 21424 T101 oasc.ZkController.createCollectionZkNode Check for collection zkNode:collection1
[junit4:junit4]   2> 21425 T101 oasc.ZkController.createCollectionZkNode Collection zkNode exists
[junit4:junit4]   2> 21425 T101 oasc.ZkController.readConfigName Load collection config from:/collections/collection1
[junit4:junit4]   2> 21426 T101 oasc.SolrResourceLoader.<init> new SolrResourceLoader for directory: '/mnt/ssd/jenkins/workspace/Lucene-Solr-trunk-Linux/solr/build/solr-core/test/J1/./org.apache.solr.cloud.UnloadDistributedZkTest-jetty4-1361642209328/collection1/'
[junit4:junit4]   2> 21427 T101 oasc.SolrResourceLoader.replaceClassLoader Adding 'file:/mnt/ssd/jenkins/workspace/Lucene-Solr-trunk-Linux/solr/build/solr-core/test/J1/org.apache.solr.cloud.UnloadDistributedZkTest-jetty4-1361642209328/collection1/lib/README' to classloader
[junit4:junit4]   2> 21428 T101 oasc.SolrResourceLoader.replaceClassLoader Adding 'file:/mnt/ssd/jenkins/workspace/Lucene-Solr-trunk-Linux/solr/build/solr-core/test/J1/org.apache.solr.cloud.UnloadDistributedZkTest-jetty4-1361642209328/collection1/lib/classes/' to classloader
[junit4:junit4]   2> 21487 T101 oasc.SolrConfig.<init> Using Lucene MatchVersion: LUCENE_50
[junit4:junit4]   2> 21539 T101 oasc.SolrConfig.<init> Loaded SolrConfig: solrconfig.xml
[junit4:junit4]   2> 21541 T101 oass.IndexSchema.readSchema Reading Solr Schema
[junit4:junit4]   2> 21558 T101 oass.IndexSchema.readSchema Schema name=test
[junit4:junit4]   2> 22173 T101 oass.OpenExchangeRatesOrgProvider.init Initialized with rates=open-exchange-rates.json, refreshInterval=1440.
[junit4:junit4]   2> 22178 T101 oass.IndexSchema.readSchema default search field in schema is text
[junit4:junit4]   2> 22181 T101 oass.IndexSchema.readSchema unique key field: id
[junit4:junit4]   2> 22204 T101 oass.FileExchangeRateProvider.reload Reloading exchange rates from file currency.xml
[junit4:junit4]   2> 22213 T101 oass.FileExchangeRateProvider.reload Reloading exchange rates from file currency.xml
[junit4:junit4]   2> 22218 T101 oass.OpenExchangeRatesOrgProvider.reload Reloading exchange rates from open-exchange-rates.json
[junit4:junit4]   2> 22220 T101 oass.OpenExchangeRatesOrgProvider.reload Reloading exchange rates from open-exchange-rates.json
[junit4:junit4]   2> 22222 T101 oasc.SolrCore.<init> [collection1] Opening new SolrCore at /mnt/ssd/jenkins/workspace/Lucene-Solr-trunk-Linux/solr/build/solr-core/test/J1/./org.apache.solr.cloud.UnloadDistributedZkTest-jetty4-1361642209328/collection1/, dataDir=./org.apache.solr.cloud.UnloadDistributedZkTest-1361642189188/jetty4/
[junit4:junit4]   2> 22222 T101 oasc.JmxMonitoredMap.<init> JMX monitoring is enabled. Adding Solr mbeans to JMX Server: com.sun.jmx.mbeanserver.JmxMBeanServer@4ba7cde3
[junit4:junit4]   2> 22223 T101 oasc.SolrCore.initDirectoryFactory org.apache.solr.core.MockDirectoryFactory
[junit4:junit4]   2> 22223 T101 oasc.CachingDirectoryFactory.get return new directory for /mnt/ssd/jenkins/workspace/Lucene-Solr-trunk-Linux/solr/build/solr-core/test/J1/./org.apache.solr.cloud.UnloadDistributedZkTest-1361642189188/jetty4 forceNew:false
[junit4:junit4]   2> 22224 T101 oasc.CachingDirectoryFactory.close Releasing directory:/mnt/ssd/jenkins/workspace/Lucene-Solr-trunk-Linux/solr/build/solr-core/test/J1/./org.apache.solr.cloud.UnloadDistributedZkTest-1361642189188/jetty4
[junit4:junit4]   2> 22224 T101 oasc.SolrCore.getNewIndexDir New index directory detected: old=null new=./org.apache.solr.cloud.UnloadDistributedZkTest-1361642189188/jetty4/index/
[junit4:junit4]   2> 22224 T101 oasc.SolrCore.initIndex WARNING [collection1] Solr index directory './org.apache.solr.cloud.UnloadDistributedZkTest-1361642189188/jetty4/index' doesn't exist. Creating new index...
[junit4:junit4]   2> 22225 T101 oasc.CachingDirectoryFactory.get return new directory for /mnt/ssd/jenkins/workspace/Lucene-Solr-trunk-Linux/solr/build/solr-core/test/J1/./org.apache.solr.cloud.UnloadDistributedZkTest-1361642189188/jetty4/index forceNew:false
[junit4:junit4]   2> 22227 T101 oasc.SolrDeletionPolicy.onCommit SolrDeletionPolicy.onCommit: commits:num=1
[junit4:junit4]   2> 		commit{dir=MockDirWrapper(org.apache.lucene.store.RAMDirectory@bcd5748 lockFactory=org.apache.lucene.store.NativeFSLockFactory@19d2e66e),segFN=segments_1,generation=1,filenames=[segments_1]
[junit4:junit4]   2> 22228 T101 oasc.SolrDeletionPolicy.updateCommits newest commit = 1[segments_1]
[junit4:junit4]   2> 22228 T101 oasc.CachingDirectoryFactory.close Releasing directory:/mnt/ssd/jenkins/workspace/Lucene-Solr-trunk-Linux/solr/build/solr-core/test/J1/./org.apache.solr.cloud.UnloadDistributedZkTest-1361642189188/jetty4/index
[junit4:junit4]   2> 22231 T101 oasup.UpdateRequestProcessorChain.init inserting DistributedUpdateProcessorFactory into updateRequestProcessorChain "dedupe"
[junit4:junit4]   2> 22231 T101 oasup.UpdateRequestProcessorChain.init inserting DistributedUpdateProcessorFactory into updateRequestProcessorChain "stored_sig"
[junit4:junit4]   2> 22232 T101 oasup.UpdateRequestProcessorChain.init inserting DistributedUpdateProcessorFactory into updateRequestProcessorChain "distrib-dup-test-chain-implicit"
[junit4:junit4]   2> 22233 T101 oasc.RequestHandlers.initHandlersFromConfig created standard: solr.StandardRequestHandler
[junit4:junit4]   2> 22234 T101 oasc.RequestHandlers.initHandlersFromConfig created /get: solr.RealTimeGetHandler
[junit4:junit4]   2> 22234 T101 oasc.RequestHandlers.initHandlersFromConfig adding lazy requestHandler: solr.ReplicationHandler
[junit4:junit4]   2> 22234 T101 oasc.RequestHandlers.initHandlersFromConfig created /replication: solr.ReplicationHandler
[junit4:junit4]   2> 22235 T101 oasc.RequestHandlers.initHandlersFromConfig created /update: solr.UpdateRequestHandler
[junit4:junit4]   2> 22236 T101 oasc.RequestHandlers.initHandlersFromConfig created /admin/: org.apache.solr.handler.admin.AdminHandlers
[junit4:junit4]   2> 22239 T101 oashl.XMLLoader.init xsltCacheLifetimeSeconds=60
[junit4:junit4]   2> 22243 T101 oasc.CachingDirectoryFactory.close Releasing directory:/mnt/ssd/jenkins/workspace/Lucene-Solr-trunk-Linux/solr/build/solr-core/test/J1/./org.apache.solr.cloud.UnloadDistributedZkTest-1361642189188/jetty4
[junit4:junit4]   2> 22243 T101 oass.SolrIndexSearcher.<init> Opening Searcher@324618ad main
[junit4:junit4]   2> 22244 T101 oasu.UpdateHandler.clearLog Clearing tlog files, tlogDir=./org.apache.solr.cloud.UnloadDistributedZkTest-1361642189188/jetty4/tlog
[junit4:junit4]   2> 22245 T101 oasu.CommitTracker.<init> Hard AutoCommit: disabled
[junit4:junit4]   2> 22245 T101 oasu.CommitTracker.<init> Soft AutoCommit: disabled
[junit4:junit4]   2> 22255 T102 oasc.SolrCore.registerSearcher [collection1] Registered new searcher Searcher@324618ad main{StandardDirectoryReader(segments_1:1)}
[junit4:junit4]   2> 22259 T101 oasc.ZkController.publish publishing core=collection1 state=down
[junit4:junit4]   2> 22259 T101 oasc.ZkController.publish numShards not found on descriptor - reading it from system property
[junit4:junit4]   2> 22656 T36 oascc.ZkStateReader.updateClusterState Updating cloud state from ZooKeeper... 
[junit4:junit4]   2> 22657 T36 oasc.Overseer$ClusterStateUpdater.updateState Update state numShards=2 message={
[junit4:junit4]   2> 	  "numShards":"2",
[junit4:junit4]   2> 	  "core":"collection1",
[junit4:junit4]   2> 	  "collection":"collection1",
[junit4:junit4]   2> 	  "operation":"state",
[junit4:junit4]   2> 	  "shard":null,
[junit4:junit4]   2> 	  "node_name":"127.0.0.1:39683_",
[junit4:junit4]   2> 	  "roles":null,
[junit4:junit4]   2> 	  "base_url":"http://127.0.0.1:39683",
[junit4:junit4]   2> 	  "state":"down"}
[junit4:junit4]   2> 22657 T36 oasc.Overseer$ClusterStateUpdater.updateState Collection already exists with numShards=2
[junit4:junit4]   2> 22657 T36 oasc.Overseer$ClusterStateUpdater.updateState Assigning new node to shard shard=shard1
[junit4:junit4]   2> 22661 T35 oascc.ZkStateReader$2.process A cluster state change: WatchedEvent state:SyncConnected type:NodeDataChanged path:/clusterstate.json, has occurred - updating... (live nodes size: 5)
[junit4:junit4]   2> 22661 T100 oascc.ZkStateReader$2.process A cluster state change: WatchedEvent state:SyncConnected type:NodeDataChanged path:/clusterstate.json, has occurred - updating... (live nodes size: 5)
[junit4:junit4]   2> 22661 T69 oascc.ZkStateReader$2.process A cluster state change: WatchedEvent state:SyncConnected type:NodeDataChanged path:/clusterstate.json, has occurred - updating... (live nodes size: 5)
[junit4:junit4]   2> 22661 T54 oascc.ZkStateReader$2.process A cluster state change: WatchedEvent state:SyncConnected type:NodeDataChanged path:/clusterstate.json, has occurred - updating... (live nodes size: 5)
[junit4:junit4]   2> 22661 T41 oascc.ZkStateReader$2.process A cluster state change: WatchedEvent state:SyncConnected type:NodeDataChanged path:/clusterstate.json, has occurred - updating... (live nodes size: 5)
[junit4:junit4]   2> 22661 T84 oascc.ZkStateReader$2.process A cluster state change: WatchedEvent state:SyncConnected type:NodeDataChanged path:/clusterstate.json, has occurred - updating... (live nodes size: 5)
[junit4:junit4]   2> 23262 T101 oasc.CoreContainer.registerCore registering core: collection1
[junit4:junit4]   2> 23263 T101 oasc.ZkController.register Register replica - core:collection1 address:http://127.0.0.1:39683 collection:collection1 shard:shard1
[junit4:junit4]   2> 23266 T101 oasc.ZkController.register We are http://127.0.0.1:39683/collection1/ and leader is http://127.0.0.1:50157/collection1/
[junit4:junit4]   2> 23266 T101 oasc.ZkController.register No LogReplay needed for core=collection1 baseURL=http://127.0.0.1:39683
[junit4:junit4]   2> 23266 T101 oasc.ZkController.checkRecovery Core needs to recover:collection1
[junit4:junit4]   2> 23266 T101 oasu.DefaultSolrCoreState.doRecovery Running recovery - first canceling any ongoing recovery
[junit4:junit4]   2> ASYNC  NEW_CORE C1 name=collection1 org.apache.solr.core.SolrCore@69623a61 url=http://127.0.0.1:39683/collection1 node=127.0.0.1:39683_ C1_STATE=coll:collection1 core:collection1 props:{core=collection1, collection=collection1, shard=null, node_name=127.0.0.1:39683_, roles=null, base_url=http://127.0.0.1:39683, state=down}
[junit4:junit4]   2> 23267 T103 C1 P39683 oasc.RecoveryStrategy.run Starting recovery process.  core=collection1 recoveringAfterStartup=true
[junit4:junit4]   2> 23267 T103 C1 P39683 oasc.RecoveryStrategy.doRecovery ###### startupVersions=[]
[junit4:junit4]   2> 23268 T103 C1 P39683 oasc.ZkController.publish publishing core=collection1 state=recovering
[junit4:junit4]   2> 23268 T101 oascc.ZkStateReader.updateClusterState Updating cloud state from ZooKeeper... 
[junit4:junit4]   2> 23268 T103 C1 P39683 oasc.ZkController.publish numShards not found on descriptor - reading it from system property
[junit4:junit4]   2> 23269 T12 oass.SolrDispatchFilter.init user.dir=/mnt/ssd/jenkins/workspace/Lucene-Solr-trunk-Linux/solr/build/solr-core/test/J1
[junit4:junit4]   2> 23269 T12 oass.SolrDispatchFilter.init SolrDispatchFilter.init() done
[junit4:junit4]   2> 23270 T12 oascsi.HttpClientUtil.createClient Creating new http client, config:maxConnections=128&maxConnectionsPerHost=32&followRedirects=false
[junit4:junit4]   2> 23272 T103 C1 P39683 oascsi.HttpClientUtil.createClient Creating new http client, config:maxConnections=128&maxConnectionsPerHost=32&followRedirects=false
[junit4:junit4]   2> 23273 T12 oascc.ZkStateReader.updateClusterState Updating cloud state from ZooKeeper... 
[junit4:junit4]   2> 23275 T12 oascsi.HttpClientUtil.createClient Creating new http client, config:maxConnections=128&maxConnectionsPerHost=32&followRedirects=false
[junit4:junit4]   2> 23286 T47 oasc.CoreContainer.create Creating SolrCore 'unloadcollection1' using instanceDir: /mnt/ssd/jenkins/workspace/Lucene-Solr-trunk-Linux/solr/build/solr-core/test/J1/./org.apache.solr.cloud.UnloadDistributedZkTest-jetty1-1361642196640/unloadcollection1
[junit4:junit4]   2> 23287 T47 oasc.ZkController.createCollectionZkNode Check for collection zkNode:unloadcollection
[junit4:junit4]   2> 23288 T47 oasc.ZkController.createCollectionZkNode Creating collection in ZooKeeper:unloadcollection
[junit4:junit4]   2> 23288 T47 oasc.ZkController.getConfName Looking for collection configName
[junit4:junit4]   2> 23289 T47 oasc.ZkController.getConfName Only one config set found in zk - using it:conf1
[junit4:junit4]   2> 23290 T47 oascc.SolrZkClient.makePath makePath: /collections/unloadcollection
[junit4:junit4]   2> 23359 T47 oasc.ZkController.readConfigName Load collection config from:/collections/unloadcollection
[junit4:junit4]   2> 23360 T47 oasc.SolrResourceLoader.<init> new SolrResourceLoader for directory: '/mnt/ssd/jenkins/workspace/Lucene-Solr-trunk-Linux/solr/build/solr-core/test/J1/./org.apache.solr.cloud.UnloadDistributedZkTest-jetty1-1361642196640/unloadcollection1/'
[junit4:junit4]   2> 23388 T47 oasc.SolrConfig.<init> Using Lucene MatchVersion: LUCENE_50
[junit4:junit4]   2> 23416 T47 oasc.SolrConfig.<init> Loaded SolrConfig: solrconfig.xml
[junit4:junit4]   2> 23417 T47 oass.IndexSchema.readSchema Reading Solr Schema
[junit4:junit4]   2> 23423 T47 oass.IndexSchema.readSchema Schema name=test
[junit4:junit4]   2>  C0_STATE=coll:collection1 core:collection1 props:{core=collection1, collection=collection1, shard=shard2, node_name=127.0.0.1:50956_, roles=null, base_url=http://127.0.0.1:50956, state=recovering}
[junit4:junit4]   2> 23651 T87 C0 P50956 oasc.RecoveryStrategy.doRecovery Attempting to PeerSync from http://127.0.0.1:33214/collection1/ core=collection1 - recoveringAfterStartup=true
[junit4:junit4]   2> 23665 T87 C0 P50956 oascsi.HttpClientUtil.createClient Creating new http client, config:maxConnectionsPerHost=20&maxConnections=10000&connTimeout=30000&socketTimeout=30000&retry=false
[junit4:junit4]   2> 23671 T87 C0 P50956 oasu.PeerSync.sync PeerSync: core=collection1 url=http://127.0.0.1:50956 START replicas=[http://127.0.0.1:33214/collection1/] nUpdates=100
[junit4:junit4]   2> 23674 T87 C0 P50956 oasu.PeerSync.sync WARNING no frame of reference to tell of we've missed updates
[junit4:junit4]   2> 23675 T87 C0 P50956 oasc.RecoveryStrategy.doRecovery PeerSync Recovery was not successful - trying replication. core=collection1
[junit4:junit4]   2> 23675 T87 C0 P50956 oasc.RecoveryStrategy.doRecovery Starting Replication Recovery. core=collection1
[junit4:junit4]   2> 23675 T87 C0 P50956 oasc.RecoveryStrategy.doRecovery Begin buffering updates. core=collection1
[junit4:junit4]   2> 23675 T87 C0 P50956 oasu.UpdateLog.bufferUpdates Starting to buffer updates. FSUpdateLog{state=ACTIVE, tlog=null}
[junit4:junit4]   2> 23675 T87 C0 P50956 oasc.RecoveryStrategy.replicate Attempting to replicate from http://127.0.0.1:33214/collection1/. core=collection1
[junit4:junit4]   2> 23676 T87 C0 P50956 oascsi.HttpClientUtil.createClient Creating new http client, config:maxConnections=128&maxConnectionsPerHost=32&followRedirects=false
[junit4:junit4]   2> ASYNC  NEW_CORE C2 name=collection1 org.apache.solr.core.SolrCore@31ab04ce url=http://127.0.0.1:33214/collection1 node=127.0.0.1:33214_ C2_STATE=coll:collection1 core:collection1 props:{core=collection1, collection=collection1, shard=shard2, node_name=127.0.0.1:33214_, roles=null, base_url=http://127.0.0.1:33214, state=active, leader=true}
[junit4:junit4]   2> 23714 T50 C2 P33214 REQ /get {version=2&getVersions=100&wt=javabin&qt=/get&distrib=false} status=0 QTime=20 
[junit4:junit4]   2> 23725 T49 C2 P33214 oasu.DirectUpdateHandler2.commit start commit{,optimize=false,openSearcher=false,waitSearcher=true,expungeDeletes=false,softCommit=false,prepareCommit=false}
[junit4:junit4]   2> 23726 T49 C2 P33214 oasc.CachingDirectoryFactory.close Releasing directory:/mnt/ssd/jenkins/workspace/Lucene-Solr-trunk-Linux/solr/build/solr-core/test/J1/./org.apache.solr.cloud.UnloadDistributedZkTest-1361642189188/jetty1
[junit4:junit4]   2> 23733 T49 C2 P33214 oasc.SolrDeletionPolicy.onInit SolrDeletionPolicy.onInit: commits:num=1
[junit4:junit4]   2> 		commit{dir=MockDirWrapper(org.apache.lucene.store.RAMDirectory@372bd7d6 lockFactory=org.apache.lucene.store.NativeFSLockFactory@33527e25),segFN=segments_1,generation=1,filenames=[segments_1]
[junit4:junit4]   2> 23733 T49 C2 P33214 oasc.SolrDeletionPolicy.updateCommits newest commit = 1[segments_1]
[junit4:junit4]   2> 23735 T49 C2 P33214 oasc.SolrDeletionPolicy.onCommit SolrDeletionPolicy.onCommit: commits:num=2
[junit4:junit4]   2> 		commit{dir=MockDirWrapper(org.apache.lucene.store.RAMDirectory@372bd7d6 lockFactory=org.apache.lucene.store.NativeFSLockFactory@33527e25),segFN=segments_1,generation=1,filenames=[segments_1]
[junit4:junit4]   2> 		commit{dir=MockDirWrapper(org.apache.lucene.store.RAMDirectory@372bd7d6 lockFactory=org.apache.lucene.store.NativeFSLockFactory@33527e25),segFN=segments_2,generation=2,filenames=[segments_2]
[junit4:junit4]   2> 23735 T49 C2 P33214 oasc.SolrDeletionPolicy.updateCommits newest commit = 2[segments_2]
[junit4:junit4]   2> 23736 T49 C2 P33214 oasc.CachingDirectoryFactory.close Releasing directory:/mnt/ssd/jenkins/workspace/Lucene-Solr-trunk-Linux/solr/build/solr-core/test/J1/./org.apache.solr.cloud.UnloadDistributedZkTest-1361642189188/jetty1
[junit4:junit4]   2> 23738 T49 C2 P33214 oass.SolrIndexSearcher.<init> Opening Searcher@47a936e2 realtime
[junit4:junit4]   2> 23738 T49 C2 P33214 oasu.DirectUpdateHandler2.commit end_commit_flush
[junit4:junit4]   2> 23739 T49 C2 P33214 /update {softCommit=false&waitSearcher=true&version=2&wt=javabin&openSearcher=false&commit_end_point=true&commit=true} {commit=} 0 46
[junit4:junit4]   2> 23775 T87 C0 P50956 oash.ReplicationHandler.inform Commits will be reserved for  10000
[junit4:junit4]   2> 23776 T87 C0 P50956 oascsi.HttpClientUtil.createClient Creating new http client, config:connTimeout=5000&socketTimeout=20000&allowCompression=false&maxConnections=10000&maxConnectionsPerHost=10000
[junit4:junit4]   2> 23784 T87 C0 P50956 oash.SnapPuller.<init>  No value set for 'pollInterval'. Timer Task not started.
[junit4:junit4]   2> 23804 T50 C2 P33214 oash.ReplicationHandler.inform Commits will be reserved for  10000
[junit4:junit4]   2> 23805 T50 C2 P33214 REQ /replication {version=2&wt=javabin&qt=/replication&command=indexversion} status=0 QTime=18 
[junit4:junit4]   2> 23807 T87 C0 P50956 oash.SnapPuller.fetchLatestIndex Master's generation: 2
[junit4:junit4]   2> 23807 T87 C0 P50956 oash.SnapPuller.fetchLatestIndex Slave's generation: 1
[junit4:junit4]   2> 23807 T87 C0 P50956 oash.SnapPuller.fetchLatestIndex Starting replication process
[junit4:junit4]   2> 23811 T49 C2 P33214 oasc.CachingDirectoryFactory.close Releasing directory:/mnt/ssd/jenkins/workspace/Lucene-Solr-trunk-Linux/solr/build/solr-core/test/J1/./org.apache.solr.cloud.UnloadDistributedZkTest-1361642189188/jetty1
[junit4:junit4]   2> 23811 T49 C2 P33214 oasc.CachingDirectoryFactory.close Releasing directory:/mnt/ssd/jenkins/workspace/Lucene-Solr-trunk-Linux/solr/build/solr-core/test/J1/./org.apache.solr.cloud.UnloadDistributedZkTest-1361642189188/jetty1/index
[junit4:junit4]   2> 23812 T49 C2 P33214 REQ /replication {generation=2&version=2&wt=javabin&qt=/replication&command=filelist} status=0 QTime=2 
[junit4:junit4]   2> 23813 T87 C0 P50956 oash.SnapPuller.fetchLatestIndex Number of files in latest index in master: 1
[junit4:junit4]   2> 23820 T87 C0 P50956 oasc.CachingDirectoryFactory.get return new directory for /mnt/ssd/jenkins/workspace/Lucene-Solr-trunk-Linux/solr/build/solr-core/test/J1/./org.apache.solr.cloud.UnloadDistributedZkTest-1361642189188/jetty3/index.20130223185652914 forceNew:false
[junit4:junit4]   2> 23821 T87 C0 P50956 oasc.CachingDirectoryFactory.close Releasing directory:/mnt/ssd/jenkins/workspace/Lucene-Solr-trunk-Linux/solr/build/solr-core/test/J1/./org.apache.solr.cloud.UnloadDistributedZkTest-1361642189188/jetty3
[junit4:junit4]   2> 23821 T87 C0 P50956 oash.SnapPuller.fetchLatestIndex Starting download to MockDirWrapper(org.apache.lucene.store.RAMDirectory@754877b1 lockFactory=org.apache.lucene.store.NativeFSLockFactory@1ba21c1) fullCopy=true
[junit4:junit4]   2> 23838 T48 C2 P33214 REQ /replication {checksum=true&generation=2&file=segments_2&wt=filestream&qt=/replication&command=filecontent} status=0 QTime=3 
[junit4:junit4]   2> 23846 T47 oass.OpenExchangeRatesOrgProvider.init Initialized with rates=open-exchange-rates.json, refreshInterval=1440.
[junit4:junit4]   2> 23856 T47 oass.IndexSchema.readSchema default search field in schema is text
[junit4:junit4]   2> 23859 T47 oass.IndexSchema.readSchema unique key field: id
[junit4:junit4]   2> 23863 T87 C0 P50956 oasc.CachingDirectoryFactory.close Releasing directory:/mnt/ssd/jenkins/workspace/Lucene-Solr-trunk-Linux/solr/build/solr-core/test/J1/./org.apache.solr.cloud.UnloadDistributedZkTest-1361642189188/jetty3/index
[junit4:junit4]   2> 23863 T87 C0 P50956 oash.SnapPuller.fetchLatestIndex Total time taken for download : 0 secs
[junit4:junit4]   2> 23864 T87 C0 P50956 oash.SnapPuller.modifyIndexProps New index installed. Updating index properties... index=index.20130223185652914
[junit4:junit4]   2> 23887 T87 C0 P50956 oasc.CachingDirectoryFactory.close Releasing directory:/mnt/ssd/jenkins/workspace/Lucene-Solr-trunk-Linux/solr/build/solr-core/test/J1/./org.apache.solr.cloud.UnloadDistributedZkTest-1361642189188/jetty3
[junit4:junit4]   2> 23888 T87 C0 P50956 oasc.CachingDirectoryFactory.close Releasing directory:/mnt/ssd/jenkins/workspace/Lucene-Solr-trunk-Linux/solr/build/solr-core/test/J1/./org.apache.solr.cloud.UnloadDistributedZkTest-1361642189188/jetty3
[junit4:junit4]   2> 23888 T87 C0 P50956 oasc.SolrCore.getNewIndexDir New index directory detected: old=./org.apache.solr.cloud.UnloadDistributedZkTest-1361642189188/jetty3/index/ new=./org.apache.solr.cloud.UnloadDistributedZkTest-1361642189188/jetty3/index.20130223185652914
[junit4:junit4]   2> 23898 T87 C0 P50956 oasc.SolrDeletionPolicy.onInit SolrDeletionPolicy.onInit: commits:num=1
[junit4:junit4]   2> 		commit{dir=MockDirWrapper(org.apache.lucene.store.RAMDirectory@754877b1 lockFactory=org.apache.lucene.store.NativeFSLockFactory@1ba21c1),segFN=segments_2,generation=2,filenames=[segments_2]
[junit4:junit4]   2> 23899 T87 C0 P50956 oasc.SolrDeletionPolicy.updateCommits newest commit = 2[segments_2]
[junit4:junit4]   2> 23900 T87 C0 P50956 oasc.CachingDirectoryFactory.close Releasing directory:/mnt/ssd/jenkins/workspace/Lucene-Solr-trunk-Linux/solr/build/solr-core/test/J1/./org.apache.solr.cloud.UnloadDistributedZkTest-1361642189188/jetty3
[junit4:junit4]   2> 23901 T87 C0 P50956 oasc.CachingDirectoryFactory.close Releasing directory:/mnt/ssd/jenkins/workspace/Lucene-Solr-trunk-Linux/solr/build/solr-core/test/J1/./org.apache.solr.cloud.UnloadDistributedZkTest-1361642189188/jetty3
[junit4:junit4]   2> 23903 T87 C0 P50956 oasu.DefaultSolrCoreState.newIndexWriter Creating new IndexWriter...
[junit4:junit4]   2> 23903 T87 C0 P50956 oasu.DefaultSolrCoreState.newIndexWriter Waiting until IndexWriter is unused... core=collection1
[junit4:junit4]   2> 23904 T87 C0 P50956 oasu.DefaultSolrCoreState.newIndexWriter Rollback old IndexWriter... core=collection1
[junit4:junit4]   2> 23905 T87 C0 P50956 oasc.CachingDirectoryFactory.close Releasing directory:/mnt/ssd/jenkins/workspace/Lucene-Solr-trunk-Linux/solr/build/solr-core/test/J1/./org.apache.solr.cloud.UnloadDistributedZkTest-1361642189188/jetty3/index.20130223185652914
[junit4:junit4]   2> 23906 T87 C0 P50956 oasc.CachingDirectoryFactory.close Releasing directory:/mnt/ssd/jenkins/workspace/Lucene-Solr-trunk-Linux/solr/build/solr-core/test/J1/./org.apache.solr.cloud.UnloadDistributedZkTest-1361642189188/jetty3
[junit4:junit4]   2> 23908 T87 C0 P50956 oasc.SolrDeletionPolicy.onInit SolrDeletionPolicy.onInit: commits:num=1
[junit4:junit4]   2> 		commit{dir=MockDirWrapper(org.apache.lucene.store.RAMDirectory@754877b1 lockFactory=org.apache.lucene.store.NativeFSLockFactory@1ba21c1),segFN=segments_2,generation=2,filenames=[segments_2]
[junit4:junit4]   2> 23908 T87 C0 P50956 oasc.SolrDeletionPolicy.updateCommits newest commit = 2[segments_2]
[junit4:junit4]   2> 23909 T87 C0 P50956 oasu.DefaultSolrCoreState.newIndexWriter New IndexWriter is ready to be used.
[junit4:junit4]   2> 23909 T87 C0 P50956 oasc.CachingDirectoryFactory.close Releasing directory:/mnt/ssd/jenkins/workspace/Lucene-Solr-trunk-Linux/solr/build/solr-core/test/J1/./org.apache.solr.cloud.UnloadDistributedZkTest-1361642189188/jetty3
[junit4:junit4]   2> 23910 T87 C0 P50956 oass.SolrIndexSearcher.<init> Opening Searcher@46a49a5f main
[junit4:junit4]   2> 23913 T47 oass.FileExchangeRateProvider.reload Reloading exchange rates from file currency.xml
[junit4:junit4]   2> 23914 T86 oasc.SolrCore.registerSearcher [collection1] Registered new searcher Searcher@46a49a5f main{StandardDirectoryReader(segments_2:1:nrt)}
[junit4:junit4]   2> 23915 T86 oasc.CachingDirectoryFactory.close Releasing directory:/mnt/ssd/jenkins/workspace/Lucene-Solr-trunk-Linux/solr/build/solr-core/test/J1/./org.apache.solr.cloud.UnloadDistributedZkTest-1361642189188/jetty3/index
[junit4:junit4]   2> 23916 T87 C0 P50956 oasc.CachingDirectoryFactory.close Releasing directory:/mnt/ssd/jenkins/workspace/Lucene-Solr-trunk-Linux/solr/build/solr-core/test/J1/./org.apache.solr.cloud.UnloadDistributedZkTest-1361642189188/jetty3/index.20130223185652914
[junit4:junit4]   2> 23916 T87 C0 P50956 oasc.CachingDirectoryFactory.close Releasing directory:/mnt/ssd/jenkins/workspace/Lucene-Solr-trunk-Linux/solr/build/solr-core/test/J1/./org.apache.solr.cloud.UnloadDistributedZkTest-1361642189188/jetty3/index
[junit4:junit4]   2> 23917 T87 C0 P50956 oasc.RecoveryStrategy.replay No replay needed. core=collection1
[junit4:junit4]   2> 23917 T87 C0 P50956 oasc.RecoveryStrategy.doRecovery Replication Recovery was successful - registering as Active. core=collection1
[junit4:junit4]   2> 23917 T87 C0 P50956 oasc.ZkController.publish publishing core=collection1 state=active
[junit4:junit4]   2> 23918 T87 C0 P50956 oasc.ZkController.publish numShards not found on descriptor - reading it from system property
[junit4:junit4]   2> 23920 T87 C0 P50956 oasc.RecoveryStrategy.doRecovery Finished recovery process. core=collection1
[junit4:junit4]   2> 23922 T47 oass.FileExchangeRateProvider.reload Reloading exchange rates from file currency.xml
[junit4:junit4]   2> 23932 T47 oass.OpenExchangeRatesOrgProvider.reload Reloading exchange rates from open-exchange-rates.json
[junit4:junit4]   2> 23934 T47 oass.OpenExchangeRatesOrgProvider.reload Reloading exchange rates from open-exchange-rates.json
[junit4:junit4]   2> 23935 T47 oasc.SolrCore.<init> [unloadcollection1] Opening new SolrCore at /mnt/ssd/jenkins/workspace/Lucene-Solr-trunk-Linux/solr/build/solr-core/test/J1/./org.apache.solr.cloud.UnloadDistributedZkTest-jetty1-1361642196640/unloadcollection1/, dataDir=/mnt/ssd/jenkins/workspace/Lucene-Solr-trunk-Linux/solr/build/solr-core/test/J1/./solrtest-UnloadDistributedZkTest-1361642189188/1361642212384unloadcollection1_1n/
[junit4:junit4]   2> 23936 T47 oasc.JmxMonitoredMap.<init> JMX monitoring is enabled. Adding Solr mbeans to JMX Server: com.sun.jmx.mbeanserver.JmxMBeanServer@4ba7cde3
[junit4:junit4]   2> 23937 T47 oasc.SolrCore.initDirectoryFactory org.apache.solr.core.MockDirectoryFactory
[junit4:junit4]   2> 23937 T47 oasc.CachingDirectoryFactory.get return new directory for /mnt/ssd/jenkins/workspace/Lucene-Solr-trunk-Linux/solr/build/solr-core/test/J1/./solrtest-UnloadDistributedZkTest-1361642189188/1361642212384unloadcollection1_1n forceNew:false
[junit4:junit4]   2> 23938 T47 oasc.CachingDirectoryFactory.close Releasing directory:/mnt/ssd/jenkins/workspace/Lucene-Solr-trunk-Linux/solr/build/solr-core/test/J1/./solrtest-UnloadDistributedZkTest-1361642189188/1361642212384unloadcollection1_1n
[junit4:junit4]   2> 23938 T47 oasc.SolrCore.getNewIndexDir New index directory detected: old=null new=/mnt/ssd/jenkins/workspace/Lucene-Solr-trunk-Linux/solr/build/solr-core/test/J1/./solrtest-UnloadDistributedZkTest-1361642189188/1361642212384unloadcollection1_1n/index/
[junit4:junit4]   2> 23939 T47 oasc.SolrCore.initIndex WARNING [unloadcollection1] Solr index directory '/mnt/ssd/jenkins/workspace/Lucene-Solr-trunk-Linux/solr/build/solr-core/test/J1/./solrtest-UnloadDistributedZkTest-1361642189188/1361642212384unloadcollection1_1n/index' doesn't exist. Creating new index...
[junit4:junit4]   2> 23939 T47 oasc.CachingDirectoryFactory.get return new directory for /mnt/ssd/jenkins/workspace/Lucene-Solr-trunk-Linux/solr/build/solr-core/test/J1/./solrtest-UnloadDistributedZkTest-1361642189188/1361642212384unloadcollection1_1n/index forceNew:false
[junit4:junit4]   2> 23941 T47 oasc.SolrDeletionPolicy.onCommit SolrDeletionPolicy.onCommit: commits:num=1
[junit4:junit4]   2> 		commit{dir=MockDirWrapper(org.apache.lucene.store.RAMDirectory@3ba58c02 lockFactory=org.apache.lucene.store.NativeFSLockFactory@5a15c79f),segFN=segments_1,generation=1,filenames=[segments_1]
[junit4:junit4]   2> 23942 T47 oasc.SolrDeletionPolicy.updateCommits newest commit = 1[segments_1]
[junit4:junit4]   2> 23943 T47 oasc.CachingDirectoryFactory.close Releasing directory:/mnt/ssd/jenkins/workspace/Lucene-Solr-trunk-Linux/solr/build/solr-core/test/J1/./solrtest-UnloadDistributedZkTest-1361642189188/1361642212384unloadcollection1_1n/index
[junit4:junit4]   2> 23946 T47 oasup.UpdateRequestProcessorChain.init inserting DistributedUpdateProcessorFactory into updateRequestProcessorChain "dedupe"
[junit4:junit4]   2> 23947 T47 oasup.UpdateRequestProcessorChain.init inserting DistributedUpdateProcessorFactory into updateRequestProcessorChain "stored_sig"
[junit4:junit4]   2> 23948 T47 oasup.UpdateRequestProcessorChain.init inserting DistributedUpdateProcessorFactory into updateRequestProcessorChain "distrib-dup-test-chain-implicit"
[junit4:junit4]   2> 23949 T47 oasc.RequestHandlers.initHandlersFromConfig created standard: solr.StandardRequestHandler
[junit4:junit4]   2> 23950 T47 oasc.RequestHandlers.initHandlersFromConfig created /get: solr.RealTimeGetHandler
[junit4:junit4]   2> 23950 T47 oasc.RequestHandlers.initHandlersFromConfig adding lazy requestHandler: solr.ReplicationHandler
[junit4:junit4]   2> 23951 T47 oasc.RequestHandlers.initHandlersFromConfig created /replication: solr.ReplicationHandler
[junit4:junit4]   2> 23951 T47 oasc.RequestHandlers.initHandlersFromConfig created /update: solr.UpdateRequestHandler
[junit4:junit4]   2> 23952 T47 oasc.RequestHandlers.initHandlersFromConfig created /admin/: org.apache.solr.handler.admin.AdminHandlers
[junit4:junit4]   2> 23955 T47 oashl.XMLLoader.init xsltCacheLifetimeSeconds=60
[junit4:junit4]   2> 23958 T47 oasc.CachingDirectoryFactory.close Releasing directory:/mnt/ssd/jenkins/workspace/Lucene-Solr-trunk-Linux/solr/build/solr-core/test/J1/./solrtest-UnloadDistributedZkTest-1361642189188/1361642212384unloadcollection1_1n
[junit4:junit4]   2> 23959 T47 oass.SolrIndexSearcher.<init> Opening Searcher@60f53c80 main
[junit4:junit4]   2> 23960 T47 oasu.UpdateHandler.clearLog Clearing tlog files, tlogDir=/mnt/ssd/jenkins/workspace/Lucene-Solr-trunk-Linux/solr/build/solr-core/test/J1/./solrtest-UnloadDistributedZkTest-1361642189188/1361642212384unloadcollection1_1n/tlog
[junit4:junit4]   2> 23961 T47 oasu.CommitTracker.<init> Hard AutoCommit: disabled
[junit4:junit4]   2> 23961 T47 oasu.CommitTracker.<init> Soft AutoCommit: disabled
[junit4:junit4]   2> 23965 T47 oasc.CachingDirectoryFactory.close Releasing directory:/mnt/ssd/jenkins/workspace/Lucene-Solr-trunk-Linux/solr/build/solr-core/test/J1/./solrtest-UnloadDistributedZkTest-1361642189188/1361642212384unloadcollection1_1n
[junit4:junit4]   2> 23971 T106 oasc.SolrCore.registerSearcher [unloadcollection1] Registered new searcher Searcher@60f53c80 main{StandardDirectoryReader(segments_1:1)}
[junit4:junit4]   2> 23971 T47 oasc.ZkController.publish publishing core=unloadcollection1 state=down
[junit4:junit4]   2> 24166 T36 oascc.ZkStateReader.updateClusterState Updating cloud state from ZooKeeper... 
[junit4:junit4]   2> 24167 T36 oasc.Overseer$ClusterStateUpdater.updateState Update state numShards=2 message={
[junit4:junit4]   2> 	  "numShards":"2",
[junit4:junit4]   2> 	  "core":"collection1",
[junit4:junit4]   2> 	  "collection":"collection1",
[junit4:junit4]   2> 	  "operation":"state",
[junit4:junit4]   2> 	  "shard":"shard1",
[junit4:junit4]   2> 	  "node_name":"127.0.0.1:39683_",
[junit4:junit4]   2> 	  "roles":null,
[junit4:junit4]   2> 	  "base_url":"http://127.0.0.1:39683",
[junit4:junit4]   2> 	  "state":"recovering"}
[junit4:junit4]   2> 24173 T36 oasc.Overseer$ClusterStateUpdater.updateState Update state numShards=2 message={
[junit4:junit4]   2> 	  "numShards":"2",
[junit4:junit4]   2> 	  "core":"collection1",
[junit4:junit4]   2> 	  "collection":"collection1",
[junit4:junit4]   2> 	  "operation":"state",
[junit4:junit4]   2> 	  "shard":"shard2",
[junit4:junit4]   2> 	  "node_name":"127.0.0.1:50956_",
[junit4:junit4]   2> 	  "roles":null,
[junit4:junit4]   2> 	  "base_url":"http://127.0.0.1:50956",
[junit4:junit4]   2> 	  "state":"active"}
[junit4:junit4]   2> 24176 T36 oasc.Overseer$ClusterStateUpdater.updateState Update state numShards=1 message={
[junit4:junit4]   2> 	  "numShards":"1",
[junit4:junit4]   2> 	  "core":"unloadcollection1",
[junit4:junit4]   2> 	  "collection":"unloadcollection",
[junit4:junit4]   2> 	  "operation":"state",
[junit4:junit4]   2> 	  "shard":null,
[junit4:junit4]   2> 	  "node_name":"127.0.0.1:33214_",
[junit4:junit4]   2> 	  "roles":null,
[junit4:junit4]   2> 	  "base_url":"http://127.0.0.1:33214",
[junit4:junit4]   2> 	  "state":"down"}
[junit4:junit4]   2> 24177 T36 oasc.Overseer$ClusterStateUpdater.createCollection Create collection unloadcollection with numShards 1
[junit4:junit4]   2> 24177 T36 oasc.Overseer$ClusterStateUpdater.updateState Assigning new node to shard shard=shard1
[junit4:junit4]   2> 24181 T35 oascc.ZkStateReader$2.process A cluster state change: WatchedEvent state:SyncConnected type:NodeDataChanged path:/clusterstate.json, has occurred - updating... (live nodes size: 5)
[junit4:junit4]   2> 24182 T41 oascc.ZkStateReader$2.process A cluster state change: WatchedEvent state:SyncConnected type:NodeDataChanged path:/clusterstate.json, has occurred - updating... (live nodes size: 5)
[junit4:junit4]   2> 24181 T69 oascc.ZkStateReader$2.process A cluster state change: WatchedEvent state:SyncConnected type:NodeDataChanged path:/clusterstate.json, has occurred - updating... (live nodes size: 5)
[junit4:junit4]   2> 24182 T84 oascc.ZkStateReader$2.process A cluster state change: WatchedEvent state:SyncConnected type:NodeDataChanged path:/clusterstate.json, has occurred - updating... (live nodes size: 5)
[junit4:junit4]   2> 24182 T54 oascc.ZkStateReader$2.process A cluster state change: WatchedEvent state:SyncConnected type:NodeDataChanged path:/clusterstate.json, has occurred - updating... (live nodes size: 5)
[junit4:junit4]   2> 24182 T100 oascc.ZkStateReader$2.process A cluster state change: WatchedEvent state:SyncConnected type:NodeDataChanged path:/clusterstate.json, has occurred - updating... (live nodes size: 5)
[junit4:junit4]   2> 24973 T47 oasc.CoreContainer.registerCore registering core: unloadcollection1
[junit4:junit4]   2> 24974 T47 oasc.ZkController.register Register replica - core:unloadcollection1 address:http://127.0.0.1:33214 collection:unloadcollection shard:shard1
[junit4:junit4]   2> 24975 T47 oascc.SolrZkClient.makePath makePath: /collections/unloadcollection/leader_elect/shard1/election
[junit4:junit4]   2> 24983 T17 oazs.PrepRequestProcessor.pRequest Got user-level KeeperException when processing sessionid:0x13d0832f20a0006 type:delete cxid:0xa6 zxid:0xc3 txntype:-1 reqpath:n/a Error Path:/solr/collections/unloadcollection/leaders Error:KeeperErrorCode = NoNode for /solr/collections/unloadcollection/leaders
[junit4:junit4]   2> 24984 T47 oasc.ShardLeaderElectionContext.runLeaderProcess Running the leader process.
[junit4:junit4]   2> 24984 T17 oazs.PrepRequestProcessor.pRequest Got user-level KeeperException when processing sessionid:0x13d0832f20a0006 type:create cxid:0xa7 zxid:0xc4 txntype:-1 reqpath:n/a Error Path:/solr/overseer Error:KeeperErrorCode = NodeExists for /solr/overseer
[junit4:junit4]   2> 24986 T47 oasc.ShardLeaderElectionContext.waitForReplicasToComeUp Enough replicas found to continue.
[junit4:junit4]   2> 24986 T47 oasc.ShardLeaderElectionContext.runLeaderProcess I may be the new leader - try and sync
[junit4:junit4]   2> 24986 T47 oasc.SyncStrategy.sync Sync replicas to http://127.0.0.1:33214/unloadcollection1/
[junit4:junit4]   2> 24987 T47 oasc.SyncStrategy.syncReplicas Sync Success - now sync replicas to me
[junit4:junit4]   2> 24987 T47 oasc.SyncStrategy.syncToMe http://127.0.0.1:33214/unloadcollection1/ has no replicas
[junit4:junit4]   2> 24987 T47 oasc.ShardLeaderElectionContext.runLeaderProcess I am the new leader: http://127.0.0.1:33214/unloadcollection1/
[junit4:junit4]   2> 24987 T47 oascc.SolrZkClient.makePath makePath: /collections/unloadcollection/leaders/shard1
[junit4:junit4]   2> 24991 T17 oazs.PrepRequestProcessor.pRequest Got user-level KeeperException when processing sessionid:0x13d0832f20a0006 type:create cxid:0xb1 zxid:0xc8 txntype:-1 reqpath:n/a Error Path:/solr/overseer Error:KeeperErrorCode = NodeExists for /solr/overseer
[junit4:junit4]   2> 25689 T36 oascc.ZkStateReader.updateClusterState Updating cloud state from ZooKeeper... 
[junit4:junit4]   2> 25739 T84 oascc.ZkStateReader$2.process A cluster state change: WatchedEvent state:SyncConnected type:NodeDataChanged path:/clusterstate.json, has occurred - updating... (live nodes size: 5)
[junit4:junit4]   2> 25739 T35 oascc.ZkStateReader$2.process A cluster state change: WatchedEvent state:SyncConnected type:NodeDataChanged path:/clusterstate.json, has occurred - updating... (live nodes size: 5)
[junit4:junit4]   2> 25739 T54 oascc.ZkStateReader$2.process A cluster state change: WatchedEvent state:SyncConnected type:NodeDataChanged path:/clusterstate.json, has occurred - updating... (live nodes size: 5)
[junit4:junit4]   2> 25739 T100 oascc.ZkStateReader$2.process A cluster state change: WatchedEvent state:SyncConnected type:NodeDataChanged path:/clusterstate.json, has occurred - updating... (live nodes size: 5)
[junit4:junit4]   2> 25739 T41 oascc.ZkStateReader$2.process A cluster state change: WatchedEvent state:SyncConnected type:NodeDataChanged path:/clusterstate.json, has occurred - updating... (live nodes size: 5)
[junit4:junit4]   2> 25739 T69 oascc.ZkStateReader$2.process A cluster state change: WatchedEvent state:SyncConnected type:NodeDataChanged path:/clusterstate.json, has occurred - updating... (live nodes size: 5)
[junit4:junit4]   2> 25793 T47 oasc.ZkController.register We are http://127.0.0.1:33214/unloadcollection1/ and leader is http://127.0.0.1:33214/unloadcollection1/
[junit4:junit4]   2> 25794 T47 oasc.ZkController.register No LogReplay needed for core=unloadcollection1 baseURL=http://127.0.0.1:33214
[junit4:junit4]   2> 25794 T47 oasc.ZkController.checkRecovery I am the leader, no recovery necessary
[junit4:junit4]   2> 25794 T47 oasc.ZkController.publish publishing core=unloadcollection1 state=active
[junit4:junit4]   2> 25796 T47 oascc.ZkStateReader.updateClusterState Updating cloud state from ZooKeeper... 
[junit4:junit4]   2> 25797 T47 oasc.CoreContainer.persistFile Persisting cores config to /mnt/ssd/jenkins/workspace/Lucene-Solr-trunk-Linux/solr/build/solr-core/test/J1/./org.apache.solr.cloud.UnloadDistributedZkTest-jetty1-1361642196640/solr.xml
[junit4:junit4]   2> 25811 T47 oasc.SolrXMLSerializer.persistFile Persisting cores config to /mnt/ssd/jenkins/workspace/Lucene-Solr-trunk-Linux/solr/build/solr-core/test/J1/./org.apache.solr.cloud.UnloadDistributedZkTest-jetty1-1361642196640/solr.xml
[junit4:junit4]   2> 25815 T12 oascsi.HttpClientUtil.createClient Creating new http client, config:
[junit4:junit4]   2> 25817 T12 oaz.ZooKeeper.<init> Initiating client connection, connectString=127.0.0.1:44589/solr sessionTimeout=10000 watcher=org.apache.solr.common.cloud.ConnectionManager@2aaa5483
[junit4:junit4]   2> 25818 T12 oascc.ConnectionManager.waitForConnected Waiting for client to connect to ZooKeeper
[junit4:junit4]   2> 25819 T107 oaz.ClientCnxn$SendThread.logStartConnect Opening socket connection to server localhost.localdomain/127.0.0.1:44589. Will not attempt to authenticate using SASL (access denied ("javax.security.auth.AuthPermission" "getLoginConfiguration"))
[junit4:junit4]   2> 25819 T107 oaz.ClientCnxn$SendThread.primeConnection Socket connection established to localhost.localdomain/127.0.0.1:44589, initiating session
[junit4:junit4]   2> 25820 T14 oazs.NIOServerCnxnFactory.run Accepted socket connection from /127.0.0.1:54399
[junit4:junit4]   2> 25828 T14 oazs.ZooKeeperServer.processConnectRequest Client attempting to establish new session at /127.0.0.1:54399
[junit4:junit4]   2> 25830 T16 oazs.ZooKeeperServer.finishSessionInit Established session 0x13d0832f20a000d with negotiated timeout 10000 for client /127.0.0.1:54399
[junit4:junit4]   2> 25830 T107 oaz.ClientCnxn$SendThread.onConnected Session establishment complete on server localhost.localdomain/127.0.0.1:44589, sessionid = 0x13d0832f20a000d, negotiated timeout = 10000
[junit4:junit4]   2> 25831 T108 oascc.ConnectionManager.process Watcher org.apache.solr.common.cloud.ConnectionManager@2aaa5483 name:ZooKeeperConnection Watcher:127.0.0.1:44589/solr got event WatchedEvent state:SyncConnected type:None path:null path:null type:None
[junit4:junit4]   2> 25831 T12 oascc.ConnectionManager.waitForConnected Client is connected to ZooKeeper
[junit4:junit4]   2> 25837 T12 oascc.ZkStateReader.createClusterStateWatchersAndUpdate Updating cluster state from ZooKeeper... 
[junit4:junit4]   2> 25840 T12 oascc.ZkStateReader.updateClusterState Updating cloud state from ZooKeeper... 
[junit4:junit4]   2> 25841 T12 oascsi.HttpClientUtil.createClient Creating new http client, config:maxConnections=128&maxConnectionsPerHost=32&followRedirects=false
[junit4:junit4]   2> 25852 T64 oasc.CoreContainer.create Creating SolrCore 'unloadcollection2' using instanceDir: /mnt/ssd/jenkins/workspace/Lucene-Solr-trunk-Linux/solr/build/solr-core/test/J1/./org.apache.solr.cloud.UnloadDistributedZkTest-jetty2-1361642201169/unloadcollection2
[junit4:junit4]   2> 25853 T64 oasc.ZkController.createCollectionZkNode Check for collection zkNode:unloadcollection
[junit4:junit4]   2> 25853 T64 oasc.ZkController.createCollectionZkNode Collection zkNode exists
[junit4:junit4]   2> 25854 T64 oasc.ZkController.readConfigName Load collection config from:/collections/unloadcollection
[junit4:junit4]   2> 25855 T64 oasc.SolrResourceLoader.<init> new SolrResourceLoader for directory: '/mnt/ssd/jenkins/workspace/Lucene-Solr-trunk-Linux/solr/build/solr-core/test/J1/./org.apache.solr.cloud.UnloadDistributedZkTest-jetty2-1361642201169/unloadcollection2/'
[junit4:junit4]   2> 25931 T64 oasc.SolrConfig.<init> Using Lucene MatchVersion: LUCENE_50
[junit4:junit4]   2> 26005 T64 oasc.SolrConfig.<init> Loaded SolrConfig: solrconfig.xml
[junit4:junit4]   2> 26006 T64 oass.IndexSchema.readSchema Reading Solr Schema
[junit4:junit4]   2> 26014 T64 oass.IndexSchema.readSchema Schema name=test
[junit4:junit4]   2>  C1_STATE=coll:collection1 core:collection1 props:{core=collection1, collection=collection1, shard=shard1, node_name=127.0.0.1:39683_, roles=null, base_url=http://127.0.0.1:39683, state=recovering}
[junit4:junit4]   2> 26284 T103 C1 P39683 oasc.RecoveryStrategy.doRecovery Attempting to PeerSync from http://127.0.0.1:50157/collection1/ core=collection1 - recoveringAfterStartup=true
[junit4:junit4]   2> 26285 T103 C1 P39683 oasu.PeerSync.sync PeerSync: core=collection1 url=http://127.0.0.1:39683 START replicas=[http://127.0.0.1:50157/collection1/] nUpdates=100
[junit4:junit4]   2> 26285 T103 C1 P39683 oasu.PeerSync.sync WARNING no frame of reference to tell of we've missed updates
[junit4:junit4]   2> 26285 T103 C1 P39683 oasc.RecoveryStrategy.doRecovery PeerSync Recovery was not successful - trying replication. core=collection1
[junit4:junit4]   2> 26286 T103 C1 P39683 oasc.RecoveryStrategy.doRecovery Starting Replication Recovery. core=collection1
[junit4:junit4]   2> 26286 T103 C1 P39683 oasc.RecoveryStrategy.doRecovery Begin buffering updates. core=collection1
[junit4:junit4]   2> 26286 T103 C1 P39683 oasu.UpdateLog.bufferUpdates Starting to buffer updates. FSUpdateLog{state=ACTIVE, tlog=null}
[junit4:junit4]   2> 26286 T103 C1 P39683 oasc.RecoveryStrategy.replicate Attempting to replicate from http://127.0.0.1:50157/collection1/. core=collection1
[junit4:junit4]   2> 26286 T103 C1 P39683 oascsi.HttpClientUtil.createClient Creating new http client, config:maxConnections=128&maxConnectionsPerHost=32&followRedirects=false
[junit4:junit4]   2> ASYNC  NEW_CORE C3 name=collection1 org.apache.solr.core.SolrCore@6a9e9a09 url=http://127.0.0.1:50157/collection1 node=127.0.0.1:50157_ C3_STATE=coll:collection1 core:collection1 props:{core=collection1, collection=collection1, shard=shard1, node_name=127.0.0.1:50157_, roles=null, base_url=http://127.0.0.1:50157, state=active, leader=true}
[junit4:junit4]   2> 26297 T62 C3 P50157 REQ /get {version=2&getVersions=100&wt=javabin&qt=/get&distrib=false} status=0 QTime=0 
[junit4:junit4]   2> 26299 T65 C3 P50157 oasu.DirectUpdateHandler2.commit start commit{,optimize=false,openSearcher=false,waitSearcher=true,expungeDeletes=false,softCommit=false,prepareCommit=false}
[junit4:junit4]   2> 26300 T65 C3 P50157 oasc.CachingDirectoryFactory.close Releasing directory:/mnt/ssd/jenkins/workspace/Lucene-Solr-trunk-Linux/solr/build/solr-core/test/J1/./org.apache.solr.cloud.UnloadDistributedZkTest-1361642189188/jetty2
[junit4:junit4]   2> 26302 T65 C3 P50157 oasc.SolrDeletionPolicy.onInit SolrDeletionPolicy.onInit: commits:num=1
[junit4:junit4]   2> 		commit{dir=MockDirWrapper(org.apache.lucene.store.RAMDirectory@6e0c7dc6 lockFactory=org.apache.lucene.store.NativeFSLockFactory@3f02ae),segFN=segments_1,generation=1,filenames=[segments_1]
[junit4:junit4]   2> 26304 T65 C3 P50157 oasc.SolrDeletionPolicy.updateCommits newest commit = 1[segments_1]
[junit4:junit4]   2> 26305 T65 C3 P50157 oasc.SolrDeletionPolicy.onCommit SolrDeletionPolicy.onCommit: commits:num=2
[junit4:junit4]   2> 		commit{dir=MockDirWrapper(org.apache.lucene.store.RAMDirectory@6e0c7dc6 lockFactory=org.apache.lucene.store.NativeFSLockFactory@3f02ae),segFN=segments_1,generation=1,filenames=[segments_1]
[junit4:junit4]   2> 		commit{dir=MockDirWrapper(org.apache.lucene.store.RAMDirectory@6e0c7dc6 lockFactory=org.apache.lucene.store.NativeFSLockFactory@3f02ae),segFN=segments_2,generation=2,filenames=[segments_2]
[junit4:junit4]   2> 26305 T65 C3 P50157 oasc.SolrDeletionPolicy.updateCommits newest commit = 2[segments_2]
[junit4:junit4]   2> 26306 T65 C3 P50157 oasc.CachingDirectoryFactory.close Releasing directory:/mnt/ssd/jenkins/workspace/Lucene-Solr-trunk-Linux/solr/build/solr-core/test/J1/./org.apache.solr.cloud.UnloadDistributedZkTest-1361642189188/jetty2
[junit4:junit4]   2> 26306 T65 C3 P50157 oass.SolrIndexSearcher.<init> Opening Searcher@1b541798 realtime
[junit4:junit4]   2> 26307 T65 C3 P50157 oasu.DirectUpdateHandler2.commit end_commit_flush
[junit4:junit4]   2> 26307 T65 C3 P50157 /update {softCommit=false&waitSearcher=true&version=2&wt=javabin&openSearcher=false&commit_end_point=true&commit=true} {commit=} 0 8
[junit4:junit4]   2> 26309 T103 C1 P39683 oash.ReplicationHandler.inform Commits will be reserved for  10000
[junit4:junit4]   2> 26316 T103 C1 P39683 oash.SnapPuller.<init>  No value set for 'pollInterval'. Timer Task not started.
[junit4:junit4]   2> 26322 T62 C3 P50157 oash.ReplicationHandler.inform Commits will be reserved for  10000
[junit4:junit4]   2> 26323 T62 C3 P50157 REQ /replication {version=2&wt=javabin&qt=/replication&command=indexversion} status=0 QTime=2 
[junit4:junit4]   2> 26324 T103 C1 P39683 oash.SnapPuller.fetchLatestIndex Master's generation: 2
[junit4:junit4]   2> 26324 T103 C1 P39683 oash.SnapPuller.fetchLatestIndex Slave's generation: 1
[junit4:junit4]   2> 26324 T103 C1 P39683 oash.SnapPuller.fetchLatestIndex Starting replication process
[junit4:junit4]   2> 26327 T63 C3 P50157 oasc.CachingDirectoryFactory.close Releasing directory:/mnt/ssd/jenkins/workspace/Lucene-Solr-trunk-Linux/solr/build/solr-core/test/J1/./org.apache.solr.cloud.UnloadDistributedZkTest-1361642189188/jetty2
[junit4:junit4]   2> 26328 T63 C3 P50157 oasc.CachingDirectoryFactory.close Releasing directory:/mnt/ssd/jenkins/workspace/Lucene-Solr-trunk-Linux/solr/build/solr-core/test/J1/./org.apache.solr.cloud.UnloadDistributedZkTest-1361642189188/jetty2/index
[junit4:junit4]   2> 26328 T63 C3 P50157 REQ /replication {generation=2&version=2&wt=javabin&qt=/replication&command=filelist} status=0 QTime=1 
[junit4:junit4]   2> 26329 T103 C1 P39683 oash.SnapPuller.fetchLatestIndex Number of files in latest index in master: 1
[junit4:junit4]   2> 26331 T103 C1 P39683 oasc.CachingDirectoryFactory.get return new directory for /mnt/ssd/jenkins/workspace/Lucene-Solr-trunk-Linux/solr/build/solr-core/test/J1/./org.apache.solr.cloud.UnloadDistributedZkTest-1361642189188/jetty4/index.20130223185655430 forceNew:false
[junit4:junit4]   2> 26331 T103 C1 P39683 oasc.CachingDirectoryFactory.close Releasing directory:/mnt/ssd/jenkins/workspace/Lucene-Solr-trunk-Linux/solr/build/solr-core/test/J1/./org.apache.solr.cloud.UnloadDistributedZkTest-1361642189188/jetty4
[junit4:junit4]   2> 26331 T103 C1 P39683 oash.SnapPuller.fetchLatestIndex Starting download to MockDirWrapper(org.apache.lucene.store.RAMDirectory@609607fc lockFactory=org.apache.lucene.store.NativeFSLockFactory@6469048a) fullCopy=true
[junit4:junit4]   2> 26334 T65 C3 P50157 REQ /replication {checksum=true&generation=2&file=segments_2&wt=filestream&qt=/replication&command=filecontent} status=0 QTime=0 
[junit4:junit4]   2> 26336 T103 C1 P39683 oasc.CachingDirectoryFactory.close Releasing directory:/mnt/ssd/jenkins/workspace/Lucene-Solr-trunk-Linux/solr/build/solr-core/test/J1/./org.apache.solr.cloud.UnloadDistributedZkTest-1361642189188/jetty4/index
[junit4:junit4]   2> 26336 T103 C1 P39683 oash.SnapPuller.fetchLatestIndex Total time taken for download : 0 secs
[junit4:junit4]   2> 26336 T103 C1 P39683 oash.SnapPuller.modifyIndexProps New index installed. Updating index properties... index=index.20130223185655430
[junit4:junit4]   2> 26337 T103 C1 P39683 oasc.CachingDirectoryFactory.close Releasing directory:/mnt/ssd/jenkins/workspace/Lucene-Solr-trunk-Linux/solr/build/solr-core/te

[...truncated too long message...]

    {"id":"89236582519406595-127.0.0.1:52315_-n_0000000000"}
[junit4:junit4]   1>    /solr/overseer_elect/election (5)
[junit4:junit4]   1>     /solr/overseer_elect/election/89236582519406595-127.0.0.1:52315_-n_0000000000 (0)
[junit4:junit4]   1>     /solr/overseer_elect/election/89236582519406604-127.0.0.1:39683_-n_0000000004 (0)
[junit4:junit4]   1>     /solr/overseer_elect/election/89236582519406602-127.0.0.1:50956_-n_0000000003 (0)
[junit4:junit4]   1>     /solr/overseer_elect/election/89236582519406598-127.0.0.1:33214_-n_0000000001 (0)
[junit4:junit4]   1>     /solr/overseer_elect/election/89236582519406600-127.0.0.1:50157_-n_0000000002 (0)
[junit4:junit4]   1>   /solr/live_nodes (5)
[junit4:junit4]   1>    /solr/live_nodes/127.0.0.1:50956_ (0)
[junit4:junit4]   1>    /solr/live_nodes/127.0.0.1:50157_ (0)
[junit4:junit4]   1>    /solr/live_nodes/127.0.0.1:39683_ (0)
[junit4:junit4]   1>    /solr/live_nodes/127.0.0.1:33214_ (0)
[junit4:junit4]   1>    /solr/live_nodes/127.0.0.1:52315_ (0)
[junit4:junit4]   1>  /zookeeper (1)
[junit4:junit4]   1>  DATA:
[junit4:junit4]   1>      
[junit4:junit4]   1> 
[junit4:junit4]   2> NOTE: reproduce with: ant test  -Dtestcase=UnloadDistributedZkTest -Dtests.method=testDistribSearch -Dtests.seed=1790C2D5AB933494 -Dtests.multiplier=3 -Dtests.slow=true -Dtests.locale=fr_FR -Dtests.timezone=Africa/Brazzaville -Dtests.file.encoding=UTF-8
[junit4:junit4] FAILURE  162s J1 | UnloadDistributedZkTest.testDistribSearch <<<
[junit4:junit4]    > Throwable #1: java.lang.AssertionError: Still found shard
[junit4:junit4]    > 	at __randomizedtesting.SeedInfo.seed([1790C2D5AB933494:96764CCDDCCC54A8]:0)
[junit4:junit4]    > 	at org.junit.Assert.fail(Assert.java:93)
[junit4:junit4]    > 	at org.apache.solr.cloud.UnloadDistributedZkTest.testUnloadShardAndCollection(UnloadDistributedZkTest.java:120)
[junit4:junit4]    > 	at org.apache.solr.cloud.UnloadDistributedZkTest.doTest(UnloadDistributedZkTest.java:73)
[junit4:junit4]    > 	at org.apache.solr.BaseDistributedSearchTestCase.testDistribSearch(BaseDistributedSearchTestCase.java:794)
[junit4:junit4]    > 	at sun.reflect.NativeMethodAccessorImpl.invoke0(Native Method)
[junit4:junit4]    > 	at sun.reflect.NativeMethodAccessorImpl.invoke(NativeMethodAccessorImpl.java:57)
[junit4:junit4]    > 	at sun.reflect.DelegatingMethodAccessorImpl.invoke(DelegatingMethodAccessorImpl.java:43)
[junit4:junit4]    > 	at java.lang.reflect.Method.invoke(Method.java:474)
[junit4:junit4]    > 	at com.carrotsearch.randomizedtesting.RandomizedRunner.invoke(RandomizedRunner.java:1559)
[junit4:junit4]    > 	at com.carrotsearch.randomizedtesting.RandomizedRunner.access$600(RandomizedRunner.java:79)
[junit4:junit4]    > 	at com.carrotsearch.randomizedtesting.RandomizedRunner$6.evaluate(RandomizedRunner.java:737)
[junit4:junit4]    > 	at com.carrotsearch.randomizedtesting.RandomizedRunner$7.evaluate(RandomizedRunner.java:773)
[junit4:junit4]    > 	at com.carrotsearch.randomizedtesting.RandomizedRunner$8.evaluate(RandomizedRunner.java:787)
[junit4:junit4]    > 	at com.carrotsearch.randomizedtesting.rules.SystemPropertiesRestoreRule$1.evaluate(SystemPropertiesRestoreRule.java:53)
[junit4:junit4]    > 	at org.apache.lucene.util.TestRuleSetupTeardownChained$1.evaluate(TestRuleSetupTeardownChained.java:50)
[junit4:junit4]    > 	at org.apache.lucene.util.TestRuleFieldCacheSanity$1.evaluate(TestRuleFieldCacheSanity.java:51)
[junit4:junit4]    > 	at org.apache.lucene.util.AbstractBeforeAfterRule$1.evaluate(AbstractBeforeAfterRule.java:46)
[junit4:junit4]    > 	at com.carrotsearch.randomizedtesting.rules.SystemPropertiesInvariantRule$1.evaluate(SystemPropertiesInvariantRule.java:55)
[junit4:junit4]    > 	at org.apache.lucene.util.TestRuleThreadAndTestName$1.evaluate(TestRuleThreadAndTestName.java:49)
[junit4:junit4]    > 	at org.apache.lucene.util.TestRuleIgnoreAfterMaxFailures$1.evaluate(TestRuleIgnoreAfterMaxFailures.java:70)
[junit4:junit4]    > 	at org.apache.lucene.util.TestRuleMarkFailure$1.evaluate(TestRuleMarkFailure.java:48)
[junit4:junit4]    > 	at com.carrotsearch.randomizedtesting.rules.StatementAdapter.evaluate(StatementAdapter.java:36)
[junit4:junit4]    > 	at com.carrotsearch.randomizedtesting.ThreadLeakControl$StatementRunner.run(ThreadLeakControl.java:358)
[junit4:junit4]    > 	at com.carrotsearch.randomizedtesting.ThreadLeakControl.forkTimeoutingTask(ThreadLeakControl.java:782)
[junit4:junit4]    > 	at com.carrotsearch.randomizedtesting.ThreadLeakControl$3.evaluate(ThreadLeakControl.java:442)
[junit4:junit4]    > 	at com.carrotsearch.randomizedtesting.RandomizedRunner.runSingleTest(RandomizedRunner.java:746)
[junit4:junit4]    > 	at com.carrotsearch.randomizedtesting.RandomizedRunner$3.evaluate(RandomizedRunner.java:648)
[junit4:junit4]    > 	at com.carrotsearch.randomizedtesting.RandomizedRunner$4.evaluate(RandomizedRunner.java:682)
[junit4:junit4]    > 	at com.carrotsearch.randomizedtesting.RandomizedRunner$5.evaluate(RandomizedRunner.java:693)
[junit4:junit4]    > 	at com.carrotsearch.randomizedtesting.rules.StatementAdapter.evaluate(StatementAdapter.java:36)
[junit4:junit4]    > 	at com.carrotsearch.randomizedtesting.rules.SystemPropertiesRestoreRule$1.evaluate(SystemPropertiesRestoreRule.java:53)
[junit4:junit4]    > 	at org.apache.lucene.util.AbstractBeforeAfterRule$1.evaluate(AbstractBeforeAfterRule.java:46)
[junit4:junit4]    > 	at org.apache.lucene.util.TestRuleStoreClassName$1.evaluate(TestRuleStoreClassName.java:42)
[junit4:junit4]    > 	at com.carrotsearch.randomizedtesting.rules.SystemPropertiesInvariantRule$1.evaluate(SystemPropertiesInvariantRule.java:55)
[junit4:junit4]    > 	at com.carrotsearch.randomizedtesting.rules.NoShadowingOrOverridesOnMethodsRule$1.evaluate(NoShadowingOrOverridesOnMethodsRule.java:39)
[junit4:junit4]    > 	at com.carrotsearch.randomizedtesting.rules.NoShadowingOrOverridesOnMethodsRule$1.evaluate(NoShadowingOrOverridesOnMethodsRule.java:39)
[junit4:junit4]    > 	at com.carrotsearch.randomizedtesting.rules.StatementAdapter.evaluate(StatementAdapter.java:36)
[junit4:junit4]    > 	at org.apache.lucene.util.TestRuleAssertionsRequired$1.evaluate(TestRuleAssertionsRequired.java:43)
[junit4:junit4]    > 	at org.apache.lucene.util.TestRuleMarkFailure$1.evaluate(TestRuleMarkFailure.java:48)
[junit4:junit4]    > 	at org.apache.lucene.util.TestRuleIgnoreAfterMaxFailures$1.evaluate(TestRuleIgnoreAfterMaxFailures.java:70)
[junit4:junit4]    > 	at org.apache.lucene.util.TestRuleIgnoreTestSuites$1.evaluate(TestRuleIgnoreTestSuites.java:55)
[junit4:junit4]    > 	at com.carrotsearch.randomizedtesting.rules.StatementAdapter.evaluate(StatementAdapter.java:36)
[junit4:junit4]    > 	at com.carrotsearch.randomizedtesting.ThreadLeakControl$StatementRunner.run(ThreadLeakControl.java:358)
[junit4:junit4]    > 	at java.lang.Thread.run(Thread.java:722)
[junit4:junit4]   2> 161747 T12 oas.SolrTestCaseJ4.deleteCore ###deleteCore
[junit4:junit4]   2> 161776 T11 ccr.ThreadLeakControl.checkThreadLeaks WARNING Will linger awaiting termination of 3 leaked thread(s).
[junit4:junit4]   2> 161900 T15 oazs.SessionTrackerImpl.run SessionTrackerImpl exited loop!
[junit4:junit4]   2> 162800 T100 oascc.ZkStateReader$3.process WARNING ZooKeeper watch triggered, but Solr cannot talk to ZK
[junit4:junit4]   2> 162801 T100 oascc.ZkStateReader$2.process A cluster state change: WatchedEvent state:SyncConnected type:NodeChildrenChanged path:/live_nodes, has occurred - updating... (live nodes size: 1)
[junit4:junit4]   2> 162801 T100 oascc.ZkStateReader$2.process WARNING ZooKeeper watch triggered, but Solr cannot talk to ZK
[junit4:junit4]   2> 162801 T100 oaz.ClientCnxn$EventThread.run EventThread shut down
[junit4:junit4]   2> NOTE: test params are: codec=Lucene42: {range_facet_sl=PostingsFormat(name=MockRandom), a_t=PostingsFormat(name=MockSep), a_si=PostingsFormat(name=Memory doPackFST= true), timestamp=PostingsFormat(name=MockSep), multiDefault=PostingsFormat(name=MockSep), other_tl1=PostingsFormat(name=Memory doPackFST= true), range_facet_l=PostingsFormat(name=MockSep), text=PostingsFormat(name=Memory doPackFST= false), intDefault=PostingsFormat(name=Memory doPackFST= true), id=PostingsFormat(name=MockRandom), range_facet_si=PostingsFormat(name=MockSep), _version_=PostingsFormat(name=Memory doPackFST= true)}, docValues:{timestamp=DocValuesFormat(name=CheapBastard)}, sim=RandomSimilarityProvider(queryNorm=false,coord=no): {}, locale=fr_FR, timezone=Africa/Brazzaville
[junit4:junit4]   2> NOTE: Linux 3.2.0-38-generic amd64/Oracle Corporation 1.8.0-ea (64-bit)/cpus=8,threads=1,free=86165128,total=126484480
[junit4:junit4]   2> NOTE: All tests run in this JVM: [UnloadDistributedZkTest]
[junit4:junit4] Completed on J1 in 163.83s, 1 test, 1 failure <<< FAILURES!

[...truncated 695 lines...]
BUILD FAILED
/mnt/ssd/jenkins/workspace/Lucene-Solr-trunk-Linux/build.xml:381: The following error occurred while executing this line:
/mnt/ssd/jenkins/workspace/Lucene-Solr-trunk-Linux/build.xml:361: The following error occurred while executing this line:
/mnt/ssd/jenkins/workspace/Lucene-Solr-trunk-Linux/build.xml:39: The following error occurred while executing this line:
/mnt/ssd/jenkins/workspace/Lucene-Solr-trunk-Linux/solr/build.xml:183: The following error occurred while executing this line:
/mnt/ssd/jenkins/workspace/Lucene-Solr-trunk-Linux/solr/common-build.xml:447: The following error occurred while executing this line:
/mnt/ssd/jenkins/workspace/Lucene-Solr-trunk-Linux/lucene/common-build.xml:1202: The following error occurred while executing this line:
/mnt/ssd/jenkins/workspace/Lucene-Solr-trunk-Linux/lucene/common-build.xml:865: There were test failures: 254 suites, 1063 tests, 1 failure, 8 ignored (3 assumptions)

Total time: 36 minutes 12 seconds
Build step 'Invoke Ant' marked build as failure
Archiving artifacts
Recording test results
Description set: Java: 64bit/jdk1.8.0-ea-b65 -XX:+UseSerialGC
Email was triggered for: Failure
Sending email for trigger: Failure



Mime
View raw message