lucene-dev mailing list archives

Site index · List index
Message view « Date » · « Thread »
Top « Date » · « Thread »
From Apache Jenkins Server <jenk...@builds.apache.org>
Subject [JENKINS] Lucene-Solr-Tests-4.x-java7 - Build # 957 - Failure
Date Sat, 02 Feb 2013 05:22:13 GMT
Build: https://builds.apache.org/job/Lucene-Solr-Tests-4.x-java7/957/

1 tests failed.
REGRESSION:  org.apache.solr.cloud.SyncSliceTest.testDistribSearch

Error Message:
shard1 should have just been set up to be inconsistent - but it's still consistent

Stack Trace:
java.lang.AssertionError: shard1 should have just been set up to be inconsistent - but it's still consistent
	at __randomizedtesting.SeedInfo.seed([12F5F8D07C79C7C8:931376C80B26A7F4]:0)
	at org.junit.Assert.fail(Assert.java:93)
	at org.junit.Assert.assertTrue(Assert.java:43)
	at org.junit.Assert.assertNotNull(Assert.java:526)
	at org.apache.solr.cloud.SyncSliceTest.doTest(SyncSliceTest.java:214)
	at org.apache.solr.BaseDistributedSearchTestCase.testDistribSearch(BaseDistributedSearchTestCase.java:794)
	at sun.reflect.NativeMethodAccessorImpl.invoke0(Native Method)
	at sun.reflect.NativeMethodAccessorImpl.invoke(NativeMethodAccessorImpl.java:57)
	at sun.reflect.DelegatingMethodAccessorImpl.invoke(DelegatingMethodAccessorImpl.java:43)
	at java.lang.reflect.Method.invoke(Method.java:601)
	at com.carrotsearch.randomizedtesting.RandomizedRunner.invoke(RandomizedRunner.java:1559)
	at com.carrotsearch.randomizedtesting.RandomizedRunner.access$600(RandomizedRunner.java:79)
	at com.carrotsearch.randomizedtesting.RandomizedRunner$6.evaluate(RandomizedRunner.java:737)
	at com.carrotsearch.randomizedtesting.RandomizedRunner$7.evaluate(RandomizedRunner.java:773)
	at com.carrotsearch.randomizedtesting.RandomizedRunner$8.evaluate(RandomizedRunner.java:787)
	at com.carrotsearch.randomizedtesting.rules.SystemPropertiesRestoreRule$1.evaluate(SystemPropertiesRestoreRule.java:53)
	at org.apache.lucene.util.TestRuleSetupTeardownChained$1.evaluate(TestRuleSetupTeardownChained.java:50)
	at org.apache.lucene.util.TestRuleFieldCacheSanity$1.evaluate(TestRuleFieldCacheSanity.java:51)
	at org.apache.lucene.util.AbstractBeforeAfterRule$1.evaluate(AbstractBeforeAfterRule.java:46)
	at com.carrotsearch.randomizedtesting.rules.SystemPropertiesInvariantRule$1.evaluate(SystemPropertiesInvariantRule.java:55)
	at org.apache.lucene.util.TestRuleThreadAndTestName$1.evaluate(TestRuleThreadAndTestName.java:49)
	at org.apache.lucene.util.TestRuleIgnoreAfterMaxFailures$1.evaluate(TestRuleIgnoreAfterMaxFailures.java:70)
	at org.apache.lucene.util.TestRuleMarkFailure$1.evaluate(TestRuleMarkFailure.java:48)
	at com.carrotsearch.randomizedtesting.rules.StatementAdapter.evaluate(StatementAdapter.java:36)
	at com.carrotsearch.randomizedtesting.ThreadLeakControl$StatementRunner.run(ThreadLeakControl.java:358)
	at com.carrotsearch.randomizedtesting.ThreadLeakControl.forkTimeoutingTask(ThreadLeakControl.java:782)
	at com.carrotsearch.randomizedtesting.ThreadLeakControl$3.evaluate(ThreadLeakControl.java:442)
	at com.carrotsearch.randomizedtesting.RandomizedRunner.runSingleTest(RandomizedRunner.java:746)
	at com.carrotsearch.randomizedtesting.RandomizedRunner$3.evaluate(RandomizedRunner.java:648)
	at com.carrotsearch.randomizedtesting.RandomizedRunner$4.evaluate(RandomizedRunner.java:682)
	at com.carrotsearch.randomizedtesting.RandomizedRunner$5.evaluate(RandomizedRunner.java:693)
	at com.carrotsearch.randomizedtesting.rules.StatementAdapter.evaluate(StatementAdapter.java:36)
	at com.carrotsearch.randomizedtesting.rules.SystemPropertiesRestoreRule$1.evaluate(SystemPropertiesRestoreRule.java:53)
	at org.apache.lucene.util.AbstractBeforeAfterRule$1.evaluate(AbstractBeforeAfterRule.java:46)
	at org.apache.lucene.util.TestRuleStoreClassName$1.evaluate(TestRuleStoreClassName.java:42)
	at com.carrotsearch.randomizedtesting.rules.SystemPropertiesInvariantRule$1.evaluate(SystemPropertiesInvariantRule.java:55)
	at com.carrotsearch.randomizedtesting.rules.NoShadowingOrOverridesOnMethodsRule$1.evaluate(NoShadowingOrOverridesOnMethodsRule.java:39)
	at com.carrotsearch.randomizedtesting.rules.NoShadowingOrOverridesOnMethodsRule$1.evaluate(NoShadowingOrOverridesOnMethodsRule.java:39)
	at com.carrotsearch.randomizedtesting.rules.StatementAdapter.evaluate(StatementAdapter.java:36)
	at org.apache.lucene.util.TestRuleAssertionsRequired$1.evaluate(TestRuleAssertionsRequired.java:43)
	at org.apache.lucene.util.TestRuleMarkFailure$1.evaluate(TestRuleMarkFailure.java:48)
	at org.apache.lucene.util.TestRuleIgnoreAfterMaxFailures$1.evaluate(TestRuleIgnoreAfterMaxFailures.java:70)
	at org.apache.lucene.util.TestRuleIgnoreTestSuites$1.evaluate(TestRuleIgnoreTestSuites.java:55)
	at com.carrotsearch.randomizedtesting.rules.StatementAdapter.evaluate(StatementAdapter.java:36)
	at com.carrotsearch.randomizedtesting.ThreadLeakControl$StatementRunner.run(ThreadLeakControl.java:358)
	at java.lang.Thread.run(Thread.java:722)




Build Log:
[...truncated 8734 lines...]
[junit4:junit4] Suite: org.apache.solr.cloud.SyncSliceTest
[junit4:junit4]   2> 0 T1229 oas.BaseDistributedSearchTestCase.initHostContext Setting hostContext system property: /_pzw/
[junit4:junit4]   2> 7 T1229 oas.SolrTestCaseJ4.setUp ###Starting testDistribSearch
[junit4:junit4]   2> Creating dataDir: /usr/home/hudson/hudson-slave/workspace/Lucene-Solr-Tests-4.x-java7/solr/build/solr-core/test/J1/./solrtest-SyncSliceTest-1359781873151
[junit4:junit4]   2> 8 T1229 oasc.ZkTestServer.run STARTING ZK TEST SERVER
[junit4:junit4]   2> 9 T1230 oasc.ZkTestServer$ZKServerMain.runFromConfig Starting server
[junit4:junit4]   2> 13 T1230 oazs.ZooKeeperServer.setTickTime tickTime set to 1000
[junit4:junit4]   2> 13 T1230 oazs.ZooKeeperServer.setMinSessionTimeout minSessionTimeout set to -1
[junit4:junit4]   2> 13 T1230 oazs.ZooKeeperServer.setMaxSessionTimeout maxSessionTimeout set to -1
[junit4:junit4]   2> 14 T1230 oazs.NIOServerCnxnFactory.configure binding to port 0.0.0.0/0.0.0.0:0
[junit4:junit4]   2> 15 T1230 oazsp.FileTxnSnapLog.save Snapshotting: 0x0 to /usr/home/hudson/hudson-slave/workspace/Lucene-Solr-Tests-4.x-java7/solr/build/solr-core/test/J1/./org.apache.solr.cloud.SyncSliceTest-1359781873150/zookeeper/server1/data/version-2/snapshot.0
[junit4:junit4]   2> 110 T1229 oasc.ZkTestServer.run start zk server on port:25600
[junit4:junit4]   2> 110 T1229 oaz.ZooKeeper.<init> Initiating client connection, connectString=127.0.0.1:25600 sessionTimeout=10000 watcher=org.apache.solr.common.cloud.ConnectionManager@2d26d80c
[junit4:junit4]   2> 111 T1229 oascc.ConnectionManager.waitForConnected Waiting for client to connect to ZooKeeper
[junit4:junit4]   2> 112 T1235 oaz.ClientCnxn$SendThread.logStartConnect Opening socket connection to server localhost/127.0.0.1:25600. Will not attempt to authenticate using SASL (access denied ("javax.security.auth.AuthPermission" "getLoginConfiguration"))
[junit4:junit4]   2> 112 T1235 oaz.ClientCnxn$SendThread.primeConnection Socket connection established to localhost/127.0.0.1:25600, initiating session
[junit4:junit4]   2> 113 T1231 oazs.NIOServerCnxnFactory.run Accepted socket connection from /140.211.11.196:40260
[junit4:junit4]   2> 113 T1231 oazs.ZooKeeperServer.processConnectRequest Client attempting to establish new session at /140.211.11.196:40260
[junit4:junit4]   2> 114 T1233 oazsp.FileTxnLog.append Creating new log file: log.1
[junit4:junit4]   2> 124 T1233 oazs.ZooKeeperServer.finishSessionInit Established session 0x13c9950c6070000 with negotiated timeout 10000 for client /140.211.11.196:40260
[junit4:junit4]   2> 124 T1235 oaz.ClientCnxn$SendThread.onConnected Session establishment complete on server localhost/127.0.0.1:25600, sessionid = 0x13c9950c6070000, negotiated timeout = 10000
[junit4:junit4]   2> 125 T1236 oascc.ConnectionManager.process Watcher org.apache.solr.common.cloud.ConnectionManager@2d26d80c name:ZooKeeperConnection Watcher:127.0.0.1:25600 got event WatchedEvent state:SyncConnected type:None path:null path:null type:None
[junit4:junit4]   2> 125 T1229 oascc.ConnectionManager.waitForConnected Client is connected to ZooKeeper
[junit4:junit4]   2> 125 T1229 oascc.SolrZkClient.makePath makePath: /solr
[junit4:junit4]   2> 134 T1234 oazs.PrepRequestProcessor.pRequest2Txn Processed session termination for sessionid: 0x13c9950c6070000
[junit4:junit4]   2> 142 T1236 oaz.ClientCnxn$EventThread.run EventThread shut down
[junit4:junit4]   2> 142 T1231 oazs.NIOServerCnxn.closeSock Closed socket connection for client /140.211.11.196:40260 which had sessionid 0x13c9950c6070000
[junit4:junit4]   2> 142 T1229 oaz.ZooKeeper.close Session: 0x13c9950c6070000 closed
[junit4:junit4]   2> 143 T1229 oaz.ZooKeeper.<init> Initiating client connection, connectString=127.0.0.1:25600/solr sessionTimeout=10000 watcher=org.apache.solr.common.cloud.ConnectionManager@78338169
[junit4:junit4]   2> 143 T1229 oascc.ConnectionManager.waitForConnected Waiting for client to connect to ZooKeeper
[junit4:junit4]   2> 144 T1237 oaz.ClientCnxn$SendThread.logStartConnect Opening socket connection to server localhost/127.0.0.1:25600. Will not attempt to authenticate using SASL (access denied ("javax.security.auth.AuthPermission" "getLoginConfiguration"))
[junit4:junit4]   2> 144 T1237 oaz.ClientCnxn$SendThread.primeConnection Socket connection established to localhost/127.0.0.1:25600, initiating session
[junit4:junit4]   2> 144 T1231 oazs.NIOServerCnxnFactory.run Accepted socket connection from /140.211.11.196:64114
[junit4:junit4]   2> 145 T1231 oazs.ZooKeeperServer.processConnectRequest Client attempting to establish new session at /140.211.11.196:64114
[junit4:junit4]   2> 149 T1233 oazs.ZooKeeperServer.finishSessionInit Established session 0x13c9950c6070001 with negotiated timeout 10000 for client /140.211.11.196:64114
[junit4:junit4]   2> 149 T1237 oaz.ClientCnxn$SendThread.onConnected Session establishment complete on server localhost/127.0.0.1:25600, sessionid = 0x13c9950c6070001, negotiated timeout = 10000
[junit4:junit4]   2> 150 T1238 oascc.ConnectionManager.process Watcher org.apache.solr.common.cloud.ConnectionManager@78338169 name:ZooKeeperConnection Watcher:127.0.0.1:25600/solr got event WatchedEvent state:SyncConnected type:None path:null path:null type:None
[junit4:junit4]   2> 150 T1229 oascc.ConnectionManager.waitForConnected Client is connected to ZooKeeper
[junit4:junit4]   2> 150 T1229 oascc.SolrZkClient.makePath makePath: /collections/collection1
[junit4:junit4]   2> 167 T1229 oascc.SolrZkClient.makePath makePath: /collections/collection1/shards
[junit4:junit4]   2> 174 T1229 oascc.SolrZkClient.makePath makePath: /collections/control_collection
[junit4:junit4]   2> 182 T1229 oascc.SolrZkClient.makePath makePath: /collections/control_collection/shards
[junit4:junit4]   2> 192 T1229 oasc.AbstractZkTestCase.putConfig put /usr/home/hudson/hudson-slave/workspace/Lucene-Solr-Tests-4.x-java7/solr/build/solr-core/test-files/solr/collection1/conf/solrconfig.xml to /configs/conf1/solrconfig.xml
[junit4:junit4]   2> 193 T1229 oascc.SolrZkClient.makePath makePath: /configs/conf1/solrconfig.xml
[junit4:junit4]   2> 223 T1229 oasc.AbstractZkTestCase.putConfig put /usr/home/hudson/hudson-slave/workspace/Lucene-Solr-Tests-4.x-java7/solr/build/solr-core/test-files/solr/collection1/conf/schema.xml to /configs/conf1/schema.xml
[junit4:junit4]   2> 224 T1229 oascc.SolrZkClient.makePath makePath: /configs/conf1/schema.xml
[junit4:junit4]   2> 332 T1229 oasc.AbstractZkTestCase.putConfig put /usr/home/hudson/hudson-slave/workspace/Lucene-Solr-Tests-4.x-java7/solr/build/solr-core/test-files/solr/collection1/conf/stopwords.txt to /configs/conf1/stopwords.txt
[junit4:junit4]   2> 333 T1229 oascc.SolrZkClient.makePath makePath: /configs/conf1/stopwords.txt
[junit4:junit4]   2> 342 T1229 oasc.AbstractZkTestCase.putConfig put /usr/home/hudson/hudson-slave/workspace/Lucene-Solr-Tests-4.x-java7/solr/build/solr-core/test-files/solr/collection1/conf/protwords.txt to /configs/conf1/protwords.txt
[junit4:junit4]   2> 343 T1229 oascc.SolrZkClient.makePath makePath: /configs/conf1/protwords.txt
[junit4:junit4]   2> 350 T1229 oasc.AbstractZkTestCase.putConfig put /usr/home/hudson/hudson-slave/workspace/Lucene-Solr-Tests-4.x-java7/solr/build/solr-core/test-files/solr/collection1/conf/currency.xml to /configs/conf1/currency.xml
[junit4:junit4]   2> 351 T1229 oascc.SolrZkClient.makePath makePath: /configs/conf1/currency.xml
[junit4:junit4]   2> 360 T1229 oasc.AbstractZkTestCase.putConfig put /usr/home/hudson/hudson-slave/workspace/Lucene-Solr-Tests-4.x-java7/solr/build/solr-core/test-files/solr/collection1/conf/open-exchange-rates.json to /configs/conf1/open-exchange-rates.json
[junit4:junit4]   2> 361 T1229 oascc.SolrZkClient.makePath makePath: /configs/conf1/open-exchange-rates.json
[junit4:junit4]   2> 368 T1229 oasc.AbstractZkTestCase.putConfig put /usr/home/hudson/hudson-slave/workspace/Lucene-Solr-Tests-4.x-java7/solr/build/solr-core/test-files/solr/collection1/conf/mapping-ISOLatin1Accent.txt to /configs/conf1/mapping-ISOLatin1Accent.txt
[junit4:junit4]   2> 369 T1229 oascc.SolrZkClient.makePath makePath: /configs/conf1/mapping-ISOLatin1Accent.txt
[junit4:junit4]   2> 379 T1229 oasc.AbstractZkTestCase.putConfig put /usr/home/hudson/hudson-slave/workspace/Lucene-Solr-Tests-4.x-java7/solr/build/solr-core/test-files/solr/collection1/conf/old_synonyms.txt to /configs/conf1/old_synonyms.txt
[junit4:junit4]   2> 380 T1229 oascc.SolrZkClient.makePath makePath: /configs/conf1/old_synonyms.txt
[junit4:junit4]   2> 387 T1229 oasc.AbstractZkTestCase.putConfig put /usr/home/hudson/hudson-slave/workspace/Lucene-Solr-Tests-4.x-java7/solr/build/solr-core/test-files/solr/collection1/conf/synonyms.txt to /configs/conf1/synonyms.txt
[junit4:junit4]   2> 387 T1229 oascc.SolrZkClient.makePath makePath: /configs/conf1/synonyms.txt
[junit4:junit4]   2> 394 T1234 oazs.PrepRequestProcessor.pRequest2Txn Processed session termination for sessionid: 0x13c9950c6070001
[junit4:junit4]   2> 401 T1238 oaz.ClientCnxn$EventThread.run EventThread shut down
[junit4:junit4]   2> 401 T1231 oazs.NIOServerCnxn.closeSock Closed socket connection for client /140.211.11.196:64114 which had sessionid 0x13c9950c6070001
[junit4:junit4]   2> 401 T1229 oaz.ZooKeeper.close Session: 0x13c9950c6070001 closed
[junit4:junit4]   2> 612 T1229 oejs.Server.doStart jetty-8.1.8.v20121106
[junit4:junit4]   2> 617 T1229 oejs.AbstractConnector.doStart Started SocketConnector@127.0.0.1:31057
[junit4:junit4]   2> 617 T1229 oass.SolrDispatchFilter.init SolrDispatchFilter.init()
[junit4:junit4]   2> 618 T1229 oasc.SolrResourceLoader.locateSolrHome JNDI not configured for solr (NoInitialContextEx)
[junit4:junit4]   2> 619 T1229 oasc.SolrResourceLoader.locateSolrHome using system property solr.solr.home: /usr/home/hudson/hudson-slave/workspace/Lucene-Solr-Tests-4.x-java7/solr/build/solr-core/test/J1/./org.apache.solr.cloud.SyncSliceTest-controljetty-1359781873545
[junit4:junit4]   2> 619 T1229 oasc.CoreContainer$Initializer.initialize looking for solr.xml: /usr/home/hudson/hudson-slave/workspace/Lucene-Solr-Tests-4.x-java7/solr/build/solr-core/test/J1/./org.apache.solr.cloud.SyncSliceTest-controljetty-1359781873545/solr.xml
[junit4:junit4]   2> 620 T1229 oasc.CoreContainer.<init> New CoreContainer 1795305068
[junit4:junit4]   2> 620 T1229 oasc.CoreContainer.load Loading CoreContainer using Solr Home: '/usr/home/hudson/hudson-slave/workspace/Lucene-Solr-Tests-4.x-java7/solr/build/solr-core/test/J1/./org.apache.solr.cloud.SyncSliceTest-controljetty-1359781873545/'
[junit4:junit4]   2> 621 T1229 oasc.SolrResourceLoader.<init> new SolrResourceLoader for directory: '/usr/home/hudson/hudson-slave/workspace/Lucene-Solr-Tests-4.x-java7/solr/build/solr-core/test/J1/./org.apache.solr.cloud.SyncSliceTest-controljetty-1359781873545/'
[junit4:junit4]   2> 675 T1229 oashc.HttpShardHandlerFactory.getParameter Setting socketTimeout to: 60000
[junit4:junit4]   2> 676 T1229 oashc.HttpShardHandlerFactory.getParameter Setting urlScheme to: http://
[junit4:junit4]   2> 676 T1229 oashc.HttpShardHandlerFactory.getParameter Setting connTimeout to: 15000
[junit4:junit4]   2> 677 T1229 oashc.HttpShardHandlerFactory.getParameter Setting maxConnectionsPerHost to: 20
[junit4:junit4]   2> 677 T1229 oashc.HttpShardHandlerFactory.getParameter Setting corePoolSize to: 0
[junit4:junit4]   2> 678 T1229 oashc.HttpShardHandlerFactory.getParameter Setting maximumPoolSize to: 2147483647
[junit4:junit4]   2> 678 T1229 oashc.HttpShardHandlerFactory.getParameter Setting maxThreadIdleTime to: 5
[junit4:junit4]   2> 679 T1229 oashc.HttpShardHandlerFactory.getParameter Setting sizeOfQueue to: -1
[junit4:junit4]   2> 679 T1229 oashc.HttpShardHandlerFactory.getParameter Setting fairnessPolicy to: false
[junit4:junit4]   2> 680 T1229 oascsi.HttpClientUtil.createClient Creating new http client, config:maxConnectionsPerHost=20&maxConnections=10000&socketTimeout=60000&connTimeout=15000&retry=false
[junit4:junit4]   2> 701 T1229 oasc.CoreContainer.load Registering Log Listener
[junit4:junit4]   2> 721 T1229 oasc.CoreContainer.initZooKeeper Zookeeper client=127.0.0.1:25600/solr
[junit4:junit4]   2> 721 T1229 oasc.ZkController.checkChrootPath zkHost includes chroot
[junit4:junit4]   2> 722 T1229 oaz.ZooKeeper.<init> Initiating client connection, connectString=127.0.0.1:25600 sessionTimeout=60000 watcher=org.apache.solr.common.cloud.ConnectionManager@5c1163dc
[junit4:junit4]   2> 723 T1229 oascc.ConnectionManager.waitForConnected Waiting for client to connect to ZooKeeper
[junit4:junit4]   2> 723 T1248 oaz.ClientCnxn$SendThread.logStartConnect Opening socket connection to server localhost/127.0.0.1:25600. Will not attempt to authenticate using SASL (access denied ("javax.security.auth.AuthPermission" "getLoginConfiguration"))
[junit4:junit4]   2> 724 T1248 oaz.ClientCnxn$SendThread.primeConnection Socket connection established to localhost/127.0.0.1:25600, initiating session
[junit4:junit4]   2> 725 T1231 oazs.NIOServerCnxnFactory.run Accepted socket connection from /140.211.11.196:54770
[junit4:junit4]   2> 725 T1231 oazs.ZooKeeperServer.processConnectRequest Client attempting to establish new session at /140.211.11.196:54770
[junit4:junit4]   2> 728 T1233 oazs.ZooKeeperServer.finishSessionInit Established session 0x13c9950c6070002 with negotiated timeout 20000 for client /140.211.11.196:54770
[junit4:junit4]   2> 728 T1248 oaz.ClientCnxn$SendThread.onConnected Session establishment complete on server localhost/127.0.0.1:25600, sessionid = 0x13c9950c6070002, negotiated timeout = 20000
[junit4:junit4]   2> 729 T1249 oascc.ConnectionManager.process Watcher org.apache.solr.common.cloud.ConnectionManager@5c1163dc name:ZooKeeperConnection Watcher:127.0.0.1:25600 got event WatchedEvent state:SyncConnected type:None path:null path:null type:None
[junit4:junit4]   2> 729 T1229 oascc.ConnectionManager.waitForConnected Client is connected to ZooKeeper
[junit4:junit4]   2> 730 T1234 oazs.PrepRequestProcessor.pRequest2Txn Processed session termination for sessionid: 0x13c9950c6070002
[junit4:junit4]   2> 739 T1249 oaz.ClientCnxn$EventThread.run EventThread shut down
[junit4:junit4]   2> 739 T1231 oazs.NIOServerCnxn.closeSock Closed socket connection for client /140.211.11.196:54770 which had sessionid 0x13c9950c6070002
[junit4:junit4]   2> 739 T1229 oaz.ZooKeeper.close Session: 0x13c9950c6070002 closed
[junit4:junit4]   2> 740 T1229 oascsi.HttpClientUtil.createClient Creating new http client, config:maxConnections=500&maxConnectionsPerHost=16&socketTimeout=60000&connTimeout=15000
[junit4:junit4]   2> 752 T1229 oaz.ZooKeeper.<init> Initiating client connection, connectString=127.0.0.1:25600/solr sessionTimeout=30000 watcher=org.apache.solr.common.cloud.ConnectionManager@51d4d399
[junit4:junit4]   2> 753 T1229 oascc.ConnectionManager.waitForConnected Waiting for client to connect to ZooKeeper
[junit4:junit4]   2> 753 T1250 oaz.ClientCnxn$SendThread.logStartConnect Opening socket connection to server localhost/127.0.0.1:25600. Will not attempt to authenticate using SASL (access denied ("javax.security.auth.AuthPermission" "getLoginConfiguration"))
[junit4:junit4]   2> 754 T1250 oaz.ClientCnxn$SendThread.primeConnection Socket connection established to localhost/127.0.0.1:25600, initiating session
[junit4:junit4]   2> 754 T1231 oazs.NIOServerCnxnFactory.run Accepted socket connection from /140.211.11.196:41548
[junit4:junit4]   2> 754 T1231 oazs.ZooKeeperServer.processConnectRequest Client attempting to establish new session at /140.211.11.196:41548
[junit4:junit4]   2> 755 T1233 oazs.ZooKeeperServer.finishSessionInit Established session 0x13c9950c6070003 with negotiated timeout 20000 for client /140.211.11.196:41548
[junit4:junit4]   2> 755 T1250 oaz.ClientCnxn$SendThread.onConnected Session establishment complete on server localhost/127.0.0.1:25600, sessionid = 0x13c9950c6070003, negotiated timeout = 20000
[junit4:junit4]   2> 756 T1251 oascc.ConnectionManager.process Watcher org.apache.solr.common.cloud.ConnectionManager@51d4d399 name:ZooKeeperConnection Watcher:127.0.0.1:25600/solr got event WatchedEvent state:SyncConnected type:None path:null path:null type:None
[junit4:junit4]   2> 756 T1229 oascc.ConnectionManager.waitForConnected Client is connected to ZooKeeper
[junit4:junit4]   2> 759 T1234 oazs.PrepRequestProcessor.pRequest Got user-level KeeperException when processing sessionid:0x13c9950c6070003 type:create cxid:0x2 zxid:0x1a txntype:-1 reqpath:n/a Error Path:/solr/overseer Error:KeeperErrorCode = NodeExists for /solr/overseer
[junit4:junit4]   2> 766 T1229 oascc.SolrZkClient.makePath makePath: /live_nodes
[junit4:junit4]   2> 769 T1229 oasc.ZkController.createEphemeralLiveNode Register node as live in ZooKeeper:/live_nodes/127.0.0.1:31057__pzw
[junit4:junit4]   2> 770 T1234 oazs.PrepRequestProcessor.pRequest Got user-level KeeperException when processing sessionid:0x13c9950c6070003 type:delete cxid:0x7 zxid:0x1c txntype:-1 reqpath:n/a Error Path:/solr/live_nodes/127.0.0.1:31057__pzw Error:KeeperErrorCode = NoNode for /solr/live_nodes/127.0.0.1:31057__pzw
[junit4:junit4]   2> 771 T1229 oascc.SolrZkClient.makePath makePath: /live_nodes/127.0.0.1:31057__pzw
[junit4:junit4]   2> 780 T1229 oascc.SolrZkClient.makePath makePath: /overseer_elect/election
[junit4:junit4]   2> 787 T1234 oazs.PrepRequestProcessor.pRequest Got user-level KeeperException when processing sessionid:0x13c9950c6070003 type:delete cxid:0x15 zxid:0x21 txntype:-1 reqpath:n/a Error Path:/solr/overseer_elect/leader Error:KeeperErrorCode = NoNode for /solr/overseer_elect/leader
[junit4:junit4]   2> 797 T1229 oascc.SolrZkClient.makePath makePath: /overseer_elect/leader
[junit4:junit4]   2> 800 T1229 oasc.Overseer.start Overseer (id=89114664839348227-127.0.0.1:31057__pzw-n_0000000000) starting
[junit4:junit4]   2> 801 T1234 oazs.PrepRequestProcessor.pRequest Got user-level KeeperException when processing sessionid:0x13c9950c6070003 type:create cxid:0x1a zxid:0x23 txntype:-1 reqpath:n/a Error Path:/solr/overseer Error:KeeperErrorCode = NodeExists for /solr/overseer
[junit4:junit4]   2> 802 T1234 oazs.PrepRequestProcessor.pRequest Got user-level KeeperException when processing sessionid:0x13c9950c6070003 type:create cxid:0x1b zxid:0x24 txntype:-1 reqpath:n/a Error Path:/solr/overseer Error:KeeperErrorCode = NodeExists for /solr/overseer
[junit4:junit4]   2> 809 T1234 oazs.PrepRequestProcessor.pRequest Got user-level KeeperException when processing sessionid:0x13c9950c6070003 type:create cxid:0x1c zxid:0x25 txntype:-1 reqpath:n/a Error Path:/solr/overseer Error:KeeperErrorCode = NodeExists for /solr/overseer
[junit4:junit4]   2> 810 T1234 oazs.PrepRequestProcessor.pRequest Got user-level KeeperException when processing sessionid:0x13c9950c6070003 type:create cxid:0x1d zxid:0x26 txntype:-1 reqpath:n/a Error Path:/solr/overseer Error:KeeperErrorCode = NodeExists for /solr/overseer
[junit4:junit4]   2> 812 T1253 oasc.OverseerCollectionProcessor.run Process current queue of collection creations
[junit4:junit4]   2> 813 T1229 oascc.SolrZkClient.makePath makePath: /clusterstate.json
[junit4:junit4]   2> 829 T1229 oascc.ZkStateReader.createClusterStateWatchersAndUpdate Updating cluster state from ZooKeeper... 
[junit4:junit4]   2> 836 T1254 oasc.CoreContainer.create Creating SolrCore 'collection1' using instanceDir: /usr/home/hudson/hudson-slave/workspace/Lucene-Solr-Tests-4.x-java7/solr/build/solr-core/test/J1/./org.apache.solr.cloud.SyncSliceTest-controljetty-1359781873545/collection1
[junit4:junit4]   2> 836 T1252 oasc.Overseer$ClusterStateUpdater.run Starting to work on the main queue
[junit4:junit4]   2> 836 T1254 oasc.ZkController.createCollectionZkNode Check for collection zkNode:control_collection
[junit4:junit4]   2> 837 T1254 oasc.ZkController.createCollectionZkNode Collection zkNode exists
[junit4:junit4]   2> 837 T1254 oasc.ZkController.readConfigName Load collection config from:/collections/control_collection
[junit4:junit4]   2> 838 T1254 oasc.SolrResourceLoader.<init> new SolrResourceLoader for directory: '/usr/home/hudson/hudson-slave/workspace/Lucene-Solr-Tests-4.x-java7/solr/build/solr-core/test/J1/./org.apache.solr.cloud.SyncSliceTest-controljetty-1359781873545/collection1/'
[junit4:junit4]   2> 840 T1254 oasc.SolrResourceLoader.replaceClassLoader Adding 'file:/usr/home/hudson/hudson-slave/workspace/Lucene-Solr-Tests-4.x-java7/solr/build/solr-core/test/J1/org.apache.solr.cloud.SyncSliceTest-controljetty-1359781873545/collection1/lib/README' to classloader
[junit4:junit4]   2> 840 T1254 oasc.SolrResourceLoader.replaceClassLoader Adding 'file:/usr/home/hudson/hudson-slave/workspace/Lucene-Solr-Tests-4.x-java7/solr/build/solr-core/test/J1/org.apache.solr.cloud.SyncSliceTest-controljetty-1359781873545/collection1/lib/classes/' to classloader
[junit4:junit4]   2> 910 T1254 oasc.SolrConfig.<init> Using Lucene MatchVersion: LUCENE_42
[junit4:junit4]   2> 982 T1254 oasc.SolrConfig.<init> Loaded SolrConfig: solrconfig.xml
[junit4:junit4]   2> 1083 T1254 oass.IndexSchema.readSchema Reading Solr Schema
[junit4:junit4]   2> 1089 T1254 oass.IndexSchema.readSchema Schema name=test
[junit4:junit4]   2> 1719 T1254 oass.OpenExchangeRatesOrgProvider.init Initialized with rates=open-exchange-rates.json, refreshInterval=1440.
[junit4:junit4]   2> 1729 T1254 oass.IndexSchema.readSchema default search field in schema is text
[junit4:junit4]   2> 1733 T1254 oass.IndexSchema.readSchema unique key field: id
[junit4:junit4]   2> 1750 T1254 oass.FileExchangeRateProvider.reload Reloading exchange rates from file currency.xml
[junit4:junit4]   2> 1755 T1254 oass.FileExchangeRateProvider.reload Reloading exchange rates from file currency.xml
[junit4:junit4]   2> 1762 T1254 oass.OpenExchangeRatesOrgProvider.reload Reloading exchange rates from open-exchange-rates.json
[junit4:junit4]   2> 1765 T1254 oass.OpenExchangeRatesOrgProvider.reload Reloading exchange rates from open-exchange-rates.json
[junit4:junit4]   2> 1777 T1254 oasc.SolrCore.<init> [collection1] Opening new SolrCore at /usr/home/hudson/hudson-slave/workspace/Lucene-Solr-Tests-4.x-java7/solr/build/solr-core/test/J1/./org.apache.solr.cloud.SyncSliceTest-controljetty-1359781873545/collection1/, dataDir=./org.apache.solr.cloud.SyncSliceTest-1359781873150/control/data/
[junit4:junit4]   2> 1777 T1254 oasc.JmxMonitoredMap.<init> JMX monitoring is enabled. Adding Solr mbeans to JMX Server: com.sun.jmx.mbeanserver.JmxMBeanServer@1102e749
[junit4:junit4]   2> 1778 T1254 oasc.SolrCore.initDirectoryFactory solr.NRTCachingDirectoryFactory
[junit4:junit4]   2> 1779 T1254 oasc.CachingDirectoryFactory.get return new directory for /usr/home/hudson/hudson-slave/workspace/Lucene-Solr-Tests-4.x-java7/solr/build/solr-core/test/J1/./org.apache.solr.cloud.SyncSliceTest-1359781873150/control/data forceNew:false
[junit4:junit4]   2> 1780 T1254 oasc.CachingDirectoryFactory.close Releasing directory:/usr/home/hudson/hudson-slave/workspace/Lucene-Solr-Tests-4.x-java7/solr/build/solr-core/test/J1/./org.apache.solr.cloud.SyncSliceTest-1359781873150/control/data
[junit4:junit4]   2> 1780 T1254 oasc.SolrCore.getNewIndexDir New index directory detected: old=null new=./org.apache.solr.cloud.SyncSliceTest-1359781873150/control/data/index/
[junit4:junit4]   2> 1781 T1254 oasc.SolrCore.initIndex WARNING [collection1] Solr index directory './org.apache.solr.cloud.SyncSliceTest-1359781873150/control/data/index' doesn't exist. Creating new index...
[junit4:junit4]   2> 1783 T1254 oasc.CachingDirectoryFactory.get return new directory for /usr/home/hudson/hudson-slave/workspace/Lucene-Solr-Tests-4.x-java7/solr/build/solr-core/test/J1/./org.apache.solr.cloud.SyncSliceTest-1359781873150/control/data/index forceNew:false
[junit4:junit4]   2> 1789 T1254 oasc.SolrDeletionPolicy.onCommit SolrDeletionPolicy.onCommit: commits:num=1
[junit4:junit4]   2> 		commit{dir=RateLimitedDirectoryWrapper(NRTCachingDirectory(org.apache.lucene.store.NIOFSDirectory@/usr/home/hudson/hudson-slave/workspace/Lucene-Solr-Tests-4.x-java7/solr/build/solr-core/test/J1/org.apache.solr.cloud.SyncSliceTest-1359781873150/control/data/index lockFactory=org.apache.lucene.store.NativeFSLockFactory@9450183; maxCacheMB=48.0 maxMergeSizeMB=4.0)),segFN=segments_1,generation=1,filenames=[segments_1]
[junit4:junit4]   2> 1790 T1254 oasc.SolrDeletionPolicy.updateCommits newest commit = 1[segments_1]
[junit4:junit4]   2> 1791 T1254 oasc.CachingDirectoryFactory.close Releasing directory:/usr/home/hudson/hudson-slave/workspace/Lucene-Solr-Tests-4.x-java7/solr/build/solr-core/test/J1/./org.apache.solr.cloud.SyncSliceTest-1359781873150/control/data/index
[junit4:junit4]   2> 1791 T1254 oasc.SolrCore.initWriters created xml: solr.XMLResponseWriter
[junit4:junit4]   2> 1793 T1254 oasup.UpdateRequestProcessorChain.init inserting DistributedUpdateProcessorFactory into updateRequestProcessorChain "dedupe"
[junit4:junit4]   2> 1793 T1254 oasup.UpdateRequestProcessorChain.init inserting DistributedUpdateProcessorFactory into updateRequestProcessorChain "dedupe-allfields"
[junit4:junit4]   2> 1793 T1254 oasup.UpdateRequestProcessorChain.init inserting DistributedUpdateProcessorFactory into updateRequestProcessorChain "stored_sig"
[junit4:junit4]   2> 1794 T1254 oasup.UpdateRequestProcessorChain.init inserting DistributedUpdateProcessorFactory into updateRequestProcessorChain "uniq-fields"
[junit4:junit4]   2> 1794 T1254 oasup.UpdateRequestProcessorChain.init inserting DistributedUpdateProcessorFactory into updateRequestProcessorChain "distrib-dup-test-chain-implicit"
[junit4:junit4]   2> 1795 T1254 oasc.RequestHandlers.initHandlersFromConfig adding lazy requestHandler: solr.ReplicationHandler
[junit4:junit4]   2> 1795 T1254 oasc.RequestHandlers.initHandlersFromConfig created /replication: solr.ReplicationHandler
[junit4:junit4]   2> 1795 T1254 oasc.RequestHandlers.initHandlersFromConfig created standard: solr.StandardRequestHandler
[junit4:junit4]   2> 1796 T1254 oasc.RequestHandlers.initHandlersFromConfig created /get: solr.RealTimeGetHandler
[junit4:junit4]   2> 1796 T1254 oasc.RequestHandlers.initHandlersFromConfig created dismax: solr.SearchHandler
[junit4:junit4]   2> 1797 T1254 oasc.RequestHandlers.initHandlersFromConfig created mock: org.apache.solr.core.MockQuerySenderListenerReqHandler
[junit4:junit4]   2> 1797 T1254 oasc.RequestHandlers.initHandlersFromConfig created /admin/: org.apache.solr.handler.admin.AdminHandlers
[junit4:junit4]   2> 1798 T1254 oasc.RequestHandlers.initHandlersFromConfig created defaults: solr.StandardRequestHandler
[junit4:junit4]   2> 1798 T1254 oasc.RequestHandlers.initHandlersFromConfig adding lazy requestHandler: solr.StandardRequestHandler
[junit4:junit4]   2> 1798 T1254 oasc.RequestHandlers.initHandlersFromConfig created lazy: solr.StandardRequestHandler
[junit4:junit4]   2> 1799 T1254 oasc.RequestHandlers.initHandlersFromConfig created /update: solr.UpdateRequestHandler
[junit4:junit4]   2> 1799 T1254 oasc.RequestHandlers.initHandlersFromConfig created /terms: org.apache.solr.handler.component.SearchHandler
[junit4:junit4]   2> 1799 T1254 oasc.RequestHandlers.initHandlersFromConfig created spellCheckCompRH: org.apache.solr.handler.component.SearchHandler
[junit4:junit4]   2> 1800 T1254 oasc.RequestHandlers.initHandlersFromConfig created spellCheckCompRH_Direct: org.apache.solr.handler.component.SearchHandler
[junit4:junit4]   2> 1800 T1254 oasc.RequestHandlers.initHandlersFromConfig created spellCheckWithWordbreak: org.apache.solr.handler.component.SearchHandler
[junit4:junit4]   2> 1801 T1254 oasc.RequestHandlers.initHandlersFromConfig created spellCheckWithWordbreak_Direct: org.apache.solr.handler.component.SearchHandler
[junit4:junit4]   2> 1801 T1254 oasc.RequestHandlers.initHandlersFromConfig created spellCheckCompRH1: org.apache.solr.handler.component.SearchHandler
[junit4:junit4]   2> 1802 T1254 oasc.RequestHandlers.initHandlersFromConfig created mltrh: org.apache.solr.handler.component.SearchHandler
[junit4:junit4]   2> 1802 T1254 oasc.RequestHandlers.initHandlersFromConfig created tvrh: org.apache.solr.handler.component.SearchHandler
[junit4:junit4]   2> 1803 T1254 oasc.RequestHandlers.initHandlersFromConfig created /mlt: solr.MoreLikeThisHandler
[junit4:junit4]   2> 1803 T1254 oasc.RequestHandlers.initHandlersFromConfig created /debug/dump: solr.DumpRequestHandler
[junit4:junit4]   2> 1815 T1254 oashl.XMLLoader.init xsltCacheLifetimeSeconds=60
[junit4:junit4]   2> 1820 T1254 oasc.SolrCore.initDeprecatedSupport WARNING solrconfig.xml uses deprecated <admin/gettableFiles>, Please update your config to use the ShowFileRequestHandler.
[junit4:junit4]   2> 1821 T1254 oasc.SolrCore.initDeprecatedSupport WARNING adding ShowFileRequestHandler with hidden files: [SCHEMA.XML, OLD_SYNONYMS.TXT, STOPWORDS.TXT, PROTWORDS.TXT, OPEN-EXCHANGE-RATES.JSON, SYNONYMS.TXT, CURRENCY.XML, MAPPING-ISOLATIN1ACCENT.TXT]
[junit4:junit4]   2> 1823 T1254 oasc.CachingDirectoryFactory.close Releasing directory:/usr/home/hudson/hudson-slave/workspace/Lucene-Solr-Tests-4.x-java7/solr/build/solr-core/test/J1/./org.apache.solr.cloud.SyncSliceTest-1359781873150/control/data
[junit4:junit4]   2> 1825 T1254 oass.SolrIndexSearcher.<init> Opening Searcher@7143e075 main
[junit4:junit4]   2> 1826 T1254 oasu.CommitTracker.<init> Hard AutoCommit: disabled
[junit4:junit4]   2> 1826 T1254 oasu.CommitTracker.<init> Soft AutoCommit: disabled
[junit4:junit4]   2> 1826 T1254 oashc.SpellCheckComponent.inform Initializing spell checkers
[junit4:junit4]   2> 1834 T1254 oass.DirectSolrSpellChecker.init init: {name=direct,classname=DirectSolrSpellChecker,field=lowerfilt,minQueryLength=3}
[junit4:junit4]   2> 1891 T1255 oasc.SolrCore.registerSearcher [collection1] Registered new searcher Searcher@7143e075 main{StandardDirectoryReader(segments_1:1)}
[junit4:junit4]   2> 1895 T1254 oasc.ZkController.publish publishing core=collection1 state=down
[junit4:junit4]   2> 1895 T1254 oasc.ZkController.publish numShards not found on descriptor - reading it from system property
[junit4:junit4]   2> 1896 T1234 oazs.PrepRequestProcessor.pRequest Got user-level KeeperException when processing sessionid:0x13c9950c6070003 type:create cxid:0x50 zxid:0x29 txntype:-1 reqpath:n/a Error Path:/solr/overseer/queue Error:KeeperErrorCode = NoNode for /solr/overseer/queue
[junit4:junit4]   2> 2339 T1252 oascc.ZkStateReader.updateClusterState Updating cloud state from ZooKeeper... 
[junit4:junit4]   2> 2340 T1252 oasc.Overseer$ClusterStateUpdater.updateState Update state numShards=1 message={
[junit4:junit4]   2> 	  "operation":"state",
[junit4:junit4]   2> 	  "numShards":"1",
[junit4:junit4]   2> 	  "shard":null,
[junit4:junit4]   2> 	  "roles":null,
[junit4:junit4]   2> 	  "state":"down",
[junit4:junit4]   2> 	  "core":"collection1",
[junit4:junit4]   2> 	  "collection":"control_collection",
[junit4:junit4]   2> 	  "node_name":"127.0.0.1:31057__pzw",
[junit4:junit4]   2> 	  "base_url":"http://127.0.0.1:31057/_pzw"}
[junit4:junit4]   2> 2340 T1252 oasc.Overseer$ClusterStateUpdater.createCollection Create collection control_collection with numShards 1
[junit4:junit4]   2> 2341 T1252 oasc.Overseer$ClusterStateUpdater.updateState Assigning new node to shard shard=shard1
[junit4:junit4]   2> 2341 T1234 oazs.PrepRequestProcessor.pRequest Got user-level KeeperException when processing sessionid:0x13c9950c6070003 type:create cxid:0x58 zxid:0x2c txntype:-1 reqpath:n/a Error Path:/solr/overseer/queue-work Error:KeeperErrorCode = NoNode for /solr/overseer/queue-work
[junit4:junit4]   2> 2359 T1251 oascc.ZkStateReader$2.process A cluster state change: WatchedEvent state:SyncConnected type:NodeDataChanged path:/clusterstate.json, has occurred - updating... (live nodes size: 1)
[junit4:junit4]   2> 2901 T1254 oasc.CoreContainer.registerCore registering core: collection1
[junit4:junit4]   2> 2901 T1254 oasc.ZkController.register Register replica - core:collection1 address:http://127.0.0.1:31057/_pzw collection:control_collection shard:shard1
[junit4:junit4]   2> 2902 T1254 oascc.SolrZkClient.makePath makePath: /collections/control_collection/leader_elect/shard1/election
[junit4:junit4]   2> 2976 T1234 oazs.PrepRequestProcessor.pRequest Got user-level KeeperException when processing sessionid:0x13c9950c6070003 type:delete cxid:0x72 zxid:0x36 txntype:-1 reqpath:n/a Error Path:/solr/collections/control_collection/leaders Error:KeeperErrorCode = NoNode for /solr/collections/control_collection/leaders
[junit4:junit4]   2> 2977 T1254 oasc.ShardLeaderElectionContext.runLeaderProcess Running the leader process.
[junit4:junit4]   2> 2978 T1234 oazs.PrepRequestProcessor.pRequest Got user-level KeeperException when processing sessionid:0x13c9950c6070003 type:create cxid:0x73 zxid:0x37 txntype:-1 reqpath:n/a Error Path:/solr/overseer Error:KeeperErrorCode = NodeExists for /solr/overseer
[junit4:junit4]   2> 3002 T1254 oasc.ShardLeaderElectionContext.waitForReplicasToComeUp Enough replicas found to continue.
[junit4:junit4]   2> 3002 T1254 oasc.ShardLeaderElectionContext.runLeaderProcess I may be the new leader - try and sync
[junit4:junit4]   2> 3002 T1254 oasc.SyncStrategy.sync Sync replicas to http://127.0.0.1:31057/_pzw/collection1/
[junit4:junit4]   2> 3003 T1254 oasc.SyncStrategy.syncReplicas Sync Success - now sync replicas to me
[junit4:junit4]   2> 3003 T1254 oasc.SyncStrategy.syncToMe http://127.0.0.1:31057/_pzw/collection1/ has no replicas
[junit4:junit4]   2> 3004 T1254 oasc.ShardLeaderElectionContext.runLeaderProcess I am the new leader: http://127.0.0.1:31057/_pzw/collection1/
[junit4:junit4]   2> 3004 T1254 oascc.SolrZkClient.makePath makePath: /collections/control_collection/leaders/shard1
[junit4:junit4]   2> 3127 T1234 oazs.PrepRequestProcessor.pRequest Got user-level KeeperException when processing sessionid:0x13c9950c6070003 type:create cxid:0x7d zxid:0x3b txntype:-1 reqpath:n/a Error Path:/solr/overseer Error:KeeperErrorCode = NodeExists for /solr/overseer
[junit4:junit4]   2> 3862 T1252 oascc.ZkStateReader.updateClusterState Updating cloud state from ZooKeeper... 
[junit4:junit4]   2> 3876 T1251 oascc.ZkStateReader$2.process A cluster state change: WatchedEvent state:SyncConnected type:NodeDataChanged path:/clusterstate.json, has occurred - updating... (live nodes size: 1)
[junit4:junit4]   2> 3895 T1254 oasc.ZkController.register We are http://127.0.0.1:31057/_pzw/collection1/ and leader is http://127.0.0.1:31057/_pzw/collection1/
[junit4:junit4]   2> 3895 T1254 oasc.ZkController.register No LogReplay needed for core=collection1 baseURL=http://127.0.0.1:31057/_pzw
[junit4:junit4]   2> 3895 T1254 oasc.ZkController.checkRecovery I am the leader, no recovery necessary
[junit4:junit4]   2> 3895 T1254 oasc.ZkController.publish publishing core=collection1 state=active
[junit4:junit4]   2> 3895 T1254 oasc.ZkController.publish numShards not found on descriptor - reading it from system property
[junit4:junit4]   2> 3897 T1254 oascc.ZkStateReader.updateClusterState Updating cloud state from ZooKeeper... 
[junit4:junit4]   2> 3898 T1229 oass.SolrDispatchFilter.init user.dir=/usr/home/hudson/hudson-slave/workspace/Lucene-Solr-Tests-4.x-java7/solr/build/solr-core/test/J1
[junit4:junit4]   2> 3898 T1229 oass.SolrDispatchFilter.init SolrDispatchFilter.init() done
[junit4:junit4]   2> 3899 T1229 oascsi.HttpClientUtil.createClient Creating new http client, config:maxConnections=128&maxConnectionsPerHost=32&followRedirects=false
[junit4:junit4]   2> 3910 T1229 oascsi.HttpClientUtil.createClient Creating new http client, config:
[junit4:junit4]   2> 3917 T1229 oaz.ZooKeeper.<init> Initiating client connection, connectString=127.0.0.1:25600/solr sessionTimeout=10000 watcher=org.apache.solr.common.cloud.ConnectionManager@5e4ee546
[junit4:junit4]   2> 3918 T1229 oascc.ConnectionManager.waitForConnected Waiting for client to connect to ZooKeeper
[junit4:junit4]   2> 3918 T1256 oaz.ClientCnxn$SendThread.logStartConnect Opening socket connection to server localhost/127.0.0.1:25600. Will not attempt to authenticate using SASL (access denied ("javax.security.auth.AuthPermission" "getLoginConfiguration"))
[junit4:junit4]   2> 3918 T1256 oaz.ClientCnxn$SendThread.primeConnection Socket connection established to localhost/127.0.0.1:25600, initiating session
[junit4:junit4]   2> 3919 T1231 oazs.NIOServerCnxnFactory.run Accepted socket connection from /140.211.11.196:52641
[junit4:junit4]   2> 3919 T1231 oazs.ZooKeeperServer.processConnectRequest Client attempting to establish new session at /140.211.11.196:52641
[junit4:junit4]   2> 3920 T1233 oazs.ZooKeeperServer.finishSessionInit Established session 0x13c9950c6070004 with negotiated timeout 10000 for client /140.211.11.196:52641
[junit4:junit4]   2> 3920 T1256 oaz.ClientCnxn$SendThread.onConnected Session establishment complete on server localhost/127.0.0.1:25600, sessionid = 0x13c9950c6070004, negotiated timeout = 10000
[junit4:junit4]   2> 3921 T1257 oascc.ConnectionManager.process Watcher org.apache.solr.common.cloud.ConnectionManager@5e4ee546 name:ZooKeeperConnection Watcher:127.0.0.1:25600/solr got event WatchedEvent state:SyncConnected type:None path:null path:null type:None
[junit4:junit4]   2> 3921 T1229 oascc.ConnectionManager.waitForConnected Client is connected to ZooKeeper
[junit4:junit4]   2> 3922 T1229 oascc.ZkStateReader.createClusterStateWatchersAndUpdate Updating cluster state from ZooKeeper... 
[junit4:junit4]   2> 3923 T1229 oasc.ChaosMonkey.monkeyLog monkey: init - expire sessions:true cause connection loss:true
[junit4:junit4]   2> 4051 T1229 oejs.Server.doStart jetty-8.1.8.v20121106
[junit4:junit4]   2> 4054 T1229 oejs.AbstractConnector.doStart Started SocketConnector@127.0.0.1:52642
[junit4:junit4]   2> 4054 T1229 oass.SolrDispatchFilter.init SolrDispatchFilter.init()
[junit4:junit4]   2> 4055 T1229 oasc.SolrResourceLoader.locateSolrHome JNDI not configured for solr (NoInitialContextEx)
[junit4:junit4]   2> 4055 T1229 oasc.SolrResourceLoader.locateSolrHome using system property solr.solr.home: /usr/home/hudson/hudson-slave/workspace/Lucene-Solr-Tests-4.x-java7/solr/build/solr-core/test/J1/./org.apache.solr.cloud.SyncSliceTest-jetty1-1359781877066
[junit4:junit4]   2> 4055 T1229 oasc.CoreContainer$Initializer.initialize looking for solr.xml: /usr/home/hudson/hudson-slave/workspace/Lucene-Solr-Tests-4.x-java7/solr/build/solr-core/test/J1/./org.apache.solr.cloud.SyncSliceTest-jetty1-1359781877066/solr.xml
[junit4:junit4]   2> 4056 T1229 oasc.CoreContainer.<init> New CoreContainer 1303963168
[junit4:junit4]   2> 4056 T1229 oasc.CoreContainer.load Loading CoreContainer using Solr Home: '/usr/home/hudson/hudson-slave/workspace/Lucene-Solr-Tests-4.x-java7/solr/build/solr-core/test/J1/./org.apache.solr.cloud.SyncSliceTest-jetty1-1359781877066/'
[junit4:junit4]   2> 4056 T1229 oasc.SolrResourceLoader.<init> new SolrResourceLoader for directory: '/usr/home/hudson/hudson-slave/workspace/Lucene-Solr-Tests-4.x-java7/solr/build/solr-core/test/J1/./org.apache.solr.cloud.SyncSliceTest-jetty1-1359781877066/'
[junit4:junit4]   2> 4098 T1229 oashc.HttpShardHandlerFactory.getParameter Setting socketTimeout to: 60000
[junit4:junit4]   2> 4099 T1229 oashc.HttpShardHandlerFactory.getParameter Setting urlScheme to: http://
[junit4:junit4]   2> 4099 T1229 oashc.HttpShardHandlerFactory.getParameter Setting connTimeout to: 15000
[junit4:junit4]   2> 4100 T1229 oashc.HttpShardHandlerFactory.getParameter Setting maxConnectionsPerHost to: 20
[junit4:junit4]   2> 4100 T1229 oashc.HttpShardHandlerFactory.getParameter Setting corePoolSize to: 0
[junit4:junit4]   2> 4100 T1229 oashc.HttpShardHandlerFactory.getParameter Setting maximumPoolSize to: 2147483647
[junit4:junit4]   2> 4101 T1229 oashc.HttpShardHandlerFactory.getParameter Setting maxThreadIdleTime to: 5
[junit4:junit4]   2> 4101 T1229 oashc.HttpShardHandlerFactory.getParameter Setting sizeOfQueue to: -1
[junit4:junit4]   2> 4101 T1229 oashc.HttpShardHandlerFactory.getParameter Setting fairnessPolicy to: false
[junit4:junit4]   2> 4102 T1229 oascsi.HttpClientUtil.createClient Creating new http client, config:maxConnectionsPerHost=20&maxConnections=10000&socketTimeout=60000&connTimeout=15000&retry=false
[junit4:junit4]   2> 4116 T1229 oasc.CoreContainer.load Registering Log Listener
[junit4:junit4]   2> 4131 T1229 oasc.CoreContainer.initZooKeeper Zookeeper client=127.0.0.1:25600/solr
[junit4:junit4]   2> 4131 T1229 oasc.ZkController.checkChrootPath zkHost includes chroot
[junit4:junit4]   2> 4132 T1229 oaz.ZooKeeper.<init> Initiating client connection, connectString=127.0.0.1:25600 sessionTimeout=60000 watcher=org.apache.solr.common.cloud.ConnectionManager@23ce93a7
[junit4:junit4]   2> 4133 T1229 oascc.ConnectionManager.waitForConnected Waiting for client to connect to ZooKeeper
[junit4:junit4]   2> 4133 T1267 oaz.ClientCnxn$SendThread.logStartConnect Opening socket connection to server localhost/127.0.0.1:25600. Will not attempt to authenticate using SASL (access denied ("javax.security.auth.AuthPermission" "getLoginConfiguration"))
[junit4:junit4]   2> 4134 T1267 oaz.ClientCnxn$SendThread.primeConnection Socket connection established to localhost/127.0.0.1:25600, initiating session
[junit4:junit4]   2> 4134 T1231 oazs.NIOServerCnxnFactory.run Accepted socket connection from /140.211.11.196:52643
[junit4:junit4]   2> 4135 T1231 oazs.ZooKeeperServer.processConnectRequest Client attempting to establish new session at /140.211.11.196:52643
[junit4:junit4]   2> 4137 T1233 oazs.ZooKeeperServer.finishSessionInit Established session 0x13c9950c6070005 with negotiated timeout 20000 for client /140.211.11.196:52643
[junit4:junit4]   2> 4137 T1267 oaz.ClientCnxn$SendThread.onConnected Session establishment complete on server localhost/127.0.0.1:25600, sessionid = 0x13c9950c6070005, negotiated timeout = 20000
[junit4:junit4]   2> 4137 T1268 oascc.ConnectionManager.process Watcher org.apache.solr.common.cloud.ConnectionManager@23ce93a7 name:ZooKeeperConnection Watcher:127.0.0.1:25600 got event WatchedEvent state:SyncConnected type:None path:null path:null type:None
[junit4:junit4]   2> 4137 T1229 oascc.ConnectionManager.waitForConnected Client is connected to ZooKeeper
[junit4:junit4]   2> 4138 T1234 oazs.PrepRequestProcessor.pRequest2Txn Processed session termination for sessionid: 0x13c9950c6070005
[junit4:junit4]   2> 4148 T1268 oaz.ClientCnxn$EventThread.run EventThread shut down
[junit4:junit4]   2> 4148 T1231 oazs.NIOServerCnxn.closeSock Closed socket connection for client /140.211.11.196:52643 which had sessionid 0x13c9950c6070005
[junit4:junit4]   2> 4148 T1229 oaz.ZooKeeper.close Session: 0x13c9950c6070005 closed
[junit4:junit4]   2> 4149 T1229 oascsi.HttpClientUtil.createClient Creating new http client, config:maxConnections=500&maxConnectionsPerHost=16&socketTimeout=60000&connTimeout=15000
[junit4:junit4]   2> 4157 T1229 oaz.ZooKeeper.<init> Initiating client connection, connectString=127.0.0.1:25600/solr sessionTimeout=30000 watcher=org.apache.solr.common.cloud.ConnectionManager@1f6839df
[junit4:junit4]   2> 4158 T1229 oascc.ConnectionManager.waitForConnected Waiting for client to connect to ZooKeeper
[junit4:junit4]   2> 4158 T1269 oaz.ClientCnxn$SendThread.logStartConnect Opening socket connection to server localhost/127.0.0.1:25600. Will not attempt to authenticate using SASL (access denied ("javax.security.auth.AuthPermission" "getLoginConfiguration"))
[junit4:junit4]   2> 4158 T1269 oaz.ClientCnxn$SendThread.primeConnection Socket connection established to localhost/127.0.0.1:25600, initiating session
[junit4:junit4]   2> 4158 T1231 oazs.NIOServerCnxnFactory.run Accepted socket connection from /140.211.11.196:52644
[junit4:junit4]   2> 4159 T1231 oazs.ZooKeeperServer.processConnectRequest Client attempting to establish new session at /140.211.11.196:52644
[junit4:junit4]   2> 4160 T1233 oazs.ZooKeeperServer.finishSessionInit Established session 0x13c9950c6070006 with negotiated timeout 20000 for client /140.211.11.196:52644
[junit4:junit4]   2> 4160 T1269 oaz.ClientCnxn$SendThread.onConnected Session establishment complete on server localhost/127.0.0.1:25600, sessionid = 0x13c9950c6070006, negotiated timeout = 20000
[junit4:junit4]   2> 4161 T1270 oascc.ConnectionManager.process Watcher org.apache.solr.common.cloud.ConnectionManager@1f6839df name:ZooKeeperConnection Watcher:127.0.0.1:25600/solr got event WatchedEvent state:SyncConnected type:None path:null path:null type:None
[junit4:junit4]   2> 4161 T1229 oascc.ConnectionManager.waitForConnected Client is connected to ZooKeeper
[junit4:junit4]   2> 4162 T1234 oazs.PrepRequestProcessor.pRequest Got user-level KeeperException when processing sessionid:0x13c9950c6070006 type:create cxid:0x1 zxid:0x49 txntype:-1 reqpath:n/a Error Path:/solr/overseer Error:KeeperErrorCode = NodeExists for /solr/overseer
[junit4:junit4]   2> 4167 T1234 oazs.PrepRequestProcessor.pRequest Got user-level KeeperException when processing sessionid:0x13c9950c6070006 type:create cxid:0x2 zxid:0x4a txntype:-1 reqpath:n/a Error Path:/solr/overseer Error:KeeperErrorCode = NodeExists for /solr/overseer
[junit4:junit4]   2> 4169 T1229 oasc.ZkController.createEphemeralLiveNode Register node as live in ZooKeeper:/live_nodes/127.0.0.1:52642__pzw
[junit4:junit4]   2> 4169 T1234 oazs.PrepRequestProcessor.pRequest Got user-level KeeperException when processing sessionid:0x13c9950c6070006 type:delete cxid:0x4 zxid:0x4b txntype:-1 reqpath:n/a Error Path:/solr/live_nodes/127.0.0.1:52642__pzw Error:KeeperErrorCode = NoNode for /solr/live_nodes/127.0.0.1:52642__pzw
[junit4:junit4]   2> 4170 T1229 oascc.SolrZkClient.makePath makePath: /live_nodes/127.0.0.1:52642__pzw
[junit4:junit4]   2> 4179 T1251 oascc.ZkStateReader$3.process Updating live nodes... (2)
[junit4:junit4]   2> 4179 T1257 oascc.ZkStateReader$3.process Updating live nodes... (2)
[junit4:junit4]   2> 4179 T1251 oascc.ZkStateReader$2.process A cluster state change: WatchedEvent state:SyncConnected type:NodeChildrenChanged path:/live_nodes, has occurred - updating... (live nodes size: 2)
[junit4:junit4]   2> 4182 T1229 oascc.ZkStateReader.createClusterStateWatchersAndUpdate Updating cluster state from ZooKeeper... 
[junit4:junit4]   2> 4188 T1271 oasc.CoreContainer.create Creating SolrCore 'collection1' using instanceDir: /usr/home/hudson/hudson-slave/workspace/Lucene-Solr-Tests-4.x-java7/solr/build/solr-core/test/J1/./org.apache.solr.cloud.SyncSliceTest-jetty1-1359781877066/collection1
[junit4:junit4]   2> 4188 T1271 oasc.ZkController.createCollectionZkNode Check for collection zkNode:collection1
[junit4:junit4]   2> 4189 T1271 oasc.ZkController.createCollectionZkNode Collection zkNode exists
[junit4:junit4]   2> 4189 T1271 oasc.ZkController.readConfigName Load collection config from:/collections/collection1
[junit4:junit4]   2> 4190 T1271 oasc.SolrResourceLoader.<init> new SolrResourceLoader for directory: '/usr/home/hudson/hudson-slave/workspace/Lucene-Solr-Tests-4.x-java7/solr/build/solr-core/test/J1/./org.apache.solr.cloud.SyncSliceTest-jetty1-1359781877066/collection1/'
[junit4:junit4]   2> 4192 T1271 oasc.SolrResourceLoader.replaceClassLoader Adding 'file:/usr/home/hudson/hudson-slave/workspace/Lucene-Solr-Tests-4.x-java7/solr/build/solr-core/test/J1/org.apache.solr.cloud.SyncSliceTest-jetty1-1359781877066/collection1/lib/classes/' to classloader
[junit4:junit4]   2> 4192 T1271 oasc.SolrResourceLoader.replaceClassLoader Adding 'file:/usr/home/hudson/hudson-slave/workspace/Lucene-Solr-Tests-4.x-java7/solr/build/solr-core/test/J1/org.apache.solr.cloud.SyncSliceTest-jetty1-1359781877066/collection1/lib/README' to classloader
[junit4:junit4]   2> 4252 T1271 oasc.SolrConfig.<init> Using Lucene MatchVersion: LUCENE_42
[junit4:junit4]   2> 4329 T1271 oasc.SolrConfig.<init> Loaded SolrConfig: solrconfig.xml
[junit4:junit4]   2> 4430 T1271 oass.IndexSchema.readSchema Reading Solr Schema
[junit4:junit4]   2> 4437 T1271 oass.IndexSchema.readSchema Schema name=test
[junit4:junit4]   2> 5078 T1271 oass.OpenExchangeRatesOrgProvider.init Initialized with rates=open-exchange-rates.json, refreshInterval=1440.
[junit4:junit4]   2> 5089 T1271 oass.IndexSchema.readSchema default search field in schema is text
[junit4:junit4]   2> 5093 T1271 oass.IndexSchema.readSchema unique key field: id
[junit4:junit4]   2> 5108 T1271 oass.FileExchangeRateProvider.reload Reloading exchange rates from file currency.xml
[junit4:junit4]   2> 5113 T1271 oass.FileExchangeRateProvider.reload Reloading exchange rates from file currency.xml
[junit4:junit4]   2> 5117 T1271 oass.OpenExchangeRatesOrgProvider.reload Reloading exchange rates from open-exchange-rates.json
[junit4:junit4]   2> 5119 T1271 oass.OpenExchangeRatesOrgProvider.reload Reloading exchange rates from open-exchange-rates.json
[junit4:junit4]   2> 5120 T1271 oasc.SolrCore.<init> [collection1] Opening new SolrCore at /usr/home/hudson/hudson-slave/workspace/Lucene-Solr-Tests-4.x-java7/solr/build/solr-core/test/J1/./org.apache.solr.cloud.SyncSliceTest-jetty1-1359781877066/collection1/, dataDir=./org.apache.solr.cloud.SyncSliceTest-1359781873150/jetty1/
[junit4:junit4]   2> 5121 T1271 oasc.JmxMonitoredMap.<init> JMX monitoring is enabled. Adding Solr mbeans to JMX Server: com.sun.jmx.mbeanserver.JmxMBeanServer@1102e749
[junit4:junit4]   2> 5121 T1271 oasc.SolrCore.initDirectoryFactory solr.NRTCachingDirectoryFactory
[junit4:junit4]   2> 5122 T1271 oasc.CachingDirectoryFactory.get return new directory for /usr/home/hudson/hudson-slave/workspace/Lucene-Solr-Tests-4.x-java7/solr/build/solr-core/test/J1/./org.apache.solr.cloud.SyncSliceTest-1359781873150/jetty1 forceNew:false
[junit4:junit4]   2> 5123 T1271 oasc.CachingDirectoryFactory.close Releasing directory:/usr/home/hudson/hudson-slave/workspace/Lucene-Solr-Tests-4.x-java7/solr/build/solr-core/test/J1/./org.apache.solr.cloud.SyncSliceTest-1359781873150/jetty1
[junit4:junit4]   2> 5123 T1271 oasc.SolrCore.getNewIndexDir New index directory detected: old=null new=./org.apache.solr.cloud.SyncSliceTest-1359781873150/jetty1/index/
[junit4:junit4]   2> 5124 T1271 oasc.SolrCore.initIndex WARNING [collection1] Solr index directory './org.apache.solr.cloud.SyncSliceTest-1359781873150/jetty1/index' doesn't exist. Creating new index...
[junit4:junit4]   2> 5125 T1271 oasc.CachingDirectoryFactory.get return new directory for /usr/home/hudson/hudson-slave/workspace/Lucene-Solr-Tests-4.x-java7/solr/build/solr-core/test/J1/./org.apache.solr.cloud.SyncSliceTest-1359781873150/jetty1/index forceNew:false
[junit4:junit4]   2> 5131 T1271 oasc.SolrDeletionPolicy.onCommit SolrDeletionPolicy.onCommit: commits:num=1
[junit4:junit4]   2> 		commit{dir=RateLimitedDirectoryWrapper(NRTCachingDirectory(org.apache.lucene.store.NIOFSDirectory@/usr/home/hudson/hudson-slave/workspace/Lucene-Solr-Tests-4.x-java7/solr/build/solr-core/test/J1/org.apache.solr.cloud.SyncSliceTest-1359781873150/jetty1/index lockFactory=org.apache.lucene.store.NativeFSLockFactory@266e4724; maxCacheMB=48.0 maxMergeSizeMB=4.0)),segFN=segments_1,generation=1,filenames=[segments_1]
[junit4:junit4]   2> 5132 T1271 oasc.SolrDeletionPolicy.updateCommits newest commit = 1[segments_1]
[junit4:junit4]   2> 5133 T1271 oasc.CachingDirectoryFactory.close Releasing directory:/usr/home/hudson/hudson-slave/workspace/Lucene-Solr-Tests-4.x-java7/solr/build/solr-core/test/J1/./org.apache.solr.cloud.SyncSliceTest-1359781873150/jetty1/index
[junit4:junit4]   2> 5133 T1271 oasc.SolrCore.initWriters created xml: solr.XMLResponseWriter
[junit4:junit4]   2> 5135 T1271 oasup.UpdateRequestProcessorChain.init inserting DistributedUpdateProcessorFactory into updateRequestProcessorChain "dedupe"
[junit4:junit4]   2> 5135 T1271 oasup.UpdateRequestProcessorChain.init inserting DistributedUpdateProcessorFactory into updateRequestProcessorChain "dedupe-allfields"
[junit4:junit4]   2> 5136 T1271 oasup.UpdateRequestProcessorChain.init inserting DistributedUpdateProcessorFactory into updateRequestProcessorChain "stored_sig"
[junit4:junit4]   2> 5136 T1271 oasup.UpdateRequestProcessorChain.init inserting DistributedUpdateProcessorFactory into updateRequestProcessorChain "uniq-fields"
[junit4:junit4]   2> 5137 T1271 oasup.UpdateRequestProcessorChain.init inserting DistributedUpdateProcessorFactory into updateRequestProcessorChain "distrib-dup-test-chain-implicit"
[junit4:junit4]   2> 5137 T1271 oasc.RequestHandlers.initHandlersFromConfig adding lazy requestHandler: solr.ReplicationHandler
[junit4:junit4]   2> 5137 T1271 oasc.RequestHandlers.initHandlersFromConfig created /replication: solr.ReplicationHandler
[junit4:junit4]   2> 5138 T1271 oasc.RequestHandlers.initHandlersFromConfig created standard: solr.StandardRequestHandler
[junit4:junit4]   2> 5138 T1271 oasc.RequestHandlers.initHandlersFromConfig created /get: solr.RealTimeGetHandler
[junit4:junit4]   2> 5139 T1271 oasc.RequestHandlers.initHandlersFromConfig created dismax: solr.SearchHandler
[junit4:junit4]   2> 5140 T1271 oasc.RequestHandlers.initHandlersFromConfig created mock: org.apache.solr.core.MockQuerySenderListenerReqHandler
[junit4:junit4]   2> 5140 T1271 oasc.RequestHandlers.initHandlersFromConfig created /admin/: org.apache.solr.handler.admin.AdminHandlers
[junit4:junit4]   2> 5141 T1271 oasc.RequestHandlers.initHandlersFromConfig created defaults: solr.StandardRequestHandler
[junit4:junit4]   2> 5141 T1271 oasc.RequestHandlers.initHandlersFromConfig adding lazy requestHandler: solr.StandardRequestHandler
[junit4:junit4]   2> 5141 T1271 oasc.RequestHandlers.initHandlersFromConfig created lazy: solr.StandardRequestHandler
[junit4:junit4]   2> 5142 T1271 oasc.RequestHandlers.initHandlersFromConfig created /update: solr.UpdateRequestHandler
[junit4:junit4]   2> 5142 T1271 oasc.RequestHandlers.initHandlersFromConfig created /terms: org.apache.solr.handler.component.SearchHandler
[junit4:junit4]   2> 5143 T1271 oasc.RequestHandlers.initHandlersFromConfig created spellCheckCompRH: org.apache.solr.handler.component.SearchHandler
[junit4:junit4]   2> 5143 T1271 oasc.RequestHandlers.initHandlersFromConfig created spellCheckCompRH_Direct: org.apache.solr.handler.component.SearchHandler
[junit4:junit4]   2> 5144 T1271 oasc.RequestHandlers.initHandlersFromConfig created spellCheckWithWordbreak: org.apache.solr.handler.component.SearchHandler
[junit4:junit4]   2> 5144 T1271 oasc.RequestHandlers.initHandlersFromConfig created spellCheckWithWordbreak_Direct: org.apache.solr.handler.component.SearchHandler
[junit4:junit4]   2> 5145 T1271 oasc.RequestHandlers.initHandlersFromConfig created spellCheckCompRH1: org.apache.solr.handler.component.SearchHandler
[junit4:junit4]   2> 5145 T1271 oasc.RequestHandlers.initHandlersFromConfig created mltrh: org.apache.solr.handler.component.SearchHandler
[junit4:junit4]   2> 5146 T1271 oasc.RequestHandlers.initHandlersFromConfig created tvrh: org.apache.solr.handler.component.SearchHandler
[junit4:junit4]   2> 5147 T1271 oasc.RequestHandlers.initHandlersFromConfig created /mlt: solr.MoreLikeThisHandler
[junit4:junit4]   2> 5147 T1271 oasc.RequestHandlers.initHandlersFromConfig created /debug/dump: solr.DumpRequestHandler
[junit4:junit4]   2> 5160 T1271 oashl.XMLLoader.init xsltCacheLifetimeSeconds=60
[junit4:junit4]   2> 5164 T1271 oasc.SolrCore.initDeprecatedSupport WARNING solrconfig.xml uses deprecated <admin/gettableFiles>, Please update your config to use the ShowFileRequestHandler.
[junit4:junit4]   2> 5166 T1271 oasc.SolrCore.initDeprecatedSupport WARNING adding ShowFileRequestHandler with hidden files: [SCHEMA.XML, OLD_SYNONYMS.TXT, STOPWORDS.TXT, PROTWORDS.TXT, OPEN-EXCHANGE-RATES.JSON, SYNONYMS.TXT, CURRENCY.XML, MAPPING-ISOLATIN1ACCENT.TXT]
[junit4:junit4]   2> 5168 T1271 oasc.CachingDirectoryFactory.close Releasing directory:/usr/home/hudson/hudson-slave/workspace/Lucene-Solr-Tests-4.x-java7/solr/build/solr-core/test/J1/./org.apache.solr.cloud.SyncSliceTest-1359781873150/jetty1
[junit4:junit4]   2> 5170 T1271 oass.SolrIndexSearcher.<init> Opening Searcher@702da6bd main
[junit4:junit4]   2> 5171 T1271 oasu.CommitTracker.<init> Hard AutoCommit: disabled
[junit4:junit4]   2> 5171 T1271 oasu.CommitTracker.<init> Soft AutoCommit: disabled
[junit4:junit4]   2> 5172 T1271 oashc.SpellCheckComponent.inform Initializing spell checkers
[junit4:junit4]   2> 5187 T1271 oass.DirectSolrSpellChecker.init init: {name=direct,classname=DirectSolrSpellChecker,field=lowerfilt,minQueryLength=3}
[junit4:junit4]   2> 5243 T1272 oasc.SolrCore.registerSearcher [collection1] Registered new searcher Searcher@702da6bd main{StandardDirectoryReader(segments_1:1)}
[junit4:junit4]   2> 5248 T1271 oasc.ZkController.publish publishing core=collection1 state=down
[junit4:junit4]   2> 5248 T1271 oasc.ZkController.publish numShards not found on descriptor - reading it from system property
[junit4:junit4]   2> 5388 T1252 oascc.ZkStateReader.updateClusterState Updating cloud state from ZooKeeper... 
[junit4:junit4]   2> 5389 T1252 oasc.Overseer$ClusterStateUpdater.updateState Update state numShards=1 message={
[junit4:junit4]   2> 	  "operation":"state",
[junit4:junit4]   2> 	  "numShards":"1",
[junit4:junit4]   2> 	  "shard":"shard1",
[junit4:junit4]   2> 	  "roles":null,
[junit4:junit4]   2> 	  "state":"active",
[junit4:junit4]   2> 	  "core":"collection1",
[junit4:junit4]   2> 	  "collection":"control_collection",
[junit4:junit4]   2> 	  "node_name":"127.0.0.1:31057__pzw",
[junit4:junit4]   2> 	  "base_url":"http://127.0.0.1:31057/_pzw"}
[junit4:junit4]   2> 5393 T1252 oasc.Overseer$ClusterStateUpdater.updateState Update state numShards=1 message={
[junit4:junit4]   2> 	  "operation":"state",
[junit4:junit4]   2> 	  "numShards":"1",
[junit4:junit4]   2> 	  "shard":null,
[junit4:junit4]   2> 	  "roles":null,
[junit4:junit4]   2> 	  "state":"down",
[junit4:junit4]   2> 	  "core":"collection1",
[junit4:junit4]   2> 	  "collection":"collection1",
[junit4:junit4]   2> 	  "node_name":"127.0.0.1:52642__pzw",
[junit4:junit4]   2> 	  "base_url":"http://127.0.0.1:52642/_pzw"}
[junit4:junit4]   2> 5393 T1252 oasc.Overseer$ClusterStateUpdater.createCollection Create collection collection1 with numShards 1
[junit4:junit4]   2> 5394 T1252 oasc.Overseer$ClusterStateUpdater.updateState Assigning new node to shard shard=shard1
[junit4:junit4]   2> 5419 T1270 oascc.ZkStateReader$2.process A cluster state change: WatchedEvent state:SyncConnected type:NodeDataChanged path:/clusterstate.json, has occurred - updating... (live nodes size: 2)
[junit4:junit4]   2> 5420 T1251 oascc.ZkStateReader$2.process A cluster state change: WatchedEvent state:SyncConnected type:NodeDataChanged path:/clusterstate.json, has occurred - updating... (live nodes size: 2)
[junit4:junit4]   2> 5419 T1257 oascc.ZkStateReader$2.process A cluster state change: WatchedEvent state:SyncConnected type:NodeDataChanged path:/clusterstate.json, has occurred - updating... (live nodes size: 2)
[junit4:junit4]   2> 6251 T1271 oasc.CoreContainer.registerCore registering core: collection1
[junit4:junit4]   2> 6251 T1271 oasc.ZkController.register Register replica - core:collection1 address:http://127.0.0.1:52642/_pzw collection:collection1 shard:shard1
[junit4:junit4]   2> 6252 T1271 oascc.SolrZkClient.makePath makePath: /collections/collection1/leader_elect/shard1/election
[junit4:junit4]   2> 6274 T1234 oazs.PrepRequestProcessor.pRequest Got user-level KeeperException when processing sessionid:0x13c9950c6070006 type:delete cxid:0x43 zxid:0x5a txntype:-1 reqpath:n/a Error Path:/solr/collections/collection1/leaders Error:KeeperErrorCode = NoNode for /solr/collections/collection1/leaders
[junit4:junit4]   2> 6275 T1271 oasc.ShardLeaderElectionContext.runLeaderProcess Running the leader process.
[junit4:junit4]   2> 6275 T1234 oazs.PrepRequestProcessor.pRequest Got user-level KeeperException when processing sessionid:0x13c9950c6070006 type:create cxid:0x44 zxid:0x5b txntype:-1 reqpath:n/a Error Path:/solr/overseer Error:KeeperErrorCode = NodeExists for /solr/overseer
[junit4:junit4]   2> 6286 T1271 oasc.ShardLeaderElectionContext.waitForReplicasToComeUp Enough replicas found to continue.
[junit4:junit4]   2> 6286 T1271 oasc.ShardLeaderElectionContext.runLeaderProcess I may be the new leader - try and sync
[junit4:junit4]   2> 6286 T1271 oasc.SyncStrategy.sync Sync replicas to http://127.0.0.1:52642/_pzw/collection1/
[junit4:junit4]   2> 6286 T1271 oasc.SyncStrategy.syncReplicas Sync Success - now sync replicas to me
[junit4:junit4]   2> 6287 T1271 oasc.SyncStrategy.syncToMe http://127.0.0.1:52642/_pzw/collection1/ has no replicas
[junit4:junit4]   2> 6287 T1271 oasc.ShardLeaderElectionContext.runLeaderProcess I am the new leader: http://127.0.0.1:52642/_pzw/collection1/
[junit4:junit4]   2> 6287 T1271 oascc.SolrZkClient.makePath makePath: /collections/collection1/leaders/shard1
[junit4:junit4]   2> 6291 T1234 oazs.PrepRequestProcessor.pRequest Got user-level KeeperException when processing sessionid:0x13c9950c6070006 type:create cxid:0x4e zxid:0x5f txntype:-1 reqpath:n/a Error Path:/solr/overseer Error:KeeperErrorCode = NodeExists for /solr/overseer
[junit4:junit4]   2> 6927 T1252 oascc.ZkStateReader.updateClusterState Updating cloud state from ZooKeeper... 
[junit4:junit4]   2> 6943 T1251 oascc.ZkStateReader$2.process A cluster state change: WatchedEvent state:SyncConnected type:NodeDataChanged path:/clusterstate.json, has occurred - updating... (live nodes size: 2)
[junit4:junit4]   2> 6943 T1257 oascc.ZkStateReader$2.process A cluster state change: WatchedEvent state:SyncConnected type:NodeDataChanged path:/clusterstate.json, has occurred - updating... (live nodes size: 2)
[junit4:junit4]   2> 6943 T1270 oascc.ZkStateReader$2.process A cluster state change: WatchedEvent state:SyncConnected type:NodeDataChanged path:/clusterstate.json, has occurred - updating... (live nodes size: 2)
[junit4:junit4]   2> 6956 T1271 oasc.ZkController.register We are http://127.0.0.1:52642/_pzw/collection1/ and leader is http://127.0.0.1:52642/_pzw/collection1/
[junit4:junit4]   2> 6956 T1271 oasc.ZkController.register No LogReplay needed for core=collection1 baseURL=http://127.0.0.1:52642/_pzw
[junit4:junit4]   2> 6956 T1271 oasc.ZkController.checkRecovery I am the leader, no recovery necessary
[junit4:junit4]   2> 6956 T1271 oasc.ZkController.publish publishing core=collection1 state=active
[junit4:junit4]   2> 6957 T1271 oasc.ZkController.publish numShards not found on descriptor - reading it from system property
[junit4:junit4]   2> 6958 T1271 oascc.ZkStateReader.updateClusterState Updating cloud state from ZooKeeper... 
[junit4:junit4]   2> 6959 T1229 oass.SolrDispatchFilter.init user.dir=/usr/home/hudson/hudson-slave/workspace/Lucene-Solr-Tests-4.x-java7/solr/build/solr-core/test/J1
[junit4:junit4]   2> 6960 T1229 oass.SolrDispatchFilter.init SolrDispatchFilter.init() done
[junit4:junit4]   2> 6961 T1229 oascsi.HttpClientUtil.createClient Creating new http client, config:maxConnections=128&maxConnectionsPerHost=32&followRedirects=false
[junit4:junit4]   2> 7153 T1229 oejs.Server.doStart jetty-8.1.8.v20121106
[junit4:junit4]   2> 7157 T1229 oejs.AbstractConnector.doStart Started SocketConnector@127.0.0.1:52646
[junit4:junit4]   2> 7158 T1229 oass.SolrDispatchFilter.init SolrDispatchFilter.init()
[junit4:junit4]   2> 7158 T1229 oasc.SolrResourceLoader.locateSolrHome JNDI not configured for solr (NoInitialContextEx)
[junit4:junit4]   2> 7159 T1229 oasc.SolrResourceLoader.locateSolrHome using system property solr.solr.home: /usr/home/hudson/hudson-slave/workspace/Lucene-Solr-Tests-4.x-java7/solr/build/solr-core/test/J1/./org.apache.solr.cloud.SyncSliceTest-jetty2-1359781880118
[junit4:junit4]   2> 7159 T1229 oasc.CoreContainer$Initializer.initialize looking for solr.xml: /usr/home/hudson/hudson-slave/workspace/Lucene-Solr-Tests-4.x-java7/solr/build/solr-core/test/J1/./org.apache.solr.cloud.SyncSliceTest-jetty2-1359781880118/solr.xml
[junit4:junit4]   2> 7160 T1229 oasc.CoreContainer.<init> New CoreContainer 1989934279
[junit4:junit4]   2> 7161 T1229 oasc.CoreContainer.load Loading CoreContainer using Solr Home: '/usr/home/hudson/hudson-slave/workspace/Lucene-Solr-Tests-4.x-java7/solr/build/solr-core/test/J1/./org.apache.solr.cloud.SyncSliceTest-jetty2-1359781880118/'
[junit4:junit4]   2> 7161 T1229 oasc.SolrResourceLoader.<init> new SolrResourceLoader for directory: '/usr/home/hudson/hudson-slave/workspace/Lucene-Solr-Tests-4.x-java7/solr/build/solr-core/test/J1/./org.apache.solr.cloud.SyncSliceTest-jetty2-1359781880118/'
[junit4:junit4]   2> 7220 T1229 oashc.HttpShardHandlerFactory.getParameter Setting socketTimeout to: 60000
[junit4:junit4]   2> 7221 T1229 oashc.HttpShardHandlerFactory.getParameter Setting urlScheme to: http://
[junit4:junit4]   2> 7221 T1229 oashc.HttpShardHandlerFactory.getParameter Setting connTimeout to: 15000
[junit4:junit4]   2> 7222 T1229 oashc.HttpShardHandlerFactory.getParameter Setting maxConnectionsPerHost to: 20
[junit4:junit4]   2> 7222 T1229 oashc.HttpShardHandlerFactory.getParameter Setting corePoolSize to: 0
[junit4:junit4]   2> 7223 T1229 oashc.HttpShardHandlerFactory.getParameter Setting maximumPoolSize to: 2147483647
[junit4:junit4]   2> 7223 T1229 oashc.HttpShardHandlerFactory.getParameter Setting maxThreadIdleTime to: 5
[junit4:junit4]   2> 7224 T1229 oashc.HttpShardHandlerFactory.getParameter Setting sizeOfQueue to: -1
[junit4:junit4]   2> 7224 T1229 oashc.HttpShardHandlerFactory.getParameter Setting fairnessPolicy to: false
[junit4:junit4]   2> 7225 T1229 oascsi.HttpClientUtil.createClient Creating new http client, config:maxConnectionsPerHost=20&maxConnections=10000&socketTimeout=60000&connTimeout=15000&retry=false
[junit4:junit4]   2> 7245 T1229 oasc.CoreContainer.load Registering Log Listener
[junit4:junit4]   2> 7265 T1229 oasc.CoreContainer.initZooKeeper Zookeeper client=127.0.0.1:25600/solr
[junit4:junit4]   2> 7266 T1229 oasc.ZkController.checkChrootPath zkHost includes chroot
[junit4:junit4]   2> 7267 T1229 oaz.ZooKeeper.<init> Initiating client connection, connectString=127.0.0.1:25600 sessionTimeout=60000 watcher=org.apache.solr.common.cloud.ConnectionManager@50580f9b
[junit4:junit4]   2> 7268 T1229 oascc.ConnectionManager.waitForConnected Waiting for client to connect to ZooKeeper
[junit4:junit4]   2> 7268 T1282 oaz.ClientCnxn$SendThread.logStartConnect Opening socket connection to server localhost/127.0.0.1:25600. Will not attempt to authenticate using SASL (access denied ("javax.security.auth.AuthPermission" "getLoginConfiguration"))
[junit4:junit4]   2> 7269 T1282 oaz.ClientCnxn$SendThread.primeConnection Socket connection established to localhost/127.0.0.1:25600, initiating session
[junit4:junit4]   2> 7269 T1231 oazs.NIOServerCnxnFactory.run Accepted socket connection from /140.211.11.196:52647
[junit4:junit4]   2> 7270 T1231 oazs.ZooKeeperServer.processConnectRequest Client attempting to establish new session at /140.211.11.196:52647
[junit4:junit4]   2> 7272 T1233 oazs.ZooKeeperServer.finishSessionInit Established session 0x13c9950c6070007 with negotiated timeout 20000 for client /140.211.11.196:52647
[junit4:junit4]   2> 7272 T1282 oaz.ClientCnxn$SendThread.onConnected Session establishment complete on server localhost/127.0.0.1:25600, sessionid = 0x13c9950c6070007, negotiated timeout = 20000
[junit4:junit4]   2> 7272 T1283 oascc.ConnectionManager.process Watcher org.apache.solr.common.cloud.ConnectionManager@50580f9b name:ZooKeeperConnection Watcher:127.0.0.1:25600 got event WatchedEvent state:SyncConnected type:None path:null path:null type:None
[junit4:junit4]   2> 7273 T1229 oascc.ConnectionManager.waitForConnected Client is connected to ZooKeeper
[junit4:junit4]   2> 7274 T1234 oazs.PrepRequestProcessor.pRequest2Txn Processed session termination for sessionid: 0x13c9950c6070007
[junit4:junit4]   2> 7287 T1283 oaz.ClientCnxn$EventThread.run EventThread shut down
[junit4:junit4]   2> 7287 T1231 oazs.NIOServerCnxn.closeSock Closed socket connection for client /140.211.11.196:52647 which had sessionid 0x13c9950c6070007
[junit4:junit4]   2> 7287 T1229 oaz.ZooKeeper.close Session: 0x13c9950c6070007 closed
[junit4:junit4]   2> 7288 T1229 oascsi.HttpClientUtil.createClient Creating new http client, config:maxConnections=500&maxConnectionsPerHost=16&socketTimeout=60000&connTimeout=15000
[junit4:junit4]   2> 7297 T1229 oaz.ZooKeeper.<init> Initiating client connection, connectString=127.0.0.1:25600/solr sessionTimeout=30000 watcher=org.apache.solr.common.cloud.ConnectionManager@1eaf30ec
[junit4:junit4]   2> 7298 T1229 oascc.ConnectionManager.waitForConnected Waiting for client to connect to ZooKeeper
[junit4:junit4]   2> 7298 T1284 oaz.ClientCnxn$SendThread.logStartConnect Opening socket connection to server localhost/127.0.0.1:25600. Will not attempt to authenticate using SASL (access denied ("javax.security.auth.AuthPermission" "getLoginConfiguration"))
[junit4:junit4]   2> 7299 T1284 oaz.ClientCnxn$SendThread.primeConnection Socket connection established to localhost/127.0.0.1:25600, initiating session
[junit4:junit4]   2> 7299 T1231 oazs.NIOServerCnxnFactory.run Accepted socket connection from /140.211.11.196:52648
[junit4:junit4]   2> 7299 T1231 oazs.ZooKeeperServer.processConnectRequest Client attempting to establish new session at /140.211.11.196:52648
[junit4:junit4]   2> 7300 T1233 oazs.ZooKeeperServer.finishSessionInit Established session 0x13c9950c6070008 with negotiated timeout 20000 for client /140.211.11.196:52648
[junit4:junit4]   2> 7301 T1284 oaz.ClientCnxn$SendThread.onConnected Session establishment complete on server localhost/127.0.0.1:25600, sessionid = 0x13c9950c6070008, negotiated timeout = 20000
[junit4:junit4]   2> 7301 T1285 oascc.ConnectionManager.process Watcher org.apache.solr.common.cloud.ConnectionManager@1eaf30ec name:ZooKeeperConnection Watcher:127.0.0.1:25600/solr got event WatchedEvent state:SyncConnected type:None path:null path:null type:None
[junit4:junit4]   2> 7301 T1229 oascc.ConnectionManager.waitForConnected Client is connected to ZooKeeper
[junit4:junit4]   2> 7302 T1234 oazs.PrepRequestProcessor.pRequest Got user-level KeeperException when processing sessionid:0x13c9950c6070008 type:create cxid:0x1 zxid:0x6c txntype:-1 reqpath:n/a Error Path:/solr/overseer Error:KeeperErrorCode = NodeExists for /solr/overseer
[junit4:junit4]   2> 7305 T1234 oazs.PrepRequestProcessor.pRequest Got user-level KeeperException when processing sessionid:0x13c9950c6070008 type:create cxid:0x2 zxid:0x6d txntype:-1 reqpath:n/a Error Path:/solr/overseer Error:KeeperErrorCode = NodeExists for /solr/overseer
[junit4:junit4]   2> 7311 T1229 oasc.ZkController.createEphemeralLiveNode Register node as live in ZooKeeper:/live_nodes/127.0.0.1:52646__pzw
[junit4:junit4]   2> 7313 T1234 oazs.PrepRequestProcessor.pRequest Got user-level KeeperException when processing sessionid:0x13c9950c6070008 type:delete cxid:0x4 zxid:0x6e txntype:-1 reqpath:n/a Error Path:/solr/live_nodes/127.0.0.1:52646__pzw Error:KeeperErrorCode = NoNode for /solr/live_nodes/127.0.0.1:52646__pzw
[junit4:junit4]   2> 7314 T1229 oascc.SolrZkClient.makePath makePath: /live_nodes/127.0.0.1:52646__pzw
[junit4:junit4]   2> 7317 T1257 oascc.ZkStateReader$3.process Updating live nodes... (3)
[junit4:junit4]   2> 7317 T1251 oascc.ZkStateReader$3.process Updating live nodes... (3)
[junit4:junit4]   2> 7317 T1270 oascc.ZkStateReader$3.process Updating live nodes... (3)
[junit4:junit4]   2> 7317 T1251 oascc.ZkStateReader$2.process A cluster state change: WatchedEvent state:SyncConnected type:NodeChildrenChanged path:/live_nodes, has occurred - updating... (live nodes size: 3)
[junit4:junit4]   2> 7317 T1257 oascc.ZkStateReader$2.process A cluster state change: WatchedEvent state:SyncConnected type:NodeChildrenChanged path:/live_nodes, has occurred - updating... (live nodes size: 3)
[junit4:junit4]   2> 7318 T1270 oascc.ZkStateReader$2.process A cluster state change: WatchedEvent state:SyncConnected type:NodeChildrenChanged path:/live_nodes, has occurred - updating... (live nodes size: 3)
[junit4:junit4]   2> 7321 T1229 oascc.ZkStateReader.createClusterStateWatchersAndUpdate Updating cluster state from ZooKeeper... 
[junit4:junit4]   2> 7331 T1286 oasc.CoreContainer.create Creating SolrCore 'collection1' using instanceDir: /usr/home/hudson/hudson-slave/workspace/Lucene-Solr-Tests-4.x-java7/solr/build/solr-core/test/J1/./org.apache.solr.cloud.SyncSliceTest-jetty2-1359781880118/collection1
[junit4:junit4]   2> 7331 T1286 oasc.ZkController.createCollectionZkNode Check for collection zkNode:collection1
[junit4:junit4]   2> 7332 T1286 oasc.ZkController.createCollectionZkNode Collection zkNode exists
[junit4:junit4]   2> 7332 T1286 oasc.ZkController.readConfigName Load collection config from:/collections/collection1
[junit4:junit4]   2> 7333 T1286 oasc.SolrResourceLoader.<init> new SolrResourceLoader for directory: '/usr/home/hudson/hudson-slave/workspace/Lucene-Solr-Tests-4.x-java7/solr/build/solr-core/test/J1/./org.apache.solr.cloud.SyncSliceTest-jetty2-1359781880118/collection1/'
[junit4:junit4]   2> 7335 T1286 oasc.SolrResourceLoader.replaceClassLoader Adding 'file:/usr/home/hudson/hudson-slave/workspace/Lucene-Solr-Tests-4.x-java7/solr/build/solr-core/test/J1/org.apache.solr.cloud.SyncSliceTest-jetty2-1359781880118/collection1/lib/README' to classloader
[junit4:junit4]   2> 7335 T1286 oasc.SolrResourceLoader.replaceClassLoader Adding 'file:/usr/home/hudson/hudson-slave/workspace/Lucene-Solr-Tests-4.x-java7/solr/build/solr-core/test/J1/org.apache.solr.cloud.SyncSliceTest-jetty2-1359781880118/collection1/lib/classes/' to classloader
[junit4:junit4]   2> 7394 T1286 oasc.SolrConfig.<init> Using Lucene MatchVersion: LUCENE_42
[junit4:junit4]   2> 7469 T1286 oasc.SolrConfig.<init> Loaded SolrConfig: solrconfig.xml
[junit4:junit4]   2> 7570 T1286 oass.IndexSchema.readSchema Reading Solr Schema
[junit4:junit4]   2> 7576 T1286 oass.IndexSchema.readSchema Schema name=test
[junit4:junit4]   2> 8204 T1286 oass.OpenExchangeRatesOrgProvider.init Initialized with rates=open-exchange-rates.json, refreshInterval=1440.
[junit4:junit4]   2> 8215 T1286 oass.IndexSchema.readSchema default search field in schema is text
[junit4:junit4]   2> 8219 T1286 oass.IndexSchema.readSchema unique key field: id
[junit4:junit4]   2> 8233 T1286 oass.FileExchangeRateProvider.reload Reloading exchange rates from file currency.xml
[junit4:junit4]   2> 8239 T1286 oass.FileExchangeRateProvider.reload Reloading exchange rates from file currency.xml
[junit4:junit4]   2> 8244 T1286 oass.OpenExchangeRatesOrgProvider.reload Reloading exchange rates from open-exchange-rates.json
[junit4:junit4]   2> 8246 T1286 oass.OpenExchangeRatesOrgProvider.reload Reloading exchange rates from open-exchange-rates.json
[junit4:junit4]   2> 8248 T1286 oasc.SolrCore.<init> [collection1] Opening new SolrCore at /usr/home/hudson/hudson-slave/workspace/Lucene-Solr-Tests-4.x-java7/solr/build/solr-core/test/J1/./org.apache.solr.cloud.SyncSliceTest-jetty2-1359781880118/collection1/, dataDir=./org.apache.solr.cloud.SyncSliceTest-1359781873150/jetty2/
[junit4:junit4]   2> 8249 T1286 oasc.JmxMonitoredMap.<init> JMX monitoring is enabled. Adding Solr mbeans to JMX Server: com.sun.jmx.mbeanserver.JmxMBeanServer@1102e749
[junit4:junit4]   2> 8249 T1286 oasc.SolrCore.initDirectoryFactory solr.NRTCachingDirectoryFactory
[junit4:junit4]   2> 8250 T1286 oasc.CachingDirectoryFactory.get return new directory for /usr/home/hudson/hudson-slave/workspace/Lucene-Solr-Tests-4.x-java7/solr/build/solr-core/test/J1/./org.apache.solr.cloud.SyncSliceTest-1359781873150/jetty2 forceNew:false
[junit4:junit4]   2> 8251 T1286 oasc.CachingDirectoryFactory.close Releasing directory:/usr/home/hudson/hudson-slave/workspace/Lucene-Solr-Tests-4.x-java7/solr/build/solr-core/test/J1/./org.apache.solr.cloud.SyncSliceTest-1359781873150/jetty2
[junit4:junit4]   2> 8251 T1286 oasc.SolrCore.getNewIndexDir New index directory detected: old=null new=./org.apache.solr.cloud.SyncSliceTest-1359781873150/jetty2/index/
[junit4:junit4]   2> 8252 T1286 oasc.SolrCore.initIndex WARNING [collection1] Solr index directory './org.apache.solr.cloud.SyncSliceTest-1359781873150/jetty2/index' doesn't exist. Creating new index...
[junit4:junit4]   2> 8253 T1286 oasc.CachingDirectoryFactory.get return new directory for /usr/home/hudson/hudson-slave/workspace/Lucene-Solr-Tests-4.x-java7/solr/build/solr-core/test/J1/./org.apache.solr.cloud.SyncSliceTest-1359781873150/jetty2/index forceNew:false
[junit4:junit4]   2> 8273 T1286 oasc.SolrDeletionPolicy.onCommit SolrDeletionPolicy.onCommit: commits:num=1
[junit4:junit4]   2> 		commit{dir=RateLimitedDirectoryWrapper(NRTCachingDirectory(org.apache.lucene.store.NIOFSDirectory@/usr/home/hudson/hudson-slave/workspace/Lucene-Solr-Tests-4.x-java7/solr/build/solr-core/test/J1/org.apache.solr.cloud.SyncSliceTest-1359781873150/jetty2/index lockFactory=org.apache.lucene.store.NativeFSLockFactory@2664cf35; maxCacheMB=48.0 maxMergeSizeMB=4.0)),segFN=segments_1,generation=1,filenames=[segments_1]
[junit4:junit4]   2> 8274 T1286 oasc.SolrDeletionPolicy.updateCommits newest commit = 1[segments_1]
[junit4:junit4]   2> 8275 T1286 oasc.CachingDirectoryFactory.close Releasing directory:/usr/home/hudson/hudson-slave/workspace/Lucene-Solr-Tests-4.x-java7/solr/build/solr-core/test/J1/./org.apache.solr.cloud.SyncSliceTest-1359781873150/jetty2/index
[junit4:junit4]   2> 8275 T1286 oasc.SolrCore.initWriters created xml: solr.XMLResponseWriter
[junit4:junit4]   2> 8277 T1286 oasup.UpdateRequestProcessorChain.init inserting DistributedUpdateProcessorFactory into updateRequestProcessorChain "dedupe"
[junit4:junit4]   2> 8277 T1286 oasup.UpdateRequestProcessorChain.init inserting DistributedUpdateProcessorFactory into updateRequestProcessorChain "dedupe-allfields"
[junit4:junit4]   2> 8278 T1286 oasup.UpdateRequestProcessorChain.init inserting DistributedUpdateProcessorFactory into updateRequestProcessorChain "stored_sig"
[junit4:junit4]   2> 8278 T1286 oasup.UpdateRequestProcessorChain.init inserting DistributedUpdateProcessorFactory into updateRequestProcessorChain "uniq-fields"
[junit4:junit4]   2> 8279 T1286 oasup.UpdateRequestProcessorChain.init inserting DistributedUpdateProcessorFactory into updateRequestProcessorChain "distrib-dup-test-chain-implicit"
[junit4:junit4]   2> 8279 T1286 oasc.RequestHandlers.initHandlersFromConfig adding lazy requestHandler: solr.ReplicationHandler
[junit4:junit4]   2> 8279 T1286 oasc.RequestHandlers.initHandlersFromConfig created /replication: solr.ReplicationHandler
[junit4:junit4]   2> 8280 T1286 oasc.RequestHandlers.initHandlersFromConfig created standard: solr.StandardRequestHandler
[junit4:junit4]   2> 8280 T1286 oasc.RequestHandlers.initHandlersFromConfig created /get: solr.RealTimeGetHandler
[junit4:junit4]   2> 8281 T1286 oasc.RequestHandlers.initHandlersFromConfig created dismax: solr.SearchHandler
[junit4:junit4]   2> 8281 T1286 oasc.RequestHandlers.initHandlersFromConfig created mock: org.apache.solr.core.MockQuerySenderListenerReqHandler
[junit4:junit4]   2> 8282 T1286 oasc.RequestHandlers.initHandlersFromConfig created /admin/: org.apache.solr.handler.admin.AdminHandlers
[junit4:junit4]   2> 8282 T1286 oasc.RequestHandlers.initHandlersFromConfig created defaults: solr.StandardRequestHandler
[junit4:junit4]   2> 8283 T1286 oasc.RequestHandlers.initHandlersFromConfig adding lazy requestHandler: solr.StandardRequestHandler
[junit4:junit4]   2> 8283 T1286 oasc.RequestHandlers.initHandlersFromConfig created lazy: solr.StandardRequestHandler
[junit4:junit4]   2> 8283 T1286 oasc.RequestHandlers.initHandlersFromConfig created /update: solr.UpdateRequestHandler
[junit4:junit4]   2> 8284 T1286 oasc.RequestHandlers.initHandlersFromConfig created /terms: org.apache.solr.handler.component.SearchHandler
[junit4:junit4]   2> 8284 T1286 oasc.RequestHandlers.initHandlersFromConfig created spellCheckCompRH: org.apache.solr.handler.component.SearchHandler
[junit4:junit4]   2> 8285 T1286 oasc.RequestHandlers.initHandlersFromConfig created spellCheckCompRH_Direct: org.apache.solr.handler.component.SearchHandler
[junit4:junit4]   2> 8285 T1286 oasc.RequestHandlers.initHandlersFromConfig created spellCheckWithWordbreak: org.apache.solr.handler.component.SearchHandler
[junit4:junit4]   2> 8286 T1286 oasc.RequestHandlers.initHandlersFromConfig created spellCheckWithWordbreak_Direct: org.apache.solr.handler.component.SearchHandler
[junit4:junit4]   2> 8286 T1286 oasc.RequestHandlers.initHandlersFromConfig created spellCheckCompRH1: org.apache.solr.handler.component.SearchHandler
[junit4:junit4]   2> 8287 T1286 oasc.RequestHandlers.initHandlersFromConfig created mltrh: org.apache.solr.handler.component.SearchHandler
[junit4:junit4]   2> 8287 T1286 oasc.RequestHandlers.initHandlersFromConfig created tvrh: org.apache.solr.handler.component.SearchHandler
[junit4:junit4]   2> 8288 T1286 oasc.RequestHandlers.initHandlersFromConfig created /mlt: solr.MoreLikeThisHandler
[junit4:junit4]   2> 8288 T1286 oasc.RequestHandlers.initHandlersFromConfig created /debug/dump: solr.DumpRequestHandler
[junit4:junit4]   2> 8301 T1286 oashl.XMLLoader.init xsltCacheLifetimeSeconds=60
[junit4:junit4]   2> 8305 T1286 oasc.SolrCore.initDeprecatedSupport WARNING solrconfig.xml uses deprecated <admin/gettableFiles>, Please update your config to use the ShowFileRequestHandler.
[junit4:junit4]   2> 8306 T1286 oasc.SolrCore.initDeprecatedSupport WARNING adding ShowFileRequestHandler with hidden files: [SCHEMA.XML, OLD_SYNONYMS.TXT, STOPWORDS.TXT, PROTWORDS.TXT, OPEN-EXCHANGE-RATES.JSON, SYNONYMS.TXT, CURRENCY.XML, MAPPING-ISOLATIN1ACCENT.TXT]
[junit4:junit4]   2> 8309 T1286 oasc.CachingDirectoryFactory.close Releasing directory:/usr/home/hudson/hudson-slave/workspace/Lucene-Solr-Tests-4.x-java7/solr/build/solr-core/test/J1/./org.apache.solr.cloud.SyncSliceTest-1359781873150/jetty2
[junit4:junit4]   2> 8310 T1286 oass.SolrIndexSearcher.<init> Opening Searcher@16dd37ee main
[junit4:junit4]   2> 8311 T1286 oasu.CommitTracker.<init> Hard AutoCommit: disabled
[junit4:junit4]   2> 8312 T1286 oasu.CommitTracker.<init> Soft AutoCommit: disabled
[junit4:junit4]   2> 8312 T1286 oashc.SpellCheckComponent.inform Initializing spell checkers
[junit4:junit4]   2> 8339 T1286 oass.DirectSolrSpellChecker.init init: {name=direct,classname=DirectSolrSpellChecker,field=lowerfilt,minQueryLength=3}
[junit4:junit4]   2> 8409 T1287 oasc.SolrCore.registerSearcher [collection1] Registered new searcher Searcher@16dd37ee main{StandardDirectoryReader(segments_1:1)}
[junit4:junit4]   2> 8414 T1286 oasc.ZkController.publish publishing core=collection1 state=down
[junit4:junit4]   2> 8414 T1286 oasc.ZkController.publish numShards not found on descriptor - reading it from system property
[junit4:junit4]   2> 8448 T1252 oascc.ZkStateReader.updateClusterState Updating cloud state from ZooKeeper... 
[junit4:junit4]   2> 8449 T1252 oasc.Overseer$ClusterStateUpdater.updateState Update state numShards=1 message={
[junit4:junit4]   2> 	  "operation":"state",
[junit4:junit4]   2> 	  "numShards":"1",
[junit4:junit4]   2> 	  "shard":"shard1",
[junit4:junit4]   2> 	  "roles":null,
[junit4:junit4]   2> 	  "state":"active",
[junit4:junit4]   2> 	  "core":"collection1",
[junit4:junit4]   2> 	  "collection":"collection1",
[junit4:junit4]   2> 	  "node_name":"127.0.0.1:52642__pzw",
[junit4:junit4]   2> 	  "base_url":"http://127.0.0.1:52642/_pzw"}
[junit4:junit4]   2> 8469 T1252 oasc.Overseer$ClusterStateUpdater.updateState Update state numShards=1 message={
[junit4:junit4]   2> 	  "operation":"state",
[junit4:junit4]   2> 	  "numShards":"1",
[junit4:junit4]   2> 	  "shard":null,
[junit4:junit4]   2> 	  "roles":null,
[junit4:junit4]   2> 	  "state":"down",
[junit4:junit4]   2> 	  "core":"collection1",
[junit4:junit4]   2> 	  "collection":"collection1",
[junit4:junit4]   2> 	  "node_name":"127.0.0.1:52646__pzw",
[junit4:junit4]   2> 	  "base_url":"http://127.0.0.1:52646/_pzw"}
[junit4:junit4]   2> 8469 T1252 oasc.Overseer$ClusterStateUpdater.updateState Collection already exists with numShards=1
[junit4:junit4]   2> 8469 T1252 oasc.Overseer$ClusterStateUpdater.updateState Assigning new node to shard shard=shard1
[junit4:junit4]   2> 8482 T1257 oascc.ZkStateReader$2.process A cluster state change: WatchedEvent state:SyncConnected type:NodeDataChanged path:/clusterstate.json, has occurred - updating... (live nodes size: 3)
[junit4:junit4]   2> 8482 T1270 oascc.ZkStateReader$2.process A cluster state change: WatchedEvent state:SyncConnected type:NodeDataChanged path:/clusterstate.json, has occurred - updating... (live nodes size: 3)
[junit4:junit4]   2> 8482 T1285 oascc.ZkStateReader$2.process A cluster state change: WatchedEvent state:SyncConnected type:NodeDataChanged path:/clusterstate.json, has occurred - updating... (live nodes size: 3)
[junit4:junit4]   2> 8482 T1251 oascc.ZkStateReader$2.process A cluster state change: WatchedEvent state:SyncConnected type:NodeDataChanged path:/clusterstate.json, has occurred - updating... (live nodes size: 3)
[junit4:junit4]   2> 9416 T1286 oasc.CoreContainer.registerCore registering core: collection1
[junit4:junit4]   2> 9416 T1286 oasc.ZkController.register Register replica - core:collection1 address:http://127.0.0.1:52646/_pzw collection:collection1 shard:shard1
[junit4:junit4]   2> 9445 T1286 oasc.ZkController.register We are http://127.0.0.1:52646/_pzw/collection1/ and leader is http://127.0.0.1:52642/_pzw/collection1/
[junit4:junit4]   2> 9445 T1286 oasc.ZkController.register No LogReplay needed for core=collection1 baseURL=http://127.0.0.1:52646/_pzw
[junit4:junit4]   2> 9445 T1286 oasc.ZkController.checkRecovery Core needs to recover:collection1
[junit4:junit4]   2> 9446 T1286 oasu.DefaultSolrCoreState.doRecovery Running recovery - first canceling any ongoing recovery
[junit4:junit4]   2> ASYNC  NEW_CORE C121 name=collection1 org.apache.solr.core.SolrCore@1cd9f1aa url=http://127.0.0.1:52646/_pzw/collection1 node=127.0.0.1:52646__pzw C121_STATE=coll:collection1 core:collection1 props:{shard=null, roles=null, state=down, core=collection1, collection=collection1, node_name=127.0.0.1:52646__pzw, base_url=http://127.0.0.1:52646/_pzw}
[junit4:junit4]   2> 9446 T1288 C121 P52646 oasc.RecoveryStrategy.run Starting recovery process.  core=collection1 recoveringAfterStartup=true
[junit4:junit4]   2> 9447 T1288 C121 P52646 oasc.RecoveryStrategy.doRecovery ###### startupVersions=[]
[junit4:junit4]   2> 9447 T1288 C121 P52646 oasc.ZkController.publish publishing core=collection1 state=recovering
[junit4:junit4]   2> 9447 T1288 C121 P52646 oasc.ZkController.publish numShards not found on descriptor - reading it from system property
[junit4:junit4]   2> 9448 T1286 oascc.ZkStateReader.updateClusterState Updating cloud state from ZooKeeper... 
[junit4:junit4]   2> 9449 T1288 C121 P52646 oascsi.HttpClientUtil.createClient Creating new http client, config:maxConnections=128&maxConnectionsPerHost=32&followRedirects=false
[junit4:junit4]   2> 9459 T1229 oass.SolrDispatchFilter.init user.dir=/usr/home/hudson/hudson-slave/workspace/Lucene-Solr-Tests-4.x-java7/solr/build/solr-core/test/J1
[junit4:junit4]   2> 9459 T1229 oass.SolrDispatchFilter.init SolrDispatchFilter.init() done
[junit4:junit4]   2> 9460 T1229 oascsi.HttpClientUtil.createClient Creating new http client, config:maxConnections=128&maxConnectionsPerHost=32&followRedirects=false
[junit4:junit4]   2> 9645 T1229 oejs.Server.doStart jetty-8.1.8.v20121106
[junit4:junit4]   2> 9648 T1229 oejs.AbstractConnector.doStart Started SocketConnector@127.0.0.1:52650
[junit4:junit4]   2> 9649 T1229 oass.SolrDispatchFilter.init SolrDispatchFilter.init()
[junit4:junit4]   2> 9650 T1229 oasc.SolrResourceLoader.locateSolrHome JNDI not configured for solr (NoInitialContextEx)
[junit4:junit4]   2> 9650 T1229 oasc.SolrResourceLoader.locateSolrHome using system property solr.solr.home: /usr/home/hudson/hudson-slave/workspace/Lucene-Solr-Tests-4.x-java7/solr/build/solr-core/test/J1/./org.apache.solr.cloud.SyncSliceTest-jetty3-1359781882613
[junit4:junit4]   2> 9650 T1229 oasc.CoreContainer$Initializer.initialize looking for solr.xml: /usr/home/hudson/hudson-slave/workspace/Lucene-Solr-Tests-4.x-java7/solr/build/solr-core/test/J1/./org.apache.solr.cloud.SyncSliceTest-jetty3-1359781882613/solr.xml
[junit4:junit4]   2> 9651 T1229 oasc.CoreContainer.<init> New CoreContainer 137254145
[junit4:junit4]   2> 9652 T1229 oasc.CoreContainer.load Loading CoreContainer using Solr Home: '/usr/home/hudson/hudson-slave/workspace/Lucene-Solr-Tests-4.x-java7/solr/build/solr-core/test/J1/./org.apache.solr.cloud.SyncSliceTest-jetty3-1359781882613/'
[junit4:junit4]   2> 9652 T1229 oasc.SolrResourceLoader.<init> new SolrResourceLoader for directory: '/usr/home/hudson/hudson-slave/workspace/Lucene-Solr-Tests-4.x-java7/solr/build/solr-core/test/J1/./org.apache.solr.cloud.SyncSliceTest-jetty3-1359781882613/'
[junit4:junit4]   2> 9723 T1229 oashc.HttpShardHandlerFactory.getParameter Setting socketTimeout to: 60000
[junit4:junit4]   2> 9723 T1229 oashc.HttpShardHandlerFactory.getParameter Setting urlScheme to: http://
[junit4:junit4]   2> 9724 T1229 oashc.HttpShardHandlerFactory.getParameter Setting connTimeout to: 15000
[junit4:junit4]   2> 9724 T1229 oashc.HttpShardHandlerFactory.getParameter Setting maxConnectionsPerHost to: 20
[junit4:junit4]   2> 9725 T1229 oashc.HttpShardHandlerFactory.getParameter Setting corePoolSize to: 0
[junit4:junit4]   2> 9725 T1229 oashc.HttpShardHandlerFactory.getParameter Setting maximumPoolSize to: 2147483647
[junit4:junit4]   2> 9726 T1229 oashc.HttpShardHandlerFactory.getParameter Setting maxThreadIdleTime to: 5
[junit4:junit4]   2> 9726 T1229 oashc.HttpShardHandlerFactory.getParameter Setting sizeOfQueue to: -1
[junit4:junit4]   2> 9727 T1229 oashc.HttpShardHandlerFactory.getParameter Setting fairnessPolicy to: false
[junit4:junit4]   2> 9727 T1229 oascsi.HttpClientUtil.createClient Creating new http client, config:maxConnectionsPerHost=20&maxConnections=10000&socketTimeout=60000&connTimeout=15000&retry=false
[junit4:junit4]   2> 9750 T1229 oasc.CoreContainer.load Registering Log Listener
[junit4:junit4]   2> 9776 T1229 oasc.CoreContainer.initZooKeeper Zookeeper client=127.0.0.1:25600/solr
[junit4:junit4]   2> 9777 T1229 oasc.ZkController.checkChrootPath zkHost includes chroot
[junit4:junit4]   2> 9778 T1229 oaz.ZooKeeper.<init> Initiating client connection, connectString=127.0.0.1:25600 sessionTimeout=60000 watcher=org.apache.solr.common.cloud.ConnectionManager@7bb50570
[junit4:junit4]   2> 9779 T1229 oascc.ConnectionManager.waitForConnected Waiting for client to connect to ZooKeeper
[junit4:junit4]   2> 9780 T1298 oaz.ClientCnxn$SendThread.logStartConnect Opening socket connection to server localhost/127.0.0.1:25600. Will not attempt to authenticate using SASL (access denied ("javax.security.auth.AuthPermission" "getLoginConfiguration"))
[junit4:junit4]   2> 9781 T1298 oaz.ClientCnxn$SendThread.primeConnection Socket connection established to localhost/127.0.0.1:25600, initiating session
[junit4:junit4]   2> 9781 T1231 oazs.NIOServerCnxnFactory.run Accepted socket connection from /140.211.11.196:52652
[junit4:junit4]   2> 9781 T1231 oazs.ZooKeeperServer.processConnectRequest Client attempting to establish new session at /140.211.11.196:52652
[junit4:junit4]   2> 9783 T1233 oazs.ZooKeeperServer.finishSessionInit Established session 0x13c9950c6070009 with negotiated timeout 20000 for client /140.211.11.196:52652
[junit4:junit4]   2> 9783 T1298 oaz.ClientCnxn$SendThread.onConnected Session establishment complete on server localhost/127.0.0.1:25600, sessionid = 0x13c9950c6070009, negotiated timeout = 20000
[junit4:junit4]   2> 9783 T1299 oascc.ConnectionManager.process Watcher org.apache.solr.common.cloud.ConnectionManager@7bb50570 name:ZooKeeperConnection Watcher:127.0.0.1:25600 got event WatchedEvent state:SyncConnected type:None path:null path:null type:None
[junit4:junit4]   2> 9783 T1229 oascc.ConnectionManager.waitForConnected Client is connected to ZooKeeper
[junit4:junit4]   2> 9785 T1234 oazs.PrepRequestProcessor.pRequest2Txn Processed session termination for sessionid: 0x13c9950c6070009
[junit4:junit4]   2> 9785 T1299 oaz.ClientCnxn$EventThread.run EventThread shut down
[junit4:junit4]   2> 9785 T1231 oazs.NIOServerCnxn.closeSock Closed socket connection for client /140.211.11.196:52652 which had sessionid 0x13c9950c6070009
[junit4:junit4]   2> 9785 T1229 oaz.ZooKeeper.close Session: 0x13c9950c6070009 closed
[junit4:junit4]   2> 9786 T1229 oascsi.HttpClientUtil.createClient Creating new http client, config:maxConnections=500&maxConnectionsPerHost=16&socketTimeout=60000&connTimeout=15000
[junit4:junit4]   2> 9798 T1229 oaz.ZooKeeper.<init> Initiating client connection, connectString=127.0.0.1:25600/solr sessionTimeout=30000 watcher=org.apache.solr.common.cloud.ConnectionManager@5c6dd2c
[junit4:junit4]   2> 9799 T1229 oascc.ConnectionManager.waitForConnected Waiting for client to connect to ZooKeeper
[junit4:junit4]   2> 9799 T1300 oaz.ClientCnxn$SendThread.logStartConnect Opening socket connection to server localhost/127.0.0.1:25600. Will not attempt to authenticate using SASL (access denied ("javax.security.auth.AuthPermission" "getLoginConfiguration"))
[junit4:junit4]   2> 9800 T1300 oaz.ClientCnxn$SendThread.primeConnection Socket connection established to localhost/127.0.0.1:25600, initiating session
[junit4:junit4]   2> 9800 T1231 oazs.NIOServerCnxnFactory.run Accepted socket connection from /140.211.11.196:52653
[junit4:junit4]   2> 9800 T1231 oazs.ZooKeeperServer.processConnectRequest Client attempting to establish new session at /140.211.11.196:52653
[junit4:junit4]   2> 9801 T1233 oazs.ZooKeeperServer.finishSessionInit Established session 0x13c9950c607000a with negotiated timeout 20000 for client /140.211.11.196:52653
[junit4:junit4]   2> 9802 T1300 oaz.ClientCnxn$SendThread.onConnected Session establishment complete on server localhost/127.0.0.1:25600, sessionid = 0x13c9950c607000a, negotiated timeout = 20000
[junit4:junit4]   2> 9802 T1301 oascc.ConnectionManager.process Watcher org.apache.solr.common.cloud.ConnectionManager@5c6dd2c name:ZooKeeperConnection Watcher:127.0.0.1:25600/solr got event WatchedEvent state:SyncConnected type:None path:null path:null type:None
[junit4:junit4]   2> 9802 T1229 oascc.ConnectionManager.waitForConnected Client is connected to ZooKeeper
[junit4:junit4]   2> 9803 T1234 oazs.PrepRequestProcessor.pRequest Got user-level KeeperException when processing sessionid:0x13c9950c607000a type:create cxid:0x1 zxid:0x7e txntype:-1 reqpath:n/a Error Path:/solr/overseer Error:KeeperErrorCode = NodeExists for /solr/overseer
[junit4:junit4]   2> 9804 T1234 oazs.PrepRequestProcessor.pRequest Got user-level KeeperException when processing sessionid:0x13c9950c607000a type:create cxid:0x2 zxid:0x7f txntype:-1 reqpath:n/a Error Path:/solr/overseer Error:KeeperErrorCode = NodeExists for /solr/overseer
[junit4:junit4]   2> 9812 T1229 oasc.ZkController.createEphemeralLiveNode Register node as live in ZooKeeper:/live_nodes/127.0.0.1:52650__pzw
[junit4:junit4]   2> 9813 T1234 oazs.PrepRequestProcessor.pRequest Got user-level KeeperException when processing sessionid:0x13c9950c607000a type:delete cxid:0x4 zxid:0x80 txntype:-1 reqpath:n/a Error Path:/solr/live_nodes/127.0.0.1:52650__pzw Error:KeeperErrorCode = NoNode for /solr/live_nodes/127.0.0.1:52650__pzw
[junit4:junit4]   2> 9814 T1229 oascc.SolrZkClient.makePath makePath: /live_nodes/127.0.0.1:52650__pzw
[junit4:junit4]   2> 9817 T1257 oascc.ZkStateReader$3.process Updating live nodes... (4)
[junit4:junit4]   2> 9818 T1251 oascc.ZkStateReader$3.process Updating live nodes... (4)
[junit4:junit4]   2> 9817 T1270 oascc.ZkStateReader$3.process Updating live nodes... (4)
[junit4:junit4]   2> 9818 T1251 oascc.ZkStateReader$2.process A cluster state change: WatchedEvent state:SyncConnected type:NodeChildrenChanged path:/live_nodes, has occurred - updating... (live nodes size: 4)
[junit4:junit4]   2> 9817 T1285 oascc.ZkStateReader$3.process Updating live nodes... (4)
[junit4:junit4]   2> 9818 T1270 oascc.ZkStateReader$2.process A cluster state change: WatchedEvent state:SyncConnected type:NodeChildrenChanged path:/live_nodes, has occurred - updating... (live nodes size: 4)
[junit4:junit4]   2> 9818 T1257 oascc.ZkStateReader$2.process A cluster state change: WatchedEvent state:SyncConnected type:NodeChildrenChanged path:/live_nodes, has occurred - updating... (live nodes size: 4)
[junit4:junit4]   2> 9818 T1285 oascc.ZkStateReader$2.process A cluster state change: WatchedEvent state:SyncConnected type:NodeChildrenChanged path:/live_nodes, has occurred - updating... (live nodes size: 4)
[junit4:junit4]   2> 9821 T1229 oascc.ZkStateReader.createClusterStateWatchersAndUpdate Updating cluster state from ZooKeeper... 
[junit4:junit4]   2> 9828 T1302 oasc.CoreContainer.create Creating SolrCore 'collection1' using instanceDir: /usr/home/hudson/hudson-slave/workspace/Lucene-Solr-Tests-4.x-java7/solr/build/solr-core/test/J1/./org.apache.solr.cloud.SyncSliceTest-jetty3-1359781882613/collection1
[junit4:junit4]   2> 9828 T1302 oasc.ZkController.createCollectionZkNode Check for collection zkNode:collection1
[junit4:junit4]   2> 9829 T1302 oasc.ZkController.createCollectionZkNode Collection zkNode exists
[junit4:junit4]   2> 9829 T1302 oasc.ZkController.readConfigName Load collection config from:/collections/collection1
[junit4:junit4]   2> 9831 T1302 oasc.SolrResourceLoader.<init> new SolrResourceLoader for directory: '/usr/home/hudson/hudson-slave/workspace/Lucene-Solr-Tests-4.x-java7/solr/build/solr-core/test/J1/./org.apache.solr.cloud.SyncSliceTest-jetty3-1359781882613/collection1/'
[junit4:junit4]   2> 9832 T1302 oasc.SolrResourceLoader.replaceClassLoader Adding 'file:/usr/home/hudson/hudson-slave/workspace/Lucene-Solr-Tests-4.x-java7/solr/build/solr-core/test/J1/org.apache.solr.cloud.SyncSliceTest-jetty3-1359781882613/collection1/lib/classes/' to classloader
[junit4:junit4]   2> 9833 T1302 oasc.SolrResourceLoader.replaceClassLoader Adding 'file:/usr/home/hudson/hudson-slave/workspace/Lucene-Solr-Tests-4.x-java7/solr/build/solr-core/test/J1/org.apache.solr.cloud.SyncSliceTest-jetty3-1359781882613/collection1/lib/README' to classloader
[junit4:junit4]   2> 9887 T1302 oasc.SolrConfig.<init> Using Lucene MatchVersion: LUCENE_42
[junit4:junit4]   2> 9960 T1302 oasc.SolrConfig.<init> Loaded SolrConfig: solrconfig.xml
[junit4:junit4]   2> 9996 T1252 oascc.ZkStateReader.updateClusterState Updating cloud state from ZooKeeper... 
[junit4:junit4]   2> 9997 T1252 oasc.Overseer$ClusterStateUpdater.updateState Update state numShards=1 message={
[junit4:junit4]   2> 	  "operation":"state",
[junit4:junit4]   2> 	  "numShards":"1",
[junit4:junit4]   2> 	  "shard":"shard1",
[junit4:junit4]   2> 	  "roles":null,
[junit4:junit4]   2> 	  "state":"recovering",
[junit4:junit4]   2> 	  "core":"collection1",
[junit4:junit4]   2> 	  "collection":"collection1",
[junit4:junit4]   2> 	  "node_name":"127.0.0.1:52646__pzw",
[junit4:junit4]   2> 	  "base_url":"http://127.0.0.1:52646/_pzw"}
[junit4:junit4]   2> 10010 T1285 oascc.ZkStateReader$2.process A cluster state change: WatchedEvent state:SyncConnected type:NodeDataChanged path:/clusterstate.json, has occurred - updating... (live nodes size: 4)
[junit4:junit4]   2> 10010 T1251 oascc.ZkStateReader$2.process A cluster state change: WatchedEvent state:SyncConnected type:NodeDataChanged path:/clusterstate.json, has occurred - updating... (live nodes size: 4)
[junit4:junit4]   2> 10010 T1270 oascc.ZkStateReader$2.process A cluster state change: WatchedEvent state:SyncConnected type:NodeDataChanged path:/clusterstate.json, has occurred - updating... (live nodes size: 4)
[junit4:junit4]   2> 10010 T1257 oascc.ZkStateReader$2.process A cluster state change: WatchedEvent state:SyncConnected type:NodeDataChanged path:/clusterstate.json, has occurred - updating... (live nodes size: 4)
[junit4:junit4]   2> 10061 T1302 oass.IndexSchema.readSchema Reading Solr Schema
[junit4:junit4]   2> 10061 T1301 oascc.ZkStateReader$2.process A cluster state change: WatchedEvent state:SyncConnected type:NodeDataChanged path:/clusterstate.json, has occurred - updating... (live nodes size: 4)
[junit4:junit4]   2> 10068 T1302 oass.IndexSchema.readSchema Schema name=test
[junit4:junit4]   2> 10657 T1302 oass.OpenExchangeRatesOrgProvider.init Initialized with rates=open-exchange-rates.json, refreshInterval=1440.
[junit4:junit4]   2> 10667 T1302 oass.IndexSchema.readSchema default search field in schema is text
[junit4:junit4]   2> 10671 T1302 oass.IndexSchema.readSchema unique key field: id
[junit4:junit4]   2> 10684 T1302 oass.FileExchangeRateProvider.reload Reloading exchange rates from file currency.xml
[junit4:junit4]   2> 10689 T1302 oass.FileExchangeRateProvider.reload Reloading exchange rates from file currency.xml
[junit4:junit4]   2> 10708 T1302 oass.OpenExchangeRatesOrgProvider.reload Reloading exchange rates from open-exchange-rates.json
[junit4:junit4]   2> 10710 T1302 oass.OpenExchangeRatesOrgProvider.reload Reloading exchange rates from open-exchange-rates.json
[junit4:junit4]   2> 10711 T1302 oasc.SolrCore.<init> [collection1] Opening new SolrCore at /usr/home/hudson/hudson-slave/workspace/Lucene-Solr-Tests-4.x-java7/solr/build/solr-core/test/J1/./org.apache.solr.cloud.SyncSliceTest-jetty3-1359781882613/collection1/, dataDir=./org.apache.solr.cloud.SyncSliceTest-1359781873150/jetty3/
[junit4:junit4]   2> 10711 T1302 oasc.JmxMonitoredMap.<init> JMX monitoring is enabled. Adding Solr mbeans to JMX Server: com.sun.jmx.mbeanserver.JmxMBeanServer@1102e749
[junit4:junit4]   2> 10712 T1302 oasc.SolrCore.initDirectoryFactory solr.NRTCachingDirectoryFactory
[junit4:junit4]   2> 10713 T1302 oasc.CachingDirectoryFactory.get return new directory for /usr/home/hudson/hudson-slave/workspace/Lucene-Solr-Tests-4.x-java7/solr/build/solr-core/test/J1/./org.apache.solr.cloud.SyncSliceTest-1359781873150/jetty3 forceNew:false
[junit4:junit4]   2> 10713 T1302 oasc.CachingDirectoryFactory.close Releasing directory:/usr/home/hudson/hudson-slave/workspace/Lucene-Solr-Tests-4.x-java7/solr/build/solr-core/test/J1/./org.apache.solr.cloud.SyncSliceTest-1359781873150/jetty3
[junit4:junit4]   2> 10714 T1302 oasc.SolrCore.getNewIndexDir New index directory detected: old=null new=./org.apache.solr.cloud.SyncSliceTest-1359781873150/jetty3/index/
[junit4:junit4]   2> 10714 T1302 oasc.SolrCore.initIndex WARNING [collection1] Solr index directory './org.apache.solr.cloud.SyncSliceTest-1359781873150/jetty3/index' doesn't exist. Creating new index...
[junit4:junit4]   2> 10715 T1302 oasc.CachingDirectoryFactory.get return new directory for /usr/home/hudson/hudson-slave/workspace/Lucene-Solr-Tests-4.x-java7/solr/build/solr-core/test/J1/./org.apache.solr.cloud.SyncSliceTest-1359781873150/jetty3/index forceNew:false
[junit4:junit4]   2> 10721 T1302 oasc.SolrDeletionPolicy.onCommit SolrDeletionPolicy.onCommit: commits:num=1
[junit4:junit4]   2> 		commit{dir=RateLimitedDirectoryWrapper(NRTCachingDirectory(org.apache.lucene.store.NIOFSDirectory@/usr/home/hudson/hudson-slave/workspace/Lucene-Solr-Tests-4.x-java7/solr/build/solr-core/test/J1/org.apache.solr.cloud.SyncSliceTest-1359781873150/jetty3/index lockFactory=org.apache.lucene.store.NativeFSLockFactory@62c5dc6a; maxCacheMB=48.0 maxMergeSizeMB=4.0)),segFN=segments_1,generation=1,filenames=[segments_1]
[junit4:junit4]   2> 10721 T1302 oasc.SolrDeletionPolicy.updateCommits newest commit = 1[segments_1]
[junit4:junit4]   2> 10722 T1302 oasc.CachingDirectoryFactory.close Releasing directory:/usr/home/hudson/hudson-slave/workspace/Lucene-Solr-Tests-4.x-java7/solr/build/solr-core/test/J1/./org.apache.solr.cloud.SyncSliceTest-1359781873150/jetty3/index
[junit4:junit4]   2> 10723 T1302 oasc.SolrCore.initWriters created xml: solr.XMLResponseWriter
[junit4:junit4]   2> 10724 T1302 oasup.UpdateRequestProcessorChain.init inserting DistributedUpdateProcessorFactory into updateRequestProcessorChain "dedupe"
[junit4:junit4]   2> 10725 T1302 oasup.UpdateRequestProcessorChain.init inserting DistributedUpdateProcessorFactory into updateRequestProcessorChain "dedupe-allfields"
[junit4:junit4]   2> 10725 T1302 oasup.UpdateRequestProcessorChain.init inserting DistributedUpdateProcessorFactory into updateRequestProcessorChain "stored_sig"
[junit4:junit4]   2> 10725 T1302 oasup.UpdateRequestProcessorChain.init inserting DistributedUpdateProcessorFactory into updateRequestProcessorChain "uniq-fields"
[junit4:junit4]   2> 10726 T1302 oasup.UpdateRequestProcessorChain.init inserting DistributedUpdateProcessorFactory into updateRequestProcessorChain "distrib-dup-test-chain-implicit"
[junit4:junit4]   2> 10726 T1302 oasc.RequestHandlers.initHandlersFromConfig adding lazy requestHandler: solr.ReplicationHandler
[junit4:junit4]   2> 10727 T1302 oasc.RequestHandlers.initHandlersFromConfig created /replication: solr.ReplicationHandler
[junit4:junit4]   2> 10727 T1302 oasc.RequestHandlers.initHandlersFromConfig created standard: solr.StandardRequestHandler
[junit4:junit4]   2> 10728 T1302 oasc.RequestHandlers.initHandlersFromConfig created /get: solr.RealTimeGetHandler
[junit4:junit4]   2> 10728 T1302 oasc.RequestHandlers.initHandlersFromConfig created dismax: solr.SearchHandler
[junit4:junit4]   2> 10729 T1302 oasc.RequestHandlers.initHandlersFromConfig created mock: org.apache.solr.core.MockQuerySenderListenerReqHandler
[junit4:junit4]   2> 10729 T1302 oasc.RequestHandlers.initHandlersFromConfig created /admin/: org.apache.solr.handler.admin.AdminHandlers
[junit4:junit4]   2> 10730 T1302 oasc.RequestHandlers.initHandlersFromConfig created defaults: solr.StandardRequestHandler
[junit4:junit4]   2> 10730 T1302 oasc.RequestHandlers.initHandlersFromConfig adding lazy requestHandler: solr.StandardRequestHandler
[junit4:junit4]   2> 10730 T1302 oasc.RequestHandlers.initHandlersFromConfig created lazy: solr.StandardRequestHandler
[junit4:junit4]   2> 10731 T1302 oasc.RequestHandlers.initHandlersFromConfig created /update: solr.UpdateRequestHandler
[junit4:junit4]   2> 10731 T1302 oasc.RequestHandlers.initHandlersFromConfig created /terms: org.apache.solr.handler.component.SearchHandler
[junit4:junit4]   2> 10732 T1302 oasc.RequestHandlers.initHandlersFromConfig created spellCheckCompRH: org.apache.solr.handler.component.SearchHandler
[junit4:junit4]   2> 10732 T1302 oasc.RequestHandlers.initHandlersFromConfig created spellCheckCompRH_Direct: org.apache.solr.handler.component.SearchHandler
[junit4:junit4]   2> 10733 T1302 oasc.RequestHandlers.initHandlersFromConfig created spellCheckWithWordbreak: org.apache.solr.handler.component.SearchHandler
[junit4:junit4]   2> 10733 T1302 oasc.RequestHandlers.initHandlersFromConfig created spellCheckWithWordbreak_Direct: org.apache.solr.handler.component.SearchHandler
[junit4:junit4]   2> 10734 T1302 oasc.RequestHandlers.initHandlersFromConfig created spellCheckCompRH1: org.apache.solr.handler.component.SearchHandler
[junit4:junit4]   2> 10734 T1302 oasc.RequestHandlers.initHandlersFromConfig created mltrh: org.apache.solr.handler.component.SearchHandler
[junit4:junit4]   2> 10735 T1302 oasc.RequestHandlers.initHandlersFromConfig created tvrh: org.apache.solr.handler.component.SearchHandler
[junit4:junit4]   2> 10735 T1302 oasc.RequestHandlers.initHandlersFromConfig created /mlt: solr.MoreLikeThisHandler
[junit4:junit4]   2> 10736 T1302 oasc.RequestHandlers.initHandlersFromConfig created /debug/dump: solr.DumpRequestHandler
[junit4:junit4]   2> 10748 T1302 oashl.XMLLoader.init xsltCacheLifetimeSeconds=60
[junit4:junit4]   2> 10752 T1302 oasc.SolrCore.initDeprecatedSupport WARNING solrconfig.xml uses deprecated <admin/gettableFiles>, Please update your config to use the ShowFileRequestHandler.
[junit4:junit4]   2> 10753 T1302 oasc.SolrCore.initDeprecatedSupport WARNING adding ShowFileRequestHandler with hidden files: [SCHEMA.XML, OLD_SYNONYMS.TXT, STOPWORDS.TXT, PROTWORDS.TXT, OPEN-EXCHANGE-RATES.JSON, SYNONYMS.TXT, CURRENCY.XML, MAPPING-ISOLATIN1ACCENT.TXT]
[junit4:junit4]   2> 10756 T1302 oasc.CachingDirectoryFactory.close Releasing directory:/usr/home/hudson/hudson-slave/workspace/Lucene-Solr-Tests-4.x-java7/solr/build/solr-core/test/J1/./org.apache.solr.cloud.SyncSliceTest-1359781873150/jetty3
[junit4:junit4]   2> 10757 T1302 oass.SolrIndexSearcher.<init> Opening Searcher@316bf3a2 main
[junit4:junit4]   2> 10758 T1302 oasu.CommitTracker.<init> Hard AutoCommit: disabled
[junit4:junit4]   2> 10759 T1302 oasu.CommitTracker.<init> Soft AutoCommit: disabled
[junit4:junit4]   2> 10759 T1302 oashc.SpellCheckComponent.inform Initializing spell checkers
[junit4:junit4]   2> 10777 T1302 oass.DirectSolrSpellChecker.init init: {name=direct,classname=DirectSolrSpellChecker,field=lowerfilt,minQueryLength=3}
[junit4:junit4]   2> 10831 T1303 oasc.SolrCore.registerSearcher [collection1] Registered new searcher Searcher@316bf3a2 main{StandardDirectoryReader(segments_1:1)}
[junit4:junit4]   2> 10835 T1302 oasc.ZkController.publish publishing core=collection1 state=down
[junit4:junit4]   2> 10836 T1302 oasc.ZkController.publish numShards not found on descriptor - reading it from system property
[junit4:junit4]   2> 11515 T1252 oascc.ZkStateReader.updateClusterState Updating cloud state from ZooKeeper... 
[junit4:junit4]   2> 11516 T1252 oasc.Overseer$ClusterStateUpdater.updateState Update state numShards=1 message={
[junit4:junit4]   2> 	  "operation":"state",
[junit4:junit4]   2> 	  "numShards":"1",
[junit4:junit4]   2> 	  "shard":null,
[junit4:junit4]   2> 	  "roles":null,
[junit4:junit4]   2> 	  "state":"down",
[junit4:junit4]   2> 	  "core":"collection1",
[junit4:junit4]   2> 	  "collection":"collection1",
[junit4:junit4]   2> 	  "node_name":"127.0.0.1:52650__pzw",
[junit4:junit4]   2> 	  "base_url":"http://127.0.0.1:52650/_pzw"}
[junit4:junit4]   2> 11516 T1252 oasc.Overseer$ClusterStateUpdater.updateState Collection already exists with numShards=1
[junit4:junit4]   2> 11517 T1252 oasc.Overseer$ClusterStateUpdater.updateState Assigning new node to shard shard=shard1
[junit4:junit4]   2> 11530 T1257 oascc.ZkStateReader$2.process A cluster state change: WatchedEvent state:SyncConnected type:NodeDataChanged path:/clusterstate.json, has occurred - updating... (live nodes size: 4)
[junit4:junit4]   2> 11530 T1285 oascc.ZkStateReader$2.process A cluster state change: WatchedEvent state:SyncConnected type:NodeDataChanged path:/clusterstate.json, has occurred - updating... (live nodes size: 4)
[junit4:junit4]   2> 11530 T1270 oascc.ZkStateReader$2.process A cluster state change: WatchedEvent state:SyncConnected type:NodeDataChanged path:/clusterstate.json, has occurred - updating... (live nodes size: 4)
[junit4:junit4]   2> 11530 T1301 oascc.ZkStateReader$2.process A cluster state change: WatchedEvent state:SyncConnected type:NodeDataChanged path:/clusterstate.json, has occurred - updating... (live nodes size: 4)
[junit4:junit4]   2> 11530 T1251 oascc.ZkStateReader$2.process A cluster state change: WatchedEvent state:SyncConnected type:NodeDataChanged path:/clusterstate.json, has occurred - updating... (live nodes size: 4)
[junit4:junit4]   2> 11838 T1302 oasc.CoreContainer.registerCore registering core: collection1
[junit4:junit4]   2> 11838 T1302 oasc.ZkController.register Register replica - core:collection1 address:http://127.0.0.1:52650/_pzw collection:collection1 shard:shard1
[junit4:junit4]   2> 11842 T1302 oasc.ZkController.register We are http://127.0.0.1:52650/_pzw/collection1/ and leader is http://127.0.0.1:52642/_pzw/collection1/
[junit4:junit4]   2> 11842 T1302 oasc.ZkController.register No LogReplay needed for core=collection1 baseURL=http://127.0.0.1:52650/_pzw
[junit4:junit4]   2> 11842 T1302 oasc.ZkController.checkRecovery Core needs to recover:collection1
[junit4:junit4]   2> 11842 T1302 oasu.DefaultSolrCoreState.doRecovery Running recovery - first canceling any ongoing recovery
[junit4:junit4]   2> ASYNC  NEW_CORE C122 name=collection1 org.apache.solr.core.SolrCore@601b1aca url=http://127.0.0.1:52650/_pzw/collection1 node=127.0.0.1:52650__pzw C122_STATE=coll:collection1 core:collection1 props:{shard=null, roles=null, state=down, core=collection1, collection=collection1, node_name=127.0.0.1:52650__pzw, base_url=http://127.0.0.1:52650/_pzw}
[junit4:junit4]   2> 11843 T1304 C122 P52650 oasc.RecoveryStrategy.run Starting recovery process.  core=collection1 recoveringAfterStartup=true
[junit4:junit4]   2> 11843 T1302 oascc.ZkStateReader.updateClusterState Updating cloud state from ZooKeeper... 
[junit4:junit4]   2> 11843 T1304 C122 P52650 oasc.RecoveryStrategy.doRecovery ###### startupVersions=[]
[junit4:junit4]   2> 11844 T1304 C122 P52650 oasc.ZkController.publish publishing core=collection1 state=recovering
[junit4:junit4]   2> 11844 T1304 C122 P52650 oasc.ZkController.publish numShards not found on descriptor - reading it from system property
[junit4:junit4]   2> 11844 T1229 oass.SolrDispatchFilter.init user.dir=/usr/home/hudson/hudson-slave/workspace/Lucene-Solr-Tests-4.x-java7/solr/build/solr-core/test/J1
[junit4:junit4]   2> 11845 T1229 oass.SolrDispatchFilter.init SolrDispatchFilter.init() done
[junit4:junit4]   2> 11846 T1304 C122 P52650 oascsi.HttpClientUtil.createClient Creating new http client, config:maxConnections=128&maxConnectionsPerHost=32&followRedirects=false
[junit4:junit4]   2> 11846 T1229 oascsi.HttpClientUtil.createClient Creating new http client, config:maxConnections=128&maxConnectionsPerHost=32&followRedirects=false
[junit4:junit4]   2> 12061 T1229 oejs.Server.doStart jetty-8.1.8.v20121106
[junit4:junit4]   2> 12065 T1229 oejs.AbstractConnector.doStart Started SocketConnector@127.0.0.1:52657
[junit4:junit4]   2> 12065 T1229 oass.SolrDispatchFilter.init SolrDispatchFilter.init()
[junit4:junit4]   2> 12066 T1229 oasc.SolrResourceLoader.locateSolrHome JNDI not configured for solr (NoInitialContextEx)
[junit4:junit4]   2> 12066 T1229 oasc.SolrResourceLoader.locateSolrHome using system property solr.solr.home: /usr/home/hudson/hudson-slave/workspace/Lucene-Solr-Tests-4.x-java7/solr/build/solr-core/test/J1/./org.apache.solr.cloud.SyncSliceTest-jetty4-1359781885010
[junit4:junit4]   2> 12067 T1229 oasc.CoreContainer$Initializer.initialize looking for solr.xml: /usr/home/hudson/hudson-slave/workspace/Lucene-Solr-Tests-4.x-java7/solr/build/solr-core/test/J1/./org.apache.solr.cloud.SyncSliceTest-jetty4-1359781885010/solr.xml
[junit4:junit4]   2> 12067 T1229 oasc.CoreContainer.<init> New CoreContainer 1871881484
[junit4:junit4]   2> 12068 T1229 oasc.CoreContainer.load Loading CoreContainer using Solr Home: '/usr/home/hudson/hudson-slave/workspace/Lucene-Solr-Tests-4.x-java7/solr/build/solr-core/test/J1/./org.apache.solr.cloud.SyncSliceTest-jetty4-1359781885010/'
[junit4:junit4]   2> 12069 T1229 oasc.SolrResourceLoader.<init> new SolrResourceLoader for directory: '/usr/home/hudson/hudson-slave/workspace/Lucene-Solr-Tests-4.x-java7/solr/build/solr-core/test/J1/./org.apache.solr.cloud.SyncSliceTest-jetty4-1359781885010/'
[junit4:junit4]   2> 12133 T1229 oashc.HttpShardHandlerFactory.getParameter Setting socketTimeout to: 60000
[junit4:junit4]   2> 12134 T1229 oashc.HttpShardHandlerFactory.getParameter Setting urlScheme to: http://
[junit4:junit4]   2> 12135 T1229 oashc.HttpShardHandlerFactory.getParameter Setting connTimeout to: 15000
[junit4:junit4]   2> 12135 T1229 oashc.HttpShardHandlerFactory.getParameter Setting maxConnectionsPerHost to: 20
[junit4:junit4]   2> 12136 T1229 oashc.HttpShardHandlerFactory.getParameter Setting corePoolSize to: 0
[junit4:junit4]   2> 12136 T1229 oashc.HttpShardHandlerFactory.getParameter Setting maximumPoolSize to: 2147483647
[junit4:junit4]   2> 12137 T1229 oashc.HttpShardHandlerFactory.getParameter Setting maxThreadIdleTime to: 5
[junit4:junit4]   2> 12137 T1229 oashc.HttpShardHandlerFactory.getParameter Setting sizeOfQueue to: -1
[junit4:junit4]   2> 12138 T1229 oashc.HttpShardHandlerFactory.getParameter Setting fairnessPolicy to: false
[junit4:junit4]   2> 12138 T1229 oascsi.HttpClientUtil.createClient Creating new http client, config:maxConnectionsPerHost=20&maxConnections=10000&socketTimeout=60000&connTimeout=15000&retry=false
[junit4:junit4]   2> 12159 T1229 oasc.CoreContainer.load Registering Log Listener
[junit4:junit4]   2> 12181 T1229 oasc.CoreContainer.initZooKeeper Zookeeper client=127.0.0.1:25600/solr
[junit4:junit4]   2> 12182 T1229 oasc.ZkController.checkChrootPath zkHost includes chroot
[junit4:junit4]   2> 12182 T1229 oaz.ZooKeeper.<init> Initiating client connection, connectString=127.0.0.1:25600 sessionTimeout=60000 watcher=org.apache.solr.common.cloud.ConnectionManager@1d50e338
[junit4:junit4]   2> 12183 T1229 oascc.ConnectionManager.waitForConnected Waiting for client to connect to ZooKeeper
[junit4:junit4]   2> 12184 T1314 oaz.ClientCnxn$SendThread.logStartConnect Opening socket connection to server localhost/127.0.0.1:25600. Will not attempt to authenticate using SASL (access denied ("javax.security.auth.AuthPermission" "getLoginConfiguration"))
[junit4:junit4]   2> 12185 T1314 oaz.ClientCnxn$SendThread.primeConnection Socket connection established to localhost/127.0.0.1:25600, initiating session
[junit4:junit4]   2> 12186 T1231 oazs.NIOServerCnxnFactory.run Accepted socket connection from /140.211.11.196:52658
[junit4:junit4]   2> 12186 T1231 oazs.ZooKeeperServer.processConnectRequest Client attempting to establish new session at /140.211.11.196:52658
[junit4:junit4]   2> 12188 T1233 oazs.ZooKeeperServer.finishSessionInit Established session 0x13c9950c607000b with negotiated timeout 20000 for client /140.211.11.196:52658
[junit4:junit4]   2> 12188 T1314 oaz.ClientCnxn$SendThread.onConnected Session establishment complete on server localhost/127.0.0.1:25600, sessionid = 0x13c9950c607000b, negotiated timeout = 20000
[junit4:junit4]   2> 12189 T1315 oascc.ConnectionManager.process Watcher org.apache.solr.common.cloud.ConnectionManager@1d50e338 name:ZooKeeperConnection Watcher:127.0.0.1:25600 got event WatchedEvent state:SyncConnected type:None path:null path:null type:None
[junit4:junit4]   2> 12189 T1229 oascc.ConnectionManager.waitForConnected Client is connected to ZooKeeper
[junit4:junit4]   2> 12190 T1234 oazs.PrepRequestProcessor.pRequest2Txn Processed session termination for sessionid: 0x13c9950c607000b
[junit4:junit4]   2> 12201 T1315 oaz.ClientCnxn$EventThread.run EventThread shut down
[junit4:junit4]   2> 12201 T1231 oazs.NIOServerCnxn.closeSock Closed socket connection for client /140.211.11.196:52658 which had sessionid 0x13c9950c607000b
[junit4:junit4]   2> 12201 T1229 oaz.ZooKeeper.close Session: 0x13c9950c607000b closed
[junit4:junit4]   2> 12201 T1229 oascsi.HttpClientUtil.createClient Creating new http client, config:maxConnections=500&maxConnectionsPerHost=16&socketTimeout=60000&connTimeout=15000
[junit4:junit4]   2> 12211 T1229 oaz.ZooKeeper.<init> Initiating client connection, connectString=127.0.0.1:25600/solr sessionTimeout=30000 watcher=org.apache.solr.common.cloud.ConnectionManager@3f76baee
[junit4:junit4]   2> 12212 T1229 oascc.ConnectionManager.waitForConnected Waiting for client to connect to ZooKeeper
[junit4:junit4]   2> 12212 T1316 oaz.ClientCnxn$SendThread.logStartConnect Opening socket connection to server localhost/127.0.0.1:25600. Will not attempt to authenticate using SASL (access denied ("javax.security.auth.AuthPermission" "getLoginConfiguration"))
[junit4:junit4]   2> 12213 T1316 oaz.ClientCnxn$SendThread.primeConnection Socket connection established to localhost/127.0.0.1:25600, initiating session
[junit4:junit4]   2> 12213 T1231 oazs.NIOServerCnxnFactory.run Accepted socket connection from /140.211.11.196:52659
[junit4:junit4]   2> 12214 T1231 oazs.ZooKeeperServer.processConnectRequest Client attempting to establish new session at /140.211.11.196:52659
[junit4:junit4]   2> 12215 T1233 oazs.ZooKeeperServer.finishSessionInit Established session 0x13c9950c607000c with negotiated timeout 20000 for client /140.211.11.196:52659
[junit4:junit4]   2> 12215 T1316 oaz.ClientCnxn$SendThread.onConnected Session establishment complete on server localhost/127.0.0.1:25600, sessionid = 0x13c9950c607000c, negotiated timeout = 20000
[junit4:junit4]   2> 12215 T1317 oascc.ConnectionManager.process Watcher org.apache.solr.common.cloud.ConnectionManager@3f76baee name:ZooKeeperConnection Watcher:127.0.0.1:25600/solr got event WatchedEvent state:SyncConnected type:None path:null path:null type:None
[junit4:junit4]   2> 12216 T1229 oascc.ConnectionManager.waitForConnected Client is connected to ZooKeeper
[junit4:junit4]   2> 12217 T1234 oazs.PrepRequestProcessor.pRequest Got user-level KeeperException when processing sessionid:0x13c9950c607000c type:create cxid:0x1 zxid:0x91 txntype:-1 reqpath:n/a Error Path:/solr/overseer Error:KeeperErrorCode = NodeExists for /solr/overseer
[junit4:junit4]   2> 12218 T1234 oazs.PrepRequestProcessor.pRequest Got user-level KeeperException when processing sessionid:0x13c9950c607000c type:create cxid:0x2 zxid:0x92 txntype:-1 reqpath:n/a Error Path:/solr/overseer Error:KeeperErrorCode = NodeExists for /solr/overseer
[junit4:junit4]   2> 12227 T1229 oasc.ZkController.createEphemeralLiveNode Register node as live in ZooKeeper:/live_nodes/127.0.0.1:52657__pzw
[junit4:junit4]   2> 12228 T1234 oazs.PrepRequestProcessor.pRequest Got user-level KeeperException when processing sessionid:0x13c9950c607000c type:delete cxid:0x4 zxid:0x93 txntype:-1 reqpath:n/a Error Path:/solr/live_nodes/127.0.0.1:52657__pzw Error:KeeperErrorCode = NoNode for /solr/live_nodes/127.0.0.1:52657__pzw
[junit4:junit4]   2> 12229 T1229 oascc.SolrZkClient.makePath makePath: /live_nodes/127.0.0.1:52657__pzw
[junit4:junit4]   2> 12232 T1257 oascc.ZkStateReader$3.process Updating live nodes... (5)
[junit4:junit4]   2> 12232 T1270 oascc.ZkStateReader$3.process Updating live nodes... (5)
[junit4:junit4]   2> 12232 T1285 oascc.ZkStateReader$3.process Updating live nodes... (5)
[junit4:junit4]   2> 12232 T1257 oascc.ZkStateReader$2.process A cluster state change: WatchedEvent state:SyncConnected type:NodeChildrenChanged path:/live_nodes, has occurred - updating... (live nodes size: 5)
[junit4:junit4]   2> 12232 T1251 oascc.ZkStateReader$3.process Updating live nodes... (5)
[junit4:junit4]   2> 12232 T1285 oascc.ZkStateReader$2.process A cluster state change: WatchedEvent state:SyncConnected type:NodeChildrenChanged path:/live_nodes, has occurred - updating... (live nodes size: 5)
[junit4:junit4]   2> 12232 T1301 oascc.ZkStateReader$3.process Updating live nodes... (5)
[junit4:junit4]   2> 12232 T1251 oascc.ZkStateReader$2.process A cluster state change: WatchedEvent state:SyncConnected type:NodeChildrenChanged path:/live_nodes, has occurred - updating... (live nodes size: 5)
[junit4:junit4]   2> 12233 T1301 oascc.ZkStateReader$2.process A cluster state change: WatchedEvent state:SyncConnected type:NodeChildrenChanged path:/live_nodes, has occurred - updating... (live nodes size: 5)
[junit4:junit4]   2> 12232 T1270 oascc.ZkStateReader$2.process A cluster state change: WatchedEvent state:SyncConnected type:NodeChildrenChanged path:/live_nodes, has occurred - updating... (live nodes size: 5)
[junit4:junit4]   2> 12236 T1229 oascc.ZkStateReader.createClusterStateWatchersAndUpdate Updating cluster state from ZooKeeper... 
[junit4:junit4]   2> 12244 T1318 oasc.CoreContainer.create Creating SolrCore 'collection1' using instanceDir: /usr/home/hudson/hudson-slave/workspace/Lucene-Solr-Tests-4.x-java7/solr/build/solr-core/test/J1/./org.apache.solr.cloud.SyncSliceTest-jetty4-1359781885010/collection1
[junit4:junit4]   2> 12244 T1318 oasc.ZkController.createCollectionZkNode Check for collection zkNode:collection1
[junit4:junit4]   2> 12245 T1318 oasc.ZkController.createCollectionZkNode Collection zkNode exists
[junit4:junit4]   2> 12245 T1318 oasc.ZkController.readConfigName Load collection config from:/collections/collection1
[junit4:junit4]   2> 12246 T1318 oasc.SolrResourceLoader.<init> new SolrResourceLoader for directory: '/usr/home/hudson/hudson-slave/workspace/Lucene-Solr-Tests-4.x-java7/solr/build/solr-core/test/J1/./org.apache.solr.cloud.SyncSliceTest-jetty4-1359781885010/collection1/'
[junit4:junit4]   2> 12247 T1318 oasc.SolrResourceLoader.replaceClassLoader Adding 'file:/usr/home/hudson/hudson-slave/workspace/Lucene-Solr-Tests-4.x-java7/solr/build/solr-core/test/J1/org.apache.solr.cloud.SyncSliceTest-jetty4-1359781885010/collection1/lib/README' to classloader
[junit4:junit4]   2> 12248 T1318 oasc.SolrResourceLoader.replaceClassLoader Adding 'file:/usr/home/hudson/hudson-slave/workspace/Lucene-Solr-Tests-4.x-java7/solr/build/solr-core/test/J1/org.apache.solr.cloud.SyncSliceTest-jetty4-1359781885010/collection1/lib/classes/' to classloader
[junit4:junit4]   2> 12294 T1318 oasc.SolrConfig.<init> Using Lucene MatchVersion: LUCENE_42
[junit4:junit4]   2> 12343 T1318 oasc.SolrConfig.<init> Loaded SolrConfig: solrconfig.xml
[junit4:junit4]   2> 12444 T1318 oass.IndexSchema.readSchema Reading Solr Schema
[junit4:junit4]   2> 12449 T1318 oass.IndexSchema.readSchema Schema name=test
[junit4:junit4]   2>  C121_STATE=coll:collection1 core:collection1 props:{shard=shard1, roles=null, state=recovering, core=collection1, collection=collection1, node_name=127.0.0.1:52646__pzw, base_url=http://127.0.0.1:52646/_pzw}
[junit4:junit4]   2> 12467 T1288 C121 P52646 oasc.RecoveryStrategy.doRecovery Attempting to PeerSync from http://127.0.0.1:52642/_pzw/collection1/ core=collection1 - recoveringAfterStartup=true
[junit4:junit4]   2> 12467 T1288 C121 P52646 oasu.PeerSync.sync PeerSync: core=collection1 url=http://127.0.0.1:52646/_pzw START replicas=[http://127.0.0.1:52642/_pzw/collection1/] nUpdates=100
[junit4:junit4]   2> 12468 T1288 C121 P52646 oasu.PeerSync.sync WARNING no frame of reference to tell of we've missed updates
[junit4:junit4]   2> 12469 T1288 C121 P52646 oasc.RecoveryStrategy.doRecovery PeerSync Recovery was not successful - trying replication. core=collection1
[junit4:junit4]   2> 12469 T1288 C121 P52646 oasc.RecoveryStrategy.doRecovery Starting Replication Recovery. core=collection1
[junit4:junit4]   2> 12469 T1288 C121 P52646 oasc.RecoveryStrategy.doRecovery Begin buffering updates. core=collection1
[junit4:junit4]   2> 12469 T1288 C121 P52646 oasu.UpdateLog.bufferUpdates Starting to buffer updates. FSUpdateLog{state=ACTIVE, tlog=null}
[junit4:junit4]   2> 12469 T1288 C121 P52646 oasc.RecoveryStrategy.replicate Attempting to replicate from http://127.0.0.1:52642/_pzw/collection1/. core=collection1
[junit4:junit4]   2> 12470 T1288 C121 P52646 oascsi.HttpClientUtil.createClient Creating new http client, config:maxConnections=128&maxConnectionsPerHost=32&followRedirects=false
[junit4:junit4]   2> ASYNC  NEW_CORE C123 name=collection1 org.apache.solr.core.SolrCore@4f3eaa3 url=http://127.0.0.1:52642/_pzw/collection1 node=127.0.0.1:52642__pzw C123_STATE=coll:collection1 core:collection1 props:{shard=shard1, roles=null, state=active, core=collection1, collection=collection1, node_name=127.0.0.1:52642__pzw, base_url=http://127.0.0.1:52642/_pzw, leader=true}
[junit4:junit4]   2> 12476 T1262 C123 P52642 REQ /get {getVersions=100&distrib=false&wt=javabin&qt=/get&version=2} status=0 QTime=1 
[junit4:junit4]   2> 12477 T1263 C123 P52642 oasu.DirectUpdateHandler2.commit start commit{,optimize=false,openSearcher=false,waitSearcher=true,expungeDeletes=false,softCommit=false}
[junit4:junit4]   2> 12479 T1263 C123 P52642 oasc.CachingDirectoryFactory.close Releasing directory:/usr/home/hudson/hudson-slave/workspace/Lucene-Solr-Tests-4.x-java7/solr/build/solr-core/test/J1/./org.apache.solr.cloud.SyncSliceTest-1359781873150/jetty1
[junit4:junit4]   2> 12482 T1263 C123 P52642 oasc.SolrDeletionPolicy.onInit SolrDeletionPolicy.onInit: commits:num=1
[junit4:junit4]   2> 		commit{dir=RateLimitedDirectoryWrapper(NRTCachingDirectory(org.apache.lucene.store.NIOFSDirectory@/usr/home/hudson/hudson-slave/workspace/Lucene-Solr-Tests-4.x-java7/solr/build/solr-core/test/J1/org.apache.solr.cloud.SyncSliceTest-1359781873150/jetty1/index lockFactory=org.apache.lucene.store.NativeFSLockFactory@266e4724; maxCacheMB=48.0 maxMergeSizeMB=4.0)),segFN=segments_1,generation=1,filenames=[segments_1]
[junit4:junit4]   2> 12482 T1263 C123 P52642 oasc.SolrDeletionPolicy.updateCommits newest commit = 1[segments_1]
[junit4:junit4]   2> 12486 T1263 C123 P52642 oasc.SolrDeletionPolicy.onCommit SolrDeletionPolicy.onCommit: commits:num=2
[junit4:junit4]   2> 		commit{dir=RateLimitedDirectoryWrapper(NRTCachingDirectory(org.apache.lucene.store.NIOFSDirectory@/usr/home/hudson/hudson-slave/workspace/Lucene-Solr-Tests-4.x-java7/solr/build/solr-core/test/J1/org.apache.solr.cloud.SyncSliceTest-1359781873150/jetty1/index lockFactory=org.apache.lucene.store.NativeFSLockFactory@266e4724; maxCacheMB=48.0 maxMergeSizeMB=4.0)),segFN=segments_1,generation=1,filenames=[segments_1]
[junit4:junit4]   2> 		commit{dir=RateLimitedDirectoryWrapper(NRTCachingDirectory(org.apache.lucene.store.NIOFSDirectory@/usr/home/hudson/hudson-slave/workspace/Lucene-Solr-Tests-4.x-java7/solr/build/solr-core/test/J1/org.apache.solr.cloud.SyncSliceTest-1359781873150/jetty1/index lockFactory=org.apache.lucene.store.NativeFSLockFactory@266e4724; maxCacheMB=48.0 maxMergeSizeMB=4.0)),segFN=segments_2,generation=2,filenames=[segments_2]
[junit4:junit4]   2> 12486 T1263 C123 P52642 oasc.SolrDeletionPolicy.updateCommits newest commit = 2[segments_2]
[junit4:junit4]   2> 12487 T1263 C123 P52642 oasc.CachingDirectoryFactory.close Releasing directory:/usr/home/hudson/hudson-slave/workspace/Lucene-Solr-Tests-4.x-java7/solr/build/solr-core/test/J1/./org.apache.solr.cloud.SyncSliceTest-1359781873150/jetty1
[junit4:junit4]   2> 12488 T1263 C123 P52642 oass.SolrIndexSearcher.<init> Opening Searcher@3d93a7a8 realtime
[junit4:junit4]   2> 12488 T1263 C123 P52642 oasu.DirectUpdateHandler2.commit end_commit_flush
[junit4:junit4]   2> 12488 T1263 C123 P52642 /update {waitSearcher=true&openSearcher=false&commit=true&wt=javabin&commit_end_point=true&version=2&softCommit=false} {commit=} 0 11
[junit4:junit4]   2> 12489 T1288 C121 P52646 oash.ReplicationHandler.inform Commits will be reserved for  10000
[junit4:junit4]   2> 12489 T1288 C121 P52646 oash.SnapPuller.<init>  No value set for 'pollInterval'. Timer Task not started.
[junit4:junit4]   2> 12492 T1264 C123 P52642 oash.ReplicationHandler.inform Commits will be reserved for  10000
[junit4:junit4]   2> 12492 T1264 C123 P52642 REQ /replication {command=indexversion&qt=/replication&wt=javabin&version=2} status=0 QTime=2 
[junit4:junit4]   2> 12492 T1288 C121 P52646 oash.SnapPuller.fetchLatestIndex Master's generation: 2
[junit4:junit4]   2> 12493 T1288 C121 P52646 oash.SnapPuller.fetchLatestIndex Slave's generation: 1
[junit4:junit4]   2> 12493 T1288 C121 P52646 oash.SnapPuller.fetchLatestIndex Starting replication process
[junit4:junit4]   2> 12495 T1264 C123 P52642 oasc.CachingDirectoryFactory.close Releasing directory:/usr/home/hudson/hudson-slave/workspace/Lucene-Solr-Tests-4.x-java7/solr/build/solr-core/test/J1/./org.apache.solr.cloud.SyncSliceTest-1359781873150/jetty1
[junit4:junit4]   2> 12496 T1264 C123 P52642 oasc.CachingDirectoryFactory.close Releasing directory:/usr/home/hudson/hudson-slave/workspace/Lucene-Solr-Tests-4.x-java7/solr/build/solr-core/test/J1/./org.apache.solr.cloud.SyncSliceTest-1359781873150/jetty1/index
[junit4:junit4]   2> 12496 T1264 C123 P52642 REQ /replication {command=filelist&qt=/replication&wt=javabin&generation=2&version=2} status=0 QTime=1 
[junit4:junit4]   2> 12497 T1288 C121 P52646 oash.SnapPuller.fetchLatestIndex Number of files in latest index in master: 1
[junit4:junit4]   2> 12498 T1288 C121 P52646 oasc.CachingDirectoryFactory.get return new directory for /usr/home/hudson/hudson-slave/workspace/Lucene-Solr-Tests-4.x-java7/solr/build/solr-core/test/J1/./org.apache.solr.cloud.SyncSliceTest-1359781873150/jetty2/index.20130202135625640 forceNew:false
[junit4:junit4]   2> 12499 T1288 C121 P52646 oasc.CachingDirectoryFactory.close Releasing directory:/usr/home/hudson/hudson-slave/workspace/Lucene-Solr-Tests-4.x-java7/solr/build/solr-core/test/J1/./org.apache.solr.cloud.SyncSliceTest-1359781873150/jetty2
[junit4:junit4]   2> 12500 T1288 C121 P52646 oash.SnapPuller.fetchLatestIndex Starting download to RateLimitedDirectoryWrapper(NRTCachingDirectory(org.apache.lucene.store.NIOFSDirectory@/usr/home/hudson/hudson-slave/workspace/Lucene-Solr-Tests-4.x-java7/solr/build/solr-core/test/J1/org.apache.solr.cloud.SyncSliceTest-1359781873150/jetty2/index.20130202135625640 lockFactory=org.apache.lucene.store.NativeFSLockFactory@39748bf1; maxCacheMB=48.0 maxMergeSizeMB=4.0)) fullCopy=true
[junit4:junit4]   2> 12504 T1264 C123 P52642 REQ /replication {file=segments_2&command=filecontent&checksum=true&wt=filestream&qt=/replication&generation=2} status=0 QTime=0 
[junit4:junit4]   2> 12506 T1288 C121 P52646 oasc.CachingDirectoryFactory.close Releasing directory:/usr/home/hudson/hudson-slave/workspace/Lucene-Solr-Tests-4.x-java7/solr/build/solr-core/test/J1/./org.apache.solr.cloud.SyncSliceTest-1359781873150/jetty2/index
[junit4:junit4]   2> 12506 T1288 C121 P52646 oash.SnapPuller.fetchLatestIndex Total time taken for download : 0 secs
[junit4:junit4]   2> 12507 T1288 C121 P52646 oash.SnapPuller.modifyIndexProps New index installed. Updating index properties... index=index.20130202135625640
[junit4:junit4]   2> 12508 T1288 C121 P52646 oasc.CachingDirectoryFactory.close Releasing directory:/usr/home/hudson/hudson-slave/workspace/Lucene-Solr-Tests-4.x-java7/solr/build/solr-core/test/J1/./org.apache.solr.cloud.SyncSliceTest-1359781873150/jetty2
[junit4:junit4]   2> 12508 T1288 C121 P52646 oasc.CachingDirectoryFactory.close Releasing directory:/usr/home/hudson/hudson-slave/workspace/Lucene-Solr-Tests-4.x-java7/solr/build/solr-core/test/J1/./org.apache.solr.cloud.SyncSliceTest-1359781873150/jetty2
[junit4:junit4]   2> 12508 T1288 C121 P52646 oasc.SolrCore.getNewIndexDir New index directory detected: old=./org.apache.solr.cloud.SyncSliceTest-1359781873150/jetty2/index/ new=./org.apache.solr.cloud.SyncSliceTest-1359781873150/jetty2/index.20130202135625640
[junit4:junit4]   2> 12511 T1288 C121 P52646 oasc.SolrDeletionPolicy.onInit SolrDeletionPolicy.onInit: commits:num=1
[junit4:junit4]   2> 		commit{dir=RateLimitedDirectoryWrapper(NRTCachingDirectory(org.apache.lucene.store.NIOFSDirectory@/usr/home/hudson/hudson-slave/workspace/Lucene-Solr-Tests-4.x-java7/solr/build/solr-core/test/J1/org.apache.solr.cloud.SyncSliceTest-1359781873150/jetty2/index.20130202135625640 lockFactory=org.apache.lucene.store.NativeFSLockFactory@39748bf1; maxCacheMB=48.0 maxMergeSizeMB=4.0)),segFN=segments_2,generation=2,filenames=[segments_2]
[junit4:junit4]   2> 12511 T1288 C121 P52646 oasc.SolrDeletionPolicy.updateCommits newest commit = 2[segments_2]
[junit4:junit4]   2> 12512 T1288 C121 P52646 oasc.CachingDirectoryFactory.close Releasing directory:/usr/home/hudson/hudson-slave/workspace/Lucene-Solr-Tests-4.x-java7/solr/build/solr-core/test/J1/./org.apache.solr.cloud.SyncSliceTest-1359781873150/jetty2
[junit4:junit4]   2> 12513 T1288 C121 P52646 oasu.DefaultSolrCoreState.newIndexWriter Creating new IndexWriter...
[junit4:junit4]   2> 12513 T1288 C121 P52646 oasu.DefaultSolrCoreState.newIndexWriter Waiting until IndexWriter is unused... core=collection1
[junit4:junit4]   2> 12513 T1288 C121 P52646 oasu.DefaultSolrCoreState.newIndexWriter Rollback old IndexWriter... core=collection1
[junit4:junit4]   2> 12513 T1288 C121 P52646 oasc.CachingDirectoryFactory.close Releasing directory:/usr/home/hudson/hudson-slave/workspace/Lucene-Solr-Tests-4.x-java7/solr/build/solr-core/test/J1/./org.apache.solr.cloud.SyncSliceTest-1359781873150/jetty2/index.20130202135625640
[junit4:junit4]   2> 12514 T1288 C121 P52646 oasc.CachingDirectoryFactory.close Releasing directory:/usr/home/hudson/hudson-slave/workspace/Lucene-Solr-Tests-4.x-java7/solr/build/solr-core/test/J1/./org.apache.solr.cloud.SyncSliceTest-1359781873150/jetty2
[junit4:junit4]   2> 12516 T1288 C121 P52646 oasc.SolrDeletionPolicy.onInit SolrDeletionPolicy.onInit: commits:num=1
[junit4:junit4]   2> 		commit{dir=RateLimitedDirectoryWrapper(NRTCachingDirectory(org.apache.lucene.store.NIOFSDirectory@/usr/home/hudson/hudson-slave/workspace/Lucene-Solr-Tests-4.x-java7/solr/build/solr-core/test/J1/org.apache.solr.cloud.SyncSliceTest-1359781873150/jetty2/index.20130202135625640 lockFactory=org.apache.lucene.store.NativeFSLockFactory@39748bf1; maxCacheMB=48.0 maxMergeSizeMB=4.0)),segFN=segments_2,generation=2,filenames=[segments_2]
[junit4:junit4]   2> 12517 T1288 C121 P52646 oasc.SolrDeletionPolicy.updateCommits newest commit = 2[segments_2]
[junit4:junit4]   2> 12517 T1288 C121 P52646 oasu.DefaultSolrCoreState.newIndexWriter New IndexWriter is ready to be used.
[junit4:junit4]   2> 12517 T1288 C121 P52646 oasc.CachingDirectoryFactory.close Releasing directory:/usr/home/hudson/hudson-slave/workspace/Lucene-Solr-Tests-4.x-java7/solr/build/solr-core/test/J1/./org.apache.solr.cloud.SyncSliceTest-1359781873150/jetty2
[junit4:junit4]   2> 12518 T1288 C121 P52646 oass.SolrIndexSearcher.<init> Opening Searcher@96d5537 main
[junit4:junit4]   2> 12519 T1287 oasc.SolrCore.registerSearcher [collection1] Registered new searcher Searcher@96d5537 main{StandardDirectoryReader(segments_2:1:nrt)}
[junit4:junit4]   2> 12519 T1287 oasc.CachingDirectoryFactory.close Releasing directory:/usr/home/hudson/hudson-slave/workspace/Lucene-Solr-Tests-4.x-java7/solr/build/solr-core/test/J1/./org.apache.solr.cloud.SyncSliceTest-1359781873150/jetty2/index
[junit4:junit4]   2> 12519 T1288 C121 P52646 oasu.DirectUpdateHandler2.commit start commit{,optimize=false,openSearcher=false,waitSearcher=false,expungeDeletes=false,softCommit=false}
[junit4:junit4]   2> 12522 T1288 C121 P52646 oasc.SolrDeletionPolicy.onCommit SolrDeletionPolicy.onCommit: commits:num=2
[junit4:junit4]   2> 		commit{dir=RateLimitedDirectoryWrapper(NRTCachingDirectory(org.apache.lucene.store.NIOFSDirectory@/usr/home/hudson/hudson-slave/workspace/Lucene-Solr-Tests-4.x-java7/solr/build/solr-core/test/J1/org.apache.solr.cloud.SyncSliceTest-1359781873150/jetty2/index.20130202135625640 lockFactory=org.apache.lucene.store.NativeFSLockFactory@39748bf1; maxCacheMB=48.0 maxMergeSizeMB=4.0)),segFN=segments_2,generation=2,filenames=[segments_2]
[junit4:junit4]   2> 		commit{dir=RateLimitedDirectoryWrapper(NRTCachingDirectory(org.apache.lucene.store.NIOFSDirectory@/usr/home/hudson/hudson-slave/workspace/Lucene-Solr-Tests-4.x-java7/solr/build/solr-core/test/J1/org.apache.solr.cloud.SyncSliceTest-1359781873150/jetty2/index.20130202135625640 lockFactory=org.apache.lucene.store.NativeFSLockFactory@39748bf1; maxCacheMB=48.0 maxMergeSizeMB=4.0)),segFN=segments_3,generation=3,filenames=[segments_3]
[junit4:junit4]   2> 12522 T1288 C121 P52646 oasc.SolrDeletionPolicy.updateCommits newest commit = 3[segments_3]
[junit4:junit4]   2> 12523 T1288 C121 P52646 oasc.CachingDirectoryFactory.close Releasing directory:/usr/home/hudson/hudson-slave/workspace/Lucene-Solr-Tests-4.x-java7/solr/build/solr-core/test/J1/./org.apache.solr.cloud.SyncSliceTest-1359781873150/jetty2
[junit4:junit4]   2> 12524 T1288 C121 P52646 oasu.DirectUpdateHandler2.commit end_commit_flush
[junit4:junit4]   2> 12524 T1288 C121 P52646 oasc.CachingDirectoryFactory.close Releasing directory:/usr/home/hudson/hudson-slave/workspace/Lucene-Solr-Tests-4.x-java7/solr/build/solr-core/test/J1/./org.apache.solr.cloud.SyncSliceTest-1359781873150/jetty2/index.20130202135625640
[junit4:junit4]   2> 12524 T1288 C121 P52646 oasc.CachingDirectoryFactory.close Releasing directory:/usr/home/hudson/hudson-slave/workspace/Lucene-Solr-Tests-4.x-java7/solr/build/solr-core/test/J1/./org.apache.solr.cloud.SyncSliceTest-1359781873150/jetty2/index
[junit4:junit4]   2> 12524 T1288 C121 P52646 oasc.RecoveryStrategy.replay No replay needed. core=collection1
[junit4:junit4]   2> 12524 T1288 C121 P52646 oasc.RecoveryStrategy.doRecovery Replication Recovery was successful - registering as Active. core=collection1
[junit4:junit4]   2> 12524 T1288 C121 P52646 oasc.ZkController.publish publishing core=collection1 state=active
[junit4:junit4]   2> 12524 T1288 C121 P52646 oasc.ZkController.publish numShards not found on descriptor - reading it from system property
[junit4:junit4]   2> 12532 T1288 C121 P52646 oasc.RecoveryStrategy.doRecovery Finished recovery process. core=collection1
[junit4:junit4]   2> 12894 T1318 oass.OpenExchangeRatesOrgProvider.init Initialized with rates=open-exchange-rates.json, refreshInterval=1440.
[junit4:junit4]   2> 12901 T1318 oass.IndexSchema.readSchema default search field in schema is text
[junit4:junit4]   2> 12903 T1318 oass.IndexSchema.readSchema unique key field: id
[junit4:junit4]   2> 12916 T1318 oass.FileExchangeRateProvider.reload Reloading exchange rates from file currency.xml
[junit4:junit4]   2> 12927 T1318 oass.FileExchangeRateProvider.reload Reloading exchange rates from file currency.xml
[junit4:junit4]   2> 12930 T1318 oass.OpenExchangeRatesOrgProvider.reload Reloading exchange rates from open-exchange-rates.json
[junit4:junit4]   2> 12931 T1318 oass.OpenExchangeRatesOrgProvider.reload Reloading exchange rates from open-exchange-rates.json
[junit4:junit4]   2> 12932 T1318 oasc.SolrCore.<init> [collection1] Opening new SolrCore at /usr/home/hudson/hudson-slave/workspace/Lucene-Solr-Tests-4.x-java7/solr/build/solr-core/test/J1/./org.apache.solr.cloud.SyncSliceTest-jetty4-1359781885010/collection1/, dataDir=./org.apache.solr.cloud.SyncSliceTest-1359781873150/jetty4/
[junit4:junit4]   2> 12933 T1318 oasc.JmxMonitoredMap.<init> JMX monitoring is enabled. Adding Solr mbeans to JMX Server: com.sun.jmx.mbeanserver.JmxMBeanServer@1102e749
[junit4:junit4]   2> 12933 T1318 oasc.SolrCore.initDirectoryFactory solr.NRTCachingDirectoryFactory
[junit4:junit4]   2> 12934 T1318 oasc.CachingDirectoryFactory.get return new directory for /usr/home/hudson/hudson-slave/workspace/Lucene-Solr-Tests-4.x-java7/solr/build/solr-core/test/J1/./org.apache.solr.cloud.SyncSliceTest-1359781873150/jetty4 forceNew:false
[junit4:junit4]   2> 12934 T1318 oasc.CachingDirectoryFactory.close Releasing directory:/usr/home/hudson/hudson-slave/workspace/Lucene-Solr-Tests-4.x-java7/solr/build/solr-core/test/J1/./org.apache.solr.cloud.SyncSliceTest-1359781873150/jetty4
[junit4:junit4]   2> 12934 T1318 oasc.SolrCore.getNewIndexDir New index directory detected: old=null new=./org.apache.solr.cloud.SyncSliceTest-1359781873150/jetty4/index/
[junit4:junit4]   2> 12935 T1318 oasc.SolrCore.initIndex WARNING [collection1] Solr index directory './org.apache.solr.cloud.SyncSliceTest-1359781873150/jetty4/index' doesn't exist. Creating new index...
[junit4:junit4]   2> 12936 T1318 oasc.CachingDirectoryFactory.get return new directory for /usr/home/hudson/hudson-slave/workspace/Lucene-Solr-Tests-4.x-java7/solr/build/solr-core/test/J1/./org.apache.solr.cloud.SyncSliceTest-1359781873150/jetty4/index forceNew:false
[junit4:junit4]   2> 12941 T1318 oasc.SolrDeletionPolicy.onCommit SolrDeletionPolicy.onCommit: commits:num=1
[junit4:junit4]   2> 		commit{dir=RateLimitedDirectoryWrapper(NRTCachingDirectory(org.apache.lucene.store.NIOFSDirectory@/usr/home/hudson/hudson-slave/workspace/Lucene-Solr-Tests-4.x-java7/solr/build/solr-core/test/J1/org.apache.solr.cloud.SyncSliceTest-1359781873150/jetty4/index lockFactory=org.apache.lucene.store.NativeFSLockFactory@3c43372a; maxCacheMB=48.0 maxMergeSizeMB=4.0)),segFN=segments_1,generation=1,filenames=[segments_1]
[junit4:junit4]   2> 12941 T1318 oasc.SolrDeletionPolicy.updateCommits newest commit = 1[segments_1]
[junit4:junit4]   2> 12942 T1318 oasc.CachingDirectoryFactory.close Releasing directory:/usr/home/hudson/hudson-slave/workspace/Lucene-Solr-Tests-4.x-java7/solr/build/solr-core/test/J1/./org.apache.solr.cloud.SyncSliceTest-1359781873150/jetty4/index
[junit4:junit4]   2> 12942 T1318 oasc.SolrCore.initWriters created xml: solr.XMLResponseWriter
[junit4:junit4]   2> 12944 T1318 oasup.UpdateRequestProcessorChain.init inserting DistributedUpdateProcessorFactory into updateRequestProcessorChain "dedupe"
[junit4:junit4]   2> 12944 T1318 oasup.UpdateRequestProcessorChain.init inserting DistributedUpdateProcessorFactory into updateRequestProcessorChain "dedupe-allfields"
[junit4:junit4]   2> 12944 T1318 oasup.UpdateRequestProcessorChain.init inserting DistributedUpdateProcessorFactory into updateRequestProcessorChain "stored_sig"
[junit4:junit4]   2> 12945 T1318 oasup.UpdateRequestProcessorChain.init inserting DistributedUpdateProcessorFactory into updateRequestProcessorChain "uniq-fields"
[junit4:junit4]   2> 12945 T1318 oasup.UpdateRequestProcessorChain.init inserting DistributedUpdateProcessorFactory into updateRequestProcessorChain "distrib-dup-test-chain-implicit"
[junit4:junit4]   2> 12945 T1318 oasc.RequestHandlers.initHandlersFromConfig adding lazy requestHandler: solr.ReplicationHandler
[junit4:junit4]   2> 12945 T1318 oasc.RequestHandlers.initHandlersFromConfig created /replication: solr.ReplicationHandler
[junit4:junit4]   2> 12946 T1318 oasc.RequestHandlers.initHandlersFromConfig created standard: solr.StandardRequestHandler
[junit4:junit4]   2> 12946 T1318 oasc.RequestHandlers.initHandlersFromConfig created /get: solr.RealTimeGetHandler
[junit4:junit4]   2> 12947 T1318 oasc.RequestHandlers.initHandlersFromConfig created dismax: solr.SearchHandler
[junit4:junit4]   2> 12947 T1318 oasc.RequestHandlers.initHandlersFromConfig created mock: org.apache.solr.core.MockQuerySenderListenerReqHandler
[junit4:junit4]   2> 12947 T1318 oasc.RequestHandlers.initHandlersFromConfig created /admin/: org.apache.solr.handler.admin.AdminHandlers
[junit4:junit4]   2> 12948 T1318 oasc.RequestHandlers.initHandlersFromConfig created defaults: solr.StandardRequestHandler
[junit4:junit4]   2> 12948 T1318 oasc.RequestHandlers.initHandlersFromConfig adding lazy requestHandler: solr.StandardRequestHandler
[junit4:junit4]   2> 12948 T1318 oasc.RequestHandlers.initHandlersFromConfig created lazy: solr.StandardRequestHandler
[junit4:junit4]   2> 12949 T1318 oasc.RequestHandlers.initHandlersFromConfig created /update: solr.UpdateRequestHandler
[junit4:junit4]   2> 12949 T1318 oasc.RequestHandlers.initHandlersFromConfig created /terms: org.apache.solr.handler.component.SearchHandler
[junit4:junit4]   2> 12949 T1318 oasc.RequestHandlers.initHandlersFromConfig created spellCheckCompRH: org.apache.solr.handler.component.SearchHandler
[junit4:junit4]   2> 12950 T1318 oasc.RequestHandlers.initHandlersFromConfig created spellCheckCompRH_Direct: org.apache.solr.handler.component.SearchHandler
[junit4:junit4]   2> 12950 T1318 oasc.RequestHandlers.initHandlersFromConfig created spellCheckWithWordbreak: org.apache.solr.handler.component.SearchHandler
[junit4:junit4]   2> 12950 T1318 oasc.RequestHandlers.initHandlersFromConfig created spellCheckWithWordbreak_Direct: org.apache.solr.handler.component.SearchHandler
[junit4:junit4]   2> 12951 T1318 oasc.RequestHandlers.initHandlersFromConfig created spellCheckCompRH1: org.apache.solr.handler.component.SearchHandler
[junit4:junit4]   2> 12951 T1318 oasc.RequestHandlers.initHandlersFromConfig created mltrh: org.apache.solr.handler.component.SearchHandler
[junit4:junit4]   2> 12951 T1318 oasc.RequestHandlers.initHandlersFromConfig created tvrh: org.apache.solr.handler.component.SearchHandler
[junit4:junit4]   2> 12952 T1318 oasc.RequestHandlers.initHandlersFromConfig created /mlt: solr.MoreLikeThisHandler
[junit4:junit4]   2> 12952 T1318 oasc.RequestHandlers.initHandlersFromConfig created /debug/dump: solr.DumpRequestHandler
[junit4:junit4]   2> 12961 T1318 oashl.XMLLoader.init xsltCacheLifetimeSeconds=60
[junit4:junit4]   2> 12964 T1318 oasc.SolrCore.initDeprecatedSupport WARNING solrconfig.xml uses deprecated <admin/gettableFiles>, Please update your config to use the ShowFileRequestHandler.
[junit4:junit4]   2> 12965 T1318 oasc.SolrCore.initDeprecatedSupport WARNING adding ShowFileRequestHandler with hidden files: [SCHEMA.XML, OLD_SYNONYMS.TXT, STOPWORDS.TXT, PROTWORDS.TXT, OPEN-EXCHANGE-RATES.JSON, SYNONYMS.TXT, CURRENCY.XML, MAPPING-ISOLATIN1ACCENT.TXT]
[junit4:junit4]   2> 12966 T1318 oasc.CachingDirectoryFactory.close Releasing directory:/usr/home/hudson/hudson-slave/workspace/Lucene-Solr-Tests-4.x-java7/solr/build/solr-core/test/J1/./org.apache.solr.cloud.SyncSliceTest-1359781873150/jetty4
[junit4:junit4]   2> 12967 T1318 oass.SolrIndexSearcher.<init> Opening Searcher@55c0fbac main
[junit4:junit4]   2> 12968 T1318 oasu.CommitTracker.<init> Hard AutoCommit: disabled
[junit4:junit4]   2> 12968 T1318 oasu.CommitTracker.<init> Soft AutoCommit: disabled
[junit4:junit4]   2> 12969 T1318 oashc.SpellCheckComponent.inform Initializing spell checkers
[junit4:junit4]   2> 13001 T1318 oass.DirectSolrSpellChecker.init init: {name=direct,classname=DirectSolrSpellChecker,field=lowerfilt,minQueryLength=3}
[junit4:junit4]   2> 13034 T1252 oascc.ZkStateReader.updateClusterState Updating cloud state from ZooKeeper... 
[junit4:junit4]   2> 13035 T1252 oasc.Overseer$ClusterStateUpdater.updateState Update state numShards=1 message={
[junit4:junit4]   2> 	  "operation":"state",
[junit4:junit4]   2> 	  "numShards":"1",
[junit4:junit4]   2> 	  "shard":"shard1",
[junit4:junit4]   2> 	  "roles":null,
[junit4:junit4]   2> 	  "state":"recovering",
[junit4:junit4]   2> 	  "core":"collection1",
[junit4:junit4]   2> 	  "collection":"collection1",
[junit4:junit4]   2> 	  "node_name":"127.0.0.1:52650__pzw",
[junit4:junit4]   2> 	  "base_url":"http://127.0.0.1:52650/_pzw"}
[junit4:junit4]   2> 13085 T1252 oasc.Overseer$ClusterStateUpdater.updateState Update state numShards=1 message={
[junit4:junit4]   2> 	  "operation":"state",
[junit4:junit4]   2> 	  "numShards":"1",
[junit4:junit4]   2> 	  "shard":"shard1",
[junit4:junit4]   2> 	  "roles":null,
[junit4:junit4]   2> 	  "state":"active",
[junit4:junit4]   2> 	  "core":"collection1",
[junit4:junit4]   2> 	  "collection":"collection1",
[junit4:junit4]   2> 	  "node_name":"127.0.0.1:52646__pzw",
[junit4:junit4]   2> 	  "base_url":"http://127.0.0.1:52646/_pzw"}
[junit4:junit4]   2> 13180 T1285 oascc.ZkStateReader$2.process A cluster state change: WatchedEvent state:SyncConnected type:NodeDataChanged path:/clusterstate.json, has occurred - updating... (live nodes size: 5)
[junit4:junit4]   2> 13180 T1257 oascc.ZkStateReader$2.process A cluster state change: WatchedEvent state:SyncConnected type:NodeDataChanged path:/clusterstate.json, has occurred - updating... (live nodes size: 5)
[junit4:junit4]   2> 13180 T1251 oascc.ZkStateReader$2.process A cluster state change: WatchedEvent state:SyncConnected type:NodeDataChanged path:/clusterstate.json, has occurred - updating... (live nodes size: 5)
[junit4:junit4]   2> 13180 T1270 oascc.ZkStateReader$2.process A cluster state change: WatchedEvent state:SyncConnected type:NodeDataChanged path:/clusterstate.json, has occurred - updating... (live nodes size: 5)
[junit4:junit4]   2> 13180 T1301 oascc.ZkStateReader$2.process A cluster state change: WatchedEvent state:SyncConnected type:NodeDataChanged path:/clusterstate.json, has occurred - updating... (live nodes size: 5)
[junit4:junit4]   2> 13180 T1317 oascc.ZkStateReader$2.process A cluster state change: WatchedEvent state:SyncConnected type:NodeDataChanged path:/clusterstate.json, has occurred - updating... (live nodes size: 5)
[junit4:junit4]   2> 13254 T1321 oasc.SolrCore.registerSearcher [collection1] Registered new searcher Searcher@55c0fbac main{StandardDirectoryReader(segments_1:1)}
[junit4:junit4]   2> 13257 T1318 oasc.ZkController.publish publishing core=collection1 state=down
[junit4:junit4]   2> 13257 T1318 oasc.ZkController.publish numShards not found on descriptor - reading it from system property
[junit4:junit4]   2> 14730 T1252 oascc.ZkStateReader.updateClusterState Updating cloud state from ZooKeeper... 
[junit4:junit4]   2> 14731 T1252 oasc.Overseer$ClusterStateUpdater.updateState Update state numShards=1 message={
[junit4:junit4]   2> 	  "operation":"state",
[junit4:junit4]   2> 	  "numShards":"1",
[junit4:junit4]   2> 	  "shard":null,
[junit4:junit4]   2> 	  "roles":null,
[junit4:junit4]   2> 	  "state":"down",
[junit4:junit4]   2> 	  "core":"collection1",
[junit4:junit4]   2> 	  "collection":"collection1",
[junit4:junit4]   2> 	  "node_name":"127.0.0.1:52657__pzw",
[junit4:junit4]   2> 	  "base_url":"http://127.0.0.1:52657/_pzw"}
[junit4:junit4]   2> 14731 T1252 oasc.Overseer$ClusterStateUpdater.updateState Collection already exists with numShards=1
[junit4:junit4]   2> 14731 T1252 oasc.Overseer$ClusterStateUpdater.updateState Assigning new node to shard shard=shard1
[junit4:junit4]   2> 14744 T1285 oascc.ZkStateReader$2.process A cluster state change: WatchedEvent state:SyncConnected type:NodeDataChanged path:/clusterstate.json, has occurred - updating... (live nodes size: 5)
[junit4:junit4]   2> 14744 T1257 oascc.ZkStateReader$2.process A cluster state change: WatchedEvent state:SyncConnected type:NodeDataChanged path:/clusterstate.json, has occurred - updating... (live nodes size: 5)
[junit4:junit4]   2> 14744 T1270 oascc.ZkStateReader$2.process A cluster state change: WatchedEvent state:SyncConnected type:NodeDataChanged path:/clusterstate.json, has occurred - updating... (live nodes size: 5)
[junit4:junit4]   2> 14744 T1301 oascc.ZkStateReader$2.process A cluster state change: WatchedEvent state:SyncConnected type:NodeDataChanged path:/clusterstate.json, has occurred - updating... (live nodes size: 5)
[junit4:junit4]   2> 14744 T1317 oascc.ZkStateReader$2.process A cluster state change: WatchedEvent state:SyncConnected type:NodeDataChanged path:/clusterstate.json, has occurred - updating... (live nodes size: 5)
[junit4:junit4]   2> 14744 T1251 oascc.ZkStateReader$2.process A cluster state change: WatchedEvent state:SyncConnected type:NodeDataChanged path:/clusterstate.json, has occurred - updating... (live nodes size: 5)
[junit4:junit4]   2> 15260 T1318 oasc.CoreContainer.registerCore registering core: collection1
[junit4:junit4]   2> 15260 T1318 oasc.ZkController.register Register replica - core:collection1 address:http://127.0.0.1:52657/_pzw collection:collection1 shard:shard1
[junit4:junit4]   2> 15264 T1318 oasc.ZkController.register We are http://127.0.0.1:52657/_pzw/collection1/ and leader is http://127.0.0.1:52642/_pzw/collection1/
[junit4:junit4]   2> 15264 T1318 oasc.ZkController.register No LogReplay needed for core=collection1 baseURL=http://127.0.0.1:52657/_pzw
[junit4:junit4]   2> 15264 T1318 oasc.ZkController.checkRecovery Core needs to recover:collection1
[junit4:junit4]   2> 15264 T1318 oasu.DefaultSolrCoreState.doRecovery Running recovery - first canceling any ongoing recovery
[junit4:junit4]   2> ASYNC  NEW_CORE C124 name=collection1 org.apache.solr.core.SolrCore@5273208f url=http://127.0.0.1:52657/_pzw/collection1 node=127.0.0.1:52657__pzw C124_STATE=coll:collection1 core:collection1 props:{shard=null, roles=null, state=down, core=collection1, collection=collection1, node_name=127.0.0.1:52657__pzw, base_url=http://127.0.0.1:52657/_pzw}
[junit4:junit4]   2> 15265 T1322 C124 P52657 oasc.RecoveryStrategy.run Starting recovery process.  core=collection1 recoveringAfterStartup=true
[junit4:junit4]   2> 15266 T1318 oascc.ZkStateReader.updateClusterState Updating cloud state from ZooKeeper... 
[junit4:junit4]   2> 15266 T1322 C124 P52657 oasc.RecoveryStrategy.doRecovery ###### startupVersions=[]
[junit4:junit4]   2> 15266 T1322 C124 P52657 oasc.ZkController.publish publishing core=collection1 state=recovering
[junit4:junit4]   2> 15266 T1322 C124 P52657 oasc.ZkController.publish numShards not found on descriptor - reading it from system property
[junit4:junit4]   2> 15267 T1229 oass.SolrDispatchFilter.init user.dir=/usr/home/hudson/hudson-slave/workspace/Lucene-Solr-Tests-4.x-java7/solr/build/solr-core/test/J1
[junit4:junit4]   2> 15268 T1229 oass.SolrDispatchFilter.init SolrDispatchFilter.init() done
[junit4:junit4]   2> 15268 T1322 C124 P52657 oascsi.HttpClientUtil.createClient Creating new http client, config:maxConnections=128&maxConnectionsPerHost=32&followRedirects=false
[junit4:junit4]   2> 15268 T1229 oascsi.HttpClientUtil.createClient Creating new http client, config:maxConnections=128&maxConnectionsPerHost=32&followRedirects=false
[junit4:junit4]   2> 15288 T1229 oascc.ZkStateReader.updateClusterState Updating cloud state from ZooKeeper... 
[junit4:junit4]   2> 15290 T1229 oasc.AbstractFullDistribZkTestBase.waitForThingsToLevelOut Wait for recoveries to finish - wait 15 for each attempt
[junit4:junit4]   2> 15290 T1229 oasc.AbstractDistribZkTestBase.waitForRecoveriesToFinish Wait for recoveries to finish - collection: collection1 failOnTimeout:true timeout (sec):15
[junit4:junit4]   2> 15291 T1229 oascc.ZkStateReader.updateClusterState Updating cloud state from ZooKeeper... 
[junit4:junit4]   2>  C122_STATE=coll:collection1 core:collection1 props:{shard=shard1, roles=null, state=recovering, core=collection1, collection=collection1, node_name=127.0.0.1:52650__pzw, base_url=http://127.0.0.1:52650/_pzw}
[junit4:junit4]   2> 15872 T1304 C122 P52650 oasc.RecoveryStrategy.doRecovery Attempting to PeerSync from http://127.0.0.1:52642/_pzw/collection1/ core=collection1 - recoveringAfterStartup=true
[junit4:junit4]   2> 15872 T1304 C122 P52650 oasu.PeerSync.sync PeerSync: core=collection1 url=http://127.0.0.1:52650/_pzw START replicas=[http://127.0.0.1:52642/_pzw/collection1/] nUpdates=100
[junit4:junit4]   2> 15873 T1304 C122 P52650 oasu.PeerSync.sync WARNING no frame of reference to tell of we've missed updates
[junit4:junit4]   2> 15874 T1304 C122 P52650 oasc.RecoveryStrategy.doRecovery PeerSync Recovery was not successful - trying replication. core=collection1
[junit4:junit4]   2> 15874 T1304 C122 P52650 oasc.RecoveryStrategy.doRecovery Starting Replication Recovery. core=collection1
[junit4:junit4]   2> 15874 T1304 C122 P52650 oasc.RecoveryStrategy.doRecovery Begin buffering updates. core=collection1
[junit4:junit4]   2> 15874 T1304 C122 P52650 oasu.UpdateLog.bufferUpdates Starting to buffer updates. FSUpdateLog{state=ACTIVE, tlog=null}
[junit4:junit4]   2> 15874 T1304 C122 P52650 oasc.RecoveryStrategy.replicate Attempting to replicate from http://127.0.0.1:52642/_pzw/collection1/. core=collection1
[junit4:junit4]   2> 15875 T1304 C122 P52650 oascsi.HttpClientUtil.createClient Creating new http client, config:maxConnections=128&maxConnectionsPerHost=32&followRedirects=false
[junit4:junit4]   2> 15876 T1262 C123 P52642 REQ /get {getVersions=100&distrib=false&wt=javabin&qt=/get&version=2} status=0 QTime=0 
[junit4:junit4]   2> 15886 T1266 C123 P52642 oasu.DirectUpdateHandler2.commit start commit{,optimize=false,openSearcher=false,waitSearcher=true,expungeDeletes=false,softCommit=false}
[junit4:junit4]   2> 15898 T1266 C123 P52642 oasc.SolrDeletionPolicy.onCommit SolrDeletionPolicy.onCommit: commits:num=2
[junit4:junit4]   2> 		commit{dir=RateLimitedDirectoryWrapper(NRTCachingDirectory(org.apache.lucene.store.NIOFSDirectory@/usr/home/hudson/hudson-slave/workspace/Lucene-Solr-Tests-4.x-java7/solr/build/solr-core/test/J1/org.apache.solr.cloud.SyncSliceTest-1359781873150/jetty1/index lockFactory=org.apache.lucene.store.NativeFSLockFactory@266e4724; maxCacheMB=48.0 maxMergeSizeMB=4.0)),segFN=segments_2,generation=2,filenames=[segments_2]
[junit4:junit4]   2> 		commit{dir=RateLimitedDirectoryWrapper(NRTCachingDirectory(org.apache.lucene.store.NIOFSDirectory@/usr/home/hudson/hudson-slave/workspace/Lucene-Solr-Tests-4.x-java7/solr/build/solr-core/test/J1/org.apache.solr.cloud.SyncSliceTest-1359781873150/jetty1/index lockFactory=org.apache.lucene.store.NativeFSLockFactory@266e4724; maxCacheMB=48.0 maxMergeSizeMB=4.0)),segFN=segments_3,generation=3,filenames=[segments_3]
[junit4:junit4]   2> 15899 T1266 C123 P52642 oasc.SolrDeletionPolicy.updateCommits newest commit = 3[segments_3]
[junit4:junit4]   2> 15899 T1266 C123 P52642 oasc.CachingDirectoryFactory.close Releasing directory:/usr/home/hudson/hudson-slave/workspace/Lucene-Solr-Tests-4.x-java7/solr/build/solr-core/test/J1/./org.apache.solr.cloud.SyncSliceTest-1359781873150/jetty1
[junit4:junit4]   2> 15900 T1266 C123 P52642 oasu.DirectUpdateHandler2.commit end_commit_flush
[junit4:junit4]   2> 15900 T1266 C123 P52642 /update {waitSearcher=true&openSearcher=false&commit=true&wt=javabin&commit_end_point=true&version=2&softCommit=false} {commit=} 0 15
[junit4:junit4]   2> 15901 T1304 C122 P52650 oash.ReplicationHandler.inform Commits will be reserved for  10000
[junit4:junit4]   2> 15902 T1304 C122 P52650 oash.SnapPuller.<init>  No value set for 'pollInterval'. Timer Task not started.
[junit4:junit4]   2> 15904 T1264 C123 P52642 REQ /replication {command=indexversion&qt=/replication&wt=javabin&version=2} status=0 QTime=0 
[junit4:junit4]   2> 15905 T1304 C122 P52650 oash.SnapPuller.fetchLatestIndex Master's generation: 3
[junit4:junit4]   2> 15905 T1304 C122 P52650 oash.SnapPuller.fetchLatestIndex Slave's generation: 1
[junit4:junit4]   2> 15905 T1304 C122 P52650 oash.SnapPuller.fetchLatestIndex Starting replication process
[junit4:junit4]   2> 15908 T1264 C123 P52642 oasc.CachingDirectoryFactory.close Releasing directory:/usr/home/hudson/hudson-slave/workspace/Lucene-Solr-Tests-4.x-java7/solr/build/solr-core/test/J1/./org.apache.solr.cloud.SyncSliceTest-1359781873150/jetty1
[junit4:junit4]   2> 15909 T1264 C123 P52642 oasc.CachingDirectoryFactory.close Releasing directory:/usr/home/hudson/hudson-slave/workspace/Lucene-Solr-Tests-4.x-java7/solr/build/solr-core/test/J1/./org.apache.solr.cloud.SyncSliceTest-1359781873150/jetty1/index
[junit4:junit4]   2> 15909 T1264 C123 P52642 REQ /replication {command=filelist&qt=/replication&wt=javabin&generation=3&version=2} status=0 QTime=1 
[junit4:junit4]   2> 15910 T1304 C122 P52650 oash.SnapPuller.fetchLatestIndex Number of files in latest index in master: 1
[junit4:junit4]   2> 15911 T1304 C122 P52650 oasc.CachingDirectoryFactory.get return new directory for /usr/home/hudson/hudson-slave/workspace/Lucene-Solr-Tests-4.x-java7/solr/build/solr-core/test/J1/./org.apache.solr.cloud.SyncSliceTest-1359781873150/jetty3/index.20130202135629053 forceNew:false
[junit4:junit4]   2> 15912 T1304 C122 P52650 oasc.CachingDirectoryFactory.close Releasing directory:/usr/home/hudson/hudson-slave/workspace/Lucene-Solr-Tests-4.x-java7/solr/build/solr-core/test/J1/./org.apache.solr.cloud.SyncSliceTest-1359781873150/jetty3
[junit4:junit4]   2> 15913 T1304 C122 P52650 oash.SnapPuller.fetchLatestIndex Starting download to RateLimitedDirectoryWrapper(NRTCachingDirectory(org.apache.lucene.store.NIOFSDirectory@/usr/home/hudson/hudson-slave/workspace/Lucene-Solr-Tests-4.x-java7/solr/build/solr-core/test/J1/org.apache.solr.cloud.SyncSliceTest-1359781873150/jetty3/index.20130202135629053 lockFactory=org.apache.lucene.store.NativeFSLockFactory@2e4a36f8; maxCacheMB=48.0 maxMergeSizeMB=4.0)) fullCopy=true
[junit4:junit4]   2> 15916 T1264 C123 P52642 REQ /replication {file=segments_3&command=filecontent&checksum=true&wt=filestream&qt=/replication&generation=3} status=0 QTime=0 
[junit4:junit4]   2> 15918 T1304 C122 P52650 oasc.CachingDirectoryFactory.close Releasing directory:/usr/home/hudson/hudson-slave/workspace/Lucene-Solr-Tests-4.x-java7/solr/build/solr-core/test/J1/./org.apache.solr.cloud.SyncSliceTest-1359781873150/jetty3/index
[junit4:junit4]   2> 15918 T1304 C122 P52650 oash.SnapPuller.fetchLatestIndex Total time taken for download : 0 secs
[junit4:junit4]   2> 15919 T1304 C122 P52650 oash.SnapPuller.modifyIndexProps New index installed. Updating index properties... index=index.20130202135629053
[junit4:junit4]   2> 15920 T1304 C122 P52650 oasc.CachingDirectoryFactory.close Releasing directory:/usr/home/hudson/hudson-slave/workspace/Lucene-Solr-Tests-4.x-java7/solr/build/solr-core/test/J1/./org.apache.solr.cloud.SyncSliceTest-1359781873150/jetty3
[junit4:junit4]   2> 15920 T1304 C122 P52650 oasc.CachingDirectoryFactory.close Releasing directory:/usr/home/hudson/hudson-slave/workspace/Lucene-Solr-Tests-4.x-java7/solr/build/solr-core/test/J1/./org.apache.solr.cloud.SyncSliceTest-1359781873150/jetty3
[junit4:junit4]   2> 15921 T1304 C122 P52650 oasc.SolrCore.getNewIndexDir New index directory detected: old=./org.apache.solr.cloud.SyncSliceTest-1359781873150/jetty3/index/ new=./org.apache.solr.cloud.SyncSliceTest-1359781873150/jetty3/index.20130202135629053
[junit4:junit4]   2> 15924 T1304 C122 P52650 oasc.SolrDeletionPolicy.onInit SolrDeletionPolicy.onInit: commits:num=1
[junit4:junit4]   2> 		commit{dir=RateLimitedDirectoryWrapper(NRTCachingDirectory(org.apache.lucene.store.NIOFSDirectory@/usr/home/hudson/hudson-slave/workspace/Lucene-Solr-Tests-4.x-java7/solr/build/solr-core/test/J1/org.apache.solr.cloud.SyncSliceTest-1359781873150/jetty3/index.20130202135629053 lockFactory=org.apache.lucene.store.NativeFSLockFactory@2e4a36f8; maxCacheMB=48.0 maxMergeSizeMB=4.0)),segFN=segments_3,generation=3,filenames=[segments_3]
[junit4:junit4]   2> 15925 T1304 C122 P52650 oasc.SolrDeletionPolicy.updateCommits newest commit = 3[segments_3]
[junit4:junit4]   2> 15926 T1304 C122 P52650 oasc.CachingDirectoryFactory.close Releasing directory:/usr/home/hudson/hudson-slave/workspace/Lucene-Solr-Tests-4.x-java7/solr/build/solr-core/test/J1/./org.apache.solr.cloud.SyncSliceTest-1359781873150/jetty3
[junit4:junit4]   2> 15926 T1304 C122 P52650 oasu.DefaultSolrCoreState.newIndexWriter Creating new IndexWriter...
[junit4:junit4]   2> 15926 T1304 C122 P52650 oasu.DefaultSolrCoreState.newIndexWriter Waiting until IndexWriter is unused... core=collection1
[junit4:junit4]   2> 15926 T1304 C122 P52650 oasu.DefaultSolrCoreState.newIndexWriter Rollback old IndexWriter... core=collection1
[junit4:junit4]   2> 15927 T1304 C122 P52650 oasc.CachingDirectoryFactory.close Releasing directory:/usr/home/hudson/hudson-slave/workspace/Lucene-Solr-Tests-4.x-java7/solr/build/solr-core/test/J1/./org.apache.solr.cloud.SyncSliceTest-1359781873150/jetty3/index.20130202135629053
[junit4:junit4]   2> 15928 T1304 C122 P52650 oasc.CachingDirectoryFactory.close Releasing directory:/usr/home/hudson/hudson-slave/workspace/Lucene-Solr-Tests-4.x-java7/solr/build/solr-core/test/J1/./org.apache.solr.cloud.SyncSliceTest-1359781873150/jetty3
[junit4:junit4]   2> 15931 T1304 C122 P52650 oasc.SolrDeletionPolicy.onInit SolrDeletionPolicy.onInit: commits:num=1
[junit4:junit4]   2> 		commit{dir=RateLimitedDirectoryWrapper(NRTCachingDirectory(org.apache.lucene.store.NIOFSDirectory@/usr/home/hudson/hudson-slave/workspace/Lucene-Solr-Tests-4.x-java7/solr/build/solr-core/test/J1/org.apache.solr.cloud.SyncSliceTest-1359781873150/jetty3/index.20130202135629053 lockFactory=org.apache.lucene.store.NativeFSLockFactory@2e4a36f8; maxCacheMB=48.0 maxMergeSizeMB=4.0)),segFN=segments_3,generation=3,filenames=[segments_3]
[junit4:junit4]   2> 15932 T1304 C122 P52650 oasc.SolrDeletionPolicy.updateCommits newest commit = 3[segments_3]
[junit4:junit4]   2> 15932 T1304 C122 P52650 oasu.DefaultSolrCoreState.newIndexWriter New IndexWriter is ready to be used.
[junit4:junit4]   2> 15932 T1304 C122 P52650 oasc.CachingDirectoryFactory.close Releasing directory:/usr/home/hudson/hudson-slave/workspace/Lucene-Solr-Tests-4.x-java7/solr/build/solr-core/test/J1/./org.apache.solr.cloud.SyncSliceTest-1359781873150/jetty3
[junit4:junit4]   2> 15933 T1304 C122 P52650 oass.SolrIndexSearcher.<init> Opening Searcher@3553bef0 main
[junit4:junit4]   2> 15935 T1303 oasc.SolrCore.registerSearcher [collection1] Registered new searcher Searcher@3553bef0 main{StandardDirectoryReader(segments_3:1:nrt)}
[junit4:junit4]   2> 15935 T1303 oasc.CachingDirectoryFactory.close Releasing directory:/usr/home/hudson/hudson-slave/workspace/Lucene-Solr-Tests-4.x-java7/solr/build/solr-core/test/J1/./org.apache.solr.cloud.SyncSliceTest-1359781873150/jetty3/index
[junit4:junit4]   2> 15935 T1304 C122 P52650 oasu.DirectUpdateHandler2.commit start commit{,optimize=false,openSearcher=false,waitSearcher=false,expungeDeletes=false,softCommit=false}
[junit4:junit4]   2> 15939 T1304 C122 P52650 oasc.SolrDeletionPolicy.onCommit SolrDeletionPolicy.onCommit: commits:num=2
[junit4:junit4]   2> 		commit{dir=RateLimitedDirectoryWrapper(NRTCachingDirectory(org.apache.lucene.store.NIOFSDirectory@/usr/home/hudson/hudson-slave/workspace/Lucene-Solr-Tests-4.x-java7/solr/build/solr-core/test/J1/org.apache.solr.cloud.SyncSliceTest-1359781873150/jetty3/index.20130202135629053 lockFactory=org.apache.lucene.store.NativeFSLockFactory@2e4a36f8; maxCacheMB=48.0 maxMergeSizeMB=4.0)),segFN=segments_3,generation=3,filenames=[segments_3]
[junit4:junit4]   2> 		commit{dir=RateLimitedDirectoryWrapper(NRTCachingDirectory(org.apache.lucene.store.NIOFSDirectory@/usr/home/hudson/hudson-slave/workspace/Lucene-Solr-Tests-4.x-java7/solr/build/solr-core/test/J1/org.apache.solr.cloud.SyncSliceTest-1359781873150/jetty3/index.20130202135629053 lockFactory=org.apache.lucene.store.NativeFSLockFactory@2e4a36f8; maxCacheMB=48.0 maxMergeSizeMB=4.0)),segFN=segments_4,generation=4,filenames=[segments_4]
[junit4:junit4]   2> 15940 T1304 C122 P52650 oasc.SolrDeletionPolicy.updateCommits newest commit = 4[segments_4]
[junit4:junit4]   2> 15941 T1304 C122 P52650 oasc.CachingDirectoryFactory.close Releasing directory:/usr/home/hudson/hudson-slave/workspace/Lucene-Solr-Tests-4.x-java7/solr/build/solr-core/test/J1/./org.apache.solr.cloud.SyncSliceTest-1359781873150/jetty3
[junit4:junit4]   2> 15941 T1304 C122 P52650 oasu.DirectUpdateHandler2.commit end_commit_flush
[junit4:junit4]   2> 15941 T1304 C122 P52650 oasc.CachingDirectoryFactory.close Releasing directory:/usr/home/hudson/hudson-slave/workspace/Lucene-Solr-Tests-4.x-java7/solr/build/solr-core/test/J1/./org.apache.solr.cloud.SyncSliceTest-1359781873150/jetty3/index.20130202135629053
[junit4:junit4]   2> 15941 T1304 C122 P52650 oasc.CachingDirectoryFactory.close Releasing directory:/usr/home/hudson/hudson-slave/workspace/Lucene-Solr-Tests-4.x-java7/solr/build/solr-core/test/J1/./org.apache.solr.cloud.SyncSliceTest-1359781873150/jetty3/index
[junit4:junit4]   2> 15942 T1304 C122 P52650 oasc.RecoveryStrategy.replay No replay needed. core=collection1
[junit4:junit4]   2> 15942 T1304 C122 P52650 oasc.RecoveryStrategy.doRecovery Replication Recovery was successful - registering as Active. core=collection1
[junit4:junit4]   2> 15942 T1304 C122 P52650 oasc.ZkController.publish publishing core=collection1 state=active
[junit4:junit4]   2> 15942 T1304 C122 P52650 oasc.ZkController.publish numShards not found on descriptor - reading it from system property
[junit4:junit4]   2> 15944 T1304 C122 P52650 oasc.RecoveryStrategy.doRecovery Finished recovery process. core=collection1
[junit4:junit4]   2> 16248 T1252 oascc.ZkStateReader.updateClusterState Updating cloud state from ZooKeeper... 
[junit4:junit4]   2> 16249 T1252 oasc.Overseer$ClusterStateUpdater.updateState Update state numShards=1 message={
[junit4:junit4]   2> 	  "operation":"state",
[junit4:junit4]   2> 	  "numShards":"1",
[junit4:junit4]   2> 	  "shard":"shard1",
[junit4:junit4]   2> 	  "roles":null,
[junit4:junit4]   2> 	  "state":"recovering",
[junit4:junit4]   2> 	  "core":"collection1",
[junit4:junit4]   2> 	  "collection":"collection1",
[junit4:junit4]   2> 	  "node_name":"127.0.0.1:52657__pzw",
[junit4:junit4]   2> 	  "base_url":"http://127.0.0.1:52657/_pzw"}
[junit4:junit4]   2> 16253 T1252 oasc.Overseer$ClusterStateUpdater.updateState Update state numShards=1 message={
[junit4:junit4]   2> 	  "operation":"state",
[junit4:junit4]   2> 	  "numShards":"1",
[junit4:junit4]   2> 	  "shard":"shard1",
[junit4:junit4]   2> 	  "roles":null,
[junit4:junit4]   2> 	  "state":"active",
[junit4:junit4]   2> 	  "core":"collection1",
[junit4:junit4]   2> 	  "collection":"collection1",
[junit4:junit4]   2> 	  "node_name":"127.0.0.1:52650__pzw",
[junit4:junit4]   2> 	  "base_url":"http://127.0.0.1:52650/_pzw"}
[junit4:junit4]   2> 16269 T1257 oascc.ZkStateReader$2.process A cluster state change: WatchedEvent state:SyncConnected type:NodeDataChanged path:/clusterstate.json, has occurred - updating... (live nodes size: 5)
[junit4:junit4]   2> 16269 T1285 oascc.ZkStateReader$2.process A cluster state change: WatchedEvent state:SyncConnected type:NodeDataChanged path:/clusterstate.json, has occurred - updating... (live nodes size: 5)
[junit4:junit4]   2> 16269 T1317 oascc.ZkStateReader$2.process A cluster state change: WatchedEvent state:SyncConnected type:NodeDataChanged path:/clusterstate.json, has occurred - updating... (live nodes size: 5)
[junit4:junit4]   2> 16269 T1301 oascc.ZkStateReader$2.process A cluster state change: WatchedEvent state:SyncConnected type:NodeDataChanged path:/clusterstate.json, has occurred - updating... (live nodes size: 5)
[junit4:junit4]   2> 16269 T1270 oascc.ZkStateReader$2.process A cluster state change: WatchedEvent state:SyncConnected type:NodeDataChanged path:/clusterstate.json, has occurred - updating... (live nodes size: 5)
[junit4:junit4]   2> 16269 T1251 oascc.ZkStateReader$2.process A cluster state change: WatchedEvent state:SyncConnected type:NodeDataChanged path:/clusterstate.json, has occurred - updating... (live nodes size: 5)
[junit4:junit4]   2> 16294 T1229 oascc.ZkStateReader.updateClusterState Updating cloud state from ZooKeeper... 
[junit4:junit4]   2> 17296 T1229 oascc.ZkStateReader.updateClusterState Updating cloud state from ZooKeeper... 
[junit4:junit4]   2>  C124_STATE=coll:collection1 core:collection1 props:{shard=shard1, roles=null, state=recovering, core=collection1, collection=collection1, node_name=127.0.0.1:52657__pzw, base_url=http://127.0.0.1:52657/_pzw}
[junit4:junit4]   2> 18289 T1322 C124 P52657 oasc.RecoveryStrategy.doRecovery Attempting to PeerSync from http://127.0.0.1:52642/_pzw/collection1/ core=collection1 - recoveringAfterStartup=true
[junit4:junit4]   2> 18289 T1322 C124 P52657 oasu.PeerSync.sync PeerSync: core=collection1 url=http://127.0.0.1:52657/_pzw START replicas=[http://127.0.0.1:52642/_pzw/collection1/] nUpdates=100
[junit4:junit4]   2> 18290 T1322 C124 P52657 oasu.PeerSync.sync WARNING no frame of reference to tell of we've missed updates
[junit4:junit4]   2> 18290 T1322 C124 P52657 oasc.RecoveryStrategy.doRecovery PeerSync Recovery was not successful - trying replication. core=collection1
[junit4:junit4]   2> 18290 T1322 C124 P52657 oasc.RecoveryStrategy.doRecovery Starting Replication Recovery. core=collection1
[junit4:junit4]   2> 18290 T1322 C124 P52657 oasc.RecoveryStrategy.doRecovery Begin buffering updates. core=collection1
[junit4:junit4]   2> 18290 T1322 C124 P52657 oasu.UpdateLog.bufferUpdates Starting to buffer updates. FSUpdateLog{state=ACTIVE, tlog=null}
[junit4:junit4]   2> 18291 T1322 C124 P52657 oasc.RecoveryStrategy.replicate Attempting to replicate from http://127.0.0.1:52642/_pzw/collection1/. core=collection1
[junit4:junit4]   2> 18291 T1322 C124 P52657 oascsi.HttpClientUtil.createClient Creating new http client, config:maxConnections=128&maxConnectionsPerHost=32&followRedirects=false
[junit4:junit4]   2> 18293 T1262 C123 P52642 REQ /get {getVersions=100&distrib=false&wt=javabin&qt=/get&version=2} status=0 QTime=0 
[junit4:junit4]   2> 18298 T1229 oascc.ZkStateReader.updateClusterState Updating cloud state from ZooKeeper... 
[junit4:junit4]   2> 18306 T1260 C123 P52642 oasu.DirectUpdateHandler2.commit start commit{,optimize=false,openSearcher=false,waitSearcher=true,expungeDeletes=false,softCommit=false}
[junit4:junit4]   2> 18316 T1260 C123 P52642 oasc.SolrDeletionPolicy.onCommit SolrDeletionPolicy.onCommit: commits:num=3
[junit4:junit4]   2> 		commit{dir=RateLimitedDirectoryWrapper(NRTCachingDirectory(org.apache.lucene.store.NIOFSDirectory@/usr/home/hudson/hudson-slave/workspace/Lucene-Solr-Tests-4.x-java7/solr/build/solr-core/test/J1/org.apache.solr.cloud.SyncSliceTest-1359781873150/jetty1/index lockFactory=org.apache.lucene.store.NativeFSLockFactory@266e4724; maxCacheMB=48.0 maxMergeSizeMB=4.0)),segFN=segments_2,generation=2,filenames=[segments_2]
[junit4:junit4]   2> 		commit{dir=RateLimitedDirectoryWrapper(NRTCachingDirectory(org.apache.lucene.store.NIOFSDirectory@/usr/home/hudson/hudson-slave/workspace/Lucene-Solr-Tests-4.x-java7/solr/build/solr-core/test/J1/org.apache.solr.cloud.SyncSliceTest-1359781873150/jetty1/index lockFactory=org.apache.lucene.store.NativeFSLockFactory@266e4724; maxCacheMB=48.0 maxMergeSizeMB=4.0)),segFN=segments_3,generation=3,filenames=[segments_3]
[junit4:junit4]   2> 		commit{dir=RateLimitedDirectoryWrapper(NRTCachingDirectory(org.apache.lucene.store.NIOFSDirectory@/usr/home/hudson/hudson-slave/workspace/Lucene-Solr-Tests-4.x-java7/solr/build/solr-core/test/J1/org.apache.solr.cloud.SyncSliceTest-1359781873150/jetty1/index lockFactory=org.apache.lucene.store.NativeFSLockFactory@266e4724; maxCacheMB=48.0 maxMergeSizeMB=4.0)),segFN=segments_4,generation=4,filenames=[segments_4]
[junit4:junit4]   2> 18317 T1260 C123 P52642 oasc.SolrDeletionPolicy.updateCommits newest commit = 4[segments_4]
[junit4:junit4]   2> 18318 T1260 C123 P52642 oasc.CachingDirectoryFactory.close Releasing directory:/usr/home/hudson/hudson-slave/workspace/Lucene-Solr-Tests-4.x-java7/solr/build/solr-core/test/J1/./org.apache.solr.cloud.SyncSliceTest-1359781873150/jetty1
[junit4:junit4]   2> 18318 T1260 C123 P52642 oasu.DirectUpdateHandler2.commit end_commit_flush
[junit4:junit4]   2> 18318 T1260 C123 P52642 /update {waitSearcher=true&openSearcher=false&commit=true&wt=javabin&commit_end_point=true&version=2&softCommit=false} {commit=} 0 12
[junit4:junit4]   2> 18319 T1322 C124 P52657 oash.ReplicationHandler.inform Commits will be reserved for  10000
[junit4:junit4]   2> 18320 T1322 C124 P52657 oash.SnapPuller.<init>  No value set for 'pollInterval'. Timer Task not started.
[junit4:junit4]   2> 18355 T1264 C123 P52642 REQ /replication {command=indexversion&qt=/replication&wt=javabin&version=2} status=0 QTime=0 
[junit4:junit4]   2> 18356 T1322 C124 P52657 oash.SnapPuller.fetchLatestIndex Master's generation: 4
[junit4:junit4]   2> 18357 T1322 C124 P52657 oash.SnapPuller.fetchLatestIndex Slave's generation: 1
[junit4:junit4]   2> 18357 T1322 C124 P52657 oash.SnapPuller.fetchLatestIndex Starting replication process
[junit4:junit4]   2> 18359 T1264 C123 P52642 oasc.CachingDirectoryFactory.close Releasing directory:/usr/home/hudson/hudson-slave/workspace/Lucene-Solr-Tests-4.x-java7/solr/build/solr-core/test/J1/./org.apache.solr.cloud.SyncSliceTest-1359781873150/jetty1
[junit4:junit4]   2> 18360 T1264 C123 P52642 oasc.CachingDirectoryFactory.close Releasing directory:/usr/home/hudson/hudson-slave/workspace/Lucene-Solr-Tests-4.x-java7/solr/build/solr-core/test/J1/./org.apache.solr.cloud.SyncSliceTest-1359781873150/jetty1/index
[junit4:junit4]   2> 18360 T1264 C123 P52642 REQ /replication {command=filelist&qt=/replication&wt=javabin&generation=4&version=2} status=0 QTime=1 
[junit4:junit4]   2> 18361 T1322 C124 P52657 oash.SnapPuller.fetchLatestIndex Number of files in latest index in master: 1
[junit4:junit4]   2> 18363 T1322 C124 P52657 oasc.CachingDirectoryFactory.get return new directory for /usr/home/hudson/hudson-slave/workspace/Lucene-Solr-Tests-4.x-java7/solr/build/solr-core/test/J1/./org.apache.solr.cloud.SyncSliceTest-1359781873150/jetty4/index.20130202135631505 forceNew:false
[junit4:junit4]   2> 18363 T1322 C124 P52657 oasc.CachingDirectoryFactory.close Releasing directory:/usr/home/hudson/hudson-slave/workspace/Lucene-Solr-Tests-4.x-java7/solr/build/solr-core/test/J1/./org.apache.solr.cloud.SyncSliceTest-1359781873150/jetty4
[junit4:junit4]   2> 18364 T1322 C124 P52657 oash.SnapPuller.fetchLatestIndex Starting download to RateLimitedDirectoryWrapper(NRTCachingDirectory(org.apache.lucene.store.NIOFSDirectory@/usr/home/hudson/hudson-slave/workspace/Lucene-Solr-Tests-4.x-java7/solr/build/solr-core/test/J1/org.apache.solr.cloud.SyncSliceTest-1359781873150/jetty4/index.20130202135631505 lockFactory=org.apache.lucene.store.NativeFSLockFactory@1aaed9a9; maxCacheMB=48.0 maxMergeSizeMB=4.0)) fullCopy=true
[junit4:junit4]   2> 18367 T1264 C123 P52642 REQ /replication {file=segments_4&command=filecontent&checksum=true&wt=filestream&qt=/replication&generation=4} status=0 QTime=0 
[junit4:junit4]   2> 18369 T1322 C124 P52657 oasc.CachingDirectoryFactory.close Releasing directory:/usr/home/hudson/hudson-slave/workspace/Lucene-Solr-Tests-4.x-java7/solr/build/solr-core/test/J1/./org.apache.solr.cloud.SyncSliceTest-1359781873150/jetty4/index
[junit4:junit4]   2> 18369 T1322 C124 P52657 oash.SnapPuller.fetchLatestIndex Total time taken for download : 0 secs
[junit4:junit4]   2> 18370 T1322 C124 P52657 oash.SnapPuller.modifyIndexProps New index installed. Updating index properties... index=index.20130202135631505
[junit4:junit4]   2> 18371 T1322 C124 P52657 oasc.CachingDirectoryFactory.close Releasing directory:/usr/home/hudson/hudson-slave/workspace/Lucene-Solr-Tests-4.x-java7/solr/build/solr-core/test/J1/./org.apache.solr.cloud.SyncSliceTest-1359781873150/jetty4
[junit4:junit4]   2> 18372 T1322 C124 P52657 oasc.CachingDirectoryFactory.close Releasing directory:/usr/home/hudson/hudson-slave/workspace/Lucene-Solr-Tests-4.x-java7/solr/build/solr-core/test/J1/./org.apache.solr.cloud.SyncSliceTest-1359781873150/jetty4
[junit4:junit4]   2> 18372 T1322 C124 P52657 oasc.SolrCore.getNewIndexDir New index directory detected: old=./org.apache.solr.cloud.SyncSliceTest-1359781873150/jetty4/index/ new=./org.apache.solr.cloud.SyncSliceTest-1359781873150/jetty4/index.20130202135631505
[junit4:junit4]   2> 18376 T1322 C124 P52657 oasc.SolrDeletionPolicy.onInit SolrDeletionPolicy.onInit: commits:num=1
[junit4:junit4]   2> 		commit{dir=RateLimitedDirectoryWrapper(NRTCachingDirectory(org.apache.lucene.store.NIOFSDirectory@/usr/home/hudson/hudson-slave/workspace/Lucene-Solr-Tests-4.x-java7/solr/build/solr-core/test/J1/org.apache.solr.cloud.SyncSliceTest-1359781873150/jetty4/index.20130202135631505 lockFactory=org.apache.lucene.store.NativeFSLockFactory@1aaed9a9; maxCacheMB=48.0 maxMergeSizeMB=4.0)),segFN=segments_4,generation=4,filenames=[segments_4]
[junit4:junit4]   2> 18376 T1322 C124 P52657 oasc.SolrDeletionPolicy.updateCommits newest commit = 4[segments_4]
[junit4:junit4]   2> 18377 T1322 C124 P52657 oasc.CachingDirectoryFactory.close Releasing directory:/usr/home/hudson/hudson-slave/workspace/Lucene-Solr-Tests-4.x-java7/solr/build/solr-core/test/J1/./org.apache.solr.cloud.SyncSliceTest-1359781873150/jetty4
[junit4:junit4]   2> 18377 T1322 C124 P52657 oasu.DefaultSolrCoreState.newIndexWriter Creating new IndexWriter...
[junit4:junit4]   2> 18378 T1322 C124 P52657 oasu.DefaultSolrCoreState.newIndexWriter Waiting until IndexWriter is unused... core=collection1
[junit4:junit4]   2> 18378 T1322 C124 P52657 oasu.DefaultSolrCoreState.newIndexWriter Rollback old IndexWriter... core=collection1
[junit4:junit4]   2> 18379 T1322 C124 P52657 oasc.CachingDirectoryFactory.close Releasing directory:/usr/home/hudson/hudson-slave/workspace/Lucene-Solr-Tests-4.x-java7/solr/build/solr-core/test/J1/./org.apache.solr.cloud.SyncSliceTest-1359781873150/jetty4/index.20130202135631505
[junit4:junit4]   2> 18379 T1322 C124 P52657 oasc.CachingDirectoryFactory.close Releasing directory:/usr/home/hudson/hudson-slave/workspace/Lucene-Solr-Tests-4.x-java7/solr/build/solr-core/test/J1/./org.apache.solr.cloud.SyncSliceTest-1359781873150/jetty4
[junit4:junit4]   2> 18383 T1322 C124 P52657 oasc.SolrDeletionPolicy.onInit SolrDeletionPolicy.onInit: commits:num=1
[junit4:junit4]   2> 		commit{dir=RateLimitedDirectoryWrapper(NRTCachingDirectory(org.apache.lucene.store.NIOFSDirectory@/usr/home/hudson/hudson-slave/workspace/Lucene-Solr-Tests-4.x-java7/solr/build/solr-core/test/J1/org.apache.solr.cloud.SyncSliceTest-1359781873150/jetty4/index.20130202135631505 lockFactory=org.apache.lucene.store.NativeFSLockFactory@1aaed9a9; maxCacheMB=48.0 maxMergeSizeMB=4.0)),segFN=segments_4,generation=4,filenames=[segments_4]
[junit4:junit4]   2> 18383 T1322 C124 P52657 oasc.SolrDeletionPolicy.updateCommits newest commit = 4[segments_4]
[junit4:junit4]   2> 18383 T1322 C124 P52657 oasu.DefaultSolrCoreState.newIndexWriter New IndexWriter is ready to be used.
[junit4:junit4]   2> 18384 T1322 C124 P52657 oasc.CachingDirectoryFactory.close Releasing directory:/usr/home/hudson/hudson-slave/workspace/Lucene-Solr-Tests-4.x-java7/solr/build/solr-core/test/J1/./org.apache.solr.cloud.SyncSliceTest-1359781873150/jetty4
[junit4:junit4]   2> 18384 T1322 C124 P52657 oass.SolrIndexSearcher.<init> Opening Searcher@4d9d9a23 main
[junit4:junit4]   2> 18386 T1321 oasc.SolrCore.registerSearcher [collection1] Registered new searcher Searcher@4d9d9a23 main{Standar

[...truncated too long message...]

1229 oash.SnapPuller$2.postClose removing old index directory RateLimitedDirectoryWrapper(NRTCachingDirectory(org.apache.lucene.store.NIOFSDirectory@/usr/home/hudson/hudson-slave/workspace/Lucene-Solr-Tests-4.x-java7/solr/build/solr-core/test/J1/org.apache.solr.cloud.SyncSliceTest-1359781873150/jetty4/index lockFactory=org.apache.lucene.store.NativeFSLockFactory@3c43372a; maxCacheMB=48.0 maxMergeSizeMB=4.0))
[junit4:junit4]   2> 142519 T1229 oasc.CachingDirectoryFactory.close Closing directory when closing factory:/usr/home/hudson/hudson-slave/workspace/Lucene-Solr-Tests-4.x-java7/solr/build/solr-core/test/J1/./org.apache.solr.cloud.SyncSliceTest-1359781873150/jetty4/index
[junit4:junit4]   2> 142520 T1229 oasc.CachingDirectoryFactory.closeDirectory Closing directory:/usr/home/hudson/hudson-slave/workspace/Lucene-Solr-Tests-4.x-java7/solr/build/solr-core/test/J1/./org.apache.solr.cloud.SyncSliceTest-1359781873150/jetty4/index
[junit4:junit4]   2> 142520 T1229 oasc.CachingDirectoryFactory.close Closing directory when closing factory:/usr/home/hudson/hudson-slave/workspace/Lucene-Solr-Tests-4.x-java7/solr/build/solr-core/test/J1/./org.apache.solr.cloud.SyncSliceTest-1359781873150/jetty4
[junit4:junit4]   2> 142521 T1229 oasc.CachingDirectoryFactory.closeDirectory Closing directory:/usr/home/hudson/hudson-slave/workspace/Lucene-Solr-Tests-4.x-java7/solr/build/solr-core/test/J1/./org.apache.solr.cloud.SyncSliceTest-1359781873150/jetty4
[junit4:junit4]   2> 142622 T1317 oaz.ClientCnxn$EventThread.run EventThread shut down
[junit4:junit4]   2> 142622 T1229 oaz.ZooKeeper.close Session: 0x13c9950c607000c closed
[junit4:junit4]   2> 142624 T1229 oejsh.ContextHandler.doStop stopped o.e.j.s.ServletContextHandler{/_pzw,null}
[junit4:junit4]   2> 142852 T1229 oas.SolrTestCaseJ4.tearDown ###Ending testDistribSearch
[junit4:junit4]   1> client port:0.0.0.0/0.0.0.0:0
[junit4:junit4]   2> NOTE: reproduce with: ant test  -Dtestcase=SyncSliceTest -Dtests.method=testDistribSearch -Dtests.seed=12F5F8D07C79C7C8 -Dtests.multiplier=3 -Dtests.slow=true -Dtests.locale=ja -Dtests.timezone=Australia/Eucla -Dtests.file.encoding=US-ASCII
[junit4:junit4] FAILURE  143s J1 | SyncSliceTest.testDistribSearch <<<
[junit4:junit4]    > Throwable #1: java.lang.AssertionError: shard1 should have just been set up to be inconsistent - but it's still consistent
[junit4:junit4]    > 	at __randomizedtesting.SeedInfo.seed([12F5F8D07C79C7C8:931376C80B26A7F4]:0)
[junit4:junit4]    > 	at org.junit.Assert.fail(Assert.java:93)
[junit4:junit4]    > 	at org.junit.Assert.assertTrue(Assert.java:43)
[junit4:junit4]    > 	at org.junit.Assert.assertNotNull(Assert.java:526)
[junit4:junit4]    > 	at org.apache.solr.cloud.SyncSliceTest.doTest(SyncSliceTest.java:214)
[junit4:junit4]    > 	at org.apache.solr.BaseDistributedSearchTestCase.testDistribSearch(BaseDistributedSearchTestCase.java:794)
[junit4:junit4]    > 	at sun.reflect.NativeMethodAccessorImpl.invoke0(Native Method)
[junit4:junit4]    > 	at sun.reflect.NativeMethodAccessorImpl.invoke(NativeMethodAccessorImpl.java:57)
[junit4:junit4]    > 	at sun.reflect.DelegatingMethodAccessorImpl.invoke(DelegatingMethodAccessorImpl.java:43)
[junit4:junit4]    > 	at java.lang.reflect.Method.invoke(Method.java:601)
[junit4:junit4]    > 	at com.carrotsearch.randomizedtesting.RandomizedRunner.invoke(RandomizedRunner.java:1559)
[junit4:junit4]    > 	at com.carrotsearch.randomizedtesting.RandomizedRunner.access$600(RandomizedRunner.java:79)
[junit4:junit4]    > 	at com.carrotsearch.randomizedtesting.RandomizedRunner$6.evaluate(RandomizedRunner.java:737)
[junit4:junit4]    > 	at com.carrotsearch.randomizedtesting.RandomizedRunner$7.evaluate(RandomizedRunner.java:773)
[junit4:junit4]    > 	at com.carrotsearch.randomizedtesting.RandomizedRunner$8.evaluate(RandomizedRunner.java:787)
[junit4:junit4]    > 	at com.carrotsearch.randomizedtesting.rules.SystemPropertiesRestoreRule$1.evaluate(SystemPropertiesRestoreRule.java:53)
[junit4:junit4]    > 	at org.apache.lucene.util.TestRuleSetupTeardownChained$1.evaluate(TestRuleSetupTeardownChained.java:50)
[junit4:junit4]    > 	at org.apache.lucene.util.TestRuleFieldCacheSanity$1.evaluate(TestRuleFieldCacheSanity.java:51)
[junit4:junit4]    > 	at org.apache.lucene.util.AbstractBeforeAfterRule$1.evaluate(AbstractBeforeAfterRule.java:46)
[junit4:junit4]    > 	at com.carrotsearch.randomizedtesting.rules.SystemPropertiesInvariantRule$1.evaluate(SystemPropertiesInvariantRule.java:55)
[junit4:junit4]    > 	at org.apache.lucene.util.TestRuleThreadAndTestName$1.evaluate(TestRuleThreadAndTestName.java:49)
[junit4:junit4]    > 	at org.apache.lucene.util.TestRuleIgnoreAfterMaxFailures$1.evaluate(TestRuleIgnoreAfterMaxFailures.java:70)
[junit4:junit4]    > 	at org.apache.lucene.util.TestRuleMarkFailure$1.evaluate(TestRuleMarkFailure.java:48)
[junit4:junit4]    > 	at com.carrotsearch.randomizedtesting.rules.StatementAdapter.evaluate(StatementAdapter.java:36)
[junit4:junit4]    > 	at com.carrotsearch.randomizedtesting.ThreadLeakControl$StatementRunner.run(ThreadLeakControl.java:358)
[junit4:junit4]    > 	at com.carrotsearch.randomizedtesting.ThreadLeakControl.forkTimeoutingTask(ThreadLeakControl.java:782)
[junit4:junit4]    > 	at com.carrotsearch.randomizedtesting.ThreadLeakControl$3.evaluate(ThreadLeakControl.java:442)
[junit4:junit4]    > 	at com.carrotsearch.randomizedtesting.RandomizedRunner.runSingleTest(RandomizedRunner.java:746)
[junit4:junit4]    > 	at com.carrotsearch.randomizedtesting.RandomizedRunner$3.evaluate(RandomizedRunner.java:648)
[junit4:junit4]    > 	at com.carrotsearch.randomizedtesting.RandomizedRunner$4.evaluate(RandomizedRunner.java:682)
[junit4:junit4]    > 	at com.carrotsearch.randomizedtesting.RandomizedRunner$5.evaluate(RandomizedRunner.java:693)
[junit4:junit4]    > 	at com.carrotsearch.randomizedtesting.rules.StatementAdapter.evaluate(StatementAdapter.java:36)
[junit4:junit4]    > 	at com.carrotsearch.randomizedtesting.rules.SystemPropertiesRestoreRule$1.evaluate(SystemPropertiesRestoreRule.java:53)
[junit4:junit4]    > 	at org.apache.lucene.util.AbstractBeforeAfterRule$1.evaluate(AbstractBeforeAfterRule.java:46)
[junit4:junit4]    > 	at org.apache.lucene.util.TestRuleStoreClassName$1.evaluate(TestRuleStoreClassName.java:42)
[junit4:junit4]    > 	at com.carrotsearch.randomizedtesting.rules.SystemPropertiesInvariantRule$1.evaluate(SystemPropertiesInvariantRule.java:55)
[junit4:junit4]    > 	at com.carrotsearch.randomizedtesting.rules.NoShadowingOrOverridesOnMethodsRule$1.evaluate(NoShadowingOrOverridesOnMethodsRule.java:39)
[junit4:junit4]    > 	at com.carrotsearch.randomizedtesting.rules.NoShadowingOrOverridesOnMethodsRule$1.evaluate(NoShadowingOrOverridesOnMethodsRule.java:39)
[junit4:junit4]    > 	at com.carrotsearch.randomizedtesting.rules.StatementAdapter.evaluate(StatementAdapter.java:36)
[junit4:junit4]    > 	at org.apache.lucene.util.TestRuleAssertionsRequired$1.evaluate(TestRuleAssertionsRequired.java:43)
[junit4:junit4]    > 	at org.apache.lucene.util.TestRuleMarkFailure$1.evaluate(TestRuleMarkFailure.java:48)
[junit4:junit4]    > 	at org.apache.lucene.util.TestRuleIgnoreAfterMaxFailures$1.evaluate(TestRuleIgnoreAfterMaxFailures.java:70)
[junit4:junit4]    > 	at org.apache.lucene.util.TestRuleIgnoreTestSuites$1.evaluate(TestRuleIgnoreTestSuites.java:55)
[junit4:junit4]    > 	at com.carrotsearch.randomizedtesting.rules.StatementAdapter.evaluate(StatementAdapter.java:36)
[junit4:junit4]    > 	at com.carrotsearch.randomizedtesting.ThreadLeakControl$StatementRunner.run(ThreadLeakControl.java:358)
[junit4:junit4]    > 	at java.lang.Thread.run(Thread.java:722)
[junit4:junit4]   2> 143053 T1229 oas.SolrTestCaseJ4.deleteCore ###deleteCore
[junit4:junit4]   2> NOTE: test params are: codec=Lucene40, sim=RandomSimilarityProvider(queryNorm=true,coord=yes): {}, locale=ja, timezone=Australia/Eucla
[junit4:junit4]   2> NOTE: FreeBSD 9.0-RELEASE amd64/Oracle Corporation 1.7.0_09 (64-bit)/cpus=16,threads=1,free=438923192,total=536870912
[junit4:junit4]   2> NOTE: All tests run in this JVM: [StatsComponentTest, TestQueryUtils, TestMergePolicyConfig, ClusterStateTest, LukeRequestHandlerTest, CollectionsAPIDistributedZkTest, SuggesterTSTTest, TimeZoneUtilsTest, TermVectorComponentDistributedTest, EchoParamsTest, UpdateParamsTest, TestAnalyzedSuggestions, IndexSchemaTest, TestCSVResponseWriter, DocumentAnalysisRequestHandlerTest, TestValueSourceCache, TestDocSet, OverseerCollectionProcessorTest, TestFunctionQuery, LeaderElectionTest, TestPropInjectDefaults, ReturnFieldsTest, IndexReaderFactoryTest, TestStressLucene, BasicDistributedZk2Test, PrimitiveFieldTypeTest, BasicFunctionalityTest, TestPostingsSolrHighlighter, RequiredFieldsTest, TestBM25SimilarityFactory, TestRTGBase, SyncSliceTest]
[junit4:junit4] Completed on J1 in 143.09s, 1 test, 1 failure <<< FAILURES!

[...truncated 490 lines...]
BUILD FAILED
/usr/home/hudson/hudson-slave/workspace/Lucene-Solr-Tests-4.x-java7/build.xml:346: The following error occurred while executing this line:
/usr/home/hudson/hudson-slave/workspace/Lucene-Solr-Tests-4.x-java7/build.xml:39: The following error occurred while executing this line:
/usr/home/hudson/hudson-slave/workspace/Lucene-Solr-Tests-4.x-java7/solr/build.xml:178: The following error occurred while executing this line:
/usr/home/hudson/hudson-slave/workspace/Lucene-Solr-Tests-4.x-java7/solr/common-build.xml:428: The following error occurred while executing this line:
/usr/home/hudson/hudson-slave/workspace/Lucene-Solr-Tests-4.x-java7/lucene/common-build.xml:1176: The following error occurred while executing this line:
/usr/home/hudson/hudson-slave/workspace/Lucene-Solr-Tests-4.x-java7/lucene/common-build.xml:841: There were test failures: 250 suites, 1041 tests, 1 failure, 23 ignored (5 assumptions)

Total time: 36 minutes 22 seconds
Build step 'Invoke Ant' marked build as failure
Archiving artifacts
Recording test results
Email was triggered for: Failure
Sending email for trigger: Failure



Mime
View raw message