lucene-dev mailing list archives

Site index · List index
Message view « Date » · « Thread »
Top « Date » · « Thread »
From Apache Jenkins Server <jenk...@builds.apache.org>
Subject [JENKINS] Lucene-Solr-Tests-trunk-java7 - Build # 3736 - Failure
Date Fri, 15 Feb 2013 18:19:22 GMT
Build: https://builds.apache.org/job/Lucene-Solr-Tests-trunk-java7/3736/

2 tests failed.
REGRESSION:  org.apache.solr.cloud.BasicDistributedZkTest.testDistribSearch

Error Message:
Timeout occured while waiting response from server at: http://127.0.0.1:24161/bclr/l/collection1

Stack Trace:
org.apache.solr.client.solrj.SolrServerException: Timeout occured while waiting response from server at: http://127.0.0.1:24161/bclr/l/collection1
	at __randomizedtesting.SeedInfo.seed([914A7CA7608FC4F5:10ACF2BF17D0A4C9]:0)
	at org.apache.solr.client.solrj.impl.HttpSolrServer.request(HttpSolrServer.java:412)
	at org.apache.solr.client.solrj.impl.HttpSolrServer.request(HttpSolrServer.java:181)
	at org.apache.solr.client.solrj.request.AbstractUpdateRequest.process(AbstractUpdateRequest.java:117)
	at org.apache.solr.client.solrj.SolrServer.commit(SolrServer.java:168)
	at org.apache.solr.client.solrj.SolrServer.commit(SolrServer.java:146)
	at org.apache.solr.cloud.BasicDistributedZkTest.testUpdateProcessorsRunOnlyOnce(BasicDistributedZkTest.java:889)
	at org.apache.solr.cloud.BasicDistributedZkTest.doTest(BasicDistributedZkTest.java:334)
	at org.apache.solr.BaseDistributedSearchTestCase.testDistribSearch(BaseDistributedSearchTestCase.java:794)
	at sun.reflect.NativeMethodAccessorImpl.invoke0(Native Method)
	at sun.reflect.NativeMethodAccessorImpl.invoke(NativeMethodAccessorImpl.java:57)
	at sun.reflect.DelegatingMethodAccessorImpl.invoke(DelegatingMethodAccessorImpl.java:43)
	at java.lang.reflect.Method.invoke(Method.java:601)
	at com.carrotsearch.randomizedtesting.RandomizedRunner.invoke(RandomizedRunner.java:1559)
	at com.carrotsearch.randomizedtesting.RandomizedRunner.access$600(RandomizedRunner.java:79)
	at com.carrotsearch.randomizedtesting.RandomizedRunner$6.evaluate(RandomizedRunner.java:737)
	at com.carrotsearch.randomizedtesting.RandomizedRunner$7.evaluate(RandomizedRunner.java:773)
	at com.carrotsearch.randomizedtesting.RandomizedRunner$8.evaluate(RandomizedRunner.java:787)
	at com.carrotsearch.randomizedtesting.rules.SystemPropertiesRestoreRule$1.evaluate(SystemPropertiesRestoreRule.java:53)
	at org.apache.lucene.util.TestRuleSetupTeardownChained$1.evaluate(TestRuleSetupTeardownChained.java:50)
	at org.apache.lucene.util.TestRuleFieldCacheSanity$1.evaluate(TestRuleFieldCacheSanity.java:51)
	at org.apache.lucene.util.AbstractBeforeAfterRule$1.evaluate(AbstractBeforeAfterRule.java:46)
	at com.carrotsearch.randomizedtesting.rules.SystemPropertiesInvariantRule$1.evaluate(SystemPropertiesInvariantRule.java:55)
	at org.apache.lucene.util.TestRuleThreadAndTestName$1.evaluate(TestRuleThreadAndTestName.java:49)
	at org.apache.lucene.util.TestRuleIgnoreAfterMaxFailures$1.evaluate(TestRuleIgnoreAfterMaxFailures.java:70)
	at org.apache.lucene.util.TestRuleMarkFailure$1.evaluate(TestRuleMarkFailure.java:48)
	at com.carrotsearch.randomizedtesting.rules.StatementAdapter.evaluate(StatementAdapter.java:36)
	at com.carrotsearch.randomizedtesting.ThreadLeakControl$StatementRunner.run(ThreadLeakControl.java:358)
	at com.carrotsearch.randomizedtesting.ThreadLeakControl.forkTimeoutingTask(ThreadLeakControl.java:782)
	at com.carrotsearch.randomizedtesting.ThreadLeakControl$3.evaluate(ThreadLeakControl.java:442)
	at com.carrotsearch.randomizedtesting.RandomizedRunner.runSingleTest(RandomizedRunner.java:746)
	at com.carrotsearch.randomizedtesting.RandomizedRunner$3.evaluate(RandomizedRunner.java:648)
	at com.carrotsearch.randomizedtesting.RandomizedRunner$4.evaluate(RandomizedRunner.java:682)
	at com.carrotsearch.randomizedtesting.RandomizedRunner$5.evaluate(RandomizedRunner.java:693)
	at com.carrotsearch.randomizedtesting.rules.StatementAdapter.evaluate(StatementAdapter.java:36)
	at com.carrotsearch.randomizedtesting.rules.SystemPropertiesRestoreRule$1.evaluate(SystemPropertiesRestoreRule.java:53)
	at org.apache.lucene.util.AbstractBeforeAfterRule$1.evaluate(AbstractBeforeAfterRule.java:46)
	at org.apache.lucene.util.TestRuleStoreClassName$1.evaluate(TestRuleStoreClassName.java:42)
	at com.carrotsearch.randomizedtesting.rules.SystemPropertiesInvariantRule$1.evaluate(SystemPropertiesInvariantRule.java:55)
	at com.carrotsearch.randomizedtesting.rules.NoShadowingOrOverridesOnMethodsRule$1.evaluate(NoShadowingOrOverridesOnMethodsRule.java:39)
	at com.carrotsearch.randomizedtesting.rules.NoShadowingOrOverridesOnMethodsRule$1.evaluate(NoShadowingOrOverridesOnMethodsRule.java:39)
	at com.carrotsearch.randomizedtesting.rules.StatementAdapter.evaluate(StatementAdapter.java:36)
	at org.apache.lucene.util.TestRuleAssertionsRequired$1.evaluate(TestRuleAssertionsRequired.java:43)
	at org.apache.lucene.util.TestRuleMarkFailure$1.evaluate(TestRuleMarkFailure.java:48)
	at org.apache.lucene.util.TestRuleIgnoreAfterMaxFailures$1.evaluate(TestRuleIgnoreAfterMaxFailures.java:70)
	at org.apache.lucene.util.TestRuleIgnoreTestSuites$1.evaluate(TestRuleIgnoreTestSuites.java:55)
	at com.carrotsearch.randomizedtesting.rules.StatementAdapter.evaluate(StatementAdapter.java:36)
	at com.carrotsearch.randomizedtesting.ThreadLeakControl$StatementRunner.run(ThreadLeakControl.java:358)
	at java.lang.Thread.run(Thread.java:722)
Caused by: java.net.SocketTimeoutException: Read timed out
	at java.net.SocketInputStream.socketRead0(Native Method)
	at java.net.SocketInputStream.read(SocketInputStream.java:150)
	at java.net.SocketInputStream.read(SocketInputStream.java:121)
	at org.apache.http.impl.io.AbstractSessionInputBuffer.fillBuffer(AbstractSessionInputBuffer.java:166)
	at org.apache.http.impl.io.SocketInputBuffer.fillBuffer(SocketInputBuffer.java:90)
	at org.apache.http.impl.io.AbstractSessionInputBuffer.readLine(AbstractSessionInputBuffer.java:281)
	at org.apache.http.impl.conn.DefaultHttpResponseParser.parseHead(DefaultHttpResponseParser.java:92)
	at org.apache.http.impl.conn.DefaultHttpResponseParser.parseHead(DefaultHttpResponseParser.java:62)
	at org.apache.http.impl.io.AbstractMessageParser.parse(AbstractMessageParser.java:254)
	at org.apache.http.impl.AbstractHttpClientConnection.receiveResponseHeader(AbstractHttpClientConnection.java:289)
	at org.apache.http.impl.conn.DefaultClientConnection.receiveResponseHeader(DefaultClientConnection.java:252)
	at org.apache.http.impl.conn.ManagedClientConnectionImpl.receiveResponseHeader(ManagedClientConnectionImpl.java:191)
	at org.apache.http.protocol.HttpRequestExecutor.doReceiveResponse(HttpRequestExecutor.java:300)
	at org.apache.http.protocol.HttpRequestExecutor.execute(HttpRequestExecutor.java:127)
	at org.apache.http.impl.client.DefaultRequestDirector.tryExecute(DefaultRequestDirector.java:717)
	at org.apache.http.impl.client.DefaultRequestDirector.execute(DefaultRequestDirector.java:522)
	at org.apache.http.impl.client.AbstractHttpClient.execute(AbstractHttpClient.java:906)
	at org.apache.http.impl.client.AbstractHttpClient.execute(AbstractHttpClient.java:805)
	at org.apache.http.impl.client.AbstractHttpClient.execute(AbstractHttpClient.java:784)
	at org.apache.solr.client.solrj.impl.HttpSolrServer.request(HttpSolrServer.java:353)
	... 47 more


REGRESSION:  org.apache.solr.cloud.SyncSliceTest.testDistribSearch

Error Message:
Test Setup Failure: shard1 should have just been set up to be inconsistent - but it's still consistent. Leader:http://127.0.0.1:47089/collection1skip list:[org.apache.solr.cloud.AbstractFullDistribZkTestBase$CloudJettyRunner@591db218, org.apache.solr.cloud.AbstractFullDistribZkTestBase$CloudJettyRunner@2133b6a1]

Stack Trace:
java.lang.AssertionError: Test Setup Failure: shard1 should have just been set up to be inconsistent - but it's still consistent. Leader:http://127.0.0.1:47089/collection1skip list:[org.apache.solr.cloud.AbstractFullDistribZkTestBase$CloudJettyRunner@591db218, org.apache.solr.cloud.AbstractFullDistribZkTestBase$CloudJettyRunner@2133b6a1]
	at __randomizedtesting.SeedInfo.seed([914A7CA7608FC4F5:10ACF2BF17D0A4C9]:0)
	at org.junit.Assert.fail(Assert.java:93)
	at org.junit.Assert.assertTrue(Assert.java:43)
	at org.junit.Assert.assertNotNull(Assert.java:526)
	at org.apache.solr.cloud.SyncSliceTest.doTest(SyncSliceTest.java:216)
	at org.apache.solr.BaseDistributedSearchTestCase.testDistribSearch(BaseDistributedSearchTestCase.java:794)
	at sun.reflect.NativeMethodAccessorImpl.invoke0(Native Method)
	at sun.reflect.NativeMethodAccessorImpl.invoke(NativeMethodAccessorImpl.java:57)
	at sun.reflect.DelegatingMethodAccessorImpl.invoke(DelegatingMethodAccessorImpl.java:43)
	at java.lang.reflect.Method.invoke(Method.java:601)
	at com.carrotsearch.randomizedtesting.RandomizedRunner.invoke(RandomizedRunner.java:1559)
	at com.carrotsearch.randomizedtesting.RandomizedRunner.access$600(RandomizedRunner.java:79)
	at com.carrotsearch.randomizedtesting.RandomizedRunner$6.evaluate(RandomizedRunner.java:737)
	at com.carrotsearch.randomizedtesting.RandomizedRunner$7.evaluate(RandomizedRunner.java:773)
	at com.carrotsearch.randomizedtesting.RandomizedRunner$8.evaluate(RandomizedRunner.java:787)
	at com.carrotsearch.randomizedtesting.rules.SystemPropertiesRestoreRule$1.evaluate(SystemPropertiesRestoreRule.java:53)
	at org.apache.lucene.util.TestRuleSetupTeardownChained$1.evaluate(TestRuleSetupTeardownChained.java:50)
	at org.apache.lucene.util.TestRuleFieldCacheSanity$1.evaluate(TestRuleFieldCacheSanity.java:51)
	at org.apache.lucene.util.AbstractBeforeAfterRule$1.evaluate(AbstractBeforeAfterRule.java:46)
	at com.carrotsearch.randomizedtesting.rules.SystemPropertiesInvariantRule$1.evaluate(SystemPropertiesInvariantRule.java:55)
	at org.apache.lucene.util.TestRuleThreadAndTestName$1.evaluate(TestRuleThreadAndTestName.java:49)
	at org.apache.lucene.util.TestRuleIgnoreAfterMaxFailures$1.evaluate(TestRuleIgnoreAfterMaxFailures.java:70)
	at org.apache.lucene.util.TestRuleMarkFailure$1.evaluate(TestRuleMarkFailure.java:48)
	at com.carrotsearch.randomizedtesting.rules.StatementAdapter.evaluate(StatementAdapter.java:36)
	at com.carrotsearch.randomizedtesting.ThreadLeakControl$StatementRunner.run(ThreadLeakControl.java:358)
	at com.carrotsearch.randomizedtesting.ThreadLeakControl.forkTimeoutingTask(ThreadLeakControl.java:782)
	at com.carrotsearch.randomizedtesting.ThreadLeakControl$3.evaluate(ThreadLeakControl.java:442)
	at com.carrotsearch.randomizedtesting.RandomizedRunner.runSingleTest(RandomizedRunner.java:746)
	at com.carrotsearch.randomizedtesting.RandomizedRunner$3.evaluate(RandomizedRunner.java:648)
	at com.carrotsearch.randomizedtesting.RandomizedRunner$4.evaluate(RandomizedRunner.java:682)
	at com.carrotsearch.randomizedtesting.RandomizedRunner$5.evaluate(RandomizedRunner.java:693)
	at com.carrotsearch.randomizedtesting.rules.StatementAdapter.evaluate(StatementAdapter.java:36)
	at com.carrotsearch.randomizedtesting.rules.SystemPropertiesRestoreRule$1.evaluate(SystemPropertiesRestoreRule.java:53)
	at org.apache.lucene.util.AbstractBeforeAfterRule$1.evaluate(AbstractBeforeAfterRule.java:46)
	at org.apache.lucene.util.TestRuleStoreClassName$1.evaluate(TestRuleStoreClassName.java:42)
	at com.carrotsearch.randomizedtesting.rules.SystemPropertiesInvariantRule$1.evaluate(SystemPropertiesInvariantRule.java:55)
	at com.carrotsearch.randomizedtesting.rules.NoShadowingOrOverridesOnMethodsRule$1.evaluate(NoShadowingOrOverridesOnMethodsRule.java:39)
	at com.carrotsearch.randomizedtesting.rules.NoShadowingOrOverridesOnMethodsRule$1.evaluate(NoShadowingOrOverridesOnMethodsRule.java:39)
	at com.carrotsearch.randomizedtesting.rules.StatementAdapter.evaluate(StatementAdapter.java:36)
	at org.apache.lucene.util.TestRuleAssertionsRequired$1.evaluate(TestRuleAssertionsRequired.java:43)
	at org.apache.lucene.util.TestRuleMarkFailure$1.evaluate(TestRuleMarkFailure.java:48)
	at org.apache.lucene.util.TestRuleIgnoreAfterMaxFailures$1.evaluate(TestRuleIgnoreAfterMaxFailures.java:70)
	at org.apache.lucene.util.TestRuleIgnoreTestSuites$1.evaluate(TestRuleIgnoreTestSuites.java:55)
	at com.carrotsearch.randomizedtesting.rules.StatementAdapter.evaluate(StatementAdapter.java:36)
	at com.carrotsearch.randomizedtesting.ThreadLeakControl$StatementRunner.run(ThreadLeakControl.java:358)
	at java.lang.Thread.run(Thread.java:722)




Build Log:
[...truncated 9484 lines...]
[junit4:junit4] Suite: org.apache.solr.cloud.SyncSliceTest
[junit4:junit4]   2> 0 T3910 oas.BaseDistributedSearchTestCase.initHostContext Setting hostContext system property: /
[junit4:junit4]   2> 5 T3910 oas.SolrTestCaseJ4.setUp ###Starting testDistribSearch
[junit4:junit4]   2> Creating dataDir: /usr/home/hudson/hudson-slave/workspace/Lucene-Solr-Tests-trunk-java7/solr/build/solr-core/test/J0/./solrtest-SyncSliceTest-1360950285257
[junit4:junit4]   2> 6 T3910 oasc.ZkTestServer.run STARTING ZK TEST SERVER
[junit4:junit4]   2> 7 T3911 oasc.ZkTestServer$ZKServerMain.runFromConfig Starting server
[junit4:junit4]   2> 10 T3911 oazs.ZooKeeperServer.setTickTime tickTime set to 1000
[junit4:junit4]   2> 10 T3911 oazs.ZooKeeperServer.setMinSessionTimeout minSessionTimeout set to -1
[junit4:junit4]   2> 10 T3911 oazs.ZooKeeperServer.setMaxSessionTimeout maxSessionTimeout set to -1
[junit4:junit4]   2> 11 T3911 oazs.NIOServerCnxnFactory.configure binding to port 0.0.0.0/0.0.0.0:0
[junit4:junit4]   2> 12 T3911 oazsp.FileTxnSnapLog.save Snapshotting: 0x0 to /usr/home/hudson/hudson-slave/workspace/Lucene-Solr-Tests-trunk-java7/solr/build/solr-core/test/J0/./org.apache.solr.cloud.SyncSliceTest-1360950285256/zookeeper/server1/data/version-2/snapshot.0
[junit4:junit4]   2> 108 T3910 oasc.ZkTestServer.run start zk server on port:25803
[junit4:junit4]   2> 108 T3910 oaz.ZooKeeper.<init> Initiating client connection, connectString=127.0.0.1:25803 sessionTimeout=10000 watcher=org.apache.solr.common.cloud.ConnectionManager@6e78de79
[junit4:junit4]   2> 109 T3910 oascc.ConnectionManager.waitForConnected Waiting for client to connect to ZooKeeper
[junit4:junit4]   2> 109 T3916 oaz.ClientCnxn$SendThread.logStartConnect Opening socket connection to server localhost/127.0.0.1:25803. Will not attempt to authenticate using SASL (access denied ("javax.security.auth.AuthPermission" "getLoginConfiguration"))
[junit4:junit4]   2> 110 T3916 oaz.ClientCnxn$SendThread.primeConnection Socket connection established to localhost/127.0.0.1:25803, initiating session
[junit4:junit4]   2> 110 T3912 oazs.NIOServerCnxnFactory.run Accepted socket connection from /140.211.11.196:30443
[junit4:junit4]   2> 111 T3912 oazs.ZooKeeperServer.processConnectRequest Client attempting to establish new session at /140.211.11.196:30443
[junit4:junit4]   2> 111 T3914 oazsp.FileTxnLog.append Creating new log file: log.1
[junit4:junit4]   2> 113 T3914 oazs.ZooKeeperServer.finishSessionInit Established session 0x13cdef553cf0000 with negotiated timeout 10000 for client /140.211.11.196:30443
[junit4:junit4]   2> 113 T3916 oaz.ClientCnxn$SendThread.onConnected Session establishment complete on server localhost/127.0.0.1:25803, sessionid = 0x13cdef553cf0000, negotiated timeout = 10000
[junit4:junit4]   2> 114 T3917 oascc.ConnectionManager.process Watcher org.apache.solr.common.cloud.ConnectionManager@6e78de79 name:ZooKeeperConnection Watcher:127.0.0.1:25803 got event WatchedEvent state:SyncConnected type:None path:null path:null type:None
[junit4:junit4]   2> 114 T3910 oascc.ConnectionManager.waitForConnected Client is connected to ZooKeeper
[junit4:junit4]   2> 114 T3910 oascc.SolrZkClient.makePath makePath: /solr
[junit4:junit4]   2> 117 T3915 oazs.PrepRequestProcessor.pRequest2Txn Processed session termination for sessionid: 0x13cdef553cf0000
[junit4:junit4]   2> 131 T3917 oaz.ClientCnxn$EventThread.run EventThread shut down
[junit4:junit4]   2> 131 T3912 oazs.NIOServerCnxn.closeSock Closed socket connection for client /140.211.11.196:30443 which had sessionid 0x13cdef553cf0000
[junit4:junit4]   2> 131 T3910 oaz.ZooKeeper.close Session: 0x13cdef553cf0000 closed
[junit4:junit4]   2> 132 T3910 oaz.ZooKeeper.<init> Initiating client connection, connectString=127.0.0.1:25803/solr sessionTimeout=10000 watcher=org.apache.solr.common.cloud.ConnectionManager@6793527
[junit4:junit4]   2> 133 T3910 oascc.ConnectionManager.waitForConnected Waiting for client to connect to ZooKeeper
[junit4:junit4]   2> 133 T3918 oaz.ClientCnxn$SendThread.logStartConnect Opening socket connection to server localhost/127.0.0.1:25803. Will not attempt to authenticate using SASL (access denied ("javax.security.auth.AuthPermission" "getLoginConfiguration"))
[junit4:junit4]   2> 134 T3918 oaz.ClientCnxn$SendThread.primeConnection Socket connection established to localhost/127.0.0.1:25803, initiating session
[junit4:junit4]   2> 134 T3912 oazs.NIOServerCnxnFactory.run Accepted socket connection from /140.211.11.196:46371
[junit4:junit4]   2> 134 T3912 oazs.ZooKeeperServer.processConnectRequest Client attempting to establish new session at /140.211.11.196:46371
[junit4:junit4]   2> 135 T3914 oazs.ZooKeeperServer.finishSessionInit Established session 0x13cdef553cf0001 with negotiated timeout 10000 for client /140.211.11.196:46371
[junit4:junit4]   2> 135 T3918 oaz.ClientCnxn$SendThread.onConnected Session establishment complete on server localhost/127.0.0.1:25803, sessionid = 0x13cdef553cf0001, negotiated timeout = 10000
[junit4:junit4]   2> 136 T3919 oascc.ConnectionManager.process Watcher org.apache.solr.common.cloud.ConnectionManager@6793527 name:ZooKeeperConnection Watcher:127.0.0.1:25803/solr got event WatchedEvent state:SyncConnected type:None path:null path:null type:None
[junit4:junit4]   2> 136 T3910 oascc.ConnectionManager.waitForConnected Client is connected to ZooKeeper
[junit4:junit4]   2> 136 T3910 oascc.SolrZkClient.makePath makePath: /collections/collection1
[junit4:junit4]   2> 140 T3910 oascc.SolrZkClient.makePath makePath: /collections/collection1/shards
[junit4:junit4]   2> 149 T3910 oascc.SolrZkClient.makePath makePath: /collections/control_collection
[junit4:junit4]   2> 151 T3910 oascc.SolrZkClient.makePath makePath: /collections/control_collection/shards
[junit4:junit4]   2> 155 T3910 oasc.AbstractZkTestCase.putConfig put /usr/home/hudson/hudson-slave/workspace/Lucene-Solr-Tests-trunk-java7/solr/build/solr-core/test-files/solr/collection1/conf/solrconfig.xml to /configs/conf1/solrconfig.xml
[junit4:junit4]   2> 155 T3910 oascc.SolrZkClient.makePath makePath: /configs/conf1/solrconfig.xml
[junit4:junit4]   2> 169 T3910 oasc.AbstractZkTestCase.putConfig put /usr/home/hudson/hudson-slave/workspace/Lucene-Solr-Tests-trunk-java7/solr/build/solr-core/test-files/solr/collection1/conf/schema.xml to /configs/conf1/schema.xml
[junit4:junit4]   2> 170 T3910 oascc.SolrZkClient.makePath makePath: /configs/conf1/schema.xml
[junit4:junit4]   2> 273 T3910 oasc.AbstractZkTestCase.putConfig put /usr/home/hudson/hudson-slave/workspace/Lucene-Solr-Tests-trunk-java7/solr/build/solr-core/test-files/solr/collection1/conf/stopwords.txt to /configs/conf1/stopwords.txt
[junit4:junit4]   2> 274 T3910 oascc.SolrZkClient.makePath makePath: /configs/conf1/stopwords.txt
[junit4:junit4]   2> 277 T3910 oasc.AbstractZkTestCase.putConfig put /usr/home/hudson/hudson-slave/workspace/Lucene-Solr-Tests-trunk-java7/solr/build/solr-core/test-files/solr/collection1/conf/protwords.txt to /configs/conf1/protwords.txt
[junit4:junit4]   2> 278 T3910 oascc.SolrZkClient.makePath makePath: /configs/conf1/protwords.txt
[junit4:junit4]   2> 281 T3910 oasc.AbstractZkTestCase.putConfig put /usr/home/hudson/hudson-slave/workspace/Lucene-Solr-Tests-trunk-java7/solr/build/solr-core/test-files/solr/collection1/conf/currency.xml to /configs/conf1/currency.xml
[junit4:junit4]   2> 281 T3910 oascc.SolrZkClient.makePath makePath: /configs/conf1/currency.xml
[junit4:junit4]   2> 289 T3910 oasc.AbstractZkTestCase.putConfig put /usr/home/hudson/hudson-slave/workspace/Lucene-Solr-Tests-trunk-java7/solr/build/solr-core/test-files/solr/collection1/conf/open-exchange-rates.json to /configs/conf1/open-exchange-rates.json
[junit4:junit4]   2> 290 T3910 oascc.SolrZkClient.makePath makePath: /configs/conf1/open-exchange-rates.json
[junit4:junit4]   2> 293 T3910 oasc.AbstractZkTestCase.putConfig put /usr/home/hudson/hudson-slave/workspace/Lucene-Solr-Tests-trunk-java7/solr/build/solr-core/test-files/solr/collection1/conf/mapping-ISOLatin1Accent.txt to /configs/conf1/mapping-ISOLatin1Accent.txt
[junit4:junit4]   2> 294 T3910 oascc.SolrZkClient.makePath makePath: /configs/conf1/mapping-ISOLatin1Accent.txt
[junit4:junit4]   2> 297 T3910 oasc.AbstractZkTestCase.putConfig put /usr/home/hudson/hudson-slave/workspace/Lucene-Solr-Tests-trunk-java7/solr/build/solr-core/test-files/solr/collection1/conf/old_synonyms.txt to /configs/conf1/old_synonyms.txt
[junit4:junit4]   2> 298 T3910 oascc.SolrZkClient.makePath makePath: /configs/conf1/old_synonyms.txt
[junit4:junit4]   2> 301 T3910 oasc.AbstractZkTestCase.putConfig put /usr/home/hudson/hudson-slave/workspace/Lucene-Solr-Tests-trunk-java7/solr/build/solr-core/test-files/solr/collection1/conf/synonyms.txt to /configs/conf1/synonyms.txt
[junit4:junit4]   2> 301 T3910 oascc.SolrZkClient.makePath makePath: /configs/conf1/synonyms.txt
[junit4:junit4]   2> 304 T3915 oazs.PrepRequestProcessor.pRequest2Txn Processed session termination for sessionid: 0x13cdef553cf0001
[junit4:junit4]   2> 311 T3919 oaz.ClientCnxn$EventThread.run EventThread shut down
[junit4:junit4]   2> 311 T3910 oaz.ZooKeeper.close Session: 0x13cdef553cf0001 closed
[junit4:junit4]   2> 311 T3912 oazs.NIOServerCnxn.closeSock Closed socket connection for client /140.211.11.196:46371 which had sessionid 0x13cdef553cf0001
[junit4:junit4]   2> 476 T3910 oejs.Server.doStart jetty-8.1.8.v20121106
[junit4:junit4]   2> 480 T3910 oejs.AbstractConnector.doStart Started SocketConnector@127.0.0.1:25840
[junit4:junit4]   2> 481 T3910 oass.SolrDispatchFilter.init SolrDispatchFilter.init()
[junit4:junit4]   2> 482 T3910 oasc.SolrResourceLoader.locateSolrHome JNDI not configured for solr (NoInitialContextEx)
[junit4:junit4]   2> 482 T3910 oasc.SolrResourceLoader.locateSolrHome using system property solr.solr.home: /usr/home/hudson/hudson-slave/workspace/Lucene-Solr-Tests-trunk-java7/solr/build/solr-core/test/J0/./org.apache.solr.cloud.SyncSliceTest-controljetty-1360950285563
[junit4:junit4]   2> 483 T3910 oasc.CoreContainer$Initializer.initialize looking for solr.xml: /usr/home/hudson/hudson-slave/workspace/Lucene-Solr-Tests-trunk-java7/solr/build/solr-core/test/J0/./org.apache.solr.cloud.SyncSliceTest-controljetty-1360950285563/solr.xml
[junit4:junit4]   2> 483 T3910 oasc.CoreContainer.<init> New CoreContainer 1672942941
[junit4:junit4]   2> 484 T3910 oasc.CoreContainer.load Loading CoreContainer using Solr Home: '/usr/home/hudson/hudson-slave/workspace/Lucene-Solr-Tests-trunk-java7/solr/build/solr-core/test/J0/./org.apache.solr.cloud.SyncSliceTest-controljetty-1360950285563/'
[junit4:junit4]   2> 484 T3910 oasc.SolrResourceLoader.<init> new SolrResourceLoader for directory: '/usr/home/hudson/hudson-slave/workspace/Lucene-Solr-Tests-trunk-java7/solr/build/solr-core/test/J0/./org.apache.solr.cloud.SyncSliceTest-controljetty-1360950285563/'
[junit4:junit4]   2> 543 T3910 oashc.HttpShardHandlerFactory.getParameter Setting socketTimeout to: 60000
[junit4:junit4]   2> 543 T3910 oashc.HttpShardHandlerFactory.getParameter Setting urlScheme to: http://
[junit4:junit4]   2> 544 T3910 oashc.HttpShardHandlerFactory.getParameter Setting connTimeout to: 15000
[junit4:junit4]   2> 544 T3910 oashc.HttpShardHandlerFactory.getParameter Setting maxConnectionsPerHost to: 20
[junit4:junit4]   2> 545 T3910 oashc.HttpShardHandlerFactory.getParameter Setting corePoolSize to: 0
[junit4:junit4]   2> 545 T3910 oashc.HttpShardHandlerFactory.getParameter Setting maximumPoolSize to: 2147483647
[junit4:junit4]   2> 546 T3910 oashc.HttpShardHandlerFactory.getParameter Setting maxThreadIdleTime to: 5
[junit4:junit4]   2> 546 T3910 oashc.HttpShardHandlerFactory.getParameter Setting sizeOfQueue to: -1
[junit4:junit4]   2> 546 T3910 oashc.HttpShardHandlerFactory.getParameter Setting fairnessPolicy to: false
[junit4:junit4]   2> 547 T3910 oascsi.HttpClientUtil.createClient Creating new http client, config:maxConnectionsPerHost=20&maxConnections=10000&socketTimeout=60000&connTimeout=15000&retry=false
[junit4:junit4]   2> 569 T3910 oasc.CoreContainer.load Registering Log Listener
[junit4:junit4]   2> 588 T3910 oasc.CoreContainer.initZooKeeper Zookeeper client=127.0.0.1:25803/solr
[junit4:junit4]   2> 589 T3910 oasc.ZkController.checkChrootPath zkHost includes chroot
[junit4:junit4]   2> 589 T3910 oaz.ZooKeeper.<init> Initiating client connection, connectString=127.0.0.1:25803 sessionTimeout=60000 watcher=org.apache.solr.common.cloud.ConnectionManager@23e58b4f
[junit4:junit4]   2> 590 T3910 oascc.ConnectionManager.waitForConnected Waiting for client to connect to ZooKeeper
[junit4:junit4]   2> 591 T3929 oaz.ClientCnxn$SendThread.logStartConnect Opening socket connection to server localhost/127.0.0.1:25803. Will not attempt to authenticate using SASL (access denied ("javax.security.auth.AuthPermission" "getLoginConfiguration"))
[junit4:junit4]   2> 591 T3929 oaz.ClientCnxn$SendThread.primeConnection Socket connection established to localhost/127.0.0.1:25803, initiating session
[junit4:junit4]   2> 592 T3912 oazs.NIOServerCnxnFactory.run Accepted socket connection from /140.211.11.196:24536
[junit4:junit4]   2> 592 T3912 oazs.ZooKeeperServer.processConnectRequest Client attempting to establish new session at /140.211.11.196:24536
[junit4:junit4]   2> 594 T3914 oazs.ZooKeeperServer.finishSessionInit Established session 0x13cdef553cf0002 with negotiated timeout 20000 for client /140.211.11.196:24536
[junit4:junit4]   2> 594 T3929 oaz.ClientCnxn$SendThread.onConnected Session establishment complete on server localhost/127.0.0.1:25803, sessionid = 0x13cdef553cf0002, negotiated timeout = 20000
[junit4:junit4]   2> 594 T3930 oascc.ConnectionManager.process Watcher org.apache.solr.common.cloud.ConnectionManager@23e58b4f name:ZooKeeperConnection Watcher:127.0.0.1:25803 got event WatchedEvent state:SyncConnected type:None path:null path:null type:None
[junit4:junit4]   2> 594 T3910 oascc.ConnectionManager.waitForConnected Client is connected to ZooKeeper
[junit4:junit4]   2> 595 T3915 oazs.PrepRequestProcessor.pRequest2Txn Processed session termination for sessionid: 0x13cdef553cf0002
[junit4:junit4]   2> 597 T3930 oaz.ClientCnxn$EventThread.run EventThread shut down
[junit4:junit4]   2> 597 T3912 oazs.NIOServerCnxn.closeSock Closed socket connection for client /140.211.11.196:24536 which had sessionid 0x13cdef553cf0002
[junit4:junit4]   2> 597 T3910 oaz.ZooKeeper.close Session: 0x13cdef553cf0002 closed
[junit4:junit4]   2> 597 T3910 oascsi.HttpClientUtil.createClient Creating new http client, config:maxConnections=500&maxConnectionsPerHost=16&socketTimeout=60000&connTimeout=15000
[junit4:junit4]   2> 609 T3910 oaz.ZooKeeper.<init> Initiating client connection, connectString=127.0.0.1:25803/solr sessionTimeout=30000 watcher=org.apache.solr.common.cloud.ConnectionManager@7b618995
[junit4:junit4]   2> 610 T3910 oascc.ConnectionManager.waitForConnected Waiting for client to connect to ZooKeeper
[junit4:junit4]   2> 610 T3931 oaz.ClientCnxn$SendThread.logStartConnect Opening socket connection to server localhost/127.0.0.1:25803. Will not attempt to authenticate using SASL (access denied ("javax.security.auth.AuthPermission" "getLoginConfiguration"))
[junit4:junit4]   2> 611 T3931 oaz.ClientCnxn$SendThread.primeConnection Socket connection established to localhost/127.0.0.1:25803, initiating session
[junit4:junit4]   2> 611 T3912 oazs.NIOServerCnxnFactory.run Accepted socket connection from /140.211.11.196:22700
[junit4:junit4]   2> 611 T3912 oazs.ZooKeeperServer.processConnectRequest Client attempting to establish new session at /140.211.11.196:22700
[junit4:junit4]   2> 612 T3914 oazs.ZooKeeperServer.finishSessionInit Established session 0x13cdef553cf0003 with negotiated timeout 20000 for client /140.211.11.196:22700
[junit4:junit4]   2> 612 T3931 oaz.ClientCnxn$SendThread.onConnected Session establishment complete on server localhost/127.0.0.1:25803, sessionid = 0x13cdef553cf0003, negotiated timeout = 20000
[junit4:junit4]   2> 613 T3932 oascc.ConnectionManager.process Watcher org.apache.solr.common.cloud.ConnectionManager@7b618995 name:ZooKeeperConnection Watcher:127.0.0.1:25803/solr got event WatchedEvent state:SyncConnected type:None path:null path:null type:None
[junit4:junit4]   2> 613 T3910 oascc.ConnectionManager.waitForConnected Client is connected to ZooKeeper
[junit4:junit4]   2> 615 T3915 oazs.PrepRequestProcessor.pRequest Got user-level KeeperException when processing sessionid:0x13cdef553cf0003 type:create cxid:0x2 zxid:0x1a txntype:-1 reqpath:n/a Error Path:/solr/overseer Error:KeeperErrorCode = NodeExists for /solr/overseer
[junit4:junit4]   2> 624 T3910 oascc.SolrZkClient.makePath makePath: /live_nodes
[junit4:junit4]   2> 626 T3910 oasc.ZkController.createEphemeralLiveNode Register node as live in ZooKeeper:/live_nodes/127.0.0.1:25840_
[junit4:junit4]   2> 627 T3915 oazs.PrepRequestProcessor.pRequest Got user-level KeeperException when processing sessionid:0x13cdef553cf0003 type:delete cxid:0x8 zxid:0x1c txntype:-1 reqpath:n/a Error Path:/solr/live_nodes/127.0.0.1:25840_ Error:KeeperErrorCode = NoNode for /solr/live_nodes/127.0.0.1:25840_
[junit4:junit4]   2> 628 T3910 oascc.SolrZkClient.makePath makePath: /live_nodes/127.0.0.1:25840_
[junit4:junit4]   2> 637 T3910 oascc.SolrZkClient.makePath makePath: /overseer_elect/election
[junit4:junit4]   2> 649 T3915 oazs.PrepRequestProcessor.pRequest Got user-level KeeperException when processing sessionid:0x13cdef553cf0003 type:delete cxid:0x16 zxid:0x21 txntype:-1 reqpath:n/a Error Path:/solr/overseer_elect/leader Error:KeeperErrorCode = NoNode for /solr/overseer_elect/leader
[junit4:junit4]   2> 649 T3910 oascc.SolrZkClient.makePath makePath: /overseer_elect/leader
[junit4:junit4]   2> 656 T3910 oasc.Overseer.start Overseer (id=89191237894995971-127.0.0.1:25840_-n_0000000000) starting
[junit4:junit4]   2> 657 T3915 oazs.PrepRequestProcessor.pRequest Got user-level KeeperException when processing sessionid:0x13cdef553cf0003 type:create cxid:0x1b zxid:0x23 txntype:-1 reqpath:n/a Error Path:/solr/overseer Error:KeeperErrorCode = NodeExists for /solr/overseer
[junit4:junit4]   2> 658 T3915 oazs.PrepRequestProcessor.pRequest Got user-level KeeperException when processing sessionid:0x13cdef553cf0003 type:create cxid:0x1c zxid:0x24 txntype:-1 reqpath:n/a Error Path:/solr/overseer Error:KeeperErrorCode = NodeExists for /solr/overseer
[junit4:junit4]   2> 660 T3915 oazs.PrepRequestProcessor.pRequest Got user-level KeeperException when processing sessionid:0x13cdef553cf0003 type:create cxid:0x1d zxid:0x25 txntype:-1 reqpath:n/a Error Path:/solr/overseer Error:KeeperErrorCode = NodeExists for /solr/overseer
[junit4:junit4]   2> 669 T3915 oazs.PrepRequestProcessor.pRequest Got user-level KeeperException when processing sessionid:0x13cdef553cf0003 type:create cxid:0x1e zxid:0x26 txntype:-1 reqpath:n/a Error Path:/solr/overseer Error:KeeperErrorCode = NodeExists for /solr/overseer
[junit4:junit4]   2> 670 T3934 oasc.OverseerCollectionProcessor.run Process current queue of collection creations
[junit4:junit4]   2> 671 T3910 oascc.SolrZkClient.makePath makePath: /clusterstate.json
[junit4:junit4]   2> 678 T3910 oascc.ZkStateReader.createClusterStateWatchersAndUpdate Updating cluster state from ZooKeeper... 
[junit4:junit4]   2> 680 T3933 oasc.Overseer$ClusterStateUpdater.run Starting to work on the main queue
[junit4:junit4]   2> 685 T3935 oasc.CoreContainer.create Creating SolrCore 'collection1' using instanceDir: /usr/home/hudson/hudson-slave/workspace/Lucene-Solr-Tests-trunk-java7/solr/build/solr-core/test/J0/./org.apache.solr.cloud.SyncSliceTest-controljetty-1360950285563/collection1
[junit4:junit4]   2> 685 T3935 oasc.ZkController.createCollectionZkNode Check for collection zkNode:control_collection
[junit4:junit4]   2> 686 T3935 oasc.ZkController.createCollectionZkNode Collection zkNode exists
[junit4:junit4]   2> 686 T3935 oasc.ZkController.readConfigName Load collection config from:/collections/control_collection
[junit4:junit4]   2> 687 T3935 oasc.SolrResourceLoader.<init> new SolrResourceLoader for directory: '/usr/home/hudson/hudson-slave/workspace/Lucene-Solr-Tests-trunk-java7/solr/build/solr-core/test/J0/./org.apache.solr.cloud.SyncSliceTest-controljetty-1360950285563/collection1/'
[junit4:junit4]   2> 688 T3935 oasc.SolrResourceLoader.replaceClassLoader Adding 'file:/usr/home/hudson/hudson-slave/workspace/Lucene-Solr-Tests-trunk-java7/solr/build/solr-core/test/J0/org.apache.solr.cloud.SyncSliceTest-controljetty-1360950285563/collection1/lib/README' to classloader
[junit4:junit4]   2> 689 T3935 oasc.SolrResourceLoader.replaceClassLoader Adding 'file:/usr/home/hudson/hudson-slave/workspace/Lucene-Solr-Tests-trunk-java7/solr/build/solr-core/test/J0/org.apache.solr.cloud.SyncSliceTest-controljetty-1360950285563/collection1/lib/classes/' to classloader
[junit4:junit4]   2> 743 T3935 oasc.SolrConfig.<init> Using Lucene MatchVersion: LUCENE_50
[junit4:junit4]   2> 815 T3935 oasc.SolrConfig.<init> Loaded SolrConfig: solrconfig.xml
[junit4:junit4]   2> 916 T3935 oass.IndexSchema.readSchema Reading Solr Schema
[junit4:junit4]   2> 923 T3935 oass.IndexSchema.readSchema Schema name=test
[junit4:junit4]   2> 1566 T3935 oass.OpenExchangeRatesOrgProvider.init Initialized with rates=open-exchange-rates.json, refreshInterval=1440.
[junit4:junit4]   2> 1577 T3935 oass.IndexSchema.readSchema default search field in schema is text
[junit4:junit4]   2> 1581 T3935 oass.IndexSchema.readSchema unique key field: id
[junit4:junit4]   2> 1593 T3935 oass.FileExchangeRateProvider.reload Reloading exchange rates from file currency.xml
[junit4:junit4]   2> 1597 T3935 oass.FileExchangeRateProvider.reload Reloading exchange rates from file currency.xml
[junit4:junit4]   2> 1602 T3935 oass.OpenExchangeRatesOrgProvider.reload Reloading exchange rates from open-exchange-rates.json
[junit4:junit4]   2> 1603 T3935 oass.OpenExchangeRatesOrgProvider.reload Reloading exchange rates from open-exchange-rates.json
[junit4:junit4]   2> 1604 T3935 oasc.SolrCore.<init> [collection1] Opening new SolrCore at /usr/home/hudson/hudson-slave/workspace/Lucene-Solr-Tests-trunk-java7/solr/build/solr-core/test/J0/./org.apache.solr.cloud.SyncSliceTest-controljetty-1360950285563/collection1/, dataDir=./org.apache.solr.cloud.SyncSliceTest-1360950285256/control/data/
[junit4:junit4]   2> 1605 T3935 oasc.JmxMonitoredMap.<init> JMX monitoring is enabled. Adding Solr mbeans to JMX Server: com.sun.jmx.mbeanserver.JmxMBeanServer@3bf06804
[junit4:junit4]   2> 1605 T3935 oasc.SolrCore.initDirectoryFactory solr.NRTCachingDirectoryFactory
[junit4:junit4]   2> 1606 T3935 oasc.CachingDirectoryFactory.get return new directory for /usr/home/hudson/hudson-slave/workspace/Lucene-Solr-Tests-trunk-java7/solr/build/solr-core/test/J0/./org.apache.solr.cloud.SyncSliceTest-1360950285256/control/data forceNew:false
[junit4:junit4]   2> 1607 T3935 oasc.CachingDirectoryFactory.close Releasing directory:/usr/home/hudson/hudson-slave/workspace/Lucene-Solr-Tests-trunk-java7/solr/build/solr-core/test/J0/./org.apache.solr.cloud.SyncSliceTest-1360950285256/control/data
[junit4:junit4]   2> 1607 T3935 oasc.SolrCore.getNewIndexDir New index directory detected: old=null new=./org.apache.solr.cloud.SyncSliceTest-1360950285256/control/data/index/
[junit4:junit4]   2> 1608 T3935 oasc.SolrCore.initIndex WARNING [collection1] Solr index directory './org.apache.solr.cloud.SyncSliceTest-1360950285256/control/data/index' doesn't exist. Creating new index...
[junit4:junit4]   2> 1609 T3935 oasc.CachingDirectoryFactory.get return new directory for /usr/home/hudson/hudson-slave/workspace/Lucene-Solr-Tests-trunk-java7/solr/build/solr-core/test/J0/./org.apache.solr.cloud.SyncSliceTest-1360950285256/control/data/index forceNew:false
[junit4:junit4]   2> 1615 T3935 oasc.SolrDeletionPolicy.onCommit SolrDeletionPolicy.onCommit: commits:num=1
[junit4:junit4]   2> 		commit{dir=RateLimitedDirectoryWrapper(NRTCachingDirectory(org.apache.lucene.store.NIOFSDirectory@/usr/home/hudson/hudson-slave/workspace/Lucene-Solr-Tests-trunk-java7/solr/build/solr-core/test/J0/org.apache.solr.cloud.SyncSliceTest-1360950285256/control/data/index lockFactory=org.apache.lucene.store.NativeFSLockFactory@6ae61c77; maxCacheMB=48.0 maxMergeSizeMB=4.0)),segFN=segments_1,generation=1,filenames=[segments_1]
[junit4:junit4]   2> 1616 T3935 oasc.SolrDeletionPolicy.updateCommits newest commit = 1[segments_1]
[junit4:junit4]   2> 1617 T3935 oasc.CachingDirectoryFactory.close Releasing directory:/usr/home/hudson/hudson-slave/workspace/Lucene-Solr-Tests-trunk-java7/solr/build/solr-core/test/J0/./org.apache.solr.cloud.SyncSliceTest-1360950285256/control/data/index
[junit4:junit4]   2> 1617 T3935 oasc.SolrCore.initWriters created xml: solr.XMLResponseWriter
[junit4:junit4]   2> 1619 T3935 oasup.UpdateRequestProcessorChain.init inserting DistributedUpdateProcessorFactory into updateRequestProcessorChain "dedupe"
[junit4:junit4]   2> 1619 T3935 oasup.UpdateRequestProcessorChain.init inserting DistributedUpdateProcessorFactory into updateRequestProcessorChain "dedupe-allfields"
[junit4:junit4]   2> 1619 T3935 oasup.UpdateRequestProcessorChain.init inserting DistributedUpdateProcessorFactory into updateRequestProcessorChain "stored_sig"
[junit4:junit4]   2> 1620 T3935 oasup.UpdateRequestProcessorChain.init inserting DistributedUpdateProcessorFactory into updateRequestProcessorChain "uniq-fields"
[junit4:junit4]   2> 1620 T3935 oasup.UpdateRequestProcessorChain.init inserting DistributedUpdateProcessorFactory into updateRequestProcessorChain "distrib-dup-test-chain-implicit"
[junit4:junit4]   2> 1621 T3935 oasc.RequestHandlers.initHandlersFromConfig adding lazy requestHandler: solr.ReplicationHandler
[junit4:junit4]   2> 1621 T3935 oasc.RequestHandlers.initHandlersFromConfig created /replication: solr.ReplicationHandler
[junit4:junit4]   2> 1621 T3935 oasc.RequestHandlers.initHandlersFromConfig created standard: solr.StandardRequestHandler
[junit4:junit4]   2> 1622 T3935 oasc.RequestHandlers.initHandlersFromConfig created /get: solr.RealTimeGetHandler
[junit4:junit4]   2> 1622 T3935 oasc.RequestHandlers.initHandlersFromConfig created dismax: solr.SearchHandler
[junit4:junit4]   2> 1623 T3935 oasc.RequestHandlers.initHandlersFromConfig created mock: org.apache.solr.core.MockQuerySenderListenerReqHandler
[junit4:junit4]   2> 1623 T3935 oasc.RequestHandlers.initHandlersFromConfig created /admin/: org.apache.solr.handler.admin.AdminHandlers
[junit4:junit4]   2> 1624 T3935 oasc.RequestHandlers.initHandlersFromConfig created defaults: solr.StandardRequestHandler
[junit4:junit4]   2> 1624 T3935 oasc.RequestHandlers.initHandlersFromConfig adding lazy requestHandler: solr.StandardRequestHandler
[junit4:junit4]   2> 1624 T3935 oasc.RequestHandlers.initHandlersFromConfig created lazy: solr.StandardRequestHandler
[junit4:junit4]   2> 1625 T3935 oasc.RequestHandlers.initHandlersFromConfig created /update: solr.UpdateRequestHandler
[junit4:junit4]   2> 1625 T3935 oasc.RequestHandlers.initHandlersFromConfig created /terms: org.apache.solr.handler.component.SearchHandler
[junit4:junit4]   2> 1626 T3935 oasc.RequestHandlers.initHandlersFromConfig created spellCheckCompRH: org.apache.solr.handler.component.SearchHandler
[junit4:junit4]   2> 1626 T3935 oasc.RequestHandlers.initHandlersFromConfig created spellCheckCompRH_Direct: org.apache.solr.handler.component.SearchHandler
[junit4:junit4]   2> 1626 T3935 oasc.RequestHandlers.initHandlersFromConfig created spellCheckWithWordbreak: org.apache.solr.handler.component.SearchHandler
[junit4:junit4]   2> 1627 T3935 oasc.RequestHandlers.initHandlersFromConfig created spellCheckWithWordbreak_Direct: org.apache.solr.handler.component.SearchHandler
[junit4:junit4]   2> 1627 T3935 oasc.RequestHandlers.initHandlersFromConfig created spellCheckCompRH1: org.apache.solr.handler.component.SearchHandler
[junit4:junit4]   2> 1628 T3935 oasc.RequestHandlers.initHandlersFromConfig created mltrh: org.apache.solr.handler.component.SearchHandler
[junit4:junit4]   2> 1628 T3935 oasc.RequestHandlers.initHandlersFromConfig created tvrh: org.apache.solr.handler.component.SearchHandler
[junit4:junit4]   2> 1629 T3935 oasc.RequestHandlers.initHandlersFromConfig created /mlt: solr.MoreLikeThisHandler
[junit4:junit4]   2> 1629 T3935 oasc.RequestHandlers.initHandlersFromConfig created /debug/dump: solr.DumpRequestHandler
[junit4:junit4]   2> 1642 T3935 oashl.XMLLoader.init xsltCacheLifetimeSeconds=60
[junit4:junit4]   2> 1647 T3935 oasc.SolrCore.initDeprecatedSupport WARNING solrconfig.xml uses deprecated <admin/gettableFiles>, Please update your config to use the ShowFileRequestHandler.
[junit4:junit4]   2> 1648 T3935 oasc.SolrCore.initDeprecatedSupport WARNING adding ShowFileRequestHandler with hidden files: [SCHEMA.XML, OLD_SYNONYMS.TXT, STOPWORDS.TXT, PROTWORDS.TXT, OPEN-EXCHANGE-RATES.JSON, SYNONYMS.TXT, CURRENCY.XML, MAPPING-ISOLATIN1ACCENT.TXT]
[junit4:junit4]   2> 1650 T3935 oasc.CachingDirectoryFactory.close Releasing directory:/usr/home/hudson/hudson-slave/workspace/Lucene-Solr-Tests-trunk-java7/solr/build/solr-core/test/J0/./org.apache.solr.cloud.SyncSliceTest-1360950285256/control/data
[junit4:junit4]   2> 1652 T3935 oass.SolrIndexSearcher.<init> Opening Searcher@30ed956c main
[junit4:junit4]   2> 1653 T3935 oasu.CommitTracker.<init> Hard AutoCommit: disabled
[junit4:junit4]   2> 1653 T3935 oasu.CommitTracker.<init> Soft AutoCommit: disabled
[junit4:junit4]   2> 1654 T3935 oashc.SpellCheckComponent.inform Initializing spell checkers
[junit4:junit4]   2> 1670 T3935 oass.DirectSolrSpellChecker.init init: {name=direct,classname=DirectSolrSpellChecker,field=lowerfilt,minQueryLength=3}
[junit4:junit4]   2> 1721 T3936 oasc.SolrCore.registerSearcher [collection1] Registered new searcher Searcher@30ed956c main{StandardDirectoryReader(segments_1:1)}
[junit4:junit4]   2> 1725 T3935 oasc.ZkController.publish publishing core=collection1 state=down
[junit4:junit4]   2> 1726 T3935 oasc.ZkController.publish numShards not found on descriptor - reading it from system property
[junit4:junit4]   2> 1726 T3915 oazs.PrepRequestProcessor.pRequest Got user-level KeeperException when processing sessionid:0x13cdef553cf0003 type:create cxid:0x51 zxid:0x29 txntype:-1 reqpath:n/a Error Path:/solr/overseer/queue Error:KeeperErrorCode = NoNode for /solr/overseer/queue
[junit4:junit4]   2> 2183 T3933 oascc.ZkStateReader.updateClusterState Updating cloud state from ZooKeeper... 
[junit4:junit4]   2> 2184 T3933 oasc.Overseer$ClusterStateUpdater.updateState Update state numShards=1 message={
[junit4:junit4]   2> 	  "operation":"state",
[junit4:junit4]   2> 	  "numShards":"1",
[junit4:junit4]   2> 	  "shard":null,
[junit4:junit4]   2> 	  "roles":null,
[junit4:junit4]   2> 	  "state":"down",
[junit4:junit4]   2> 	  "core":"collection1",
[junit4:junit4]   2> 	  "collection":"control_collection",
[junit4:junit4]   2> 	  "node_name":"127.0.0.1:25840_",
[junit4:junit4]   2> 	  "base_url":"http://127.0.0.1:25840"}
[junit4:junit4]   2> 2184 T3933 oasc.Overseer$ClusterStateUpdater.createCollection Create collection control_collection with numShards 1
[junit4:junit4]   2> 2184 T3933 oasc.Overseer$ClusterStateUpdater.updateState Assigning new node to shard shard=shard1
[junit4:junit4]   2> 2185 T3915 oazs.PrepRequestProcessor.pRequest Got user-level KeeperException when processing sessionid:0x13cdef553cf0003 type:create cxid:0x59 zxid:0x2c txntype:-1 reqpath:n/a Error Path:/solr/overseer/queue-work Error:KeeperErrorCode = NoNode for /solr/overseer/queue-work
[junit4:junit4]   2> 2202 T3932 oascc.ZkStateReader$2.process A cluster state change: WatchedEvent state:SyncConnected type:NodeDataChanged path:/clusterstate.json, has occurred - updating... (live nodes size: 1)
[junit4:junit4]   2> 2739 T3935 oasc.CoreContainer.registerCore registering core: collection1
[junit4:junit4]   2> 2739 T3935 oasc.ZkController.register Register replica - core:collection1 address:http://127.0.0.1:25840 collection:control_collection shard:shard1
[junit4:junit4]   2> 2740 T3935 oascc.SolrZkClient.makePath makePath: /collections/control_collection/leader_elect/shard1/election
[junit4:junit4]   2> 2761 T3915 oazs.PrepRequestProcessor.pRequest Got user-level KeeperException when processing sessionid:0x13cdef553cf0003 type:delete cxid:0x73 zxid:0x36 txntype:-1 reqpath:n/a Error Path:/solr/collections/control_collection/leaders Error:KeeperErrorCode = NoNode for /solr/collections/control_collection/leaders
[junit4:junit4]   2> 2762 T3935 oasc.ShardLeaderElectionContext.runLeaderProcess Running the leader process.
[junit4:junit4]   2> 2763 T3915 oazs.PrepRequestProcessor.pRequest Got user-level KeeperException when processing sessionid:0x13cdef553cf0003 type:create cxid:0x74 zxid:0x37 txntype:-1 reqpath:n/a Error Path:/solr/overseer Error:KeeperErrorCode = NodeExists for /solr/overseer
[junit4:junit4]   2> 2774 T3935 oasc.ShardLeaderElectionContext.waitForReplicasToComeUp Enough replicas found to continue.
[junit4:junit4]   2> 2774 T3935 oasc.ShardLeaderElectionContext.runLeaderProcess I may be the new leader - try and sync
[junit4:junit4]   2> 2774 T3935 oasc.SyncStrategy.sync Sync replicas to http://127.0.0.1:25840/collection1/
[junit4:junit4]   2> 2775 T3935 oasc.SyncStrategy.syncReplicas Sync Success - now sync replicas to me
[junit4:junit4]   2> 2775 T3935 oasc.SyncStrategy.syncToMe http://127.0.0.1:25840/collection1/ has no replicas
[junit4:junit4]   2> 2775 T3935 oasc.ShardLeaderElectionContext.runLeaderProcess I am the new leader: http://127.0.0.1:25840/collection1/
[junit4:junit4]   2> 2776 T3935 oascc.SolrZkClient.makePath makePath: /collections/control_collection/leaders/shard1
[junit4:junit4]   2> 2785 T3915 oazs.PrepRequestProcessor.pRequest Got user-level KeeperException when processing sessionid:0x13cdef553cf0003 type:create cxid:0x7e zxid:0x3b txntype:-1 reqpath:n/a Error Path:/solr/overseer Error:KeeperErrorCode = NodeExists for /solr/overseer
[junit4:junit4]   2> 3706 T3933 oascc.ZkStateReader.updateClusterState Updating cloud state from ZooKeeper... 
[junit4:junit4]   2> 3722 T3932 oascc.ZkStateReader$2.process A cluster state change: WatchedEvent state:SyncConnected type:NodeDataChanged path:/clusterstate.json, has occurred - updating... (live nodes size: 1)
[junit4:junit4]   2> 3767 T3935 oasc.ZkController.register We are http://127.0.0.1:25840/collection1/ and leader is http://127.0.0.1:25840/collection1/
[junit4:junit4]   2> 3767 T3935 oasc.ZkController.register No LogReplay needed for core=collection1 baseURL=http://127.0.0.1:25840
[junit4:junit4]   2> 3767 T3935 oasc.ZkController.checkRecovery I am the leader, no recovery necessary
[junit4:junit4]   2> 3767 T3935 oasc.ZkController.publish publishing core=collection1 state=active
[junit4:junit4]   2> 3768 T3935 oasc.ZkController.publish numShards not found on descriptor - reading it from system property
[junit4:junit4]   2> 3770 T3935 oascc.ZkStateReader.updateClusterState Updating cloud state from ZooKeeper... 
[junit4:junit4]   2> 3771 T3910 oass.SolrDispatchFilter.init user.dir=/usr/home/hudson/hudson-slave/workspace/Lucene-Solr-Tests-trunk-java7/solr/build/solr-core/test/J0
[junit4:junit4]   2> 3772 T3910 oass.SolrDispatchFilter.init SolrDispatchFilter.init() done
[junit4:junit4]   2> 3772 T3910 oascsi.HttpClientUtil.createClient Creating new http client, config:maxConnections=128&maxConnectionsPerHost=32&followRedirects=false
[junit4:junit4]   2> 3788 T3910 oascsi.HttpClientUtil.createClient Creating new http client, config:
[junit4:junit4]   2> 3790 T3910 oaz.ZooKeeper.<init> Initiating client connection, connectString=127.0.0.1:25803/solr sessionTimeout=10000 watcher=org.apache.solr.common.cloud.ConnectionManager@29a96179
[junit4:junit4]   2> 3791 T3910 oascc.ConnectionManager.waitForConnected Waiting for client to connect to ZooKeeper
[junit4:junit4]   2> 3791 T3937 oaz.ClientCnxn$SendThread.logStartConnect Opening socket connection to server localhost/127.0.0.1:25803. Will not attempt to authenticate using SASL (access denied ("javax.security.auth.AuthPermission" "getLoginConfiguration"))
[junit4:junit4]   2> 3792 T3937 oaz.ClientCnxn$SendThread.primeConnection Socket connection established to localhost/127.0.0.1:25803, initiating session
[junit4:junit4]   2> 3792 T3912 oazs.NIOServerCnxnFactory.run Accepted socket connection from /140.211.11.196:65197
[junit4:junit4]   2> 3792 T3912 oazs.ZooKeeperServer.processConnectRequest Client attempting to establish new session at /140.211.11.196:65197
[junit4:junit4]   2> 3816 T3914 oazs.ZooKeeperServer.finishSessionInit Established session 0x13cdef553cf0004 with negotiated timeout 10000 for client /140.211.11.196:65197
[junit4:junit4]   2> 3816 T3937 oaz.ClientCnxn$SendThread.onConnected Session establishment complete on server localhost/127.0.0.1:25803, sessionid = 0x13cdef553cf0004, negotiated timeout = 10000
[junit4:junit4]   2> 3816 T3938 oascc.ConnectionManager.process Watcher org.apache.solr.common.cloud.ConnectionManager@29a96179 name:ZooKeeperConnection Watcher:127.0.0.1:25803/solr got event WatchedEvent state:SyncConnected type:None path:null path:null type:None
[junit4:junit4]   2> 3816 T3910 oascc.ConnectionManager.waitForConnected Client is connected to ZooKeeper
[junit4:junit4]   2> 3817 T3910 oascc.ZkStateReader.createClusterStateWatchersAndUpdate Updating cluster state from ZooKeeper... 
[junit4:junit4]   2> 3819 T3910 oasc.ChaosMonkey.monkeyLog monkey: init - expire sessions:true cause connection loss:true
[junit4:junit4]   2> 3985 T3910 oejs.Server.doStart jetty-8.1.8.v20121106
[junit4:junit4]   2> 3988 T3910 oejs.AbstractConnector.doStart Started SocketConnector@127.0.0.1:19665
[junit4:junit4]   2> 3989 T3910 oass.SolrDispatchFilter.init SolrDispatchFilter.init()
[junit4:junit4]   2> 3990 T3910 oasc.SolrResourceLoader.locateSolrHome JNDI not configured for solr (NoInitialContextEx)
[junit4:junit4]   2> 3990 T3910 oasc.SolrResourceLoader.locateSolrHome using system property solr.solr.home: /usr/home/hudson/hudson-slave/workspace/Lucene-Solr-Tests-trunk-java7/solr/build/solr-core/test/J0/./org.apache.solr.cloud.SyncSliceTest-jetty1-1360950289070
[junit4:junit4]   2> 3991 T3910 oasc.CoreContainer$Initializer.initialize looking for solr.xml: /usr/home/hudson/hudson-slave/workspace/Lucene-Solr-Tests-trunk-java7/solr/build/solr-core/test/J0/./org.apache.solr.cloud.SyncSliceTest-jetty1-1360950289070/solr.xml
[junit4:junit4]   2> 3991 T3910 oasc.CoreContainer.<init> New CoreContainer 2036781545
[junit4:junit4]   2> 3992 T3910 oasc.CoreContainer.load Loading CoreContainer using Solr Home: '/usr/home/hudson/hudson-slave/workspace/Lucene-Solr-Tests-trunk-java7/solr/build/solr-core/test/J0/./org.apache.solr.cloud.SyncSliceTest-jetty1-1360950289070/'
[junit4:junit4]   2> 3992 T3910 oasc.SolrResourceLoader.<init> new SolrResourceLoader for directory: '/usr/home/hudson/hudson-slave/workspace/Lucene-Solr-Tests-trunk-java7/solr/build/solr-core/test/J0/./org.apache.solr.cloud.SyncSliceTest-jetty1-1360950289070/'
[junit4:junit4]   2> 4051 T3910 oashc.HttpShardHandlerFactory.getParameter Setting socketTimeout to: 60000
[junit4:junit4]   2> 4051 T3910 oashc.HttpShardHandlerFactory.getParameter Setting urlScheme to: http://
[junit4:junit4]   2> 4052 T3910 oashc.HttpShardHandlerFactory.getParameter Setting connTimeout to: 15000
[junit4:junit4]   2> 4052 T3910 oashc.HttpShardHandlerFactory.getParameter Setting maxConnectionsPerHost to: 20
[junit4:junit4]   2> 4053 T3910 oashc.HttpShardHandlerFactory.getParameter Setting corePoolSize to: 0
[junit4:junit4]   2> 4053 T3910 oashc.HttpShardHandlerFactory.getParameter Setting maximumPoolSize to: 2147483647
[junit4:junit4]   2> 4054 T3910 oashc.HttpShardHandlerFactory.getParameter Setting maxThreadIdleTime to: 5
[junit4:junit4]   2> 4054 T3910 oashc.HttpShardHandlerFactory.getParameter Setting sizeOfQueue to: -1
[junit4:junit4]   2> 4055 T3910 oashc.HttpShardHandlerFactory.getParameter Setting fairnessPolicy to: false
[junit4:junit4]   2> 4055 T3910 oascsi.HttpClientUtil.createClient Creating new http client, config:maxConnectionsPerHost=20&maxConnections=10000&socketTimeout=60000&connTimeout=15000&retry=false
[junit4:junit4]   2> 4075 T3910 oasc.CoreContainer.load Registering Log Listener
[junit4:junit4]   2> 4095 T3910 oasc.CoreContainer.initZooKeeper Zookeeper client=127.0.0.1:25803/solr
[junit4:junit4]   2> 4095 T3910 oasc.ZkController.checkChrootPath zkHost includes chroot
[junit4:junit4]   2> 4096 T3910 oaz.ZooKeeper.<init> Initiating client connection, connectString=127.0.0.1:25803 sessionTimeout=60000 watcher=org.apache.solr.common.cloud.ConnectionManager@4d6b599c
[junit4:junit4]   2> 4097 T3910 oascc.ConnectionManager.waitForConnected Waiting for client to connect to ZooKeeper
[junit4:junit4]   2> 4097 T3948 oaz.ClientCnxn$SendThread.logStartConnect Opening socket connection to server localhost/127.0.0.1:25803. Will not attempt to authenticate using SASL (access denied ("javax.security.auth.AuthPermission" "getLoginConfiguration"))
[junit4:junit4]   2> 4098 T3948 oaz.ClientCnxn$SendThread.primeConnection Socket connection established to localhost/127.0.0.1:25803, initiating session
[junit4:junit4]   2> 4098 T3912 oazs.NIOServerCnxnFactory.run Accepted socket connection from /140.211.11.196:16876
[junit4:junit4]   2> 4098 T3912 oazs.ZooKeeperServer.processConnectRequest Client attempting to establish new session at /140.211.11.196:16876
[junit4:junit4]   2> 4102 T3914 oazs.ZooKeeperServer.finishSessionInit Established session 0x13cdef553cf0005 with negotiated timeout 20000 for client /140.211.11.196:16876
[junit4:junit4]   2> 4102 T3948 oaz.ClientCnxn$SendThread.onConnected Session establishment complete on server localhost/127.0.0.1:25803, sessionid = 0x13cdef553cf0005, negotiated timeout = 20000
[junit4:junit4]   2> 4102 T3949 oascc.ConnectionManager.process Watcher org.apache.solr.common.cloud.ConnectionManager@4d6b599c name:ZooKeeperConnection Watcher:127.0.0.1:25803 got event WatchedEvent state:SyncConnected type:None path:null path:null type:None
[junit4:junit4]   2> 4102 T3910 oascc.ConnectionManager.waitForConnected Client is connected to ZooKeeper
[junit4:junit4]   2> 4103 T3915 oazs.PrepRequestProcessor.pRequest2Txn Processed session termination for sessionid: 0x13cdef553cf0005
[junit4:junit4]   2> 4120 T3949 oaz.ClientCnxn$EventThread.run EventThread shut down
[junit4:junit4]   2> 4121 T3912 oazs.NIOServerCnxn.closeSock Closed socket connection for client /140.211.11.196:16876 which had sessionid 0x13cdef553cf0005
[junit4:junit4]   2> 4120 T3910 oaz.ZooKeeper.close Session: 0x13cdef553cf0005 closed
[junit4:junit4]   2> 4121 T3910 oascsi.HttpClientUtil.createClient Creating new http client, config:maxConnections=500&maxConnectionsPerHost=16&socketTimeout=60000&connTimeout=15000
[junit4:junit4]   2> 4131 T3910 oaz.ZooKeeper.<init> Initiating client connection, connectString=127.0.0.1:25803/solr sessionTimeout=30000 watcher=org.apache.solr.common.cloud.ConnectionManager@2afd6560
[junit4:junit4]   2> 4132 T3910 oascc.ConnectionManager.waitForConnected Waiting for client to connect to ZooKeeper
[junit4:junit4]   2> 4132 T3950 oaz.ClientCnxn$SendThread.logStartConnect Opening socket connection to server localhost/127.0.0.1:25803. Will not attempt to authenticate using SASL (access denied ("javax.security.auth.AuthPermission" "getLoginConfiguration"))
[junit4:junit4]   2> 4133 T3950 oaz.ClientCnxn$SendThread.primeConnection Socket connection established to localhost/127.0.0.1:25803, initiating session
[junit4:junit4]   2> 4133 T3912 oazs.NIOServerCnxnFactory.run Accepted socket connection from /140.211.11.196:38688
[junit4:junit4]   2> 4134 T3912 oazs.ZooKeeperServer.processConnectRequest Client attempting to establish new session at /140.211.11.196:38688
[junit4:junit4]   2> 4135 T3914 oazs.ZooKeeperServer.finishSessionInit Established session 0x13cdef553cf0006 with negotiated timeout 20000 for client /140.211.11.196:38688
[junit4:junit4]   2> 4135 T3950 oaz.ClientCnxn$SendThread.onConnected Session establishment complete on server localhost/127.0.0.1:25803, sessionid = 0x13cdef553cf0006, negotiated timeout = 20000
[junit4:junit4]   2> 4135 T3951 oascc.ConnectionManager.process Watcher org.apache.solr.common.cloud.ConnectionManager@2afd6560 name:ZooKeeperConnection Watcher:127.0.0.1:25803/solr got event WatchedEvent state:SyncConnected type:None path:null path:null type:None
[junit4:junit4]   2> 4136 T3910 oascc.ConnectionManager.waitForConnected Client is connected to ZooKeeper
[junit4:junit4]   2> 4136 T3915 oazs.PrepRequestProcessor.pRequest Got user-level KeeperException when processing sessionid:0x13cdef553cf0006 type:create cxid:0x1 zxid:0x49 txntype:-1 reqpath:n/a Error Path:/solr/overseer Error:KeeperErrorCode = NodeExists for /solr/overseer
[junit4:junit4]   2> 4138 T3915 oazs.PrepRequestProcessor.pRequest Got user-level KeeperException when processing sessionid:0x13cdef553cf0006 type:create cxid:0x2 zxid:0x4a txntype:-1 reqpath:n/a Error Path:/solr/overseer Error:KeeperErrorCode = NodeExists for /solr/overseer
[junit4:junit4]   2> 4146 T3910 oascc.ZkStateReader.createClusterStateWatchersAndUpdate Updating cluster state from ZooKeeper... 
[junit4:junit4]   2> 4147 T3910 oasc.ZkController.createEphemeralLiveNode Register node as live in ZooKeeper:/live_nodes/127.0.0.1:19665_
[junit4:junit4]   2> 4148 T3915 oazs.PrepRequestProcessor.pRequest Got user-level KeeperException when processing sessionid:0x13cdef553cf0006 type:delete cxid:0x9 zxid:0x4b txntype:-1 reqpath:n/a Error Path:/solr/live_nodes/127.0.0.1:19665_ Error:KeeperErrorCode = NoNode for /solr/live_nodes/127.0.0.1:19665_
[junit4:junit4]   2> 4149 T3910 oascc.SolrZkClient.makePath makePath: /live_nodes/127.0.0.1:19665_
[junit4:junit4]   2> 4156 T3932 oascc.ZkStateReader$2.process A cluster state change: WatchedEvent state:SyncConnected type:NodeChildrenChanged path:/live_nodes, has occurred - updating... (live nodes size: 1)
[junit4:junit4]   2> 4157 T3951 oascc.ZkStateReader$3.process Updating live nodes... (2)
[junit4:junit4]   2> 4157 T3938 oascc.ZkStateReader$3.process Updating live nodes... (2)
[junit4:junit4]   2> 4159 T3932 oascc.ZkStateReader$3.process Updating live nodes... (2)
[junit4:junit4]   2> 4164 T3952 oasc.CoreContainer.create Creating SolrCore 'collection1' using instanceDir: /usr/home/hudson/hudson-slave/workspace/Lucene-Solr-Tests-trunk-java7/solr/build/solr-core/test/J0/./org.apache.solr.cloud.SyncSliceTest-jetty1-1360950289070/collection1
[junit4:junit4]   2> 4165 T3952 oasc.ZkController.createCollectionZkNode Check for collection zkNode:collection1
[junit4:junit4]   2> 4165 T3952 oasc.ZkController.createCollectionZkNode Collection zkNode exists
[junit4:junit4]   2> 4165 T3952 oasc.ZkController.readConfigName Load collection config from:/collections/collection1
[junit4:junit4]   2> 4167 T3952 oasc.SolrResourceLoader.<init> new SolrResourceLoader for directory: '/usr/home/hudson/hudson-slave/workspace/Lucene-Solr-Tests-trunk-java7/solr/build/solr-core/test/J0/./org.apache.solr.cloud.SyncSliceTest-jetty1-1360950289070/collection1/'
[junit4:junit4]   2> 4168 T3952 oasc.SolrResourceLoader.replaceClassLoader Adding 'file:/usr/home/hudson/hudson-slave/workspace/Lucene-Solr-Tests-trunk-java7/solr/build/solr-core/test/J0/org.apache.solr.cloud.SyncSliceTest-jetty1-1360950289070/collection1/lib/classes/' to classloader
[junit4:junit4]   2> 4169 T3952 oasc.SolrResourceLoader.replaceClassLoader Adding 'file:/usr/home/hudson/hudson-slave/workspace/Lucene-Solr-Tests-trunk-java7/solr/build/solr-core/test/J0/org.apache.solr.cloud.SyncSliceTest-jetty1-1360950289070/collection1/lib/README' to classloader
[junit4:junit4]   2> 4223 T3952 oasc.SolrConfig.<init> Using Lucene MatchVersion: LUCENE_50
[junit4:junit4]   2> 4294 T3952 oasc.SolrConfig.<init> Loaded SolrConfig: solrconfig.xml
[junit4:junit4]   2> 4395 T3952 oass.IndexSchema.readSchema Reading Solr Schema
[junit4:junit4]   2> 4402 T3952 oass.IndexSchema.readSchema Schema name=test
[junit4:junit4]   2> 5027 T3952 oass.OpenExchangeRatesOrgProvider.init Initialized with rates=open-exchange-rates.json, refreshInterval=1440.
[junit4:junit4]   2> 5037 T3952 oass.IndexSchema.readSchema default search field in schema is text
[junit4:junit4]   2> 5041 T3952 oass.IndexSchema.readSchema unique key field: id
[junit4:junit4]   2> 5053 T3952 oass.FileExchangeRateProvider.reload Reloading exchange rates from file currency.xml
[junit4:junit4]   2> 5058 T3952 oass.FileExchangeRateProvider.reload Reloading exchange rates from file currency.xml
[junit4:junit4]   2> 5062 T3952 oass.OpenExchangeRatesOrgProvider.reload Reloading exchange rates from open-exchange-rates.json
[junit4:junit4]   2> 5063 T3952 oass.OpenExchangeRatesOrgProvider.reload Reloading exchange rates from open-exchange-rates.json
[junit4:junit4]   2> 5064 T3952 oasc.SolrCore.<init> [collection1] Opening new SolrCore at /usr/home/hudson/hudson-slave/workspace/Lucene-Solr-Tests-trunk-java7/solr/build/solr-core/test/J0/./org.apache.solr.cloud.SyncSliceTest-jetty1-1360950289070/collection1/, dataDir=./org.apache.solr.cloud.SyncSliceTest-1360950285256/jetty1/
[junit4:junit4]   2> 5065 T3952 oasc.JmxMonitoredMap.<init> JMX monitoring is enabled. Adding Solr mbeans to JMX Server: com.sun.jmx.mbeanserver.JmxMBeanServer@3bf06804
[junit4:junit4]   2> 5065 T3952 oasc.SolrCore.initDirectoryFactory solr.NRTCachingDirectoryFactory
[junit4:junit4]   2> 5066 T3952 oasc.CachingDirectoryFactory.get return new directory for /usr/home/hudson/hudson-slave/workspace/Lucene-Solr-Tests-trunk-java7/solr/build/solr-core/test/J0/./org.apache.solr.cloud.SyncSliceTest-1360950285256/jetty1 forceNew:false
[junit4:junit4]   2> 5067 T3952 oasc.CachingDirectoryFactory.close Releasing directory:/usr/home/hudson/hudson-slave/workspace/Lucene-Solr-Tests-trunk-java7/solr/build/solr-core/test/J0/./org.apache.solr.cloud.SyncSliceTest-1360950285256/jetty1
[junit4:junit4]   2> 5067 T3952 oasc.SolrCore.getNewIndexDir New index directory detected: old=null new=./org.apache.solr.cloud.SyncSliceTest-1360950285256/jetty1/index/
[junit4:junit4]   2> 5067 T3952 oasc.SolrCore.initIndex WARNING [collection1] Solr index directory './org.apache.solr.cloud.SyncSliceTest-1360950285256/jetty1/index' doesn't exist. Creating new index...
[junit4:junit4]   2> 5068 T3952 oasc.CachingDirectoryFactory.get return new directory for /usr/home/hudson/hudson-slave/workspace/Lucene-Solr-Tests-trunk-java7/solr/build/solr-core/test/J0/./org.apache.solr.cloud.SyncSliceTest-1360950285256/jetty1/index forceNew:false
[junit4:junit4]   2> 5074 T3952 oasc.SolrDeletionPolicy.onCommit SolrDeletionPolicy.onCommit: commits:num=1
[junit4:junit4]   2> 		commit{dir=RateLimitedDirectoryWrapper(NRTCachingDirectory(org.apache.lucene.store.NIOFSDirectory@/usr/home/hudson/hudson-slave/workspace/Lucene-Solr-Tests-trunk-java7/solr/build/solr-core/test/J0/org.apache.solr.cloud.SyncSliceTest-1360950285256/jetty1/index lockFactory=org.apache.lucene.store.NativeFSLockFactory@72bab1ce; maxCacheMB=48.0 maxMergeSizeMB=4.0)),segFN=segments_1,generation=1,filenames=[segments_1]
[junit4:junit4]   2> 5074 T3952 oasc.SolrDeletionPolicy.updateCommits newest commit = 1[segments_1]
[junit4:junit4]   2> 5075 T3952 oasc.CachingDirectoryFactory.close Releasing directory:/usr/home/hudson/hudson-slave/workspace/Lucene-Solr-Tests-trunk-java7/solr/build/solr-core/test/J0/./org.apache.solr.cloud.SyncSliceTest-1360950285256/jetty1/index
[junit4:junit4]   2> 5075 T3952 oasc.SolrCore.initWriters created xml: solr.XMLResponseWriter
[junit4:junit4]   2> 5077 T3952 oasup.UpdateRequestProcessorChain.init inserting DistributedUpdateProcessorFactory into updateRequestProcessorChain "dedupe"
[junit4:junit4]   2> 5077 T3952 oasup.UpdateRequestProcessorChain.init inserting DistributedUpdateProcessorFactory into updateRequestProcessorChain "dedupe-allfields"
[junit4:junit4]   2> 5078 T3952 oasup.UpdateRequestProcessorChain.init inserting DistributedUpdateProcessorFactory into updateRequestProcessorChain "stored_sig"
[junit4:junit4]   2> 5078 T3952 oasup.UpdateRequestProcessorChain.init inserting DistributedUpdateProcessorFactory into updateRequestProcessorChain "uniq-fields"
[junit4:junit4]   2> 5079 T3952 oasup.UpdateRequestProcessorChain.init inserting DistributedUpdateProcessorFactory into updateRequestProcessorChain "distrib-dup-test-chain-implicit"
[junit4:junit4]   2> 5079 T3952 oasc.RequestHandlers.initHandlersFromConfig adding lazy requestHandler: solr.ReplicationHandler
[junit4:junit4]   2> 5079 T3952 oasc.RequestHandlers.initHandlersFromConfig created /replication: solr.ReplicationHandler
[junit4:junit4]   2> 5080 T3952 oasc.RequestHandlers.initHandlersFromConfig created standard: solr.StandardRequestHandler
[junit4:junit4]   2> 5080 T3952 oasc.RequestHandlers.initHandlersFromConfig created /get: solr.RealTimeGetHandler
[junit4:junit4]   2> 5081 T3952 oasc.RequestHandlers.initHandlersFromConfig created dismax: solr.SearchHandler
[junit4:junit4]   2> 5081 T3952 oasc.RequestHandlers.initHandlersFromConfig created mock: org.apache.solr.core.MockQuerySenderListenerReqHandler
[junit4:junit4]   2> 5082 T3952 oasc.RequestHandlers.initHandlersFromConfig created /admin/: org.apache.solr.handler.admin.AdminHandlers
[junit4:junit4]   2> 5082 T3952 oasc.RequestHandlers.initHandlersFromConfig created defaults: solr.StandardRequestHandler
[junit4:junit4]   2> 5083 T3952 oasc.RequestHandlers.initHandlersFromConfig adding lazy requestHandler: solr.StandardRequestHandler
[junit4:junit4]   2> 5083 T3952 oasc.RequestHandlers.initHandlersFromConfig created lazy: solr.StandardRequestHandler
[junit4:junit4]   2> 5083 T3952 oasc.RequestHandlers.initHandlersFromConfig created /update: solr.UpdateRequestHandler
[junit4:junit4]   2> 5084 T3952 oasc.RequestHandlers.initHandlersFromConfig created /terms: org.apache.solr.handler.component.SearchHandler
[junit4:junit4]   2> 5084 T3952 oasc.RequestHandlers.initHandlersFromConfig created spellCheckCompRH: org.apache.solr.handler.component.SearchHandler
[junit4:junit4]   2> 5085 T3952 oasc.RequestHandlers.initHandlersFromConfig created spellCheckCompRH_Direct: org.apache.solr.handler.component.SearchHandler
[junit4:junit4]   2> 5085 T3952 oasc.RequestHandlers.initHandlersFromConfig created spellCheckWithWordbreak: org.apache.solr.handler.component.SearchHandler
[junit4:junit4]   2> 5086 T3952 oasc.RequestHandlers.initHandlersFromConfig created spellCheckWithWordbreak_Direct: org.apache.solr.handler.component.SearchHandler
[junit4:junit4]   2> 5087 T3952 oasc.RequestHandlers.initHandlersFromConfig created spellCheckCompRH1: org.apache.solr.handler.component.SearchHandler
[junit4:junit4]   2> 5087 T3952 oasc.RequestHandlers.initHandlersFromConfig created mltrh: org.apache.solr.handler.component.SearchHandler
[junit4:junit4]   2> 5088 T3952 oasc.RequestHandlers.initHandlersFromConfig created tvrh: org.apache.solr.handler.component.SearchHandler
[junit4:junit4]   2> 5088 T3952 oasc.RequestHandlers.initHandlersFromConfig created /mlt: solr.MoreLikeThisHandler
[junit4:junit4]   2> 5089 T3952 oasc.RequestHandlers.initHandlersFromConfig created /debug/dump: solr.DumpRequestHandler
[junit4:junit4]   2> 5100 T3952 oashl.XMLLoader.init xsltCacheLifetimeSeconds=60
[junit4:junit4]   2> 5105 T3952 oasc.SolrCore.initDeprecatedSupport WARNING solrconfig.xml uses deprecated <admin/gettableFiles>, Please update your config to use the ShowFileRequestHandler.
[junit4:junit4]   2> 5106 T3952 oasc.SolrCore.initDeprecatedSupport WARNING adding ShowFileRequestHandler with hidden files: [SCHEMA.XML, OLD_SYNONYMS.TXT, STOPWORDS.TXT, PROTWORDS.TXT, OPEN-EXCHANGE-RATES.JSON, SYNONYMS.TXT, CURRENCY.XML, MAPPING-ISOLATIN1ACCENT.TXT]
[junit4:junit4]   2> 5108 T3952 oasc.CachingDirectoryFactory.close Releasing directory:/usr/home/hudson/hudson-slave/workspace/Lucene-Solr-Tests-trunk-java7/solr/build/solr-core/test/J0/./org.apache.solr.cloud.SyncSliceTest-1360950285256/jetty1
[junit4:junit4]   2> 5110 T3952 oass.SolrIndexSearcher.<init> Opening Searcher@3fb431b7 main
[junit4:junit4]   2> 5111 T3952 oasu.CommitTracker.<init> Hard AutoCommit: disabled
[junit4:junit4]   2> 5111 T3952 oasu.CommitTracker.<init> Soft AutoCommit: disabled
[junit4:junit4]   2> 5112 T3952 oashc.SpellCheckComponent.inform Initializing spell checkers
[junit4:junit4]   2> 5118 T3952 oass.DirectSolrSpellChecker.init init: {name=direct,classname=DirectSolrSpellChecker,field=lowerfilt,minQueryLength=3}
[junit4:junit4]   2> 5163 T3953 oasc.SolrCore.registerSearcher [collection1] Registered new searcher Searcher@3fb431b7 main{StandardDirectoryReader(segments_1:1)}
[junit4:junit4]   2> 5168 T3952 oasc.ZkController.publish publishing core=collection1 state=down
[junit4:junit4]   2> 5169 T3952 oasc.ZkController.publish numShards not found on descriptor - reading it from system property
[junit4:junit4]   2> 5233 T3933 oascc.ZkStateReader.updateClusterState Updating cloud state from ZooKeeper... 
[junit4:junit4]   2> 5234 T3933 oasc.Overseer$ClusterStateUpdater.updateState Update state numShards=1 message={
[junit4:junit4]   2> 	  "operation":"state",
[junit4:junit4]   2> 	  "numShards":"1",
[junit4:junit4]   2> 	  "shard":"shard1",
[junit4:junit4]   2> 	  "roles":null,
[junit4:junit4]   2> 	  "state":"active",
[junit4:junit4]   2> 	  "core":"collection1",
[junit4:junit4]   2> 	  "collection":"control_collection",
[junit4:junit4]   2> 	  "node_name":"127.0.0.1:25840_",
[junit4:junit4]   2> 	  "base_url":"http://127.0.0.1:25840"}
[junit4:junit4]   2> 5237 T3933 oasc.Overseer$ClusterStateUpdater.updateState Update state numShards=1 message={
[junit4:junit4]   2> 	  "operation":"state",
[junit4:junit4]   2> 	  "numShards":"1",
[junit4:junit4]   2> 	  "shard":null,
[junit4:junit4]   2> 	  "roles":null,
[junit4:junit4]   2> 	  "state":"down",
[junit4:junit4]   2> 	  "core":"collection1",
[junit4:junit4]   2> 	  "collection":"collection1",
[junit4:junit4]   2> 	  "node_name":"127.0.0.1:19665_",
[junit4:junit4]   2> 	  "base_url":"http://127.0.0.1:19665"}
[junit4:junit4]   2> 5238 T3933 oasc.Overseer$ClusterStateUpdater.createCollection Create collection collection1 with numShards 1
[junit4:junit4]   2> 5238 T3933 oasc.Overseer$ClusterStateUpdater.updateState Assigning new node to shard shard=shard1
[junit4:junit4]   2> 5250 T3951 oascc.ZkStateReader$2.process A cluster state change: WatchedEvent state:SyncConnected type:NodeDataChanged path:/clusterstate.json, has occurred - updating... (live nodes size: 2)
[junit4:junit4]   2> 5250 T3932 oascc.ZkStateReader$2.process A cluster state change: WatchedEvent state:SyncConnected type:NodeDataChanged path:/clusterstate.json, has occurred - updating... (live nodes size: 2)
[junit4:junit4]   2> 5250 T3938 oascc.ZkStateReader$2.process A cluster state change: WatchedEvent state:SyncConnected type:NodeDataChanged path:/clusterstate.json, has occurred - updating... (live nodes size: 2)
[junit4:junit4]   2> 6171 T3952 oasc.CoreContainer.registerCore registering core: collection1
[junit4:junit4]   2> 6171 T3952 oasc.ZkController.register Register replica - core:collection1 address:http://127.0.0.1:19665 collection:collection1 shard:shard1
[junit4:junit4]   2> 6172 T3952 oascc.SolrZkClient.makePath makePath: /collections/collection1/leader_elect/shard1/election
[junit4:junit4]   2> 6190 T3915 oazs.PrepRequestProcessor.pRequest Got user-level KeeperException when processing sessionid:0x13cdef553cf0006 type:delete cxid:0x45 zxid:0x5a txntype:-1 reqpath:n/a Error Path:/solr/collections/collection1/leaders Error:KeeperErrorCode = NoNode for /solr/collections/collection1/leaders
[junit4:junit4]   2> 6191 T3952 oasc.ShardLeaderElectionContext.runLeaderProcess Running the leader process.
[junit4:junit4]   2> 6191 T3915 oazs.PrepRequestProcessor.pRequest Got user-level KeeperException when processing sessionid:0x13cdef553cf0006 type:create cxid:0x46 zxid:0x5b txntype:-1 reqpath:n/a Error Path:/solr/overseer Error:KeeperErrorCode = NodeExists for /solr/overseer
[junit4:junit4]   2> 6193 T3952 oasc.ShardLeaderElectionContext.waitForReplicasToComeUp Enough replicas found to continue.
[junit4:junit4]   2> 6194 T3952 oasc.ShardLeaderElectionContext.runLeaderProcess I may be the new leader - try and sync
[junit4:junit4]   2> 6194 T3952 oasc.SyncStrategy.sync Sync replicas to http://127.0.0.1:19665/collection1/
[junit4:junit4]   2> 6194 T3952 oasc.SyncStrategy.syncReplicas Sync Success - now sync replicas to me
[junit4:junit4]   2> 6194 T3952 oasc.SyncStrategy.syncToMe http://127.0.0.1:19665/collection1/ has no replicas
[junit4:junit4]   2> 6195 T3952 oasc.ShardLeaderElectionContext.runLeaderProcess I am the new leader: http://127.0.0.1:19665/collection1/
[junit4:junit4]   2> 6195 T3952 oascc.SolrZkClient.makePath makePath: /collections/collection1/leaders/shard1
[junit4:junit4]   2> 6198 T3915 oazs.PrepRequestProcessor.pRequest Got user-level KeeperException when processing sessionid:0x13cdef553cf0006 type:create cxid:0x50 zxid:0x5f txntype:-1 reqpath:n/a Error Path:/solr/overseer Error:KeeperErrorCode = NodeExists for /solr/overseer
[junit4:junit4]   2> 6762 T3933 oascc.ZkStateReader.updateClusterState Updating cloud state from ZooKeeper... 
[junit4:junit4]   2> 6780 T3951 oascc.ZkStateReader$2.process A cluster state change: WatchedEvent state:SyncConnected type:NodeDataChanged path:/clusterstate.json, has occurred - updating... (live nodes size: 2)
[junit4:junit4]   2> 6780 T3932 oascc.ZkStateReader$2.process A cluster state change: WatchedEvent state:SyncConnected type:NodeDataChanged path:/clusterstate.json, has occurred - updating... (live nodes size: 2)
[junit4:junit4]   2> 6780 T3938 oascc.ZkStateReader$2.process A cluster state change: WatchedEvent state:SyncConnected type:NodeDataChanged path:/clusterstate.json, has occurred - updating... (live nodes size: 2)
[junit4:junit4]   2> 6812 T3952 oasc.ZkController.register We are http://127.0.0.1:19665/collection1/ and leader is http://127.0.0.1:19665/collection1/
[junit4:junit4]   2> 6812 T3952 oasc.ZkController.register No LogReplay needed for core=collection1 baseURL=http://127.0.0.1:19665
[junit4:junit4]   2> 6812 T3952 oasc.ZkController.checkRecovery I am the leader, no recovery necessary
[junit4:junit4]   2> 6813 T3952 oasc.ZkController.publish publishing core=collection1 state=active
[junit4:junit4]   2> 6813 T3952 oasc.ZkController.publish numShards not found on descriptor - reading it from system property
[junit4:junit4]   2> 6815 T3952 oascc.ZkStateReader.updateClusterState Updating cloud state from ZooKeeper... 
[junit4:junit4]   2> 6816 T3910 oass.SolrDispatchFilter.init user.dir=/usr/home/hudson/hudson-slave/workspace/Lucene-Solr-Tests-trunk-java7/solr/build/solr-core/test/J0
[junit4:junit4]   2> 6817 T3910 oass.SolrDispatchFilter.init SolrDispatchFilter.init() done
[junit4:junit4]   2> 6818 T3910 oascsi.HttpClientUtil.createClient Creating new http client, config:maxConnections=128&maxConnectionsPerHost=32&followRedirects=false
[junit4:junit4]   2> 6996 T3910 oejs.Server.doStart jetty-8.1.8.v20121106
[junit4:junit4]   2> 7000 T3910 oejs.AbstractConnector.doStart Started SocketConnector@127.0.0.1:47089
[junit4:junit4]   2> 7000 T3910 oass.SolrDispatchFilter.init SolrDispatchFilter.init()
[junit4:junit4]   2> 7001 T3910 oasc.SolrResourceLoader.locateSolrHome JNDI not configured for solr (NoInitialContextEx)
[junit4:junit4]   2> 7001 T3910 oasc.SolrResourceLoader.locateSolrHome using system property solr.solr.home: /usr/home/hudson/hudson-slave/workspace/Lucene-Solr-Tests-trunk-java7/solr/build/solr-core/test/J0/./org.apache.solr.cloud.SyncSliceTest-jetty2-1360950292083
[junit4:junit4]   2> 7002 T3910 oasc.CoreContainer$Initializer.initialize looking for solr.xml: /usr/home/hudson/hudson-slave/workspace/Lucene-Solr-Tests-trunk-java7/solr/build/solr-core/test/J0/./org.apache.solr.cloud.SyncSliceTest-jetty2-1360950292083/solr.xml
[junit4:junit4]   2> 7002 T3910 oasc.CoreContainer.<init> New CoreContainer 2015036889
[junit4:junit4]   2> 7003 T3910 oasc.CoreContainer.load Loading CoreContainer using Solr Home: '/usr/home/hudson/hudson-slave/workspace/Lucene-Solr-Tests-trunk-java7/solr/build/solr-core/test/J0/./org.apache.solr.cloud.SyncSliceTest-jetty2-1360950292083/'
[junit4:junit4]   2> 7003 T3910 oasc.SolrResourceLoader.<init> new SolrResourceLoader for directory: '/usr/home/hudson/hudson-slave/workspace/Lucene-Solr-Tests-trunk-java7/solr/build/solr-core/test/J0/./org.apache.solr.cloud.SyncSliceTest-jetty2-1360950292083/'
[junit4:junit4]   2> 7062 T3910 oashc.HttpShardHandlerFactory.getParameter Setting socketTimeout to: 60000
[junit4:junit4]   2> 7063 T3910 oashc.HttpShardHandlerFactory.getParameter Setting urlScheme to: http://
[junit4:junit4]   2> 7063 T3910 oashc.HttpShardHandlerFactory.getParameter Setting connTimeout to: 15000
[junit4:junit4]   2> 7064 T3910 oashc.HttpShardHandlerFactory.getParameter Setting maxConnectionsPerHost to: 20
[junit4:junit4]   2> 7064 T3910 oashc.HttpShardHandlerFactory.getParameter Setting corePoolSize to: 0
[junit4:junit4]   2> 7065 T3910 oashc.HttpShardHandlerFactory.getParameter Setting maximumPoolSize to: 2147483647
[junit4:junit4]   2> 7065 T3910 oashc.HttpShardHandlerFactory.getParameter Setting maxThreadIdleTime to: 5
[junit4:junit4]   2> 7066 T3910 oashc.HttpShardHandlerFactory.getParameter Setting sizeOfQueue to: -1
[junit4:junit4]   2> 7066 T3910 oashc.HttpShardHandlerFactory.getParameter Setting fairnessPolicy to: false
[junit4:junit4]   2> 7067 T3910 oascsi.HttpClientUtil.createClient Creating new http client, config:maxConnectionsPerHost=20&maxConnections=10000&socketTimeout=60000&connTimeout=15000&retry=false
[junit4:junit4]   2> 7086 T3910 oasc.CoreContainer.load Registering Log Listener
[junit4:junit4]   2> 7105 T3910 oasc.CoreContainer.initZooKeeper Zookeeper client=127.0.0.1:25803/solr
[junit4:junit4]   2> 7106 T3910 oasc.ZkController.checkChrootPath zkHost includes chroot
[junit4:junit4]   2> 7107 T3910 oaz.ZooKeeper.<init> Initiating client connection, connectString=127.0.0.1:25803 sessionTimeout=60000 watcher=org.apache.solr.common.cloud.ConnectionManager@18d02eaa
[junit4:junit4]   2> 7108 T3910 oascc.ConnectionManager.waitForConnected Waiting for client to connect to ZooKeeper
[junit4:junit4]   2> 7108 T3963 oaz.ClientCnxn$SendThread.logStartConnect Opening socket connection to server localhost/127.0.0.1:25803. Will not attempt to authenticate using SASL (access denied ("javax.security.auth.AuthPermission" "getLoginConfiguration"))
[junit4:junit4]   2> 7109 T3963 oaz.ClientCnxn$SendThread.primeConnection Socket connection established to localhost/127.0.0.1:25803, initiating session
[junit4:junit4]   2> 7109 T3912 oazs.NIOServerCnxnFactory.run Accepted socket connection from /140.211.11.196:38074
[junit4:junit4]   2> 7109 T3912 oazs.ZooKeeperServer.processConnectRequest Client attempting to establish new session at /140.211.11.196:38074
[junit4:junit4]   2> 7111 T3914 oazs.ZooKeeperServer.finishSessionInit Established session 0x13cdef553cf0007 with negotiated timeout 20000 for client /140.211.11.196:38074
[junit4:junit4]   2> 7111 T3963 oaz.ClientCnxn$SendThread.onConnected Session establishment complete on server localhost/127.0.0.1:25803, sessionid = 0x13cdef553cf0007, negotiated timeout = 20000
[junit4:junit4]   2> 7112 T3964 oascc.ConnectionManager.process Watcher org.apache.solr.common.cloud.ConnectionManager@18d02eaa name:ZooKeeperConnection Watcher:127.0.0.1:25803 got event WatchedEvent state:SyncConnected type:None path:null path:null type:None
[junit4:junit4]   2> 7112 T3910 oascc.ConnectionManager.waitForConnected Client is connected to ZooKeeper
[junit4:junit4]   2> 7113 T3915 oazs.PrepRequestProcessor.pRequest2Txn Processed session termination for sessionid: 0x13cdef553cf0007
[junit4:junit4]   2> 7127 T3964 oaz.ClientCnxn$EventThread.run EventThread shut down
[junit4:junit4]   2> 7127 T3912 oazs.NIOServerCnxn.closeSock Closed socket connection for client /140.211.11.196:38074 which had sessionid 0x13cdef553cf0007
[junit4:junit4]   2> 7127 T3910 oaz.ZooKeeper.close Session: 0x13cdef553cf0007 closed
[junit4:junit4]   2> 7128 T3910 oascsi.HttpClientUtil.createClient Creating new http client, config:maxConnections=500&maxConnectionsPerHost=16&socketTimeout=60000&connTimeout=15000
[junit4:junit4]   2> 7137 T3910 oaz.ZooKeeper.<init> Initiating client connection, connectString=127.0.0.1:25803/solr sessionTimeout=30000 watcher=org.apache.solr.common.cloud.ConnectionManager@39720815
[junit4:junit4]   2> 7138 T3910 oascc.ConnectionManager.waitForConnected Waiting for client to connect to ZooKeeper
[junit4:junit4]   2> 7139 T3965 oaz.ClientCnxn$SendThread.logStartConnect Opening socket connection to server localhost/127.0.0.1:25803. Will not attempt to authenticate using SASL (access denied ("javax.security.auth.AuthPermission" "getLoginConfiguration"))
[junit4:junit4]   2> 7139 T3965 oaz.ClientCnxn$SendThread.primeConnection Socket connection established to localhost/127.0.0.1:25803, initiating session
[junit4:junit4]   2> 7139 T3912 oazs.NIOServerCnxnFactory.run Accepted socket connection from /140.211.11.196:41307
[junit4:junit4]   2> 7140 T3912 oazs.ZooKeeperServer.processConnectRequest Client attempting to establish new session at /140.211.11.196:41307
[junit4:junit4]   2> 7141 T3914 oazs.ZooKeeperServer.finishSessionInit Established session 0x13cdef553cf0008 with negotiated timeout 20000 for client /140.211.11.196:41307
[junit4:junit4]   2> 7141 T3965 oaz.ClientCnxn$SendThread.onConnected Session establishment complete on server localhost/127.0.0.1:25803, sessionid = 0x13cdef553cf0008, negotiated timeout = 20000
[junit4:junit4]   2> 7141 T3966 oascc.ConnectionManager.process Watcher org.apache.solr.common.cloud.ConnectionManager@39720815 name:ZooKeeperConnection Watcher:127.0.0.1:25803/solr got event WatchedEvent state:SyncConnected type:None path:null path:null type:None
[junit4:junit4]   2> 7142 T3910 oascc.ConnectionManager.waitForConnected Client is connected to ZooKeeper
[junit4:junit4]   2> 7142 T3915 oazs.PrepRequestProcessor.pRequest Got user-level KeeperException when processing sessionid:0x13cdef553cf0008 type:create cxid:0x1 zxid:0x6c txntype:-1 reqpath:n/a Error Path:/solr/overseer Error:KeeperErrorCode = NodeExists for /solr/overseer
[junit4:junit4]   2> 7144 T3915 oazs.PrepRequestProcessor.pRequest Got user-level KeeperException when processing sessionid:0x13cdef553cf0008 type:create cxid:0x2 zxid:0x6d txntype:-1 reqpath:n/a Error Path:/solr/overseer Error:KeeperErrorCode = NodeExists for /solr/overseer
[junit4:junit4]   2> 7146 T3910 oascc.ZkStateReader.createClusterStateWatchersAndUpdate Updating cluster state from ZooKeeper... 
[junit4:junit4]   2> 7148 T3910 oasc.ZkController.createEphemeralLiveNode Register node as live in ZooKeeper:/live_nodes/127.0.0.1:47089_
[junit4:junit4]   2> 7148 T3915 oazs.PrepRequestProcessor.pRequest Got user-level KeeperException when processing sessionid:0x13cdef553cf0008 type:delete cxid:0x9 zxid:0x6e txntype:-1 reqpath:n/a Error Path:/solr/live_nodes/127.0.0.1:47089_ Error:KeeperErrorCode = NoNode for /solr/live_nodes/127.0.0.1:47089_
[junit4:junit4]   2> 7156 T3910 oascc.SolrZkClient.makePath makePath: /live_nodes/127.0.0.1:47089_
[junit4:junit4]   2> 7158 T3932 oascc.ZkStateReader$2.process A cluster state change: WatchedEvent state:SyncConnected type:NodeChildrenChanged path:/live_nodes, has occurred - updating... (live nodes size: 2)
[junit4:junit4]   2> 7158 T3938 oascc.ZkStateReader$3.process Updating live nodes... (3)
[junit4:junit4]   2> 7158 T3966 oascc.ZkStateReader$3.process Updating live nodes... (3)
[junit4:junit4]   2> 7158 T3951 oascc.ZkStateReader$3.process Updating live nodes... (3)
[junit4:junit4]   2> 7159 T3938 oascc.ZkStateReader$2.process A cluster state change: WatchedEvent state:SyncConnected type:NodeChildrenChanged path:/live_nodes, has occurred - updating... (live nodes size: 3)
[junit4:junit4]   2> 7159 T3951 oascc.ZkStateReader$2.process A cluster state change: WatchedEvent state:SyncConnected type:NodeChildrenChanged path:/live_nodes, has occurred - updating... (live nodes size: 3)
[junit4:junit4]   2> 7159 T3932 oascc.ZkStateReader$3.process Updating live nodes... (3)
[junit4:junit4]   2> 7166 T3967 oasc.CoreContainer.create Creating SolrCore 'collection1' using instanceDir: /usr/home/hudson/hudson-slave/workspace/Lucene-Solr-Tests-trunk-java7/solr/build/solr-core/test/J0/./org.apache.solr.cloud.SyncSliceTest-jetty2-1360950292083/collection1
[junit4:junit4]   2> 7167 T3967 oasc.ZkController.createCollectionZkNode Check for collection zkNode:collection1
[junit4:junit4]   2> 7167 T3967 oasc.ZkController.createCollectionZkNode Collection zkNode exists
[junit4:junit4]   2> 7168 T3967 oasc.ZkController.readConfigName Load collection config from:/collections/collection1
[junit4:junit4]   2> 7169 T3967 oasc.SolrResourceLoader.<init> new SolrResourceLoader for directory: '/usr/home/hudson/hudson-slave/workspace/Lucene-Solr-Tests-trunk-java7/solr/build/solr-core/test/J0/./org.apache.solr.cloud.SyncSliceTest-jetty2-1360950292083/collection1/'
[junit4:junit4]   2> 7170 T3967 oasc.SolrResourceLoader.replaceClassLoader Adding 'file:/usr/home/hudson/hudson-slave/workspace/Lucene-Solr-Tests-trunk-java7/solr/build/solr-core/test/J0/org.apache.solr.cloud.SyncSliceTest-jetty2-1360950292083/collection1/lib/README' to classloader
[junit4:junit4]   2> 7170 T3967 oasc.SolrResourceLoader.replaceClassLoader Adding 'file:/usr/home/hudson/hudson-slave/workspace/Lucene-Solr-Tests-trunk-java7/solr/build/solr-core/test/J0/org.apache.solr.cloud.SyncSliceTest-jetty2-1360950292083/collection1/lib/classes/' to classloader
[junit4:junit4]   2> 7224 T3967 oasc.SolrConfig.<init> Using Lucene MatchVersion: LUCENE_50
[junit4:junit4]   2> 7295 T3967 oasc.SolrConfig.<init> Loaded SolrConfig: solrconfig.xml
[junit4:junit4]   2> 7396 T3967 oass.IndexSchema.readSchema Reading Solr Schema
[junit4:junit4]   2> 7403 T3967 oass.IndexSchema.readSchema Schema name=test
[junit4:junit4]   2> 8029 T3967 oass.OpenExchangeRatesOrgProvider.init Initialized with rates=open-exchange-rates.json, refreshInterval=1440.
[junit4:junit4]   2> 8040 T3967 oass.IndexSchema.readSchema default search field in schema is text
[junit4:junit4]   2> 8044 T3967 oass.IndexSchema.readSchema unique key field: id
[junit4:junit4]   2> 8056 T3967 oass.FileExchangeRateProvider.reload Reloading exchange rates from file currency.xml
[junit4:junit4]   2> 8061 T3967 oass.FileExchangeRateProvider.reload Reloading exchange rates from file currency.xml
[junit4:junit4]   2> 8065 T3967 oass.OpenExchangeRatesOrgProvider.reload Reloading exchange rates from open-exchange-rates.json
[junit4:junit4]   2> 8066 T3967 oass.OpenExchangeRatesOrgProvider.reload Reloading exchange rates from open-exchange-rates.json
[junit4:junit4]   2> 8067 T3967 oasc.SolrCore.<init> [collection1] Opening new SolrCore at /usr/home/hudson/hudson-slave/workspace/Lucene-Solr-Tests-trunk-java7/solr/build/solr-core/test/J0/./org.apache.solr.cloud.SyncSliceTest-jetty2-1360950292083/collection1/, dataDir=./org.apache.solr.cloud.SyncSliceTest-1360950285256/jetty2/
[junit4:junit4]   2> 8068 T3967 oasc.JmxMonitoredMap.<init> JMX monitoring is enabled. Adding Solr mbeans to JMX Server: com.sun.jmx.mbeanserver.JmxMBeanServer@3bf06804
[junit4:junit4]   2> 8068 T3967 oasc.SolrCore.initDirectoryFactory solr.NRTCachingDirectoryFactory
[junit4:junit4]   2> 8069 T3967 oasc.CachingDirectoryFactory.get return new directory for /usr/home/hudson/hudson-slave/workspace/Lucene-Solr-Tests-trunk-java7/solr/build/solr-core/test/J0/./org.apache.solr.cloud.SyncSliceTest-1360950285256/jetty2 forceNew:false
[junit4:junit4]   2> 8070 T3967 oasc.CachingDirectoryFactory.close Releasing directory:/usr/home/hudson/hudson-slave/workspace/Lucene-Solr-Tests-trunk-java7/solr/build/solr-core/test/J0/./org.apache.solr.cloud.SyncSliceTest-1360950285256/jetty2
[junit4:junit4]   2> 8070 T3967 oasc.SolrCore.getNewIndexDir New index directory detected: old=null new=./org.apache.solr.cloud.SyncSliceTest-1360950285256/jetty2/index/
[junit4:junit4]   2> 8071 T3967 oasc.SolrCore.initIndex WARNING [collection1] Solr index directory './org.apache.solr.cloud.SyncSliceTest-1360950285256/jetty2/index' doesn't exist. Creating new index...
[junit4:junit4]   2> 8071 T3967 oasc.CachingDirectoryFactory.get return new directory for /usr/home/hudson/hudson-slave/workspace/Lucene-Solr-Tests-trunk-java7/solr/build/solr-core/test/J0/./org.apache.solr.cloud.SyncSliceTest-1360950285256/jetty2/index forceNew:false
[junit4:junit4]   2> 8077 T3967 oasc.SolrDeletionPolicy.onCommit SolrDeletionPolicy.onCommit: commits:num=1
[junit4:junit4]   2> 		commit{dir=RateLimitedDirectoryWrapper(NRTCachingDirectory(org.apache.lucene.store.NIOFSDirectory@/usr/home/hudson/hudson-slave/workspace/Lucene-Solr-Tests-trunk-java7/solr/build/solr-core/test/J0/org.apache.solr.cloud.SyncSliceTest-1360950285256/jetty2/index lockFactory=org.apache.lucene.store.NativeFSLockFactory@740717ed; maxCacheMB=48.0 maxMergeSizeMB=4.0)),segFN=segments_1,generation=1,filenames=[segments_1]
[junit4:junit4]   2> 8078 T3967 oasc.SolrDeletionPolicy.updateCommits newest commit = 1[segments_1]
[junit4:junit4]   2> 8079 T3967 oasc.CachingDirectoryFactory.close Releasing directory:/usr/home/hudson/hudson-slave/workspace/Lucene-Solr-Tests-trunk-java7/solr/build/solr-core/test/J0/./org.apache.solr.cloud.SyncSliceTest-1360950285256/jetty2/index
[junit4:junit4]   2> 8079 T3967 oasc.SolrCore.initWriters created xml: solr.XMLResponseWriter
[junit4:junit4]   2> 8081 T3967 oasup.UpdateRequestProcessorChain.init inserting DistributedUpdateProcessorFactory into updateRequestProcessorChain "dedupe"
[junit4:junit4]   2> 8081 T3967 oasup.UpdateRequestProcessorChain.init inserting DistributedUpdateProcessorFactory into updateRequestProcessorChain "dedupe-allfields"
[junit4:junit4]   2> 8082 T3967 oasup.UpdateRequestProcessorChain.init inserting DistributedUpdateProcessorFactory into updateRequestProcessorChain "stored_sig"
[junit4:junit4]   2> 8082 T3967 oasup.UpdateRequestProcessorChain.init inserting DistributedUpdateProcessorFactory into updateRequestProcessorChain "uniq-fields"
[junit4:junit4]   2> 8083 T3967 oasup.UpdateRequestProcessorChain.init inserting DistributedUpdateProcessorFactory into updateRequestProcessorChain "distrib-dup-test-chain-implicit"
[junit4:junit4]   2> 8083 T3967 oasc.RequestHandlers.initHandlersFromConfig adding lazy requestHandler: solr.ReplicationHandler
[junit4:junit4]   2> 8083 T3967 oasc.RequestHandlers.initHandlersFromConfig created /replication: solr.ReplicationHandler
[junit4:junit4]   2> 8084 T3967 oasc.RequestHandlers.initHandlersFromConfig created standard: solr.StandardRequestHandler
[junit4:junit4]   2> 8084 T3967 oasc.RequestHandlers.initHandlersFromConfig created /get: solr.RealTimeGetHandler
[junit4:junit4]   2> 8085 T3967 oasc.RequestHandlers.initHandlersFromConfig created dismax: solr.SearchHandler
[junit4:junit4]   2> 8086 T3967 oasc.RequestHandlers.initHandlersFromConfig created mock: org.apache.solr.core.MockQuerySenderListenerReqHandler
[junit4:junit4]   2> 8086 T3967 oasc.RequestHandlers.initHandlersFromConfig created /admin/: org.apache.solr.handler.admin.AdminHandlers
[junit4:junit4]   2> 8087 T3967 oasc.RequestHandlers.initHandlersFromConfig created defaults: solr.StandardRequestHandler
[junit4:junit4]   2> 8087 T3967 oasc.RequestHandlers.initHandlersFromConfig adding lazy requestHandler: solr.StandardRequestHandler
[junit4:junit4]   2> 8087 T3967 oasc.RequestHandlers.initHandlersFromConfig created lazy: solr.StandardRequestHandler
[junit4:junit4]   2> 8088 T3967 oasc.RequestHandlers.initHandlersFromConfig created /update: solr.UpdateRequestHandler
[junit4:junit4]   2> 8088 T3967 oasc.RequestHandlers.initHandlersFromConfig created /terms: org.apache.solr.handler.component.SearchHandler
[junit4:junit4]   2> 8089 T3967 oasc.RequestHandlers.initHandlersFromConfig created spellCheckCompRH: org.apache.solr.handler.component.SearchHandler
[junit4:junit4]   2> 8089 T3967 oasc.RequestHandlers.initHandlersFromConfig created spellCheckCompRH_Direct: org.apache.solr.handler.component.SearchHandler
[junit4:junit4]   2> 8090 T3967 oasc.RequestHandlers.initHandlersFromConfig created spellCheckWithWordbreak: org.apache.solr.handler.component.SearchHandler
[junit4:junit4]   2> 8091 T3967 oasc.RequestHandlers.initHandlersFromConfig created spellCheckWithWordbreak_Direct: org.apache.solr.handler.component.SearchHandler
[junit4:junit4]   2> 8091 T3967 oasc.RequestHandlers.initHandlersFromConfig created spellCheckCompRH1: org.apache.solr.handler.component.SearchHandler
[junit4:junit4]   2> 8092 T3967 oasc.RequestHandlers.initHandlersFromConfig created mltrh: org.apache.solr.handler.component.SearchHandler
[junit4:junit4]   2> 8092 T3967 oasc.RequestHandlers.initHandlersFromConfig created tvrh: org.apache.solr.handler.component.SearchHandler
[junit4:junit4]   2> 8093 T3967 oasc.RequestHandlers.initHandlersFromConfig created /mlt: solr.MoreLikeThisHandler
[junit4:junit4]   2> 8093 T3967 oasc.RequestHandlers.initHandlersFromConfig created /debug/dump: solr.DumpRequestHandler
[junit4:junit4]   2> 8106 T3967 oashl.XMLLoader.init xsltCacheLifetimeSeconds=60
[junit4:junit4]   2> 8111 T3967 oasc.SolrCore.initDeprecatedSupport WARNING solrconfig.xml uses deprecated <admin/gettableFiles>, Please update your config to use the ShowFileRequestHandler.
[junit4:junit4]   2> 8112 T3967 oasc.SolrCore.initDeprecatedSupport WARNING adding ShowFileRequestHandler with hidden files: [SCHEMA.XML, OLD_SYNONYMS.TXT, STOPWORDS.TXT, PROTWORDS.TXT, OPEN-EXCHANGE-RATES.JSON, SYNONYMS.TXT, CURRENCY.XML, MAPPING-ISOLATIN1ACCENT.TXT]
[junit4:junit4]   2> 8114 T3967 oasc.CachingDirectoryFactory.close Releasing directory:/usr/home/hudson/hudson-slave/workspace/Lucene-Solr-Tests-trunk-java7/solr/build/solr-core/test/J0/./org.apache.solr.cloud.SyncSliceTest-1360950285256/jetty2
[junit4:junit4]   2> 8116 T3967 oass.SolrIndexSearcher.<init> Opening Searcher@35121158 main
[junit4:junit4]   2> 8117 T3967 oasu.CommitTracker.<init> Hard AutoCommit: disabled
[junit4:junit4]   2> 8117 T3967 oasu.CommitTracker.<init> Soft AutoCommit: disabled
[junit4:junit4]   2> 8118 T3967 oashc.SpellCheckComponent.inform Initializing spell checkers
[junit4:junit4]   2> 8124 T3967 oass.DirectSolrSpellChecker.init init: {name=direct,classname=DirectSolrSpellChecker,field=lowerfilt,minQueryLength=3}
[junit4:junit4]   2> 8174 T3968 oasc.SolrCore.registerSearcher [collection1] Registered new searcher Searcher@35121158 main{StandardDirectoryReader(segments_1:1)}
[junit4:junit4]   2> 8180 T3967 oasc.ZkController.publish publishing core=collection1 state=down
[junit4:junit4]   2> 8180 T3967 oasc.ZkController.publish numShards not found on descriptor - reading it from system property
[junit4:junit4]   2> 8285 T3933 oascc.ZkStateReader.updateClusterState Updating cloud state from ZooKeeper... 
[junit4:junit4]   2> 8286 T3933 oasc.Overseer$ClusterStateUpdater.updateState Update state numShards=1 message={
[junit4:junit4]   2> 	  "operation":"state",
[junit4:junit4]   2> 	  "numShards":"1",
[junit4:junit4]   2> 	  "shard":"shard1",
[junit4:junit4]   2> 	  "roles":null,
[junit4:junit4]   2> 	  "state":"active",
[junit4:junit4]   2> 	  "core":"collection1",
[junit4:junit4]   2> 	  "collection":"collection1",
[junit4:junit4]   2> 	  "node_name":"127.0.0.1:19665_",
[junit4:junit4]   2> 	  "base_url":"http://127.0.0.1:19665"}
[junit4:junit4]   2> 8303 T3933 oasc.Overseer$ClusterStateUpdater.updateState Update state numShards=1 message={
[junit4:junit4]   2> 	  "operation":"state",
[junit4:junit4]   2> 	  "numShards":"1",
[junit4:junit4]   2> 	  "shard":null,
[junit4:junit4]   2> 	  "roles":null,
[junit4:junit4]   2> 	  "state":"down",
[junit4:junit4]   2> 	  "core":"collection1",
[junit4:junit4]   2> 	  "collection":"collection1",
[junit4:junit4]   2> 	  "node_name":"127.0.0.1:47089_",
[junit4:junit4]   2> 	  "base_url":"http://127.0.0.1:47089"}
[junit4:junit4]   2> 8304 T3933 oasc.Overseer$ClusterStateUpdater.updateState Collection already exists with numShards=1
[junit4:junit4]   2> 8304 T3933 oasc.Overseer$ClusterStateUpdater.updateState Assigning new node to shard shard=shard1
[junit4:junit4]   2> 8316 T3951 oascc.ZkStateReader$2.process A cluster state change: WatchedEvent state:SyncConnected type:NodeDataChanged path:/clusterstate.json, has occurred - updating... (live nodes size: 3)
[junit4:junit4]   2> 8316 T3966 oascc.ZkStateReader$2.process A cluster state change: WatchedEvent state:SyncConnected type:NodeDataChanged path:/clusterstate.json, has occurred - updating... (live nodes size: 3)
[junit4:junit4]   2> 8316 T3932 oascc.ZkStateReader$2.process A cluster state change: WatchedEvent state:SyncConnected type:NodeDataChanged path:/clusterstate.json, has occurred - updating... (live nodes size: 3)
[junit4:junit4]   2> 8316 T3938 oascc.ZkStateReader$2.process A cluster state change: WatchedEvent state:SyncConnected type:NodeDataChanged path:/clusterstate.json, has occurred - updating... (live nodes size: 3)
[junit4:junit4]   2> 9182 T3967 oasc.CoreContainer.registerCore registering core: collection1
[junit4:junit4]   2> 9182 T3967 oasc.ZkController.register Register replica - core:collection1 address:http://127.0.0.1:47089 collection:collection1 shard:shard1
[junit4:junit4]   2> 9211 T3967 oasc.ZkController.register We are http://127.0.0.1:47089/collection1/ and leader is http://127.0.0.1:19665/collection1/
[junit4:junit4]   2> 9212 T3967 oasc.ZkController.register No LogReplay needed for core=collection1 baseURL=http://127.0.0.1:47089
[junit4:junit4]   2> 9212 T3967 oasc.ZkController.checkRecovery Core needs to recover:collection1
[junit4:junit4]   2> 9212 T3967 oasu.DefaultSolrCoreState.doRecovery Running recovery - first canceling any ongoing recovery
[junit4:junit4]   2> ASYNC  NEW_CORE C195 name=collection1 org.apache.solr.core.SolrCore@6be2c27 url=http://127.0.0.1:47089/collection1 node=127.0.0.1:47089_ C195_STATE=coll:collection1 core:collection1 props:{shard=null, roles=null, state=down, core=collection1, collection=collection1, node_name=127.0.0.1:47089_, base_url=http://127.0.0.1:47089}
[junit4:junit4]   2> 9213 T3969 C195 P47089 oasc.RecoveryStrategy.run Starting recovery process.  core=collection1 recoveringAfterStartup=true
[junit4:junit4]   2> 9213 T3967 oascc.ZkStateReader.updateClusterState Updating cloud state from ZooKeeper... 
[junit4:junit4]   2> 9214 T3969 C195 P47089 oasc.RecoveryStrategy.doRecovery ###### startupVersions=[]
[junit4:junit4]   2> 9214 T3969 C195 P47089 oasc.ZkController.publish publishing core=collection1 state=recovering
[junit4:junit4]   2> 9215 T3969 C195 P47089 oasc.ZkController.publish numShards not found on descriptor - reading it from system property
[junit4:junit4]   2> 9214 T3910 oass.SolrDispatchFilter.init user.dir=/usr/home/hudson/hudson-slave/workspace/Lucene-Solr-Tests-trunk-java7/solr/build/solr-core/test/J0
[junit4:junit4]   2> 9215 T3910 oass.SolrDispatchFilter.init SolrDispatchFilter.init() done
[junit4:junit4]   2> 9216 T3910 oascsi.HttpClientUtil.createClient Creating new http client, config:maxConnections=128&maxConnectionsPerHost=32&followRedirects=false
[junit4:junit4]   2> 9244 T3969 C195 P47089 oascsi.HttpClientUtil.createClient Creating new http client, config:maxConnections=128&maxConnectionsPerHost=32&followRedirects=false
[junit4:junit4]   2> 9395 T3910 oejs.Server.doStart jetty-8.1.8.v20121106
[junit4:junit4]   2> 9398 T3910 oejs.AbstractConnector.doStart Started SocketConnector@127.0.0.1:28562
[junit4:junit4]   2> 9398 T3910 oass.SolrDispatchFilter.init SolrDispatchFilter.init()
[junit4:junit4]   2> 9399 T3910 oasc.SolrResourceLoader.locateSolrHome JNDI not configured for solr (NoInitialContextEx)
[junit4:junit4]   2> 9399 T3910 oasc.SolrResourceLoader.locateSolrHome using system property solr.solr.home: /usr/home/hudson/hudson-slave/workspace/Lucene-Solr-Tests-trunk-java7/solr/build/solr-core/test/J0/./org.apache.solr.cloud.SyncSliceTest-jetty3-1360950294480
[junit4:junit4]   2> 9400 T3910 oasc.CoreContainer$Initializer.initialize looking for solr.xml: /usr/home/hudson/hudson-slave/workspace/Lucene-Solr-Tests-trunk-java7/solr/build/solr-core/test/J0/./org.apache.solr.cloud.SyncSliceTest-jetty3-1360950294480/solr.xml
[junit4:junit4]   2> 9400 T3910 oasc.CoreContainer.<init> New CoreContainer 1769290505
[junit4:junit4]   2> 9401 T3910 oasc.CoreContainer.load Loading CoreContainer using Solr Home: '/usr/home/hudson/hudson-slave/workspace/Lucene-Solr-Tests-trunk-java7/solr/build/solr-core/test/J0/./org.apache.solr.cloud.SyncSliceTest-jetty3-1360950294480/'
[junit4:junit4]   2> 9402 T3910 oasc.SolrResourceLoader.<init> new SolrResourceLoader for directory: '/usr/home/hudson/hudson-slave/workspace/Lucene-Solr-Tests-trunk-java7/solr/build/solr-core/test/J0/./org.apache.solr.cloud.SyncSliceTest-jetty3-1360950294480/'
[junit4:junit4]   2> 9460 T3910 oashc.HttpShardHandlerFactory.getParameter Setting socketTimeout to: 60000
[junit4:junit4]   2> 9461 T3910 oashc.HttpShardHandlerFactory.getParameter Setting urlScheme to: http://
[junit4:junit4]   2> 9461 T3910 oashc.HttpShardHandlerFactory.getParameter Setting connTimeout to: 15000
[junit4:junit4]   2> 9462 T3910 oashc.HttpShardHandlerFactory.getParameter Setting maxConnectionsPerHost to: 20
[junit4:junit4]   2> 9462 T3910 oashc.HttpShardHandlerFactory.getParameter Setting corePoolSize to: 0
[junit4:junit4]   2> 9463 T3910 oashc.HttpShardHandlerFactory.getParameter Setting maximumPoolSize to: 2147483647
[junit4:junit4]   2> 9463 T3910 oashc.HttpShardHandlerFactory.getParameter Setting maxThreadIdleTime to: 5
[junit4:junit4]   2> 9463 T3910 oashc.HttpShardHandlerFactory.getParameter Setting sizeOfQueue to: -1
[junit4:junit4]   2> 9464 T3910 oashc.HttpShardHandlerFactory.getParameter Setting fairnessPolicy to: false
[junit4:junit4]   2> 9464 T3910 oascsi.HttpClientUtil.createClient Creating new http client, config:maxConnectionsPerHost=20&maxConnections=10000&socketTimeout=60000&connTimeout=15000&retry=false
[junit4:junit4]   2> 9484 T3910 oasc.CoreContainer.load Registering Log Listener
[junit4:junit4]   2> 9503 T3910 oasc.CoreContainer.initZooKeeper Zookeeper client=127.0.0.1:25803/solr
[junit4:junit4]   2> 9504 T3910 oasc.ZkController.checkChrootPath zkHost includes chroot
[junit4:junit4]   2> 9505 T3910 oaz.ZooKeeper.<init> Initiating client connection, connectString=127.0.0.1:25803 sessionTimeout=60000 watcher=org.apache.solr.common.cloud.ConnectionManager@62720900
[junit4:junit4]   2> 9506 T3910 oascc.ConnectionManager.waitForConnected Waiting for client to connect to ZooKeeper
[junit4:junit4]   2> 9506 T3979 oaz.ClientCnxn$SendThread.logStartConnect Opening socket connection to server localhost/127.0.0.1:25803. Will not attempt to authenticate using SASL (access denied ("javax.security.auth.AuthPermission" "getLoginConfiguration"))
[junit4:junit4]   2> 9507 T3979 oaz.ClientCnxn$SendThread.primeConnection Socket connection established to localhost/127.0.0.1:25803, initiating session
[junit4:junit4]   2> 9507 T3912 oazs.NIOServerCnxnFactory.run Accepted socket connection from /140.211.11.196:52194
[junit4:junit4]   2> 9507 T3912 oazs.ZooKeeperServer.processConnectRequest Client attempting to establish new session at /140.211.11.196:52194
[junit4:junit4]   2> 9517 T3914 oazs.ZooKeeperServer.finishSessionInit Established session 0x13cdef553cf0009 with negotiated timeout 20000 for client /140.211.11.196:52194
[junit4:junit4]   2> 9517 T3979 oaz.ClientCnxn$SendThread.onConnected Session establishment complete on server localhost/127.0.0.1:25803, sessionid = 0x13cdef553cf0009, negotiated timeout = 20000
[junit4:junit4]   2> 9518 T3980 oascc.ConnectionManager.process Watcher org.apache.solr.common.cloud.ConnectionManager@62720900 name:ZooKeeperConnection Watcher:127.0.0.1:25803 got event WatchedEvent state:SyncConnected type:None path:null path:null type:None
[junit4:junit4]   2> 9518 T3910 oascc.ConnectionManager.waitForConnected Client is connected to ZooKeeper
[junit4:junit4]   2> 9519 T3915 oazs.PrepRequestProcessor.pRequest2Txn Processed session termination for sessionid: 0x13cdef553cf0009
[junit4:junit4]   2> 9520 T3980 oaz.ClientCnxn$EventThread.run EventThread shut down
[junit4:junit4]   2> 9520 T3912 oazs.NIOServerCnxn.closeSock Closed socket connection for client /140.211.11.196:52194 which had sessionid 0x13cdef553cf0009
[junit4:junit4]   2> 9520 T3910 oaz.ZooKeeper.close Session: 0x13cdef553cf0009 closed
[junit4:junit4]   2> 9521 T3910 oascsi.HttpClientUtil.createClient Creating new http client, config:maxConnections=500&maxConnectionsPerHost=16&socketTimeout=60000&connTimeout=15000
[junit4:junit4]   2> 9531 T3910 oaz.ZooKeeper.<init> Initiating client connection, connectString=127.0.0.1:25803/solr sessionTimeout=30000 watcher=org.apache.solr.common.cloud.ConnectionManager@474dec9
[junit4:junit4]   2> 9532 T3910 oascc.ConnectionManager.waitForConnected Waiting for client to connect to ZooKeeper
[junit4:junit4]   2> 9532 T3981 oaz.ClientCnxn$SendThread.logStartConnect Opening socket connection to server localhost/127.0.0.1:25803. Will not attempt to authenticate using SASL (access denied ("javax.security.auth.AuthPermission" "getLoginConfiguration"))
[junit4:junit4]   2> 9533 T3981 oaz.ClientCnxn$SendThread.primeConnection Socket connection established to localhost/127.0.0.1:25803, initiating session
[junit4:junit4]   2> 9533 T3912 oazs.NIOServerCnxnFactory.run Accepted socket connection from /140.211.11.196:25033
[junit4:junit4]   2> 9533 T3912 oazs.ZooKeeperServer.processConnectRequest Client attempting to establish new session at /140.211.11.196:25033
[junit4:junit4]   2> 9534 T3914 oazs.ZooKeeperServer.finishSessionInit Established session 0x13cdef553cf000a with negotiated timeout 20000 for client /140.211.11.196:25033
[junit4:junit4]   2> 9534 T3981 oaz.ClientCnxn$SendThread.onConnected Session establishment complete on server localhost/127.0.0.1:25803, sessionid = 0x13cdef553cf000a, negotiated timeout = 20000
[junit4:junit4]   2> 9535 T3982 oascc.ConnectionManager.process Watcher org.apache.solr.common.cloud.ConnectionManager@474dec9 name:ZooKeeperConnection Watcher:127.0.0.1:25803/solr got event WatchedEvent state:SyncConnected type:None path:null path:null type:None
[junit4:junit4]   2> 9535 T3910 oascc.ConnectionManager.waitForConnected Client is connected to ZooKeeper
[junit4:junit4]   2> 9536 T3915 oazs.PrepRequestProcessor.pRequest Got user-level KeeperException when processing sessionid:0x13cdef553cf000a type:create cxid:0x1 zxid:0x7e txntype:-1 reqpath:n/a Error Path:/solr/overseer Error:KeeperErrorCode = NodeExists for /solr/overseer
[junit4:junit4]   2> 9537 T3915 oazs.PrepRequestProcessor.pRequest Got user-level KeeperException when processing sessionid:0x13cdef553cf000a type:create cxid:0x2 zxid:0x7f txntype:-1 reqpath:n/a Error Path:/solr/overseer Error:KeeperErrorCode = NodeExists for /solr/overseer
[junit4:junit4]   2> 9546 T3910 oascc.ZkStateReader.createClusterStateWatchersAndUpdate Updating cluster state from ZooKeeper... 
[junit4:junit4]   2> 9548 T3910 oasc.ZkController.createEphemeralLiveNode Register node as live in ZooKeeper:/live_nodes/127.0.0.1:28562_
[junit4:junit4]   2> 9549 T3915 oazs.PrepRequestProcessor.pRequest Got user-level KeeperException when processing sessionid:0x13cdef553cf000a type:delete cxid:0x9 zxid:0x80 txntype:-1 reqpath:n/a Error Path:/solr/live_nodes/127.0.0.1:28562_ Error:KeeperErrorCode = NoNode for /solr/live_nodes/127.0.0.1:28562_
[junit4:junit4]   2> 9550 T3910 oascc.SolrZkClient.makePath makePath: /live_nodes/127.0.0.1:28562_
[junit4:junit4]   2> 9556 T3932 oascc.ZkStateReader$2.process A cluster state change: WatchedEvent state:SyncConnected type:NodeChildrenChanged path:/live_nodes, has occurred - updating... (live nodes size: 3)
[junit4:junit4]   2> 9557 T3966 oascc.ZkStateReader$2.process A cluster state change: WatchedEvent state:SyncConnected type:NodeChildrenChanged path:/live_nodes, has occurred - updating... (live nodes size: 3)
[junit4:junit4]   2> 9557 T3938 oascc.ZkStateReader$3.process Updating live nodes... (4)
[junit4:junit4]   2> 9557 T3951 oascc.ZkStateReader$3.process Updating live nodes... (4)
[junit4:junit4]   2> 9557 T3982 oascc.ZkStateReader$3.process Updating live nodes... (4)
[junit4:junit4]   2> 9557 T3938 oascc.ZkStateReader$2.process A cluster state change: WatchedEvent state:SyncConnected type:NodeChildrenChanged path:/live_nodes, has occurred - updating... (live nodes size: 4)
[junit4:junit4]   2> 9557 T3951 oascc.ZkStateReader$2.process A cluster state change: WatchedEvent state:SyncConnected type:NodeChildrenChanged path:/live_nodes, has occurred - updating... (live nodes size: 4)
[junit4:junit4]   2> 9559 T3932 oascc.ZkStateReader$3.process Updating live nodes... (4)
[junit4:junit4]   2> 9559 T3966 oascc.ZkStateReader$3.process Updating live nodes... (4)
[junit4:junit4]   2> 9565 T3983 oasc.CoreContainer.create Creating SolrCore 'collection1' using instanceDir: /usr/home/hudson/hudson-slave/workspace/Lucene-Solr-Tests-trunk-java7/solr/build/solr-core/test/J0/./org.apache.solr.cloud.SyncSliceTest-jetty3-1360950294480/collection1
[junit4:junit4]   2> 9566 T3983 oasc.ZkController.createCollectionZkNode Check for collection zkNode:collection1
[junit4:junit4]   2> 9566 T3983 oasc.ZkController.createCollectionZkNode Collection zkNode exists
[junit4:junit4]   2> 9566 T3983 oasc.ZkController.readConfigName Load collection config from:/collections/collection1
[junit4:junit4]   2> 9568 T3983 oasc.SolrResourceLoader.<init> new SolrResourceLoader for directory: '/usr/home/hudson/hudson-slave/workspace/Lucene-Solr-Tests-trunk-java7/solr/build/solr-core/test/J0/./org.apache.solr.cloud.SyncSliceTest-jetty3-1360950294480/collection1/'
[junit4:junit4]   2> 9569 T3983 oasc.SolrResourceLoader.replaceClassLoader Adding 'file:/usr/home/hudson/hudson-slave/workspace/Lucene-Solr-Tests-trunk-java7/solr/build/solr-core/test/J0/org.apache.solr.cloud.SyncSliceTest-jetty3-1360950294480/collection1/lib/README' to classloader
[junit4:junit4]   2> 9569 T3983 oasc.SolrResourceLoader.replaceClassLoader Adding 'file:/usr/home/hudson/hudson-slave/workspace/Lucene-Solr-Tests-trunk-java7/solr/build/solr-core/test/J0/org.apache.solr.cloud.SyncSliceTest-jetty3-1360950294480/collection1/lib/classes/' to classloader
[junit4:junit4]   2> 9623 T3983 oasc.SolrConfig.<init> Using Lucene MatchVersion: LUCENE_50
[junit4:junit4]   2> 9695 T3983 oasc.SolrConfig.<init> Loaded SolrConfig: solrconfig.xml
[junit4:junit4]   2> 9796 T3983 oass.IndexSchema.readSchema Reading Solr Schema
[junit4:junit4]   2> 9803 T3983 oass.IndexSchema.readSchema Schema name=test
[junit4:junit4]   2> 9821 T3933 oascc.ZkStateReader.updateClusterState Updating cloud state from ZooKeeper... 
[junit4:junit4]   2> 9822 T3933 oasc.Overseer$ClusterStateUpdater.updateState Update state numShards=1 message={
[junit4:junit4]   2> 	  "operation":"state",
[junit4:junit4]   2> 	  "numShards":"1",
[junit4:junit4]   2> 	  "shard":"shard1",
[junit4:junit4]   2> 	  "roles":null,
[junit4:junit4]   2> 	  "state":"recovering",
[junit4:junit4]   2> 	  "core":"collection1",
[junit4:junit4]   2> 	  "collection":"collection1",
[junit4:junit4]   2> 	  "node_name":"127.0.0.1:47089_",
[junit4:junit4]   2> 	  "base_url":"http://127.0.0.1:47089"}
[junit4:junit4]   2> 9835 T3966 oascc.ZkStateReader$2.process A cluster state change: WatchedEvent state:SyncConnected type:NodeDataChanged path:/clusterstate.json, has occurred - updating... (live nodes size: 4)
[junit4:junit4]   2> 9835 T3951 oascc.ZkStateReader$2.process A cluster state change: WatchedEvent state:SyncConnected type:NodeDataChanged path:/clusterstate.json, has occurred - updating... (live nodes size: 4)
[junit4:junit4]   2> 9835 T3932 oascc.ZkStateReader$2.process A cluster state change: WatchedEvent state:SyncConnected type:NodeDataChanged path:/clusterstate.json, has occurred - updating... (live nodes size: 4)
[junit4:junit4]   2> 9835 T3938 oascc.ZkStateReader$2.process A cluster state change: WatchedEvent state:SyncConnected type:NodeDataChanged path:/clusterstate.json, has occurred - updating... (live nodes size: 4)
[junit4:junit4]   2> 9836 T3982 oascc.ZkStateReader$2.process A cluster state change: WatchedEvent state:SyncConnected type:NodeDataChanged path:/clusterstate.json, has occurred - updating... (live nodes size: 4)
[junit4:junit4]   2> 10413 T3983 oass.OpenExchangeRatesOrgProvider.init Initialized with rates=open-exchange-rates.json, refreshInterval=1440.
[junit4:junit4]   2> 10424 T3983 oass.IndexSchema.readSchema default search field in schema is text
[junit4:junit4]   2> 10428 T3983 oass.IndexSchema.readSchema unique key field: id
[junit4:junit4]   2> 10441 T3983 oass.FileExchangeRateProvider.reload Reloading exchange rates from file currency.xml
[junit4:junit4]   2> 10446 T3983 oass.FileExchangeRateProvider.reload Reloading exchange rates from file currency.xml
[junit4:junit4]   2> 10450 T3983 oass.OpenExchangeRatesOrgProvider.reload Reloading exchange rates from open-exchange-rates.json
[junit4:junit4]   2> 10451 T3983 oass.OpenExchangeRatesOrgProvider.reload Reloading exchange rates from open-exchange-rates.json
[junit4:junit4]   2> 10452 T3983 oasc.SolrCore.<init> [collection1] Opening new SolrCore at /usr/home/hudson/hudson-slave/workspace/Lucene-Solr-Tests-trunk-java7/solr/build/solr-core/test/J0/./org.apache.solr.cloud.SyncSliceTest-jetty3-1360950294480/collection1/, dataDir=./org.apache.solr.cloud.SyncSliceTest-1360950285256/jetty3/
[junit4:junit4]   2> 10453 T3983 oasc.JmxMonitoredMap.<init> JMX monitoring is enabled. Adding Solr mbeans to JMX Server: com.sun.jmx.mbeanserver.JmxMBeanServer@3bf06804
[junit4:junit4]   2> 10453 T3983 oasc.SolrCore.initDirectoryFactory solr.NRTCachingDirectoryFactory
[junit4:junit4]   2> 10454 T3983 oasc.CachingDirectoryFactory.get return new directory for /usr/home/hudson/hudson-slave/workspace/Lucene-Solr-Tests-trunk-java7/solr/build/solr-core/test/J0/./org.apache.solr.cloud.SyncSliceTest-1360950285256/jetty3 forceNew:false
[junit4:junit4]   2> 10455 T3983 oasc.CachingDirectoryFactory.close Releasing directory:/usr/home/hudson/hudson-slave/workspace/Lucene-Solr-Tests-trunk-java7/solr/build/solr-core/test/J0/./org.apache.solr.cloud.SyncSliceTest-1360950285256/jetty3
[junit4:junit4]   2> 10455 T3983 oasc.SolrCore.getNewIndexDir New index directory detected: old=null new=./org.apache.solr.cloud.SyncSliceTest-1360950285256/jetty3/index/
[junit4:junit4]   2> 10456 T3983 oasc.SolrCore.initIndex WARNING [collection1] Solr index directory './org.apache.solr.cloud.SyncSliceTest-1360950285256/jetty3/index' doesn't exist. Creating new index...
[junit4:junit4]   2> 10456 T3983 oasc.CachingDirectoryFactory.get return new directory for /usr/home/hudson/hudson-slave/workspace/Lucene-Solr-Tests-trunk-java7/solr/build/solr-core/test/J0/./org.apache.solr.cloud.SyncSliceTest-1360950285256/jetty3/index forceNew:false
[junit4:junit4]   2> 10464 T3983 oasc.SolrDeletionPolicy.onCommit SolrDeletionPolicy.onCommit: commits:num=1
[junit4:junit4]   2> 		commit{dir=RateLimitedDirectoryWrapper(NRTCachingDirectory(org.apache.lucene.store.NIOFSDirectory@/usr/home/hudson/hudson-slave/workspace/Lucene-Solr-Tests-trunk-java7/solr/build/solr-core/test/J0/org.apache.solr.cloud.SyncSliceTest-1360950285256/jetty3/index lockFactory=org.apache.lucene.store.NativeFSLockFactory@502ee6f9; maxCacheMB=48.0 maxMergeSizeMB=4.0)),segFN=segments_1,generation=1,filenames=[segments_1]
[junit4:junit4]   2> 10464 T3983 oasc.SolrDeletionPolicy.updateCommits newest commit = 1[segments_1]
[junit4:junit4]   2> 10465 T3983 oasc.CachingDirectoryFactory.close Releasing directory:/usr/home/hudson/hudson-slave/workspace/Lucene-Solr-Tests-trunk-java7/solr/build/solr-core/test/J0/./org.apache.solr.cloud.SyncSliceTest-1360950285256/jetty3/index
[junit4:junit4]   2> 10465 T3983 oasc.SolrCore.initWriters created xml: solr.XMLResponseWriter
[junit4:junit4]   2> 10467 T3983 oasup.UpdateRequestProcessorChain.init inserting DistributedUpdateProcessorFactory into updateRequestProcessorChain "dedupe"
[junit4:junit4]   2> 10468 T3983 oasup.UpdateRequestProcessorChain.init inserting DistributedUpdateProcessorFactory into updateRequestProcessorChain "dedupe-allfields"
[junit4:junit4]   2> 10468 T3983 oasup.UpdateRequestProcessorChain.init inserting DistributedUpdateProcessorFactory into updateRequestProcessorChain "stored_sig"
[junit4:junit4]   2> 10468 T3983 oasup.UpdateRequestProcessorChain.init inserting DistributedUpdateProcessorFactory into updateRequestProcessorChain "uniq-fields"
[junit4:junit4]   2> 10469 T3983 oasup.UpdateRequestProcessorChain.init inserting DistributedUpdateProcessorFactory into updateRequestProcessorChain "distrib-dup-test-chain-implicit"
[junit4:junit4]   2> 10469 T3983 oasc.RequestHandlers.initHandlersFromConfig adding lazy requestHandler: solr.ReplicationHandler
[junit4:junit4]   2> 10470 T3983 oasc.RequestHandlers.initHandlersFromConfig created /replication: solr.ReplicationHandler
[junit4:junit4]   2> 10470 T3983 oasc.RequestHandlers.initHandlersFromConfig created standard: solr.StandardRequestHandler
[junit4:junit4]   2> 10471 T3983 oasc.RequestHandlers.initHandlersFromConfig created /get: solr.RealTimeGetHandler
[junit4:junit4]   2> 10471 T3983 oasc.RequestHandlers.initHandlersFromConfig created dismax: solr.SearchHandler
[junit4:junit4]   2> 10472 T3983 oasc.RequestHandlers.initHandlersFromConfig created mock: org.apache.solr.core.MockQuerySenderListenerReqHandler
[junit4:junit4]   2> 10472 T3983 oasc.RequestHandlers.initHandlersFromConfig created /admin/: org.apache.solr.handler.admin.AdminHandlers
[junit4:junit4]   2> 10473 T3983 oasc.RequestHandlers.initHandlersFromConfig created defaults: solr.StandardRequestHandler
[junit4:junit4]   2> 10473 T3983 oasc.RequestHandlers.initHandlersFromConfig adding lazy requestHandler: solr.StandardRequestHandler
[junit4:junit4]   2> 10474 T3983 oasc.RequestHandlers.initHandlersFromConfig created lazy: solr.StandardRequestHandler
[junit4:junit4]   2> 10474 T3983 oasc.RequestHandlers.initHandlersFromConfig created /update: solr.UpdateRequestHandler
[junit4:junit4]   2> 10475 T3983 oasc.RequestHandlers.initHandlersFromConfig created /terms: org.apache.solr.handler.component.SearchHandler
[junit4:junit4]   2> 10475 T3983 oasc.RequestHandlers.initHandlersFromConfig created spellCheckCompRH: org.apache.solr.handler.component.SearchHandler
[junit4:junit4]   2> 10476 T3983 oasc.RequestHandlers.initHandlersFromConfig created spellCheckCompRH_Direct: org.apache.solr.handler.component.SearchHandler
[junit4:junit4]   2> 10476 T3983 oasc.RequestHandlers.initHandlersFromConfig created spellCheckWithWordbreak: org.apache.solr.handler.component.SearchHandler
[junit4:junit4]   2> 10477 T3983 oasc.RequestHandlers.initHandlersFromConfig created spellCheckWithWordbreak_Direct: org.apache.solr.handler.component.SearchHandler
[junit4:junit4]   2> 10477 T3983 oasc.RequestHandlers.initHandlersFromConfig created spellCheckCompRH1: org.apache.solr.handler.component.SearchHandler
[junit4:junit4]   2> 10478 T3983 oasc.RequestHandlers.initHandlersFromConfig created mltrh: org.apache.solr.handler.component.SearchHandler
[junit4:junit4]   2> 10478 T3983 oasc.RequestHandlers.initHandlersFromConfig created tvrh: org.apache.solr.handler.component.SearchHandler
[junit4:junit4]   2> 10479 T3983 oasc.RequestHandlers.initHandlersFromConfig created /mlt: solr.MoreLikeThisHandler
[junit4:junit4]   2> 10479 T3983 oasc.RequestHandlers.initHandlersFromConfig created /debug/dump: solr.DumpRequestHandler
[junit4:junit4]   2> 10491 T3983 oashl.XMLLoader.init xsltCacheLifetimeSeconds=60
[junit4:junit4]   2> 10495 T3983 oasc.SolrCore.initDeprecatedSupport WARNING solrconfig.xml uses deprecated <admin/gettableFiles>, Please update your config to use the ShowFileRequestHandler.
[junit4:junit4]   2> 10496 T3983 oasc.SolrCore.initDeprecatedSupport WARNING adding ShowFileRequestHandler with hidden files: [SCHEMA.XML, OLD_SYNONYMS.TXT, STOPWORDS.TXT, PROTWORDS.TXT, OPEN-EXCHANGE-RATES.JSON, SYNONYMS.TXT, CURRENCY.XML, MAPPING-ISOLATIN1ACCENT.TXT]
[junit4:junit4]   2> 10499 T3983 oasc.CachingDirectoryFactory.close Releasing directory:/usr/home/hudson/hudson-slave/workspace/Lucene-Solr-Tests-trunk-java7/solr/build/solr-core/test/J0/./org.apache.solr.cloud.SyncSliceTest-1360950285256/jetty3
[junit4:junit4]   2> 10500 T3983 oass.SolrIndexSearcher.<init> Opening Searcher@1dfac42e main
[junit4:junit4]   2> 10501 T3983 oasu.CommitTracker.<init> Hard AutoCommit: disabled
[junit4:junit4]   2> 10502 T3983 oasu.CommitTracker.<init> Soft AutoCommit: disabled
[junit4:junit4]   2> 10502 T3983 oashc.SpellCheckComponent.inform Initializing spell checkers
[junit4:junit4]   2> 10509 T3983 oass.DirectSolrSpellChecker.init init: {name=direct,classname=DirectSolrSpellChecker,field=lowerfilt,minQueryLength=3}
[junit4:junit4]   2> 10560 T3984 oasc.SolrCore.registerSearcher [collection1] Registered new searcher Searcher@1dfac42e main{StandardDirectoryReader(segments_1:1)}
[junit4:junit4]   2> 10565 T3983 oasc.ZkController.publish publishing core=collection1 state=down
[junit4:junit4]   2> 10565 T3983 oasc.ZkController.publish numShards not found on descriptor - reading it from system property
[junit4:junit4]   2> 11340 T3933 oascc.ZkStateReader.updateClusterState Updating cloud state from ZooKeeper... 
[junit4:junit4]   2> 11341 T3933 oasc.Overseer$ClusterStateUpdater.updateState Update state numShards=1 message={
[junit4:junit4]   2> 	  "operation":"state",
[junit4:junit4]   2> 	  "numShards":"1",
[junit4:junit4]   2> 	  "shard":null,
[junit4:junit4]   2> 	  "roles":null,
[junit4:junit4]   2> 	  "state":"down",
[junit4:junit4]   2> 	  "core":"collection1",
[junit4:junit4]   2> 	  "collection":"collection1",
[junit4:junit4]   2> 	  "node_name":"127.0.0.1:28562_",
[junit4:junit4]   2> 	  "base_url":"http://127.0.0.1:28562"}
[junit4:junit4]   2> 11341 T3933 oasc.Overseer$ClusterStateUpdater.updateState Collection already exists with numShards=1
[junit4:junit4]   2> 11341 T3933 oasc.Overseer$ClusterStateUpdater.updateState Assigning new node to shard shard=shard1
[junit4:junit4]   2> 11373 T3982 oascc.ZkStateReader$2.process A cluster state change: WatchedEvent state:SyncConnected type:NodeDataChanged path:/clusterstate.json, has occurred - updating... (live nodes size: 4)
[junit4:junit4]   2> 11373 T3951 oascc.ZkStateReader$2.process A cluster state change: WatchedEvent state:SyncConnected type:NodeDataChanged path:/clusterstate.json, has occurred - updating... (live nodes size: 4)
[junit4:junit4]   2> 11373 T3932 oascc.ZkStateReader$2.process A cluster state change: WatchedEvent state:SyncConnected type:NodeDataChanged path:/clusterstate.json, has occurred - updating... (live nodes size: 4)
[junit4:junit4]   2> 11373 T3938 oascc.ZkStateReader$2.process A cluster state change: WatchedEvent state:SyncConnected type:NodeDataChanged path:/clusterstate.json, has occurred - updating... (live nodes size: 4)
[junit4:junit4]   2> 11373 T3966 oascc.ZkStateReader$2.process A cluster state change: WatchedEvent state:SyncConnected type:NodeDataChanged path:/clusterstate.json, has occurred - updating... (live nodes size: 4)
[junit4:junit4]   2> 11568 T3983 oasc.CoreContainer.registerCore registering core: collection1
[junit4:junit4]   2> 11568 T3983 oasc.ZkController.register Register replica - core:collection1 address:http://127.0.0.1:28562 collection:collection1 shard:shard1
[junit4:junit4]   2> 11571 T3983 oasc.ZkController.register We are http://127.0.0.1:28562/collection1/ and leader is http://127.0.0.1:19665/collection1/
[junit4:junit4]   2> 11571 T3983 oasc.ZkController.register No LogReplay needed for core=collection1 baseURL=http://127.0.0.1:28562
[junit4:junit4]   2> 11571 T3983 oasc.ZkController.checkRecovery Core needs to recover:collection1
[junit4:junit4]   2> 11571 T3983 oasu.DefaultSolrCoreState.doRecovery Running recovery - first canceling any ongoing recovery
[junit4:junit4]   2> ASYNC  NEW_CORE C196 name=collection1 org.apache.solr.core.SolrCore@46b3542c url=http://127.0.0.1:28562/collection1 node=127.0.0.1:28562_ C196_STATE=coll:collection1 core:collection1 props:{shard=null, roles=null, state=down, core=collection1, collection=collection1, node_name=127.0.0.1:28562_, base_url=http://127.0.0.1:28562}
[junit4:junit4]   2> 11572 T3985 C196 P28562 oasc.RecoveryStrategy.run Starting recovery process.  core=collection1 recoveringAfterStartup=true
[junit4:junit4]   2> 11573 T3985 C196 P28562 oasc.RecoveryStrategy.doRecovery ###### startupVersions=[]
[junit4:junit4]   2> 11573 T3983 oascc.ZkStateReader.updateClusterState Updating cloud state from ZooKeeper... 
[junit4:junit4]   2> 11573 T3985 C196 P28562 oasc.ZkController.publish publishing core=collection1 state=recovering
[junit4:junit4]   2> 11573 T3985 C196 P28562 oasc.ZkController.publish numShards not found on descriptor - reading it from system property
[junit4:junit4]   2> 11574 T3910 oass.SolrDispatchFilter.init user.dir=/usr/home/hudson/hudson-slave/workspace/Lucene-Solr-Tests-trunk-java7/solr/build/solr-core/test/J0
[junit4:junit4]   2> 11575 T3910 oass.SolrDispatchFilter.init SolrDispatchFilter.init() done
[junit4:junit4]   2> 11575 T3985 C196 P28562 oascsi.HttpClientUtil.createClient Creating new http client, config:maxConnections=128&maxConnectionsPerHost=32&followRedirects=false
[junit4:junit4]   2> 11575 T3910 oascsi.HttpClientUtil.createClient Creating new http client, config:maxConnections=128&maxConnectionsPerHost=32&followRedirects=false
[junit4:junit4]   2> 11760 T3910 oejs.Server.doStart jetty-8.1.8.v20121106
[junit4:junit4]   2> 11764 T3910 oejs.AbstractConnector.doStart Started SocketConnector@127.0.0.1:40808
[junit4:junit4]   2> 11764 T3910 oass.SolrDispatchFilter.init SolrDispatchFilter.init()
[junit4:junit4]   2> 11765 T3910 oasc.SolrResourceLoader.locateSolrHome JNDI not configured for solr (NoInitialContextEx)
[junit4:junit4]   2> 11765 T3910 oasc.SolrResourceLoader.locateSolrHome using system property solr.solr.home: /usr/home/hudson/hudson-slave/workspace/Lucene-Solr-Tests-trunk-java7/solr/build/solr-core/test/J0/./org.apache.solr.cloud.SyncSliceTest-jetty4-1360950296846
[junit4:junit4]   2> 11766 T3910 oasc.CoreContainer$Initializer.initialize looking for solr.xml: /usr/home/hudson/hudson-slave/workspace/Lucene-Solr-Tests-trunk-java7/solr/build/solr-core/test/J0/./org.apache.solr.cloud.SyncSliceTest-jetty4-1360950296846/solr.xml
[junit4:junit4]   2> 11766 T3910 oasc.CoreContainer.<init> New CoreContainer 1108208452
[junit4:junit4]   2> 11767 T3910 oasc.CoreContainer.load Loading CoreContainer using Solr Home: '/usr/home/hudson/hudson-slave/workspace/Lucene-Solr-Tests-trunk-java7/solr/build/solr-core/test/J0/./org.apache.solr.cloud.SyncSliceTest-jetty4-1360950296846/'
[junit4:junit4]   2> 11768 T3910 oasc.SolrResourceLoader.<init> new SolrResourceLoader for directory: '/usr/home/hudson/hudson-slave/workspace/Lucene-Solr-Tests-trunk-java7/solr/build/solr-core/test/J0/./org.apache.solr.cloud.SyncSliceTest-jetty4-1360950296846/'
[junit4:junit4]   2> 11826 T3910 oashc.HttpShardHandlerFactory.getParameter Setting socketTimeout to: 60000
[junit4:junit4]   2> 11827 T3910 oashc.HttpShardHandlerFactory.getParameter Setting urlScheme to: http://
[junit4:junit4]   2> 11827 T3910 oashc.HttpShardHandlerFactory.getParameter Setting connTimeout to: 15000
[junit4:junit4]   2> 11828 T3910 oashc.HttpShardHandlerFactory.getParameter Setting maxConnectionsPerHost to: 20
[junit4:junit4]   2> 11828 T3910 oashc.HttpShardHandlerFactory.getParameter Setting corePoolSize to: 0
[junit4:junit4]   2> 11829 T3910 oashc.HttpShardHandlerFactory.getParameter Setting maximumPoolSize to: 2147483647
[junit4:junit4]   2> 11829 T3910 oashc.HttpShardHandlerFactory.getParameter Setting maxThreadIdleTime to: 5
[junit4:junit4]   2> 11830 T3910 oashc.HttpShardHandlerFactory.getParameter Setting sizeOfQueue to: -1
[junit4:junit4]   2> 11830 T3910 oashc.HttpShardHandlerFactory.getParameter Setting fairnessPolicy to: false
[junit4:junit4]   2> 11831 T3910 oascsi.HttpClientUtil.createClient Creating new http client, config:maxConnectionsPerHost=20&maxConnections=10000&socketTimeout=60000&connTimeout=15000&retry=false
[junit4:junit4]   2> 11850 T3910 oasc.CoreContainer.load Registering Log Listener
[junit4:junit4]   2> 11869 T3910 oasc.CoreContainer.initZooKeeper Zookeeper client=127.0.0.1:25803/solr
[junit4:junit4]   2> 11870 T3910 oasc.ZkController.checkChrootPath zkHost includes chroot
[junit4:junit4]   2> 11871 T3910 oaz.ZooKeeper.<init> Initiating client connection, connectString=127.0.0.1:25803 sessionTimeout=60000 watcher=org.apache.solr.common.cloud.ConnectionManager@31b107f
[junit4:junit4]   2> 11872 T3910 oascc.ConnectionManager.waitForConnected Waiting for client to connect to ZooKeeper
[junit4:junit4]   2> 11872 T3995 oaz.ClientCnxn$SendThread.logStartConnect Opening socket connection to server localhost/127.0.0.1:25803. Will not attempt to authenticate using SASL (access denied ("javax.security.auth.AuthPermission" "getLoginConfiguration"))
[junit4:junit4]   2> 11873 T3995 oaz.ClientCnxn$SendThread.primeConnection Socket connection established to localhost/127.0.0.1:25803, initiating session
[junit4:junit4]   2> 11873 T3912 oazs.NIOServerCnxnFactory.run Accepted socket connection from /140.211.11.196:63050
[junit4:junit4]   2> 11873 T3912 oazs.ZooKeeperServer.processConnectRequest Client attempting to establish new session at /140.211.11.196:63050
[junit4:junit4]   2> 11875 T3914 oazs.ZooKeeperServer.finishSessionInit Established session 0x13cdef553cf000b with negotiated timeout 20000 for client /140.211.11.196:63050
[junit4:junit4]   2> 11875 T3995 oaz.ClientCnxn$SendThread.onConnected Session establishment complete on server localhost/127.0.0.1:25803, sessionid = 0x13cdef553cf000b, negotiated timeout = 20000
[junit4:junit4]   2> 11875 T3996 oascc.ConnectionManager.process Watcher org.apache.solr.common.cloud.ConnectionManager@31b107f name:ZooKeeperConnection Watcher:127.0.0.1:25803 got event WatchedEvent state:SyncConnected type:None path:null path:null type:None
[junit4:junit4]   2> 11876 T3910 oascc.ConnectionManager.waitForConnected Client is connected to ZooKeeper
[junit4:junit4]   2> 11877 T3915 oazs.PrepRequestProcessor.pRequest2Txn Processed session termination for sessionid: 0x13cdef553cf000b
[junit4:junit4]   2> 11885 T3996 oaz.ClientCnxn$EventThread.run EventThread shut down
[junit4:junit4]   2> 11885 T3912 oazs.NIOServerCnxn.closeSock Closed socket connection for client /140.211.11.196:63050 which had sessionid 0x13cdef553cf000b
[junit4:junit4]   2> 11885 T3910 oaz.ZooKeeper.close Session: 0x13cdef553cf000b closed
[junit4:junit4]   2> 11886 T3910 oascsi.HttpClientUtil.createClient Creating new http client, config:maxConnections=500&maxConnectionsPerHost=16&socketTimeout=60000&connTimeout=15000
[junit4:junit4]   2> 11895 T3910 oaz.ZooKeeper.<init> Initiating client connection, connectString=127.0.0.1:25803/solr sessionTimeout=30000 watcher=org.apache.solr.common.cloud.ConnectionManager@78a91650
[junit4:junit4]   2> 11896 T3910 oascc.ConnectionManager.waitForConnected Waiting for client to connect to ZooKeeper
[junit4:junit4]   2> 11897 T3997 oaz.ClientCnxn$SendThread.logStartConnect Opening socket connection to server localhost/127.0.0.1:25803. Will not attempt to authenticate using SASL (access denied ("javax.security.auth.AuthPermission" "getLoginConfiguration"))
[junit4:junit4]   2> 11897 T3997 oaz.ClientCnxn$SendThread.primeConnection Socket connection established to localhost/127.0.0.1:25803, initiating session
[junit4:junit4]   2> 11898 T3912 oazs.NIOServerCnxnFactory.run Accepted socket connection from /140.211.11.196:38416
[junit4:junit4]   2> 11898 T3912 oazs.ZooKeeperServer.processConnectRequest Client attempting to establish new session at /140.211.11.196:38416
[junit4:junit4]   2> 11899 T3914 oazs.ZooKeeperServer.finishSessionInit Established session 0x13cdef553cf000c with negotiated timeout 20000 for client /140.211.11.196:38416
[junit4:junit4]   2> 11899 T3997 oaz.ClientCnxn$SendThread.onConnected Session establishment complete on server localhost/127.0.0.1:25803, sessionid = 0x13cdef553cf000c, negotiated timeout = 20000
[junit4:junit4]   2> 11899 T3998 oascc.ConnectionManager.process Watcher org.apache.solr.common.cloud.ConnectionManager@78a91650 name:ZooKeeperConnection Watcher:127.0.0.1:25803/solr got event WatchedEvent state:SyncConnected type:None path:null path:null type:None
[junit4:junit4]   2> 11900 T3910 oascc.ConnectionManager.waitForConnected Client is connected to ZooKeeper
[junit4:junit4]   2> 11901 T3915 oazs.PrepRequestProcessor.pRequest Got user-level KeeperException when processing sessionid:0x13cdef553cf000c type:create cxid:0x1 zxid:0x91 txntype:-1 reqpath:n/a Error Path:/solr/overseer Error:KeeperErrorCode = NodeExists for /solr/overseer
[junit4:junit4]   2> 11902 T3915 oazs.PrepRequestProcessor.pRequest Got user-level KeeperException when processing sessionid:0x13cdef553cf000c type:create cxid:0x2 zxid:0x92 txntype:-1 reqpath:n/a Error Path:/solr/overseer Error:KeeperErrorCode = NodeExists for /solr/overseer
[junit4:junit4]   2> 11911 T3910 oascc.ZkStateReader.createClusterStateWatchersAndUpdate Updating cluster state from ZooKeeper... 
[junit4:junit4]   2> 11913 T3910 oasc.ZkController.createEphemeralLiveNode Register node as live in ZooKeeper:/live_nodes/127.0.0.1:40808_
[junit4:junit4]   2> 11913 T3915 oazs.PrepRequestProcessor.pRequest Got user-level KeeperException when processing sessionid:0x13cdef553cf000c type:delete cxid:0x9 zxid:0x93 txntype:-1 reqpath:n/a Error Path:/solr/live_nodes/127.0.0.1:40808_ Error:KeeperErrorCode = NoNode for /solr/live_nodes/127.0.0.1:40808_
[junit4:junit4]   2> 11914 T3910 oascc.SolrZkClient.makePath makePath: /live_nodes/127.0.0.1:40808_
[junit4:junit4]   2> 11917 T3932 oascc.ZkStateReader$2.process A cluster state change: WatchedEvent state:SyncConnected type:NodeChildrenChanged path:/live_nodes, has occurred - updating... (live nodes size: 4)
[junit4:junit4]   2> 11917 T3966 oascc.ZkStateReader$2.process A cluster state change: WatchedEvent state:SyncConnected type:NodeChildrenChanged path:/live_nodes, has occurred - updating... (live nodes size: 4)
[junit4:junit4]   2> 11917 T3938 oascc.ZkStateReader$3.process Updating live nodes... (5)
[junit4:junit4]   2> 11917 T3951 oascc.ZkStateReader$3.process Updating live nodes... (5)
[junit4:junit4]   2> 11917 T3998 oascc.ZkStateReader$3.process Updating live nodes... (5)
[junit4:junit4]   2> 11918 T3951 oascc.ZkStateReader$2.process A cluster state change: WatchedEvent state:SyncConnected type:NodeChildrenChanged path:/live_nodes, has occurred - updating... (live nodes size: 5)
[junit4:junit4]   2> 11917 T3982 oascc.ZkStateReader$3.process Updating live nodes... (5)
[junit4:junit4]   2> 11918 T3938 oascc.ZkStateReader$2.process A cluster state change: WatchedEvent state:SyncConnected type:NodeChildrenChanged path:/live_nodes, has occurred - updating... (live nodes size: 5)
[junit4:junit4]   2> 11918 T3982 oascc.ZkStateReader$2.process A cluster state change: WatchedEvent state:SyncConnected type:NodeChildrenChanged path:/live_nodes, has occurred - updating... (live nodes size: 5)
[junit4:junit4]   2> 11918 T3932 oascc.ZkStateReader$3.process Updating live nodes... (5)
[junit4:junit4]   2> 11925 T3966 oascc.ZkStateReader$3.process Updating live nodes... (5)
[junit4:junit4]   2> 11931 T3999 oasc.CoreContainer.create Creating SolrCore 'collection1' using instanceDir: /usr/home/hudson/hudson-slave/workspace/Lucene-Solr-Tests-trunk-java7/solr/build/solr-core/test/J0/./org.apache.solr.cloud.SyncSliceTest-jetty4-1360950296846/collection1
[junit4:junit4]   2> 11932 T3999 oasc.ZkController.createCollectionZkNode Check for collection zkNode:collection1
[junit4:junit4]   2> 11932 T3999 oasc.ZkController.createCollectionZkNode Collection zkNode exists
[junit4:junit4]   2> 11933 T3999 oasc.ZkController.readConfigName Load collection config from:/collections/collection1
[junit4:junit4]   2> 11934 T3999 oasc.SolrResourceLoader.<init> new SolrResourceLoader for directory: '/usr/home/hudson/hudson-slave/workspace/Lucene-Solr-Tests-trunk-java7/solr/build/solr-core/test/J0/./org.apache.solr.cloud.SyncSliceTest-jetty4-1360950296846/collection1/'
[junit4:junit4]   2> 11935 T3999 oasc.SolrResourceLoader.replaceClassLoader Adding 'file:/usr/home/hudson/hudson-slave/workspace/Lucene-Solr-Tests-trunk-java7/solr/build/solr-core/test/J0/org.apache.solr.cloud.SyncSliceTest-jetty4-1360950296846/collection1/lib/README' to classloader
[junit4:junit4]   2> 11935 T3999 oasc.SolrResourceLoader.replaceClassLoader Adding 'file:/usr/home/hudson/hudson-slave/workspace/Lucene-Solr-Tests-trunk-java7/solr/build/solr-core/test/J0/org.apache.solr.cloud.SyncSliceTest-jetty4-1360950296846/collection1/lib/classes/' to classloader
[junit4:junit4]   2> 12010 T3999 oasc.SolrConfig.<init> Using Lucene MatchVersion: LUCENE_50
[junit4:junit4]   2> 12080 T3999 oasc.SolrConfig.<init> Loaded SolrConfig: solrconfig.xml
[junit4:junit4]   2> 12181 T3999 oass.IndexSchema.readSchema Reading Solr Schema
[junit4:junit4]   2> 12188 T3999 oass.IndexSchema.readSchema Schema name=test
[junit4:junit4]   2>  C195_STATE=coll:collection1 core:collection1 props:{shard=shard1, roles=null, state=recovering, core=collection1, collection=collection1, node_name=127.0.0.1:47089_, base_url=http://127.0.0.1:47089}
[junit4:junit4]   2> 12257 T3969 C195 P47089 oasc.RecoveryStrategy.doRecovery Attempting to PeerSync from http://127.0.0.1:19665/collection1/ core=collection1 - recoveringAfterStartup=true
[junit4:junit4]   2> 12257 T3969 C195 P47089 oasu.PeerSync.sync PeerSync: core=collection1 url=http://127.0.0.1:47089 START replicas=[http://127.0.0.1:19665/collection1/] nUpdates=100
[junit4:junit4]   2> 12258 T3969 C195 P47089 oasu.PeerSync.sync WARNING no frame of reference to tell of we've missed updates
[junit4:junit4]   2> 12258 T3969 C195 P47089 oasc.RecoveryStrategy.doRecovery PeerSync Recovery was not successful - trying replication. core=collection1
[junit4:junit4]   2> 12258 T3969 C195 P47089 oasc.RecoveryStrategy.doRecovery Starting Replication Recovery. core=collection1
[junit4:junit4]   2> 12258 T3969 C195 P47089 oasc.RecoveryStrategy.doRecovery Begin buffering updates. core=collection1
[junit4:junit4]   2> 12258 T3969 C195 P47089 oasu.UpdateLog.bufferUpdates Starting to buffer updates. FSUpdateLog{state=ACTIVE, tlog=null}
[junit4:junit4]   2> 12259 T3969 C195 P47089 oasc.RecoveryStrategy.replicate Attempting to replicate from http://127.0.0.1:19665/collection1/. core=collection1
[junit4:junit4]   2> 12259 T3969 C195 P47089 oascsi.HttpClientUtil.createClient Creating new http client, config:maxConnections=128&maxConnectionsPerHost=32&followRedirects=false
[junit4:junit4]   2> ASYNC  NEW_CORE C197 name=collection1 org.apache.solr.core.SolrCore@1ab4077c url=http://127.0.0.1:19665/collection1 node=127.0.0.1:19665_ C197_STATE=coll:collection1 core:collection1 props:{shard=shard1, roles=null, state=active, core=collection1, collection=collection1, node_name=127.0.0.1:19665_, base_url=http://127.0.0.1:19665, leader=true}
[junit4:junit4]   2> 12267 T3943 C197 P19665 REQ /get {getVersions=100&distrib=false&wt=javabin&qt=/get&version=2} status=0 QTime=1 
[junit4:junit4]   2> 12270 T3944 C197 P19665 oasu.DirectUpdateHandler2.commit start commit{,optimize=false,openSearcher=false,waitSearcher=true,expungeDeletes=false,softCommit=false}
[junit4:junit4]   2> 12271 T3944 C197 P19665 oasc.CachingDirectoryFactory.close Releasing directory:/usr/home/hudson/hudson-slave/workspace/Lucene-Solr-Tests-trunk-java7/solr/build/solr-core/test/J0/./org.apache.solr.cloud.SyncSliceTest-1360950285256/jetty1
[junit4:junit4]   2> 12276 T3944 C197 P19665 oasc.SolrDeletionPolicy.onInit SolrDeletionPolicy.onInit: commits:num=1
[junit4:junit4]   2> 		commit{dir=RateLimitedDirectoryWrapper(NRTCachingDirectory(org.apache.lucene.store.NIOFSDirectory@/usr/home/hudson/hudson-slave/workspace/Lucene-Solr-Tests-trunk-java7/solr/build/solr-core/test/J0/org.apache.solr.cloud.SyncSliceTest-1360950285256/jetty1/index lockFactory=org.apache.lucene.store.NativeFSLockFactory@72bab1ce; maxCacheMB=48.0 maxMergeSizeMB=4.0)),segFN=segments_1,generation=1,filenames=[segments_1]
[junit4:junit4]   2> 12276 T3944 C197 P19665 oasc.SolrDeletionPolicy.updateCommits newest commit = 1[segments_1]
[junit4:junit4]   2> 12282 T3944 C197 P19665 oasc.SolrDeletionPolicy.onCommit SolrDeletionPolicy.onCommit: commits:num=2
[junit4:junit4]   2> 		commit{dir=RateLimitedDirectoryWrapper(NRTCachingDirectory(org.apache.lucene.store.NIOFSDirectory@/usr/home/hudson/hudson-slave/workspace/Lucene-Solr-Tests-trunk-java7/solr/build/solr-core/test/J0/org.apache.solr.cloud.SyncSliceTest-1360950285256/jetty1/index lockFactory=org.apache.lucene.store.NativeFSLockFactory@72bab1ce; maxCacheMB=48.0 maxMergeSizeMB=4.0)),segFN=segments_1,generation=1,filenames=[segments_1]
[junit4:junit4]   2> 		commit{dir=RateLimitedDirectoryWrapper(NRTCachingDirectory(org.apache.lucene.store.NIOFSDirectory@/usr/home/hudson/hudson-slave/workspace/Lucene-Solr-Tests-trunk-java7/solr/build/solr-core/test/J0/org.apache.solr.cloud.SyncSliceTest-1360950285256/jetty1/index lockFactory=org.apache.lucene.store.NativeFSLockFactory@72bab1ce; maxCacheMB=48.0 maxMergeSizeMB=4.0)),segFN=segments_2,generation=2,filenames=[segments_2]
[junit4:junit4]   2> 12282 T3944 C197 P19665 oasc.SolrDeletionPolicy.updateCommits newest commit = 2[segments_2]
[junit4:junit4]   2> 12283 T3944 C197 P19665 oasc.CachingDirectoryFactory.close Releasing directory:/usr/home/hudson/hudson-slave/workspace/Lucene-Solr-Tests-trunk-java7/solr/build/solr-core/test/J0/./org.apache.solr.cloud.SyncSliceTest-1360950285256/jetty1
[junit4:junit4]   2> 12284 T3944 C197 P19665 oass.SolrIndexSearcher.<init> Opening Searcher@1035093f realtime
[junit4:junit4]   2> 12284 T3944 C197 P19665 oasu.DirectUpdateHandler2.commit end_commit_flush
[junit4:junit4]   2> 12285 T3944 C197 P19665 /update {waitSearcher=true&openSearcher=false&commit=true&wt=javabin&commit_end_point=true&version=2&softCommit=false} {commit=} 0 15
[junit4:junit4]   2> 12285 T3969 C195 P47089 oash.ReplicationHandler.inform Commits will be reserved for  10000
[junit4:junit4]   2> 12286 T3969 C195 P47089 oash.SnapPuller.<init>  No value set for 'pollInterval'. Timer Task not started.
[junit4:junit4]   2> 12288 T3945 C197 P19665 oash.ReplicationHandler.inform Commits will be reserved for  10000
[junit4:junit4]   2> 12288 T3945 C197 P19665 REQ /replication {command=indexversion&qt=/replication&wt=javabin&version=2} status=0 QTime=1 
[junit4:junit4]   2> 12289 T3969 C195 P47089 oash.SnapPuller.fetchLatestIndex Master's generation: 2
[junit4:junit4]   2> 12289 T3969 C195 P47089 oash.SnapPuller.fetchLatestIndex Slave's generation: 1
[junit4:junit4]   2> 12289 T3969 C195 P47089 oash.SnapPuller.fetchLatestIndex Starting replication process
[junit4:junit4]   2> 12291 T3945 C197 P19665 oasc.CachingDirectoryFactory.close Releasing directory:/usr/home/hudson/hudson-slave/workspace/Lucene-Solr-Tests-trunk-java7/solr/build/solr-core/test/J0/./org.apache.solr.cloud.SyncSliceTest-1360950285256/jetty1
[junit4:junit4]   2> 12292 T3945 C197 P19665 oasc.CachingDirectoryFactory.close Releasing directory:/usr/home/hudson/hudson-slave/workspace/Lucene-Solr-Tests-trunk-java7/solr/build/solr-core/test/J0/./org.apache.solr.cloud.SyncSliceTest-1360950285256/jetty1/index
[junit4:junit4]   2> 12292 T3945 C197 P19665 REQ /replication {command=filelist&qt=/replication&wt=javabin&generation=2&version=2} status=0 QTime=1 
[junit4:junit4]   2> 12293 T3969 C195 P47089 oash.SnapPuller.fetchLatestIndex Number of files in latest index in master: 1
[junit4:junit4]   2> 12294 T3969 C195 P47089 oasc.CachingDirectoryFactory.get return new directory for /usr/home/hudson/hudson-slave/workspace/Lucene-Solr-Tests-trunk-java7/solr/build/solr-core/test/J0/./org.apache.solr.cloud.SyncSliceTest-1360950285256/jetty2/index.20130215104457544 forceNew:false
[junit4:junit4]   2> 12295 T3969 C195 P47089 oasc.CachingDirectoryFactory.close Releasing directory:/usr/home/hudson/hudson-slave/workspace/Lucene-Solr-Tests-trunk-java7/solr/build/solr-core/test/J0/./org.apache.solr.cloud.SyncSliceTest-1360950285256/jetty2
[junit4:junit4]   2> 12296 T3969 C195 P47089 oash.SnapPuller.fetchLatestIndex Starting download to RateLimitedDirectoryWrapper(NRTCachingDirectory(org.apache.lucene.store.NIOFSDirectory@/usr/home/hudson/hudson-slave/workspace/Lucene-Solr-Tests-trunk-java7/solr/build/solr-core/test/J0/org.apache.solr.cloud.SyncSliceTest-1360950285256/jetty2/index.20130215104457544 lockFactory=org.apache.lucene.store.NativeFSLockFactory@25028cd6; maxCacheMB=48.0 maxMergeSizeMB=4.0)) fullCopy=true
[junit4:junit4]   2> 12299 T3945 C197 P19665 REQ /replication {file=segments_2&command=filecontent&checksum=true&wt=filestream&qt=/replication&generation=2} status=0 QTime=0 
[junit4:junit4]   2> 12300 T3969 C195 P47089 oasc.CachingDirectoryFactory.close Releasing directory:/usr/home/hudson/hudson-slave/workspace/Lucene-Solr-Tests-trunk-java7/solr/build/solr-core/test/J0/./org.apache.solr.cloud.SyncSliceTest-1360950285256/jetty2/index
[junit4:junit4]   2> 12301 T3969 C195 P47089 oash.SnapPuller.fetchLatestIndex Total time taken for download : 0 secs
[junit4:junit4]   2> 12301 T3969 C195 P47089 oash.SnapPuller.modifyIndexProps New index installed. Updating index properties... index=index.20130215104457544
[junit4:junit4]   2> 12303 T3969 C195 P47089 oasc.CachingDirectoryFactory.close Releasing directory:/usr/home/hudson/hudson-slave/workspace/Lucene-Solr-Tests-trunk-java7/solr/build/solr-core/test/J0/./org.apache.solr.cloud.SyncSliceTest-1360950285256/jetty2
[junit4:junit4]   2> 12303 T3969 C195 P47089 oasc.CachingDirectoryFactory.close Releasing directory:/usr/home/hudson/hudson-slave/workspace/Lucene-Solr-Tests-trunk-java7/solr/build/solr-core/test/J0/./org.apache.solr.cloud.SyncSliceTest-1360950285256/jetty2
[junit4:junit4]   2> 12303 T3969 C195 P47089 oasc.SolrCore.getNewIndexDir New index directory detected: old=./org.apache.solr.cloud.SyncSliceTest-1360950285256/jetty2/index/ new=./org.apache.solr.cloud.SyncSliceTest-1360950285256/jetty2/index.20130215104457544
[junit4:junit4]   2> 12307 T3969 C195 P47089 oasc.SolrDeletionPolicy.onInit SolrDeletionPolicy.onInit: commits:num=1
[junit4:junit4]   2> 		commit{dir=RateLimitedDirectoryWrapper(NRTCachingDirectory(org.apache.lucene.store.NIOFSDirectory@/usr/home/hudson/hudson-slave/workspace/Lucene-Solr-Tests-trunk-java7/solr/build/solr-core/test/J0/org.apache.solr.cloud.SyncSliceTest-1360950285256/jetty2/index.20130215104457544 lockFactory=org.apache.lucene.store.NativeFSLockFactory@25028cd6; maxCacheMB=48.0 maxMergeSizeMB=4.0)),segFN=segments_2,generation=2,filenames=[segments_2]
[junit4:junit4]   2> 12307 T3969 C195 P47089 oasc.SolrDeletionPolicy.updateCommits newest commit = 2[segments_2]
[junit4:junit4]   2> 12309 T3969 C195 P47089 oasc.CachingDirectoryFactory.close Releasing directory:/usr/home/hudson/hudson-slave/workspace/Lucene-Solr-Tests-trunk-java7/solr/build/solr-core/test/J0/./org.apache.solr.cloud.SyncSliceTest-1360950285256/jetty2
[junit4:junit4]   2> 12309 T3969 C195 P47089 oasu.DefaultSolrCoreState.newIndexWriter Creating new IndexWriter...
[junit4:junit4]   2> 12309 T3969 C195 P47089 oasu.DefaultSolrCoreState.newIndexWriter Waiting until IndexWriter is unused... core=collection1
[junit4:junit4]   2> 12309 T3969 C195 P47089 oasu.DefaultSolrCoreState.newIndexWriter Rollback old IndexWriter... core=collection1
[junit4:junit4]   2> 12310 T3969 C195 P47089 oasc.CachingDirectoryFactory.close Releasing directory:/usr/home/hudson/hudson-slave/workspace/Lucene-Solr-Tests-trunk-java7/solr/build/solr-core/test/J0/./org.apache.solr.cloud.SyncSliceTest-1360950285256/jetty2/index.20130215104457544
[junit4:junit4]   2> 12311 T3969 C195 P47089 oasc.CachingDirectoryFactory.close Releasing directory:/usr/home/hudson/hudson-slave/workspace/Lucene-Solr-Tests-trunk-java7/solr/build/solr-core/test/J0/./org.apache.solr.cloud.SyncSliceTest-1360950285256/jetty2
[junit4:junit4]   2> 12314 T3969 C195 P47089 oasc.SolrDeletionPolicy.onInit SolrDeletionPolicy.onInit: commits:num=1
[junit4:junit4]   2> 		commit{dir=RateLimitedDirectoryWrapper(NRTCachingDirectory(org.apache.lucene.store.NIOFSDirectory@/usr/home/hudson/hudson-slave/workspace/Lucene-Solr-Tests-trunk-java7/solr/build/solr-core/test/J0/org.apache.solr.cloud.SyncSliceTest-1360950285256/jetty2/index.20130215104457544 lockFactory=org.apache.lucene.store.NativeFSLockFactory@25028cd6; maxCacheMB=48.0 maxMergeSizeMB=4.0)),segFN=segments_2,generation=2,filenames=[segments_2]
[junit4:junit4]   2> 12315 T3969 C195 P47089 oasc.SolrDeletionPolicy.updateCommits newest commit = 2[segments_2]
[junit4:junit4]   2> 12315 T3969 C195 P47089 oasu.DefaultSolrCoreState.newIndexWriter New IndexWriter is ready to be used.
[junit4:junit4]   2> 12315 T3969 C195 P47089 oasc.CachingDirectoryFactory.close Releasing directory:/usr/home/hudson/hudson-slave/workspace/Lucene-Solr-Tests-trunk-java7/solr/build/solr-core/test/J0/./org.apache.solr.cloud.SyncSliceTest-1360950285256/jetty2
[junit4:junit4]   2> 12316 T3969 C195 P47089 oass.SolrIndexSearcher.<init> Opening Searcher@530acd5f main
[junit4:junit4]   2> 12318 T3968 oasc.SolrCore.registerSearcher [collection1] Registered new searcher Searcher@530acd5f main{StandardDirectoryReader(segments_2:1:nrt)}
[junit4:junit4]   2> 12318 T3968 oasc.CachingDirectoryFactory.close Releasing directory:/usr/home/hudson/hudson-slave/workspace/Lucene-Solr-Tests-trunk-java7/solr/build/solr-core/test/J0/./org.apache.solr.cloud.SyncSliceTest-1360950285256/jetty2/index
[junit4:junit4]   2> 12318 T3969 C195 P47089 oasu.DirectUpdateHandler2.commit start commit{,optimize=false,openSearcher=false,waitSearcher=false,expungeDeletes=false,softCommit=false}
[junit4:junit4]   2> 12322 T3969 C195 P47089 oasc.SolrDeletionPolicy.onCommit SolrDeletionPolicy.onCommit: commits:num=2
[junit4:junit4]   2> 		commit{dir=RateLimitedDirectoryWrapper(NRTCachingDirectory(org.apache.lucene.store.NIOFSDirectory@/usr/home/hudson/hudson-slave/workspace/Lucene-Solr-Tests-trunk-java7/solr/build/solr-core/test/J0/org.apache.solr.cloud.SyncSliceTest-1360950285256/jetty2/index.20130215104457544 lockFactory=org.apache.lucene.store.NativeFSLockFactory@25028cd6; maxCacheMB=48.0 maxMergeSizeMB=4.0)),segFN=segments_2,generation=2,filenames=[segments_2]
[junit4:junit4]   2> 		commit{dir=RateLimitedDirectoryWrapper(NRTCachingDirectory(org.apache.lucene.store.NIOFSDirectory@/usr/home/hudson/hudson-slave/workspace/Lucene-Solr-Tests-trunk-java7/solr/build/solr-core/test/J0/org.apache.solr.cloud.SyncSliceTest-1360950285256/jetty2/index.20130215104457544 lockFactory=org.apache.lucene.store.NativeFSLockFactory@25028cd6; maxCacheMB=48.0 maxMergeSizeMB=4.0)),segFN=segments_3,generation=3,filenames=[segments_3]
[junit4:junit4]   2> 12322 T3969 C195 P47089 oasc.SolrDeletionPolicy.updateCommits newest commit = 3[segments_3]
[junit4:junit4]   2> 12323 T3969 C195 P47089 oasc.CachingDirectoryFactory.close Releasing directory:/usr/home/hudson/hudson-slave/workspace/Lucene-Solr-Tests-trunk-java7/solr/build/solr-core/test/J0/./org.apache.solr.cloud.SyncSliceTest-1360950285256/jetty2
[junit4:junit4]   2> 12324 T3969 C195 P47089 oasu.DirectUpdateHandler2.commit end_commit_flush
[junit4:junit4]   2> 12324 T3969 C195 P47089 oasc.CachingDirectoryFactory.close Releasing directory:/usr/home/hudson/hudson-slave/workspace/Lucene-Solr-Tests-trunk-java7/solr/build/solr-core/test/J0/./org.apache.solr.cloud.SyncSliceTest-1360950285256/jetty2/index.20130215104457544
[junit4:junit4]   2> 12324 T3969 C195 P47089 oasc.CachingDirectoryFactory.close Releasing directory:/usr/home/hudson/hudson-slave/workspace/Lucene-Solr-Tests-trunk-java7/solr/build/solr-core/test/J0/./org.apache.solr.cloud.SyncSliceTest-1360950285256/jetty2/index
[junit4:junit4]   2> 12324 T3969 C195 P47089 oasc.RecoveryStrategy.replay No replay needed. core=collection1
[junit4:junit4]   2> 12325 T3969 C195 P47089 oasc.RecoveryStrategy.doRecovery Replication Recovery was successful - registering as Active. core=collection1
[junit4:junit4]   2> 12325 T3969 C195 P47089 oasc.ZkController.publish publishing core=collection1 state=active
[junit4:junit4]   2> 12325 T3969 C195 P47089 oasc.ZkController.publish numShards not found on descriptor - reading it from system property
[junit4:junit4]   2> 12327 T3969 C195 P47089 oasc.RecoveryStrategy.doRecovery Finished recovery process. core=collection1
[junit4:junit4]   2> 12806 T3999 oass.OpenExchangeRatesOrgProvider.init Initialized with rates=open-exchange-rates.json, refreshInterval=1440.
[junit4:junit4]   2> 12817 T3999 oass.IndexSchema.readSchema default search field in schema is text
[junit4:junit4]   2> 12821 T3999 oass.IndexSchema.readSchema unique key field: id
[junit4:junit4]   2> 12833 T3999 oass.FileExchangeRateProvider.reload Reloading exchange rates from file currency.xml
[junit4:junit4]   2> 12849 T3999 oass.FileExchangeRateProvider.reload Reloading exchange rates from file currency.xml
[junit4:junit4]   2> 12854 T3999 oass.OpenExchangeRatesOrgProvider.reload Reloading exchange rates from open-exchange-rates.json
[junit4:junit4]   2> 12855 T3999 oass.OpenExchangeRatesOrgProvider.reload Reloading exchange rates from open-exchange-rates.json
[junit4:junit4]   2> 12856 T3999 oasc.SolrCore.<init> [collection1] Opening new SolrCore at /usr/home/hudson/hudson-slave/workspace/Lucene-Solr-Tests-trunk-java7/solr/build/solr-core/test/J0/./org.apache.solr.cloud.SyncSliceTest-jetty4-1360950296846/collection1/, dataDir=./org.apache.solr.cloud.SyncSliceTest-1360950285256/jetty4/
[junit4:junit4]   2> 12856 T3999 oasc.JmxMonitoredMap.<init> JMX monitoring is enabled. Adding Solr mbeans to JMX Server: com.sun.jmx.mbeanserver.JmxMBeanServer@3bf06804
[junit4:junit4]   2> 12857 T3999 oasc.SolrCore.initDirectoryFactory solr.NRTCachingDirectoryFactory
[junit4:junit4]   2> 12858 T3999 oasc.CachingDirectoryFactory.get return new directory for /usr/home/hudson/hudson-slave/workspace/Lucene-Solr-Tests-trunk-java7/solr/build/solr-core/test/J0/./org.apache.solr.cloud.SyncSliceTest-1360950285256/jetty4 forceNew:false
[junit4:junit4]   2> 12858 T3999 oasc.CachingDirectoryFactory.close Releasing directory:/usr/home/hudson/hudson-slave/workspace/Lucene-Solr-Tests-trunk-java7/solr/build/solr-core/test/J0/./org.apache.solr.cloud.SyncSliceTest-1360950285256/jetty4
[junit4:junit4]   2> 12859 T3999 oasc.SolrCore.getNewIndexDir New index directory detected: old=null new=./org.apache.solr.cloud.SyncSliceTest-1360950285256/jetty4/index/
[junit4:junit4]   2> 12859 T3999 oasc.SolrCore.initIndex WARNING [collection1] Solr index directory './org.apache.solr.cloud.SyncSliceTest-1360950285256/jetty4/index' doesn't exist. Creating new index...
[junit4:junit4]   2> 12860 T3999 oasc.CachingDirectoryFactory.get return new directory for /usr/home/hudson/hudson-slave/workspace/Lucene-Solr-Tests-trunk-java7/solr/build/solr-core/test/J0/./org.apache.solr.cloud.SyncSliceTest-1360950285256/jetty4/index forceNew:false
[junit4:junit4]   2> 12877 T3933 oascc.ZkStateReader.updateClusterState Updating cloud state from ZooKeeper... 
[junit4:junit4]   2> 12878 T3933 oasc.Overseer$ClusterStateUpdater.updateState Update state numShards=1 message={
[junit4:junit4]   2> 	  "operation":"state",
[junit4:junit4]   2> 	  "numShards":"1",
[junit4:junit4]   2> 	  "shard":"shard1",
[junit4:junit4]   2> 	  "roles":null,
[junit4:junit4]   2> 	  "state":"recovering",
[junit4:junit4]   2> 	  "core":"collection1",
[junit4:junit4]   2> 	  "collection":"collection1",
[junit4:junit4]   2> 	  "node_name":"127.0.0.1:28562_",
[junit4:junit4]   2> 	  "base_url":"http://127.0.0.1:28562"}
[junit4:junit4]   2> 12906 T3999 oasc.SolrDeletionPolicy.onCommit SolrDeletionPolicy.onCommit: commits:num=1
[junit4:junit4]   2> 		commit{dir=RateLimitedDirectoryWrapper(NRTCachingDirectory(org.apache.lucene.store.NIOFSDirectory@/usr/home/hudson/hudson-slave/workspace/Lucene-Solr-Tests-trunk-java7/solr/build/solr-core/test/J0/org.apache.solr.cloud.SyncSliceTest-1360950285256/jetty4/index lockFactory=org.apache.lucene.store.NativeFSLockFactory@3ddea00b; maxCacheMB=48.0 maxMergeSizeMB=4.0)),segFN=segments_1,generation=1,filenames=[segments_1]
[junit4:junit4]   2> 12906 T3999 oasc.SolrDeletionPolicy.updateCommits newest commit = 1[segments_1]
[junit4:junit4]   2> 12907 T3933 oasc.Overseer$ClusterStateUpdater.updateState Update state numShards=1 message={
[junit4:junit4]   2> 	  "operation":"state",
[junit4:junit4]   2> 	  "numShards":"1",
[junit4:junit4]   2> 	  "shard":"shard1",
[junit4:junit4]   2> 	  "roles":null,
[junit4:junit4]   2> 	  "state":"active",
[junit4:junit4]   2> 	  "core":"collection1",
[junit4:junit4]   2> 	  "collection":"collection1",
[junit4:junit4]   2> 	  "node_name":"127.0.0.1:47089_",
[junit4:junit4]   2> 	  "base_url":"http://127.0.0.1:47089"}
[junit4:junit4]   2> 12907 T3999 oasc.CachingDirectoryFactory.close Releasing directory:/usr/home/hudson/hudson-slave/workspace/Lucene-Solr-Tests-trunk-java7/solr/build/solr-core/test/J0/./org.apache.solr.cloud.SyncSliceTest-1360950285256/jetty4/index
[junit4:junit4]   2> 12908 T3999 oasc.SolrCore.initWriters created xml: solr.XMLResponseWriter
[junit4:junit4]   2> 12910 T3999 oasup.UpdateRequestProcessorChain.init inserting DistributedUpdateProcessorFactory into updateRequestProcessorChain "dedupe"
[junit4:junit4]   2> 12910 T3999 oasup.UpdateRequestProcessorChain.init inserting DistributedUpdateProcessorFactory into updateRequestProcessorChain "dedupe-allfields"
[junit4:junit4]   2> 12910 T3999 oasup.UpdateRequestProcessorChain.init inserting DistributedUpdateProcessorFactory into updateRequestProcessorChain "stored_sig"
[junit4:junit4]   2> 12911 T3999 oasup.UpdateRequestProcessorChain.init inserting DistributedUpdateProcessorFactory into updateRequestProcessorChain "uniq-fields"
[junit4:junit4]   2> 12911 T3999 oasup.UpdateRequestProcessorChain.init inserting DistributedUpdateProcessorFactory into updateRequestProcessorChain "distrib-dup-test-chain-implicit"
[junit4:junit4]   2> 12912 T3999 oasc.RequestHandlers.initHandlersFromConfig adding lazy requestHandler: solr.ReplicationHandler
[junit4:junit4]   2> 12912 T3999 oasc.RequestHandlers.initHandlersFromConfig created /replication: solr.ReplicationHandler
[junit4:junit4]   2> 12913 T3999 oasc.RequestHandlers.initHandlersFromConfig created standard: solr.StandardRequestHandler
[junit4:junit4]   2> 12913 T3999 oasc.RequestHandlers.initHandlersFromConfig created /get: solr.RealTimeGetHandler
[junit4:junit4]   2> 12914 T3999 oasc.RequestHandlers.initHandlersFromConfig created dismax: solr.SearchHandler
[junit4:junit4]   2> 12914 T3999 oasc.RequestHandlers.initHandlersFromConfig created mock: org.apache.solr.core.MockQuerySenderListenerReqHandler
[junit4:junit4]   2> 12915 T3999 oasc.RequestHandlers.initHandlersFromConfig created /admin/: org.apache.solr.handler.admin.AdminHandlers
[junit4:junit4]   2> 12915 T3999 oasc.RequestHandlers.initHandlersFromConfig created defaults: solr.StandardRequestHandler
[junit4:junit4]   2> 12916 T3999 oasc.RequestHandlers.initHandlersFromConfig adding lazy requestHandler: solr.StandardRequestHandler
[junit4:junit4]   2> 12916 T3999 oasc.RequestHandlers.initHandlersFromConfig created lazy: solr.StandardRequestHandler
[junit4:junit4]   2> 12916 T3951 oascc.ZkStateReader$2.process A cluster state change: WatchedEvent state:SyncConnected type:NodeDataChanged path:/clusterstate.json, has occurred - updating... (live nodes size: 5)
[junit4:junit4]   2> 12916 T3998 oascc.ZkStateReader$2.process A cluster state change: WatchedEvent state:SyncConnected type:NodeDataChanged path:/clusterstate.json, has occurred - updating... (live nodes size: 5)
[junit4:junit4]   2> 12916 T3938 oascc.ZkStateReader$2.process A cluster state change: WatchedEvent state:SyncConnected type:NodeDataChanged path:/clusterstate.json, has occurred - updating... (live nodes size: 5)
[junit4:junit4]   2> 12916 T3982 oascc.ZkStateReader$2.process A cluster state change: WatchedEvent state:SyncConnected type:NodeDataChanged path:/clusterstate.json, has occurred - updating... (live nodes size: 5)
[junit4:junit4]   2> 12916 T3932 oascc.ZkStateReader$2.process A cluster state change: WatchedEvent state:SyncConnected type:NodeDataChanged path:/clusterstate.json, has occurred - updating... (live nodes size: 5)
[junit4:junit4]   2> 12917 T3966 oascc.ZkStateReader$2.process A cluster state change: WatchedEvent state:SyncConnected type:NodeDataChanged path:/clusterstate.json, has occurred - updating... (live nodes size: 5)
[junit4:junit4]   2> 12917 T3999 oasc.RequestHandlers.initHandlersFromConfig created /update: solr.UpdateRequestHandler
[junit4:junit4]   2> 12918 T3999 oasc.RequestHandlers.initHandlersFromConfig created /terms: org.apache.solr.handler.component.SearchHandler
[junit4:junit4]   2> 12919 T3999 oasc.RequestHandlers.initHandlersFromConfig created spellCheckCompRH: org.apache.solr.handler.component.SearchHandler
[junit4:junit4]   2> 12919 T3999 oasc.RequestHandlers.initHandlersFromConfig created spellCheckCompRH_Direct: org.apache.solr.handler.component.SearchHandler
[junit4:junit4]   2> 12920 T3999 oasc.RequestHandlers.initHandlersFromConfig created spellCheckWithWordbreak: org.apache.solr.handler.component.SearchHandler
[junit4:junit4]   2> 12921 T3999 oasc.RequestHandlers.initHandlersFromConfig created spellCheckWithWordbreak_Direct: org.apache.solr.handler.component.SearchHandler
[junit4:junit4]   2> 12921 T3999 oasc.RequestHandlers.initHandlersFromConfig created spellCheckCompRH1: org.apache.solr.handler.component.SearchHandler
[junit4:junit4]   2> 12922 T3999 oasc.RequestHandlers.initHandlersFromConfig created mltrh: org.apache.solr.handler.component.SearchHandler
[junit4:junit4]   2> 12922 T3999 oasc.RequestHandlers.initHandlersFromConfig created tvrh: org.apache.solr.handler.component.SearchHandler
[junit4:junit4]   2> 12923 T3999 oasc.RequestHandlers.initHandlersFromConfig created /mlt: solr.MoreLikeThisHandler
[junit4:junit4]   2> 12923 T3999 oasc.RequestHandlers.initHandlersFromConfig created /debug/dump: solr.DumpRequestHandler
[junit4:junit4]   2> 12936 T3999 oashl.XMLLoader.init xsltCacheLifetimeSeconds=60
[junit4:junit4]   2> 12941 T3999 oasc.SolrCore.initDeprecatedSupport WARNING solrconfig.xml uses deprecated <admin/gettableFiles>, Please update your config to use the ShowFileRequestHandler.
[junit4:junit4]   2> 12942 T3999 oasc.SolrCore.initDeprecatedSupport WARNING adding ShowFileRequestHandler with hidden files: [SCHEMA.XML, OLD_SYNONYMS.TXT, STOPWORDS.TXT, PROTWORDS.TXT, OPEN-EXCHANGE-RATES.JSON, SYNONYMS.TXT, CURRENCY.XML, MAPPING-ISOLATIN1ACCENT.TXT]
[junit4:junit4]   2> 12944 T3999 oasc.CachingDirectoryFactory.close Releasing directory:/usr/home/hudson/hudson-slave/workspace/Lucene-Solr-Tests-trunk-java7/solr/build/solr-core/test/J0/./org.apache.solr.cloud.SyncSliceTest-1360950285256/jetty4
[junit4:junit4]   2> 12946 T3999 oass.SolrIndexSearcher.<init> Opening Searcher@31da088a main
[junit4:junit4]   2> 12947 T3999 oasu.CommitTracker.<init> Hard AutoCommit: disabled
[junit4:junit4]   2> 12947 T3999 oasu.CommitTracker.<init> Soft AutoCommit: disabled
[junit4:junit4]   2> 12948 T3999 oashc.SpellCheckComponent.inform Initializing spell checkers
[junit4:junit4]   2> 12955 T3999 oass.DirectSolrSpellChecker.init init: {name=direct,classname=DirectSolrSpellChecker,field=lowerfilt,minQueryLength=3}
[junit4:junit4]   2> 13017 T4002 oasc.SolrCore.registerSearcher [collection1] Registered new searcher Searcher@31da088a main{StandardDirectoryReader(segments_1:1)}
[junit4:junit4]   2> 13022 T3999 oasc.ZkController.publish publishing core=collection1 state=down
[junit4:junit4]   2> 13023 T3999 oasc.ZkController.publish numShards not found on descriptor - reading it from system property
[junit4:junit4]   2> 14422 T3933 oascc.ZkStateReader.updateClusterState Updating cloud state from ZooKeeper... 
[junit4:junit4]   2> 14423 T3933 oasc.Overseer$ClusterStateUpdater.updateState Update state numShards=1 message={
[junit4:junit4]   2> 	  "operation":"state",
[junit4:junit4]   2> 	  "numShards":"1",
[junit4:junit4]   2> 	  "shard":null,
[junit4:junit4]   2> 	  "roles":null,
[junit4:junit4]   2> 	  "state":"down",
[junit4:junit4]   2> 	  "core":"collection1",
[junit4:junit4]   2> 	  "collection":"collection1",
[junit4:junit4]   2> 	  "node_name":"127.0.0.1:40808_",
[junit4:junit4]   2> 	  "base_url":"http://127.0.0.1:40808"}
[junit4:junit4]   2> 14423 T3933 oasc.Overseer$ClusterStateUpdater.updateState Collection already exists with numShards=1
[junit4:junit4]   2> 14424 T3933 oasc.Overseer$ClusterStateUpdater.updateState Assigning new node to shard shard=shard1
[junit4:junit4]   2> 14449 T3951 oascc.ZkStateReader$2.process A cluster state change: WatchedEvent state:SyncConnected type:NodeDataChanged path:/clusterstate.json, has occurred - updating... (live nodes size: 5)
[junit4:junit4]   2> 14449 T3998 oascc.ZkStateReader$2.process A cluster state change: WatchedEvent state:SyncConnected type:NodeDataChanged path:/clusterstate.json, has occurred - updating... (live nodes size: 5)
[junit4:junit4]   2> 14449 T3938 oascc.ZkStateReader$2.process A cluster state change: WatchedEvent state:SyncConnected type:NodeDataChanged path:/clusterstate.json, has occurred - updating... (live nodes size: 5)
[junit4:junit4]   2> 14449 T3982 oascc.ZkStateReader$2.process A cluster state change: WatchedEvent state:SyncConnected type:NodeDataChanged path:/clusterstate.json, has occurred - updating... (live nodes size: 5)
[junit4:junit4]   2> 14449 T3932 oascc.ZkStateReader$2.process A cluster state change: WatchedEvent state:SyncConnected type:NodeDataChanged path:/clusterstate.json, has occurred - updating... (live nodes size: 5)
[junit4:junit4]   2> 14449 T3966 oascc.ZkStateReader$2.process A cluster state change: WatchedEvent state:SyncConnected type:NodeDataChanged path:/clusterstate.json, has occurred - updating... (live nodes size: 5)
[junit4:junit4]   2> 15027 T3999 oasc.CoreContainer.registerCore registering core: collection1
[junit4:junit4]   2> 15027 T3999 oasc.ZkController.register Register replica - core:collection1 address:http://127.0.0.1:40808 collection:collection1 shard:shard1
[junit4:junit4]   2> 15032 T3999 oasc.ZkController.register We are http://127.0.0.1:40808/collection1/ and leader is http://127.0.0.1:19665/collection1/
[junit4:junit4]   2> 15032 T3999 oasc.ZkController.register No LogReplay needed for core=collection1 baseURL=http://127.0.0.1:40808
[junit4:junit4]   2> 15033 T3999 oasc.ZkController.checkRecovery Core needs to recover:collection1
[junit4:junit4]   2> 15033 T3999 oasu.DefaultSolrCoreState.doRecovery Running recovery - first canceling any ongoing recovery
[junit4:junit4]   2> ASYNC  NEW_CORE C198 name=collection1 org.apache.solr.core.SolrCore@1bb83189 url=http://127.0.0.1:40808/collection1 node=127.0.0.1:40808_ C198_STATE=coll:collection1 core:collection1 props:{shard=null, roles=null, state=down, core=collection1, collection=collection1, node_name=127.0.0.1:40808_, base_url=http://127.0.0.1:40808}
[junit4:junit4]   2> 15033 T4003 C198 P40808 oasc.RecoveryStrategy.run Starting recovery process.  core=collection1 recoveringAfterStartup=true
[junit4:junit4]   2> 15034 T4003 C198 P40808 oasc.RecoveryStrategy.doRecovery ###### startupVersions=[]
[junit4:junit4]   2> 15035 T4003 C198 P40808 oasc.ZkController.publish publishing core=collection1 state=recovering
[junit4:junit4]   2> 15035 T3999 oascc.ZkStateReader.updateClusterState Updating cloud state from ZooKeeper... 
[junit4:junit4]   2> 15035 T4003 C198 P40808 oasc.ZkController.publish numShards not found on descriptor - reading it from system property
[junit4:junit4]   2> 15036 T3910 oass.SolrDispatchFilter.init user.dir=/usr/home/hudson/hudson-slave/workspace/Lucene-Solr-Tests-trunk-java7/solr/build/solr-core/test/J0
[junit4:junit4]   2> 15036 T3910 oass.SolrDispatchFilter.init SolrDispatchFilter.init() done
[junit4:junit4]   2> 15037 T4003 C198 P40808 oascsi.HttpClientUtil.createClient Creating new http client, config:maxConnections=128&maxConnectionsPerHost=32&followRedirects=false
[junit4:junit4]   2> 15037 T3910 oascsi.HttpClientUtil.createClient Creating new http client, config:maxConnections=128&maxConnectionsPerHost=32&followRedirects=false
[junit4:junit4]   2> 15058 T3910 oascc.ZkStateReader.updateClusterState Updating cloud state from ZooKeeper... 
[junit4:junit4]   2> 15059 T3910 oasc.AbstractFullDistribZkTestBase.waitForThingsToLevelOut Wait for recoveries to finish - wait 15 for each attempt
[junit4:junit4]   2> 15059 T3910 oasc.AbstractDistribZkTestBase.waitForRecoveriesToFinish Wait for recoveries to finish - collection: collection1 failOnTimeout:true timeout (sec):15
[junit4:junit4]   2> 15060 T3910 oascc.ZkStateReader.updateClusterState Updating cloud state from ZooKeeper... 
[junit4:junit4]   2>  C196_STATE=coll:collection1 core:collection1 props:{shard=shard1, roles=null, state=recovering, core=collection1, collection=collection1, node_name=127.0.0.1:28562_, base_url=http://127.0.0.1:28562}
[junit4:junit4]   2> 15599 T3985 C196 P28562 oasc.RecoveryStrategy.doRecovery Attempting to PeerSync from http://127.0.0.1:19665/collection1/ core=collection1 - recoveringAfterStartup=true
[junit4:junit4]   2> 15599 T3985 C196 P28562 oasu.PeerSync.sync PeerSync: core=collection1 url=http://127.0.0.1:28562 START replicas=[http://127.0.0.1:19665/collection1/] nUpdates=100
[junit4:junit4]   2> 15600 T3985 C196 P28562 oasu.PeerSync.sync WARNING no frame of reference to tell of we've missed updates
[junit4:junit4]   2> 15600 T3985 C196 P28562 oasc.RecoveryStrategy.doRecovery PeerSync Recovery was not successful - trying replication. core=collection1
[junit4:junit4]   2> 15600 T3985 C196 P28562 oasc.RecoveryStrategy.doRecovery Starting Replication Recovery. core=collection1
[junit4:junit4]   2> 15600 T3985 C196 P28562 oasc.RecoveryStrategy.doRecovery Begin buffering updates. core=collection1
[junit4:junit4]   2> 15600 T3985 C196 P28562 oasu.UpdateLog.bufferUpdates Starting to buffer updates. FSUpdateLog{state=ACTIVE, tlog=null}
[junit4:junit4]   2> 15601 T3985 C196 P28562 oasc.RecoveryStrategy.replicate Attempting to replicate from http://127.0.0.1:19665/collection1/. core=collection1
[junit4:junit4]   2> 15601 T3985 C196 P28562 oascsi.HttpClientUtil.createClient Creating new http client, config:maxConnections=128&maxConnectionsPerHost=32&followRedirects=false
[junit4:junit4]   2> 15602 T3943 C197 P19665 REQ /get {getVersions=100&distrib=false&wt=javabin&qt=/get&version=2} status=0 QTime=0 
[junit4:junit4]   2> 15611 T3947 C197 P19665 oasu.DirectUpdateHandler2.commit start commit{,optimize=false,openSearcher=false,waitSearcher=true,expungeDeletes=false,softCommit=false}
[junit4:junit4]   2> 15644 T3947 C197 P19665 oasc.SolrDeletionPolicy.onCommit SolrDeletionPolicy.onCommit: commits:num=2
[junit4:junit4]   2> 		commit{dir=RateLimitedDirectoryWrapper(NRTCachingDirectory(org.apache.lucene.store.NIOFSDirectory@/usr/home/hudson/hudson-slave/workspace/Lucene-Solr-Tests-trunk-java7/solr/build/solr-core/test/J0/org.apache.solr.cloud.SyncSliceTest-1360950285256/jetty1/index lockFactory=org.apache.lucene.store.NativeFSLockFactory@72bab1ce; maxCacheMB=48.0 maxMergeSizeMB=4.0)),segFN=segments_2,generation=2,filenames=[segments_2]
[junit4:junit4]   2> 		commit{dir=RateLimitedDirectoryWrapper(NRTCachingDirectory(org.apache.lucene.store.NIOFSDirectory@/usr/home/hudson/hudson-slave/workspace/Lucene-Solr-Tests-trunk-java7/solr/build/solr-core/test/J0/org.apache.solr.cloud.SyncSliceTest-1360950285256/jetty1/index lockFactory=org.apache.lucene.store.NativeFSLockFactory@72bab1ce; maxCacheMB=48.0 maxMergeSizeMB=4.0)),segFN=segments_3,generation=3,filenames=[segments_3]
[junit4:junit4]   2> 15644 T3947 C197 P19665 oasc.SolrDeletionPolicy.updateCommits newest commit = 3[segments_3]
[junit4:junit4]   2> 15645 T3947 C197 P19665 oasc.CachingDirectoryFactory.close Releasing directory:/usr/home/hudson/hudson-slave/workspace/Lucene-Solr-Tests-trunk-java7/solr/build/solr-core/test/J0/./org.apache.solr.cloud.SyncSliceTest-1360950285256/jetty1
[junit4:junit4]   2> 15646 T3947 C197 P19665 oasu.DirectUpdateHandler2.commit end_commit_flush
[junit4:junit4]   2> 15646 T3947 C197 P19665 /update {waitSearcher=true&openSearcher=false&commit=true&wt=javabin&commit_end_point=true&version=2&softCommit=false} {commit=} 0 35
[junit4:junit4]   2> 15647 T3985 C196 P28562 oash.ReplicationHandler.inform Commits will be reserved for  10000
[junit4:junit4]   2> 15647 T3985 C196 P28562 oash.SnapPuller.<init>  No value set for 'pollInterval'. Timer Task not started.
[junit4:junit4]   2> 15649 T3945 C197 P19665 REQ /replication {command=indexversion&qt=/replication&wt=javabin&version=2} status=0 QTime=0 
[junit4:junit4]   2> 15650 T3985 C196 P28562 oash.SnapPuller.fetchLatestIndex Master's generation: 3
[junit4:junit4]   2> 15650 T3985 C196 P28562 oash.SnapPuller.fetchLatestIndex Slave's generation: 1
[junit4:junit4]   2> 15650 T3985 C196 P28562 oash.SnapPuller.fetchLatestIndex Starting replication process
[junit4:junit4]   2> 15652 T3945 C197 P19665 oasc.CachingDirectoryFactory.close Releasing directory:/usr/home/hudson/hudson-slave/workspace/Lucene-Solr-Tests-trunk-java7/solr/build/solr-core/test/J0/./org.apache.solr.cloud.SyncSliceTest-1360950285256/jetty1
[junit4:junit4]   2> 15653 T3945 C197 P19665 oasc.CachingDirectoryFactory.close Releasing directory:/usr/home/hudson/hudson-slave/workspace/Lucene-Solr-Tests-trunk-java7/solr/build/solr-core/test/J0/./org.apache.solr.cloud.SyncSliceTest-1360950285256/jetty1/index
[junit4:junit4]   2> 15653 T3945 C197 P19665 REQ /replication {command=filelist&qt=/replication&wt=javabin&generation=3&version=2} status=0 QTime=1 
[junit4:junit4]   2> 15654 T3985 C196 P28562 oash.SnapPuller.fetchLatestIndex Number of files in latest index in master: 1
[junit4:junit4]   2> 15655 T3985 C196 P28562 oasc.CachingDirectoryFactory.get return new directory for /usr/home/hudson/hudson-slave/workspace/Lucene-Solr-Tests-trunk-java7/solr/build/solr-core/test/J0/./org.apache.solr.cloud.SyncSliceTest-1360950285256/jetty3/index.20130215104500905 forceNew:false
[junit4:junit4]   2> 15656 T3985 C196 P28562 oasc.CachingDirectoryFactory.close Releasing directory:/usr/home/hudson/hudson-slave/workspace/Lucene-Solr-Tests-trunk-java7/solr/build/solr-core/test/J0/./org.apache.solr.cloud.SyncSliceTest-1360950285256/jetty3
[junit4:junit4]   2> 15656 T3985 C196 P28562 oash.SnapPuller.fetchLatestIndex Starting download to RateLimitedDirectoryWrapper(NRTCachingDirectory(org.apache.lucene.store.NIOFSDirectory@/usr/home/hudson/hudson-slave/workspace/Lucene-Solr-Tests-trunk-java7/solr/build/solr-core/test/J0/org.apache.solr.cloud.SyncSliceTest-1360950285256/jetty3/index.20130215104500905 lockFactory=org.apache.lucene.store.NativeFSLockFactory@2002f7cf; maxCacheMB=48.0 maxMergeSizeMB=4.0)) fullCopy=true
[junit4:junit4]   2> 15660 T3945 C197 P19665 REQ /replication {file=segments_3&command=filecontent&checksum=true&wt=filestream&qt=/replication&generation=3} status=0 QTime=0 
[junit4:junit4]   2> 15661 T3985 C196 P28562 oasc.CachingDirectoryFactory.close Releasing directory:/usr/home/hudson/hudson-slave/workspace/Lucene-Solr-Tests-trunk-java7/solr/build/solr-core/test/J0/./org.apache.solr.cloud.SyncSliceTest-1360950285256/jetty3/index
[junit4:junit4]   2> 15662 T3985 C196 P28562 oash.SnapPuller.fetchLatestIndex Total time taken for download : 0 secs
[junit4:junit4]   2> 15662 T3985 C196 P28562 oash.SnapPuller.modifyIndexProps New index installed. Updating index properties... index=index.20130215104500905
[junit4:junit4]   2> 15664 T3985 C196 P28562 oasc.CachingDirectoryFactory.close Releasing directory:/usr/home/hudson/hudson-slave/workspace/Lucene-Solr-Tests-trunk-java7/solr/build/solr-core/test/J0/./org.apache.solr.cloud.SyncSliceTest-1360950285256/jetty3
[junit4:junit4]   2> 15664 T3985 C196 P28562 oasc.CachingDirectoryFactory.close Releasing directory:/usr/home/hudson/hudson-slave/workspace/Lucene-Solr-Tests-trunk-java7/solr/build/solr-core/test/J0/./org.apache.solr.cloud.SyncSliceTest-1360950285256/jetty3
[junit4:junit4]   2> 15664 T3985 C196 P28562 oasc.SolrCore.getNewIndexDir New index directory detected: old=./org.apache.solr.cloud.SyncSliceTest-1360950285256/jetty3/index/ new=./org.apache.solr.cloud.SyncSliceTest-1360950285256/jetty3/index.20130215104500905
[junit4:junit4]   2> 15668 T3985 C196 P28562 oasc.SolrDeletionPolicy.onInit SolrDeletionPolicy.onInit: commits:num=1
[junit4:junit4]   2> 		commit{dir=RateLimitedDirectoryWrapper(NRTCachingDirectory(org.apache.lucene.store.NIOFSDirectory@/usr/home/hudson/hudson-slave/workspace/Lucene-Solr-Tests-trunk-java7/solr/build/solr-core/test/J0/org.apache.solr.cloud.SyncSliceTest-1360950285256/jetty3/index.20130215104500905 lockFactory=org.apache.lucene.store.NativeFSLockFactory@2002f7cf; maxCacheMB=48.0 maxMergeSizeMB=4.0)),segFN=segments_3,generation=3,filenames=[segments_3]
[junit4:junit4]   2> 15668 T3985 C196 P28562 oasc.SolrDeletionPolicy.updateCommits newest commit = 3[segments_3]
[junit4:junit4]   2> 15670 T3985 C196 P28562 oasc.CachingDirectoryFactory.close Releasing directory:/usr/home/hudson/hudson-slave/workspace/Lucene-Solr-Tests-trunk-java7/solr/build/solr-core/test/J0/./org.apache.solr.cloud.SyncSliceTest-1360950285256/jetty3
[junit4:junit4]   2> 15670 T3985 C196 P28562 oasu.DefaultSolrCoreState.newIndexWriter Creating new IndexWriter...
[junit4:junit4]   2> 15670 T3985 C196 P28562 oasu.DefaultSolrCoreState.newIndexWriter Waiting until IndexWriter is unused... core=collection1
[junit4:junit4]   2> 15670 T3985 C196 P28562 oasu.DefaultSolrCoreState.newIndexWriter Rollback old IndexWriter... core=collection1
[junit4:junit4]   2> 15671 T3985 C196 P28562 oasc.CachingDirectoryFactory.close Releasing directory:/usr/home/hudson/hudson-slave/workspace/Lucene-Solr-Tests-trunk-java7/solr/build/solr-core/test/J0/./org.apache.solr.cloud.SyncSliceTest-1360950285256/jetty3/index.20130215104500905
[junit4:junit4]   2> 15672 T3985 C196 P28562 oasc.CachingDirectoryFactory.close Releasing directory:/usr/home/hudson/hudson-slave/workspace/Lucene-Solr-Tests-trunk-java7/solr/build/solr-core/test/J0/./org.apache.solr.cloud.SyncSliceTest-1360950285256/jetty3
[junit4:junit4]   2> 15675 T3985 C196 P28562 oasc.SolrDeletionPolicy.onInit SolrDeletionPolicy.onInit: commits:num=1
[junit4:junit4]   2> 		commit{dir=RateLimitedDirectoryWrapper(NRTCachingDirectory(org.apache.lucene.store.NIOFSDirectory@/usr/home/hudson/hudson-slave/workspace/Lucene-Solr-Tests-trunk-java7/solr/build/solr-core/test/J0/org.apache.solr.cloud.SyncSliceTest-1360950285256/jetty3/index.20130215104500905 lockFactory=org.apache.lucene.store.NativeFSLockFactory@2002f7cf; maxCacheMB=48.0 maxMergeSizeMB=4.0)),segFN=segments_3,generation=3,filenames=[segments_3]
[junit4:junit4]   2> 15675 T3985 C196 P28562 oasc.SolrDeletionPolicy.updateCommits newest commit = 3[segments_3]
[junit4:junit4]   2> 15676 T3985 C196 P28562 oasu.DefaultSolrCoreState.newIndexWriter New IndexWriter is ready to be used.
[junit4:junit4]   2> 15676 T3985 C196 P28562 oasc.CachingDirectoryFactory.close Releasing directory:/usr/home/hudson/hudson-slave/workspace/Lucene-Solr-Tests-trunk-java7/solr/build/solr-core/test/J0/./org.apache.solr.cloud.SyncSliceTest-1360950285256/jetty3
[junit4:junit4]   2> 15676 T3985 C196 P28562 oass.SolrIndexSearcher.<init> Opening Searcher@5c53d2cb main
[junit4:junit4]   2> 15678 T3984 oasc.SolrCore.registerSearcher [collection1] Registered new searcher Searcher@5c53d2cb main{StandardDirectoryReader(segments_3:1:nrt)}
[junit4:junit4]   2> 15679 T3984 oasc.CachingDirectoryFactory.close Releasing directory:/usr/home/hudson/hudson-slave/workspace/Lucene-Solr-Tests-trunk-java7/solr/build/solr-core/test/J0/./org.apache.solr.cloud.SyncSliceTest-1360950285256/jetty3/index
[junit4:junit4]   2> 15679 T3985 C196 P28562 oasu.DirectUpdateHandler2.commit start commit{,optimize=false,openSearcher=false,waitSearcher=false,expungeDeletes=false,softCommit=false}
[junit4:junit4]   2> 15683 T3985 C196 P28562 oasc.SolrDeletionPolicy.onCommit SolrDeletionPolicy.onCommit: commits:num=2
[junit4:junit4]   2> 		commit{dir=RateLimitedDirectoryWrapper(NRTCachingDirectory(org.apache.lucene.store.NIOFSDirectory@/usr/home/hudson/hudson-slave/workspace/Lucene-Solr-Tests-trunk-java7/solr/build/solr-core/test/J0/org.apache.solr.cloud.SyncSliceTest-1360950285256/jetty3/index.20130215104500905 lockFactory=org.apache.lucene.store.NativeFSLockFactory@2002f7cf; maxCacheMB=48.0 maxMergeSizeMB=4.0)),segFN=segments_3,generation=3,filenames=[segments_3]
[junit4:junit4]   2> 		commit{dir=RateLimitedDirectoryWrapper(NRTCachingDirectory(org.apache.lucene.store.NIOFSDirectory@/usr/home/hudson/hudson-slave/workspace/Lucene-Solr-Tests-trunk-java7/solr/build/solr-core/test/J0/org.apache.solr.cloud.SyncSliceTest-1360950285256/jetty3/index.20130215104500905 lockFactory=org.apache.lucene.store.NativeFSLockFactory@2002f7cf; maxCacheMB=48.0 maxMergeSizeMB=4.0)),segFN=segments_4,generation=4,filenames=[segments_4]
[junit4:junit4]   2> 15683 T3985 C196 P28562 oasc.SolrDeletionPolicy.updateCommits newest commit = 4[segments_4]
[junit4:junit4]   2> 15684 T3985 C196 P28562 oasc.CachingDirectoryFactory.close Releasing directory:/usr/home/hudson/hudson-slave/workspace/Lucene-Solr-Tests-trunk-java7/solr/build/solr-core/test/J0/./org.apache.solr.cloud.SyncSliceTest-1360950285256/jetty3
[junit4:junit4]   2> 15685 T3985 C196 P28562 oasu.DirectUpdateHandler2.commit end_commit_flush
[junit4:junit4]   2> 15685 T3985 C196 P28562 oasc.CachingDirectoryFactory.close Releasing directory:/usr/home/hudson/hudson-slave/workspace/Lucene-Solr-Tests-trunk-java7/solr/build/solr-core/test/J0/./org.apache.solr.cloud.SyncSliceTest-1360950285256/jetty3/index.20130215104500905
[junit4:junit4]   2> 15685 T3985 C196 P28562 oasc.CachingDirectoryFactory.close Releasing directory:/usr/home/hudson/hudson-slave/workspace/Lucene-Solr-Tests-trunk-java7/solr/build/solr-core/test/J0/./org.apache.solr.cloud.SyncSliceTest-1360950285256/jetty3/index
[junit4:junit4]   2> 15685 T3985 C196 P28562 oasc.RecoveryStrategy.replay No replay needed. core=collection1
[junit4:junit4]   2> 15685 T3985 C196 P28562 oasc.RecoveryStrategy.doRecovery Replication Recovery was successful - registering as Active. core=collection1
[junit4:junit4]   2> 15686 T3985 C196 P28562 oasc.ZkController.publish publishing core=collection1 state=active
[junit4:junit4]   2> 15686 T3985 C196 P28562 oasc.ZkController.publish numShards not found on descriptor - reading it from system property
[junit4:junit4]   2> 15693 T3985 C196 P28562 oasc.RecoveryStrategy.doRecovery Finished recovery process. core=collection1
[junit4:junit4]   2> 15954 T3933 oascc.ZkStateReader.updateClusterState Updating cloud state from ZooKeeper... 
[junit4:junit4]   2> 15955 T3933 oasc.Overseer$ClusterStateUpdater.updateState Update state numShards=1 message={
[junit4:junit4]   2> 	  "operation":"state",
[junit4:junit4]   2> 	  "numShards":"1",
[junit4:junit4]   2> 	  "shard":"shard1",
[junit4:junit4]   2> 	  "roles":null,
[junit4:junit4]   2> 	  "state":"recovering",
[junit4:junit4]   2> 	  "core":"collection1",
[junit4:junit4]   2> 	  "collection":"collection1",
[junit4:junit4]   2> 	  "node_name":"127.0.0.1:40808_",
[junit4:junit4]   2> 	  "base_url":"http://127.0.0.1:40808"}
[junit4:junit4]   2> 15960 T3933 oasc.Overseer$ClusterStateUpdater.updateState Update state numShards=1 message={
[junit4:junit4]   2> 	  "operation":"state",
[junit4:junit4]   2> 	  "numShards":"1",
[junit4:junit4]   2> 	  "shard":"shard1",
[junit4:junit4]   2> 	  "roles":null,
[junit4:junit4]   2> 	  "state":"active",
[junit4:junit4]   2> 	  "core":"collection1",
[junit4:junit4]   2> 	  "collection":"collection1",
[junit4:junit4]   2> 	  "node_name":"127.0.0.1:28562_",
[junit4:junit4]   2> 	  "base_url":"http://127.0.0.1:28562"}
[junit4:junit4]   2> 15971 T3998 oascc.ZkStateReader$2.process A cluster state change: WatchedEvent state:SyncConnected type:NodeDataChanged path:/clusterstate.json, has occurred - updating... (live nodes size: 5)
[junit4:junit4]   2> 15971 T3982 oascc.ZkStateReader$2.process A cluster state change: WatchedEvent state:SyncConnected type:NodeDataChanged path:/clusterstate.json, has occurred - updating... (live nodes size: 5)
[junit4:junit4]   2> 15971 T3951 oascc.ZkStateReader$2.process A cluster state change: WatchedEvent state:SyncConnected type:NodeDataChanged path:/clusterstate.json, has occurred - updating... (live nodes size: 5)
[junit4:junit4]   2> 15971 T3938 oascc.ZkStateReader$2.process A cluster state change: WatchedEvent state:SyncConnected type:NodeDataChanged path:/clusterstate.json, has occurred - updating... (live nodes size: 5)
[junit4:junit4]   2> 15971 T3932 oascc.ZkStateReader$2.process A cluster state change: WatchedEvent state:SyncConnected type:NodeDataChanged path:/clusterstate.json, has occurred - updating... (live nodes size: 5)
[junit4:junit4]   2> 15971 T3966 oascc.ZkStateReader$2.process A cluster state change: WatchedEvent state:SyncConnected type:NodeDataChanged path:/clusterstate.json, has occurred - updating... (live nodes size: 5)
[junit4:junit4]   2> 16062 T3910 oascc.ZkStateReader.updateClusterState Updating cloud state from ZooKeeper... 
[junit4:junit4]   2> 17064 T3910 oascc.ZkStateReader.updateClusterState Updating cloud state from ZooKeeper... 
[junit4:junit4]   2>  C198_STATE=coll:collection1 core:collection1 props:{shard=shard1, roles=null, state=recovering, core=collection1, collection=collection1, node_name=127.0.0.1:40808_, base_url=http://127.0.0.1:40808}
[junit4:junit4]   2> 18060 T4003 C198 P40808 oasc.RecoveryStrategy.doRecovery Attempting to PeerSync from http://127.0.0.1:19665/collection1/ core=collection1 - recoveringAfterStartup=true
[junit4:junit4]   2> 18060 T4003 C198 P40808 oasu.PeerSync.sync PeerSync: core=collection1 url=http://127.0.0.1:40808 START replicas=[http://127.0.0.1:19665/collection1/] nUpdates=100
[junit4:junit4]   2> 18061 T4003 C198 P40808 oasu.PeerSync.sync WARNING no frame of reference to tell of we've missed updates
[junit4:junit4]   2> 18061 T4003 C198 P40808 oasc.RecoveryStrategy.doRecovery PeerSync Recovery was not successful - trying replication. core=collection1
[junit4:junit4]   2> 18061 T4003 C198 P40808 oasc.RecoveryStrategy.doRecovery Starting Replication Recovery. core=collection1
[junit4:junit4]   2> 18061 T4003 C198 P40808 oasc.RecoveryStrategy.doRecovery Begin buffering updates. core=collection1
[junit4:junit4]   2> 18061 T4003 C198 P40808 oasu.UpdateLog.bufferUpdates Starting to buffer updates. FSUpdateLog{state=ACTIVE, tlog=null}
[junit4:junit4]   2> 18061 T4003 C198 P40808 oasc.RecoveryStrategy.replicate Attempting to replicate from http://127.0.0.1:19665/collection1/. core=collection1
[junit4:junit4]   2> 18062 T4003 C198 P40808 oascsi.HttpClientUtil.createClient Creating new http client, config:maxConnections=128&maxConnectionsPerHost=32&followRedirects=false
[junit4:junit4]   2> 18063 T3943 C197 P19665 REQ /get {getVersions=100&distrib=false&wt=javabin&qt=/get&version=2} status=0 QTime=0 
[junit4:junit4]   2> 18066 T3910 oascc.ZkStateReader.updateClusterState Updating cloud state from ZooKeeper... 
[junit4:junit4]   2> 18077 T3941 C197 P19665 oasu.DirectUpdateHandler2.commit start commit{,optimize=false,openSearcher=false,waitSearcher=true,expungeDeletes=false,softCommit=false}
[junit4:junit4]   2> 18082 T3941 C197 P19665 oasc.SolrDeletionPolicy.onCommit SolrDeletionPolicy.onCommit: commits:num=3
[junit4:junit4]   2> 		commit{dir=RateLimitedDirectoryWrapper(NRTCachingDirectory(org.apache.lucene.store.NIOFSDirectory@/usr/home/hudson/hudson-slave/workspace/Lucene-Solr-Tests-trunk-java7/solr/build/solr-core/test/J0/org.apache.solr.cloud.SyncSliceTest-1360950285256/jetty1/index lockFactory=org.apache.lucene.store.NativeFSLockFactory@72bab1ce; maxCacheMB=48.0 maxMergeSizeMB=4.0)),segFN=segments_2,generation=2,filenames=[segments_2]
[junit4:junit4]   2> 		commit{dir=RateLimitedDirectoryWrapper(NRTCachingDirectory(org.apache.lucene.store.NIOFSDirectory@/usr/home/hudson/hudson-slave/workspace/Lucene-Solr-Tests-trunk-java7/solr/build/solr-core/test/J0/org.apache.solr.cloud.SyncSliceTest-1360950285256/jetty1/index lockFactory=org.apache.lucene.store.NativeFSLockFactory@72bab1ce; maxCacheMB=48.0 maxMergeSizeMB=4.0)),segFN=segments_3,generation=3,filenames=[segments_3]
[junit4:junit4]   2> 		commit{dir=RateLimitedDirectoryWrapper(NRTCachingDirectory(org.apache.lucene.store.NIOFSDirectory@/usr/home/hudson/hudson-slave/workspace/Lucene-Solr-Tests-trunk-java7/solr/build/solr-core/test/J0/org.apache.solr.cloud.SyncSliceTest-1360950285256/jetty1/index lockFactory=org.apache.lucene.store.NativeFSLockFactory@72bab1ce; maxCacheMB=48.0 maxMergeSizeMB=4.0)),segFN=segments_4,generation=4,filenames=[segments_4]
[junit4:junit4]   2> 18082 T3941 C197 P19665 oasc.SolrDeletionPolicy.updateCommits newest commit = 4[segments_4]
[junit4:junit4]   2> 18083 T3941 C197 P19665 oasc.CachingDirectoryFactory.close Releasing directory:

[...truncated too long message...]

estRuleMarkFailure.java:48)
[junit4:junit4]    > 	at com.carrotsearch.randomizedtesting.rules.StatementAdapter.evaluate(StatementAdapter.java:36)
[junit4:junit4]    > 	at com.carrotsearch.randomizedtesting.ThreadLeakControl$StatementRunner.run(ThreadLeakControl.java:358)
[junit4:junit4]    > 	at com.carrotsearch.randomizedtesting.ThreadLeakControl.forkTimeoutingTask(ThreadLeakControl.java:782)
[junit4:junit4]    > 	at com.carrotsearch.randomizedtesting.ThreadLeakControl$3.evaluate(ThreadLeakControl.java:442)
[junit4:junit4]    > 	at com.carrotsearch.randomizedtesting.RandomizedRunner.runSingleTest(RandomizedRunner.java:746)
[junit4:junit4]    > 	at com.carrotsearch.randomizedtesting.RandomizedRunner$3.evaluate(RandomizedRunner.java:648)
[junit4:junit4]    > 	at com.carrotsearch.randomizedtesting.RandomizedRunner$4.evaluate(RandomizedRunner.java:682)
[junit4:junit4]    > 	at com.carrotsearch.randomizedtesting.RandomizedRunner$5.evaluate(RandomizedRunner.java:693)
[junit4:junit4]    > 	at com.carrotsearch.randomizedtesting.rules.StatementAdapter.evaluate(StatementAdapter.java:36)
[junit4:junit4]    > 	at com.carrotsearch.randomizedtesting.rules.SystemPropertiesRestoreRule$1.evaluate(SystemPropertiesRestoreRule.java:53)
[junit4:junit4]    > 	at org.apache.lucene.util.AbstractBeforeAfterRule$1.evaluate(AbstractBeforeAfterRule.java:46)
[junit4:junit4]    > 	at org.apache.lucene.util.TestRuleStoreClassName$1.evaluate(TestRuleStoreClassName.java:42)
[junit4:junit4]    > 	at com.carrotsearch.randomizedtesting.rules.SystemPropertiesInvariantRule$1.evaluate(SystemPropertiesInvariantRule.java:55)
[junit4:junit4]    > 	at com.carrotsearch.randomizedtesting.rules.NoShadowingOrOverridesOnMethodsRule$1.evaluate(NoShadowingOrOverridesOnMethodsRule.java:39)
[junit4:junit4]    > 	at com.carrotsearch.randomizedtesting.rules.NoShadowingOrOverridesOnMethodsRule$1.evaluate(NoShadowingOrOverridesOnMethodsRule.java:39)
[junit4:junit4]    > 	at com.carrotsearch.randomizedtesting.rules.StatementAdapter.evaluate(StatementAdapter.java:36)
[junit4:junit4]    > 	at org.apache.lucene.util.TestRuleAssertionsRequired$1.evaluate(TestRuleAssertionsRequired.java:43)
[junit4:junit4]    > 	at org.apache.lucene.util.TestRuleMarkFailure$1.evaluate(TestRuleMarkFailure.java:48)
[junit4:junit4]    > 	at org.apache.lucene.util.TestRuleIgnoreAfterMaxFailures$1.evaluate(TestRuleIgnoreAfterMaxFailures.java:70)
[junit4:junit4]    > 	at org.apache.lucene.util.TestRuleIgnoreTestSuites$1.evaluate(TestRuleIgnoreTestSuites.java:55)
[junit4:junit4]    > 	at com.carrotsearch.randomizedtesting.rules.StatementAdapter.evaluate(StatementAdapter.java:36)
[junit4:junit4]    > 	at com.carrotsearch.randomizedtesting.ThreadLeakControl$StatementRunner.run(ThreadLeakControl.java:358)
[junit4:junit4]    > 	at java.lang.Thread.run(Thread.java:722)
[junit4:junit4]    > Caused by: java.net.SocketTimeoutException: Read timed out
[junit4:junit4]    > 	at java.net.SocketInputStream.socketRead0(Native Method)
[junit4:junit4]    > 	at java.net.SocketInputStream.read(SocketInputStream.java:150)
[junit4:junit4]    > 	at java.net.SocketInputStream.read(SocketInputStream.java:121)
[junit4:junit4]    > 	at org.apache.http.impl.io.AbstractSessionInputBuffer.fillBuffer(AbstractSessionInputBuffer.java:166)
[junit4:junit4]    > 	at org.apache.http.impl.io.SocketInputBuffer.fillBuffer(SocketInputBuffer.java:90)
[junit4:junit4]    > 	at org.apache.http.impl.io.AbstractSessionInputBuffer.readLine(AbstractSessionInputBuffer.java:281)
[junit4:junit4]    > 	at org.apache.http.impl.conn.DefaultHttpResponseParser.parseHead(DefaultHttpResponseParser.java:92)
[junit4:junit4]    > 	at org.apache.http.impl.conn.DefaultHttpResponseParser.parseHead(DefaultHttpResponseParser.java:62)
[junit4:junit4]    > 	at org.apache.http.impl.io.AbstractMessageParser.parse(AbstractMessageParser.java:254)
[junit4:junit4]    > 	at org.apache.http.impl.AbstractHttpClientConnection.receiveResponseHeader(AbstractHttpClientConnection.java:289)
[junit4:junit4]    > 	at org.apache.http.impl.conn.DefaultClientConnection.receiveResponseHeader(DefaultClientConnection.java:252)
[junit4:junit4]    > 	at org.apache.http.impl.conn.ManagedClientConnectionImpl.receiveResponseHeader(ManagedClientConnectionImpl.java:191)
[junit4:junit4]    > 	at org.apache.http.protocol.HttpRequestExecutor.doReceiveResponse(HttpRequestExecutor.java:300)
[junit4:junit4]    > 	at org.apache.http.protocol.HttpRequestExecutor.execute(HttpRequestExecutor.java:127)
[junit4:junit4]    > 	at org.apache.http.impl.client.DefaultRequestDirector.tryExecute(DefaultRequestDirector.java:717)
[junit4:junit4]    > 	at org.apache.http.impl.client.DefaultRequestDirector.execute(DefaultRequestDirector.java:522)
[junit4:junit4]    > 	at org.apache.http.impl.client.AbstractHttpClient.execute(AbstractHttpClient.java:906)
[junit4:junit4]    > 	at org.apache.http.impl.client.AbstractHttpClient.execute(AbstractHttpClient.java:805)
[junit4:junit4]    > 	at org.apache.http.impl.client.AbstractHttpClient.execute(AbstractHttpClient.java:784)
[junit4:junit4]    > 	at org.apache.solr.client.solrj.impl.HttpSolrServer.request(HttpSolrServer.java:353)
[junit4:junit4]    > 	... 47 more
[junit4:junit4]   2> 3022461 T1496 oas.SolrTestCaseJ4.deleteCore ###deleteCore
[junit4:junit4]   2> NOTE: test params are: codec=Lucene42: {n_f1=PostingsFormat(name=MockSep), foo_b=MockVariableIntBlock(baseBlockSize=120), cat=PostingsFormat(name=SimpleText), foo_d=PostingsFormat(name=Direct), foo_f=MockVariableIntBlock(baseBlockSize=120), n_tl1=PostingsFormat(name=MockSep), n_d1=PostingsFormat(name=SimpleText), rnd_b=PostingsFormat(name=Direct), intDefault=PostingsFormat(name=SimpleText), n_td1=PostingsFormat(name=MockSep), timestamp=PostingsFormat(name=SimpleText), id=PostingsFormat(name=Direct), range_facet_sl=MockVariableIntBlock(baseBlockSize=120), range_facet_si=PostingsFormat(name=MockSep), oddField_s=MockVariableIntBlock(baseBlockSize=120), sequence_i=MockVariableIntBlock(baseBlockSize=120), name=PostingsFormat(name=Direct), foo_i=PostingsFormat(name=MockSep), regex_dup_B_s=PostingsFormat(name=SimpleText), multiDefault=PostingsFormat(name=MockSep), n_tf1=PostingsFormat(name=SimpleText), n_dt1=PostingsFormat(name=MockSep), genre_s=MockVariableIntBlock(baseBlockSize=120), author_t=PostingsFormat(name=MockSep), n_ti1=PostingsFormat(name=Direct), range_facet_l=PostingsFormat(name=SimpleText), text=MockVariableIntBlock(baseBlockSize=120), _version_=PostingsFormat(name=SimpleText), val_i=PostingsFormat(name=Direct), SubjectTerms_mfacet=PostingsFormat(name=SimpleText), series_t=PostingsFormat(name=MockSep), a_t=PostingsFormat(name=SimpleText), n_tdt1=PostingsFormat(name=SimpleText), regex_dup_A_s=MockVariableIntBlock(baseBlockSize=120), price=MockVariableIntBlock(baseBlockSize=120), other_tl1=PostingsFormat(name=SimpleText), n_l1=PostingsFormat(name=SimpleText), a_si=PostingsFormat(name=MockSep), inStock=MockVariableIntBlock(baseBlockSize=120)}, docValues:{}, sim=RandomSimilarityProvider(queryNorm=false,coord=yes): {}, locale=ar_LY, timezone=Africa/Nouakchott
[junit4:junit4]   2> NOTE: FreeBSD 9.0-RELEASE amd64/Oracle Corporation 1.7.0_09 (64-bit)/cpus=16,threads=1,free=356809592,total=536870912
[junit4:junit4]   2> NOTE: All tests run in this JVM: [TestUtils, DirectUpdateHandlerTest, DisMaxRequestHandlerTest, LukeRequestHandlerTest, IndexSchemaRuntimeFieldTest, SignatureUpdateProcessorFactoryTest, UpdateParamsTest, TestSurroundQueryParser, HardAutoCommitTest, TestSolrJ, TestBinaryField, TestUpdate, TestSolrDeletionPolicy1, TestPropInjectDefaults, AnalysisAfterCoreReloadTest, DebugComponentTest, StatelessScriptUpdateProcessorFactoryTest, MultiTermTest, TestSolrXMLSerializer, QueryEqualityTest, FullSolrCloudDistribCmdsTest, TestLRUCache, TestSolr4Spatial, XmlUpdateRequestHandlerTest, TestDocSet, TestMultiCoreConfBootstrap, XsltUpdateRequestHandlerTest, TestPostingsSolrHighlighter, TestArbitraryIndexDir, CollectionsAPIDistributedZkTest, SuggesterTest, TestRealTimeGet, PingRequestHandlerTest, TimeZoneUtilsTest, ExternalFileFieldSortTest, DOMUtilTest, TestAnalyzedSuggestions, SolrIndexSplitterTest, TestStressLucene, BadIndexSchemaTest, PrimUtilsTest, ConvertedLegacyTest, SpellingQueryConverterTest, TestRTGBase, SolrCoreTest, TestSolrDeletionPolicy2, BasicZkTest, TestReload, TestOmitPositions, TestTrie, FileUtilsTest, EchoParamsTest, TestDFRSimilarityFactory, TestReversedWildcardFilterFactory, TestDistributedGrouping, PolyFieldTest, IndexSchemaTest, QueryParsingTest, TestReplicationHandler, TermVectorComponentTest, OutputWriterTest, BasicDistributedZkTest]
[junit4:junit4] Completed on J1 in 3022.83s, 1 test, 1 error <<< FAILURES!

[...truncated 11 lines...]
BUILD FAILED
/usr/home/hudson/hudson-slave/workspace/Lucene-Solr-Tests-trunk-java7/build.xml:381: The following error occurred while executing this line:
/usr/home/hudson/hudson-slave/workspace/Lucene-Solr-Tests-trunk-java7/build.xml:361: The following error occurred while executing this line:
/usr/home/hudson/hudson-slave/workspace/Lucene-Solr-Tests-trunk-java7/build.xml:39: The following error occurred while executing this line:
/usr/home/hudson/hudson-slave/workspace/Lucene-Solr-Tests-trunk-java7/solr/build.xml:183: The following error occurred while executing this line:
/usr/home/hudson/hudson-slave/workspace/Lucene-Solr-Tests-trunk-java7/solr/common-build.xml:447: The following error occurred while executing this line:
/usr/home/hudson/hudson-slave/workspace/Lucene-Solr-Tests-trunk-java7/lucene/common-build.xml:1202: The following error occurred while executing this line:
/usr/home/hudson/hudson-slave/workspace/Lucene-Solr-Tests-trunk-java7/lucene/common-build.xml:865: There were test failures: 250 suites, 1040 tests, 1 error, 1 failure, 22 ignored (4 assumptions)

Total time: 81 minutes 31 seconds
Build step 'Invoke Ant' marked build as failure
Archiving artifacts
Recording test results
Email was triggered for: Failure
Sending email for trigger: Failure



Mime
View raw message