lucene-dev mailing list archives

Site index · List index
Message view « Date » · « Thread »
Top « Date » · « Thread »
From Apache Jenkins Server <jenk...@builds.apache.org>
Subject [JENKINS] Lucene-Solr-Tests-trunk-java7 - Build # 3731 - Still Failing
Date Wed, 13 Feb 2013 15:26:26 GMT
Build: https://builds.apache.org/job/Lucene-Solr-Tests-trunk-java7/3731/

2 tests failed.
REGRESSION:  org.apache.solr.cloud.ChaosMonkeySafeLeaderTest.testDistribSearch

Error Message:
document count mismatch.  control=733 sum(shards)=734 cloudClient=734

Stack Trace:
java.lang.AssertionError: document count mismatch.  control=733 sum(shards)=734 cloudClient=734
	at __randomizedtesting.SeedInfo.seed([7DAB9B598DAD6F5F:FC4D1541FAF20F63]:0)
	at org.junit.Assert.fail(Assert.java:93)
	at org.apache.solr.cloud.AbstractFullDistribZkTestBase.checkShardConsistency(AbstractFullDistribZkTestBase.java:1042)
	at org.apache.solr.cloud.ChaosMonkeySafeLeaderTest.doTest(ChaosMonkeySafeLeaderTest.java:131)
	at org.apache.solr.BaseDistributedSearchTestCase.testDistribSearch(BaseDistributedSearchTestCase.java:794)
	at sun.reflect.NativeMethodAccessorImpl.invoke0(Native Method)
	at sun.reflect.NativeMethodAccessorImpl.invoke(NativeMethodAccessorImpl.java:57)
	at sun.reflect.DelegatingMethodAccessorImpl.invoke(DelegatingMethodAccessorImpl.java:43)
	at java.lang.reflect.Method.invoke(Method.java:601)
	at com.carrotsearch.randomizedtesting.RandomizedRunner.invoke(RandomizedRunner.java:1559)
	at com.carrotsearch.randomizedtesting.RandomizedRunner.access$600(RandomizedRunner.java:79)
	at com.carrotsearch.randomizedtesting.RandomizedRunner$6.evaluate(RandomizedRunner.java:737)
	at com.carrotsearch.randomizedtesting.RandomizedRunner$7.evaluate(RandomizedRunner.java:773)
	at com.carrotsearch.randomizedtesting.RandomizedRunner$8.evaluate(RandomizedRunner.java:787)
	at com.carrotsearch.randomizedtesting.rules.SystemPropertiesRestoreRule$1.evaluate(SystemPropertiesRestoreRule.java:53)
	at org.apache.lucene.util.TestRuleSetupTeardownChained$1.evaluate(TestRuleSetupTeardownChained.java:50)
	at org.apache.lucene.util.TestRuleFieldCacheSanity$1.evaluate(TestRuleFieldCacheSanity.java:51)
	at org.apache.lucene.util.AbstractBeforeAfterRule$1.evaluate(AbstractBeforeAfterRule.java:46)
	at com.carrotsearch.randomizedtesting.rules.SystemPropertiesInvariantRule$1.evaluate(SystemPropertiesInvariantRule.java:55)
	at org.apache.lucene.util.TestRuleThreadAndTestName$1.evaluate(TestRuleThreadAndTestName.java:49)
	at org.apache.lucene.util.TestRuleIgnoreAfterMaxFailures$1.evaluate(TestRuleIgnoreAfterMaxFailures.java:70)
	at org.apache.lucene.util.TestRuleMarkFailure$1.evaluate(TestRuleMarkFailure.java:48)
	at com.carrotsearch.randomizedtesting.rules.StatementAdapter.evaluate(StatementAdapter.java:36)
	at com.carrotsearch.randomizedtesting.ThreadLeakControl$StatementRunner.run(ThreadLeakControl.java:358)
	at com.carrotsearch.randomizedtesting.ThreadLeakControl.forkTimeoutingTask(ThreadLeakControl.java:782)
	at com.carrotsearch.randomizedtesting.ThreadLeakControl$3.evaluate(ThreadLeakControl.java:442)
	at com.carrotsearch.randomizedtesting.RandomizedRunner.runSingleTest(RandomizedRunner.java:746)
	at com.carrotsearch.randomizedtesting.RandomizedRunner$3.evaluate(RandomizedRunner.java:648)
	at com.carrotsearch.randomizedtesting.RandomizedRunner$4.evaluate(RandomizedRunner.java:682)
	at com.carrotsearch.randomizedtesting.RandomizedRunner$5.evaluate(RandomizedRunner.java:693)
	at com.carrotsearch.randomizedtesting.rules.StatementAdapter.evaluate(StatementAdapter.java:36)
	at com.carrotsearch.randomizedtesting.rules.SystemPropertiesRestoreRule$1.evaluate(SystemPropertiesRestoreRule.java:53)
	at org.apache.lucene.util.AbstractBeforeAfterRule$1.evaluate(AbstractBeforeAfterRule.java:46)
	at org.apache.lucene.util.TestRuleStoreClassName$1.evaluate(TestRuleStoreClassName.java:42)
	at com.carrotsearch.randomizedtesting.rules.SystemPropertiesInvariantRule$1.evaluate(SystemPropertiesInvariantRule.java:55)
	at com.carrotsearch.randomizedtesting.rules.NoShadowingOrOverridesOnMethodsRule$1.evaluate(NoShadowingOrOverridesOnMethodsRule.java:39)
	at com.carrotsearch.randomizedtesting.rules.NoShadowingOrOverridesOnMethodsRule$1.evaluate(NoShadowingOrOverridesOnMethodsRule.java:39)
	at com.carrotsearch.randomizedtesting.rules.StatementAdapter.evaluate(StatementAdapter.java:36)
	at org.apache.lucene.util.TestRuleAssertionsRequired$1.evaluate(TestRuleAssertionsRequired.java:43)
	at org.apache.lucene.util.TestRuleMarkFailure$1.evaluate(TestRuleMarkFailure.java:48)
	at org.apache.lucene.util.TestRuleIgnoreAfterMaxFailures$1.evaluate(TestRuleIgnoreAfterMaxFailures.java:70)
	at org.apache.lucene.util.TestRuleIgnoreTestSuites$1.evaluate(TestRuleIgnoreTestSuites.java:55)
	at com.carrotsearch.randomizedtesting.rules.StatementAdapter.evaluate(StatementAdapter.java:36)
	at com.carrotsearch.randomizedtesting.ThreadLeakControl$StatementRunner.run(ThreadLeakControl.java:358)
	at java.lang.Thread.run(Thread.java:722)


FAILED:  org.apache.solr.cloud.SyncSliceTest.testDistribSearch

Error Message:
Test Setup Failure: shard1 should have just been set up to be inconsistent - but it's still consistent. Leader:http://127.0.0.1:10309/collection1skip list:[org.apache.solr.cloud.AbstractFullDistribZkTestBase$CloudJettyRunner@9aef17cd, org.apache.solr.cloud.AbstractFullDistribZkTestBase$CloudJettyRunner@1c5ce487]

Stack Trace:
java.lang.AssertionError: Test Setup Failure: shard1 should have just been set up to be inconsistent - but it's still consistent. Leader:http://127.0.0.1:10309/collection1skip list:[org.apache.solr.cloud.AbstractFullDistribZkTestBase$CloudJettyRunner@9aef17cd, org.apache.solr.cloud.AbstractFullDistribZkTestBase$CloudJettyRunner@1c5ce487]
	at __randomizedtesting.SeedInfo.seed([7DAB9B598DAD6F5F:FC4D1541FAF20F63]:0)
	at org.junit.Assert.fail(Assert.java:93)
	at org.junit.Assert.assertTrue(Assert.java:43)
	at org.junit.Assert.assertNotNull(Assert.java:526)
	at org.apache.solr.cloud.SyncSliceTest.doTest(SyncSliceTest.java:216)
	at org.apache.solr.BaseDistributedSearchTestCase.testDistribSearch(BaseDistributedSearchTestCase.java:794)
	at sun.reflect.NativeMethodAccessorImpl.invoke0(Native Method)
	at sun.reflect.NativeMethodAccessorImpl.invoke(NativeMethodAccessorImpl.java:57)
	at sun.reflect.DelegatingMethodAccessorImpl.invoke(DelegatingMethodAccessorImpl.java:43)
	at java.lang.reflect.Method.invoke(Method.java:601)
	at com.carrotsearch.randomizedtesting.RandomizedRunner.invoke(RandomizedRunner.java:1559)
	at com.carrotsearch.randomizedtesting.RandomizedRunner.access$600(RandomizedRunner.java:79)
	at com.carrotsearch.randomizedtesting.RandomizedRunner$6.evaluate(RandomizedRunner.java:737)
	at com.carrotsearch.randomizedtesting.RandomizedRunner$7.evaluate(RandomizedRunner.java:773)
	at com.carrotsearch.randomizedtesting.RandomizedRunner$8.evaluate(RandomizedRunner.java:787)
	at com.carrotsearch.randomizedtesting.rules.SystemPropertiesRestoreRule$1.evaluate(SystemPropertiesRestoreRule.java:53)
	at org.apache.lucene.util.TestRuleSetupTeardownChained$1.evaluate(TestRuleSetupTeardownChained.java:50)
	at org.apache.lucene.util.TestRuleFieldCacheSanity$1.evaluate(TestRuleFieldCacheSanity.java:51)
	at org.apache.lucene.util.AbstractBeforeAfterRule$1.evaluate(AbstractBeforeAfterRule.java:46)
	at com.carrotsearch.randomizedtesting.rules.SystemPropertiesInvariantRule$1.evaluate(SystemPropertiesInvariantRule.java:55)
	at org.apache.lucene.util.TestRuleThreadAndTestName$1.evaluate(TestRuleThreadAndTestName.java:49)
	at org.apache.lucene.util.TestRuleIgnoreAfterMaxFailures$1.evaluate(TestRuleIgnoreAfterMaxFailures.java:70)
	at org.apache.lucene.util.TestRuleMarkFailure$1.evaluate(TestRuleMarkFailure.java:48)
	at com.carrotsearch.randomizedtesting.rules.StatementAdapter.evaluate(StatementAdapter.java:36)
	at com.carrotsearch.randomizedtesting.ThreadLeakControl$StatementRunner.run(ThreadLeakControl.java:358)
	at com.carrotsearch.randomizedtesting.ThreadLeakControl.forkTimeoutingTask(ThreadLeakControl.java:782)
	at com.carrotsearch.randomizedtesting.ThreadLeakControl$3.evaluate(ThreadLeakControl.java:442)
	at com.carrotsearch.randomizedtesting.RandomizedRunner.runSingleTest(RandomizedRunner.java:746)
	at com.carrotsearch.randomizedtesting.RandomizedRunner$3.evaluate(RandomizedRunner.java:648)
	at com.carrotsearch.randomizedtesting.RandomizedRunner$4.evaluate(RandomizedRunner.java:682)
	at com.carrotsearch.randomizedtesting.RandomizedRunner$5.evaluate(RandomizedRunner.java:693)
	at com.carrotsearch.randomizedtesting.rules.StatementAdapter.evaluate(StatementAdapter.java:36)
	at com.carrotsearch.randomizedtesting.rules.SystemPropertiesRestoreRule$1.evaluate(SystemPropertiesRestoreRule.java:53)
	at org.apache.lucene.util.AbstractBeforeAfterRule$1.evaluate(AbstractBeforeAfterRule.java:46)
	at org.apache.lucene.util.TestRuleStoreClassName$1.evaluate(TestRuleStoreClassName.java:42)
	at com.carrotsearch.randomizedtesting.rules.SystemPropertiesInvariantRule$1.evaluate(SystemPropertiesInvariantRule.java:55)
	at com.carrotsearch.randomizedtesting.rules.NoShadowingOrOverridesOnMethodsRule$1.evaluate(NoShadowingOrOverridesOnMethodsRule.java:39)
	at com.carrotsearch.randomizedtesting.rules.NoShadowingOrOverridesOnMethodsRule$1.evaluate(NoShadowingOrOverridesOnMethodsRule.java:39)
	at com.carrotsearch.randomizedtesting.rules.StatementAdapter.evaluate(StatementAdapter.java:36)
	at org.apache.lucene.util.TestRuleAssertionsRequired$1.evaluate(TestRuleAssertionsRequired.java:43)
	at org.apache.lucene.util.TestRuleMarkFailure$1.evaluate(TestRuleMarkFailure.java:48)
	at org.apache.lucene.util.TestRuleIgnoreAfterMaxFailures$1.evaluate(TestRuleIgnoreAfterMaxFailures.java:70)
	at org.apache.lucene.util.TestRuleIgnoreTestSuites$1.evaluate(TestRuleIgnoreTestSuites.java:55)
	at com.carrotsearch.randomizedtesting.rules.StatementAdapter.evaluate(StatementAdapter.java:36)
	at com.carrotsearch.randomizedtesting.ThreadLeakControl$StatementRunner.run(ThreadLeakControl.java:358)
	at java.lang.Thread.run(Thread.java:722)




Build Log:
[...truncated 9304 lines...]
[junit4:junit4] Suite: org.apache.solr.cloud.ChaosMonkeySafeLeaderTest
[junit4:junit4]   2> 0 T536 oas.BaseDistributedSearchTestCase.initHostContext Setting hostContext system property: /
[junit4:junit4]   2> 5 T536 oas.SolrTestCaseJ4.setUp ###Starting testDistribSearch
[junit4:junit4]   2> Creating dataDir: /usr/home/hudson/hudson-slave/workspace/Lucene-Solr-Tests-trunk-java7/solr/build/solr-core/test/J0/./solrtest-ChaosMonkeySafeLeaderTest-1360765973520
[junit4:junit4]   2> 6 T536 oasc.ZkTestServer.run STARTING ZK TEST SERVER
[junit4:junit4]   2> 6 T537 oasc.ZkTestServer$ZKServerMain.runFromConfig Starting server
[junit4:junit4]   2> 10 T537 oazs.ZooKeeperServer.setTickTime tickTime set to 1000
[junit4:junit4]   2> 11 T537 oazs.ZooKeeperServer.setMinSessionTimeout minSessionTimeout set to -1
[junit4:junit4]   2> 11 T537 oazs.ZooKeeperServer.setMaxSessionTimeout maxSessionTimeout set to -1
[junit4:junit4]   2> 12 T537 oazs.NIOServerCnxnFactory.configure binding to port 0.0.0.0/0.0.0.0:0
[junit4:junit4]   2> 13 T537 oazsp.FileTxnSnapLog.save Snapshotting: 0x0 to /usr/home/hudson/hudson-slave/workspace/Lucene-Solr-Tests-trunk-java7/solr/build/solr-core/test/J0/./org.apache.solr.cloud.ChaosMonkeySafeLeaderTest-1360765973520/zookeeper/server1/data/version-2/snapshot.0
[junit4:junit4]   2> 107 T536 oasc.ZkTestServer.run start zk server on port:47126
[junit4:junit4]   2> 107 T536 oaz.ZooKeeper.<init> Initiating client connection, connectString=127.0.0.1:47126 sessionTimeout=10000 watcher=org.apache.solr.common.cloud.ConnectionManager@7b33f19f
[junit4:junit4]   2> 108 T536 oascc.ConnectionManager.waitForConnected Waiting for client to connect to ZooKeeper
[junit4:junit4]   2> 109 T542 oaz.ClientCnxn$SendThread.logStartConnect Opening socket connection to server localhost/127.0.0.1:47126. Will not attempt to authenticate using SASL (access denied ("javax.security.auth.AuthPermission" "getLoginConfiguration"))
[junit4:junit4]   2> 109 T542 oaz.ClientCnxn$SendThread.primeConnection Socket connection established to localhost/127.0.0.1:47126, initiating session
[junit4:junit4]   2> 109 T538 oazs.NIOServerCnxnFactory.run Accepted socket connection from /140.211.11.196:53245
[junit4:junit4]   2> 110 T538 oazs.ZooKeeperServer.processConnectRequest Client attempting to establish new session at /140.211.11.196:53245
[junit4:junit4]   2> 110 T540 oazsp.FileTxnLog.append Creating new log file: log.1
[junit4:junit4]   2> 114 T540 oazs.ZooKeeperServer.finishSessionInit Established session 0x13cd3f8f4190000 with negotiated timeout 10000 for client /140.211.11.196:53245
[junit4:junit4]   2> 114 T542 oaz.ClientCnxn$SendThread.onConnected Session establishment complete on server localhost/127.0.0.1:47126, sessionid = 0x13cd3f8f4190000, negotiated timeout = 10000
[junit4:junit4]   2> 114 T543 oascc.ConnectionManager.process Watcher org.apache.solr.common.cloud.ConnectionManager@7b33f19f name:ZooKeeperConnection Watcher:127.0.0.1:47126 got event WatchedEvent state:SyncConnected type:None path:null path:null type:None
[junit4:junit4]   2> 114 T536 oascc.ConnectionManager.waitForConnected Client is connected to ZooKeeper
[junit4:junit4]   2> 115 T536 oascc.SolrZkClient.makePath makePath: /solr
[junit4:junit4]   2> 118 T541 oazs.PrepRequestProcessor.pRequest2Txn Processed session termination for sessionid: 0x13cd3f8f4190000
[junit4:junit4]   2> 119 T543 oaz.ClientCnxn$EventThread.run EventThread shut down
[junit4:junit4]   2> 119 T536 oaz.ZooKeeper.close Session: 0x13cd3f8f4190000 closed
[junit4:junit4]   2> 119 T538 oazs.NIOServerCnxn.closeSock Closed socket connection for client /140.211.11.196:53245 which had sessionid 0x13cd3f8f4190000
[junit4:junit4]   2> 119 T536 oaz.ZooKeeper.<init> Initiating client connection, connectString=127.0.0.1:47126/solr sessionTimeout=10000 watcher=org.apache.solr.common.cloud.ConnectionManager@b5d2b0b
[junit4:junit4]   2> 120 T536 oascc.ConnectionManager.waitForConnected Waiting for client to connect to ZooKeeper
[junit4:junit4]   2> 121 T544 oaz.ClientCnxn$SendThread.logStartConnect Opening socket connection to server localhost/127.0.0.1:47126. Will not attempt to authenticate using SASL (access denied ("javax.security.auth.AuthPermission" "getLoginConfiguration"))
[junit4:junit4]   2> 121 T544 oaz.ClientCnxn$SendThread.primeConnection Socket connection established to localhost/127.0.0.1:47126, initiating session
[junit4:junit4]   2> 121 T538 oazs.NIOServerCnxnFactory.run Accepted socket connection from /140.211.11.196:58279
[junit4:junit4]   2> 121 T538 oazs.ZooKeeperServer.processConnectRequest Client attempting to establish new session at /140.211.11.196:58279
[junit4:junit4]   2> 128 T540 oazs.ZooKeeperServer.finishSessionInit Established session 0x13cd3f8f4190001 with negotiated timeout 10000 for client /140.211.11.196:58279
[junit4:junit4]   2> 128 T544 oaz.ClientCnxn$SendThread.onConnected Session establishment complete on server localhost/127.0.0.1:47126, sessionid = 0x13cd3f8f4190001, negotiated timeout = 10000
[junit4:junit4]   2> 128 T545 oascc.ConnectionManager.process Watcher org.apache.solr.common.cloud.ConnectionManager@b5d2b0b name:ZooKeeperConnection Watcher:127.0.0.1:47126/solr got event WatchedEvent state:SyncConnected type:None path:null path:null type:None
[junit4:junit4]   2> 129 T536 oascc.ConnectionManager.waitForConnected Client is connected to ZooKeeper
[junit4:junit4]   2> 129 T536 oascc.SolrZkClient.makePath makePath: /collections/collection1
[junit4:junit4]   2> 133 T536 oascc.SolrZkClient.makePath makePath: /collections/collection1/shards
[junit4:junit4]   2> 143 T536 oascc.SolrZkClient.makePath makePath: /collections/control_collection
[junit4:junit4]   2> 154 T536 oascc.SolrZkClient.makePath makePath: /collections/control_collection/shards
[junit4:junit4]   2> 158 T536 oasc.AbstractZkTestCase.putConfig put /usr/home/hudson/hudson-slave/workspace/Lucene-Solr-Tests-trunk-java7/solr/build/solr-core/test-files/solr/collection1/conf/solrconfig.xml to /configs/conf1/solrconfig.xml
[junit4:junit4]   2> 159 T536 oascc.SolrZkClient.makePath makePath: /configs/conf1/solrconfig.xml
[junit4:junit4]   2> 180 T536 oasc.AbstractZkTestCase.putConfig put /usr/home/hudson/hudson-slave/workspace/Lucene-Solr-Tests-trunk-java7/solr/build/solr-core/test-files/solr/collection1/conf/schema.xml to /configs/conf1/schema.xml
[junit4:junit4]   2> 182 T536 oascc.SolrZkClient.makePath makePath: /configs/conf1/schema.xml
[junit4:junit4]   2> 286 T536 oasc.AbstractZkTestCase.putConfig put /usr/home/hudson/hudson-slave/workspace/Lucene-Solr-Tests-trunk-java7/solr/build/solr-core/test-files/solr/collection1/conf/stopwords.txt to /configs/conf1/stopwords.txt
[junit4:junit4]   2> 287 T536 oascc.SolrZkClient.makePath makePath: /configs/conf1/stopwords.txt
[junit4:junit4]   2> 291 T536 oasc.AbstractZkTestCase.putConfig put /usr/home/hudson/hudson-slave/workspace/Lucene-Solr-Tests-trunk-java7/solr/build/solr-core/test-files/solr/collection1/conf/protwords.txt to /configs/conf1/protwords.txt
[junit4:junit4]   2> 292 T536 oascc.SolrZkClient.makePath makePath: /configs/conf1/protwords.txt
[junit4:junit4]   2> 296 T536 oasc.AbstractZkTestCase.putConfig put /usr/home/hudson/hudson-slave/workspace/Lucene-Solr-Tests-trunk-java7/solr/build/solr-core/test-files/solr/collection1/conf/currency.xml to /configs/conf1/currency.xml
[junit4:junit4]   2> 297 T536 oascc.SolrZkClient.makePath makePath: /configs/conf1/currency.xml
[junit4:junit4]   2> 301 T536 oasc.AbstractZkTestCase.putConfig put /usr/home/hudson/hudson-slave/workspace/Lucene-Solr-Tests-trunk-java7/solr/build/solr-core/test-files/solr/collection1/conf/open-exchange-rates.json to /configs/conf1/open-exchange-rates.json
[junit4:junit4]   2> 301 T536 oascc.SolrZkClient.makePath makePath: /configs/conf1/open-exchange-rates.json
[junit4:junit4]   2> 305 T536 oasc.AbstractZkTestCase.putConfig put /usr/home/hudson/hudson-slave/workspace/Lucene-Solr-Tests-trunk-java7/solr/build/solr-core/test-files/solr/collection1/conf/mapping-ISOLatin1Accent.txt to /configs/conf1/mapping-ISOLatin1Accent.txt
[junit4:junit4]   2> 306 T536 oascc.SolrZkClient.makePath makePath: /configs/conf1/mapping-ISOLatin1Accent.txt
[junit4:junit4]   2> 328 T536 oasc.AbstractZkTestCase.putConfig put /usr/home/hudson/hudson-slave/workspace/Lucene-Solr-Tests-trunk-java7/solr/build/solr-core/test-files/solr/collection1/conf/old_synonyms.txt to /configs/conf1/old_synonyms.txt
[junit4:junit4]   2> 329 T536 oascc.SolrZkClient.makePath makePath: /configs/conf1/old_synonyms.txt
[junit4:junit4]   2> 333 T536 oasc.AbstractZkTestCase.putConfig put /usr/home/hudson/hudson-slave/workspace/Lucene-Solr-Tests-trunk-java7/solr/build/solr-core/test-files/solr/collection1/conf/synonyms.txt to /configs/conf1/synonyms.txt
[junit4:junit4]   2> 334 T536 oascc.SolrZkClient.makePath makePath: /configs/conf1/synonyms.txt
[junit4:junit4]   2> 338 T541 oazs.PrepRequestProcessor.pRequest2Txn Processed session termination for sessionid: 0x13cd3f8f4190001
[junit4:junit4]   2> 339 T545 oaz.ClientCnxn$EventThread.run EventThread shut down
[junit4:junit4]   2> 339 T538 oazs.NIOServerCnxn.closeSock Closed socket connection for client /140.211.11.196:58279 which had sessionid 0x13cd3f8f4190001
[junit4:junit4]   2> 339 T536 oaz.ZooKeeper.close Session: 0x13cd3f8f4190001 closed
[junit4:junit4]   2> 532 T536 oejs.Server.doStart jetty-8.1.8.v20121106
[junit4:junit4]   2> 539 T536 oejs.AbstractConnector.doStart Started SocketConnector@127.0.0.1:43329
[junit4:junit4]   2> 540 T536 oass.SolrDispatchFilter.init SolrDispatchFilter.init()
[junit4:junit4]   2> 540 T536 oasc.SolrResourceLoader.locateSolrHome JNDI not configured for solr (NoInitialContextEx)
[junit4:junit4]   2> 541 T536 oasc.SolrResourceLoader.locateSolrHome using system property solr.solr.home: /usr/home/hudson/hudson-slave/workspace/Lucene-Solr-Tests-trunk-java7/solr/build/solr-core/test/J0/./org.apache.solr.cloud.ChaosMonkeySafeLeaderTest-controljetty-1360765973855
[junit4:junit4]   2> 541 T536 oasc.CoreContainer$Initializer.initialize looking for solr.xml: /usr/home/hudson/hudson-slave/workspace/Lucene-Solr-Tests-trunk-java7/solr/build/solr-core/test/J0/./org.apache.solr.cloud.ChaosMonkeySafeLeaderTest-controljetty-1360765973855/solr.xml
[junit4:junit4]   2> 542 T536 oasc.CoreContainer.<init> New CoreContainer 815740391
[junit4:junit4]   2> 542 T536 oasc.CoreContainer.load Loading CoreContainer using Solr Home: '/usr/home/hudson/hudson-slave/workspace/Lucene-Solr-Tests-trunk-java7/solr/build/solr-core/test/J0/./org.apache.solr.cloud.ChaosMonkeySafeLeaderTest-controljetty-1360765973855/'
[junit4:junit4]   2> 543 T536 oasc.SolrResourceLoader.<init> new SolrResourceLoader for directory: '/usr/home/hudson/hudson-slave/workspace/Lucene-Solr-Tests-trunk-java7/solr/build/solr-core/test/J0/./org.apache.solr.cloud.ChaosMonkeySafeLeaderTest-controljetty-1360765973855/'
[junit4:junit4]   2> 605 T536 oashc.HttpShardHandlerFactory.getParameter Setting socketTimeout to: 60000
[junit4:junit4]   2> 605 T536 oashc.HttpShardHandlerFactory.getParameter Setting urlScheme to: http://
[junit4:junit4]   2> 606 T536 oashc.HttpShardHandlerFactory.getParameter Setting connTimeout to: 15000
[junit4:junit4]   2> 606 T536 oashc.HttpShardHandlerFactory.getParameter Setting maxConnectionsPerHost to: 20
[junit4:junit4]   2> 607 T536 oashc.HttpShardHandlerFactory.getParameter Setting corePoolSize to: 0
[junit4:junit4]   2> 607 T536 oashc.HttpShardHandlerFactory.getParameter Setting maximumPoolSize to: 2147483647
[junit4:junit4]   2> 607 T536 oashc.HttpShardHandlerFactory.getParameter Setting maxThreadIdleTime to: 5
[junit4:junit4]   2> 608 T536 oashc.HttpShardHandlerFactory.getParameter Setting sizeOfQueue to: -1
[junit4:junit4]   2> 608 T536 oashc.HttpShardHandlerFactory.getParameter Setting fairnessPolicy to: false
[junit4:junit4]   2> 609 T536 oascsi.HttpClientUtil.createClient Creating new http client, config:maxConnectionsPerHost=20&maxConnections=10000&socketTimeout=60000&connTimeout=15000&retry=false
[junit4:junit4]   2> 634 T536 oasc.CoreContainer.load Registering Log Listener
[junit4:junit4]   2> 653 T536 oasc.CoreContainer.initZooKeeper Zookeeper client=127.0.0.1:47126/solr
[junit4:junit4]   2> 654 T536 oasc.ZkController.checkChrootPath zkHost includes chroot
[junit4:junit4]   2> 655 T536 oaz.ZooKeeper.<init> Initiating client connection, connectString=127.0.0.1:47126 sessionTimeout=60000 watcher=org.apache.solr.common.cloud.ConnectionManager@37060d80
[junit4:junit4]   2> 656 T536 oascc.ConnectionManager.waitForConnected Waiting for client to connect to ZooKeeper
[junit4:junit4]   2> 656 T555 oaz.ClientCnxn$SendThread.logStartConnect Opening socket connection to server localhost/127.0.0.1:47126. Will not attempt to authenticate using SASL (access denied ("javax.security.auth.AuthPermission" "getLoginConfiguration"))
[junit4:junit4]   2> 657 T555 oaz.ClientCnxn$SendThread.primeConnection Socket connection established to localhost/127.0.0.1:47126, initiating session
[junit4:junit4]   2> 657 T538 oazs.NIOServerCnxnFactory.run Accepted socket connection from /140.211.11.196:41280
[junit4:junit4]   2> 658 T538 oazs.ZooKeeperServer.processConnectRequest Client attempting to establish new session at /140.211.11.196:41280
[junit4:junit4]   2> 660 T540 oazs.ZooKeeperServer.finishSessionInit Established session 0x13cd3f8f4190002 with negotiated timeout 20000 for client /140.211.11.196:41280
[junit4:junit4]   2> 660 T555 oaz.ClientCnxn$SendThread.onConnected Session establishment complete on server localhost/127.0.0.1:47126, sessionid = 0x13cd3f8f4190002, negotiated timeout = 20000
[junit4:junit4]   2> 660 T556 oascc.ConnectionManager.process Watcher org.apache.solr.common.cloud.ConnectionManager@37060d80 name:ZooKeeperConnection Watcher:127.0.0.1:47126 got event WatchedEvent state:SyncConnected type:None path:null path:null type:None
[junit4:junit4]   2> 660 T536 oascc.ConnectionManager.waitForConnected Client is connected to ZooKeeper
[junit4:junit4]   2> 662 T541 oazs.PrepRequestProcessor.pRequest2Txn Processed session termination for sessionid: 0x13cd3f8f4190002
[junit4:junit4]   2> 663 T556 oaz.ClientCnxn$EventThread.run EventThread shut down
[junit4:junit4]   2> 663 T536 oaz.ZooKeeper.close Session: 0x13cd3f8f4190002 closed
[junit4:junit4]   2> 663 T538 oazs.NIOServerCnxn.closeSock Closed socket connection for client /140.211.11.196:41280 which had sessionid 0x13cd3f8f4190002
[junit4:junit4]   2> 664 T536 oascsi.HttpClientUtil.createClient Creating new http client, config:maxConnections=500&maxConnectionsPerHost=16&socketTimeout=60000&connTimeout=15000
[junit4:junit4]   2> 678 T536 oaz.ZooKeeper.<init> Initiating client connection, connectString=127.0.0.1:47126/solr sessionTimeout=30000 watcher=org.apache.solr.common.cloud.ConnectionManager@7b40d562
[junit4:junit4]   2> 679 T536 oascc.ConnectionManager.waitForConnected Waiting for client to connect to ZooKeeper
[junit4:junit4]   2> 679 T557 oaz.ClientCnxn$SendThread.logStartConnect Opening socket connection to server localhost/127.0.0.1:47126. Will not attempt to authenticate using SASL (access denied ("javax.security.auth.AuthPermission" "getLoginConfiguration"))
[junit4:junit4]   2> 680 T557 oaz.ClientCnxn$SendThread.primeConnection Socket connection established to localhost/127.0.0.1:47126, initiating session
[junit4:junit4]   2> 680 T538 oazs.NIOServerCnxnFactory.run Accepted socket connection from /140.211.11.196:56132
[junit4:junit4]   2> 681 T538 oazs.ZooKeeperServer.processConnectRequest Client attempting to establish new session at /140.211.11.196:56132
[junit4:junit4]   2> 682 T540 oazs.ZooKeeperServer.finishSessionInit Established session 0x13cd3f8f4190003 with negotiated timeout 20000 for client /140.211.11.196:56132
[junit4:junit4]   2> 682 T557 oaz.ClientCnxn$SendThread.onConnected Session establishment complete on server localhost/127.0.0.1:47126, sessionid = 0x13cd3f8f4190003, negotiated timeout = 20000
[junit4:junit4]   2> 683 T558 oascc.ConnectionManager.process Watcher org.apache.solr.common.cloud.ConnectionManager@7b40d562 name:ZooKeeperConnection Watcher:127.0.0.1:47126/solr got event WatchedEvent state:SyncConnected type:None path:null path:null type:None
[junit4:junit4]   2> 683 T536 oascc.ConnectionManager.waitForConnected Client is connected to ZooKeeper
[junit4:junit4]   2> 686 T541 oazs.PrepRequestProcessor.pRequest Got user-level KeeperException when processing sessionid:0x13cd3f8f4190003 type:create cxid:0x2 zxid:0x1a txntype:-1 reqpath:n/a Error Path:/solr/overseer Error:KeeperErrorCode = NodeExists for /solr/overseer
[junit4:junit4]   2> 694 T536 oascc.SolrZkClient.makePath makePath: /live_nodes
[junit4:junit4]   2> 696 T536 oasc.ZkController.createEphemeralLiveNode Register node as live in ZooKeeper:/live_nodes/127.0.0.1:43329_
[junit4:junit4]   2> 697 T541 oazs.PrepRequestProcessor.pRequest Got user-level KeeperException when processing sessionid:0x13cd3f8f4190003 type:delete cxid:0x8 zxid:0x1c txntype:-1 reqpath:n/a Error Path:/solr/live_nodes/127.0.0.1:43329_ Error:KeeperErrorCode = NoNode for /solr/live_nodes/127.0.0.1:43329_
[junit4:junit4]   2> 698 T536 oascc.SolrZkClient.makePath makePath: /live_nodes/127.0.0.1:43329_
[junit4:junit4]   2> 708 T536 oascc.SolrZkClient.makePath makePath: /overseer_elect/election
[junit4:junit4]   2> 720 T541 oazs.PrepRequestProcessor.pRequest Got user-level KeeperException when processing sessionid:0x13cd3f8f4190003 type:delete cxid:0x16 zxid:0x21 txntype:-1 reqpath:n/a Error Path:/solr/overseer_elect/leader Error:KeeperErrorCode = NoNode for /solr/overseer_elect/leader
[junit4:junit4]   2> 721 T536 oascc.SolrZkClient.makePath makePath: /overseer_elect/leader
[junit4:junit4]   2> 724 T536 oasc.Overseer.start Overseer (id=89179158841196547-127.0.0.1:43329_-n_0000000000) starting
[junit4:junit4]   2> 725 T541 oazs.PrepRequestProcessor.pRequest Got user-level KeeperException when processing sessionid:0x13cd3f8f4190003 type:create cxid:0x1b zxid:0x23 txntype:-1 reqpath:n/a Error Path:/solr/overseer Error:KeeperErrorCode = NodeExists for /solr/overseer
[junit4:junit4]   2> 726 T541 oazs.PrepRequestProcessor.pRequest Got user-level KeeperException when processing sessionid:0x13cd3f8f4190003 type:create cxid:0x1c zxid:0x24 txntype:-1 reqpath:n/a Error Path:/solr/overseer Error:KeeperErrorCode = NodeExists for /solr/overseer
[junit4:junit4]   2> 727 T541 oazs.PrepRequestProcessor.pRequest Got user-level KeeperException when processing sessionid:0x13cd3f8f4190003 type:create cxid:0x1d zxid:0x25 txntype:-1 reqpath:n/a Error Path:/solr/overseer Error:KeeperErrorCode = NodeExists for /solr/overseer
[junit4:junit4]   2> 728 T541 oazs.PrepRequestProcessor.pRequest Got user-level KeeperException when processing sessionid:0x13cd3f8f4190003 type:create cxid:0x1e zxid:0x26 txntype:-1 reqpath:n/a Error Path:/solr/overseer Error:KeeperErrorCode = NodeExists for /solr/overseer
[junit4:junit4]   2> 729 T560 oasc.OverseerCollectionProcessor.run Process current queue of collection creations
[junit4:junit4]   2> 730 T536 oascc.SolrZkClient.makePath makePath: /clusterstate.json
[junit4:junit4]   2> 733 T536 oascc.ZkStateReader.createClusterStateWatchersAndUpdate Updating cluster state from ZooKeeper... 
[junit4:junit4]   2> 735 T559 oasc.Overseer$ClusterStateUpdater.run Starting to work on the main queue
[junit4:junit4]   2> 750 T561 oasc.CoreContainer.create Creating SolrCore 'collection1' using instanceDir: /usr/home/hudson/hudson-slave/workspace/Lucene-Solr-Tests-trunk-java7/solr/build/solr-core/test/J0/./org.apache.solr.cloud.ChaosMonkeySafeLeaderTest-controljetty-1360765973855/collection1
[junit4:junit4]   2> 751 T561 oasc.ZkController.createCollectionZkNode Check for collection zkNode:control_collection
[junit4:junit4]   2> 752 T561 oasc.ZkController.createCollectionZkNode Collection zkNode exists
[junit4:junit4]   2> 752 T561 oasc.ZkController.readConfigName Load collection config from:/collections/control_collection
[junit4:junit4]   2> 754 T561 oasc.SolrResourceLoader.<init> new SolrResourceLoader for directory: '/usr/home/hudson/hudson-slave/workspace/Lucene-Solr-Tests-trunk-java7/solr/build/solr-core/test/J0/./org.apache.solr.cloud.ChaosMonkeySafeLeaderTest-controljetty-1360765973855/collection1/'
[junit4:junit4]   2> 755 T561 oasc.SolrResourceLoader.replaceClassLoader Adding 'file:/usr/home/hudson/hudson-slave/workspace/Lucene-Solr-Tests-trunk-java7/solr/build/solr-core/test/J0/org.apache.solr.cloud.ChaosMonkeySafeLeaderTest-controljetty-1360765973855/collection1/lib/classes/' to classloader
[junit4:junit4]   2> 756 T561 oasc.SolrResourceLoader.replaceClassLoader Adding 'file:/usr/home/hudson/hudson-slave/workspace/Lucene-Solr-Tests-trunk-java7/solr/build/solr-core/test/J0/org.apache.solr.cloud.ChaosMonkeySafeLeaderTest-controljetty-1360765973855/collection1/lib/README' to classloader
[junit4:junit4]   2> 815 T561 oasc.SolrConfig.<init> Using Lucene MatchVersion: LUCENE_50
[junit4:junit4]   2> 887 T561 oasc.SolrConfig.<init> Loaded SolrConfig: solrconfig.xml
[junit4:junit4]   2> 989 T561 oass.IndexSchema.readSchema Reading Solr Schema
[junit4:junit4]   2> 996 T561 oass.IndexSchema.readSchema Schema name=test
[junit4:junit4]   2> 1630 T561 oass.OpenExchangeRatesOrgProvider.init Initialized with rates=open-exchange-rates.json, refreshInterval=1440.
[junit4:junit4]   2> 1639 T561 oass.IndexSchema.readSchema default search field in schema is text
[junit4:junit4]   2> 1641 T561 oass.IndexSchema.readSchema unique key field: id
[junit4:junit4]   2> 1656 T561 oass.FileExchangeRateProvider.reload Reloading exchange rates from file currency.xml
[junit4:junit4]   2> 1660 T561 oass.FileExchangeRateProvider.reload Reloading exchange rates from file currency.xml
[junit4:junit4]   2> 1663 T561 oass.OpenExchangeRatesOrgProvider.reload Reloading exchange rates from open-exchange-rates.json
[junit4:junit4]   2> 1664 T561 oass.OpenExchangeRatesOrgProvider.reload Reloading exchange rates from open-exchange-rates.json
[junit4:junit4]   2> 1666 T561 oasc.SolrCore.<init> [collection1] Opening new SolrCore at /usr/home/hudson/hudson-slave/workspace/Lucene-Solr-Tests-trunk-java7/solr/build/solr-core/test/J0/./org.apache.solr.cloud.ChaosMonkeySafeLeaderTest-controljetty-1360765973855/collection1/, dataDir=./org.apache.solr.cloud.ChaosMonkeySafeLeaderTest-1360765973520/control/data/
[junit4:junit4]   2> 1666 T561 oasc.JmxMonitoredMap.<init> JMX monitoring is enabled. Adding Solr mbeans to JMX Server: com.sun.jmx.mbeanserver.JmxMBeanServer@2f29271e
[junit4:junit4]   2> 1666 T561 oasc.SolrCore.initDirectoryFactory solr.StandardDirectoryFactory
[junit4:junit4]   2> 1690 T561 oasc.CachingDirectoryFactory.get return new directory for /usr/home/hudson/hudson-slave/workspace/Lucene-Solr-Tests-trunk-java7/solr/build/solr-core/test/J0/./org.apache.solr.cloud.ChaosMonkeySafeLeaderTest-1360765973520/control/data forceNew:false
[junit4:junit4]   2> 1691 T561 oasc.CachingDirectoryFactory.close Releasing directory:/usr/home/hudson/hudson-slave/workspace/Lucene-Solr-Tests-trunk-java7/solr/build/solr-core/test/J0/./org.apache.solr.cloud.ChaosMonkeySafeLeaderTest-1360765973520/control/data
[junit4:junit4]   2> 1691 T561 oasc.SolrCore.getNewIndexDir New index directory detected: old=null new=./org.apache.solr.cloud.ChaosMonkeySafeLeaderTest-1360765973520/control/data/index/
[junit4:junit4]   2> 1692 T561 oasc.SolrCore.initIndex WARNING [collection1] Solr index directory './org.apache.solr.cloud.ChaosMonkeySafeLeaderTest-1360765973520/control/data/index' doesn't exist. Creating new index...
[junit4:junit4]   2> 1692 T561 oasc.CachingDirectoryFactory.get return new directory for /usr/home/hudson/hudson-slave/workspace/Lucene-Solr-Tests-trunk-java7/solr/build/solr-core/test/J0/./org.apache.solr.cloud.ChaosMonkeySafeLeaderTest-1360765973520/control/data/index forceNew:false
[junit4:junit4]   2> 1697 T561 oasc.SolrDeletionPolicy.onCommit SolrDeletionPolicy.onCommit: commits:num=1
[junit4:junit4]   2> 		commit{dir=RateLimitedDirectoryWrapper(org.apache.lucene.store.NIOFSDirectory@/usr/home/hudson/hudson-slave/workspace/Lucene-Solr-Tests-trunk-java7/solr/build/solr-core/test/J0/org.apache.solr.cloud.ChaosMonkeySafeLeaderTest-1360765973520/control/data/index lockFactory=org.apache.lucene.store.NativeFSLockFactory@391f0422),segFN=segments_1,generation=1,filenames=[segments_1]
[junit4:junit4]   2> 1697 T561 oasc.SolrDeletionPolicy.updateCommits newest commit = 1[segments_1]
[junit4:junit4]   2> 1698 T561 oasc.CachingDirectoryFactory.close Releasing directory:/usr/home/hudson/hudson-slave/workspace/Lucene-Solr-Tests-trunk-java7/solr/build/solr-core/test/J0/./org.apache.solr.cloud.ChaosMonkeySafeLeaderTest-1360765973520/control/data/index
[junit4:junit4]   2> 1698 T561 oasc.SolrCore.initWriters created xml: solr.XMLResponseWriter
[junit4:junit4]   2> 1699 T561 oasup.UpdateRequestProcessorChain.init inserting DistributedUpdateProcessorFactory into updateRequestProcessorChain "dedupe"
[junit4:junit4]   2> 1700 T561 oasup.UpdateRequestProcessorChain.init inserting DistributedUpdateProcessorFactory into updateRequestProcessorChain "dedupe-allfields"
[junit4:junit4]   2> 1700 T561 oasup.UpdateRequestProcessorChain.init inserting DistributedUpdateProcessorFactory into updateRequestProcessorChain "stored_sig"
[junit4:junit4]   2> 1700 T561 oasup.UpdateRequestProcessorChain.init inserting DistributedUpdateProcessorFactory into updateRequestProcessorChain "uniq-fields"
[junit4:junit4]   2> 1701 T561 oasup.UpdateRequestProcessorChain.init inserting DistributedUpdateProcessorFactory into updateRequestProcessorChain "distrib-dup-test-chain-implicit"
[junit4:junit4]   2> 1701 T561 oasc.RequestHandlers.initHandlersFromConfig adding lazy requestHandler: solr.ReplicationHandler
[junit4:junit4]   2> 1701 T561 oasc.RequestHandlers.initHandlersFromConfig created /replication: solr.ReplicationHandler
[junit4:junit4]   2> 1701 T561 oasc.RequestHandlers.initHandlersFromConfig created standard: solr.StandardRequestHandler
[junit4:junit4]   2> 1702 T561 oasc.RequestHandlers.initHandlersFromConfig created /get: solr.RealTimeGetHandler
[junit4:junit4]   2> 1702 T561 oasc.RequestHandlers.initHandlersFromConfig created dismax: solr.SearchHandler
[junit4:junit4]   2> 1703 T561 oasc.RequestHandlers.initHandlersFromConfig created mock: org.apache.solr.core.MockQuerySenderListenerReqHandler
[junit4:junit4]   2> 1703 T561 oasc.RequestHandlers.initHandlersFromConfig created /admin/: org.apache.solr.handler.admin.AdminHandlers
[junit4:junit4]   2> 1703 T561 oasc.RequestHandlers.initHandlersFromConfig created defaults: solr.StandardRequestHandler
[junit4:junit4]   2> 1703 T561 oasc.RequestHandlers.initHandlersFromConfig adding lazy requestHandler: solr.StandardRequestHandler
[junit4:junit4]   2> 1704 T561 oasc.RequestHandlers.initHandlersFromConfig created lazy: solr.StandardRequestHandler
[junit4:junit4]   2> 1704 T561 oasc.RequestHandlers.initHandlersFromConfig created /update: solr.UpdateRequestHandler
[junit4:junit4]   2> 1704 T561 oasc.RequestHandlers.initHandlersFromConfig created /terms: org.apache.solr.handler.component.SearchHandler
[junit4:junit4]   2> 1705 T561 oasc.RequestHandlers.initHandlersFromConfig created spellCheckCompRH: org.apache.solr.handler.component.SearchHandler
[junit4:junit4]   2> 1705 T561 oasc.RequestHandlers.initHandlersFromConfig created spellCheckCompRH_Direct: org.apache.solr.handler.component.SearchHandler
[junit4:junit4]   2> 1705 T561 oasc.RequestHandlers.initHandlersFromConfig created spellCheckWithWordbreak: org.apache.solr.handler.component.SearchHandler
[junit4:junit4]   2> 1706 T561 oasc.RequestHandlers.initHandlersFromConfig created spellCheckWithWordbreak_Direct: org.apache.solr.handler.component.SearchHandler
[junit4:junit4]   2> 1706 T561 oasc.RequestHandlers.initHandlersFromConfig created spellCheckCompRH1: org.apache.solr.handler.component.SearchHandler
[junit4:junit4]   2> 1706 T561 oasc.RequestHandlers.initHandlersFromConfig created mltrh: org.apache.solr.handler.component.SearchHandler
[junit4:junit4]   2> 1707 T561 oasc.RequestHandlers.initHandlersFromConfig created tvrh: org.apache.solr.handler.component.SearchHandler
[junit4:junit4]   2> 1707 T561 oasc.RequestHandlers.initHandlersFromConfig created /mlt: solr.MoreLikeThisHandler
[junit4:junit4]   2> 1707 T561 oasc.RequestHandlers.initHandlersFromConfig created /debug/dump: solr.DumpRequestHandler
[junit4:junit4]   2> 1716 T561 oashl.XMLLoader.init xsltCacheLifetimeSeconds=60
[junit4:junit4]   2> 1719 T561 oasc.SolrCore.initDeprecatedSupport WARNING solrconfig.xml uses deprecated <admin/gettableFiles>, Please update your config to use the ShowFileRequestHandler.
[junit4:junit4]   2> 1720 T561 oasc.SolrCore.initDeprecatedSupport WARNING adding ShowFileRequestHandler with hidden files: [SCHEMA.XML, OLD_SYNONYMS.TXT, STOPWORDS.TXT, PROTWORDS.TXT, OPEN-EXCHANGE-RATES.JSON, SYNONYMS.TXT, CURRENCY.XML, MAPPING-ISOLATIN1ACCENT.TXT]
[junit4:junit4]   2> 1722 T561 oasc.CachingDirectoryFactory.close Releasing directory:/usr/home/hudson/hudson-slave/workspace/Lucene-Solr-Tests-trunk-java7/solr/build/solr-core/test/J0/./org.apache.solr.cloud.ChaosMonkeySafeLeaderTest-1360765973520/control/data
[junit4:junit4]   2> 1724 T561 oass.SolrIndexSearcher.<init> Opening Searcher@2a76aa0e main
[junit4:junit4]   2> 1724 T561 oasu.CommitTracker.<init> Hard AutoCommit: disabled
[junit4:junit4]   2> 1724 T561 oasu.CommitTracker.<init> Soft AutoCommit: disabled
[junit4:junit4]   2> 1725 T561 oashc.SpellCheckComponent.inform Initializing spell checkers
[junit4:junit4]   2> 1742 T561 oass.DirectSolrSpellChecker.init init: {name=direct,classname=DirectSolrSpellChecker,field=lowerfilt,minQueryLength=3}
[junit4:junit4]   2> 1789 T562 oasc.SolrCore.registerSearcher [collection1] Registered new searcher Searcher@2a76aa0e main{StandardDirectoryReader(segments_1:1)}
[junit4:junit4]   2> 1793 T561 oasc.ZkController.publish publishing core=collection1 state=down
[junit4:junit4]   2> 1794 T561 oasc.ZkController.publish numShards not found on descriptor - reading it from system property
[junit4:junit4]   2> 1794 T541 oazs.PrepRequestProcessor.pRequest Got user-level KeeperException when processing sessionid:0x13cd3f8f4190003 type:create cxid:0x51 zxid:0x29 txntype:-1 reqpath:n/a Error Path:/solr/overseer/queue Error:KeeperErrorCode = NoNode for /solr/overseer/queue
[junit4:junit4]   2> 2239 T559 oascc.ZkStateReader.updateClusterState Updating cloud state from ZooKeeper... 
[junit4:junit4]   2> 2240 T559 oasc.Overseer$ClusterStateUpdater.updateState Update state numShards=1 message={
[junit4:junit4]   2> 	  "operation":"state",
[junit4:junit4]   2> 	  "numShards":"1",
[junit4:junit4]   2> 	  "shard":null,
[junit4:junit4]   2> 	  "roles":null,
[junit4:junit4]   2> 	  "state":"down",
[junit4:junit4]   2> 	  "core":"collection1",
[junit4:junit4]   2> 	  "collection":"control_collection",
[junit4:junit4]   2> 	  "node_name":"127.0.0.1:43329_",
[junit4:junit4]   2> 	  "base_url":"http://127.0.0.1:43329"}
[junit4:junit4]   2> 2240 T559 oasc.Overseer$ClusterStateUpdater.createCollection Create collection control_collection with numShards 1
[junit4:junit4]   2> 2240 T559 oasc.Overseer$ClusterStateUpdater.updateState Assigning new node to shard shard=shard1
[junit4:junit4]   2> 2241 T541 oazs.PrepRequestProcessor.pRequest Got user-level KeeperException when processing sessionid:0x13cd3f8f4190003 type:create cxid:0x59 zxid:0x2c txntype:-1 reqpath:n/a Error Path:/solr/overseer/queue-work Error:KeeperErrorCode = NoNode for /solr/overseer/queue-work
[junit4:junit4]   2> 2256 T558 oascc.ZkStateReader$2.process A cluster state change: WatchedEvent state:SyncConnected type:NodeDataChanged path:/clusterstate.json, has occurred - updating... (live nodes size: 1)
[junit4:junit4]   2> 2806 T561 oasc.CoreContainer.registerCore registering core: collection1
[junit4:junit4]   2> 2806 T561 oasc.ZkController.register Register replica - core:collection1 address:http://127.0.0.1:43329 collection:control_collection shard:shard1
[junit4:junit4]   2> 2807 T561 oascc.SolrZkClient.makePath makePath: /collections/control_collection/leader_elect/shard1/election
[junit4:junit4]   2> 2824 T541 oazs.PrepRequestProcessor.pRequest Got user-level KeeperException when processing sessionid:0x13cd3f8f4190003 type:delete cxid:0x73 zxid:0x36 txntype:-1 reqpath:n/a Error Path:/solr/collections/control_collection/leaders Error:KeeperErrorCode = NoNode for /solr/collections/control_collection/leaders
[junit4:junit4]   2> 2824 T561 oasc.ShardLeaderElectionContext.runLeaderProcess Running the leader process.
[junit4:junit4]   2> 2825 T541 oazs.PrepRequestProcessor.pRequest Got user-level KeeperException when processing sessionid:0x13cd3f8f4190003 type:create cxid:0x74 zxid:0x37 txntype:-1 reqpath:n/a Error Path:/solr/overseer Error:KeeperErrorCode = NodeExists for /solr/overseer
[junit4:junit4]   2> 2835 T561 oasc.ShardLeaderElectionContext.waitForReplicasToComeUp Enough replicas found to continue.
[junit4:junit4]   2> 2835 T561 oasc.ShardLeaderElectionContext.runLeaderProcess I may be the new leader - try and sync
[junit4:junit4]   2> 2835 T561 oasc.SyncStrategy.sync Sync replicas to http://127.0.0.1:43329/collection1/
[junit4:junit4]   2> 2836 T561 oasc.SyncStrategy.syncReplicas Sync Success - now sync replicas to me
[junit4:junit4]   2> 2836 T561 oasc.SyncStrategy.syncToMe http://127.0.0.1:43329/collection1/ has no replicas
[junit4:junit4]   2> 2836 T561 oasc.ShardLeaderElectionContext.runLeaderProcess I am the new leader: http://127.0.0.1:43329/collection1/
[junit4:junit4]   2> 2836 T561 oascc.SolrZkClient.makePath makePath: /collections/control_collection/leaders/shard1
[junit4:junit4]   2> 2840 T541 oazs.PrepRequestProcessor.pRequest Got user-level KeeperException when processing sessionid:0x13cd3f8f4190003 type:create cxid:0x7e zxid:0x3b txntype:-1 reqpath:n/a Error Path:/solr/overseer Error:KeeperErrorCode = NodeExists for /solr/overseer
[junit4:junit4]   2> 3761 T559 oascc.ZkStateReader.updateClusterState Updating cloud state from ZooKeeper... 
[junit4:junit4]   2> 3778 T558 oascc.ZkStateReader$2.process A cluster state change: WatchedEvent state:SyncConnected type:NodeDataChanged path:/clusterstate.json, has occurred - updating... (live nodes size: 1)
[junit4:junit4]   2> 3812 T561 oasc.ZkController.register We are http://127.0.0.1:43329/collection1/ and leader is http://127.0.0.1:43329/collection1/
[junit4:junit4]   2> 3812 T561 oasc.ZkController.register No LogReplay needed for core=collection1 baseURL=http://127.0.0.1:43329
[junit4:junit4]   2> 3812 T561 oasc.ZkController.checkRecovery I am the leader, no recovery necessary
[junit4:junit4]   2> 3812 T561 oasc.ZkController.publish publishing core=collection1 state=active
[junit4:junit4]   2> 3813 T561 oasc.ZkController.publish numShards not found on descriptor - reading it from system property
[junit4:junit4]   2> 3815 T561 oascc.ZkStateReader.updateClusterState Updating cloud state from ZooKeeper... 
[junit4:junit4]   2> 3816 T536 oass.SolrDispatchFilter.init user.dir=/usr/home/hudson/hudson-slave/workspace/Lucene-Solr-Tests-trunk-java7/solr/build/solr-core/test/J0
[junit4:junit4]   2> 3816 T536 oass.SolrDispatchFilter.init SolrDispatchFilter.init() done
[junit4:junit4]   2> 3817 T536 oascsi.HttpClientUtil.createClient Creating new http client, config:maxConnections=128&maxConnectionsPerHost=32&followRedirects=false
[junit4:junit4]   2> 3834 T536 oascsi.HttpClientUtil.createClient Creating new http client, config:
[junit4:junit4]   2> 3845 T536 oaz.ZooKeeper.<init> Initiating client connection, connectString=127.0.0.1:47126/solr sessionTimeout=10000 watcher=org.apache.solr.common.cloud.ConnectionManager@5d7962bd
[junit4:junit4]   2> 3846 T536 oascc.ConnectionManager.waitForConnected Waiting for client to connect to ZooKeeper
[junit4:junit4]   2> 3846 T563 oaz.ClientCnxn$SendThread.logStartConnect Opening socket connection to server localhost/127.0.0.1:47126. Will not attempt to authenticate using SASL (access denied ("javax.security.auth.AuthPermission" "getLoginConfiguration"))
[junit4:junit4]   2> 3847 T563 oaz.ClientCnxn$SendThread.primeConnection Socket connection established to localhost/127.0.0.1:47126, initiating session
[junit4:junit4]   2> 3847 T538 oazs.NIOServerCnxnFactory.run Accepted socket connection from /140.211.11.196:23900
[junit4:junit4]   2> 3847 T538 oazs.ZooKeeperServer.processConnectRequest Client attempting to establish new session at /140.211.11.196:23900
[junit4:junit4]   2> 3849 T540 oazs.ZooKeeperServer.finishSessionInit Established session 0x13cd3f8f4190004 with negotiated timeout 10000 for client /140.211.11.196:23900
[junit4:junit4]   2> 3849 T563 oaz.ClientCnxn$SendThread.onConnected Session establishment complete on server localhost/127.0.0.1:47126, sessionid = 0x13cd3f8f4190004, negotiated timeout = 10000
[junit4:junit4]   2> 3849 T564 oascc.ConnectionManager.process Watcher org.apache.solr.common.cloud.ConnectionManager@5d7962bd name:ZooKeeperConnection Watcher:127.0.0.1:47126/solr got event WatchedEvent state:SyncConnected type:None path:null path:null type:None
[junit4:junit4]   2> 3849 T536 oascc.ConnectionManager.waitForConnected Client is connected to ZooKeeper
[junit4:junit4]   2> 3851 T536 oascc.ZkStateReader.createClusterStateWatchersAndUpdate Updating cluster state from ZooKeeper... 
[junit4:junit4]   2> 3853 T536 oasc.ChaosMonkey.monkeyLog monkey: init - expire sessions:true cause connection loss:true
[junit4:junit4]   2> 4054 T536 oejs.Server.doStart jetty-8.1.8.v20121106
[junit4:junit4]   2> 4057 T536 oejs.AbstractConnector.doStart Started SocketConnector@127.0.0.1:60875
[junit4:junit4]   2> 4058 T536 oass.SolrDispatchFilter.init SolrDispatchFilter.init()
[junit4:junit4]   2> 4058 T536 oasc.SolrResourceLoader.locateSolrHome JNDI not configured for solr (NoInitialContextEx)
[junit4:junit4]   2> 4059 T536 oasc.SolrResourceLoader.locateSolrHome using system property solr.solr.home: /usr/home/hudson/hudson-slave/workspace/Lucene-Solr-Tests-trunk-java7/solr/build/solr-core/test/J0/./org.apache.solr.cloud.ChaosMonkeySafeLeaderTest-jetty1-1360765977368
[junit4:junit4]   2> 4059 T536 oasc.CoreContainer$Initializer.initialize looking for solr.xml: /usr/home/hudson/hudson-slave/workspace/Lucene-Solr-Tests-trunk-java7/solr/build/solr-core/test/J0/./org.apache.solr.cloud.ChaosMonkeySafeLeaderTest-jetty1-1360765977368/solr.xml
[junit4:junit4]   2> 4059 T536 oasc.CoreContainer.<init> New CoreContainer 224805384
[junit4:junit4]   2> 4060 T536 oasc.CoreContainer.load Loading CoreContainer using Solr Home: '/usr/home/hudson/hudson-slave/workspace/Lucene-Solr-Tests-trunk-java7/solr/build/solr-core/test/J0/./org.apache.solr.cloud.ChaosMonkeySafeLeaderTest-jetty1-1360765977368/'
[junit4:junit4]   2> 4061 T536 oasc.SolrResourceLoader.<init> new SolrResourceLoader for directory: '/usr/home/hudson/hudson-slave/workspace/Lucene-Solr-Tests-trunk-java7/solr/build/solr-core/test/J0/./org.apache.solr.cloud.ChaosMonkeySafeLeaderTest-jetty1-1360765977368/'
[junit4:junit4]   2> 4127 T536 oashc.HttpShardHandlerFactory.getParameter Setting socketTimeout to: 60000
[junit4:junit4]   2> 4128 T536 oashc.HttpShardHandlerFactory.getParameter Setting urlScheme to: http://
[junit4:junit4]   2> 4128 T536 oashc.HttpShardHandlerFactory.getParameter Setting connTimeout to: 15000
[junit4:junit4]   2> 4129 T536 oashc.HttpShardHandlerFactory.getParameter Setting maxConnectionsPerHost to: 20
[junit4:junit4]   2> 4129 T536 oashc.HttpShardHandlerFactory.getParameter Setting corePoolSize to: 0
[junit4:junit4]   2> 4130 T536 oashc.HttpShardHandlerFactory.getParameter Setting maximumPoolSize to: 2147483647
[junit4:junit4]   2> 4130 T536 oashc.HttpShardHandlerFactory.getParameter Setting maxThreadIdleTime to: 5
[junit4:junit4]   2> 4131 T536 oashc.HttpShardHandlerFactory.getParameter Setting sizeOfQueue to: -1
[junit4:junit4]   2> 4131 T536 oashc.HttpShardHandlerFactory.getParameter Setting fairnessPolicy to: false
[junit4:junit4]   2> 4131 T536 oascsi.HttpClientUtil.createClient Creating new http client, config:maxConnectionsPerHost=20&maxConnections=10000&socketTimeout=60000&connTimeout=15000&retry=false
[junit4:junit4]   2> 4154 T536 oasc.CoreContainer.load Registering Log Listener
[junit4:junit4]   2> 4173 T536 oasc.CoreContainer.initZooKeeper Zookeeper client=127.0.0.1:47126/solr
[junit4:junit4]   2> 4174 T536 oasc.ZkController.checkChrootPath zkHost includes chroot
[junit4:junit4]   2> 4175 T536 oaz.ZooKeeper.<init> Initiating client connection, connectString=127.0.0.1:47126 sessionTimeout=60000 watcher=org.apache.solr.common.cloud.ConnectionManager@5a88d2a9
[junit4:junit4]   2> 4176 T536 oascc.ConnectionManager.waitForConnected Waiting for client to connect to ZooKeeper
[junit4:junit4]   2> 4176 T574 oaz.ClientCnxn$SendThread.logStartConnect Opening socket connection to server localhost/127.0.0.1:47126. Will not attempt to authenticate using SASL (access denied ("javax.security.auth.AuthPermission" "getLoginConfiguration"))
[junit4:junit4]   2> 4177 T574 oaz.ClientCnxn$SendThread.primeConnection Socket connection established to localhost/127.0.0.1:47126, initiating session
[junit4:junit4]   2> 4177 T538 oazs.NIOServerCnxnFactory.run Accepted socket connection from /140.211.11.196:11317
[junit4:junit4]   2> 4178 T538 oazs.ZooKeeperServer.processConnectRequest Client attempting to establish new session at /140.211.11.196:11317
[junit4:junit4]   2> 4186 T540 oazs.ZooKeeperServer.finishSessionInit Established session 0x13cd3f8f4190005 with negotiated timeout 20000 for client /140.211.11.196:11317
[junit4:junit4]   2> 4186 T574 oaz.ClientCnxn$SendThread.onConnected Session establishment complete on server localhost/127.0.0.1:47126, sessionid = 0x13cd3f8f4190005, negotiated timeout = 20000
[junit4:junit4]   2> 4186 T575 oascc.ConnectionManager.process Watcher org.apache.solr.common.cloud.ConnectionManager@5a88d2a9 name:ZooKeeperConnection Watcher:127.0.0.1:47126 got event WatchedEvent state:SyncConnected type:None path:null path:null type:None
[junit4:junit4]   2> 4187 T536 oascc.ConnectionManager.waitForConnected Client is connected to ZooKeeper
[junit4:junit4]   2> 4188 T541 oazs.PrepRequestProcessor.pRequest2Txn Processed session termination for sessionid: 0x13cd3f8f4190005
[junit4:junit4]   2> 4189 T575 oaz.ClientCnxn$EventThread.run EventThread shut down
[junit4:junit4]   2> 4190 T538 oazs.NIOServerCnxn.closeSock Closed socket connection for client /140.211.11.196:11317 which had sessionid 0x13cd3f8f4190005
[junit4:junit4]   2> 4189 T536 oaz.ZooKeeper.close Session: 0x13cd3f8f4190005 closed
[junit4:junit4]   2> 4190 T536 oascsi.HttpClientUtil.createClient Creating new http client, config:maxConnections=500&maxConnectionsPerHost=16&socketTimeout=60000&connTimeout=15000
[junit4:junit4]   2> 4202 T536 oaz.ZooKeeper.<init> Initiating client connection, connectString=127.0.0.1:47126/solr sessionTimeout=30000 watcher=org.apache.solr.common.cloud.ConnectionManager@1fa1519d
[junit4:junit4]   2> 4203 T536 oascc.ConnectionManager.waitForConnected Waiting for client to connect to ZooKeeper
[junit4:junit4]   2> 4203 T576 oaz.ClientCnxn$SendThread.logStartConnect Opening socket connection to server localhost/127.0.0.1:47126. Will not attempt to authenticate using SASL (access denied ("javax.security.auth.AuthPermission" "getLoginConfiguration"))
[junit4:junit4]   2> 4204 T576 oaz.ClientCnxn$SendThread.primeConnection Socket connection established to localhost/127.0.0.1:47126, initiating session
[junit4:junit4]   2> 4204 T538 oazs.NIOServerCnxnFactory.run Accepted socket connection from /140.211.11.196:38806
[junit4:junit4]   2> 4204 T538 oazs.ZooKeeperServer.processConnectRequest Client attempting to establish new session at /140.211.11.196:38806
[junit4:junit4]   2> 4206 T540 oazs.ZooKeeperServer.finishSessionInit Established session 0x13cd3f8f4190006 with negotiated timeout 20000 for client /140.211.11.196:38806
[junit4:junit4]   2> 4206 T576 oaz.ClientCnxn$SendThread.onConnected Session establishment complete on server localhost/127.0.0.1:47126, sessionid = 0x13cd3f8f4190006, negotiated timeout = 20000
[junit4:junit4]   2> 4207 T577 oascc.ConnectionManager.process Watcher org.apache.solr.common.cloud.ConnectionManager@1fa1519d name:ZooKeeperConnection Watcher:127.0.0.1:47126/solr got event WatchedEvent state:SyncConnected type:None path:null path:null type:None
[junit4:junit4]   2> 4207 T536 oascc.ConnectionManager.waitForConnected Client is connected to ZooKeeper
[junit4:junit4]   2> 4208 T541 oazs.PrepRequestProcessor.pRequest Got user-level KeeperException when processing sessionid:0x13cd3f8f4190006 type:create cxid:0x1 zxid:0x49 txntype:-1 reqpath:n/a Error Path:/solr/overseer Error:KeeperErrorCode = NodeExists for /solr/overseer
[junit4:junit4]   2> 4210 T541 oazs.PrepRequestProcessor.pRequest Got user-level KeeperException when processing sessionid:0x13cd3f8f4190006 type:create cxid:0x2 zxid:0x4a txntype:-1 reqpath:n/a Error Path:/solr/overseer Error:KeeperErrorCode = NodeExists for /solr/overseer
[junit4:junit4]   2> 4212 T536 oascc.ZkStateReader.createClusterStateWatchersAndUpdate Updating cluster state from ZooKeeper... 
[junit4:junit4]   2> 4215 T536 oasc.ZkController.createEphemeralLiveNode Register node as live in ZooKeeper:/live_nodes/127.0.0.1:60875_
[junit4:junit4]   2> 4216 T541 oazs.PrepRequestProcessor.pRequest Got user-level KeeperException when processing sessionid:0x13cd3f8f4190006 type:delete cxid:0x9 zxid:0x4b txntype:-1 reqpath:n/a Error Path:/solr/live_nodes/127.0.0.1:60875_ Error:KeeperErrorCode = NoNode for /solr/live_nodes/127.0.0.1:60875_
[junit4:junit4]   2> 4217 T536 oascc.SolrZkClient.makePath makePath: /live_nodes/127.0.0.1:60875_
[junit4:junit4]   2> 4225 T564 oascc.ZkStateReader$3.process Updating live nodes... (2)
[junit4:junit4]   2> 4225 T577 oascc.ZkStateReader$3.process Updating live nodes... (2)
[junit4:junit4]   2> 4225 T558 oascc.ZkStateReader$3.process Updating live nodes... (2)
[junit4:junit4]   2> 4225 T558 oascc.ZkStateReader$2.process A cluster state change: WatchedEvent state:SyncConnected type:NodeChildrenChanged path:/live_nodes, has occurred - updating... (live nodes size: 2)
[junit4:junit4]   2> 4234 T578 oasc.CoreContainer.create Creating SolrCore 'collection1' using instanceDir: /usr/home/hudson/hudson-slave/workspace/Lucene-Solr-Tests-trunk-java7/solr/build/solr-core/test/J0/./org.apache.solr.cloud.ChaosMonkeySafeLeaderTest-jetty1-1360765977368/collection1
[junit4:junit4]   2> 4235 T578 oasc.ZkController.createCollectionZkNode Check for collection zkNode:collection1
[junit4:junit4]   2> 4235 T578 oasc.ZkController.createCollectionZkNode Collection zkNode exists
[junit4:junit4]   2> 4235 T578 oasc.ZkController.readConfigName Load collection config from:/collections/collection1
[junit4:junit4]   2> 4237 T578 oasc.SolrResourceLoader.<init> new SolrResourceLoader for directory: '/usr/home/hudson/hudson-slave/workspace/Lucene-Solr-Tests-trunk-java7/solr/build/solr-core/test/J0/./org.apache.solr.cloud.ChaosMonkeySafeLeaderTest-jetty1-1360765977368/collection1/'
[junit4:junit4]   2> 4239 T578 oasc.SolrResourceLoader.replaceClassLoader Adding 'file:/usr/home/hudson/hudson-slave/workspace/Lucene-Solr-Tests-trunk-java7/solr/build/solr-core/test/J0/org.apache.solr.cloud.ChaosMonkeySafeLeaderTest-jetty1-1360765977368/collection1/lib/README' to classloader
[junit4:junit4]   2> 4239 T578 oasc.SolrResourceLoader.replaceClassLoader Adding 'file:/usr/home/hudson/hudson-slave/workspace/Lucene-Solr-Tests-trunk-java7/solr/build/solr-core/test/J0/org.apache.solr.cloud.ChaosMonkeySafeLeaderTest-jetty1-1360765977368/collection1/lib/classes/' to classloader
[junit4:junit4]   2> 4302 T578 oasc.SolrConfig.<init> Using Lucene MatchVersion: LUCENE_50
[junit4:junit4]   2> 4376 T578 oasc.SolrConfig.<init> Loaded SolrConfig: solrconfig.xml
[junit4:junit4]   2> 4477 T578 oass.IndexSchema.readSchema Reading Solr Schema
[junit4:junit4]   2> 4484 T578 oass.IndexSchema.readSchema Schema name=test
[junit4:junit4]   2> 5123 T578 oass.OpenExchangeRatesOrgProvider.init Initialized with rates=open-exchange-rates.json, refreshInterval=1440.
[junit4:junit4]   2> 5131 T578 oass.IndexSchema.readSchema default search field in schema is text
[junit4:junit4]   2> 5134 T578 oass.IndexSchema.readSchema unique key field: id
[junit4:junit4]   2> 5147 T578 oass.FileExchangeRateProvider.reload Reloading exchange rates from file currency.xml
[junit4:junit4]   2> 5151 T578 oass.FileExchangeRateProvider.reload Reloading exchange rates from file currency.xml
[junit4:junit4]   2> 5155 T578 oass.OpenExchangeRatesOrgProvider.reload Reloading exchange rates from open-exchange-rates.json
[junit4:junit4]   2> 5156 T578 oass.OpenExchangeRatesOrgProvider.reload Reloading exchange rates from open-exchange-rates.json
[junit4:junit4]   2> 5157 T578 oasc.SolrCore.<init> [collection1] Opening new SolrCore at /usr/home/hudson/hudson-slave/workspace/Lucene-Solr-Tests-trunk-java7/solr/build/solr-core/test/J0/./org.apache.solr.cloud.ChaosMonkeySafeLeaderTest-jetty1-1360765977368/collection1/, dataDir=./org.apache.solr.cloud.ChaosMonkeySafeLeaderTest-1360765973520/jetty1/
[junit4:junit4]   2> 5157 T578 oasc.JmxMonitoredMap.<init> JMX monitoring is enabled. Adding Solr mbeans to JMX Server: com.sun.jmx.mbeanserver.JmxMBeanServer@2f29271e
[junit4:junit4]   2> 5158 T578 oasc.SolrCore.initDirectoryFactory solr.StandardDirectoryFactory
[junit4:junit4]   2> 5158 T578 oasc.CachingDirectoryFactory.get return new directory for /usr/home/hudson/hudson-slave/workspace/Lucene-Solr-Tests-trunk-java7/solr/build/solr-core/test/J0/./org.apache.solr.cloud.ChaosMonkeySafeLeaderTest-1360765973520/jetty1 forceNew:false
[junit4:junit4]   2> 5159 T578 oasc.CachingDirectoryFactory.close Releasing directory:/usr/home/hudson/hudson-slave/workspace/Lucene-Solr-Tests-trunk-java7/solr/build/solr-core/test/J0/./org.apache.solr.cloud.ChaosMonkeySafeLeaderTest-1360765973520/jetty1
[junit4:junit4]   2> 5159 T578 oasc.SolrCore.getNewIndexDir New index directory detected: old=null new=./org.apache.solr.cloud.ChaosMonkeySafeLeaderTest-1360765973520/jetty1/index/
[junit4:junit4]   2> 5159 T578 oasc.SolrCore.initIndex WARNING [collection1] Solr index directory './org.apache.solr.cloud.ChaosMonkeySafeLeaderTest-1360765973520/jetty1/index' doesn't exist. Creating new index...
[junit4:junit4]   2> 5160 T578 oasc.CachingDirectoryFactory.get return new directory for /usr/home/hudson/hudson-slave/workspace/Lucene-Solr-Tests-trunk-java7/solr/build/solr-core/test/J0/./org.apache.solr.cloud.ChaosMonkeySafeLeaderTest-1360765973520/jetty1/index forceNew:false
[junit4:junit4]   2> 5170 T578 oasc.SolrDeletionPolicy.onCommit SolrDeletionPolicy.onCommit: commits:num=1
[junit4:junit4]   2> 		commit{dir=RateLimitedDirectoryWrapper(org.apache.lucene.store.NIOFSDirectory@/usr/home/hudson/hudson-slave/workspace/Lucene-Solr-Tests-trunk-java7/solr/build/solr-core/test/J0/org.apache.solr.cloud.ChaosMonkeySafeLeaderTest-1360765973520/jetty1/index lockFactory=org.apache.lucene.store.NativeFSLockFactory@2636d85f),segFN=segments_1,generation=1,filenames=[segments_1]
[junit4:junit4]   2> 5170 T578 oasc.SolrDeletionPolicy.updateCommits newest commit = 1[segments_1]
[junit4:junit4]   2> 5171 T578 oasc.CachingDirectoryFactory.close Releasing directory:/usr/home/hudson/hudson-slave/workspace/Lucene-Solr-Tests-trunk-java7/solr/build/solr-core/test/J0/./org.apache.solr.cloud.ChaosMonkeySafeLeaderTest-1360765973520/jetty1/index
[junit4:junit4]   2> 5171 T578 oasc.SolrCore.initWriters created xml: solr.XMLResponseWriter
[junit4:junit4]   2> 5172 T578 oasup.UpdateRequestProcessorChain.init inserting DistributedUpdateProcessorFactory into updateRequestProcessorChain "dedupe"
[junit4:junit4]   2> 5173 T578 oasup.UpdateRequestProcessorChain.init inserting DistributedUpdateProcessorFactory into updateRequestProcessorChain "dedupe-allfields"
[junit4:junit4]   2> 5173 T578 oasup.UpdateRequestProcessorChain.init inserting DistributedUpdateProcessorFactory into updateRequestProcessorChain "stored_sig"
[junit4:junit4]   2> 5173 T578 oasup.UpdateRequestProcessorChain.init inserting DistributedUpdateProcessorFactory into updateRequestProcessorChain "uniq-fields"
[junit4:junit4]   2> 5174 T578 oasup.UpdateRequestProcessorChain.init inserting DistributedUpdateProcessorFactory into updateRequestProcessorChain "distrib-dup-test-chain-implicit"
[junit4:junit4]   2> 5174 T578 oasc.RequestHandlers.initHandlersFromConfig adding lazy requestHandler: solr.ReplicationHandler
[junit4:junit4]   2> 5174 T578 oasc.RequestHandlers.initHandlersFromConfig created /replication: solr.ReplicationHandler
[junit4:junit4]   2> 5174 T578 oasc.RequestHandlers.initHandlersFromConfig created standard: solr.StandardRequestHandler
[junit4:junit4]   2> 5175 T578 oasc.RequestHandlers.initHandlersFromConfig created /get: solr.RealTimeGetHandler
[junit4:junit4]   2> 5175 T578 oasc.RequestHandlers.initHandlersFromConfig created dismax: solr.SearchHandler
[junit4:junit4]   2> 5176 T578 oasc.RequestHandlers.initHandlersFromConfig created mock: org.apache.solr.core.MockQuerySenderListenerReqHandler
[junit4:junit4]   2> 5176 T578 oasc.RequestHandlers.initHandlersFromConfig created /admin/: org.apache.solr.handler.admin.AdminHandlers
[junit4:junit4]   2> 5176 T578 oasc.RequestHandlers.initHandlersFromConfig created defaults: solr.StandardRequestHandler
[junit4:junit4]   2> 5177 T578 oasc.RequestHandlers.initHandlersFromConfig adding lazy requestHandler: solr.StandardRequestHandler
[junit4:junit4]   2> 5177 T578 oasc.RequestHandlers.initHandlersFromConfig created lazy: solr.StandardRequestHandler
[junit4:junit4]   2> 5177 T578 oasc.RequestHandlers.initHandlersFromConfig created /update: solr.UpdateRequestHandler
[junit4:junit4]   2> 5178 T578 oasc.RequestHandlers.initHandlersFromConfig created /terms: org.apache.solr.handler.component.SearchHandler
[junit4:junit4]   2> 5178 T578 oasc.RequestHandlers.initHandlersFromConfig created spellCheckCompRH: org.apache.solr.handler.component.SearchHandler
[junit4:junit4]   2> 5179 T578 oasc.RequestHandlers.initHandlersFromConfig created spellCheckCompRH_Direct: org.apache.solr.handler.component.SearchHandler
[junit4:junit4]   2> 5179 T578 oasc.RequestHandlers.initHandlersFromConfig created spellCheckWithWordbreak: org.apache.solr.handler.component.SearchHandler
[junit4:junit4]   2> 5179 T578 oasc.RequestHandlers.initHandlersFromConfig created spellCheckWithWordbreak_Direct: org.apache.solr.handler.component.SearchHandler
[junit4:junit4]   2> 5180 T578 oasc.RequestHandlers.initHandlersFromConfig created spellCheckCompRH1: org.apache.solr.handler.component.SearchHandler
[junit4:junit4]   2> 5180 T578 oasc.RequestHandlers.initHandlersFromConfig created mltrh: org.apache.solr.handler.component.SearchHandler
[junit4:junit4]   2> 5181 T578 oasc.RequestHandlers.initHandlersFromConfig created tvrh: org.apache.solr.handler.component.SearchHandler
[junit4:junit4]   2> 5181 T578 oasc.RequestHandlers.initHandlersFromConfig created /mlt: solr.MoreLikeThisHandler
[junit4:junit4]   2> 5182 T578 oasc.RequestHandlers.initHandlersFromConfig created /debug/dump: solr.DumpRequestHandler
[junit4:junit4]   2> 5192 T578 oashl.XMLLoader.init xsltCacheLifetimeSeconds=60
[junit4:junit4]   2> 5195 T578 oasc.SolrCore.initDeprecatedSupport WARNING solrconfig.xml uses deprecated <admin/gettableFiles>, Please update your config to use the ShowFileRequestHandler.
[junit4:junit4]   2> 5196 T578 oasc.SolrCore.initDeprecatedSupport WARNING adding ShowFileRequestHandler with hidden files: [SCHEMA.XML, OLD_SYNONYMS.TXT, STOPWORDS.TXT, PROTWORDS.TXT, OPEN-EXCHANGE-RATES.JSON, SYNONYMS.TXT, CURRENCY.XML, MAPPING-ISOLATIN1ACCENT.TXT]
[junit4:junit4]   2> 5198 T578 oasc.CachingDirectoryFactory.close Releasing directory:/usr/home/hudson/hudson-slave/workspace/Lucene-Solr-Tests-trunk-java7/solr/build/solr-core/test/J0/./org.apache.solr.cloud.ChaosMonkeySafeLeaderTest-1360765973520/jetty1
[junit4:junit4]   2> 5199 T578 oass.SolrIndexSearcher.<init> Opening Searcher@3592fc59 main
[junit4:junit4]   2> 5200 T578 oasu.CommitTracker.<init> Hard AutoCommit: disabled
[junit4:junit4]   2> 5200 T578 oasu.CommitTracker.<init> Soft AutoCommit: disabled
[junit4:junit4]   2> 5201 T578 oashc.SpellCheckComponent.inform Initializing spell checkers
[junit4:junit4]   2> 5213 T578 oass.DirectSolrSpellChecker.init init: {name=direct,classname=DirectSolrSpellChecker,field=lowerfilt,minQueryLength=3}
[junit4:junit4]   2> 5288 T579 oasc.SolrCore.registerSearcher [collection1] Registered new searcher Searcher@3592fc59 main{StandardDirectoryReader(segments_1:1)}
[junit4:junit4]   2> 5293 T578 oasc.ZkController.publish publishing core=collection1 state=down
[junit4:junit4]   2> 5293 T578 oasc.ZkController.publish numShards not found on descriptor - reading it from system property
[junit4:junit4]   2> 5295 T559 oascc.ZkStateReader.updateClusterState Updating cloud state from ZooKeeper... 
[junit4:junit4]   2> 5296 T559 oasc.Overseer$ClusterStateUpdater.updateState Update state numShards=1 message={
[junit4:junit4]   2> 	  "operation":"state",
[junit4:junit4]   2> 	  "numShards":"1",
[junit4:junit4]   2> 	  "shard":"shard1",
[junit4:junit4]   2> 	  "roles":null,
[junit4:junit4]   2> 	  "state":"active",
[junit4:junit4]   2> 	  "core":"collection1",
[junit4:junit4]   2> 	  "collection":"control_collection",
[junit4:junit4]   2> 	  "node_name":"127.0.0.1:43329_",
[junit4:junit4]   2> 	  "base_url":"http://127.0.0.1:43329"}
[junit4:junit4]   2> 5299 T559 oasc.Overseer$ClusterStateUpdater.updateState Update state numShards=3 message={
[junit4:junit4]   2> 	  "operation":"state",
[junit4:junit4]   2> 	  "numShards":"3",
[junit4:junit4]   2> 	  "shard":null,
[junit4:junit4]   2> 	  "roles":null,
[junit4:junit4]   2> 	  "state":"down",
[junit4:junit4]   2> 	  "core":"collection1",
[junit4:junit4]   2> 	  "collection":"collection1",
[junit4:junit4]   2> 	  "node_name":"127.0.0.1:60875_",
[junit4:junit4]   2> 	  "base_url":"http://127.0.0.1:60875"}
[junit4:junit4]   2> 5299 T559 oasc.Overseer$ClusterStateUpdater.createCollection Create collection collection1 with numShards 3
[junit4:junit4]   2> 5300 T559 oasc.Overseer$ClusterStateUpdater.updateState Assigning new node to shard shard=shard1
[junit4:junit4]   2> 5309 T577 oascc.ZkStateReader$2.process A cluster state change: WatchedEvent state:SyncConnected type:NodeDataChanged path:/clusterstate.json, has occurred - updating... (live nodes size: 2)
[junit4:junit4]   2> 5309 T564 oascc.ZkStateReader$2.process A cluster state change: WatchedEvent state:SyncConnected type:NodeDataChanged path:/clusterstate.json, has occurred - updating... (live nodes size: 2)
[junit4:junit4]   2> 5309 T558 oascc.ZkStateReader$2.process A cluster state change: WatchedEvent state:SyncConnected type:NodeDataChanged path:/clusterstate.json, has occurred - updating... (live nodes size: 2)
[junit4:junit4]   2> 6295 T578 oasc.CoreContainer.registerCore registering core: collection1
[junit4:junit4]   2> 6295 T578 oasc.ZkController.register Register replica - core:collection1 address:http://127.0.0.1:60875 collection:collection1 shard:shard1
[junit4:junit4]   2> 6296 T578 oascc.SolrZkClient.makePath makePath: /collections/collection1/leader_elect/shard1/election
[junit4:junit4]   2> 6339 T541 oazs.PrepRequestProcessor.pRequest Got user-level KeeperException when processing sessionid:0x13cd3f8f4190006 type:delete cxid:0x45 zxid:0x5a txntype:-1 reqpath:n/a Error Path:/solr/collections/collection1/leaders Error:KeeperErrorCode = NoNode for /solr/collections/collection1/leaders
[junit4:junit4]   2> 6340 T578 oasc.ShardLeaderElectionContext.runLeaderProcess Running the leader process.
[junit4:junit4]   2> 6340 T541 oazs.PrepRequestProcessor.pRequest Got user-level KeeperException when processing sessionid:0x13cd3f8f4190006 type:create cxid:0x46 zxid:0x5b txntype:-1 reqpath:n/a Error Path:/solr/overseer Error:KeeperErrorCode = NodeExists for /solr/overseer
[junit4:junit4]   2> 6343 T578 oasc.ShardLeaderElectionContext.waitForReplicasToComeUp Enough replicas found to continue.
[junit4:junit4]   2> 6343 T578 oasc.ShardLeaderElectionContext.runLeaderProcess I may be the new leader - try and sync
[junit4:junit4]   2> 6343 T578 oasc.SyncStrategy.sync Sync replicas to http://127.0.0.1:60875/collection1/
[junit4:junit4]   2> 6343 T578 oasc.SyncStrategy.syncReplicas Sync Success - now sync replicas to me
[junit4:junit4]   2> 6343 T578 oasc.SyncStrategy.syncToMe http://127.0.0.1:60875/collection1/ has no replicas
[junit4:junit4]   2> 6344 T578 oasc.ShardLeaderElectionContext.runLeaderProcess I am the new leader: http://127.0.0.1:60875/collection1/
[junit4:junit4]   2> 6344 T578 oascc.SolrZkClient.makePath makePath: /collections/collection1/leaders/shard1
[junit4:junit4]   2> 6348 T541 oazs.PrepRequestProcessor.pRequest Got user-level KeeperException when processing sessionid:0x13cd3f8f4190006 type:create cxid:0x50 zxid:0x5f txntype:-1 reqpath:n/a Error Path:/solr/overseer Error:KeeperErrorCode = NodeExists for /solr/overseer
[junit4:junit4]   2> 6816 T559 oascc.ZkStateReader.updateClusterState Updating cloud state from ZooKeeper... 
[junit4:junit4]   2> 6830 T558 oascc.ZkStateReader$2.process A cluster state change: WatchedEvent state:SyncConnected type:NodeDataChanged path:/clusterstate.json, has occurred - updating... (live nodes size: 2)
[junit4:junit4]   2> 6830 T577 oascc.ZkStateReader$2.process A cluster state change: WatchedEvent state:SyncConnected type:NodeDataChanged path:/clusterstate.json, has occurred - updating... (live nodes size: 2)
[junit4:junit4]   2> 6830 T564 oascc.ZkStateReader$2.process A cluster state change: WatchedEvent state:SyncConnected type:NodeDataChanged path:/clusterstate.json, has occurred - updating... (live nodes size: 2)
[junit4:junit4]   2> 6860 T578 oasc.ZkController.register We are http://127.0.0.1:60875/collection1/ and leader is http://127.0.0.1:60875/collection1/
[junit4:junit4]   2> 6860 T578 oasc.ZkController.register No LogReplay needed for core=collection1 baseURL=http://127.0.0.1:60875
[junit4:junit4]   2> 6860 T578 oasc.ZkController.checkRecovery I am the leader, no recovery necessary
[junit4:junit4]   2> 6860 T578 oasc.ZkController.publish publishing core=collection1 state=active
[junit4:junit4]   2> 6860 T578 oasc.ZkController.publish numShards not found on descriptor - reading it from system property
[junit4:junit4]   2> 6862 T578 oascc.ZkStateReader.updateClusterState Updating cloud state from ZooKeeper... 
[junit4:junit4]   2> 6863 T536 oass.SolrDispatchFilter.init user.dir=/usr/home/hudson/hudson-slave/workspace/Lucene-Solr-Tests-trunk-java7/solr/build/solr-core/test/J0
[junit4:junit4]   2> 6864 T536 oass.SolrDispatchFilter.init SolrDispatchFilter.init() done
[junit4:junit4]   2> 6864 T536 oascsi.HttpClientUtil.createClient Creating new http client, config:maxConnections=128&maxConnectionsPerHost=32&followRedirects=false
[junit4:junit4]   2> 7049 T536 oejs.Server.doStart jetty-8.1.8.v20121106
[junit4:junit4]   2> 7052 T536 oejs.AbstractConnector.doStart Started SocketConnector@127.0.0.1:11434
[junit4:junit4]   2> 7053 T536 oass.SolrDispatchFilter.init SolrDispatchFilter.init()
[junit4:junit4]   2> 7053 T536 oasc.SolrResourceLoader.locateSolrHome JNDI not configured for solr (NoInitialContextEx)
[junit4:junit4]   2> 7054 T536 oasc.SolrResourceLoader.locateSolrHome using system property solr.solr.home: /usr/home/hudson/hudson-slave/workspace/Lucene-Solr-Tests-trunk-java7/solr/build/solr-core/test/J0/./org.apache.solr.cloud.ChaosMonkeySafeLeaderTest-jetty2-1360765980395
[junit4:junit4]   2> 7054 T536 oasc.CoreContainer$Initializer.initialize looking for solr.xml: /usr/home/hudson/hudson-slave/workspace/Lucene-Solr-Tests-trunk-java7/solr/build/solr-core/test/J0/./org.apache.solr.cloud.ChaosMonkeySafeLeaderTest-jetty2-1360765980395/solr.xml
[junit4:junit4]   2> 7055 T536 oasc.CoreContainer.<init> New CoreContainer 685138035
[junit4:junit4]   2> 7055 T536 oasc.CoreContainer.load Loading CoreContainer using Solr Home: '/usr/home/hudson/hudson-slave/workspace/Lucene-Solr-Tests-trunk-java7/solr/build/solr-core/test/J0/./org.apache.solr.cloud.ChaosMonkeySafeLeaderTest-jetty2-1360765980395/'
[junit4:junit4]   2> 7056 T536 oasc.SolrResourceLoader.<init> new SolrResourceLoader for directory: '/usr/home/hudson/hudson-slave/workspace/Lucene-Solr-Tests-trunk-java7/solr/build/solr-core/test/J0/./org.apache.solr.cloud.ChaosMonkeySafeLeaderTest-jetty2-1360765980395/'
[junit4:junit4]   2> 7115 T536 oashc.HttpShardHandlerFactory.getParameter Setting socketTimeout to: 60000
[junit4:junit4]   2> 7115 T536 oashc.HttpShardHandlerFactory.getParameter Setting urlScheme to: http://
[junit4:junit4]   2> 7116 T536 oashc.HttpShardHandlerFactory.getParameter Setting connTimeout to: 15000
[junit4:junit4]   2> 7116 T536 oashc.HttpShardHandlerFactory.getParameter Setting maxConnectionsPerHost to: 20
[junit4:junit4]   2> 7117 T536 oashc.HttpShardHandlerFactory.getParameter Setting corePoolSize to: 0
[junit4:junit4]   2> 7117 T536 oashc.HttpShardHandlerFactory.getParameter Setting maximumPoolSize to: 2147483647
[junit4:junit4]   2> 7118 T536 oashc.HttpShardHandlerFactory.getParameter Setting maxThreadIdleTime to: 5
[junit4:junit4]   2> 7118 T536 oashc.HttpShardHandlerFactory.getParameter Setting sizeOfQueue to: -1
[junit4:junit4]   2> 7118 T536 oashc.HttpShardHandlerFactory.getParameter Setting fairnessPolicy to: false
[junit4:junit4]   2> 7119 T536 oascsi.HttpClientUtil.createClient Creating new http client, config:maxConnectionsPerHost=20&maxConnections=10000&socketTimeout=60000&connTimeout=15000&retry=false
[junit4:junit4]   2> 7141 T536 oasc.CoreContainer.load Registering Log Listener
[junit4:junit4]   2> 7160 T536 oasc.CoreContainer.initZooKeeper Zookeeper client=127.0.0.1:47126/solr
[junit4:junit4]   2> 7161 T536 oasc.ZkController.checkChrootPath zkHost includes chroot
[junit4:junit4]   2> 7162 T536 oaz.ZooKeeper.<init> Initiating client connection, connectString=127.0.0.1:47126 sessionTimeout=60000 watcher=org.apache.solr.common.cloud.ConnectionManager@163e1573
[junit4:junit4]   2> 7163 T536 oascc.ConnectionManager.waitForConnected Waiting for client to connect to ZooKeeper
[junit4:junit4]   2> 7163 T589 oaz.ClientCnxn$SendThread.logStartConnect Opening socket connection to server localhost/127.0.0.1:47126. Will not attempt to authenticate using SASL (access denied ("javax.security.auth.AuthPermission" "getLoginConfiguration"))
[junit4:junit4]   2> 7164 T589 oaz.ClientCnxn$SendThread.primeConnection Socket connection established to localhost/127.0.0.1:47126, initiating session
[junit4:junit4]   2> 7164 T538 oazs.NIOServerCnxnFactory.run Accepted socket connection from /140.211.11.196:60793
[junit4:junit4]   2> 7165 T538 oazs.ZooKeeperServer.processConnectRequest Client attempting to establish new session at /140.211.11.196:60793
[junit4:junit4]   2> 7167 T540 oazs.ZooKeeperServer.finishSessionInit Established session 0x13cd3f8f4190007 with negotiated timeout 20000 for client /140.211.11.196:60793
[junit4:junit4]   2> 7167 T589 oaz.ClientCnxn$SendThread.onConnected Session establishment complete on server localhost/127.0.0.1:47126, sessionid = 0x13cd3f8f4190007, negotiated timeout = 20000
[junit4:junit4]   2> 7167 T590 oascc.ConnectionManager.process Watcher org.apache.solr.common.cloud.ConnectionManager@163e1573 name:ZooKeeperConnection Watcher:127.0.0.1:47126 got event WatchedEvent state:SyncConnected type:None path:null path:null type:None
[junit4:junit4]   2> 7167 T536 oascc.ConnectionManager.waitForConnected Client is connected to ZooKeeper
[junit4:junit4]   2> 7169 T541 oazs.PrepRequestProcessor.pRequest2Txn Processed session termination for sessionid: 0x13cd3f8f4190007
[junit4:junit4]   2> 7181 T590 oaz.ClientCnxn$EventThread.run EventThread shut down
[junit4:junit4]   2> 7182 T538 oazs.NIOServerCnxn.closeSock Closed socket connection for client /140.211.11.196:60793 which had sessionid 0x13cd3f8f4190007
[junit4:junit4]   2> 7181 T536 oaz.ZooKeeper.close Session: 0x13cd3f8f4190007 closed
[junit4:junit4]   2> 7182 T536 oascsi.HttpClientUtil.createClient Creating new http client, config:maxConnections=500&maxConnectionsPerHost=16&socketTimeout=60000&connTimeout=15000
[junit4:junit4]   2> 7195 T536 oaz.ZooKeeper.<init> Initiating client connection, connectString=127.0.0.1:47126/solr sessionTimeout=30000 watcher=org.apache.solr.common.cloud.ConnectionManager@5af1752b
[junit4:junit4]   2> 7196 T536 oascc.ConnectionManager.waitForConnected Waiting for client to connect to ZooKeeper
[junit4:junit4]   2> 7197 T591 oaz.ClientCnxn$SendThread.logStartConnect Opening socket connection to server localhost/127.0.0.1:47126. Will not attempt to authenticate using SASL (access denied ("javax.security.auth.AuthPermission" "getLoginConfiguration"))
[junit4:junit4]   2> 7197 T591 oaz.ClientCnxn$SendThread.primeConnection Socket connection established to localhost/127.0.0.1:47126, initiating session
[junit4:junit4]   2> 7197 T538 oazs.NIOServerCnxnFactory.run Accepted socket connection from /140.211.11.196:47901
[junit4:junit4]   2> 7198 T538 oazs.ZooKeeperServer.processConnectRequest Client attempting to establish new session at /140.211.11.196:47901
[junit4:junit4]   2> 7199 T540 oazs.ZooKeeperServer.finishSessionInit Established session 0x13cd3f8f4190008 with negotiated timeout 20000 for client /140.211.11.196:47901
[junit4:junit4]   2> 7199 T591 oaz.ClientCnxn$SendThread.onConnected Session establishment complete on server localhost/127.0.0.1:47126, sessionid = 0x13cd3f8f4190008, negotiated timeout = 20000
[junit4:junit4]   2> 7200 T592 oascc.ConnectionManager.process Watcher org.apache.solr.common.cloud.ConnectionManager@5af1752b name:ZooKeeperConnection Watcher:127.0.0.1:47126/solr got event WatchedEvent state:SyncConnected type:None path:null path:null type:None
[junit4:junit4]   2> 7200 T536 oascc.ConnectionManager.waitForConnected Client is connected to ZooKeeper
[junit4:junit4]   2> 7201 T541 oazs.PrepRequestProcessor.pRequest Got user-level KeeperException when processing sessionid:0x13cd3f8f4190008 type:create cxid:0x1 zxid:0x6c txntype:-1 reqpath:n/a Error Path:/solr/overseer Error:KeeperErrorCode = NodeExists for /solr/overseer
[junit4:junit4]   2> 7203 T541 oazs.PrepRequestProcessor.pRequest Got user-level KeeperException when processing sessionid:0x13cd3f8f4190008 type:create cxid:0x2 zxid:0x6d txntype:-1 reqpath:n/a Error Path:/solr/overseer Error:KeeperErrorCode = NodeExists for /solr/overseer
[junit4:junit4]   2> 7211 T536 oascc.ZkStateReader.createClusterStateWatchersAndUpdate Updating cluster state from ZooKeeper... 
[junit4:junit4]   2> 7214 T536 oasc.ZkController.createEphemeralLiveNode Register node as live in ZooKeeper:/live_nodes/127.0.0.1:11434_
[junit4:junit4]   2> 7215 T541 oazs.PrepRequestProcessor.pRequest Got user-level KeeperException when processing sessionid:0x13cd3f8f4190008 type:delete cxid:0x9 zxid:0x6e txntype:-1 reqpath:n/a Error Path:/solr/live_nodes/127.0.0.1:11434_ Error:KeeperErrorCode = NoNode for /solr/live_nodes/127.0.0.1:11434_
[junit4:junit4]   2> 7216 T536 oascc.SolrZkClient.makePath makePath: /live_nodes/127.0.0.1:11434_
[junit4:junit4]   2> 7219 T577 oascc.ZkStateReader$2.process A cluster state change: WatchedEvent state:SyncConnected type:NodeChildrenChanged path:/live_nodes, has occurred - updating... (live nodes size: 2)
[junit4:junit4]   2> 7219 T558 oascc.ZkStateReader$3.process Updating live nodes... (3)
[junit4:junit4]   2> 7219 T592 oascc.ZkStateReader$3.process Updating live nodes... (3)
[junit4:junit4]   2> 7219 T558 oascc.ZkStateReader$2.process A cluster state change: WatchedEvent state:SyncConnected type:NodeChildrenChanged path:/live_nodes, has occurred - updating... (live nodes size: 3)
[junit4:junit4]   2> 7219 T564 oascc.ZkStateReader$3.process Updating live nodes... (3)
[junit4:junit4]   2> 7220 T564 oascc.ZkStateReader$2.process A cluster state change: WatchedEvent state:SyncConnected type:NodeChildrenChanged path:/live_nodes, has occurred - updating... (live nodes size: 3)
[junit4:junit4]   2> 7221 T577 oascc.ZkStateReader$3.process Updating live nodes... (3)
[junit4:junit4]   2> 7232 T593 oasc.CoreContainer.create Creating SolrCore 'collection1' using instanceDir: /usr/home/hudson/hudson-slave/workspace/Lucene-Solr-Tests-trunk-java7/solr/build/solr-core/test/J0/./org.apache.solr.cloud.ChaosMonkeySafeLeaderTest-jetty2-1360765980395/collection1
[junit4:junit4]   2> 7233 T593 oasc.ZkController.createCollectionZkNode Check for collection zkNode:collection1
[junit4:junit4]   2> 7233 T593 oasc.ZkController.createCollectionZkNode Collection zkNode exists
[junit4:junit4]   2> 7234 T593 oasc.ZkController.readConfigName Load collection config from:/collections/collection1
[junit4:junit4]   2> 7235 T593 oasc.SolrResourceLoader.<init> new SolrResourceLoader for directory: '/usr/home/hudson/hudson-slave/workspace/Lucene-Solr-Tests-trunk-java7/solr/build/solr-core/test/J0/./org.apache.solr.cloud.ChaosMonkeySafeLeaderTest-jetty2-1360765980395/collection1/'
[junit4:junit4]   2> 7236 T593 oasc.SolrResourceLoader.replaceClassLoader Adding 'file:/usr/home/hudson/hudson-slave/workspace/Lucene-Solr-Tests-trunk-java7/solr/build/solr-core/test/J0/org.apache.solr.cloud.ChaosMonkeySafeLeaderTest-jetty2-1360765980395/collection1/lib/README' to classloader
[junit4:junit4]   2> 7237 T593 oasc.SolrResourceLoader.replaceClassLoader Adding 'file:/usr/home/hudson/hudson-slave/workspace/Lucene-Solr-Tests-trunk-java7/solr/build/solr-core/test/J0/org.apache.solr.cloud.ChaosMonkeySafeLeaderTest-jetty2-1360765980395/collection1/lib/classes/' to classloader
[junit4:junit4]   2> 7293 T593 oasc.SolrConfig.<init> Using Lucene MatchVersion: LUCENE_50
[junit4:junit4]   2> 7381 T593 oasc.SolrConfig.<init> Loaded SolrConfig: solrconfig.xml
[junit4:junit4]   2> 7482 T593 oass.IndexSchema.readSchema Reading Solr Schema
[junit4:junit4]   2> 7489 T593 oass.IndexSchema.readSchema Schema name=test
[junit4:junit4]   2> 8108 T593 oass.OpenExchangeRatesOrgProvider.init Initialized with rates=open-exchange-rates.json, refreshInterval=1440.
[junit4:junit4]   2> 8120 T593 oass.IndexSchema.readSchema default search field in schema is text
[junit4:junit4]   2> 8124 T593 oass.IndexSchema.readSchema unique key field: id
[junit4:junit4]   2> 8141 T593 oass.FileExchangeRateProvider.reload Reloading exchange rates from file currency.xml
[junit4:junit4]   2> 8146 T593 oass.FileExchangeRateProvider.reload Reloading exchange rates from file currency.xml
[junit4:junit4]   2> 8151 T593 oass.OpenExchangeRatesOrgProvider.reload Reloading exchange rates from open-exchange-rates.json
[junit4:junit4]   2> 8153 T593 oass.OpenExchangeRatesOrgProvider.reload Reloading exchange rates from open-exchange-rates.json
[junit4:junit4]   2> 8155 T593 oasc.SolrCore.<init> [collection1] Opening new SolrCore at /usr/home/hudson/hudson-slave/workspace/Lucene-Solr-Tests-trunk-java7/solr/build/solr-core/test/J0/./org.apache.solr.cloud.ChaosMonkeySafeLeaderTest-jetty2-1360765980395/collection1/, dataDir=./org.apache.solr.cloud.ChaosMonkeySafeLeaderTest-1360765973520/jetty2/
[junit4:junit4]   2> 8155 T593 oasc.JmxMonitoredMap.<init> JMX monitoring is enabled. Adding Solr mbeans to JMX Server: com.sun.jmx.mbeanserver.JmxMBeanServer@2f29271e
[junit4:junit4]   2> 8156 T593 oasc.SolrCore.initDirectoryFactory solr.StandardDirectoryFactory
[junit4:junit4]   2> 8156 T593 oasc.CachingDirectoryFactory.get return new directory for /usr/home/hudson/hudson-slave/workspace/Lucene-Solr-Tests-trunk-java7/solr/build/solr-core/test/J0/./org.apache.solr.cloud.ChaosMonkeySafeLeaderTest-1360765973520/jetty2 forceNew:false
[junit4:junit4]   2> 8157 T593 oasc.CachingDirectoryFactory.close Releasing directory:/usr/home/hudson/hudson-slave/workspace/Lucene-Solr-Tests-trunk-java7/solr/build/solr-core/test/J0/./org.apache.solr.cloud.ChaosMonkeySafeLeaderTest-1360765973520/jetty2
[junit4:junit4]   2> 8157 T593 oasc.SolrCore.getNewIndexDir New index directory detected: old=null new=./org.apache.solr.cloud.ChaosMonkeySafeLeaderTest-1360765973520/jetty2/index/
[junit4:junit4]   2> 8158 T593 oasc.SolrCore.initIndex WARNING [collection1] Solr index directory './org.apache.solr.cloud.ChaosMonkeySafeLeaderTest-1360765973520/jetty2/index' doesn't exist. Creating new index...
[junit4:junit4]   2> 8159 T593 oasc.CachingDirectoryFactory.get return new directory for /usr/home/hudson/hudson-slave/workspace/Lucene-Solr-Tests-trunk-java7/solr/build/solr-core/test/J0/./org.apache.solr.cloud.ChaosMonkeySafeLeaderTest-1360765973520/jetty2/index forceNew:false
[junit4:junit4]   2> 8164 T593 oasc.SolrDeletionPolicy.onCommit SolrDeletionPolicy.onCommit: commits:num=1
[junit4:junit4]   2> 		commit{dir=RateLimitedDirectoryWrapper(org.apache.lucene.store.NIOFSDirectory@/usr/home/hudson/hudson-slave/workspace/Lucene-Solr-Tests-trunk-java7/solr/build/solr-core/test/J0/org.apache.solr.cloud.ChaosMonkeySafeLeaderTest-1360765973520/jetty2/index lockFactory=org.apache.lucene.store.NativeFSLockFactory@232e35d8),segFN=segments_1,generation=1,filenames=[segments_1]
[junit4:junit4]   2> 8164 T593 oasc.SolrDeletionPolicy.updateCommits newest commit = 1[segments_1]
[junit4:junit4]   2> 8165 T593 oasc.CachingDirectoryFactory.close Releasing directory:/usr/home/hudson/hudson-slave/workspace/Lucene-Solr-Tests-trunk-java7/solr/build/solr-core/test/J0/./org.apache.solr.cloud.ChaosMonkeySafeLeaderTest-1360765973520/jetty2/index
[junit4:junit4]   2> 8166 T593 oasc.SolrCore.initWriters created xml: solr.XMLResponseWriter
[junit4:junit4]   2> 8168 T593 oasup.UpdateRequestProcessorChain.init inserting DistributedUpdateProcessorFactory into updateRequestProcessorChain "dedupe"
[junit4:junit4]   2> 8168 T593 oasup.UpdateRequestProcessorChain.init inserting DistributedUpdateProcessorFactory into updateRequestProcessorChain "dedupe-allfields"
[junit4:junit4]   2> 8168 T593 oasup.UpdateRequestProcessorChain.init inserting DistributedUpdateProcessorFactory into updateRequestProcessorChain "stored_sig"
[junit4:junit4]   2> 8169 T593 oasup.UpdateRequestProcessorChain.init inserting DistributedUpdateProcessorFactory into updateRequestProcessorChain "uniq-fields"
[junit4:junit4]   2> 8169 T593 oasup.UpdateRequestProcessorChain.init inserting DistributedUpdateProcessorFactory into updateRequestProcessorChain "distrib-dup-test-chain-implicit"
[junit4:junit4]   2> 8170 T593 oasc.RequestHandlers.initHandlersFromConfig adding lazy requestHandler: solr.ReplicationHandler
[junit4:junit4]   2> 8170 T593 oasc.RequestHandlers.initHandlersFromConfig created /replication: solr.ReplicationHandler
[junit4:junit4]   2> 8171 T593 oasc.RequestHandlers.initHandlersFromConfig created standard: solr.StandardRequestHandler
[junit4:junit4]   2> 8171 T593 oasc.RequestHandlers.initHandlersFromConfig created /get: solr.RealTimeGetHandler
[junit4:junit4]   2> 8172 T593 oasc.RequestHandlers.initHandlersFromConfig created dismax: solr.SearchHandler
[junit4:junit4]   2> 8172 T593 oasc.RequestHandlers.initHandlersFromConfig created mock: org.apache.solr.core.MockQuerySenderListenerReqHandler
[junit4:junit4]   2> 8173 T593 oasc.RequestHandlers.initHandlersFromConfig created /admin/: org.apache.solr.handler.admin.AdminHandlers
[junit4:junit4]   2> 8173 T593 oasc.RequestHandlers.initHandlersFromConfig created defaults: solr.StandardRequestHandler
[junit4:junit4]   2> 8174 T593 oasc.RequestHandlers.initHandlersFromConfig adding lazy requestHandler: solr.StandardRequestHandler
[junit4:junit4]   2> 8174 T593 oasc.RequestHandlers.initHandlersFromConfig created lazy: solr.StandardRequestHandler
[junit4:junit4]   2> 8175 T593 oasc.RequestHandlers.initHandlersFromConfig created /update: solr.UpdateRequestHandler
[junit4:junit4]   2> 8175 T593 oasc.RequestHandlers.initHandlersFromConfig created /terms: org.apache.solr.handler.component.SearchHandler
[junit4:junit4]   2> 8176 T593 oasc.RequestHandlers.initHandlersFromConfig created spellCheckCompRH: org.apache.solr.handler.component.SearchHandler
[junit4:junit4]   2> 8176 T593 oasc.RequestHandlers.initHandlersFromConfig created spellCheckCompRH_Direct: org.apache.solr.handler.component.SearchHandler
[junit4:junit4]   2> 8177 T593 oasc.RequestHandlers.initHandlersFromConfig created spellCheckWithWordbreak: org.apache.solr.handler.component.SearchHandler
[junit4:junit4]   2> 8177 T593 oasc.RequestHandlers.initHandlersFromConfig created spellCheckWithWordbreak_Direct: org.apache.solr.handler.component.SearchHandler
[junit4:junit4]   2> 8178 T593 oasc.RequestHandlers.initHandlersFromConfig created spellCheckCompRH1: org.apache.solr.handler.component.SearchHandler
[junit4:junit4]   2> 8179 T593 oasc.RequestHandlers.initHandlersFromConfig created mltrh: org.apache.solr.handler.component.SearchHandler
[junit4:junit4]   2> 8179 T593 oasc.RequestHandlers.initHandlersFromConfig created tvrh: org.apache.solr.handler.component.SearchHandler
[junit4:junit4]   2> 8180 T593 oasc.RequestHandlers.initHandlersFromConfig created /mlt: solr.MoreLikeThisHandler
[junit4:junit4]   2> 8180 T593 oasc.RequestHandlers.initHandlersFromConfig created /debug/dump: solr.DumpRequestHandler
[junit4:junit4]   2> 8193 T593 oashl.XMLLoader.init xsltCacheLifetimeSeconds=60
[junit4:junit4]   2> 8198 T593 oasc.SolrCore.initDeprecatedSupport WARNING solrconfig.xml uses deprecated <admin/gettableFiles>, Please update your config to use the ShowFileRequestHandler.
[junit4:junit4]   2> 8199 T593 oasc.SolrCore.initDeprecatedSupport WARNING adding ShowFileRequestHandler with hidden files: [SCHEMA.XML, OLD_SYNONYMS.TXT, STOPWORDS.TXT, PROTWORDS.TXT, OPEN-EXCHANGE-RATES.JSON, SYNONYMS.TXT, CURRENCY.XML, MAPPING-ISOLATIN1ACCENT.TXT]
[junit4:junit4]   2> 8201 T593 oasc.CachingDirectoryFactory.close Releasing directory:/usr/home/hudson/hudson-slave/workspace/Lucene-Solr-Tests-trunk-java7/solr/build/solr-core/test/J0/./org.apache.solr.cloud.ChaosMonkeySafeLeaderTest-1360765973520/jetty2
[junit4:junit4]   2> 8203 T593 oass.SolrIndexSearcher.<init> Opening Searcher@37e69a99 main
[junit4:junit4]   2> 8204 T593 oasu.CommitTracker.<init> Hard AutoCommit: disabled
[junit4:junit4]   2> 8204 T593 oasu.CommitTracker.<init> Soft AutoCommit: disabled
[junit4:junit4]   2> 8205 T593 oashc.SpellCheckComponent.inform Initializing spell checkers
[junit4:junit4]   2> 8243 T593 oass.DirectSolrSpellChecker.init init: {name=direct,classname=DirectSolrSpellChecker,field=lowerfilt,minQueryLength=3}
[junit4:junit4]   2> 8343 T559 oascc.ZkStateReader.updateClusterState Updating cloud state from ZooKeeper... 
[junit4:junit4]   2> 8343 T559 oasc.Overseer$ClusterStateUpdater.updateState Update state numShards=3 message={
[junit4:junit4]   2> 	  "operation":"state",
[junit4:junit4]   2> 	  "numShards":"3",
[junit4:junit4]   2> 	  "shard":"shard1",
[junit4:junit4]   2> 	  "roles":null,
[junit4:junit4]   2> 	  "state":"active",
[junit4:junit4]   2> 	  "core":"collection1",
[junit4:junit4]   2> 	  "collection":"collection1",
[junit4:junit4]   2> 	  "node_name":"127.0.0.1:60875_",
[junit4:junit4]   2> 	  "base_url":"http://127.0.0.1:60875"}
[junit4:junit4]   2> 8407 T564 oascc.ZkStateReader$2.process A cluster state change: WatchedEvent state:SyncConnected type:NodeDataChanged path:/clusterstate.json, has occurred - updating... (live nodes size: 3)
[junit4:junit4]   2> 8407 T592 oascc.ZkStateReader$2.process A cluster state change: WatchedEvent state:SyncConnected type:NodeDataChanged path:/clusterstate.json, has occurred - updating... (live nodes size: 3)
[junit4:junit4]   2> 8407 T558 oascc.ZkStateReader$2.process A cluster state change: WatchedEvent state:SyncConnected type:NodeDataChanged path:/clusterstate.json, has occurred - updating... (live nodes size: 3)
[junit4:junit4]   2> 8407 T577 oascc.ZkStateReader$2.process A cluster state change: WatchedEvent state:SyncConnected type:NodeDataChanged path:/clusterstate.json, has occurred - updating... (live nodes size: 3)
[junit4:junit4]   2> 8430 T594 oasc.SolrCore.registerSearcher [collection1] Registered new searcher Searcher@37e69a99 main{StandardDirectoryReader(segments_1:1)}
[junit4:junit4]   2> 8437 T593 oasc.ZkController.publish publishing core=collection1 state=down
[junit4:junit4]   2> 8437 T593 oasc.ZkController.publish numShards not found on descriptor - reading it from system property
[junit4:junit4]   2> 9913 T559 oascc.ZkStateReader.updateClusterState Updating cloud state from ZooKeeper... 
[junit4:junit4]   2> 9914 T559 oasc.Overseer$ClusterStateUpdater.updateState Update state numShards=3 message={
[junit4:junit4]   2> 	  "operation":"state",
[junit4:junit4]   2> 	  "numShards":"3",
[junit4:junit4]   2> 	  "shard":null,
[junit4:junit4]   2> 	  "roles":null,
[junit4:junit4]   2> 	  "state":"down",
[junit4:junit4]   2> 	  "core":"collection1",
[junit4:junit4]   2> 	  "collection":"collection1",
[junit4:junit4]   2> 	  "node_name":"127.0.0.1:11434_",
[junit4:junit4]   2> 	  "base_url":"http://127.0.0.1:11434"}
[junit4:junit4]   2> 9914 T559 oasc.Overseer$ClusterStateUpdater.updateState Collection already exists with numShards=3
[junit4:junit4]   2> 9914 T559 oasc.Overseer$ClusterStateUpdater.updateState Assigning new node to shard shard=shard2
[junit4:junit4]   2> 9926 T592 oascc.ZkStateReader$2.process A cluster state change: WatchedEvent state:SyncConnected type:NodeDataChanged path:/clusterstate.json, has occurred - updating... (live nodes size: 3)
[junit4:junit4]   2> 9926 T577 oascc.ZkStateReader$2.process A cluster state change: WatchedEvent state:SyncConnected type:NodeDataChanged path:/clusterstate.json, has occurred - updating... (live nodes size: 3)
[junit4:junit4]   2> 9927 T558 oascc.ZkStateReader$2.process A cluster state change: WatchedEvent state:SyncConnected type:NodeDataChanged path:/clusterstate.json, has occurred - updating... (live nodes size: 3)
[junit4:junit4]   2> 9926 T564 oascc.ZkStateReader$2.process A cluster state change: WatchedEvent state:SyncConnected type:NodeDataChanged path:/clusterstate.json, has occurred - updating... (live nodes size: 3)
[junit4:junit4]   2> 10441 T593 oasc.CoreContainer.registerCore registering core: collection1
[junit4:junit4]   2> 10441 T593 oasc.ZkController.register Register replica - core:collection1 address:http://127.0.0.1:11434 collection:collection1 shard:shard2
[junit4:junit4]   2> 10442 T593 oascc.SolrZkClient.makePath makePath: /collections/collection1/leader_elect/shard2/election
[junit4:junit4]   2> 10457 T541 oazs.PrepRequestProcessor.pRequest Got user-level KeeperException when processing sessionid:0x13cd3f8f4190008 type:delete cxid:0x46 zxid:0x7d txntype:-1 reqpath:n/a Error Path:/solr/collections/collection1/leaders/shard2 Error:KeeperErrorCode = NoNode for /solr/collections/collection1/leaders/shard2
[junit4:junit4]   2> 10457 T593 oasc.ShardLeaderElectionContext.runLeaderProcess Running the leader process.
[junit4:junit4]   2> 10458 T541 oazs.PrepRequestProcessor.pRequest Got user-level KeeperException when processing sessionid:0x13cd3f8f4190008 type:create cxid:0x47 zxid:0x7e txntype:-1 reqpath:n/a Error Path:/solr/overseer Error:KeeperErrorCode = NodeExists for /solr/overseer
[junit4:junit4]   2> 10468 T593 oasc.ShardLeaderElectionContext.waitForReplicasToComeUp Enough replicas found to continue.
[junit4:junit4]   2> 10469 T593 oasc.ShardLeaderElectionContext.runLeaderProcess I may be the new leader - try and sync
[junit4:junit4]   2> 10469 T593 oasc.SyncStrategy.sync Sync replicas to http://127.0.0.1:11434/collection1/
[junit4:junit4]   2> 10469 T593 oasc.SyncStrategy.syncReplicas Sync Success - now sync replicas to me
[junit4:junit4]   2> 10469 T593 oasc.SyncStrategy.syncToMe http://127.0.0.1:11434/collection1/ has no replicas
[junit4:junit4]   2> 10469 T593 oasc.ShardLeaderElectionContext.runLeaderProcess I am the new leader: http://127.0.0.1:11434/collection1/
[junit4:junit4]   2> 10469 T593 oascc.SolrZkClient.makePath makePath: /collections/collection1/leaders/shard2
[junit4:junit4]   2> 10473 T541 oazs.PrepRequestProcessor.pRequest Got user-level KeeperException when processing sessionid:0x13cd3f8f4190008 type:create cxid:0x50 zxid:0x81 txntype:-1 reqpath:n/a Error Path:/solr/overseer Error:KeeperErrorCode = NodeExists for /solr/overseer
[junit4:junit4]   2> 11432 T559 oascc.ZkStateReader.updateClusterState Updating cloud state from ZooKeeper... 
[junit4:junit4]   2> 11452 T592 oascc.ZkStateReader$2.process A cluster state change: WatchedEvent state:SyncConnected type:NodeDataChanged path:/clusterstate.json, has occurred - updating... (live nodes size: 3)
[junit4:junit4]   2> 11452 T577 oascc.ZkStateReader$2.process A cluster state change: WatchedEvent state:SyncConnected type:NodeDataChanged path:/clusterstate.json, has occurred - updating... (live nodes size: 3)
[junit4:junit4]   2> 11452 T558 oascc.ZkStateReader$2.process A cluster state change: WatchedEvent state:SyncConnected type:NodeDataChanged path:/clusterstate.json, has occurred - updating... (live nodes size: 3)
[junit4:junit4]   2> 11452 T564 oascc.ZkStateReader$2.process A cluster state change: WatchedEvent state:SyncConnected type:NodeDataChanged path:/clusterstate.json, has occurred - updating... (live nodes size: 3)
[junit4:junit4]   2> 11495 T593 oasc.ZkController.register We are http://127.0.0.1:11434/collection1/ and leader is http://127.0.0.1:11434/collection1/
[junit4:junit4]   2> 11495 T593 oasc.ZkController.register No LogReplay needed for core=collection1 baseURL=http://127.0.0.1:11434
[junit4:junit4]   2> 11495 T593 oasc.ZkController.checkRecovery I am the leader, no recovery necessary
[junit4:junit4]   2> 11495 T593 oasc.ZkController.publish publishing core=collection1 state=active
[junit4:junit4]   2> 11496 T593 oasc.ZkController.publish numShards not found on descriptor - reading it from system property
[junit4:junit4]   2> 11497 T593 oascc.ZkStateReader.updateClusterState Updating cloud state from ZooKeeper... 
[junit4:junit4]   2> 11498 T536 oass.SolrDispatchFilter.init user.dir=/usr/home/hudson/hudson-slave/workspace/Lucene-Solr-Tests-trunk-java7/solr/build/solr-core/test/J0
[junit4:junit4]   2> 11499 T536 oass.SolrDispatchFilter.init SolrDispatchFilter.init() done
[junit4:junit4]   2> 11500 T536 oascsi.HttpClientUtil.createClient Creating new http client, config:maxConnections=128&maxConnectionsPerHost=32&followRedirects=false
[junit4:junit4]   2> 11717 T536 oejs.Server.doStart jetty-8.1.8.v20121106
[junit4:junit4]   2> 11720 T536 oejs.AbstractConnector.doStart Started SocketConnector@127.0.0.1:39906
[junit4:junit4]   2> 11721 T536 oass.SolrDispatchFilter.init SolrDispatchFilter.init()
[junit4:junit4]   2> 11721 T536 oasc.SolrResourceLoader.locateSolrHome JNDI not configured for solr (NoInitialContextEx)
[junit4:junit4]   2> 11722 T536 oasc.SolrResourceLoader.locateSolrHome using system property solr.solr.home: /usr/home/hudson/hudson-slave/workspace/Lucene-Solr-Tests-trunk-java7/solr/build/solr-core/test/J0/./org.apache.solr.cloud.ChaosMonkeySafeLeaderTest-jetty3-1360765985030
[junit4:junit4]   2> 11722 T536 oasc.CoreContainer$Initializer.initialize looking for solr.xml: /usr/home/hudson/hudson-slave/workspace/Lucene-Solr-Tests-trunk-java7/solr/build/solr-core/test/J0/./org.apache.solr.cloud.ChaosMonkeySafeLeaderTest-jetty3-1360765985030/solr.xml
[junit4:junit4]   2> 11722 T536 oasc.CoreContainer.<init> New CoreContainer 884096470
[junit4:junit4]   2> 11723 T536 oasc.CoreContainer.load Loading CoreContainer using Solr Home: '/usr/home/hudson/hudson-slave/workspace/Lucene-Solr-Tests-trunk-java7/solr/build/solr-core/test/J0/./org.apache.solr.cloud.ChaosMonkeySafeLeaderTest-jetty3-1360765985030/'
[junit4:junit4]   2> 11723 T536 oasc.SolrResourceLoader.<init> new SolrResourceLoader for directory: '/usr/home/hudson/hudson-slave/workspace/Lucene-Solr-Tests-trunk-java7/solr/build/solr-core/test/J0/./org.apache.solr.cloud.ChaosMonkeySafeLeaderTest-jetty3-1360765985030/'
[junit4:junit4]   2> 11798 T536 oashc.HttpShardHandlerFactory.getParameter Setting socketTimeout to: 60000
[junit4:junit4]   2> 11799 T536 oashc.HttpShardHandlerFactory.getParameter Setting urlScheme to: http://
[junit4:junit4]   2> 11799 T536 oashc.HttpShardHandlerFactory.getParameter Setting connTimeout to: 15000
[junit4:junit4]   2> 11800 T536 oashc.HttpShardHandlerFactory.getParameter Setting maxConnectionsPerHost to: 20
[junit4:junit4]   2> 11800 T536 oashc.HttpShardHandlerFactory.getParameter Setting corePoolSize to: 0
[junit4:junit4]   2> 11801 T536 oashc.HttpShardHandlerFactory.getParameter Setting maximumPoolSize to: 2147483647
[junit4:junit4]   2> 11801 T536 oashc.HttpShardHandlerFactory.getParameter Setting maxThreadIdleTime to: 5
[junit4:junit4]   2> 11801 T536 oashc.HttpShardHandlerFactory.getParameter Setting sizeOfQueue to: -1
[junit4:junit4]   2> 11802 T536 oashc.HttpShardHandlerFactory.getParameter Setting fairnessPolicy to: false
[junit4:junit4]   2> 11802 T536 oascsi.HttpClientUtil.createClient Creating new http client, config:maxConnectionsPerHost=20&maxConnections=10000&socketTimeout=60000&connTimeout=15000&retry=false
[junit4:junit4]   2> 11827 T536 oasc.CoreContainer.load Registering Log Listener
[junit4:junit4]   2> 11847 T536 oasc.CoreContainer.initZooKeeper Zookeeper client=127.0.0.1:47126/solr
[junit4:junit4]   2> 11847 T536 oasc.ZkController.checkChrootPath zkHost includes chroot
[junit4:junit4]   2> 11848 T536 oaz.ZooKeeper.<init> Initiating client connection, connectString=127.0.0.1:47126 sessionTimeout=60000 watcher=org.apache.solr.common.cloud.ConnectionManager@20994ae9
[junit4:junit4]   2> 11849 T536 oascc.ConnectionManager.waitForConnected Waiting for client to connect to ZooKeeper
[junit4:junit4]   2> 11849 T604 oaz.ClientCnxn$SendThread.logStartConnect Opening socket connection to server localhost/127.0.0.1:47126. Will not attempt to authenticate using SASL (access denied ("javax.security.auth.AuthPermission" "getLoginConfiguration"))
[junit4:junit4]   2> 11850 T604 oaz.ClientCnxn$SendThread.primeConnection Socket connection established to localhost/127.0.0.1:47126, initiating session
[junit4:junit4]   2> 11851 T538 oazs.NIOServerCnxnFactory.run Accepted socket connection from /140.211.11.196:54347
[junit4:junit4]   2> 11851 T538 oazs.ZooKeeperServer.processConnectRequest Client attempting to establish new session at /140.211.11.196:54347
[junit4:junit4]   2> 11853 T540 oazs.ZooKeeperServer.finishSessionInit Established session 0x13cd3f8f4190009 with negotiated timeout 20000 for client /140.211.11.196:54347
[junit4:junit4]   2> 11853 T604 oaz.ClientCnxn$SendThread.onConnected Session establishment complete on server localhost/127.0.0.1:47126, sessionid = 0x13cd3f8f4190009, negotiated timeout = 20000
[junit4:junit4]   2> 11854 T605 oascc.ConnectionManager.process Watcher org.apache.solr.common.cloud.ConnectionManager@20994ae9 name:ZooKeeperConnection Watcher:127.0.0.1:47126 got event WatchedEvent state:SyncConnected type:None path:null path:null type:None
[junit4:junit4]   2> 11854 T536 oascc.ConnectionManager.waitForConnected Client is connected to ZooKeeper
[junit4:junit4]   2> 11855 T541 oazs.PrepRequestProcessor.pRequest2Txn Processed session termination for sessionid: 0x13cd3f8f4190009
[junit4:junit4]   2> 11857 T605 oaz.ClientCnxn$EventThread.run EventThread shut down
[junit4:junit4]   2> 11857 T538 oazs.NIOServerCnxn.closeSock Closed socket connection for client /140.211.11.196:54347 which had sessionid 0x13cd3f8f4190009
[junit4:junit4]   2> 11857 T536 oaz.ZooKeeper.close Session: 0x13cd3f8f4190009 closed
[junit4:junit4]   2> 11857 T536 oascsi.HttpClientUtil.createClient Creating new http client, config:maxConnections=500&maxConnectionsPerHost=16&socketTimeout=60000&connTimeout=15000
[junit4:junit4]   2> 11869 T536 oaz.ZooKeeper.<init> Initiating client connection, connectString=127.0.0.1:47126/solr sessionTimeout=30000 watcher=org.apache.solr.common.cloud.ConnectionManager@657c8c0f
[junit4:junit4]   2> 11870 T536 oascc.ConnectionManager.waitForConnected Waiting for client to connect to ZooKeeper
[junit4:junit4]   2> 11870 T606 oaz.ClientCnxn$SendThread.logStartConnect Opening socket connection to server localhost/127.0.0.1:47126. Will not attempt to authenticate using SASL (access denied ("javax.security.auth.AuthPermission" "getLoginConfiguration"))
[junit4:junit4]   2> 11871 T606 oaz.ClientCnxn$SendThread.primeConnection Socket connection established to localhost/127.0.0.1:47126, initiating session
[junit4:junit4]   2> 11871 T538 oazs.NIOServerCnxnFactory.run Accepted socket connection from /140.211.11.196:20865
[junit4:junit4]   2> 11871 T538 oazs.ZooKeeperServer.processConnectRequest Client attempting to establish new session at /140.211.11.196:20865
[junit4:junit4]   2> 11873 T540 oazs.ZooKeeperServer.finishSessionInit Established session 0x13cd3f8f419000a with negotiated timeout 20000 for client /140.211.11.196:20865
[junit4:junit4]   2> 11873 T606 oaz.ClientCnxn$SendThread.onConnected Session establishment complete on server localhost/127.0.0.1:47126, sessionid = 0x13cd3f8f419000a, negotiated timeout = 20000
[junit4:junit4]   2> 11873 T607 oascc.ConnectionManager.process Watcher org.apache.solr.common.cloud.ConnectionManager@657c8c0f name:ZooKeeperConnection Watcher:127.0.0.1:47126/solr got event WatchedEvent state:SyncConnected type:None path:null path:null type:None
[junit4:junit4]   2> 11873 T536 oascc.ConnectionManager.waitForConnected Client is connected to ZooKeeper
[junit4:junit4]   2> 11875 T541 oazs.PrepRequestProcessor.pRequest Got user-level KeeperException when processing sessionid:0x13cd3f8f419000a type:create cxid:0x1 zxid:0x8e txntype:-1 reqpath:n/a Error Path:/solr/overseer Error:KeeperErrorCode = NodeExists for /solr/overseer
[junit4:junit4]   2> 11876 T541 oazs.PrepRequestProcessor.pRequest Got user-level KeeperException when processing sessionid:0x13cd3f8f419000a type:create cxid:0x2 zxid:0x8f txntype:-1 reqpath:n/a Error Path:/solr/overseer Error:KeeperErrorCode = NodeExists for /solr/overseer
[junit4:junit4]   2> 11885 T536 oascc.ZkStateReader.createClusterStateWatchersAndUpdate Updating cluster state from ZooKeeper... 
[junit4:junit4]   2> 11887 T536 oasc.ZkController.createEphemeralLiveNode Register node as live in ZooKeeper:/live_nodes/127.0.0.1:39906_
[junit4:junit4]   2> 11888 T541 oazs.PrepRequestProcessor.pRequest Got user-level KeeperException when processing sessionid:0x13cd3f8f419000a type:delete cxid:0x9 zxid:0x90 txntype:-1 reqpath:n/a Error Path:/solr/live_nodes/127.0.0.1:39906_ Error:KeeperErrorCode = NoNode for /solr/live_nodes/127.0.0.1:39906_
[junit4:junit4]   2> 11889 T536 oascc.SolrZkClient.makePath makePath: /live_nodes/127.0.0.1:39906_
[junit4:junit4]   2> 11899 T577 oascc.ZkStateReader$2.process A cluster state change: WatchedEvent state:SyncConnected type:NodeChildrenChanged path:/live_nodes, has occurred - updating... (live nodes size: 3)
[junit4:junit4]   2> 11900 T564 oascc.ZkStateReader$3.process Updating live nodes... (4)
[junit4:junit4]   2> 11900 T592 oascc.ZkStateReader$3.process Updating live nodes... (4)
[junit4:junit4]   2> 11900 T564 oascc.ZkStateReader$2.process A cluster state change: WatchedEvent state:SyncConnected type:NodeChildrenChanged path:/live_nodes, has occurred - updating... (live nodes size: 4)
[junit4:junit4]   2> 11900 T592 oascc.ZkStateReader$2.process A cluster state change: WatchedEvent state:SyncConnected type:NodeChildrenChanged path:/live_nodes, has occurred - updating... (live nodes size: 4)
[junit4:junit4]   2> 11900 T607 oascc.ZkStateReader$3.process Updating live nodes... (4)
[junit4:junit4]   2> 11900 T558 oascc.ZkStateReader$3.process Updating live nodes... (4)
[junit4:junit4]   2> 11901 T558 oascc.ZkStateReader$2.process A cluster state change: WatchedEvent state:SyncConnected type:NodeChildrenChanged path:/live_nodes, has occurred - updating... (live nodes size: 4)
[junit4:junit4]   2> 11902 T577 oascc.ZkStateReader$3.process Updating live nodes... (4)
[junit4:junit4]   2> 11909 T608 oasc.CoreContainer.create Creating SolrCore 'collection1' using instanceDir: /usr/home/hudson/hudson-slave/workspace/Lucene-Solr-Tests-trunk-java7/solr/build/solr-core/test/J0/./org.apache.solr.cloud.ChaosMonkeySafeLeaderTest-jetty3-1360765985030/collection1
[junit4:junit4]   2> 11910 T608 oasc.ZkController.createCollectionZkNode Check for collection zkNode:collection1
[junit4:junit4]   2> 11910 T608 oasc.ZkController.createCollectionZkNode Collection zkNode exists
[junit4:junit4]   2> 11910 T608 oasc.ZkController.readConfigName Load collection config from:/collections/collection1
[junit4:junit4]   2> 11912 T608 oasc.SolrResourceLoader.<init> new SolrResourceLoader for directory: '/usr/home/hudson/hudson-slave/workspace/Lucene-Solr-Tests-trunk-java7/solr/build/solr-core/test/J0/./org.apache.solr.cloud.ChaosMonkeySafeLeaderTest-jetty3-1360765985030/collection1/'
[junit4:junit4]   2> 11913 T608 oasc.SolrResourceLoader.replaceClassLoader Adding 'file:/usr/home/hudson/hudson-slave/workspace/Lucene-Solr-Tests-trunk-java7/solr/build/solr-core/test/J0/org.apache.solr.cloud.ChaosMonkeySafeLeaderTest-jetty3-1360765985030/collection1/lib/classes/' to classloader
[junit4:junit4]   2> 11914 T608 oasc.SolrResourceLoader.replaceClassLoader Adding 'file:/usr/home/hudson/hudson-slave/workspace/Lucene-Solr-Tests-trunk-java7/solr/build/solr-core/test/J0/org.apache.solr.cloud.ChaosMonkeySafeLeaderTest-jetty3-1360765985030/collection1/lib/README' to classloader
[junit4:junit4]   2> 11972 T608 oasc.SolrConfig.<init> Using Lucene MatchVersion: LUCENE_50
[junit4:junit4]   2> 12049 T608 oasc.SolrConfig.<init> Loaded SolrConfig: solrconfig.xml
[junit4:junit4]   2> 12150 T608 oass.IndexSchema.readSchema Reading Solr Schema
[junit4:junit4]   2> 12157 T608 oass.IndexSchema.readSchema Schema name=test
[junit4:junit4]   2> 12828 T608 oass.OpenExchangeRatesOrgProvider.init Initialized with rates=open-exchange-rates.json, refreshInterval=1440.
[junit4:junit4]   2> 12841 T608 oass.IndexSchema.readSchema default search field in schema is text
[junit4:junit4]   2> 12845 T608 oass.IndexSchema.readSchema unique key field: id
[junit4:junit4]   2> 12863 T608 oass.FileExchangeRateProvider.reload Reloading exchange rates from file currency.xml
[junit4:junit4]   2> 12869 T608 oass.FileExchangeRateProvider.reload Reloading exchange rates from file currency.xml
[junit4:junit4]   2> 12874 T608 oass.OpenExchangeRatesOrgProvider.reload Reloading exchange rates from open-exchange-rates.json
[junit4:junit4]   2> 12876 T608 oass.OpenExchangeRatesOrgProvider.reload Reloading exchange rates from open-exchange-rates.json
[junit4:junit4]   2> 12877 T608 oasc.SolrCore.<init> [collection1] Opening new SolrCore at /usr/home/hudson/hudson-slave/workspace/Lucene-Solr-Tests-trunk-java7/solr/build/solr-core/test/J0/./org.apache.solr.cloud.ChaosMonkeySafeLeaderTest-jetty3-1360765985030/collection1/, dataDir=./org.apache.solr.cloud.ChaosMonkeySafeLeaderTest-1360765973520/jetty3/
[junit4:junit4]   2> 12878 T608 oasc.JmxMonitoredMap.<init> JMX monitoring is enabled. Adding Solr mbeans to JMX Server: com.sun.jmx.mbeanserver.JmxMBeanServer@2f29271e
[junit4:junit4]   2> 12878 T608 oasc.SolrCore.initDirectoryFactory solr.StandardDirectoryFactory
[junit4:junit4]   2> 12879 T608 oasc.CachingDirectoryFactory.get return new directory for /usr/home/hudson/hudson-slave/workspace/Lucene-Solr-Tests-trunk-java7/solr/build/solr-core/test/J0/./org.apache.solr.cloud.ChaosMonkeySafeLeaderTest-1360765973520/jetty3 forceNew:false
[junit4:junit4]   2> 12880 T608 oasc.CachingDirectoryFactory.close Releasing directory:/usr/home/hudson/hudson-slave/workspace/Lucene-Solr-Tests-trunk-java7/solr/build/solr-core/test/J0/./org.apache.solr.cloud.ChaosMonkeySafeLeaderTest-1360765973520/jetty3
[junit4:junit4]   2> 12880 T608 oasc.SolrCore.getNewIndexDir New index directory detected: old=null new=./org.apache.solr.cloud.ChaosMonkeySafeLeaderTest-1360765973520/jetty3/index/
[junit4:junit4]   2> 12881 T608 oasc.SolrCore.initIndex WARNING [collection1] Solr index directory './org.apache.solr.cloud.ChaosMonkeySafeLeaderTest-1360765973520/jetty3/index' doesn't exist. Creating new index...
[junit4:junit4]   2> 12882 T608 oasc.CachingDirectoryFactory.get return new directory for /usr/home/hudson/hudson-slave/workspace/Lucene-Solr-Tests-trunk-java7/solr/build/solr-core/test/J0/./org.apache.solr.cloud.ChaosMonkeySafeLeaderTest-1360765973520/jetty3/index forceNew:false
[junit4:junit4]   2> 12888 T608 oasc.SolrDeletionPolicy.onCommit SolrDeletionPolicy.onCommit: commits:num=1
[junit4:junit4]   2> 		commit{dir=RateLimitedDirectoryWrapper(org.apache.lucene.store.NIOFSDirectory@/usr/home/hudson/hudson-slave/workspace/Lucene-Solr-Tests-trunk-java7/solr/build/solr-core/test/J0/org.apache.solr.cloud.ChaosMonkeySafeLeaderTest-1360765973520/jetty3/index lockFactory=org.apache.lucene.store.NativeFSLockFactory@28d3aa04),segFN=segments_1,generation=1,filenames=[segments_1]
[junit4:junit4]   2> 12888 T608 oasc.SolrDeletionPolicy.updateCommits newest commit = 1[segments_1]
[junit4:junit4]   2> 12889 T608 oasc.CachingDirectoryFactory.close Releasing directory:/usr/home/hudson/hudson-slave/workspace/Lucene-Solr-Tests-trunk-java7/solr/build/solr-core/test/J0/./org.apache.solr.cloud.ChaosMonkeySafeLeaderTest-1360765973520/jetty3/index
[junit4:junit4]   2> 12889 T608 oasc.SolrCore.initWriters created xml: solr.XMLResponseWriter
[junit4:junit4]   2> 12892 T608 oasup.UpdateRequestProcessorChain.init inserting DistributedUpdateProcessorFactory into updateRequestProcessorChain "dedupe"
[junit4:junit4]   2> 12892 T608 oasup.UpdateRequestProcessorChain.init inserting DistributedUpdateProcessorFactory into updateRequestProcessorChain "dedupe-allfields"
[junit4:junit4]   2> 12893 T608 oasup.UpdateRequestProcessorChain.init inserting DistributedUpdateProcessorFactory into updateRequestProcessorChain "stored_sig"
[junit4:junit4]   2> 12893 T608 oasup.UpdateRequestProcessorChain.init inserting DistributedUpdateProcessorFactory into updateRequestProcessorChain "uniq-fields"
[junit4:junit4]   2> 12894 T608 oasup.UpdateRequestProcessorChain.init inserting DistributedUpdateProcessorFactory into updateRequestProcessorChain "distrib-dup-test-chain-implicit"
[junit4:junit4]   2> 12894 T608 oasc.RequestHandlers.initHandlersFromConfig adding lazy requestHandler: solr.ReplicationHandler
[junit4:junit4]   2> 12894 T608 oasc.RequestHandlers.initHandlersFromConfig created /replication: solr.ReplicationHandler
[junit4:junit4]   2> 12895 T608 oasc.RequestHandlers.initHandlersFromConfig created standard: solr.StandardRequestHandler
[junit4:junit4]   2> 12896 T608 oasc.RequestHandlers.initHandlersFromConfig created /get: solr.RealTimeGetHandler
[junit4:junit4]   2> 12896 T608 oasc.RequestHandlers.initHandlersFromConfig created dismax: solr.SearchHandler
[junit4:junit4]   2> 12897 T608 oasc.RequestHandlers.initHandlersFromConfig created mock: org.apache.solr.core.MockQuerySenderListenerReqHandler
[junit4:junit4]   2> 12897 T608 oasc.RequestHandlers.initHandlersFromConfig created /admin/: org.apache.solr.handler.admin.AdminHandlers
[junit4:junit4]   2> 12898 T608 oasc.RequestHandlers.initHandlersFromConfig created defaults: solr.StandardRequestHandler
[junit4:junit4]   2> 12898 T608 oasc.RequestHandlers.initHandlersFromConfig adding lazy requestHandler: solr.StandardRequestHandler
[junit4:junit4]   2> 12898 T608 oasc.RequestHandlers.initHandlersFromConfig created lazy: solr.StandardRequestHandler
[junit4:junit4]   2> 12899 T608 oasc.RequestHandlers.initHandlersFromConfig created /update: solr.UpdateRequestHandler
[junit4:junit4]   2> 12900 T608 oasc.RequestHandlers.initHandlersFromConfig created /terms: org.apache.solr.handler.component.SearchHandler
[junit4:junit4]   2> 12900 T608 oasc.RequestHandlers.initHandlersFromConfig created spellCheckCompRH: org.apache.solr.handler.component.SearchHandler
[junit4:junit4]   2> 12901 T608 oasc.RequestHandlers.initHandlersFromConfig created spellCheckCompRH_Direct: org.apache.solr.handler.component.SearchHandler
[junit4:junit4]   2> 12902 T608 oasc.RequestHandlers.initHandlersFromConfig created spellCheckWithWordbreak: org.apache.solr.handler.component.SearchHandler
[junit4:junit4]   2> 12902 T608 oasc.RequestHandlers.initHandlersFromConfig created spellCheckWithWordbreak_Direct: org.apache.solr.handler.component.SearchHandler
[junit4:junit4]   2> 12903 T608 oasc.RequestHandlers.initHandlersFromConfig created spellCheckCompRH1: org.apache.solr.handler.component.SearchHandler
[junit4:junit4]   2> 12903 T608 oasc.RequestHandlers.initHandlersFromConfig created mltrh: org.apache.solr.handler.component.SearchHandler
[junit4:junit4]   2> 12904 T608 oasc.RequestHandlers.initHandlersFromConfig created tvrh: org.apache.solr.handler.component.SearchHandler
[junit4:junit4]   2> 12905 T608 oasc.RequestHandlers.initHandlersFromConfig created /mlt: solr.MoreLikeThisHandler
[junit4:junit4]   2> 12905 T608 oasc.RequestHandlers.initHandlersFromConfig created /debug/dump: solr.DumpRequestHandler
[junit4:junit4]   2> 12918 T608 oashl.XMLLoader.init xsltCacheLifetimeSeconds=60
[junit4:junit4]   2> 12923 T608 oasc.SolrCore.initDeprecatedSupport WARNING solrconfig.xml uses deprecated <admin/gettableFiles>, Please update your config to use the ShowFileRequestHandler.
[junit4:junit4]   2> 12925 T608 oasc.SolrCore.initDeprecatedSupport WARNING adding ShowFileRequestHandler with hidden files: [SCHEMA.XML, OLD_SYNONYMS.TXT, STOPWORDS.TXT, PROTWORDS.TXT, OPEN-EXCHANGE-RATES.JSON, SYNONYMS.TXT, CURRENCY.XML, MAPPING-ISOLATIN1ACCENT.TXT]
[junit4:junit4]   2> 12927 T608 oasc.CachingDirectoryFactory.close Releasing directory:/usr/home/hudson/hudson-slave/workspace/Lucene-Solr-Tests-trunk-java7/solr/build/solr-core/test/J0/./org.apache.solr.cloud.ChaosMonkeySafeLeaderTest-1360765973520/jetty3
[junit4:junit4]   2> 12929 T608 oass.SolrIndexSearcher.<init> Opening Searcher@3df94353 main
[junit4:junit4]   2> 12930 T608 oasu.CommitTracker.<init> Hard AutoCommit: disabled
[junit4:junit4]   2> 12931 T608 oasu.CommitTracker.<init> Soft AutoCommit: disabled
[junit4:junit4]   2> 12931 T608 oashc.SpellCheckComponent.inform Initializing spell checkers
[junit4:junit4]   2> 12948 T608 oass.DirectSolrSpellChecker.init init: {name=direct,classname=DirectSolrSpellChecker,field=lowerfilt,minQueryLength=3}
[junit4:junit4]   2> 12960 T559 oascc.ZkStateReader.updateClusterState Updating cloud state from ZooKeeper... 
[junit4:junit4]   2> 12961 T559 oasc.Overseer$ClusterStateUpdater.updateState Update state numShards=3 message={
[junit4:junit4]   2> 	  "operation":"state",
[junit4:junit4]   2> 	  "numShards":"3",
[junit4:junit4]   2> 	  "shard":"shard2",
[junit4:junit4]   2> 	  "roles":null,
[junit4:junit4]   2> 	  "state":"active",
[junit4:junit4]   2> 	  "core":"collection1",
[junit4:junit4]   2> 	  "collection":"collection1",
[junit4:junit4]   2> 	  "node_name":"127.0.0.1:11434_",
[junit4:junit4]   2> 	  "base_url":"http://127.0.0.1:11434"}
[junit4:junit4]   2> 12972 T592 oascc.ZkStateReader$2.process A cluster state change: WatchedEvent state:SyncConnected type:NodeDataChanged path:/clusterstate.json, has occurred - updating... (live nodes size: 4)
[junit4:junit4]   2> 12972 T564 oascc.ZkStateReader$2.process A cluster state change: WatchedEvent state:SyncConnected type:NodeDataChanged path:/clusterstate.json, has occurred - updating... (live nodes size: 4)
[junit4:junit4]   2> 12972 T558 oascc.ZkStateReader$2.process A cluster state change: WatchedEvent state:SyncConnected type:NodeDataChanged path:/clusterstate.json, has occurred - updating... (live nodes size: 4)
[junit4:junit4]   2> 12972 T577 oascc.ZkStateReader$2.process A cluster state change: WatchedEvent state:SyncConnected type:NodeDataChanged path:/clusterstate.json, has occurred - updating... (live nodes size: 4)
[junit4:junit4]   2> 12972 T607 oascc.ZkStateReader$2.process A cluster state change: WatchedEvent state:SyncConnected type:NodeDataChanged path:/clusterstate.json, has occurred - updating... (live nodes size: 4)
[junit4:junit4]   2> 13091 T609 oasc.SolrCore.registerSearcher [collection1] Registered new searcher Searcher@3df94353 main{StandardDirectoryReader(segments_1:1)}
[junit4:junit4]   2> 13098 T608 oasc.ZkController.publish publishing core=collection1 state=down
[junit4:junit4]   2> 13098 T608 oasc.ZkController.publish numShards not found on descriptor - reading it from system property
[junit4:junit4]   2> 14484 T559 oascc.ZkStateReader.updateClusterState Updating cloud state from ZooKeeper... 
[junit4:junit4]   2> 14485 T559 oasc.Overseer$ClusterStateUpdater.updateState Update state numShards=3 message={
[junit4:junit4]   2> 	  "operation":"state",
[junit4:junit4]   2> 	  "numShards":"3",
[junit4:junit4]   2> 	  "shard":null,
[junit4:junit4]   2> 	  "roles":null,
[junit4:junit4]   2> 	  "state":"down",
[junit4:junit4]   2> 	  "core":"collection1",
[junit4:junit4]   2> 	  "collection":"collection1",
[junit4:junit4]   2> 	  "node_name":"127.0.0.1:39906_",
[junit4:junit4]   2> 	  "base_url":"http://127.0.0.1:39906"}
[junit4:junit4]   2> 14485 T559 oasc.Overseer$ClusterStateUpdater.updateState Collection already exists with numShards=3
[junit4:junit4]   2> 14485 T559 oasc.Overseer$ClusterStateUpdater.updateState Assigning new node to shard shard=shard3
[junit4:junit4]   2> 14503 T592 oascc.ZkStateReader$2.process A cluster state change: WatchedEvent state:SyncConnected type:NodeDataChanged path:/clusterstate.json, has occurred - updating... (live nodes size: 4)
[junit4:junit4]   2> 14503 T577 oascc.ZkStateReader$2.process A cluster state change: WatchedEvent state:SyncConnected type:NodeDataChanged path:/clusterstate.json, has occurred - updating... (live nodes size: 4)
[junit4:junit4]   2> 14503 T558 oascc.ZkStateReader$2.process A cluster state change: WatchedEvent state:SyncConnected type:NodeDataChanged path:/clusterstate.json, has occurred - updating... (live nodes size: 4)
[junit4:junit4]   2> 14503 T564 oascc.ZkStateReader$2.process A cluster state change: WatchedEvent state:SyncConnected type:NodeDataChanged path:/clusterstate.json, has occurred - updating... (live nodes size: 4)
[junit4:junit4]   2> 14503 T607 oascc.ZkStateReader$2.process A cluster state change: WatchedEvent state:SyncConnected type:NodeDataChanged path:/clusterstate.json, has occurred - updating... (live nodes size: 4)
[junit4:junit4]   2> 15108 T608 oasc.CoreContainer.registerCore registering core: collection1
[junit4:junit4]   2> 15108 T608 oasc.ZkController.register Register replica - core:collection1 address:http://127.0.0.1:39906 collection:collection1 shard:shard3
[junit4:junit4]   2> 15109 T608 oascc.SolrZkClient.makePath makePath: /collections/collection1/leader_elect/shard3/election
[junit4:junit4]   2> 15154 T541 oazs.PrepRequestProcessor.pRequest Got user-level KeeperException when processing sessionid:0x13cd3f8f419000a type:delete cxid:0x46 zxid:0x9f txntype:-1 reqpath:n/a Error Path:/solr/collections/collection1/leaders/shard3 Error:KeeperErrorCode = NoNode for /solr/collections/collection1/leaders/shard3
[junit4:junit4]   2> 15155 T608 oasc.ShardLeaderElectionContext.runLeaderProcess Running the leader process.
[junit4:junit4]   2> 15155 T541 oazs.PrepRequestProcessor.pRequest Got user-level KeeperException when processing sessionid:0x13cd3f8f419000a type:create cxid:0x47 zxid:0xa0 txntype:-1 reqpath:n/a Error Path:/solr/overseer Error:KeeperErrorCode = NodeExists for /solr/overseer
[junit4:junit4]   2> 15166 T608 oasc.ShardLeaderElectionContext.waitForReplicasToComeUp Enough replicas found to continue.
[junit4:junit4]   2> 15166 T608 oasc.ShardLeaderElectionContext.runLeaderProcess I may be the new leader - try and sync
[junit4:junit4]   2> 15166 T608 oasc.SyncStrategy.sync Sync replicas to http://127.0.0.1:39906/collection1/
[junit4:junit4]   2> 15167 T608 oasc.SyncStrategy.syncReplicas Sync Success - now sync replicas to me
[junit4:junit4]   2> 15167 T608 oasc.SyncStrategy.syncToMe http://127.0.0.1:39906/collection1/ has no replicas
[junit4:junit4]   2> 15167 T608 oasc.ShardLeaderElectionContext.runLeaderProcess I am the new leader: http://127.0.0.1:39906/collection1/
[junit4:junit4]   2> 15167 T608 oascc.SolrZkClient.makePath makePath: /collections/collection1/leaders/shard3
[junit4:junit4]   2> 15171 T541 oazs.PrepRequestProcessor.pRequest Got user-level KeeperException when processing sessionid:0x13cd3f8f419000a type:create cxid:0x50 zxid:0xa3 txntype:-1 reqpath:n/a Error Path:/solr/overseer Error:KeeperErrorCode = NodeExists for /solr/overseer
[junit4:junit4]   2> 16010 T559 oascc.ZkStateReader.updateClusterState Updating cloud state from ZooKeeper... 
[junit4:junit4]   2> 16028 T592 oascc.ZkStateReader$2.process A cluster state change: WatchedEvent state:SyncConnected type:NodeDataChanged path:/clusterstate.json, has occurred - updating... (live nodes size: 4)
[junit4:junit4]   2> 16028 T577 oascc.ZkStateReader$2.process A cluster state change: WatchedEvent state:SyncConnected type:NodeDataChanged path:/clusterstate.json, has occurred - updating... (live nodes size: 4)
[junit4:junit4]   2> 16028 T558 oascc.ZkStateReader$2.process A cluster state change: WatchedEvent state:SyncConnected type:NodeDataChanged path:/clusterstate.json, has occurred - updating... (live nodes size: 4)
[junit4:junit4]   2> 16028 T564 oascc.ZkStateReader$2.process A cluster state change: WatchedEvent state:SyncConnected type:NodeDataChanged path:/clusterstate.json, has occurred - updating... (live nodes size: 4)
[junit4:junit4]   2> 16028 T607 oascc.ZkStateReader$2.process A cluster state change: WatchedEvent state:SyncConnected type:NodeDataChanged path:/clusterstate.json, has occurred - updating... (live nodes size: 4)
[junit4:junit4]   2> 16040 T608 oasc.ZkController.register We are http://127.0.0.1:39906/collection1/ and leader is http://127.0.0.1:39906/collection1/
[junit4:junit4]   2> 16040 T608 oasc.ZkController.register No LogReplay needed for core=collection1 baseURL=http://127.0.0.1:39906
[junit4:junit4]   2> 16040 T608 oasc.ZkController.checkRecovery I am the leader, no recovery necessary
[junit4:junit4]   2> 16041 T608 oasc.ZkController.publish publishing core=collection1 state=active
[junit4:junit4]   2> 16041 T608 oasc.ZkController.publish numShards not found on descriptor - reading it from system property
[junit4:junit4]   2> 16052 T608 oascc.ZkStateReader.updateClusterState Updating cloud state from ZooKeeper... 
[junit4:junit4]   2> 16053 T536 oass.SolrDispatchFilter.init user.dir=/usr/home/hudson/hudson-slave/workspace/Lucene-Solr-Tests-trunk-java7/solr/build/solr-core/test/J0
[junit4:junit4]   2> 16053 T536 oass.SolrDispatchFilter.init SolrDispatchFilter.init() done
[junit4:junit4]   2> 16054 T536 oascsi.HttpClientUtil.createClient Creating new http client, config:maxConnections=128&maxConnectionsPerHost=32&followRedirects=false
[junit4:junit4]   2> 16249 T536 oejs.Server.doStart jetty-8.1.8.v20121106
[junit4:junit4]   2> 16252 T536 oejs.AbstractConnector.doStart Started SocketConnector@127.0.0.1:52897
[junit4:junit4]   2> 16253 T536 oass.SolrDispatchFilter.init SolrDispatchFilter.init()
[junit4:junit4]   2> 16253 T536 oasc.SolrResourceLoader.locateSolrHome JNDI not configured for solr (NoInitialContextEx)
[junit4:junit4]   2> 16254 T536 oasc.SolrResourceLoader.locateSolrHome using system property solr.solr.home: /usr/home/hudson/hudson-slave/workspace/Lucene-Solr-Tests-trunk-java7/solr/build/solr-core/test/J0/./org.apache.solr.cloud.ChaosMonkeySafeLeaderTest-jetty4-1360765989586
[junit4:junit4]   2> 16254 T536 oasc.CoreContainer$Initializer.initialize looking for solr.xml: /usr/home/hudson/hudson-slave/workspace/Lucene-Solr-Tests-trunk-java7/solr/build/solr-core/test/J0/./org.apache.solr.cloud.ChaosMonkeySafeLeaderTest-jetty4-1360765989586/solr.xml
[junit4:junit4]   2> 16254 T536 oasc.CoreContainer.<init> New CoreContainer 1572482885
[junit4:junit4]   2> 16255 T536 oasc.CoreContainer.load Loading CoreContainer using Solr Home: '/usr/home/hudson/hudson-slave/workspace/Lucene-Solr-Tests-trunk-java7/solr/build/solr-core/test/J0/./org.apache.solr.cloud.ChaosMonkeySafeLeaderTest-jetty4-1360765989586/'
[junit4:junit4]   2> 16256 T536 oasc.SolrResourceLoader.<init> new SolrResourceLoader for directory: '/usr/home/hudson/hudson-slave/workspace/Lucene-Solr-Tests-trunk-java7/solr/build/solr-core/test/J0/./org.apache.solr.cloud.ChaosMonkeySafeLeaderTest-jetty4-1360765989586/'
[junit4:junit4]   2> 16319 T536 oashc.HttpShardHandlerFactory.getParameter Setting socketTimeout to: 60000
[junit4:junit4]   2> 16319 T536 oashc.HttpShardHandlerFactory.getParameter Setting urlScheme to: http://
[junit4:junit4]   2> 16320 T536 oashc.HttpShardHandlerFactory.getParameter Setting connTimeout to: 15000
[junit4:junit4]   2> 16320 T536 oashc.HttpShardHandlerFactory.getParameter Setting maxConnectionsPerHost to: 20
[junit4:junit4]   2> 16321 T536 oashc.HttpShardHandlerFactory.getParameter Setting corePoolSize to: 0
[junit4:junit4]   2> 16321 T536 oashc.HttpShardHandlerFactory.getParameter Setting maximumPoolSize to: 2147483647
[junit4:junit4]   2> 16322 T536 oashc.HttpShardHandlerFactory.getParameter Setting maxThreadIdleTime to: 5
[junit4:junit4]   2> 16322 T536 oashc.HttpShardHandlerFactory.getParameter Setting sizeOfQueue to: -1
[junit4:junit4]   2> 16322 T536 oashc.HttpShardHandlerFactory.getParameter Setting fairnessPolicy to: false
[junit4:junit4]   2> 16323 T536 oascsi.HttpClientUtil.createClient Creating new http client, config:maxConnectionsPerHost=20&maxConnections=10000&socketTimeout=60000&connTimeout=15000&retry=false
[junit4:junit4]   2> 16344 T536 oasc.CoreContainer.load Registering Log Listener
[junit4:junit4]   2> 16365 T536 oasc.CoreContainer.initZooKeeper Zookeeper client=127.0.0.1:47126/solr
[junit4:junit4]   2> 16365 T536 oasc.ZkController.checkChrootPath zkHost includes chroot
[junit4:junit4]   2> 16366 T536 oaz.ZooKeeper.<init> Initiating client connection, connectString=127.0.0.1:47126 sessionTimeout=60000 watcher=org.apache.solr.common.cloud.ConnectionManager@8025ec7
[junit4:junit4]   2> 16367 T536 oascc.ConnectionManager.waitForConnected Waiting for client to connect to ZooKeeper
[junit4:junit4]   2> 16367 T619 oaz.ClientCnxn$SendThread.logStartConnect Opening socket connection to server localhost/127.0.0.1:47126. Will not attempt to authenticate using SASL (access denied ("javax.security.auth.AuthPermission" "getLoginConfiguration"))
[junit4:junit4]   2> 16368 T619 oaz.ClientCnxn$SendThread.primeConnection Socket connection established to localhost/127.0.0.1:47126, initiating session
[junit4:junit4]   2> 16368 T538 oazs.NIOServerCnxnFactory.run Accepted socket connection from /140.211.11.196:43119
[junit4:junit4]   2> 16369 T538 oazs.ZooKeeperServer.processConnectRequest Client attempting to establish new session at /140.211.11.196:43119
[junit4:junit4]   2> 16371 T540 oazs.ZooKeeperServer.finishSessionInit Established session 0x13cd3f8f419000b with negotiated timeout 20000 for client /140.211.11.196:43119
[junit4:junit4]   2> 16371 T619 oaz.ClientCnxn$SendThread.onConnected Session establishment complete on server localhost/127.0.0.1:47126, sessionid = 0x13cd3f8f419000b, negotiated timeout = 20000
[junit4:junit4]   2> 16371 T620 oascc.ConnectionManager.process Watcher org.apache.solr.common.cloud.ConnectionManager@8025ec7 name:ZooKeeperConnection Watcher:127.0.0.1:47126 got event WatchedEvent state:SyncConnected type:None path:null path:null type:None
[junit4:junit4]   2> 16372 T536 oascc.ConnectionManager.waitForConnected Client is connected to ZooKeeper
[junit4:junit4]   2> 16373 T541 oazs.PrepRequestProcessor.pRequest2Txn Processed session termination for sessionid: 0x13cd3f8f419000b
[junit4:junit4]   2> 16387 T620 oaz.ClientCnxn$EventThread.run EventThread shut down
[junit4:junit4]   2> 16387 T538 oazs.NIOServerCnxn.closeSock Closed socket connection for client /140.211.11.196:43119 which had sessionid 0x13cd3f8f419000b
[junit4:junit4]   2> 16387 T536 oaz.ZooKeeper.close Session: 0x13cd3f8f419000b closed
[junit4:junit4]   2> 16388 T536 oascsi.HttpClientUtil.createClient Creating new http client, config:maxConnections=500&maxConnectionsPerHost=16&socketTimeout=60000&connTimeout=15000
[junit4:junit4]   2> 16399 T536 oaz.ZooKeeper.<init> Initiating client connection, connectString=127.0.0.1:47126/solr sessionTimeout=30000 watcher=org.apache.solr.common.cloud.ConnectionManager@6e2c9af3
[junit4:junit4]   2> 16400 T536 oascc.ConnectionManager.waitForConnected Waiting for client to connect to ZooKeeper
[junit4:junit4]   2> 16400 T621 oaz.ClientCnxn$SendThread.logStartConnect Opening socket connection to server localhost/127.0.0.1:47126. Will not attempt to authenticate using SASL (access denied ("javax.security.auth.AuthPermission" "getLoginConfiguration"))
[junit4:junit4]   2> 16401 T621 oaz.ClientCnxn$SendThread.primeConnection Socket connection established to localhost/127.0.0.1:47126, initiating session
[junit4:junit4]   2> 16401 T538 oazs.NIOServerCnxnFactory.run Accepted socket connection from /140.211.11.196:46051
[junit4:junit4]   2> 16401 T538 oazs.ZooKeeperServer.processConnectRequest Client attempting to establish new session at /140.211.11.196:46051
[junit4:junit4]   2> 16403 T540 oazs.ZooKeeperServer.finishSessionInit Established session 0x13cd3f8f419000c with negotiated timeout 20000 for client /140.211.11.196:46051
[junit4:junit4]   2> 16403 T621 oaz.ClientCnxn$SendThread.onConnected Session establishment complete on server localhost/127.0.0.1:47126, sessionid = 0x13cd3f8f419000c, negotiated timeout = 20000
[junit4:junit4]   2> 16403 T622 oascc.ConnectionManager.process Watcher org.apache.solr.common.cloud.ConnectionManager@6e2c9af3 name:ZooKeeperConnection Watcher:127.0.0.1:47126/solr got event WatchedEvent state:SyncConnected type:None path:null path:null type:None
[junit4:junit4]   2> 16404 T536 oascc.ConnectionManager.waitForConnected Client is connected to ZooKeeper
[junit4:junit4]   2> 16405 T541 oazs.PrepRequestProcessor.pRequest Got user-level KeeperException when processing sessionid:0x13cd3f8f419000c type:create cxid:0x1 zxid:0xb0 txntype:-1 reqpath:n/a Error Path:/solr/overseer Error:KeeperErrorCode = NodeExists for /solr/overseer
[junit4:junit4]   2> 16406 T541 oazs.PrepRequestProcessor.pRequest Got user-level KeeperException when processing sessionid:0x13cd3f8f419000c type:create cxid:0x2 zxid:0xb1 txntype:-1 reqpath:n/a Error Path:/solr/overseer Error:KeeperErrorCode = NodeExists for /solr/overseer
[junit4:junit4]   2> 16409 T536 oascc.ZkStateReader.createClusterStateWatchersAndUpdate Updating cluster state from ZooKeeper... 
[junit4:junit4]   2> 16411 T536 oasc.ZkController.createEphemeralLiveNode Register node as live in ZooKeeper:/live_nodes/127.0.0.1:52897_
[junit4:junit4]   2> 16412 T541 oazs.PrepRequestProcessor.pRequest Got user-level KeeperException when processing sessionid:0x13cd3f8f419000c type:delete cxid:0x9 zxid:0xb2 txntype:-1 reqpath:n/a Error Path:/solr/live_nodes/127.0.0.1:52897_ Error:KeeperErrorCode = NoNode for /solr/live_nodes/127.0.0.1:52897_
[junit4:junit4]   2> 16414 T536 oascc.SolrZkClient.makePath makePath: /live_nodes/127.0.0.1:52897_
[junit4:junit4]   2> 16417 T607 oascc.ZkStateReader$2.process A cluster state change: WatchedEvent state:SyncConnected type:NodeChildrenChanged path:/live_nodes, has occurred - updating... (live nodes size: 4)
[junit4:junit4]   2> 16417 T577 oascc.ZkStateReader$2.process A cluster state change: WatchedEvent state:SyncConnected type:NodeChildrenChanged path:/live_nodes, has occurred - updating... (live nodes size: 4)
[junit4:junit4]   2> 16417 T592 oascc.ZkStateReader$3.process Updating live nodes... (5)
[junit4:junit4]   2> 16417 T564 oascc.ZkStateReader$3.process Updating live nodes... (5)
[junit4:junit4]   2> 16417 T622 oascc.ZkStateReader$3.process Updating live nodes... (5)
[junit4:junit4]   2> 16417 T592 oascc.ZkStateReader$2.process A cluster state change: WatchedEvent state:SyncConnected type:NodeChildrenChanged path:/live_nodes, has occurred - updating... (live nodes size: 5)
[junit4:junit4]   2> 16418 T564 oascc.ZkStateReader$2.process A cluster state change: WatchedEvent state:SyncConnected type:NodeChildrenChanged path:/live_nodes, has occurred - updating... (live nodes size: 5)
[junit4:junit4]   2> 16418 T558 oascc.ZkStateReader$3.process Updating live nodes... (5)
[junit4:junit4]   2> 16418 T558 oascc.ZkStateReader$2.process A cluster state change: WatchedEvent state:SyncConnected type:NodeChildrenChanged path:/live_nodes, has occurred - updating... (live nodes size: 5)
[junit4:junit4]   2> 16419 T607 oascc.ZkStateReader$3.process Updating live nodes... (5)
[junit4:junit4]   2> 16420 T577 oascc.ZkStateReader$3.process Updating live nodes... (5)
[junit4:junit4]   2> 16427 T623 oasc.CoreContainer.create Creating SolrCore 'collection1' using instanceDir: /usr/home/hudson/hudson-slave/workspace/Lucene-Solr-Tests-trunk-java7/solr/build/solr-core/test/J0/./org.apache.solr.cloud.ChaosMonkeySafeLeaderTest-jetty4-1360765989586/collection1
[junit4:junit4]   2> 16427 T623 oasc.ZkController.createCollectionZkNode Check for collection zkNode:collection1
[junit4:junit4]   2> 16428 T623 oasc.ZkController.createCollectionZkNode Collection zkNode exists
[junit4:junit4]   2> 16428 T623 oasc.ZkController.readConfigName Load collection config from:/collections/collection1
[junit4:junit4]   2> 16430 T623 oasc.SolrResourceLoader.<init> new SolrResourceLoader for directory: '/usr/home/hudson/hudson-slave/workspace/Lucene-Solr-Tests-trunk-java7/solr/build/solr-core/test/J0/./org.apache.solr.cloud.ChaosMonkeySafeLeaderTest-jetty4-1360765989586/collection1/'
[junit4:junit4]   2> 16431 T623 oasc.SolrResourceLoader.replaceClassLoader Adding 'file:/usr/home/hudson/hudson-slave/workspace/Lucene-Solr-Tests-trunk-java7/solr/build/solr-core/test/J0/org.apache.solr.cloud.ChaosMonkeySafeLeaderTest-jetty4-1360765989586/collection1/lib/README' to classloader
[junit4:junit4]   2> 16432 T623 oasc.SolrResourceLoader.replaceClassLoader Adding 'file:/usr/home/hudson/hudson-slave/workspace/Lucene-Solr-Tests-trunk-java7/solr/build/solr-core/test/J0/org.apache.solr.cloud.ChaosMonkeySafeLeaderTest-jetty4-1360765989586/collection1/lib/classes/' to classloader
[junit4:junit4]   2> 16492 T623 oasc.SolrConfig.<init> Using Lucene MatchVersion: LUCENE_50
[junit4:junit4]   2> 16569 T623 oasc.SolrConfig.<init> Loaded SolrConfig: solrconfig.xml
[junit4:junit4]   2> 16670 T623 oass.IndexSchema.readSchema Reading Solr Schema
[junit4:junit4]   2> 16677 T623 oass.IndexSchema.readSchema Schema name=test
[junit4:junit4]   2> 17300 T623 oass.OpenExchangeRatesOrgProvider.init Initialized with rates=open-exchange-rates.json, refreshInterval=1440.
[junit4:junit4]   2> 17312 T623 oass.IndexSchema.readSchema default search field in schema is text
[junit4:junit4]   2> 17316 T623 oass.IndexSchema.readSchema unique key field: id
[junit4:junit4]   2> 17334 T623 oass.FileExchangeRateProvider.reload Reloading exchange rates from file currency.xml
[junit4:junit4]   2> 17339 T623 oass.FileExchangeRateProvider.reload Reloading exchange rates from file currency.xml
[junit4:junit4]   2> 17345 T623 oass.OpenExchangeRatesOrgProvider.reload Reloading exchange rates from open-exchange-rates.json
[junit4:junit4]   2> 17346 T623 oass.OpenExchangeRatesOrgProvider.reload Reloading exchange rates from open-exchange-rates.json
[junit4:junit4]   2> 17348 T623 oasc.SolrCore.<init> [collection1] Opening new SolrCore at /usr/home/hudson/hudson-slave/workspace/Lucene-Solr-Tests-trunk-java7/solr/build/solr-core/test/J0/./org.apache.solr.cloud.ChaosMonkeySafeLeaderTest-jetty4-1360765989586/collection1/, dataDir=./org.apache.solr.cloud.ChaosMonkeySafeLeaderTest-1360765973520/jetty4/
[junit4:junit4]   2> 17348 T623 oasc.JmxMonitoredMap.<init> JMX monitoring is enabled. Adding Solr mbeans to JMX Server: com.sun.jmx.mbeanserver.JmxMBeanServer@2f29271e
[junit4:junit4]   2> 17349 T623 oasc.SolrCore.initDirectoryFactory solr.StandardDirectoryFactory
[junit4:junit4]   2> 17350 T623 oasc.CachingDirectoryFactory.get return new directory for /usr/home/hudson/hudson-slave/workspace/Lucene-Solr-Tests-trunk-java7/solr/build/solr-core/test/J0/./org.apache.solr.cloud.ChaosMonkeySafeLeaderTest-1360765973520/jetty4 forceNew:false
[junit4:junit4]   2> 17350 T623 oasc.CachingDirectoryFactory.close Releasing directory:/usr/home/hudson/hudson-slave/workspace/Lucene-Solr-Tests-trunk-java7/solr/build/solr-core/test/J0/./org.apache.solr.cloud.ChaosMonkeySafeLeaderTest-1360765973520/jetty4
[junit4:junit4]   2> 17351 T623 oasc.SolrCore.getNewIndexDir New index directory detected: old=null new=./org.apache.solr.cloud.ChaosMonkeySafeLeaderTest-1360765973520/jetty4/index/
[junit4:junit4]   2> 17351 T623 oasc.SolrCore.initIndex WARNING [collection1] Solr index directory './org.apache.solr.cloud.ChaosMonkeySafeLeaderTest-1360765973520/jetty4/index' doesn't exist. Creating new index...
[junit4:junit4]   2> 17352 T623 oasc.CachingDirectoryFactory.get return new directory for /usr/home/hudson/hudson-slave/workspace/Lucene-Solr-Tests-trunk-java7/solr/build/solr-core/test/J0/./org.apache.solr.cloud.ChaosMonkeySafeLeaderTest-1360765973520/jetty4/index forceNew:false
[junit4:junit4]   2> 17380 T623 oasc.SolrDeletionPolicy.onCommit SolrDeletionPolicy.onCommit: commits:num=1
[junit4:junit4]   2> 		commit{dir=RateLimitedDirectoryWrapper(org.apache.lucene.store.NIOFSDirectory@/usr/home/hudson/hudson-slave/workspace/Lucene-Solr-Tests-trunk-java7/solr/build/solr-core/test/J0/org.apache.solr.cloud.ChaosMonkeySafeLeaderTest-1360765973520/jetty4/index lockFactory=org.apache.lucene.store.NativeFSLockFactory@130a6736),segFN=segments_1,generation=1,filenames=[segments_1]
[junit4:junit4]   2> 17380 T623 oasc.SolrDeletionPolicy.updateCommits newest commit = 1[segments_1]
[junit4:junit4]   2> 17381 T623 oasc.CachingDirectoryFactory.close Releasing directory:/usr/home/hudson/hudson-slave/workspace/Lucene-Solr-Tests-trunk-java7/solr/build/solr-core/test/J0/./org.apache.solr.cloud.ChaosMonkeySafeLeaderTest-1360765973520/jetty4/index
[junit4:junit4]   2> 17381 T623 oasc.SolrCore.initWriters created xml: solr.XMLResponseWriter
[junit4:junit4]   2> 17384 T623 oasup.UpdateRequestProcessorChain.init inserting DistributedUpdateProcessorFactory into updateRequestProcessorChain "dedupe"
[junit4:junit4]   2> 17384 T623 oasup.UpdateRequestProcessorChain.init inserting DistributedUpdateProcessorFactory into updateRequestProcessorChain "dedupe-allfields"
[junit4:junit4]   2> 17384 T623 oasup.UpdateRequestProcessorChain.init inserting DistributedUpdateProcessorFactory into updateRequestProcessorChain "stored_sig"
[junit4:junit4]   2> 17385 T623 oasup.UpdateRequestProcessorChain.init inserting DistributedUpdateProcessorFactory into updateRequestProcessorChain "uniq-fields"
[junit4:junit4]   2> 17385 T623 oasup.UpdateRequestProcessorChain.init inserting DistributedUpdateProcessorFactory into updateRequestProcessorChain "distrib-dup-test-chain-implicit"
[junit4:junit4]   2> 17386 T623 oasc.RequestHandlers.initHandlersFromConfig adding lazy requestHandler: solr.ReplicationHandler
[junit4:junit4]   2> 17386 T623 oasc.RequestHandlers.initHandlersFromConfig created /replication: solr.ReplicationHandler
[junit4:junit4]   2> 17387 T623 oasc.RequestHandlers.initHandlersFromConfig created standard: solr.StandardRequestHandler
[junit4:junit4]   2> 17387 T623 oasc.RequestHandlers.initHandlersFromConfig created /get: solr.RealTimeGetHandler
[junit4:junit4]   2> 17388 T623 oasc.RequestHandlers.initHandlersFromConfig created dismax: solr.SearchHandler
[junit4:junit4]   2> 17389 T623 oasc.RequestHandlers.initHandlersFromConfig created mock: org.apache.solr.core.MockQuerySenderListenerReqHandler
[junit4:junit4]   2> 17389 T623 oasc.RequestHandlers.initHandlersFromConfig created /admin/: org.apache.solr.handler.admin.AdminHandlers
[junit4:junit4]   2> 17390 T623 oasc.RequestHandlers.initHandlersFromConfig created defaults: solr.StandardRequestHandler
[junit4:junit4]   2> 17390 T623 oasc.RequestHandlers.initHandlersFromConfig adding lazy requestHandler: solr.StandardRequestHandler
[junit4:junit4]   2> 17390 T623 oasc.RequestHandlers.initHandlersFromConfig created lazy: solr.StandardRequestHandler
[junit4:junit4]   2> 17391 T623 oasc.RequestHandlers.initHandlersFromConfig created /update: solr.UpdateRequestHandler
[junit4:junit4]   2> 17392 T623 oasc.RequestHandlers.initHandlersFromConfig created /terms: org.apache.solr.handler.component.SearchHandler
[junit4:junit4]   2> 17392 T623 oasc.RequestHandlers.initHandlersFromConfig created spellCheckCompRH: org.apache.solr.handler.component.SearchHandler
[junit4:junit4]   2> 17393 T623 oasc.RequestHandlers.initHandlersFromConfig created spellCheckCompRH_Direct: org.apache.solr.handler.component.SearchHandler
[junit4:junit4]   2> 17394 T623 oasc.RequestHandlers.initHandlersFromConfig created spellCheckWithWordbreak: org.apache.solr.handler.component.SearchHandler
[junit4:junit4]   2> 17394 T623 oasc.RequestHandlers.initHandlersFromConfig created spellCheckWithWordbreak_Direct: org.apache.solr.handler.component.SearchHandler
[junit4:junit4]   2> 17395 T623 oasc.RequestHandlers.initHandlersFromConfig created spellCheckCompRH1: org.apache.solr.handler.component.SearchHandler
[junit4:junit4]   2> 17395 T623 oasc.RequestHandlers.initHandlersFromConfig created mltrh: org.apache.solr.handler.component.SearchHandler
[junit4:junit4]   2> 17396 T623 oasc.RequestHandlers.initHandlersFromConfig created tvrh: org.apache.solr.handler.component.SearchHandler
[junit4:junit4]   2> 17397 T623 oasc.RequestHandlers.initHandlersFromConfig created /mlt: solr.MoreLikeThisHandler
[junit4:junit4]   2> 17398 T623 oasc.RequestHandlers.initHandlersFromConfig created /debug/dump: solr.DumpRequestHandler
[junit4:junit4]   2> 17411 T623 oashl.XMLLoader.init xsltCacheLifetimeSeconds=60
[junit4:junit4]   2> 17415 T623 oasc.SolrCore.initDeprecatedSupport WARNING solrconfig.xml uses deprecated <admin/gettableFiles>, Please update your config to use the ShowFileRequestHandler.
[junit4:junit4]   2> 17417 T623 oasc.SolrCore.initDeprecatedSupport WARNING adding ShowFileRequestHandler with hidden files: [SCHEMA.XML, OLD_SYNONYMS.TXT, STOPWORDS.TXT, PROTWORDS.TXT, OPEN-EXCHANGE-RATES.JSON, SYNONYMS.TXT, CURRENCY.XML, MAPPING-ISOLATIN1ACCENT.TXT]
[junit4:junit4]   2> 17419 T623 oasc.CachingDirectoryFactory.close Releasing directory:/usr/home/hudson/hudson-slave/workspace/Lucene-Solr-Tests-trunk-java7/solr/build/solr-core/test/J0/./org.apache.solr.cloud.ChaosMonkeySafeLeaderTest-1360765973520/jetty4
[junit4:junit4]   2> 17421 T623 oass.SolrIndexSearcher.<init> Opening Searcher@73a99fb3 main
[junit4:junit4]   2> 17422 T623 oasu.CommitTracker.<init> Hard AutoCommit: disabled
[junit4:junit4]   2> 17422 T623 oasu.CommitTracker.<init> Soft AutoCommit: disabled
[junit4:junit4]   2> 17423 T623 oashc.SpellCheckComponent.inform Initializing spell checkers
[junit4:junit4]   2> 17430 T623 oass.DirectSolrSpellChecker.init init: {name=direct,classname=DirectSolrSpellChecker,field=lowerfilt,minQueryLength=3}
[junit4:junit4]   2> 17480 T624 oasc.SolrCore.registerSearcher [collection1] Registered new searcher Searcher@73a99fb3 main{StandardDirectoryReader(segments_1:1)}
[junit4:junit4]   2> 17485 T623 oasc.ZkController.publish publishing core=collection1 state=down
[junit4:junit4]   2> 17486 T623 oasc.ZkController.publish numShards not found on descriptor - reading it from system property
[junit4:junit4]   2> 17554 T559 oascc.ZkStateReader.updateClusterState Updating cloud state from ZooKeeper... 
[junit4:junit4]   2> 17555 T559 oasc.Overseer$ClusterStateUpdater.updateState Update state numShards=3 message={
[junit4:junit4]   2> 	  "operation":"state",
[junit4:junit4]   2> 	  "numShards":"3",
[junit4:junit4]   2> 	  "shard":"shard3",
[junit4:junit4]   2> 	  "roles":null,
[junit4:junit4]   2> 	  "state":"active",
[junit4:junit4]   2> 	  "core":"collection1",
[junit4:junit4]   2> 	  "collection":"collection1",
[junit4:junit4]   2> 	  "node_name":"127.0.0.1:39906_",
[junit4:junit4]   2> 	  "base_url":"http://127.0.0.1:39906"}
[junit4:junit4]   2> 17559 T559 oasc.Overseer$ClusterStateUpdater.updateState Update state numShards=3 message={
[junit4:junit4]   2> 	  "operation":"state",
[junit4:junit4]   2> 	  "numShards":"3",
[junit4:junit4]   2> 	  "shard":null,
[junit4:junit4]   2> 	  "roles":null,
[junit4:junit4]   2> 	  "state":"down",
[junit4:junit4]   2> 	  "core":"collection1",
[junit4:junit4]   2> 	  "collection":"collection1",
[junit4:junit4]   2> 	  "node_name":"127.0.0.1:52897_",
[junit4:junit4]   2> 	  "base_url":"http://127.0.0.1:52897"}
[junit4:junit4]   2> 17559 T559 oasc.Overseer$ClusterStateUpdater.updateState Collection already exists with numShards=3
[junit4:junit4]   2> 17560 T559 oasc.Overseer$ClusterStateUpdater.updateState Assigning new node to shard shard=shard1
[junit4:junit4]   2> 17572 T592 oascc.ZkStateReader$2.process A cluster state change: WatchedEvent state:SyncConnected type:NodeDataChanged path:/clusterstate.json, has occurred - updating... (live nodes size: 5)
[junit4:junit4]   2> 17573 T607 oascc.ZkStateReader$2.process A cluster state change: WatchedEvent state:SyncConnected type:NodeDataChanged path:/clusterstate.json, has occurred - updating... (live nodes size: 5)
[junit4:junit4]   2> 17573 T564 oascc.ZkStateReader$2.process A cluster state change: WatchedEvent state:SyncConnected type:NodeDataChanged path:/clusterstate.json, has occurred - updating... (live nodes size: 5)
[junit4:junit4]   2> 17573 T577 oascc.ZkStateReader$2.process A cluster state change: WatchedEvent state:SyncConnected type:NodeDataChanged path:/clusterstate.json, has occurred - updating... (live nodes size: 5)
[junit4:junit4]   2> 17573 T558 oascc.ZkStateReader$2.process A cluster state change: WatchedEvent state:SyncConnected type:NodeDataChanged path:/clusterstate.json, has occurred - updating... (live nodes size: 5)
[junit4:junit4]   2> 17573 T622 oascc.ZkStateReader$2.process A cluster state change: WatchedEvent state:SyncConnected type:NodeDataChanged path:/clusterstate.json, has occurred - updating... (live nodes size: 5)
[junit4:junit4]   2> 18488 T623 oasc.CoreContainer.registerCore registering core: collection1
[junit4:junit4]   2> 18488 T623 oasc.ZkController.register Register replica - core:collection1 address:http://127.0.0.1:52897 collection:collection1 shard:shard1
[junit4:junit4]   2> 18492 T623 oasc.ZkController.register We are http://127.0.0.1:52897/collection1/ and leader is http://127.0.0.1:60875/collection1/
[junit4:junit4]   2> 18493 T623 oasc.ZkController.register No LogReplay needed for core=collection1 baseURL=http://127.0.0.1:52897
[junit4:junit4]   2> 18493 T623 oasc.ZkController.checkRecovery Core needs to recover:collection1
[junit4:junit4]   2> 18493 T623 oasu.DefaultSolrCoreState.doRecovery Running recovery - first canceling any ongoing recovery
[junit4:junit4]   2> ASYNC  NEW_CORE C24 name=collection1 org.apache.solr.core.SolrCore@6f7714c8 url=http://127.0.0.1:52897/collection1 node=127.0.0.1:52897_ C24_STATE=coll:collection1 core:collection1 props:{shard=null, roles=null, state=down, core=collection1, collection=collection1, node_name=127.0.0.1:52897_, base_url=http://127.0.0.1:52897}
[junit4:junit4]   2> 18494 T625 C24 P52897 oasc.RecoveryStrategy.run Starting recovery process.  core=collection1 recoveringAfterStartup=true
[junit4:junit4]   2> 18495 T623 oascc.ZkStateReader.updateClusterState Updating cloud state from ZooKeeper... 
[junit4:junit4]   2> 18495 T625 C24 P52897 oasc.RecoveryStrategy.doRecovery ###### startupVersions=[]
[junit4:junit4]   2> 18496 T625 C24 P52897 oasc.ZkController.publish publishing core=collection1 state=recovering
[junit4:junit4]   2> 18496 T625 C24 P52897 oasc.ZkController.publish numShards not found on descriptor - reading it from system property
[junit4:junit4]   2> 18496 T536 oass.SolrDispatchFilter.init user.dir=/usr/home/hudson/hudson-slave/workspace/Lucene-Solr-Tests-trunk-java7/solr/build/solr-core/test/J0
[junit4:junit4]   2> 18497 T536 oass.SolrDispatchFilter.init SolrDispatchFilter.init() done
[junit4:junit4]   2> 18497 T536 oascsi.HttpClientUtil.createClient Creating new http client, config:maxConnections=128&maxConnectionsPerHost=32&followRedirects=false
[junit4:junit4]   2> 18497 T625 C24 P52897 oascsi.HttpClientUtil.createClient Creating new http client, config:maxConnections=128&maxConnectionsPerHost=32&followRedirects=false
[junit4:junit4]   2> 18682 T536 oejs.Server.doStart jetty-8.1.8.v20121106
[junit4:junit4]   2> 18685 T536 oejs.AbstractConnector.doStart Started SocketConnector@127.0.0.1:33901
[junit4:junit4]   2> 18685 T536 oass.SolrDispatchFilter.init SolrDispatchFilter.init()
[junit4:junit4]   2> 18686 T536 oasc.SolrResourceLoader.locateSolrHome JNDI not configured for solr (NoInitialContextEx)
[junit4:junit4]   2> 18686 T536 oasc.SolrResourceLoader.locateSolrHome using system property solr.solr.home: /usr/home/hudson/hudson-slave/workspace/Lucene-Solr-Tests-trunk-java7/solr/build/solr-core/test/J0/./org.apache.solr.cloud.ChaosMonkeySafeLeaderTest-jetty5-1360765992029
[junit4:junit4]   2> 18687 T536 oasc.CoreContainer$Initializer.initialize looking for solr.xml: /usr/home/hudson/hudson-slave/workspace/Lucene-Solr-Tests-trunk-java7/solr/build/solr-core/test/J0/./org.apache.solr.cloud.ChaosMonkeySafeLeaderTest-jetty5-1360765992029/solr.xml
[junit4:junit4]   2> 18687 T536 oasc.CoreContainer.<init> New CoreContainer 972402086
[junit4:junit4]   2> 18688 T536 oasc.CoreContainer.load Loading CoreContainer using Solr Home: '/usr/home/hudson/hudson-slave/workspace/Lucene-Solr-Tests-trunk-java7/solr/build/solr-core/test/J0/./org.apache.solr.cloud.ChaosMonkeySafeLeaderTest-jetty5-1360765992029/'
[junit4:junit4]   2> 18688 T536 oasc.SolrResourceLoader.<init> new SolrResourceLoader for directory: '/usr/home/hudson/hudson-slave/workspace/Lucene-Solr-Tests-trunk-java7/solr/build/solr-core/test/J0/./org.apache.solr.cloud.ChaosMonkeySafeLeaderTest-jetty5-1360765992029/'
[junit4:junit4]   2> 18747 T536 oashc.HttpShardHandlerFactory.getParameter Setting socketTimeout to: 60000
[junit4:junit4]   2> 18748 T536 oashc.HttpShardHandlerFactory.getParameter Setting urlScheme to: http://
[junit4:junit4]   2> 18748 T536 oashc.HttpShardHandlerFactory.getParameter Setting connTimeout to: 15000
[junit4:junit4]   2> 18749 T536 oashc.HttpShardHandlerFactory.getParameter Setting maxConnectionsPerHost to: 20
[junit4:junit4]   2> 18749 T536 oashc.HttpShardHandlerFactory.getParameter Setting corePoolSize to: 0
[junit4:junit4]   2> 18749 T536 oashc.HttpShardHandlerFactory.getParameter Setting maximumPoolSize to: 2147483647
[junit4:junit4]   2> 18750 T536 oashc.HttpShardHandlerFactory.getParameter Setting maxThreadIdleTime to: 5
[junit4:junit4]   2> 18750 T536 oashc.HttpShardHandlerFactory.getParameter Setting sizeOfQueue to: -1
[junit4:junit4]   2> 18751 T536 oashc.HttpShardHandlerFactory.getParameter Setting fairnessPolicy to: false
[junit4:junit4]   2> 18751 T536 oascsi.HttpClientUtil.createClient Creating new http client, config:maxConnectionsPerHost=20&maxConnections=10000&socketTimeout=60000&connTimeout=15000&retry=false
[junit4:junit4]   2> 18772 T536 oasc.CoreContainer.load Registering Log Listener
[junit4:junit4]   2> 18791 T536 oasc.CoreContainer.initZooKeeper Zookeeper client=127.0.0.1:47126/solr
[junit4:junit4]   2> 18792 T536 oasc.ZkController.checkChrootPath zkHost includes chroot
[junit4:junit4]   2> 18792 T536 oaz.ZooKeeper.<init> Initiating client connection, connectString=127.0.0.1:47126 sessionTimeout=60000 watcher=org.apache.solr.common.cloud.ConnectionManager@2a41e72a
[junit4:junit4]   2> 18793 T536 oascc.ConnectionManager.waitForConnected Waiting for client to connect to ZooKeeper
[junit4:junit4]   2> 18794 T635 oaz.ClientCnxn$SendThread.logStartConnect Opening socket connection to server localhost/127.0.0.1:47126. Will not attempt to authenticate using SASL (access denied ("javax.security.auth.AuthPermission" "getLoginConfiguration"))
[junit4:junit4]   2> 18795 T635 oaz.ClientCnxn$SendThread.primeConnection Socket connection established to localhost/127.0.0.1:47126, initiating session
[junit4:junit4]   2> 18795 T538 oazs.NIOServerCnxnFactory.run Accepted socket connection from /140.211.11.196:44842
[junit4:junit4]   2> 18795 T538 oazs.ZooKeeperServer.processConnectRequest Client attempting to establish new session at /140.211.11.196:44842
[junit4:junit4]   2> 18801 T540 oazs.ZooKeeperServer.finishSessionInit Established session 0x13cd3f8f419000d with negotiated timeout 20000 for client /140.211.11.196:44842
[junit4:junit4]   2> 18801 T635 oaz.ClientCnxn$SendThread.onConnected Session establishment complete on server localhost/127.0.0.1:47126, sessionid = 0x13cd3f8f419000d, negotiated timeout = 20000
[junit4:junit4]   2> 18801 T636 oascc.ConnectionManager.process Watcher org.apache.solr.common.cloud.ConnectionManager@2a41e72a name:ZooKeeperConnection Watcher:127.0.0.1:47126 got event WatchedEvent state:SyncConnected type:None path:null path:null type:None
[junit4:junit4]   2> 18801 T536 oascc.ConnectionManager.waitForConnected Client is connected to ZooKeeper
[junit4:junit4]   2> 18803 T541 oazs.PrepRequestProcessor.pRequest2Txn Processed session termination for sessionid: 0x13cd3f8f419000d
[junit4:junit4]   2> 18816 T636 oaz.ClientCnxn$EventThread.run EventThread shut down
[junit4:junit4]   2> 18816 T538 oazs.NIOServerCnxn.closeSock Closed socket connection for client /140.211.11.196:44842 which had sessionid 0x13cd3f8f419000d
[junit4:junit4]   2> 18816 T536 oaz.ZooKeeper.close Session: 0x13cd3f8f419000d closed
[junit4:junit4]   2> 18817 T536 oascsi.HttpClientUtil.createClient Creating new http client, config:maxConnections=500&maxConnectionsPerHost=16&socketTimeout=60000&connTimeout=15000
[junit4:junit4]   2> 18828 T536 oaz.ZooKeeper.<init> Initiating client connection, connectString=127.0.0.1:47126/solr sessionTimeout=30000 watcher=org.apache.solr.common.cloud.ConnectionManager@17bd4b04
[junit4:junit4]   2> 18829 T536 oascc.ConnectionManager.waitForConnected Waiting for client to connect to ZooKeeper
[junit4:junit4]   2> 18829 T637 oaz.ClientCnxn$SendThread.logStartConnect Opening socket connection to server localhost/127.0.0.1:47126. Will not attempt to authenticate using SASL (access denied ("javax.security.auth.AuthPermission" "getLoginConfiguration"))
[junit4:junit4]   2> 18830 T637 oaz.ClientCnxn$SendThread.primeConnection Socket connection established to localhost/127.0.0.1:47126, initiating session
[junit4:junit4]   2> 18830 T538 oazs.NIOServerCnxnFactory.run Accepted socket connection from /140.211.11.196:62967
[junit4:junit4]   2> 18830 T538 oazs.ZooKeeperServer.processConnectRequest Client attempting to establish new session at /140.211.11.196:62967
[junit4:junit4]   2> 18832 T540 oazs.ZooKeeperServer.finishSessionInit Established session 0x13cd3f8f419000e with negotiated timeout 20000 for client /140.211.11.196:62967
[junit4:junit4]   2> 18832 T637 oaz.ClientCnxn$SendThread.onConnected Session establishment complete on server localhost/127.0.0.1:47126, sessionid = 0x13cd3f8f419000e, negotiated timeout = 20000
[junit4:junit4]   2> 18832 T638 oascc.ConnectionManager.process Watcher org.apache.solr.common.cloud.ConnectionManager@17bd4b04 name:ZooKeeperConnection Watcher:127.0.0.1:47126/solr got event WatchedEvent state:SyncConnected type:None path:null path:null type:None
[junit4:junit4]   2> 18832 T536 oascc.ConnectionManager.waitForConnected Client is connected to ZooKeeper
[junit4:junit4]   2> 18833 T541 oazs.PrepRequestProcessor.pRequest Got user-level KeeperException when processing sessionid:0x13cd3f8f419000e type:create cxid:0x1 zxid:0xc2 txntype:-1 reqpath:n/a Error Path:/solr/overseer Error:KeeperErrorCode = NodeExists for /solr/overseer
[junit4:junit4]   2> 18835 T541 oazs.PrepRequestProcessor.pRequest Got user-level KeeperException when processing sessionid:0x13cd3f8f419000e type:create cxid:0x2 zxid:0xc3 txntype:-1 reqpath:n/a Error Path:/solr/overseer Error:KeeperErrorCode = NodeExists for /solr/overseer
[junit4:junit4]   2> 18843 T536 oascc.ZkStateReader.createClusterStateWatchersAndUpdate Updating cluster state from ZooKeeper... 
[junit4:junit4]   2> 18846 T536 oasc.ZkController.createEphemeralLiveNode Register node as live in ZooKeeper:/live_nodes/127.0.0.1:33901_
[junit4:junit4]   2> 18847 T541 oazs.PrepRequestProcessor.pRequest Got user-level KeeperException when processing sessionid:0x13cd3f8f419000e type:delete cxid:0x9 zxid:0xc4 txntype:-1 reqpath:n/a Error Path:/solr/live_nodes/127.0.0.1:33901_ Error:KeeperErrorCode = NoNode for /solr/live_nodes/127.0.0.1:33901_
[junit4:junit4]   2> 18848 T536 oascc.SolrZkClient.makePath makePath: /live_nodes/127.0.0.1:33901_
[junit4:junit4]   2> 18850 T607 oascc.ZkStateReader$2.process A cluster state change: WatchedEvent state:SyncConnected type:NodeChildrenChanged path:/live_nodes, has occurred - updating... (live nodes size: 5)
[junit4:junit4]   2> 18850 T622 oascc.ZkStateReader$2.process A cluster state change: WatchedEvent state:SyncConnected type:NodeChildrenChanged path:/live_nodes, has occurred - updating... (live nodes size: 5)
[junit4:junit4]   2> 18851 T577 oascc.ZkStateReader$2.process A cluster state change: WatchedEvent state:SyncConnected type:NodeChildrenChanged path:/live_nodes, has occurred - updating... (live nodes size: 5)
[junit4:junit4]   2> 18851 T564 oascc.ZkStateReader$3.process Updating live nodes... (6)
[junit4:junit4]   2> 18851 T558 oascc.ZkStateReader$3.process Updating live nodes... (6)
[junit4:junit4]   2> 18852 T564 oascc.ZkStateReader$2.process A cluster state change: WatchedEvent state:SyncConnected type:NodeChildrenChanged path:/live_nodes, has occurred - updating... (live nodes size: 6)
[junit4:junit4]   2> 18851 T592 oascc.ZkStateReader$3.process Updating live nodes... (6)
[junit4:junit4]   2> 18852 T558 oascc.ZkStateReader$2.process A cluster state change: WatchedEvent state:SyncConnected type:NodeChildrenChanged path:/live_nodes, has occurred - updating... (live nodes size: 6)
[junit4:junit4]   2> 18852 T592 oascc.ZkStateReader$2.process A cluster state change: WatchedEvent state:SyncConnected type:NodeChildrenChanged path:/live_nodes, has occurred - updating... (live nodes size: 6)
[junit4:junit4]   2> 18852 T638 oascc.ZkStateReader$3.process Updating live nodes... (6)
[junit4:junit4]   2> 18853 T607 oascc.ZkStateReader$3.process Updating live nodes... (6)
[junit4:junit4]   2> 18853 T622 oascc.ZkStateReader$3.process Updating live nodes... (6)
[junit4:junit4]   2> 18853 T577 oascc.ZkStateReader$3.process Updating live nodes... (6)
[junit4:junit4]   2> 18861 T639 oasc.CoreContainer.create Creating SolrCore 'collection1' using instanceDir: /usr/home/hudson/hudson-slave/workspace/Lucene-Solr-Tests-trunk-java7/solr/build/solr-core/test/J0/./org.apache.solr.cloud.ChaosMonkeySafeLeaderTest-jetty5-1360765992029/collection1
[junit4:junit4]   2> 18861 T639 oasc.ZkController.createCollectionZkNode Check for collection zkNode:collection1
[junit4:junit4]   2> 18862 T639 oasc.ZkController.createCollectionZkNode Collection zkNode exists
[junit4:junit4]   2> 18862 T639 oasc.ZkController.readConfigName Load collection config from:/collections/collection1
[junit4:junit4]   2> 18863 T639 oasc.SolrResourceLoader.<init> new SolrResourceLoader for directory: '/usr/home/hudson/hudson-slave/workspace/Lucene-Solr-Tests-trunk-java7/solr/build/solr-core/test/J0/./org.apache.solr.cloud.ChaosMonkeySafeLeaderTest-jetty5-1360765992029/collection1/'
[junit4:junit4]   2> 18865 T639 oasc.SolrResourceLoader.replaceClassLoader Adding 'file:/usr/home/hudson/hudson-slave/workspace/Lucene-Solr-Tests-trunk-java7/solr/build/solr-core/test/J0/org.apache.solr.cloud.ChaosMonkeySafeLeaderTest-jetty5-1360765992029/collection1/lib/README' to classloader
[junit4:junit4]   2> 18866 T639 oasc.SolrResourceLoader.replaceClassLoader Adding 'file:/usr/home/hudson/hudson-slave/workspace/Lucene-Solr-Tests-trunk-java7/solr/build/solr-core/test/J0/org.apache.solr.cloud.ChaosMonkeySafeLeaderTest-jetty5-1360765992029/collection1/lib/classes/' to classloader
[junit4:junit4]   2> 18921 T639 oasc.SolrConfig.<init> Using Lucene MatchVersion: LUCENE_50
[junit4:junit4]   2> 18991 T639 oasc.SolrConfig.<init> Loaded SolrConfig: solrconfig.xml
[junit4:junit4]   2> 19088 T559 oascc.ZkStateReader.updateClusterState Updating cloud state from ZooKeeper... 
[junit4:junit4]   2> 19088 T559 oasc.Overseer$ClusterStateUpdater.updateState Update state numShards=3 message={
[junit4:junit4]   2> 	  "operation":"state",
[junit4:junit4]   2> 	  "numShards":"3",
[junit4:junit4]   2> 	  "shard":"shard1",
[junit4:junit4]   2> 	  "roles":null,
[junit4:junit4]   2> 	  "state":"recovering",
[junit4:junit4]   2> 	  "core":"collection1",
[junit4:junit4]   2> 	  "collection":"collection1",
[junit4:junit4]   2> 	  "node_name":"127.0.0.1:52897_",
[junit4:junit4]   2> 	  "base_url":"http://127.0.0.1:52897"}
[junit4:junit4]   2> 19092 T639 oass.IndexSchema.readSchema Reading Solr Schema
[junit4:junit4]   2> 19099 T639 oass.IndexSchema.readSchema Schema name=test
[junit4:junit4]   2> 19102 T592 oascc.ZkStateReader$2.process A cluster state change: WatchedEvent state:SyncConnected type:NodeDataChanged path:/clusterstate.json, has occurred - updating... (live nodes size: 6)
[junit4:junit4]   2> 19102 T622 oascc.ZkStateReader$2.process A cluster state change: WatchedEvent state:SyncConnected type:NodeDataChanged path:/clusterstate.json, has occurred - updating... (live nodes size: 6)
[junit4:junit4]   2> 19102 T558 oascc.ZkStateReader$2.process A cluster state change: WatchedEvent state:SyncConnected type:NodeDataChanged path:/clusterstate.json, has occurred - updating... (live nodes size: 6)
[junit4:junit4]   2> 19102 T638 oascc.ZkStateReader$2.process A cluster state change: WatchedEvent state:SyncConnected type:NodeDataChanged path:/clusterstate.json, has occurred - updating... (live nodes size: 6)
[junit4:junit4]   2> 19102 T577 oascc.ZkStateReader$2.process A cluster state change: WatchedEvent state:SyncConnected type:NodeDataChanged path:/clusterstate.json, has occurred - updating... (live nodes size: 6)
[junit4:junit4]   2> 19102 T607 oascc.ZkStateReader$2.process A cluster state change: WatchedEvent state:SyncConnected type:NodeDataChanged path:/clusterstate.json, has occurred - updating... (live nodes size: 6)
[junit4:junit4]   2> 19102 T564 oascc.ZkStateReader$2.process A cluster state change: WatchedEvent state:SyncConnected type:NodeDataChanged path:/clusterstate.json, has occurred - updating... (live nodes size: 6)
[junit4:junit4]   2> 19714 T639 oass.OpenExchangeRatesOrgProvider.init Initialized with rates=open-exchange-rates.json, refreshInterval=1440.
[junit4:junit4]   2> 19727 T639 oass.IndexSchema.readSchema default search field in schema is text
[junit4:junit4]   2> 19731 T639 oass.IndexSchema.readSchema unique key field: id
[junit4:junit4]   2> 19749 T639 oass.FileExchangeRateProvider.reload Reloading exchange rates from file currency.xml
[junit4:junit4]   2> 19754 T639 oass.FileExchangeRateProvider.reload Reloading exchange rates from file currency.xml
[junit4:junit4]   2> 19759 T639 oass.OpenExchangeRatesOrgProvider.reload Reloading exchange rates from open-exchange-rates.json
[junit4:junit4]   2> 19761 T639 oass.OpenExchangeRatesOrgProvider.reload Reloading exchange rates from open-exchange-rates.json
[junit4:junit4]   2> 19762 T639 oasc.SolrCore.<init> [collection1] Opening new SolrCore at /usr/home/hudson/hudson-slave/workspace/Lucene-Solr-Tests-trunk-java7/solr/build/solr-core/test/J0/./org.apache.solr.cloud.ChaosMonkeySafeLeaderTest-jetty5-1360765992029/collection1/, dataDir=./org.apache.solr.cloud.ChaosMonkeySafeLeaderTest-1360765973520/jetty5/
[junit4:junit4]   2> 19763 T639 oasc.JmxMonitoredMap.<init> JMX monitoring is enabled. Adding Solr mbeans to JMX Server: com.sun.jmx.mbeanserver.JmxMBeanServer@2f29271e
[junit4:junit4]   2> 19763 T639 oasc.SolrCore.initDirectoryFactory solr.StandardDirectoryFactory
[junit4:junit4]   2> 19764 T639 oasc.CachingDirectoryFactory.get return new directory for /usr/home/hudson/hudson-slave/workspace/Lucene-Solr-Tests-trunk-java7/solr/build/solr-core/test/J0/./org.apache.solr.cloud.ChaosMonkeySafeLeaderTest-1360765973520/jetty5 forceNew:false
[junit4:junit4]   2> 19765 T639 oasc.CachingDirectoryFactory.close Releasing directory:/usr/home/hudson/hudson-slave/workspace/Lucene-Solr-Tests-trunk-java7/solr/build/solr-core/test/J0/./org.apache.solr.cloud.ChaosMonkeySafeLeaderTest-1360765973520/jetty5
[junit4:junit4]   2> 19765 T639 oasc.SolrCore.getNewIndexDir New index directory detected: old=null new=./org.apache.solr.cloud.ChaosMonkeySafeLeaderTest-1360765973520/jetty5/index/
[junit4:junit4]   2> 19765 T639 oasc.SolrCore.initIndex WARNING [collection1] Solr index directory './org.apache.solr.cloud.ChaosMonkeySafeLeaderTest-1360765973520/jetty5/index' doesn't exist. Creating new index...
[junit4:junit4]   2> 19766 T639 oasc.CachingDirectoryFactory.get return new directory for /usr/home/hudson/hudson-slave/workspace/Lucene-Solr-Tests-trunk-java7/solr/build/solr-core/test/J0/./org.apache.solr.cloud.ChaosMonkeySafeLeaderTest-1360765973520/jetty5/index forceNew:false
[junit4:junit4]   2> 19785 T639 oasc.SolrDeletionPolicy.onCommit SolrDeletionPolicy.onCommit: commits:num=1
[junit4:junit4]   2> 		commit{dir=RateLimitedDirectoryWrapper(org.apache.lucene.store.NIOFSDirectory@/usr/home/hudson/hudson-slave/workspace/Lucene-Solr-Tests-trunk-java7/solr/build/solr-core/test/J0/org.apache.solr.cloud.ChaosMonkeySafeLeaderTest-1360765973520/jetty5/index lockFactory=org.apache.lucene.store.NativeFSLockFactory@1cff3eee),segFN=segments_1,generation=1,filenames=[segments_1]
[junit4:junit4]   2> 19785 T639 oasc.SolrDeletionPolicy.updateCommits newest commit = 1[segments_1]
[junit4:junit4]   2> 19786 T639 oasc.CachingDirectoryFactory.close Releasing directory:/usr/home/hudson/hudson-slave/workspace/Lucene-Solr-Tests-trunk-java7/solr/build/solr-core/test/J0/./org.apache.solr.cloud.ChaosMonkeySafeLeaderTest-1360765973520/jetty5/index
[junit4:junit4]   2> 19787 T639 oasc.SolrCore.initWriters created xml: solr.XMLResponseWriter
[junit4:junit4]   2> 19789 T639 oasup.UpdateRequestProcessorChain.init inserting DistributedUpdateProcessorFactory into updateRequestProcessorChain "dedupe"
[junit4:junit4]   2> 19789 T639 oasup.UpdateRequestProcessorChain.init inserting DistributedUpdateProcessorFactory into updateRequestProcessorChain "dedupe-allfields"
[junit4:junit4]   2> 19790 T639 oasup.UpdateRequestProcessorChain.init inserting DistributedUpdateProcessorFactory into updateRequestProcessorChain "stored_sig"
[junit4:junit4]   2> 19790 T639 oasup.UpdateRequestProcessorChain.init inserting DistributedUpdateProcessorFactory into updateRequestProcessorChain "uniq-fields"
[junit4:junit4]   2> 19791 T639 oasup.UpdateRequestProcessorChain.init inserting DistributedUpdateProcessorFactory into updateRequestProcessorChain "distrib-dup-test-chain-implicit"
[junit4:junit4]   2> 19791 T639 oasc.RequestHandlers.initHandlersFromConfig adding lazy requestHandler: solr.ReplicationHandler
[junit4:junit4]   2> 19791 T639 oasc.RequestHandlers.initHandlersFromConfig created /replication: solr.ReplicationHandler
[junit4:junit4]   2> 19792 T639 oasc.RequestHandlers.initHandlersFromConfig created standard: solr.StandardRequestHandler
[junit4:junit4]   2> 19793 T639 oasc.RequestHandlers.initHandlersFromConfig created /get: solr.RealTimeGetHandler
[junit4:junit4]   2> 19793 T639 oasc.RequestHandlers.initHandlersFromConfig created dismax: solr.SearchHandler
[junit4:junit4]   2> 19794 T639 oasc.RequestHandlers.initHandlersFromConfig created mock: org.apache.solr.core.MockQuerySenderListenerReqHandler
[junit4:junit4]   2> 19794 T639 oasc.RequestHandlers.initHandlersFromConfig created /admin/: org.apache.solr.handler.admin.AdminHandlers
[junit4:junit4]   2> 19795 T639 oasc.RequestHandlers.initHandlersFromConfig created defaults: solr.StandardRequestHandler
[junit4:junit4]   2> 19795 T639 oasc.RequestHandlers.initHandlersFromConfig adding lazy requestHandler: solr.StandardRequestHandler
[junit4:junit4]   2> 19796 T639 oasc.RequestHandlers.initHandlersFromConfig created lazy: solr.StandardRequestHandler
[junit4:junit4]   2> 19796 T639 oasc.RequestHandlers.initHandlersFromConfig created /update: solr.UpdateRequestHandler
[junit4:junit4]   2> 19797 T639 oasc.RequestHandlers.initHandlersFromConfig created /terms: org.apache.solr.handler.component.SearchHandler
[junit4:junit4]   2> 19797 T639 oasc.RequestHandlers.initHandlersFromConfig created spellCheckCompRH: org.apache.solr.handler.component.SearchHandler
[junit4:junit4]   2> 19798 T639 oasc.RequestHandlers.initHandlersFromConfig created spellCheckCompRH_Direct: org.apache.solr.handler.component.SearchHandler
[junit4:junit4]   2> 19799 T639 oasc.RequestHandlers.initHandlersFromConfig created spellCheckWithWordbreak: org.apache.solr.handler.component.SearchHandler
[junit4:junit4]   2> 19799 T639 oasc.RequestHandlers.initHandlersFromConfig created spellCheckWithWordbreak_Direct: org.apache.solr.handler.component.SearchHandler
[junit4:junit4]   2> 19800 T639 oasc.RequestHandlers.initHandlersFromConfig created spellCheckCompRH1: org.apache.solr.handler.component.SearchHandler
[junit4:junit4]   2> 19800 T639 oasc.RequestHandlers.initHandlersFromConfig created mltrh: org.apache.solr.handler.component.SearchHandler
[junit4:junit4]   2> 19801 T639 oasc.RequestHandlers.initHandlersFromConfig created tvrh: org.apache.solr.handler.component.SearchHandler
[junit4:junit4]   2> 19802 T639 oasc.RequestHandlers.initHandlersFromConfig created /mlt: solr.MoreLikeThisHandler
[junit4:junit4]   2> 19802 T639 oasc.RequestHandlers.initHandlersFromConfig created /debug/dump: solr.DumpRequestHandler
[junit4:junit4]   2> 19815 T639 oashl.XMLLoader.init xsltCacheLifetimeSeconds=60
[junit4:junit4]   2> 19820 T639 oasc.SolrCore.initDeprecatedSupport WARNING solrconfig.xml uses deprecated <admin/gettableFiles>, Please update your config to use the ShowFileRequestHandler.
[junit4:junit4]   2> 19821 T639 oasc.SolrCore.initDeprecatedSupport WARNING adding ShowFileRequestHandler with hidden files: [SCHEMA.XML, OLD_SYNONYMS.TXT, STOPWORDS.TXT, PROTWORDS.TXT, OPEN-EXCHANGE-RATES.JSON, SYNONYMS.TXT, CURRENCY.XML, MAPPING-ISOLATIN1ACCENT.TXT]
[junit4:junit4]   2> 19824 T639 oasc.CachingDirectoryFactory.close Releasing directory:/usr/home/hudson/hudson-slave/workspace/Lucene-Solr-Tests-trunk-java7/solr/build/solr-core/test/J0/./org.apache.solr.cloud.ChaosMonkeySafeLeaderTest-1360765973520/jetty5
[junit4:junit4]   2> 19825 T639 oass.SolrIndexSearcher.<init> Opening Searcher@6735e90a main
[junit4:junit4]   2> 19827 T639 oasu.CommitTracker.<init> Hard AutoCommit: disabled
[junit4:junit4]   2> 19827 T639 oasu.CommitTracker.<init> Soft AutoCommit: disabled
[junit4:junit4]   2> 19827 T639 oashc.SpellCheckComponent.inform Initializing spell checkers
[junit4:junit4]   2> 19834 T639 oass.DirectSolrSpellChecker.init init: {name=direct,classname=DirectSolrSpellChecker,field=lowerfilt,minQueryLength=3}
[junit4:junit4]   2> 19888 T640 oasc.SolrCore.registerSearcher [collection1] Registered new searcher Searcher@6735e90a main{StandardDirectoryReader(segments_1:1)}
[junit4:junit4]   2> 19894 T639 oasc.ZkController.publish publishing core=collection1 state=down
[junit4:junit4]   2> 19895 T639 oasc.ZkController.publish numShards not found on descriptor - reading it from system property
[junit4:junit4]   2> 20608 T559 oascc.ZkStateReader.updateClusterState Updating cloud state from ZooKeeper... 
[junit4:junit4]   2> 20609 T559 oasc.Overseer$ClusterStateUpdater.updateState Update state numShards=3 message={
[junit4:junit4]   2> 	  "operation":"state",
[junit4:junit4]   2> 	  "numShards":"3",
[junit4:junit4]   2> 	  "shard":null,
[junit4:junit4]   2> 	  "roles":null,
[junit4:junit4]   2> 	  "state":"down",
[junit4:junit4]   2> 	  "core":"collection1",
[junit4:junit4]   2> 	  "collection":"collection1",
[junit4:junit4]   2> 	  "node_name":"127.0.0.1:33901_",
[junit4:junit4]   2> 	  "base_url":"http://127.0.0.1:33901"}
[junit4:junit4]   2> 20609 T559 oasc.Overseer$ClusterStateUpdater.updateState Collection already exists with numShards=3
[junit4:junit4]   2> 20609 T559 oasc.Overseer$ClusterStateUpdater.updateState Assigning new node to shard shard=shard2
[junit4:junit4]   2> 20648 T592 oascc.ZkStateReader$2.process A cluster state change: WatchedEvent state:SyncConnected type:NodeDataChanged path:/clusterstate.json, has occurred - updating... (live nodes size: 6)
[junit4:junit4]   2> 20648 T558 oascc.ZkStateReader$2.process A cluster state change: WatchedEvent state:SyncConnected type:NodeDataChanged path:/clusterstate.json, has occurred - updating... (live nodes size: 6)
[junit4:junit4]   2> 20648 T577 oascc.ZkStateReader$2.process A cluster state change: WatchedEvent state:SyncConnected type:NodeDataChanged path:/clusterstate.json, has occurred - updating... (live nodes size: 6)
[junit4:junit4]   2> 20649 T638 oascc.ZkStateReader$2.process A cluster state change: WatchedEvent state:SyncConnected type:NodeDataChanged path:/clusterstate.json, has occurred - updating... (live nodes size: 6)
[junit4:junit4]   2> 20648 T564 oascc.ZkStateReader$2.process A cluster state change: WatchedEvent state:SyncConnected type:NodeDataChanged path:/clusterstate.json, has occurred - updating... (live nodes size: 6)
[junit4:junit4]   2> 20648 T622 oascc.ZkStateReader$2.process A cluster state change: WatchedEvent state:SyncConnected type:NodeDataChanged path:/clusterstate.json, has occurred - updating... (live nodes size: 6)
[junit4:junit4]   2> 20648 T607 oascc.ZkStateReader$2.process A cluster state change: WatchedEvent state:SyncConnected type:NodeDataChanged path:/clusterstate.json, has occurred - updating... (live nodes size: 6)
[junit4:junit4]   2> 20897 T639 oasc.CoreContainer.registerCore registering core: collection1
[junit4:junit4]   2> 20897 T639 oasc.ZkController.register Register replica - core:collection1 address:http://127.0.0.1:33901 collection:collection1 shard:shard2
[junit4:junit4]   2> 20901 T639 oasc.ZkController.register We are http://127.0.0.1:33901/collection1/ and leader is http://127.0.0.1:11434/collection1/
[junit4:junit4]   2> 20901 T639 oasc.ZkController.register No LogReplay needed for core=collection1 baseURL=http://127.0.0.1:33901
[junit4:junit4]   2> 20901 T639 oasc.ZkController.checkRecovery Core needs to recover:collection1
[junit4:junit4]   2> 20901 T639 oasu.DefaultSolrCoreState.doRecovery Running recovery - first canceling any ongoing recovery
[junit4:junit4]   2> ASYNC  NEW_CORE C25 name=collection1 org.apache.solr.core.SolrCore@3defad77 url=http://127.0.0.1:33901/collection1 node=127.0.0.1:33901_ C25_STATE=coll:collection1 core:collection1 props:{shard=null, roles=null, state=down, core=collection1, collection=collection1, node_name=127.0.0.1:33901_, base_url=http://127.0.0.1:33901}
[junit4:junit4]   2> 20902 T641 C25 P33901 oasc.RecoveryStrategy.run Starting recovery process.  core=collection1 recoveringAfterStartup=true
[junit4:junit4]   2> 20903 T641 C25 P33901 oasc.RecoveryStrategy.doRecovery ###### startupVersions=[]
[junit4:junit4]   2> 20903 T639 oascc.ZkStateReader.updateClusterState Updating cloud state from ZooKeeper... 
[junit4:junit4]   2> 20903 T641 C25 P33901 oasc.ZkController.publish publishing core=collection1 state=recovering
[junit4:junit4]   2> 20903 T641 C25 P33901 oasc.ZkController.publish numShards not found on descriptor - reading it from system property
[junit4:junit4]   2> 20904 T536 oass.SolrDispatchFilter.init user.dir=/usr/home/hudson/hudson-slave/workspace/Lucene-Solr-Tests-trunk-java7/solr/build/solr-core/test/J0
[junit4:junit4]   2> 20904 T536 oass.SolrDispatchFilter.init SolrDispatchFilter.init() done
[junit4:junit4]   2> 20905 T536 oascsi.HttpClientUtil.createClient Creating new http client, config:maxConnections=128&maxConnectionsPerHost=32&followRedirects=false
[junit4:junit4]   2> 20971 T641 C25 P33901 oascsi.HttpClientUtil.createClient Creating new http client, config:maxConnections=128&maxConnectionsPerHost=32&followRedirects=false
[junit4:junit4]   2> 21097 T536 oejs.Server.doStart jetty-8.1.8.v20121106
[junit4:junit4]   2> 21100 T536 oejs.AbstractConnector.doStart Started SocketConnector@127.0.0.1:35468
[junit4:junit4]   2> 21101 T536 oass.SolrDispatchFilter.init SolrDispatchFilter.init()
[junit4:junit4]   2> 21102 T536 oasc.SolrResourceLoader.locateSolrHome JNDI not configured for solr (NoInitialContextEx)
[junit4:junit4]   2> 21102 T536 oasc.SolrResourceLoader.locateSolrHome using system property solr.solr.home: /usr/home/hudson/hudson-slave/workspace/Lucene-Solr-Tests-trunk-java7/solr/build/solr-core/test/J0/./org.apache.solr.cloud.ChaosMonkeySafeLeaderTest-jetty6-1360765994437
[junit4:junit4]   2> 21102 T536 oasc.CoreContainer$Initializer.initialize looking for solr.xml: /usr/home/hudson/hudson-slave/workspace/Lucene-Solr-Tests-trunk-java7/solr/build/solr-core/test/J0/./org.apache.solr.cloud.ChaosMonkeySafeLeaderTest-jetty6-1360765994437/solr.xml
[junit4:junit4]   2> 21103 T536 oasc.CoreContainer.<init> New CoreContainer 97002500
[junit4:junit4]   2> 21103 T536 oasc.CoreContainer.load Loading CoreContainer using Solr Home: '/usr/home/hudson/hudson-slave/workspace/Lucene-Solr-Tests-trunk-java7/solr/build/solr-core/test/J0/./org.apache.solr.cloud.ChaosMonkeySafeLeaderTest-jetty6-1360765994437/'
[junit4:junit4]   2> 21104 T536 oasc.SolrResourceLoader.<init> new SolrResourceLoader for directory: '/usr/home/hudson/hudson-slave/workspace/Lucene-Solr-Tests-trunk-java7/solr/build/solr-core/test/J0/./org.apache.solr.cloud.ChaosMonkeySafeLeaderTest-jetty6-1360765994437/'
[junit4:junit4]   2> 21164 T536 oashc.HttpShardHandlerFactory.getParameter Setting socketTimeout to: 60000
[junit4:junit4]   2> 21164 T536 oashc.HttpShardHandlerFactory.getParameter Setting urlScheme to: http://
[junit4:junit4]   2> 21165 T536 oashc.HttpShardHandlerFactory.getParameter Setting connTimeout to: 15000
[junit4:junit4]   2> 21165 T536 oashc.HttpShardHandlerFactory.getParameter Setting maxConnectionsPerHost to: 20
[junit4:junit4]   2> 21165 T536 oashc.HttpShardHandlerFactory.getParameter Setting corePoolSize to: 0
[junit4:junit4]   2> 21166 T536 oashc.HttpShardHandlerFactory.getParameter Setting maximumPoolSize to: 2147483647
[junit4:junit4]   2> 21166 T536 oashc.HttpShardHandlerFactory.getParameter Setting maxThreadIdleTime to: 5
[junit4:junit4]   2> 21167 T536 oashc.HttpShardHandlerFactory.getParameter Setting sizeOfQueue to: -1
[junit4:junit4]   2> 21167 T536 oashc.HttpShardHandlerFactory.getParameter Setting fairnessPolicy to: false
[junit4:junit4]   2> 21168 T536 oascsi.HttpClientUtil.createClient Creating new http client, config:maxConnectionsPerHost=20&maxConnections=10000&socketTimeout=60000&connTimeout=15000&retry=false
[junit4:junit4]   2> 21191 T536 oasc.CoreContainer.load Registering Log Listener
[junit4:junit4]   2> 21210 T536 oasc.CoreContainer.initZooKeeper Zookeeper client=127.0.0.1:47126/solr
[junit4:junit4]   2> 21210 T536 oasc.ZkController.checkChrootPath zkHost includes chroot
[junit4:junit4]   2> 21211 T536 oaz.ZooKeeper.<init> Initiating client connection, connectString=127.0.0.1:47126 sessionTimeout=60000 watcher=org.apache.solr.common.cloud.ConnectionManager@276acd3b
[junit4:junit4]   2> 21212 T536 oascc.ConnectionManager.waitForConnected Waiting for client to connect to ZooKeeper
[junit4:junit4]   2> 21212 T651 oaz.ClientCnxn$SendThread.logStartConnect Opening socket connection to server localhost/127.0.0.1:47126. Will not attempt to authenticate using SASL (access denied ("javax.security.auth.AuthPermission" "getLoginConfiguration"))
[junit4:junit4]   2> 21213 T651 oaz.ClientCnxn$SendThread.primeConnection Socket connection established to localhost/127.0.0.1:47126, initiating session
[junit4:junit4]   2> 21214 T538 oazs.NIOServerCnxnFactory.run Accepted socket connection from /140.211.11.196:20152
[junit4:junit4]   2> 21214 T538 oazs.ZooKeeperServer.processConnectRequest Client attempting to establish new session at /140.211.11.196:20152
[junit4:junit4]   2> 21216 T540 oazs.ZooKeeperServer.finishSessionInit Established session 0x13cd3f8f419000f with negotiated timeout 20000 for client /140.211.11.196:20152
[junit4:junit4]   2> 21216 T651 oaz.ClientCnxn$SendThread.onConnected Session establishment complete on server localhost/127.0.0.1:47126, sessionid = 0x13cd3f8f419000f, negotiated timeout = 20000
[junit4:junit4]   2> 21216 T652 oascc.ConnectionManager.process Watcher org.apache.solr.common.cloud.ConnectionManager@276acd3b name:ZooKeeperConnection Watcher:127.0.0.1:47126 got event WatchedEvent state:SyncConnected type:None path:null path:null type:None
[junit4:junit4]   2> 21217 T536 oascc.ConnectionManager.waitForConnected Client is connected to ZooKeeper
[junit4:junit4]   2> 21218 T541 oazs.PrepRequestProcessor.pRequest2Txn Processed session termination for sessionid: 0x13cd3f8f419000f
[junit4:junit4]   2> 21230 T652 oaz.ClientCnxn$EventThread.run EventThread shut down
[junit4:junit4]   2> 21230 T538 oazs.NIOServerCnxn.closeSock Closed socket connection for client /140.211.11.196:20152 which had sessionid 0x13cd3f8f419000f
[junit4:junit4]   2> 21230 T536 oaz.ZooKeeper.close Session: 0x13cd3f8f419000f closed
[junit4:junit4]   2> 21231 T536 oascsi.HttpClientUtil.createClient Creating new http client, config:maxConnections=500&maxConnectionsPerHost=16&socketTimeout=60000&connTimeout=15000
[junit4:junit4]   2> 21244 T536 oaz.ZooKeeper.<init> Initiating client connection, connectString=127.0.0.1:47126/solr sessionTimeout=30000 watcher=org.apache.solr.common.cloud.ConnectionManager@42954a38
[junit4:junit4]   2> 21245 T536 oascc.ConnectionManager.waitForConnected Waiting for client to connect to ZooKeeper
[junit4:junit4]   2> 21245 T653 oaz.ClientCnxn$SendThread.logStartConnect Opening socket connection to server localhost/127.0.0.1:47126. Will not attempt to authenticate using SASL (access denied ("javax.security.auth.AuthPermission" "getLoginConfiguration"))
[junit4:junit4]   2> 21245 T653 oaz.ClientCnxn$SendThread.primeConnection Socket connection established to localhost/127.0.0.1:47126, initiating session
[junit4:junit4]   2> 21246 T538 oazs.NIOServerCnxnFactory.run Accepted socket connection from /140.211.11.196:55777
[junit4:junit4]   2> 21246 T538 oazs.ZooKeeperServer.processConnectRequest Client attempting to establish new session at /140.211.11.196:55777
[junit4:junit4]   2> 21247 T540 oazs.ZooKeeperServer.finishSessionInit Established session 0x13cd3f8f4190010 with negotiated timeout 20000 for client /140.211.11.196:55777
[junit4:junit4]   2> 21247 T653 oaz.ClientCnxn$SendThread.onConnected Session establishment complete on server localhost/127.0.0.1:47126, sessionid = 0x13cd3f8f4190010, negotiated timeout = 20000
[junit4:junit4]   2> 21248 T654 oascc.ConnectionManager.process Watcher org.apache.solr.common.cloud.ConnectionManager@42954a38 name:ZooKeeperConnection Watcher:127.0.0.1:47126/solr got event WatchedEvent state:SyncConnected type:None path:null path:null type:None
[junit4:junit4]   2> 21248 T536 oascc.ConnectionManager.waitForConnected Client is connected to ZooKeeper
[junit4:junit4]   2> 21249 T541 oazs.PrepRequestProcessor.pRequest Got user-level KeeperException when processing sessionid:0x13cd3f8f4190010 type:create cxid:0x1 zxid:0xd5 txntype:-1 reqpath:n/a Error Path:/solr/overseer Error:KeeperErrorCode = NodeExists for /solr/overseer
[junit4:junit4]   2> 21255 T541 oazs.PrepRequestProcessor.pRequest Got user-level KeeperException when processing sessionid:0x13cd3f8f4190010 type:create cxid:0x2 zxid:0xd6 txntype:-1 reqpath:n/a Error Path:/solr/overseer Error:Keep

[...truncated too long message...]

/workspace/Lucene-Solr-Tests-trunk-java7/solr/build/solr-core/test/J0/./org.apache.solr.cloud.SyncSliceTest-1360768147414/jetty4/index
[junit4:junit4]   2> 855127 T1368 oasc.CachingDirectoryFactory.closeDirectory Closing directory:/usr/home/hudson/hudson-slave/workspace/Lucene-Solr-Tests-trunk-java7/solr/build/solr-core/test/J0/./org.apache.solr.cloud.SyncSliceTest-1360768147414/jetty4/index
[junit4:junit4]   2> 867411 T1456 oaz.ClientCnxn$EventThread.run EventThread shut down
[junit4:junit4]   2> 867411 T1368 oaz.ZooKeeper.close Session: 0x13cd41a1fde000c closed
[junit4:junit4]   2> 867413 T1368 oejsh.ContextHandler.doStop stopped o.e.j.s.ServletContextHandler{/,null}
[junit4:junit4]   2> 867701 T1368 oas.SolrTestCaseJ4.tearDown ###Ending testDistribSearch
[junit4:junit4]   1> client port:0.0.0.0/0.0.0.0:0
[junit4:junit4]   2> NOTE: reproduce with: ant test  -Dtestcase=SyncSliceTest -Dtests.method=testDistribSearch -Dtests.seed=7DAB9B598DAD6F5F -Dtests.multiplier=3 -Dtests.slow=true -Dtests.locale=es_CL -Dtests.timezone=America/Indiana/Winamac -Dtests.file.encoding=ISO-8859-1
[junit4:junit4] FAILURE  868s J0 | SyncSliceTest.testDistribSearch <<<
[junit4:junit4]    > Throwable #1: java.lang.AssertionError: Test Setup Failure: shard1 should have just been set up to be inconsistent - but it's still consistent. Leader:http://127.0.0.1:10309/collection1skip list:[org.apache.solr.cloud.AbstractFullDistribZkTestBase$CloudJettyRunner@9aef17cd, org.apache.solr.cloud.AbstractFullDistribZkTestBase$CloudJettyRunner@1c5ce487]
[junit4:junit4]    > 	at __randomizedtesting.SeedInfo.seed([7DAB9B598DAD6F5F:FC4D1541FAF20F63]:0)
[junit4:junit4]    > 	at org.junit.Assert.fail(Assert.java:93)
[junit4:junit4]    > 	at org.junit.Assert.assertTrue(Assert.java:43)
[junit4:junit4]    > 	at org.junit.Assert.assertNotNull(Assert.java:526)
[junit4:junit4]    > 	at org.apache.solr.cloud.SyncSliceTest.doTest(SyncSliceTest.java:216)
[junit4:junit4]    > 	at org.apache.solr.BaseDistributedSearchTestCase.testDistribSearch(BaseDistributedSearchTestCase.java:794)
[junit4:junit4]    > 	at sun.reflect.NativeMethodAccessorImpl.invoke0(Native Method)
[junit4:junit4]    > 	at sun.reflect.NativeMethodAccessorImpl.invoke(NativeMethodAccessorImpl.java:57)
[junit4:junit4]    > 	at sun.reflect.DelegatingMethodAccessorImpl.invoke(DelegatingMethodAccessorImpl.java:43)
[junit4:junit4]    > 	at java.lang.reflect.Method.invoke(Method.java:601)
[junit4:junit4]    > 	at com.carrotsearch.randomizedtesting.RandomizedRunner.invoke(RandomizedRunner.java:1559)
[junit4:junit4]    > 	at com.carrotsearch.randomizedtesting.RandomizedRunner.access$600(RandomizedRunner.java:79)
[junit4:junit4]    > 	at com.carrotsearch.randomizedtesting.RandomizedRunner$6.evaluate(RandomizedRunner.java:737)
[junit4:junit4]    > 	at com.carrotsearch.randomizedtesting.RandomizedRunner$7.evaluate(RandomizedRunner.java:773)
[junit4:junit4]    > 	at com.carrotsearch.randomizedtesting.RandomizedRunner$8.evaluate(RandomizedRunner.java:787)
[junit4:junit4]    > 	at com.carrotsearch.randomizedtesting.rules.SystemPropertiesRestoreRule$1.evaluate(SystemPropertiesRestoreRule.java:53)
[junit4:junit4]    > 	at org.apache.lucene.util.TestRuleSetupTeardownChained$1.evaluate(TestRuleSetupTeardownChained.java:50)
[junit4:junit4]    > 	at org.apache.lucene.util.TestRuleFieldCacheSanity$1.evaluate(TestRuleFieldCacheSanity.java:51)
[junit4:junit4]    > 	at org.apache.lucene.util.AbstractBeforeAfterRule$1.evaluate(AbstractBeforeAfterRule.java:46)
[junit4:junit4]    > 	at com.carrotsearch.randomizedtesting.rules.SystemPropertiesInvariantRule$1.evaluate(SystemPropertiesInvariantRule.java:55)
[junit4:junit4]    > 	at org.apache.lucene.util.TestRuleThreadAndTestName$1.evaluate(TestRuleThreadAndTestName.java:49)
[junit4:junit4]    > 	at org.apache.lucene.util.TestRuleIgnoreAfterMaxFailures$1.evaluate(TestRuleIgnoreAfterMaxFailures.java:70)
[junit4:junit4]    > 	at org.apache.lucene.util.TestRuleMarkFailure$1.evaluate(TestRuleMarkFailure.java:48)
[junit4:junit4]    > 	at com.carrotsearch.randomizedtesting.rules.StatementAdapter.evaluate(StatementAdapter.java:36)
[junit4:junit4]    > 	at com.carrotsearch.randomizedtesting.ThreadLeakControl$StatementRunner.run(ThreadLeakControl.java:358)
[junit4:junit4]    > 	at com.carrotsearch.randomizedtesting.ThreadLeakControl.forkTimeoutingTask(ThreadLeakControl.java:782)
[junit4:junit4]    > 	at com.carrotsearch.randomizedtesting.ThreadLeakControl$3.evaluate(ThreadLeakControl.java:442)
[junit4:junit4]    > 	at com.carrotsearch.randomizedtesting.RandomizedRunner.runSingleTest(RandomizedRunner.java:746)
[junit4:junit4]    > 	at com.carrotsearch.randomizedtesting.RandomizedRunner$3.evaluate(RandomizedRunner.java:648)
[junit4:junit4]    > 	at com.carrotsearch.randomizedtesting.RandomizedRunner$4.evaluate(RandomizedRunner.java:682)
[junit4:junit4]    > 	at com.carrotsearch.randomizedtesting.RandomizedRunner$5.evaluate(RandomizedRunner.java:693)
[junit4:junit4]    > 	at com.carrotsearch.randomizedtesting.rules.StatementAdapter.evaluate(StatementAdapter.java:36)
[junit4:junit4]    > 	at com.carrotsearch.randomizedtesting.rules.SystemPropertiesRestoreRule$1.evaluate(SystemPropertiesRestoreRule.java:53)
[junit4:junit4]    > 	at org.apache.lucene.util.AbstractBeforeAfterRule$1.evaluate(AbstractBeforeAfterRule.java:46)
[junit4:junit4]    > 	at org.apache.lucene.util.TestRuleStoreClassName$1.evaluate(TestRuleStoreClassName.java:42)
[junit4:junit4]    > 	at com.carrotsearch.randomizedtesting.rules.SystemPropertiesInvariantRule$1.evaluate(SystemPropertiesInvariantRule.java:55)
[junit4:junit4]    > 	at com.carrotsearch.randomizedtesting.rules.NoShadowingOrOverridesOnMethodsRule$1.evaluate(NoShadowingOrOverridesOnMethodsRule.java:39)
[junit4:junit4]    > 	at com.carrotsearch.randomizedtesting.rules.NoShadowingOrOverridesOnMethodsRule$1.evaluate(NoShadowingOrOverridesOnMethodsRule.java:39)
[junit4:junit4]    > 	at com.carrotsearch.randomizedtesting.rules.StatementAdapter.evaluate(StatementAdapter.java:36)
[junit4:junit4]    > 	at org.apache.lucene.util.TestRuleAssertionsRequired$1.evaluate(TestRuleAssertionsRequired.java:43)
[junit4:junit4]    > 	at org.apache.lucene.util.TestRuleMarkFailure$1.evaluate(TestRuleMarkFailure.java:48)
[junit4:junit4]    > 	at org.apache.lucene.util.TestRuleIgnoreAfterMaxFailures$1.evaluate(TestRuleIgnoreAfterMaxFailures.java:70)
[junit4:junit4]    > 	at org.apache.lucene.util.TestRuleIgnoreTestSuites$1.evaluate(TestRuleIgnoreTestSuites.java:55)
[junit4:junit4]    > 	at com.carrotsearch.randomizedtesting.rules.StatementAdapter.evaluate(StatementAdapter.java:36)
[junit4:junit4]    > 	at com.carrotsearch.randomizedtesting.ThreadLeakControl$StatementRunner.run(ThreadLeakControl.java:358)
[junit4:junit4]    > 	at java.lang.Thread.run(Thread.java:722)
[junit4:junit4]   2> 867729 T1368 oas.SolrTestCaseJ4.deleteCore ###deleteCore
[junit4:junit4]   2> NOTE: test params are: codec=Lucene42: {range_facet_l=Lucene41(blocksize=128), text=PostingsFormat(name=Memory doPackFST= false), _version_=PostingsFormat(name=NestedPulsing), rnd_b=PostingsFormat(name=Lucene41WithOrds), intDefault=PostingsFormat(name=NestedPulsing), timestamp=Lucene41(blocksize=128), id=PostingsFormat(name=Lucene41WithOrds), a_t=Lucene41(blocksize=128), range_facet_sl=PostingsFormat(name=Lucene41WithOrds), range_facet_si=Lucene41(blocksize=128), other_tl1=PostingsFormat(name=NestedPulsing), multiDefault=Lucene41(blocksize=128), a_si=PostingsFormat(name=NestedPulsing)}, docValues:{}, sim=RandomSimilarityProvider(queryNorm=true,coord=no): {}, locale=es_CL, timezone=America/Indiana/Winamac
[junit4:junit4]   2> NOTE: FreeBSD 9.0-RELEASE amd64/Oracle Corporation 1.7.0_09 (64-bit)/cpus=16,threads=2,free=97291176,total=283115520
[junit4:junit4]   2> NOTE: All tests run in this JVM: [ZkCLITest, PreAnalyzedFieldTest, TestIndexingPerformance, DefaultValueUpdateProcessorTest, TestCollationField, CacheHeaderTest, TermVectorComponentDistributedTest, SolrRequestParserTest, CoreAdminHandlerTest, ShardRoutingTest, TestQueryTypes, NotRequiredUniqueKeyTest, MBeansHandlerTest, TestStressRecovery, ChaosMonkeySafeLeaderTest, TestLMJelinekMercerSimilarityFactory, TestFastLRUCache, DateMathParserTest, FileBasedSpellCheckerTest, MoreLikeThisHandlerTest, IndexBasedSpellCheckerTest, JsonLoaderTest, TestLFUCache, TestRandomFaceting, TestRangeQuery, SearchHandlerTest, TestNumberUtils, SpatialFilterTest, UpdateRequestProcessorFactoryTest, TestJmxMonitoredMap, TestFuzzyAnalyzedSuggestions, SuggesterFSTTest, CurrencyFieldTest, RegexBoostProcessorTest, TestPerFieldSimilarity, SyncSliceTest]
[junit4:junit4] Completed on J0 in 867.77s, 1 test, 1 failure <<< FAILURES!

[...truncated 83 lines...]
BUILD FAILED
/usr/home/hudson/hudson-slave/workspace/Lucene-Solr-Tests-trunk-java7/build.xml:381: The following error occurred while executing this line:
/usr/home/hudson/hudson-slave/workspace/Lucene-Solr-Tests-trunk-java7/build.xml:361: The following error occurred while executing this line:
/usr/home/hudson/hudson-slave/workspace/Lucene-Solr-Tests-trunk-java7/build.xml:39: The following error occurred while executing this line:
/usr/home/hudson/hudson-slave/workspace/Lucene-Solr-Tests-trunk-java7/solr/build.xml:183: The following error occurred while executing this line:
/usr/home/hudson/hudson-slave/workspace/Lucene-Solr-Tests-trunk-java7/solr/common-build.xml:447: The following error occurred while executing this line:
/usr/home/hudson/hudson-slave/workspace/Lucene-Solr-Tests-trunk-java7/lucene/common-build.xml:1202: The following error occurred while executing this line:
/usr/home/hudson/hudson-slave/workspace/Lucene-Solr-Tests-trunk-java7/lucene/common-build.xml:865: There were test failures: 250 suites, 1040 tests, 2 failures, 22 ignored (4 assumptions)

Total time: 77 minutes 36 seconds
Build step 'Invoke Ant' marked build as failure
Archiving artifacts
Recording test results
Email was triggered for: Failure
Sending email for trigger: Failure



Mime
View raw message