lucene-dev mailing list archives

Site index · List index
Message view « Date » · « Thread »
Top « Date » · « Thread »
From Policeman Jenkins Server <jenk...@thetaphi.de>
Subject [JENKINS] Lucene-Solr-trunk-MacOSX (64bit/jdk1.7.0) - Build # 182 - Failure!
Date Mon, 04 Feb 2013 12:41:07 GMT
Build: http://jenkins.thetaphi.de/job/Lucene-Solr-trunk-MacOSX/182/
Java: 64bit/jdk1.7.0 -XX:+UseConcMarkSweepGC

1 tests failed.
REGRESSION:  org.apache.solr.cloud.BasicDistributedZkTest.testDistribSearch

Error Message:
There are still nodes recoverying - waited for 230 seconds

Stack Trace:
java.lang.AssertionError: There are still nodes recoverying - waited for 230 seconds
	at __randomizedtesting.SeedInfo.seed([930688C156120156:12E006D9214D616A]:0)
	at org.junit.Assert.fail(Assert.java:93)
	at org.apache.solr.cloud.AbstractDistribZkTestBase.waitForRecoveriesToFinish(AbstractDistribZkTestBase.java:168)
	at org.apache.solr.cloud.AbstractDistribZkTestBase.waitForRecoveriesToFinish(AbstractDistribZkTestBase.java:126)
	at org.apache.solr.cloud.AbstractDistribZkTestBase.waitForRecoveriesToFinish(AbstractDistribZkTestBase.java:121)
	at org.apache.solr.cloud.BasicDistributedZkTest.testCoreUnloadAndLeaders(BasicDistributedZkTest.java:599)
	at org.apache.solr.cloud.BasicDistributedZkTest.doTest(BasicDistributedZkTest.java:337)
	at org.apache.solr.BaseDistributedSearchTestCase.testDistribSearch(BaseDistributedSearchTestCase.java:794)
	at sun.reflect.NativeMethodAccessorImpl.invoke0(Native Method)
	at sun.reflect.NativeMethodAccessorImpl.invoke(NativeMethodAccessorImpl.java:57)
	at sun.reflect.DelegatingMethodAccessorImpl.invoke(DelegatingMethodAccessorImpl.java:43)
	at java.lang.reflect.Method.invoke(Method.java:601)
	at com.carrotsearch.randomizedtesting.RandomizedRunner.invoke(RandomizedRunner.java:1559)
	at com.carrotsearch.randomizedtesting.RandomizedRunner.access$600(RandomizedRunner.java:79)
	at com.carrotsearch.randomizedtesting.RandomizedRunner$6.evaluate(RandomizedRunner.java:737)
	at com.carrotsearch.randomizedtesting.RandomizedRunner$7.evaluate(RandomizedRunner.java:773)
	at com.carrotsearch.randomizedtesting.RandomizedRunner$8.evaluate(RandomizedRunner.java:787)
	at com.carrotsearch.randomizedtesting.rules.SystemPropertiesRestoreRule$1.evaluate(SystemPropertiesRestoreRule.java:53)
	at org.apache.lucene.util.TestRuleSetupTeardownChained$1.evaluate(TestRuleSetupTeardownChained.java:50)
	at org.apache.lucene.util.TestRuleFieldCacheSanity$1.evaluate(TestRuleFieldCacheSanity.java:51)
	at org.apache.lucene.util.AbstractBeforeAfterRule$1.evaluate(AbstractBeforeAfterRule.java:46)
	at com.carrotsearch.randomizedtesting.rules.SystemPropertiesInvariantRule$1.evaluate(SystemPropertiesInvariantRule.java:55)
	at org.apache.lucene.util.TestRuleThreadAndTestName$1.evaluate(TestRuleThreadAndTestName.java:49)
	at org.apache.lucene.util.TestRuleIgnoreAfterMaxFailures$1.evaluate(TestRuleIgnoreAfterMaxFailures.java:70)
	at org.apache.lucene.util.TestRuleMarkFailure$1.evaluate(TestRuleMarkFailure.java:48)
	at com.carrotsearch.randomizedtesting.rules.StatementAdapter.evaluate(StatementAdapter.java:36)
	at com.carrotsearch.randomizedtesting.ThreadLeakControl$StatementRunner.run(ThreadLeakControl.java:358)
	at com.carrotsearch.randomizedtesting.ThreadLeakControl.forkTimeoutingTask(ThreadLeakControl.java:782)
	at com.carrotsearch.randomizedtesting.ThreadLeakControl$3.evaluate(ThreadLeakControl.java:442)
	at com.carrotsearch.randomizedtesting.RandomizedRunner.runSingleTest(RandomizedRunner.java:746)
	at com.carrotsearch.randomizedtesting.RandomizedRunner$3.evaluate(RandomizedRunner.java:648)
	at com.carrotsearch.randomizedtesting.RandomizedRunner$4.evaluate(RandomizedRunner.java:682)
	at com.carrotsearch.randomizedtesting.RandomizedRunner$5.evaluate(RandomizedRunner.java:693)
	at com.carrotsearch.randomizedtesting.rules.StatementAdapter.evaluate(StatementAdapter.java:36)
	at com.carrotsearch.randomizedtesting.rules.SystemPropertiesRestoreRule$1.evaluate(SystemPropertiesRestoreRule.java:53)
	at org.apache.lucene.util.AbstractBeforeAfterRule$1.evaluate(AbstractBeforeAfterRule.java:46)
	at org.apache.lucene.util.TestRuleStoreClassName$1.evaluate(TestRuleStoreClassName.java:42)
	at com.carrotsearch.randomizedtesting.rules.SystemPropertiesInvariantRule$1.evaluate(SystemPropertiesInvariantRule.java:55)
	at com.carrotsearch.randomizedtesting.rules.NoShadowingOrOverridesOnMethodsRule$1.evaluate(NoShadowingOrOverridesOnMethodsRule.java:39)
	at com.carrotsearch.randomizedtesting.rules.NoShadowingOrOverridesOnMethodsRule$1.evaluate(NoShadowingOrOverridesOnMethodsRule.java:39)
	at com.carrotsearch.randomizedtesting.rules.StatementAdapter.evaluate(StatementAdapter.java:36)
	at org.apache.lucene.util.TestRuleAssertionsRequired$1.evaluate(TestRuleAssertionsRequired.java:43)
	at org.apache.lucene.util.TestRuleMarkFailure$1.evaluate(TestRuleMarkFailure.java:48)
	at org.apache.lucene.util.TestRuleIgnoreAfterMaxFailures$1.evaluate(TestRuleIgnoreAfterMaxFailures.java:70)
	at org.apache.lucene.util.TestRuleIgnoreTestSuites$1.evaluate(TestRuleIgnoreTestSuites.java:55)
	at com.carrotsearch.randomizedtesting.rules.StatementAdapter.evaluate(StatementAdapter.java:36)
	at com.carrotsearch.randomizedtesting.ThreadLeakControl$StatementRunner.run(ThreadLeakControl.java:358)
	at java.lang.Thread.run(Thread.java:722)




Build Log:
[...truncated 8753 lines...]
[junit4:junit4] Suite: org.apache.solr.cloud.BasicDistributedZkTest
[junit4:junit4]   2> 0 T703 oas.BaseDistributedSearchTestCase.initHostContext Setting hostContext system property: /
[junit4:junit4]   2> 15 T703 oas.SolrTestCaseJ4.setUp ###Starting testDistribSearch
[junit4:junit4]   2> Creating dataDir: /Users/jenkins/jenkins-slave/workspace/Lucene-Solr-trunk-MacOSX/solr/build/solr-core/test/J0/./solrtest-BasicDistributedZkTest-1359979901484
[junit4:junit4]   2> 16 T703 oasc.ZkTestServer.run STARTING ZK TEST SERVER
[junit4:junit4]   2> 17 T704 oasc.ZkTestServer$ZKServerMain.runFromConfig Starting server
[junit4:junit4]   2> 25 T704 oazs.ZooKeeperServer.setTickTime tickTime set to 1000
[junit4:junit4]   2> 25 T704 oazs.ZooKeeperServer.setMinSessionTimeout minSessionTimeout set to -1
[junit4:junit4]   2> 26 T704 oazs.ZooKeeperServer.setMaxSessionTimeout maxSessionTimeout set to -1
[junit4:junit4]   2> 26 T704 oazs.NIOServerCnxnFactory.configure binding to port 0.0.0.0/0.0.0.0:0
[junit4:junit4]   2> 28 T704 oazsp.FileTxnSnapLog.save Snapshotting: 0x0 to /Users/jenkins/jenkins-slave/workspace/Lucene-Solr-trunk-MacOSX/solr/build/solr-core/test/J0/./org.apache.solr.cloud.BasicDistributedZkTest-1359979901483/zookeeper/server1/data/version-2/snapshot.0
[junit4:junit4]   2> 126 T703 oasc.ZkTestServer.run start zk server on port:49308
[junit4:junit4]   2> 127 T703 oaz.ZooKeeper.<init> Initiating client connection, connectString=127.0.0.1:49308 sessionTimeout=10000 watcher=org.apache.solr.common.cloud.ConnectionManager@5854278
[junit4:junit4]   2> 129 T709 oaz.ClientCnxn$SendThread.logStartConnect Opening socket connection to server localhost/127.0.0.1:49308. Will not attempt to authenticate using SASL (access denied ("javax.security.auth.AuthPermission" "getLoginConfiguration"))
[junit4:junit4]   2> 130 T705 oazs.NIOServerCnxnFactory.run Accepted socket connection from /127.0.0.1:49309
[junit4:junit4]   2> 131 T703 oascc.ConnectionManager.waitForConnected Waiting for client to connect to ZooKeeper
[junit4:junit4]   2> 132 T709 oaz.ClientCnxn$SendThread.primeConnection Socket connection established to localhost/127.0.0.1:49308, initiating session
[junit4:junit4]   2> 132 T705 oazs.ZooKeeperServer.processConnectRequest Client attempting to establish new session at /127.0.0.1:49309
[junit4:junit4]   2> 133 T707 oazsp.FileTxnLog.append Creating new log file: log.1
[junit4:junit4]   2> 137 T707 oazs.ZooKeeperServer.finishSessionInit Established session 0x13ca51e72390000 with negotiated timeout 10000 for client /127.0.0.1:49309
[junit4:junit4]   2> 137 T709 oaz.ClientCnxn$SendThread.onConnected Session establishment complete on server localhost/127.0.0.1:49308, sessionid = 0x13ca51e72390000, negotiated timeout = 10000
[junit4:junit4]   2> 138 T710 oascc.ConnectionManager.process Watcher org.apache.solr.common.cloud.ConnectionManager@5854278 name:ZooKeeperConnection Watcher:127.0.0.1:49308 got event WatchedEvent state:SyncConnected type:None path:null path:null type:None
[junit4:junit4]   2> 138 T703 oascc.ConnectionManager.waitForConnected Client is connected to ZooKeeper
[junit4:junit4]   2> 139 T703 oascc.SolrZkClient.makePath makePath: /solr
[junit4:junit4]   2> 144 T708 oazs.PrepRequestProcessor.pRequest2Txn Processed session termination for sessionid: 0x13ca51e72390000
[junit4:junit4]   2> 146 T710 oaz.ClientCnxn$EventThread.run EventThread shut down
[junit4:junit4]   2> 146 T703 oaz.ZooKeeper.close Session: 0x13ca51e72390000 closed
[junit4:junit4]   2> 147 T703 oaz.ZooKeeper.<init> Initiating client connection, connectString=127.0.0.1:49308/solr sessionTimeout=10000 watcher=org.apache.solr.common.cloud.ConnectionManager@3dbb284a
[junit4:junit4]   2> 148 T711 oaz.ClientCnxn$SendThread.logStartConnect Opening socket connection to server localhost/127.0.0.1:49308. Will not attempt to authenticate using SASL (access denied ("javax.security.auth.AuthPermission" "getLoginConfiguration"))
[junit4:junit4]   2> 148 T703 oascc.ConnectionManager.waitForConnected Waiting for client to connect to ZooKeeper
[junit4:junit4]   2> 149 T711 oaz.ClientCnxn$SendThread.primeConnection Socket connection established to localhost/127.0.0.1:49308, initiating session
[junit4:junit4]   2> 149 T705 oazs.NIOServerCnxn.closeSock Closed socket connection for client /127.0.0.1:49309 which had sessionid 0x13ca51e72390000
[junit4:junit4]   2> 151 T705 oazs.NIOServerCnxnFactory.run Accepted socket connection from /127.0.0.1:49310
[junit4:junit4]   2> 153 T705 oazs.ZooKeeperServer.processConnectRequest Client attempting to establish new session at /127.0.0.1:49310
[junit4:junit4]   2> 158 T707 oazs.ZooKeeperServer.finishSessionInit Established session 0x13ca51e72390001 with negotiated timeout 10000 for client /127.0.0.1:49310
[junit4:junit4]   2> 158 T711 oaz.ClientCnxn$SendThread.onConnected Session establishment complete on server localhost/127.0.0.1:49308, sessionid = 0x13ca51e72390001, negotiated timeout = 10000
[junit4:junit4]   2> 159 T712 oascc.ConnectionManager.process Watcher org.apache.solr.common.cloud.ConnectionManager@3dbb284a name:ZooKeeperConnection Watcher:127.0.0.1:49308/solr got event WatchedEvent state:SyncConnected type:None path:null path:null type:None
[junit4:junit4]   2> 159 T703 oascc.ConnectionManager.waitForConnected Client is connected to ZooKeeper
[junit4:junit4]   2> 160 T703 oascc.SolrZkClient.makePath makePath: /collections/collection1
[junit4:junit4]   2> 169 T703 oascc.SolrZkClient.makePath makePath: /collections/collection1/shards
[junit4:junit4]   2> 176 T703 oascc.SolrZkClient.makePath makePath: /collections/control_collection
[junit4:junit4]   2> 181 T703 oascc.SolrZkClient.makePath makePath: /collections/control_collection/shards
[junit4:junit4]   2> 189 T703 oasc.AbstractZkTestCase.putConfig put /Users/jenkins/jenkins-slave/workspace/Lucene-Solr-trunk-MacOSX/solr/build/solr-core/test-files/solr/collection1/conf/solrconfig.xml to /configs/conf1/solrconfig.xml
[junit4:junit4]   2> 190 T703 oascc.SolrZkClient.makePath makePath: /configs/conf1/solrconfig.xml
[junit4:junit4]   2> 231 T703 oasc.AbstractZkTestCase.putConfig put /Users/jenkins/jenkins-slave/workspace/Lucene-Solr-trunk-MacOSX/solr/build/solr-core/test-files/solr/collection1/conf/schema.xml to /configs/conf1/schema.xml
[junit4:junit4]   2> 233 T703 oascc.SolrZkClient.makePath makePath: /configs/conf1/schema.xml
[junit4:junit4]   2> 238 T703 oasc.AbstractZkTestCase.putConfig put /Users/jenkins/jenkins-slave/workspace/Lucene-Solr-trunk-MacOSX/solr/build/solr-core/test-files/solr/collection1/conf/stopwords.txt to /configs/conf1/stopwords.txt
[junit4:junit4]   2> 239 T703 oascc.SolrZkClient.makePath makePath: /configs/conf1/stopwords.txt
[junit4:junit4]   2> 245 T703 oasc.AbstractZkTestCase.putConfig put /Users/jenkins/jenkins-slave/workspace/Lucene-Solr-trunk-MacOSX/solr/build/solr-core/test-files/solr/collection1/conf/protwords.txt to /configs/conf1/protwords.txt
[junit4:junit4]   2> 246 T703 oascc.SolrZkClient.makePath makePath: /configs/conf1/protwords.txt
[junit4:junit4]   2> 255 T703 oasc.AbstractZkTestCase.putConfig put /Users/jenkins/jenkins-slave/workspace/Lucene-Solr-trunk-MacOSX/solr/build/solr-core/test-files/solr/collection1/conf/currency.xml to /configs/conf1/currency.xml
[junit4:junit4]   2> 256 T703 oascc.SolrZkClient.makePath makePath: /configs/conf1/currency.xml
[junit4:junit4]   2> 264 T703 oasc.AbstractZkTestCase.putConfig put /Users/jenkins/jenkins-slave/workspace/Lucene-Solr-trunk-MacOSX/solr/build/solr-core/test-files/solr/collection1/conf/open-exchange-rates.json to /configs/conf1/open-exchange-rates.json
[junit4:junit4]   2> 264 T703 oascc.SolrZkClient.makePath makePath: /configs/conf1/open-exchange-rates.json
[junit4:junit4]   2> 272 T703 oasc.AbstractZkTestCase.putConfig put /Users/jenkins/jenkins-slave/workspace/Lucene-Solr-trunk-MacOSX/solr/build/solr-core/test-files/solr/collection1/conf/mapping-ISOLatin1Accent.txt to /configs/conf1/mapping-ISOLatin1Accent.txt
[junit4:junit4]   2> 272 T703 oascc.SolrZkClient.makePath makePath: /configs/conf1/mapping-ISOLatin1Accent.txt
[junit4:junit4]   2> 292 T703 oasc.AbstractZkTestCase.putConfig put /Users/jenkins/jenkins-slave/workspace/Lucene-Solr-trunk-MacOSX/solr/build/solr-core/test-files/solr/collection1/conf/old_synonyms.txt to /configs/conf1/old_synonyms.txt
[junit4:junit4]   2> 293 T703 oascc.SolrZkClient.makePath makePath: /configs/conf1/old_synonyms.txt
[junit4:junit4]   2> 299 T703 oasc.AbstractZkTestCase.putConfig put /Users/jenkins/jenkins-slave/workspace/Lucene-Solr-trunk-MacOSX/solr/build/solr-core/test-files/solr/collection1/conf/synonyms.txt to /configs/conf1/synonyms.txt
[junit4:junit4]   2> 300 T703 oascc.SolrZkClient.makePath makePath: /configs/conf1/synonyms.txt
[junit4:junit4]   2> 306 T708 oazs.PrepRequestProcessor.pRequest2Txn Processed session termination for sessionid: 0x13ca51e72390001
[junit4:junit4]   2> 308 T705 oazs.NIOServerCnxn.closeSock Closed socket connection for client /127.0.0.1:49310 which had sessionid 0x13ca51e72390001
[junit4:junit4]   2> 313 T712 oaz.ClientCnxn$EventThread.run EventThread shut down
[junit4:junit4]   2> 314 T703 oaz.ZooKeeper.close Session: 0x13ca51e72390001 closed
[junit4:junit4]   2> 537 T703 oejs.Server.doStart jetty-8.1.8.v20121106
[junit4:junit4]   2> 830 T703 oejs.AbstractConnector.doStart Started SelectChannelConnector@127.0.0.1:49311
[junit4:junit4]   2> 831 T703 oass.SolrDispatchFilter.init SolrDispatchFilter.init()
[junit4:junit4]   2> 832 T703 oasc.SolrResourceLoader.locateSolrHome JNDI not configured for solr (NoInitialContextEx)
[junit4:junit4]   2> 833 T703 oasc.SolrResourceLoader.locateSolrHome using system property solr.solr.home: /Users/jenkins/jenkins-slave/workspace/Lucene-Solr-trunk-MacOSX/solr/build/solr-core/test/J0/./org.apache.solr.cloud.BasicDistributedZkTest-controljetty-1359979901783
[junit4:junit4]   2> 833 T703 oasc.CoreContainer$Initializer.initialize looking for solr.xml: /Users/jenkins/jenkins-slave/workspace/Lucene-Solr-trunk-MacOSX/solr/build/solr-core/test/J0/./org.apache.solr.cloud.BasicDistributedZkTest-controljetty-1359979901783/solr.xml
[junit4:junit4]   2> 834 T703 oasc.CoreContainer.<init> New CoreContainer 307548210
[junit4:junit4]   2> 835 T703 oasc.CoreContainer.load Loading CoreContainer using Solr Home: '/Users/jenkins/jenkins-slave/workspace/Lucene-Solr-trunk-MacOSX/solr/build/solr-core/test/J0/./org.apache.solr.cloud.BasicDistributedZkTest-controljetty-1359979901783/'
[junit4:junit4]   2> 835 T703 oasc.SolrResourceLoader.<init> new SolrResourceLoader for directory: '/Users/jenkins/jenkins-slave/workspace/Lucene-Solr-trunk-MacOSX/solr/build/solr-core/test/J0/./org.apache.solr.cloud.BasicDistributedZkTest-controljetty-1359979901783/'
[junit4:junit4]   2> 882 T703 oashc.HttpShardHandlerFactory.getParameter Setting socketTimeout to: 60000
[junit4:junit4]   2> 887 T703 oashc.HttpShardHandlerFactory.getParameter Setting urlScheme to: http://
[junit4:junit4]   2> 887 T703 oashc.HttpShardHandlerFactory.getParameter Setting connTimeout to: 15000
[junit4:junit4]   2> 888 T703 oashc.HttpShardHandlerFactory.getParameter Setting maxConnectionsPerHost to: 20
[junit4:junit4]   2> 889 T703 oashc.HttpShardHandlerFactory.getParameter Setting corePoolSize to: 0
[junit4:junit4]   2> 890 T703 oashc.HttpShardHandlerFactory.getParameter Setting maximumPoolSize to: 2147483647
[junit4:junit4]   2> 891 T703 oashc.HttpShardHandlerFactory.getParameter Setting maxThreadIdleTime to: 5
[junit4:junit4]   2> 891 T703 oashc.HttpShardHandlerFactory.getParameter Setting sizeOfQueue to: -1
[junit4:junit4]   2> 892 T703 oashc.HttpShardHandlerFactory.getParameter Setting fairnessPolicy to: false
[junit4:junit4]   2> 894 T703 oascsi.HttpClientUtil.createClient Creating new http client, config:maxConnectionsPerHost=20&maxConnections=10000&socketTimeout=60000&connTimeout=15000&retry=false
[junit4:junit4]   2> 928 T703 oasc.CoreContainer.load Registering Log Listener
[junit4:junit4]   2> 948 T703 oasc.CoreContainer.initZooKeeper Zookeeper client=127.0.0.1:49308/solr
[junit4:junit4]   2> 949 T703 oasc.ZkController.checkChrootPath zkHost includes chroot
[junit4:junit4]   2> 949 T703 oaz.ZooKeeper.<init> Initiating client connection, connectString=127.0.0.1:49308 sessionTimeout=60000 watcher=org.apache.solr.common.cloud.ConnectionManager@31daa59d
[junit4:junit4]   2> 955 T722 oaz.ClientCnxn$SendThread.logStartConnect Opening socket connection to server localhost/127.0.0.1:49308. Will not attempt to authenticate using SASL (access denied ("javax.security.auth.AuthPermission" "getLoginConfiguration"))
[junit4:junit4]   2> 955 T703 oascc.ConnectionManager.waitForConnected Waiting for client to connect to ZooKeeper
[junit4:junit4]   2> 964 T722 oaz.ClientCnxn$SendThread.primeConnection Socket connection established to localhost/127.0.0.1:49308, initiating session
[junit4:junit4]   2> 971 T705 oazs.NIOServerCnxnFactory.run Accepted socket connection from /127.0.0.1:49312
[junit4:junit4]   2> 974 T705 oazs.ZooKeeperServer.processConnectRequest Client attempting to establish new session at /127.0.0.1:49312
[junit4:junit4]   2> 976 T707 oazs.ZooKeeperServer.finishSessionInit Established session 0x13ca51e72390002 with negotiated timeout 20000 for client /127.0.0.1:49312
[junit4:junit4]   2> 976 T722 oaz.ClientCnxn$SendThread.onConnected Session establishment complete on server localhost/127.0.0.1:49308, sessionid = 0x13ca51e72390002, negotiated timeout = 20000
[junit4:junit4]   2> 977 T723 oascc.ConnectionManager.process Watcher org.apache.solr.common.cloud.ConnectionManager@31daa59d name:ZooKeeperConnection Watcher:127.0.0.1:49308 got event WatchedEvent state:SyncConnected type:None path:null path:null type:None
[junit4:junit4]   2> 977 T703 oascc.ConnectionManager.waitForConnected Client is connected to ZooKeeper
[junit4:junit4]   2> 980 T708 oazs.PrepRequestProcessor.pRequest2Txn Processed session termination for sessionid: 0x13ca51e72390002
[junit4:junit4]   2> 984 T705 oazs.NIOServerCnxn.closeSock Closed socket connection for client /127.0.0.1:49312 which had sessionid 0x13ca51e72390002
[junit4:junit4]   2> 985 T703 oaz.ZooKeeper.close Session: 0x13ca51e72390002 closed
[junit4:junit4]   2> 985 T703 oascsi.HttpClientUtil.createClient Creating new http client, config:maxConnections=500&maxConnectionsPerHost=16&socketTimeout=60000&connTimeout=15000
[junit4:junit4]   2> 996 T703 oaz.ZooKeeper.<init> Initiating client connection, connectString=127.0.0.1:49308/solr sessionTimeout=30000 watcher=org.apache.solr.common.cloud.ConnectionManager@47c40da1
[junit4:junit4]   2> 998 T724 oaz.ClientCnxn$SendThread.logStartConnect Opening socket connection to server localhost/127.0.0.1:49308. Will not attempt to authenticate using SASL (access denied ("javax.security.auth.AuthPermission" "getLoginConfiguration"))
[junit4:junit4]   2> 998 T723 oaz.ClientCnxn$EventThread.run EventThread shut down
[junit4:junit4]   2> 998 T724 oaz.ClientCnxn$SendThread.primeConnection Socket connection established to localhost/127.0.0.1:49308, initiating session
[junit4:junit4]   2> 999 T705 oazs.NIOServerCnxnFactory.run Accepted socket connection from /127.0.0.1:49313
[junit4:junit4]   2> 999 T705 oazs.ZooKeeperServer.processConnectRequest Client attempting to establish new session at /127.0.0.1:49313
[junit4:junit4]   2> 1004 T703 oascc.ConnectionManager.waitForConnected Waiting for client to connect to ZooKeeper
[junit4:junit4]   2> 1005 T707 oazs.ZooKeeperServer.finishSessionInit Established session 0x13ca51e72390003 with negotiated timeout 20000 for client /127.0.0.1:49313
[junit4:junit4]   2> 1005 T724 oaz.ClientCnxn$SendThread.onConnected Session establishment complete on server localhost/127.0.0.1:49308, sessionid = 0x13ca51e72390003, negotiated timeout = 20000
[junit4:junit4]   2> 1005 T725 oascc.ConnectionManager.process Watcher org.apache.solr.common.cloud.ConnectionManager@47c40da1 name:ZooKeeperConnection Watcher:127.0.0.1:49308/solr got event WatchedEvent state:SyncConnected type:None path:null path:null type:None
[junit4:junit4]   2> 1006 T703 oascc.ConnectionManager.waitForConnected Client is connected to ZooKeeper
[junit4:junit4]   2> 1008 T708 oazs.PrepRequestProcessor.pRequest Got user-level KeeperException when processing sessionid:0x13ca51e72390003 type:create cxid:0x2 zxid:0x1a txntype:-1 reqpath:n/a Error Path:/solr/overseer Error:KeeperErrorCode = NodeExists for /solr/overseer
[junit4:junit4]   2> 1010 T703 oascc.SolrZkClient.makePath makePath: /live_nodes
[junit4:junit4]   2> 1023 T703 oasc.ZkController.createEphemeralLiveNode Register node as live in ZooKeeper:/live_nodes/127.0.0.1:49311_
[junit4:junit4]   2> 1024 T708 oazs.PrepRequestProcessor.pRequest Got user-level KeeperException when processing sessionid:0x13ca51e72390003 type:delete cxid:0x7 zxid:0x1c txntype:-1 reqpath:n/a Error Path:/solr/live_nodes/127.0.0.1:49311_ Error:KeeperErrorCode = NoNode for /solr/live_nodes/127.0.0.1:49311_
[junit4:junit4]   2> 1025 T703 oascc.SolrZkClient.makePath makePath: /live_nodes/127.0.0.1:49311_
[junit4:junit4]   2> 1031 T703 oascc.SolrZkClient.makePath makePath: /overseer_elect/election
[junit4:junit4]   2> 1042 T708 oazs.PrepRequestProcessor.pRequest Got user-level KeeperException when processing sessionid:0x13ca51e72390003 type:delete cxid:0x15 zxid:0x21 txntype:-1 reqpath:n/a Error Path:/solr/overseer_elect/leader Error:KeeperErrorCode = NoNode for /solr/overseer_elect/leader
[junit4:junit4]   2> 1043 T703 oascc.SolrZkClient.makePath makePath: /overseer_elect/leader
[junit4:junit4]   2> 1048 T703 oasc.Overseer.start Overseer (id=89127642824507395-127.0.0.1:49311_-n_0000000000) starting
[junit4:junit4]   2> 1048 T708 oazs.PrepRequestProcessor.pRequest Got user-level KeeperException when processing sessionid:0x13ca51e72390003 type:create cxid:0x1a zxid:0x23 txntype:-1 reqpath:n/a Error Path:/solr/overseer Error:KeeperErrorCode = NodeExists for /solr/overseer
[junit4:junit4]   2> 1050 T708 oazs.PrepRequestProcessor.pRequest Got user-level KeeperException when processing sessionid:0x13ca51e72390003 type:create cxid:0x1b zxid:0x24 txntype:-1 reqpath:n/a Error Path:/solr/overseer Error:KeeperErrorCode = NodeExists for /solr/overseer
[junit4:junit4]   2> 1051 T708 oazs.PrepRequestProcessor.pRequest Got user-level KeeperException when processing sessionid:0x13ca51e72390003 type:create cxid:0x1c zxid:0x25 txntype:-1 reqpath:n/a Error Path:/solr/overseer Error:KeeperErrorCode = NodeExists for /solr/overseer
[junit4:junit4]   2> 1053 T708 oazs.PrepRequestProcessor.pRequest Got user-level KeeperException when processing sessionid:0x13ca51e72390003 type:create cxid:0x1d zxid:0x26 txntype:-1 reqpath:n/a Error Path:/solr/overseer Error:KeeperErrorCode = NodeExists for /solr/overseer
[junit4:junit4]   2> 1054 T727 oasc.OverseerCollectionProcessor.run Process current queue of collection creations
[junit4:junit4]   2> 1056 T703 oascc.SolrZkClient.makePath makePath: /clusterstate.json
[junit4:junit4]   2> 1060 T703 oascc.ZkStateReader.createClusterStateWatchersAndUpdate Updating cluster state from ZooKeeper... 
[junit4:junit4]   2> 1068 T728 oasc.CoreContainer.create Creating SolrCore 'collection1' using instanceDir: /Users/jenkins/jenkins-slave/workspace/Lucene-Solr-trunk-MacOSX/solr/build/solr-core/test/J0/./org.apache.solr.cloud.BasicDistributedZkTest-controljetty-1359979901783/collection1
[junit4:junit4]   2> 1068 T728 oasc.ZkController.createCollectionZkNode Check for collection zkNode:control_collection
[junit4:junit4]   2> 1070 T728 oasc.ZkController.createCollectionZkNode Collection zkNode exists
[junit4:junit4]   2> 1070 T728 oasc.ZkController.readConfigName Load collection config from:/collections/control_collection
[junit4:junit4]   2> 1072 T728 oasc.SolrResourceLoader.<init> new SolrResourceLoader for directory: '/Users/jenkins/jenkins-slave/workspace/Lucene-Solr-trunk-MacOSX/solr/build/solr-core/test/J0/./org.apache.solr.cloud.BasicDistributedZkTest-controljetty-1359979901783/collection1/'
[junit4:junit4]   2> 1073 T728 oasc.SolrResourceLoader.replaceClassLoader Adding 'file:/Users/jenkins/jenkins-slave/workspace/Lucene-Solr-trunk-MacOSX/solr/build/solr-core/test/J0/org.apache.solr.cloud.BasicDistributedZkTest-controljetty-1359979901783/collection1/lib/classes/' to classloader
[junit4:junit4]   2> 1074 T728 oasc.SolrResourceLoader.replaceClassLoader Adding 'file:/Users/jenkins/jenkins-slave/workspace/Lucene-Solr-trunk-MacOSX/solr/build/solr-core/test/J0/org.apache.solr.cloud.BasicDistributedZkTest-controljetty-1359979901783/collection1/lib/README' to classloader
[junit4:junit4]   2> 1096 T726 oasc.Overseer$ClusterStateUpdater.run Starting to work on the main queue
[junit4:junit4]   2> 1159 T728 oasc.SolrConfig.<init> Using Lucene MatchVersion: LUCENE_50
[junit4:junit4]   2> 1257 T728 oasc.SolrConfig.<init> Loaded SolrConfig: solrconfig.xml
[junit4:junit4]   2> 1259 T728 oass.IndexSchema.readSchema Reading Solr Schema
[junit4:junit4]   2> 1268 T728 oass.IndexSchema.readSchema Schema name=test
[junit4:junit4]   2> 2197 T728 oass.OpenExchangeRatesOrgProvider.init Initialized with rates=open-exchange-rates.json, refreshInterval=1440.
[junit4:junit4]   2> 2207 T728 oass.IndexSchema.readSchema default search field in schema is text
[junit4:junit4]   2> 2211 T728 oass.IndexSchema.readSchema unique key field: id
[junit4:junit4]   2> 2250 T728 oass.FileExchangeRateProvider.reload Reloading exchange rates from file currency.xml
[junit4:junit4]   2> 2258 T728 oass.FileExchangeRateProvider.reload Reloading exchange rates from file currency.xml
[junit4:junit4]   2> 2267 T728 oass.OpenExchangeRatesOrgProvider.reload Reloading exchange rates from open-exchange-rates.json
[junit4:junit4]   2> 2270 T728 oass.OpenExchangeRatesOrgProvider.reload Reloading exchange rates from open-exchange-rates.json
[junit4:junit4]   2> 2273 T728 oasc.SolrCore.<init> [collection1] Opening new SolrCore at /Users/jenkins/jenkins-slave/workspace/Lucene-Solr-trunk-MacOSX/solr/build/solr-core/test/J0/./org.apache.solr.cloud.BasicDistributedZkTest-controljetty-1359979901783/collection1/, dataDir=./org.apache.solr.cloud.BasicDistributedZkTest-1359979901483/control/data/
[junit4:junit4]   2> 2273 T728 oasc.JmxMonitoredMap.<init> JMX monitoring is enabled. Adding Solr mbeans to JMX Server: com.sun.jmx.mbeanserver.JmxMBeanServer@36298619
[junit4:junit4]   2> 2273 T728 oasc.SolrCore.initDirectoryFactory solr.NRTCachingDirectoryFactory
[junit4:junit4]   2> 2275 T728 oasc.CachingDirectoryFactory.get return new directory for /Users/jenkins/jenkins-slave/workspace/Lucene-Solr-trunk-MacOSX/solr/build/solr-core/test/J0/./org.apache.solr.cloud.BasicDistributedZkTest-1359979901483/control/data forceNew:false
[junit4:junit4]   2> 2276 T728 oasc.CachingDirectoryFactory.close Releasing directory:/Users/jenkins/jenkins-slave/workspace/Lucene-Solr-trunk-MacOSX/solr/build/solr-core/test/J0/./org.apache.solr.cloud.BasicDistributedZkTest-1359979901483/control/data
[junit4:junit4]   2> 2276 T728 oasc.SolrCore.getNewIndexDir New index directory detected: old=null new=./org.apache.solr.cloud.BasicDistributedZkTest-1359979901483/control/data/index/
[junit4:junit4]   2> 2277 T728 oasc.SolrCore.initIndex WARNING [collection1] Solr index directory './org.apache.solr.cloud.BasicDistributedZkTest-1359979901483/control/data/index' doesn't exist. Creating new index...
[junit4:junit4]   2> 2278 T728 oasc.CachingDirectoryFactory.get return new directory for /Users/jenkins/jenkins-slave/workspace/Lucene-Solr-trunk-MacOSX/solr/build/solr-core/test/J0/./org.apache.solr.cloud.BasicDistributedZkTest-1359979901483/control/data/index forceNew:false
[junit4:junit4]   2> 2292 T728 oasc.SolrDeletionPolicy.onCommit SolrDeletionPolicy.onCommit: commits:num=1
[junit4:junit4]   2> 		commit{dir=RateLimitedDirectoryWrapper(NRTCachingDirectory(org.apache.lucene.store.NIOFSDirectory@/Users/jenkins/jenkins-slave/workspace/Lucene-Solr-trunk-MacOSX/solr/build/solr-core/test/J0/org.apache.solr.cloud.BasicDistributedZkTest-1359979901483/control/data/index lockFactory=org.apache.lucene.store.NativeFSLockFactory@45f60505; maxCacheMB=48.0 maxMergeSizeMB=4.0)),segFN=segments_1,generation=1,filenames=[segments_1]
[junit4:junit4]   2> 2292 T728 oasc.SolrDeletionPolicy.updateCommits newest commit = 1[segments_1]
[junit4:junit4]   2> 2293 T728 oasc.CachingDirectoryFactory.close Releasing directory:/Users/jenkins/jenkins-slave/workspace/Lucene-Solr-trunk-MacOSX/solr/build/solr-core/test/J0/./org.apache.solr.cloud.BasicDistributedZkTest-1359979901483/control/data/index
[junit4:junit4]   2> 2294 T728 oasc.SolrCore.initWriters created xml: solr.XMLResponseWriter
[junit4:junit4]   2> 2296 T728 oasup.UpdateRequestProcessorChain.init inserting DistributedUpdateProcessorFactory into updateRequestProcessorChain "dedupe"
[junit4:junit4]   2> 2297 T728 oasup.UpdateRequestProcessorChain.init inserting DistributedUpdateProcessorFactory into updateRequestProcessorChain "dedupe-allfields"
[junit4:junit4]   2> 2298 T728 oasup.UpdateRequestProcessorChain.init inserting DistributedUpdateProcessorFactory into updateRequestProcessorChain "stored_sig"
[junit4:junit4]   2> 2298 T728 oasup.UpdateRequestProcessorChain.init inserting DistributedUpdateProcessorFactory into updateRequestProcessorChain "uniq-fields"
[junit4:junit4]   2> 2299 T728 oasup.UpdateRequestProcessorChain.init inserting DistributedUpdateProcessorFactory into updateRequestProcessorChain "distrib-dup-test-chain-implicit"
[junit4:junit4]   2> 2299 T728 oasc.RequestHandlers.initHandlersFromConfig adding lazy requestHandler: solr.ReplicationHandler
[junit4:junit4]   2> 2300 T728 oasc.RequestHandlers.initHandlersFromConfig created /replication: solr.ReplicationHandler
[junit4:junit4]   2> 2300 T728 oasc.RequestHandlers.initHandlersFromConfig created standard: solr.StandardRequestHandler
[junit4:junit4]   2> 2301 T728 oasc.RequestHandlers.initHandlersFromConfig created /get: solr.RealTimeGetHandler
[junit4:junit4]   2> 2302 T728 oasc.RequestHandlers.initHandlersFromConfig created dismax: solr.SearchHandler
[junit4:junit4]   2> 2302 T728 oasc.RequestHandlers.initHandlersFromConfig created mock: org.apache.solr.core.MockQuerySenderListenerReqHandler
[junit4:junit4]   2> 2303 T728 oasc.RequestHandlers.initHandlersFromConfig created /admin/: org.apache.solr.handler.admin.AdminHandlers
[junit4:junit4]   2> 2304 T728 oasc.RequestHandlers.initHandlersFromConfig created defaults: solr.StandardRequestHandler
[junit4:junit4]   2> 2304 T728 oasc.RequestHandlers.initHandlersFromConfig adding lazy requestHandler: solr.StandardRequestHandler
[junit4:junit4]   2> 2305 T728 oasc.RequestHandlers.initHandlersFromConfig created lazy: solr.StandardRequestHandler
[junit4:junit4]   2> 2306 T728 oasc.RequestHandlers.initHandlersFromConfig created /update: solr.UpdateRequestHandler
[junit4:junit4]   2> 2307 T728 oasc.RequestHandlers.initHandlersFromConfig created /terms: org.apache.solr.handler.component.SearchHandler
[junit4:junit4]   2> 2309 T728 oasc.RequestHandlers.initHandlersFromConfig created spellCheckCompRH: org.apache.solr.handler.component.SearchHandler
[junit4:junit4]   2> 2310 T728 oasc.RequestHandlers.initHandlersFromConfig created spellCheckCompRH_Direct: org.apache.solr.handler.component.SearchHandler
[junit4:junit4]   2> 2310 T728 oasc.RequestHandlers.initHandlersFromConfig created spellCheckWithWordbreak: org.apache.solr.handler.component.SearchHandler
[junit4:junit4]   2> 2311 T728 oasc.RequestHandlers.initHandlersFromConfig created spellCheckWithWordbreak_Direct: org.apache.solr.handler.component.SearchHandler
[junit4:junit4]   2> 2311 T728 oasc.RequestHandlers.initHandlersFromConfig created spellCheckCompRH1: org.apache.solr.handler.component.SearchHandler
[junit4:junit4]   2> 2312 T728 oasc.RequestHandlers.initHandlersFromConfig created mltrh: org.apache.solr.handler.component.SearchHandler
[junit4:junit4]   2> 2312 T728 oasc.RequestHandlers.initHandlersFromConfig created tvrh: org.apache.solr.handler.component.SearchHandler
[junit4:junit4]   2> 2313 T728 oasc.RequestHandlers.initHandlersFromConfig created /mlt: solr.MoreLikeThisHandler
[junit4:junit4]   2> 2314 T728 oasc.RequestHandlers.initHandlersFromConfig created /debug/dump: solr.DumpRequestHandler
[junit4:junit4]   2> 2323 T728 oashl.XMLLoader.init xsltCacheLifetimeSeconds=60
[junit4:junit4]   2> 2329 T728 oasc.SolrCore.initDeprecatedSupport WARNING solrconfig.xml uses deprecated <admin/gettableFiles>, Please update your config to use the ShowFileRequestHandler.
[junit4:junit4]   2> 2332 T728 oasc.SolrCore.initDeprecatedSupport WARNING adding ShowFileRequestHandler with hidden files: [SCHEMA.XML, OLD_SYNONYMS.TXT, STOPWORDS.TXT, PROTWORDS.TXT, OPEN-EXCHANGE-RATES.JSON, SYNONYMS.TXT, CURRENCY.XML, MAPPING-ISOLATIN1ACCENT.TXT]
[junit4:junit4]   2> 2335 T728 oasc.CachingDirectoryFactory.close Releasing directory:/Users/jenkins/jenkins-slave/workspace/Lucene-Solr-trunk-MacOSX/solr/build/solr-core/test/J0/./org.apache.solr.cloud.BasicDistributedZkTest-1359979901483/control/data
[junit4:junit4]   2> 2336 T728 oass.SolrIndexSearcher.<init> Opening Searcher@50a3b5e5 main
[junit4:junit4]   2> 2337 T728 oasu.CommitTracker.<init> Hard AutoCommit: disabled
[junit4:junit4]   2> 2337 T728 oasu.CommitTracker.<init> Soft AutoCommit: disabled
[junit4:junit4]   2> 2338 T728 oashc.SpellCheckComponent.inform Initializing spell checkers
[junit4:junit4]   2> 2344 T728 oass.DirectSolrSpellChecker.init init: {name=direct,classname=DirectSolrSpellChecker,field=lowerfilt,minQueryLength=3}
[junit4:junit4]   2> 2399 T728 oasc.ZkController.publish publishing core=collection1 state=down
[junit4:junit4]   2> 2399 T728 oasc.ZkController.publish numShards not found on descriptor - reading it from system property
[junit4:junit4]   2> 2401 T729 oasc.SolrCore.registerSearcher [collection1] Registered new searcher Searcher@50a3b5e5 main{StandardDirectoryReader(segments_1:1)}
[junit4:junit4]   2> 2401 T708 oazs.PrepRequestProcessor.pRequest Got user-level KeeperException when processing sessionid:0x13ca51e72390003 type:create cxid:0x50 zxid:0x29 txntype:-1 reqpath:n/a Error Path:/solr/overseer/queue Error:KeeperErrorCode = NoNode for /solr/overseer/queue
[junit4:junit4]   2> 2619 T726 oascc.ZkStateReader.updateClusterState Updating cloud state from ZooKeeper... 
[junit4:junit4]   2> 2621 T726 oasc.Overseer$ClusterStateUpdater.updateState Update state numShards=1 message={
[junit4:junit4]   2> 	  "operation":"state",
[junit4:junit4]   2> 	  "numShards":"1",
[junit4:junit4]   2> 	  "shard":null,
[junit4:junit4]   2> 	  "roles":null,
[junit4:junit4]   2> 	  "state":"down",
[junit4:junit4]   2> 	  "core":"collection1",
[junit4:junit4]   2> 	  "collection":"control_collection",
[junit4:junit4]   2> 	  "node_name":"127.0.0.1:49311_",
[junit4:junit4]   2> 	  "base_url":"http://127.0.0.1:49311"}
[junit4:junit4]   2> 2621 T726 oasc.Overseer$ClusterStateUpdater.createCollection Create collection control_collection with numShards 1
[junit4:junit4]   2> 2622 T726 oasc.Overseer$ClusterStateUpdater.updateState Assigning new node to shard shard=shard1
[junit4:junit4]   2> 2623 T708 oazs.PrepRequestProcessor.pRequest Got user-level KeeperException when processing sessionid:0x13ca51e72390003 type:create cxid:0x58 zxid:0x2c txntype:-1 reqpath:n/a Error Path:/solr/overseer/queue-work Error:KeeperErrorCode = NoNode for /solr/overseer/queue-work
[junit4:junit4]   2> 2634 T725 oascc.ZkStateReader$2.process A cluster state change: WatchedEvent state:SyncConnected type:NodeDataChanged path:/clusterstate.json, has occurred - updating... (live nodes size: 1)
[junit4:junit4]   2> 3411 T728 oasc.CoreContainer.registerCore registering core: collection1
[junit4:junit4]   2> 3411 T728 oasc.ZkController.register Register replica - core:collection1 address:http://127.0.0.1:49311 collection:control_collection shard:shard1
[junit4:junit4]   2> 3413 T728 oascc.SolrZkClient.makePath makePath: /collections/control_collection/leader_elect/shard1/election
[junit4:junit4]   2> 3427 T708 oazs.PrepRequestProcessor.pRequest Got user-level KeeperException when processing sessionid:0x13ca51e72390003 type:delete cxid:0x72 zxid:0x36 txntype:-1 reqpath:n/a Error Path:/solr/collections/control_collection/leaders Error:KeeperErrorCode = NoNode for /solr/collections/control_collection/leaders
[junit4:junit4]   2> 3429 T728 oasc.ShardLeaderElectionContext.runLeaderProcess Running the leader process.
[junit4:junit4]   2> 3430 T708 oazs.PrepRequestProcessor.pRequest Got user-level KeeperException when processing sessionid:0x13ca51e72390003 type:create cxid:0x73 zxid:0x37 txntype:-1 reqpath:n/a Error Path:/solr/overseer Error:KeeperErrorCode = NodeExists for /solr/overseer
[junit4:junit4]   2> 3433 T728 oasc.ShardLeaderElectionContext.waitForReplicasToComeUp Enough replicas found to continue.
[junit4:junit4]   2> 3433 T728 oasc.ShardLeaderElectionContext.runLeaderProcess I may be the new leader - try and sync
[junit4:junit4]   2> 3434 T728 oasc.SyncStrategy.sync Sync replicas to http://127.0.0.1:49311/collection1/
[junit4:junit4]   2> 3435 T728 oasc.SyncStrategy.syncReplicas Sync Success - now sync replicas to me
[junit4:junit4]   2> 3439 T728 oasc.SyncStrategy.syncToMe http://127.0.0.1:49311/collection1/ has no replicas
[junit4:junit4]   2> 3439 T728 oasc.ShardLeaderElectionContext.runLeaderProcess I am the new leader: http://127.0.0.1:49311/collection1/
[junit4:junit4]   2> 3439 T728 oascc.SolrZkClient.makePath makePath: /collections/control_collection/leaders/shard1
[junit4:junit4]   2> 3446 T708 oazs.PrepRequestProcessor.pRequest Got user-level KeeperException when processing sessionid:0x13ca51e72390003 type:create cxid:0x7d zxid:0x3b txntype:-1 reqpath:n/a Error Path:/solr/overseer Error:KeeperErrorCode = NodeExists for /solr/overseer
[junit4:junit4]   2> 4144 T726 oascc.ZkStateReader.updateClusterState Updating cloud state from ZooKeeper... 
[junit4:junit4]   2> 4161 T725 oascc.ZkStateReader$2.process A cluster state change: WatchedEvent state:SyncConnected type:NodeDataChanged path:/clusterstate.json, has occurred - updating... (live nodes size: 1)
[junit4:junit4]   2> 4192 T728 oasc.ZkController.register We are http://127.0.0.1:49311/collection1/ and leader is http://127.0.0.1:49311/collection1/
[junit4:junit4]   2> 4192 T728 oasc.ZkController.register No LogReplay needed for core=collection1 baseURL=http://127.0.0.1:49311
[junit4:junit4]   2> 4192 T728 oasc.ZkController.checkRecovery I am the leader, no recovery necessary
[junit4:junit4]   2> 4192 T728 oasc.ZkController.publish publishing core=collection1 state=active
[junit4:junit4]   2> 4193 T728 oasc.ZkController.publish numShards not found on descriptor - reading it from system property
[junit4:junit4]   2> 4196 T728 oascc.ZkStateReader.updateClusterState Updating cloud state from ZooKeeper... 
[junit4:junit4]   2> 4198 T703 oass.SolrDispatchFilter.init user.dir=/Users/jenkins/jenkins-slave/workspace/Lucene-Solr-trunk-MacOSX/solr/build/solr-core/test/J0
[junit4:junit4]   2> 4198 T703 oass.SolrDispatchFilter.init SolrDispatchFilter.init() done
[junit4:junit4]   2> 4199 T703 oascsi.HttpClientUtil.createClient Creating new http client, config:maxConnections=128&maxConnectionsPerHost=32&followRedirects=false
[junit4:junit4]   2> 4230 T703 oascsi.HttpClientUtil.createClient Creating new http client, config:
[junit4:junit4]   2> 4237 T703 oaz.ZooKeeper.<init> Initiating client connection, connectString=127.0.0.1:49308/solr sessionTimeout=10000 watcher=org.apache.solr.common.cloud.ConnectionManager@9e160a
[junit4:junit4]   2> 4243 T703 oascc.ConnectionManager.waitForConnected Waiting for client to connect to ZooKeeper
[junit4:junit4]   2> 4244 T730 oaz.ClientCnxn$SendThread.logStartConnect Opening socket connection to server localhost/127.0.0.1:49308. Will not attempt to authenticate using SASL (access denied ("javax.security.auth.AuthPermission" "getLoginConfiguration"))
[junit4:junit4]   2> 4245 T705 oazs.NIOServerCnxnFactory.run Accepted socket connection from /127.0.0.1:49314
[junit4:junit4]   2> 4245 T730 oaz.ClientCnxn$SendThread.primeConnection Socket connection established to localhost/127.0.0.1:49308, initiating session
[junit4:junit4]   2> 4245 T705 oazs.ZooKeeperServer.processConnectRequest Client attempting to establish new session at /127.0.0.1:49314
[junit4:junit4]   2> 4246 T707 oazs.ZooKeeperServer.finishSessionInit Established session 0x13ca51e72390004 with negotiated timeout 10000 for client /127.0.0.1:49314
[junit4:junit4]   2> 4247 T730 oaz.ClientCnxn$SendThread.onConnected Session establishment complete on server localhost/127.0.0.1:49308, sessionid = 0x13ca51e72390004, negotiated timeout = 10000
[junit4:junit4]   2> 4247 T731 oascc.ConnectionManager.process Watcher org.apache.solr.common.cloud.ConnectionManager@9e160a name:ZooKeeperConnection Watcher:127.0.0.1:49308/solr got event WatchedEvent state:SyncConnected type:None path:null path:null type:None
[junit4:junit4]   2> 4247 T703 oascc.ConnectionManager.waitForConnected Client is connected to ZooKeeper
[junit4:junit4]   2> 4248 T703 oascc.ZkStateReader.createClusterStateWatchersAndUpdate Updating cluster state from ZooKeeper... 
[junit4:junit4]   2> 4256 T703 oasc.ChaosMonkey.monkeyLog monkey: init - expire sessions:true cause connection loss:true
[junit4:junit4]   2> 4531 T703 oejs.Server.doStart jetty-8.1.8.v20121106
[junit4:junit4]   2> 4538 T703 oejs.AbstractConnector.doStart Started SelectChannelConnector@127.0.0.1:49315
[junit4:junit4]   2> 4539 T703 oass.SolrDispatchFilter.init SolrDispatchFilter.init()
[junit4:junit4]   2> 4539 T703 oasc.SolrResourceLoader.locateSolrHome JNDI not configured for solr (NoInitialContextEx)
[junit4:junit4]   2> 4540 T703 oasc.SolrResourceLoader.locateSolrHome using system property solr.solr.home: /Users/jenkins/jenkins-slave/workspace/Lucene-Solr-trunk-MacOSX/solr/build/solr-core/test/J0/./org.apache.solr.cloud.BasicDistributedZkTest-jetty1-1359979905725
[junit4:junit4]   2> 4540 T703 oasc.CoreContainer$Initializer.initialize looking for solr.xml: /Users/jenkins/jenkins-slave/workspace/Lucene-Solr-trunk-MacOSX/solr/build/solr-core/test/J0/./org.apache.solr.cloud.BasicDistributedZkTest-jetty1-1359979905725/solr.xml
[junit4:junit4]   2> 4541 T703 oasc.CoreContainer.<init> New CoreContainer 820959146
[junit4:junit4]   2> 4541 T703 oasc.CoreContainer.load Loading CoreContainer using Solr Home: '/Users/jenkins/jenkins-slave/workspace/Lucene-Solr-trunk-MacOSX/solr/build/solr-core/test/J0/./org.apache.solr.cloud.BasicDistributedZkTest-jetty1-1359979905725/'
[junit4:junit4]   2> 4542 T703 oasc.SolrResourceLoader.<init> new SolrResourceLoader for directory: '/Users/jenkins/jenkins-slave/workspace/Lucene-Solr-trunk-MacOSX/solr/build/solr-core/test/J0/./org.apache.solr.cloud.BasicDistributedZkTest-jetty1-1359979905725/'
[junit4:junit4]   2> 4577 T703 oashc.HttpShardHandlerFactory.getParameter Setting socketTimeout to: 60000
[junit4:junit4]   2> 4577 T703 oashc.HttpShardHandlerFactory.getParameter Setting urlScheme to: http://
[junit4:junit4]   2> 4578 T703 oashc.HttpShardHandlerFactory.getParameter Setting connTimeout to: 15000
[junit4:junit4]   2> 4578 T703 oashc.HttpShardHandlerFactory.getParameter Setting maxConnectionsPerHost to: 20
[junit4:junit4]   2> 4578 T703 oashc.HttpShardHandlerFactory.getParameter Setting corePoolSize to: 0
[junit4:junit4]   2> 4578 T703 oashc.HttpShardHandlerFactory.getParameter Setting maximumPoolSize to: 2147483647
[junit4:junit4]   2> 4579 T703 oashc.HttpShardHandlerFactory.getParameter Setting maxThreadIdleTime to: 5
[junit4:junit4]   2> 4579 T703 oashc.HttpShardHandlerFactory.getParameter Setting sizeOfQueue to: -1
[junit4:junit4]   2> 4579 T703 oashc.HttpShardHandlerFactory.getParameter Setting fairnessPolicy to: false
[junit4:junit4]   2> 4580 T703 oascsi.HttpClientUtil.createClient Creating new http client, config:maxConnectionsPerHost=20&maxConnections=10000&socketTimeout=60000&connTimeout=15000&retry=false
[junit4:junit4]   2> 4588 T703 oasc.CoreContainer.load Registering Log Listener
[junit4:junit4]   2> 4600 T703 oasc.CoreContainer.initZooKeeper Zookeeper client=127.0.0.1:49308/solr
[junit4:junit4]   2> 4600 T703 oasc.ZkController.checkChrootPath zkHost includes chroot
[junit4:junit4]   2> 4600 T703 oaz.ZooKeeper.<init> Initiating client connection, connectString=127.0.0.1:49308 sessionTimeout=60000 watcher=org.apache.solr.common.cloud.ConnectionManager@1a7787b9
[junit4:junit4]   2> 4601 T703 oascc.ConnectionManager.waitForConnected Waiting for client to connect to ZooKeeper
[junit4:junit4]   2> 4602 T741 oaz.ClientCnxn$SendThread.logStartConnect Opening socket connection to server localhost/127.0.0.1:49308. Will not attempt to authenticate using SASL (access denied ("javax.security.auth.AuthPermission" "getLoginConfiguration"))
[junit4:junit4]   2> 4603 T705 oazs.NIOServerCnxnFactory.run Accepted socket connection from /127.0.0.1:49316
[junit4:junit4]   2> 4604 T741 oaz.ClientCnxn$SendThread.primeConnection Socket connection established to localhost/127.0.0.1:49308, initiating session
[junit4:junit4]   2> 4604 T705 oazs.ZooKeeperServer.processConnectRequest Client attempting to establish new session at /127.0.0.1:49316
[junit4:junit4]   2> 4605 T707 oazs.ZooKeeperServer.finishSessionInit Established session 0x13ca51e72390005 with negotiated timeout 20000 for client /127.0.0.1:49316
[junit4:junit4]   2> 4605 T741 oaz.ClientCnxn$SendThread.onConnected Session establishment complete on server localhost/127.0.0.1:49308, sessionid = 0x13ca51e72390005, negotiated timeout = 20000
[junit4:junit4]   2> 4607 T742 oascc.ConnectionManager.process Watcher org.apache.solr.common.cloud.ConnectionManager@1a7787b9 name:ZooKeeperConnection Watcher:127.0.0.1:49308 got event WatchedEvent state:SyncConnected type:None path:null path:null type:None
[junit4:junit4]   2> 4607 T703 oascc.ConnectionManager.waitForConnected Client is connected to ZooKeeper
[junit4:junit4]   2> 4617 T708 oazs.PrepRequestProcessor.pRequest2Txn Processed session termination for sessionid: 0x13ca51e72390005
[junit4:junit4]   2> 4618 T705 oazs.NIOServerCnxn.closeSock Closed socket connection for client /127.0.0.1:49316 which had sessionid 0x13ca51e72390005
[junit4:junit4]   2> 4619 T742 oaz.ClientCnxn$EventThread.run EventThread shut down
[junit4:junit4]   2> 4619 T703 oaz.ZooKeeper.close Session: 0x13ca51e72390005 closed
[junit4:junit4]   2> 4620 T703 oascsi.HttpClientUtil.createClient Creating new http client, config:maxConnections=500&maxConnectionsPerHost=16&socketTimeout=60000&connTimeout=15000
[junit4:junit4]   2> 4630 T703 oaz.ZooKeeper.<init> Initiating client connection, connectString=127.0.0.1:49308/solr sessionTimeout=30000 watcher=org.apache.solr.common.cloud.ConnectionManager@4c9adbe5
[junit4:junit4]   2> 4633 T703 oascc.ConnectionManager.waitForConnected Waiting for client to connect to ZooKeeper
[junit4:junit4]   2> 4633 T743 oaz.ClientCnxn$SendThread.logStartConnect Opening socket connection to server localhost/127.0.0.1:49308. Will not attempt to authenticate using SASL (access denied ("javax.security.auth.AuthPermission" "getLoginConfiguration"))
[junit4:junit4]   2> 4634 T743 oaz.ClientCnxn$SendThread.primeConnection Socket connection established to localhost/127.0.0.1:49308, initiating session
[junit4:junit4]   2> 4635 T705 oazs.NIOServerCnxnFactory.run Accepted socket connection from /127.0.0.1:49317
[junit4:junit4]   2> 4635 T705 oazs.ZooKeeperServer.processConnectRequest Client attempting to establish new session at /127.0.0.1:49317
[junit4:junit4]   2> 4640 T707 oazs.ZooKeeperServer.finishSessionInit Established session 0x13ca51e72390006 with negotiated timeout 20000 for client /127.0.0.1:49317
[junit4:junit4]   2> 4640 T743 oaz.ClientCnxn$SendThread.onConnected Session establishment complete on server localhost/127.0.0.1:49308, sessionid = 0x13ca51e72390006, negotiated timeout = 20000
[junit4:junit4]   2> 4641 T744 oascc.ConnectionManager.process Watcher org.apache.solr.common.cloud.ConnectionManager@4c9adbe5 name:ZooKeeperConnection Watcher:127.0.0.1:49308/solr got event WatchedEvent state:SyncConnected type:None path:null path:null type:None
[junit4:junit4]   2> 4641 T703 oascc.ConnectionManager.waitForConnected Client is connected to ZooKeeper
[junit4:junit4]   2> 4642 T708 oazs.PrepRequestProcessor.pRequest Got user-level KeeperException when processing sessionid:0x13ca51e72390006 type:create cxid:0x1 zxid:0x49 txntype:-1 reqpath:n/a Error Path:/solr/overseer Error:KeeperErrorCode = NodeExists for /solr/overseer
[junit4:junit4]   2> 4645 T708 oazs.PrepRequestProcessor.pRequest Got user-level KeeperException when processing sessionid:0x13ca51e72390006 type:create cxid:0x2 zxid:0x4a txntype:-1 reqpath:n/a Error Path:/solr/overseer Error:KeeperErrorCode = NodeExists for /solr/overseer
[junit4:junit4]   2> 4647 T703 oasc.ZkController.createEphemeralLiveNode Register node as live in ZooKeeper:/live_nodes/127.0.0.1:49315_
[junit4:junit4]   2> 4648 T708 oazs.PrepRequestProcessor.pRequest Got user-level KeeperException when processing sessionid:0x13ca51e72390006 type:delete cxid:0x4 zxid:0x4b txntype:-1 reqpath:n/a Error Path:/solr/live_nodes/127.0.0.1:49315_ Error:KeeperErrorCode = NoNode for /solr/live_nodes/127.0.0.1:49315_
[junit4:junit4]   2> 4649 T703 oascc.SolrZkClient.makePath makePath: /live_nodes/127.0.0.1:49315_
[junit4:junit4]   2> 4656 T725 oascc.ZkStateReader$3.process Updating live nodes... (2)
[junit4:junit4]   2> 4656 T725 oascc.ZkStateReader$2.process A cluster state change: WatchedEvent state:SyncConnected type:NodeChildrenChanged path:/live_nodes, has occurred - updating... (live nodes size: 2)
[junit4:junit4]   2> 4657 T731 oascc.ZkStateReader$3.process Updating live nodes... (2)
[junit4:junit4]   2> 4667 T703 oascc.ZkStateReader.createClusterStateWatchersAndUpdate Updating cluster state from ZooKeeper... 
[junit4:junit4]   2> 4689 T745 oasc.CoreContainer.create Creating SolrCore 'collection1' using instanceDir: /Users/jenkins/jenkins-slave/workspace/Lucene-Solr-trunk-MacOSX/solr/build/solr-core/test/J0/./org.apache.solr.cloud.BasicDistributedZkTest-jetty1-1359979905725/collection1
[junit4:junit4]   2> 4689 T745 oasc.ZkController.createCollectionZkNode Check for collection zkNode:collection1
[junit4:junit4]   2> 4691 T745 oasc.ZkController.createCollectionZkNode Collection zkNode exists
[junit4:junit4]   2> 4691 T745 oasc.ZkController.readConfigName Load collection config from:/collections/collection1
[junit4:junit4]   2> 4694 T745 oasc.SolrResourceLoader.<init> new SolrResourceLoader for directory: '/Users/jenkins/jenkins-slave/workspace/Lucene-Solr-trunk-MacOSX/solr/build/solr-core/test/J0/./org.apache.solr.cloud.BasicDistributedZkTest-jetty1-1359979905725/collection1/'
[junit4:junit4]   2> 4695 T745 oasc.SolrResourceLoader.replaceClassLoader Adding 'file:/Users/jenkins/jenkins-slave/workspace/Lucene-Solr-trunk-MacOSX/solr/build/solr-core/test/J0/org.apache.solr.cloud.BasicDistributedZkTest-jetty1-1359979905725/collection1/lib/classes/' to classloader
[junit4:junit4]   2> 4695 T745 oasc.SolrResourceLoader.replaceClassLoader Adding 'file:/Users/jenkins/jenkins-slave/workspace/Lucene-Solr-trunk-MacOSX/solr/build/solr-core/test/J0/org.apache.solr.cloud.BasicDistributedZkTest-jetty1-1359979905725/collection1/lib/README' to classloader
[junit4:junit4]   2> 4809 T745 oasc.SolrConfig.<init> Using Lucene MatchVersion: LUCENE_50
[junit4:junit4]   2> 4907 T745 oasc.SolrConfig.<init> Loaded SolrConfig: solrconfig.xml
[junit4:junit4]   2> 4909 T745 oass.IndexSchema.readSchema Reading Solr Schema
[junit4:junit4]   2> 4918 T745 oass.IndexSchema.readSchema Schema name=test
[junit4:junit4]   2> 5720 T726 oascc.ZkStateReader.updateClusterState Updating cloud state from ZooKeeper... 
[junit4:junit4]   2> 5722 T726 oasc.Overseer$ClusterStateUpdater.updateState Update state numShards=1 message={
[junit4:junit4]   2> 	  "operation":"state",
[junit4:junit4]   2> 	  "numShards":"1",
[junit4:junit4]   2> 	  "shard":"shard1",
[junit4:junit4]   2> 	  "roles":null,
[junit4:junit4]   2> 	  "state":"active",
[junit4:junit4]   2> 	  "core":"collection1",
[junit4:junit4]   2> 	  "collection":"control_collection",
[junit4:junit4]   2> 	  "node_name":"127.0.0.1:49311_",
[junit4:junit4]   2> 	  "base_url":"http://127.0.0.1:49311"}
[junit4:junit4]   2> 5736 T744 oascc.ZkStateReader$2.process A cluster state change: WatchedEvent state:SyncConnected type:NodeDataChanged path:/clusterstate.json, has occurred - updating... (live nodes size: 2)
[junit4:junit4]   2> 5737 T731 oascc.ZkStateReader$2.process A cluster state change: WatchedEvent state:SyncConnected type:NodeDataChanged path:/clusterstate.json, has occurred - updating... (live nodes size: 2)
[junit4:junit4]   2> 5737 T725 oascc.ZkStateReader$2.process A cluster state change: WatchedEvent state:SyncConnected type:NodeDataChanged path:/clusterstate.json, has occurred - updating... (live nodes size: 2)
[junit4:junit4]   2> 5756 T745 oass.OpenExchangeRatesOrgProvider.init Initialized with rates=open-exchange-rates.json, refreshInterval=1440.
[junit4:junit4]   2> 5768 T745 oass.IndexSchema.readSchema default search field in schema is text
[junit4:junit4]   2> 5773 T745 oass.IndexSchema.readSchema unique key field: id
[junit4:junit4]   2> 5816 T745 oass.FileExchangeRateProvider.reload Reloading exchange rates from file currency.xml
[junit4:junit4]   2> 5824 T745 oass.FileExchangeRateProvider.reload Reloading exchange rates from file currency.xml
[junit4:junit4]   2> 5834 T745 oass.OpenExchangeRatesOrgProvider.reload Reloading exchange rates from open-exchange-rates.json
[junit4:junit4]   2> 5837 T745 oass.OpenExchangeRatesOrgProvider.reload Reloading exchange rates from open-exchange-rates.json
[junit4:junit4]   2> 5840 T745 oasc.SolrCore.<init> [collection1] Opening new SolrCore at /Users/jenkins/jenkins-slave/workspace/Lucene-Solr-trunk-MacOSX/solr/build/solr-core/test/J0/./org.apache.solr.cloud.BasicDistributedZkTest-jetty1-1359979905725/collection1/, dataDir=./org.apache.solr.cloud.BasicDistributedZkTest-1359979901483/jetty1/
[junit4:junit4]   2> 5840 T745 oasc.JmxMonitoredMap.<init> JMX monitoring is enabled. Adding Solr mbeans to JMX Server: com.sun.jmx.mbeanserver.JmxMBeanServer@36298619
[junit4:junit4]   2> 5841 T745 oasc.SolrCore.initDirectoryFactory solr.NRTCachingDirectoryFactory
[junit4:junit4]   2> 5843 T745 oasc.CachingDirectoryFactory.get return new directory for /Users/jenkins/jenkins-slave/workspace/Lucene-Solr-trunk-MacOSX/solr/build/solr-core/test/J0/./org.apache.solr.cloud.BasicDistributedZkTest-1359979901483/jetty1 forceNew:false
[junit4:junit4]   2> 5844 T745 oasc.CachingDirectoryFactory.close Releasing directory:/Users/jenkins/jenkins-slave/workspace/Lucene-Solr-trunk-MacOSX/solr/build/solr-core/test/J0/./org.apache.solr.cloud.BasicDistributedZkTest-1359979901483/jetty1
[junit4:junit4]   2> 5844 T745 oasc.SolrCore.getNewIndexDir New index directory detected: old=null new=./org.apache.solr.cloud.BasicDistributedZkTest-1359979901483/jetty1/index/
[junit4:junit4]   2> 5845 T745 oasc.SolrCore.initIndex WARNING [collection1] Solr index directory './org.apache.solr.cloud.BasicDistributedZkTest-1359979901483/jetty1/index' doesn't exist. Creating new index...
[junit4:junit4]   2> 5847 T745 oasc.CachingDirectoryFactory.get return new directory for /Users/jenkins/jenkins-slave/workspace/Lucene-Solr-trunk-MacOSX/solr/build/solr-core/test/J0/./org.apache.solr.cloud.BasicDistributedZkTest-1359979901483/jetty1/index forceNew:false
[junit4:junit4]   2> 5854 T745 oasc.SolrDeletionPolicy.onCommit SolrDeletionPolicy.onCommit: commits:num=1
[junit4:junit4]   2> 		commit{dir=RateLimitedDirectoryWrapper(NRTCachingDirectory(org.apache.lucene.store.NIOFSDirectory@/Users/jenkins/jenkins-slave/workspace/Lucene-Solr-trunk-MacOSX/solr/build/solr-core/test/J0/org.apache.solr.cloud.BasicDistributedZkTest-1359979901483/jetty1/index lockFactory=org.apache.lucene.store.NativeFSLockFactory@3e40cc10; maxCacheMB=48.0 maxMergeSizeMB=4.0)),segFN=segments_1,generation=1,filenames=[segments_1]
[junit4:junit4]   2> 5855 T745 oasc.SolrDeletionPolicy.updateCommits newest commit = 1[segments_1]
[junit4:junit4]   2> 5856 T745 oasc.CachingDirectoryFactory.close Releasing directory:/Users/jenkins/jenkins-slave/workspace/Lucene-Solr-trunk-MacOSX/solr/build/solr-core/test/J0/./org.apache.solr.cloud.BasicDistributedZkTest-1359979901483/jetty1/index
[junit4:junit4]   2> 5857 T745 oasc.SolrCore.initWriters created xml: solr.XMLResponseWriter
[junit4:junit4]   2> 5860 T745 oasup.UpdateRequestProcessorChain.init inserting DistributedUpdateProcessorFactory into updateRequestProcessorChain "dedupe"
[junit4:junit4]   2> 5861 T745 oasup.UpdateRequestProcessorChain.init inserting DistributedUpdateProcessorFactory into updateRequestProcessorChain "dedupe-allfields"
[junit4:junit4]   2> 5861 T745 oasup.UpdateRequestProcessorChain.init inserting DistributedUpdateProcessorFactory into updateRequestProcessorChain "stored_sig"
[junit4:junit4]   2> 5862 T745 oasup.UpdateRequestProcessorChain.init inserting DistributedUpdateProcessorFactory into updateRequestProcessorChain "uniq-fields"
[junit4:junit4]   2> 5863 T745 oasup.UpdateRequestProcessorChain.init inserting DistributedUpdateProcessorFactory into updateRequestProcessorChain "distrib-dup-test-chain-implicit"
[junit4:junit4]   2> 5863 T745 oasc.RequestHandlers.initHandlersFromConfig adding lazy requestHandler: solr.ReplicationHandler
[junit4:junit4]   2> 5864 T745 oasc.RequestHandlers.initHandlersFromConfig created /replication: solr.ReplicationHandler
[junit4:junit4]   2> 5864 T745 oasc.RequestHandlers.initHandlersFromConfig created standard: solr.StandardRequestHandler
[junit4:junit4]   2> 5865 T745 oasc.RequestHandlers.initHandlersFromConfig created /get: solr.RealTimeGetHandler
[junit4:junit4]   2> 5867 T745 oasc.RequestHandlers.initHandlersFromConfig created dismax: solr.SearchHandler
[junit4:junit4]   2> 5868 T745 oasc.RequestHandlers.initHandlersFromConfig created mock: org.apache.solr.core.MockQuerySenderListenerReqHandler
[junit4:junit4]   2> 5868 T745 oasc.RequestHandlers.initHandlersFromConfig created /admin/: org.apache.solr.handler.admin.AdminHandlers
[junit4:junit4]   2> 5869 T745 oasc.RequestHandlers.initHandlersFromConfig created defaults: solr.StandardRequestHandler
[junit4:junit4]   2> 5869 T745 oasc.RequestHandlers.initHandlersFromConfig adding lazy requestHandler: solr.StandardRequestHandler
[junit4:junit4]   2> 5870 T745 oasc.RequestHandlers.initHandlersFromConfig created lazy: solr.StandardRequestHandler
[junit4:junit4]   2> 5871 T745 oasc.RequestHandlers.initHandlersFromConfig created /update: solr.UpdateRequestHandler
[junit4:junit4]   2> 5872 T745 oasc.RequestHandlers.initHandlersFromConfig created /terms: org.apache.solr.handler.component.SearchHandler
[junit4:junit4]   2> 5873 T745 oasc.RequestHandlers.initHandlersFromConfig created spellCheckCompRH: org.apache.solr.handler.component.SearchHandler
[junit4:junit4]   2> 5874 T745 oasc.RequestHandlers.initHandlersFromConfig created spellCheckCompRH_Direct: org.apache.solr.handler.component.SearchHandler
[junit4:junit4]   2> 5874 T745 oasc.RequestHandlers.initHandlersFromConfig created spellCheckWithWordbreak: org.apache.solr.handler.component.SearchHandler
[junit4:junit4]   2> 5875 T745 oasc.RequestHandlers.initHandlersFromConfig created spellCheckWithWordbreak_Direct: org.apache.solr.handler.component.SearchHandler
[junit4:junit4]   2> 5876 T745 oasc.RequestHandlers.initHandlersFromConfig created spellCheckCompRH1: org.apache.solr.handler.component.SearchHandler
[junit4:junit4]   2> 5876 T745 oasc.RequestHandlers.initHandlersFromConfig created mltrh: org.apache.solr.handler.component.SearchHandler
[junit4:junit4]   2> 5877 T745 oasc.RequestHandlers.initHandlersFromConfig created tvrh: org.apache.solr.handler.component.SearchHandler
[junit4:junit4]   2> 5878 T745 oasc.RequestHandlers.initHandlersFromConfig created /mlt: solr.MoreLikeThisHandler
[junit4:junit4]   2> 5879 T745 oasc.RequestHandlers.initHandlersFromConfig created /debug/dump: solr.DumpRequestHandler
[junit4:junit4]   2> 5889 T745 oashl.XMLLoader.init xsltCacheLifetimeSeconds=60
[junit4:junit4]   2> 5894 T745 oasc.SolrCore.initDeprecatedSupport WARNING solrconfig.xml uses deprecated <admin/gettableFiles>, Please update your config to use the ShowFileRequestHandler.
[junit4:junit4]   2> 5896 T745 oasc.SolrCore.initDeprecatedSupport WARNING adding ShowFileRequestHandler with hidden files: [SCHEMA.XML, OLD_SYNONYMS.TXT, STOPWORDS.TXT, PROTWORDS.TXT, OPEN-EXCHANGE-RATES.JSON, SYNONYMS.TXT, CURRENCY.XML, MAPPING-ISOLATIN1ACCENT.TXT]
[junit4:junit4]   2> 5900 T745 oasc.CachingDirectoryFactory.close Releasing directory:/Users/jenkins/jenkins-slave/workspace/Lucene-Solr-trunk-MacOSX/solr/build/solr-core/test/J0/./org.apache.solr.cloud.BasicDistributedZkTest-1359979901483/jetty1
[junit4:junit4]   2> 5902 T745 oass.SolrIndexSearcher.<init> Opening Searcher@69f2fae4 main
[junit4:junit4]   2> 5906 T745 oasu.CommitTracker.<init> Hard AutoCommit: disabled
[junit4:junit4]   2> 5908 T745 oasu.CommitTracker.<init> Soft AutoCommit: disabled
[junit4:junit4]   2> 5909 T745 oashc.SpellCheckComponent.inform Initializing spell checkers
[junit4:junit4]   2> 5920 T745 oass.DirectSolrSpellChecker.init init: {name=direct,classname=DirectSolrSpellChecker,field=lowerfilt,minQueryLength=3}
[junit4:junit4]   2> 5960 T746 oasc.SolrCore.registerSearcher [collection1] Registered new searcher Searcher@69f2fae4 main{StandardDirectoryReader(segments_1:1)}
[junit4:junit4]   2> 5974 T745 oasc.ZkController.publish publishing core=collection1 state=down
[junit4:junit4]   2> 5975 T745 oasc.ZkController.publish numShards not found on descriptor - reading it from system property
[junit4:junit4]   2> 7283 T726 oascc.ZkStateReader.updateClusterState Updating cloud state from ZooKeeper... 
[junit4:junit4]   2> 7284 T726 oasc.Overseer$ClusterStateUpdater.updateState Update state numShards=2 message={
[junit4:junit4]   2> 	  "operation":"state",
[junit4:junit4]   2> 	  "numShards":"2",
[junit4:junit4]   2> 	  "shard":null,
[junit4:junit4]   2> 	  "roles":null,
[junit4:junit4]   2> 	  "state":"down",
[junit4:junit4]   2> 	  "core":"collection1",
[junit4:junit4]   2> 	  "collection":"collection1",
[junit4:junit4]   2> 	  "node_name":"127.0.0.1:49315_",
[junit4:junit4]   2> 	  "base_url":"http://127.0.0.1:49315"}
[junit4:junit4]   2> 7285 T726 oasc.Overseer$ClusterStateUpdater.createCollection Create collection collection1 with numShards 2
[junit4:junit4]   2> 7285 T726 oasc.Overseer$ClusterStateUpdater.updateState Assigning new node to shard shard=shard1
[junit4:junit4]   2> 7300 T731 oascc.ZkStateReader$2.process A cluster state change: WatchedEvent state:SyncConnected type:NodeDataChanged path:/clusterstate.json, has occurred - updating... (live nodes size: 2)
[junit4:junit4]   2> 7301 T725 oascc.ZkStateReader$2.process A cluster state change: WatchedEvent state:SyncConnected type:NodeDataChanged path:/clusterstate.json, has occurred - updating... (live nodes size: 2)
[junit4:junit4]   2> 7301 T744 oascc.ZkStateReader$2.process A cluster state change: WatchedEvent state:SyncConnected type:NodeDataChanged path:/clusterstate.json, has occurred - updating... (live nodes size: 2)
[junit4:junit4]   2> 7980 T745 oasc.CoreContainer.registerCore registering core: collection1
[junit4:junit4]   2> 7980 T745 oasc.ZkController.register Register replica - core:collection1 address:http://127.0.0.1:49315 collection:collection1 shard:shard1
[junit4:junit4]   2> 7982 T745 oascc.SolrZkClient.makePath makePath: /collections/collection1/leader_elect/shard1/election
[junit4:junit4]   2> 8009 T708 oazs.PrepRequestProcessor.pRequest Got user-level KeeperException when processing sessionid:0x13ca51e72390006 type:delete cxid:0x45 zxid:0x5b txntype:-1 reqpath:n/a Error Path:/solr/collections/collection1/leaders Error:KeeperErrorCode = NoNode for /solr/collections/collection1/leaders
[junit4:junit4]   2> 8011 T745 oasc.ShardLeaderElectionContext.runLeaderProcess Running the leader process.
[junit4:junit4]   2> 8012 T708 oazs.PrepRequestProcessor.pRequest Got user-level KeeperException when processing sessionid:0x13ca51e72390006 type:create cxid:0x46 zxid:0x5c txntype:-1 reqpath:n/a Error Path:/solr/overseer Error:KeeperErrorCode = NodeExists for /solr/overseer
[junit4:junit4]   2> 8018 T745 oasc.ShardLeaderElectionContext.waitForReplicasToComeUp Enough replicas found to continue.
[junit4:junit4]   2> 8018 T745 oasc.ShardLeaderElectionContext.runLeaderProcess I may be the new leader - try and sync
[junit4:junit4]   2> 8019 T745 oasc.SyncStrategy.sync Sync replicas to http://127.0.0.1:49315/collection1/
[junit4:junit4]   2> 8020 T745 oasc.SyncStrategy.syncReplicas Sync Success - now sync replicas to me
[junit4:junit4]   2> 8021 T745 oasc.SyncStrategy.syncToMe http://127.0.0.1:49315/collection1/ has no replicas
[junit4:junit4]   2> 8021 T745 oasc.ShardLeaderElectionContext.runLeaderProcess I am the new leader: http://127.0.0.1:49315/collection1/
[junit4:junit4]   2> 8022 T745 oascc.SolrZkClient.makePath makePath: /collections/collection1/leaders/shard1
[junit4:junit4]   2> 8029 T708 oazs.PrepRequestProcessor.pRequest Got user-level KeeperException when processing sessionid:0x13ca51e72390006 type:create cxid:0x50 zxid:0x60 txntype:-1 reqpath:n/a Error Path:/solr/overseer Error:KeeperErrorCode = NodeExists for /solr/overseer
[junit4:junit4]   2> 8813 T726 oascc.ZkStateReader.updateClusterState Updating cloud state from ZooKeeper... 
[junit4:junit4]   2> 8828 T744 oascc.ZkStateReader$2.process A cluster state change: WatchedEvent state:SyncConnected type:NodeDataChanged path:/clusterstate.json, has occurred - updating... (live nodes size: 2)
[junit4:junit4]   2> 8830 T725 oascc.ZkStateReader$2.process A cluster state change: WatchedEvent state:SyncConnected type:NodeDataChanged path:/clusterstate.json, has occurred - updating... (live nodes size: 2)
[junit4:junit4]   2> 8832 T731 oascc.ZkStateReader$2.process A cluster state change: WatchedEvent state:SyncConnected type:NodeDataChanged path:/clusterstate.json, has occurred - updating... (live nodes size: 2)
[junit4:junit4]   2> 8860 T745 oasc.ZkController.register We are http://127.0.0.1:49315/collection1/ and leader is http://127.0.0.1:49315/collection1/
[junit4:junit4]   2> 8860 T745 oasc.ZkController.register No LogReplay needed for core=collection1 baseURL=http://127.0.0.1:49315
[junit4:junit4]   2> 8860 T745 oasc.ZkController.checkRecovery I am the leader, no recovery necessary
[junit4:junit4]   2> 8861 T745 oasc.ZkController.publish publishing core=collection1 state=active
[junit4:junit4]   2> 8861 T745 oasc.ZkController.publish numShards not found on descriptor - reading it from system property
[junit4:junit4]   2> 8864 T745 oascc.ZkStateReader.updateClusterState Updating cloud state from ZooKeeper... 
[junit4:junit4]   2> 8866 T703 oass.SolrDispatchFilter.init user.dir=/Users/jenkins/jenkins-slave/workspace/Lucene-Solr-trunk-MacOSX/solr/build/solr-core/test/J0
[junit4:junit4]   2> 8866 T703 oass.SolrDispatchFilter.init SolrDispatchFilter.init() done
[junit4:junit4]   2> 8867 T703 oascsi.HttpClientUtil.createClient Creating new http client, config:maxConnections=128&maxConnectionsPerHost=32&followRedirects=false
[junit4:junit4]   2> 9149 T703 oejs.Server.doStart jetty-8.1.8.v20121106
[junit4:junit4]   2> 9153 T703 oejs.AbstractConnector.doStart Started SelectChannelConnector@127.0.0.1:49318
[junit4:junit4]   2> 9154 T703 oass.SolrDispatchFilter.init SolrDispatchFilter.init()
[junit4:junit4]   2> 9155 T703 oasc.SolrResourceLoader.locateSolrHome JNDI not configured for solr (NoInitialContextEx)
[junit4:junit4]   2> 9156 T703 oasc.SolrResourceLoader.locateSolrHome using system property solr.solr.home: /Users/jenkins/jenkins-slave/workspace/Lucene-Solr-trunk-MacOSX/solr/build/solr-core/test/J0/./org.apache.solr.cloud.BasicDistributedZkTest-jetty2-1359979910342
[junit4:junit4]   2> 9156 T703 oasc.CoreContainer$Initializer.initialize looking for solr.xml: /Users/jenkins/jenkins-slave/workspace/Lucene-Solr-trunk-MacOSX/solr/build/solr-core/test/J0/./org.apache.solr.cloud.BasicDistributedZkTest-jetty2-1359979910342/solr.xml
[junit4:junit4]   2> 9157 T703 oasc.CoreContainer.<init> New CoreContainer 1529885855
[junit4:junit4]   2> 9158 T703 oasc.CoreContainer.load Loading CoreContainer using Solr Home: '/Users/jenkins/jenkins-slave/workspace/Lucene-Solr-trunk-MacOSX/solr/build/solr-core/test/J0/./org.apache.solr.cloud.BasicDistributedZkTest-jetty2-1359979910342/'
[junit4:junit4]   2> 9158 T703 oasc.SolrResourceLoader.<init> new SolrResourceLoader for directory: '/Users/jenkins/jenkins-slave/workspace/Lucene-Solr-trunk-MacOSX/solr/build/solr-core/test/J0/./org.apache.solr.cloud.BasicDistributedZkTest-jetty2-1359979910342/'
[junit4:junit4]   2> 9252 T703 oashc.HttpShardHandlerFactory.getParameter Setting socketTimeout to: 60000
[junit4:junit4]   2> 9253 T703 oashc.HttpShardHandlerFactory.getParameter Setting urlScheme to: http://
[junit4:junit4]   2> 9253 T703 oashc.HttpShardHandlerFactory.getParameter Setting connTimeout to: 15000
[junit4:junit4]   2> 9254 T703 oashc.HttpShardHandlerFactory.getParameter Setting maxConnectionsPerHost to: 20
[junit4:junit4]   2> 9254 T703 oashc.HttpShardHandlerFactory.getParameter Setting corePoolSize to: 0
[junit4:junit4]   2> 9255 T703 oashc.HttpShardHandlerFactory.getParameter Setting maximumPoolSize to: 2147483647
[junit4:junit4]   2> 9255 T703 oashc.HttpShardHandlerFactory.getParameter Setting maxThreadIdleTime to: 5
[junit4:junit4]   2> 9259 T703 oashc.HttpShardHandlerFactory.getParameter Setting sizeOfQueue to: -1
[junit4:junit4]   2> 9260 T703 oashc.HttpShardHandlerFactory.getParameter Setting fairnessPolicy to: false
[junit4:junit4]   2> 9261 T703 oascsi.HttpClientUtil.createClient Creating new http client, config:maxConnectionsPerHost=20&maxConnections=10000&socketTimeout=60000&connTimeout=15000&retry=false
[junit4:junit4]   2> 9286 T703 oasc.CoreContainer.load Registering Log Listener
[junit4:junit4]   2> 9321 T703 oasc.CoreContainer.initZooKeeper Zookeeper client=127.0.0.1:49308/solr
[junit4:junit4]   2> 9322 T703 oasc.ZkController.checkChrootPath zkHost includes chroot
[junit4:junit4]   2> 9322 T703 oaz.ZooKeeper.<init> Initiating client connection, connectString=127.0.0.1:49308 sessionTimeout=60000 watcher=org.apache.solr.common.cloud.ConnectionManager@5677e40c
[junit4:junit4]   2> 9323 T703 oascc.ConnectionManager.waitForConnected Waiting for client to connect to ZooKeeper
[junit4:junit4]   2> 9324 T756 oaz.ClientCnxn$SendThread.logStartConnect Opening socket connection to server localhost/127.0.0.1:49308. Will not attempt to authenticate using SASL (access denied ("javax.security.auth.AuthPermission" "getLoginConfiguration"))
[junit4:junit4]   2> 9328 T756 oaz.ClientCnxn$SendThread.primeConnection Socket connection established to localhost/127.0.0.1:49308, initiating session
[junit4:junit4]   2> 9329 T705 oazs.NIOServerCnxnFactory.run Accepted socket connection from /127.0.0.1:49319
[junit4:junit4]   2> 9330 T705 oazs.ZooKeeperServer.processConnectRequest Client attempting to establish new session at /127.0.0.1:49319
[junit4:junit4]   2> 9525 T707 oazs.ZooKeeperServer.finishSessionInit Established session 0x13ca51e72390007 with negotiated timeout 20000 for client /127.0.0.1:49319
[junit4:junit4]   2> 9526 T756 oaz.ClientCnxn$SendThread.onConnected Session establishment complete on server localhost/127.0.0.1:49308, sessionid = 0x13ca51e72390007, negotiated timeout = 20000
[junit4:junit4]   2> 9526 T757 oascc.ConnectionManager.process Watcher org.apache.solr.common.cloud.ConnectionManager@5677e40c name:ZooKeeperConnection Watcher:127.0.0.1:49308 got event WatchedEvent state:SyncConnected type:None path:null path:null type:None
[junit4:junit4]   2> 9527 T703 oascc.ConnectionManager.waitForConnected Client is connected to ZooKeeper
[junit4:junit4]   2> 9530 T708 oazs.PrepRequestProcessor.pRequest2Txn Processed session termination for sessionid: 0x13ca51e72390007
[junit4:junit4]   2> 9532 T757 oaz.ClientCnxn$EventThread.run EventThread shut down
[junit4:junit4]   2> 9532 T705 oazs.NIOServerCnxn.doIO WARNING caught end of stream exception EndOfStreamException: Unable to read additional data from client sessionid 0x13ca51e72390007, likely client has closed socket
[junit4:junit4]   2> 	at org.apache.zookeeper.server.NIOServerCnxn.doIO(NIOServerCnxn.java:220)
[junit4:junit4]   2> 	at org.apache.zookeeper.server.NIOServerCnxnFactory.run(NIOServerCnxnFactory.java:208)
[junit4:junit4]   2> 	at java.lang.Thread.run(Thread.java:722)
[junit4:junit4]   2> 
[junit4:junit4]   2> 9532 T703 oaz.ZooKeeper.close Session: 0x13ca51e72390007 closed
[junit4:junit4]   2> 9534 T705 oazs.NIOServerCnxn.closeSock Closed socket connection for client /127.0.0.1:49319 which had sessionid 0x13ca51e72390007
[junit4:junit4]   2> 9534 T703 oascsi.HttpClientUtil.createClient Creating new http client, config:maxConnections=500&maxConnectionsPerHost=16&socketTimeout=60000&connTimeout=15000
[junit4:junit4]   2> 9545 T703 oaz.ZooKeeper.<init> Initiating client connection, connectString=127.0.0.1:49308/solr sessionTimeout=30000 watcher=org.apache.solr.common.cloud.ConnectionManager@4fcfb70d
[junit4:junit4]   2> 9547 T703 oascc.ConnectionManager.waitForConnected Waiting for client to connect to ZooKeeper
[junit4:junit4]   2> 9549 T758 oaz.ClientCnxn$SendThread.logStartConnect Opening socket connection to server localhost/127.0.0.1:49308. Will not attempt to authenticate using SASL (access denied ("javax.security.auth.AuthPermission" "getLoginConfiguration"))
[junit4:junit4]   2> 9550 T758 oaz.ClientCnxn$SendThread.primeConnection Socket connection established to localhost/127.0.0.1:49308, initiating session
[junit4:junit4]   2> 9551 T705 oazs.NIOServerCnxnFactory.run Accepted socket connection from /127.0.0.1:49320
[junit4:junit4]   2> 9552 T705 oazs.ZooKeeperServer.processConnectRequest Client attempting to establish new session at /127.0.0.1:49320
[junit4:junit4]   2> 9553 T707 oazs.ZooKeeperServer.finishSessionInit Established session 0x13ca51e72390008 with negotiated timeout 20000 for client /127.0.0.1:49320
[junit4:junit4]   2> 9554 T758 oaz.ClientCnxn$SendThread.onConnected Session establishment complete on server localhost/127.0.0.1:49308, sessionid = 0x13ca51e72390008, negotiated timeout = 20000
[junit4:junit4]   2> 9555 T759 oascc.ConnectionManager.process Watcher org.apache.solr.common.cloud.ConnectionManager@4fcfb70d name:ZooKeeperConnection Watcher:127.0.0.1:49308/solr got event WatchedEvent state:SyncConnected type:None path:null path:null type:None
[junit4:junit4]   2> 9555 T703 oascc.ConnectionManager.waitForConnected Client is connected to ZooKeeper
[junit4:junit4]   2> 9557 T708 oazs.PrepRequestProcessor.pRequest Got user-level KeeperException when processing sessionid:0x13ca51e72390008 type:create cxid:0x1 zxid:0x6d txntype:-1 reqpath:n/a Error Path:/solr/overseer Error:KeeperErrorCode = NodeExists for /solr/overseer
[junit4:junit4]   2> 9559 T708 oazs.PrepRequestProcessor.pRequest Got user-level KeeperException when processing sessionid:0x13ca51e72390008 type:create cxid:0x2 zxid:0x6e txntype:-1 reqpath:n/a Error Path:/solr/overseer Error:KeeperErrorCode = NodeExists for /solr/overseer
[junit4:junit4]   2> 9562 T703 oasc.ZkController.createEphemeralLiveNode Register node as live in ZooKeeper:/live_nodes/127.0.0.1:49318_
[junit4:junit4]   2> 9563 T708 oazs.PrepRequestProcessor.pRequest Got user-level KeeperException when processing sessionid:0x13ca51e72390008 type:delete cxid:0x4 zxid:0x6f txntype:-1 reqpath:n/a Error Path:/solr/live_nodes/127.0.0.1:49318_ Error:KeeperErrorCode = NoNode for /solr/live_nodes/127.0.0.1:49318_
[junit4:junit4]   2> 9565 T703 oascc.SolrZkClient.makePath makePath: /live_nodes/127.0.0.1:49318_
[junit4:junit4]   2> 9585 T731 oascc.ZkStateReader$2.process A cluster state change: WatchedEvent state:SyncConnected type:NodeChildrenChanged path:/live_nodes, has occurred - updating... (live nodes size: 2)
[junit4:junit4]   2> 9585 T744 oascc.ZkStateReader$2.process A cluster state change: WatchedEvent state:SyncConnected type:NodeChildrenChanged path:/live_nodes, has occurred - updating... (live nodes size: 2)
[junit4:junit4]   2> 9585 T725 oascc.ZkStateReader$3.process Updating live nodes... (3)
[junit4:junit4]   2> 9586 T725 oascc.ZkStateReader$2.process A cluster state change: WatchedEvent state:SyncConnected type:NodeChildrenChanged path:/live_nodes, has occurred - updating... (live nodes size: 3)
[junit4:junit4]   2> 9598 T744 oascc.ZkStateReader$3.process Updating live nodes... (3)
[junit4:junit4]   2> 9599 T731 oascc.ZkStateReader$3.process Updating live nodes... (3)
[junit4:junit4]   2> 9602 T703 oascc.ZkStateReader.createClusterStateWatchersAndUpdate Updating cluster state from ZooKeeper... 
[junit4:junit4]   2> 9613 T760 oasc.CoreContainer.create Creating SolrCore 'collection1' using instanceDir: /Users/jenkins/jenkins-slave/workspace/Lucene-Solr-trunk-MacOSX/solr/build/solr-core/test/J0/./org.apache.solr.cloud.BasicDistributedZkTest-jetty2-1359979910342/collection1
[junit4:junit4]   2> 9614 T760 oasc.ZkController.createCollectionZkNode Check for collection zkNode:collection1
[junit4:junit4]   2> 9616 T760 oasc.ZkController.createCollectionZkNode Collection zkNode exists
[junit4:junit4]   2> 9616 T760 oasc.ZkController.readConfigName Load collection config from:/collections/collection1
[junit4:junit4]   2> 9619 T760 oasc.SolrResourceLoader.<init> new SolrResourceLoader for directory: '/Users/jenkins/jenkins-slave/workspace/Lucene-Solr-trunk-MacOSX/solr/build/solr-core/test/J0/./org.apache.solr.cloud.BasicDistributedZkTest-jetty2-1359979910342/collection1/'
[junit4:junit4]   2> 9620 T760 oasc.SolrResourceLoader.replaceClassLoader Adding 'file:/Users/jenkins/jenkins-slave/workspace/Lucene-Solr-trunk-MacOSX/solr/build/solr-core/test/J0/org.apache.solr.cloud.BasicDistributedZkTest-jetty2-1359979910342/collection1/lib/classes/' to classloader
[junit4:junit4]   2> 9621 T760 oasc.SolrResourceLoader.replaceClassLoader Adding 'file:/Users/jenkins/jenkins-slave/workspace/Lucene-Solr-trunk-MacOSX/solr/build/solr-core/test/J0/org.apache.solr.cloud.BasicDistributedZkTest-jetty2-1359979910342/collection1/lib/README' to classloader
[junit4:junit4]   2> 9731 T760 oasc.SolrConfig.<init> Using Lucene MatchVersion: LUCENE_50
[junit4:junit4]   2> 9882 T760 oasc.SolrConfig.<init> Loaded SolrConfig: solrconfig.xml
[junit4:junit4]   2> 9897 T760 oass.IndexSchema.readSchema Reading Solr Schema
[junit4:junit4]   2> 9922 T760 oass.IndexSchema.readSchema Schema name=test
[junit4:junit4]   2> 10355 T726 oascc.ZkStateReader.updateClusterState Updating cloud state from ZooKeeper... 
[junit4:junit4]   2> 10358 T726 oasc.Overseer$ClusterStateUpdater.updateState Update state numShards=2 message={
[junit4:junit4]   2> 	  "operation":"state",
[junit4:junit4]   2> 	  "numShards":"2",
[junit4:junit4]   2> 	  "shard":"shard1",
[junit4:junit4]   2> 	  "roles":null,
[junit4:junit4]   2> 	  "state":"active",
[junit4:junit4]   2> 	  "core":"collection1",
[junit4:junit4]   2> 	  "collection":"collection1",
[junit4:junit4]   2> 	  "node_name":"127.0.0.1:49315_",
[junit4:junit4]   2> 	  "base_url":"http://127.0.0.1:49315"}
[junit4:junit4]   2> 10369 T731 oascc.ZkStateReader$2.process A cluster state change: WatchedEvent state:SyncConnected type:NodeDataChanged path:/clusterstate.json, has occurred - updating... (live nodes size: 3)
[junit4:junit4]   2> 10369 T759 oascc.ZkStateReader$2.process A cluster state change: WatchedEvent state:SyncConnected type:NodeDataChanged path:/clusterstate.json, has occurred - updating... (live nodes size: 3)
[junit4:junit4]   2> 10370 T725 oascc.ZkStateReader$2.process A cluster state change: WatchedEvent state:SyncConnected type:NodeDataChanged path:/clusterstate.json, has occurred - updating... (live nodes size: 3)
[junit4:junit4]   2> 10370 T744 oascc.ZkStateReader$2.process A cluster state change: WatchedEvent state:SyncConnected type:NodeDataChanged path:/clusterstate.json, has occurred - updating... (live nodes size: 3)
[junit4:junit4]   2> 11248 T760 oass.OpenExchangeRatesOrgProvider.init Initialized with rates=open-exchange-rates.json, refreshInterval=1440.
[junit4:junit4]   2> 11287 T760 oass.IndexSchema.readSchema default search field in schema is text
[junit4:junit4]   2> 11297 T760 oass.IndexSchema.readSchema unique key field: id
[junit4:junit4]   2> 11335 T760 oass.FileExchangeRateProvider.reload Reloading exchange rates from file currency.xml
[junit4:junit4]   2> 11348 T760 oass.FileExchangeRateProvider.reload Reloading exchange rates from file currency.xml
[junit4:junit4]   2> 11356 T760 oass.OpenExchangeRatesOrgProvider.reload Reloading exchange rates from open-exchange-rates.json
[junit4:junit4]   2> 11359 T760 oass.OpenExchangeRatesOrgProvider.reload Reloading exchange rates from open-exchange-rates.json
[junit4:junit4]   2> 11361 T760 oasc.SolrCore.<init> [collection1] Opening new SolrCore at /Users/jenkins/jenkins-slave/workspace/Lucene-Solr-trunk-MacOSX/solr/build/solr-core/test/J0/./org.apache.solr.cloud.BasicDistributedZkTest-jetty2-1359979910342/collection1/, dataDir=./org.apache.solr.cloud.BasicDistributedZkTest-1359979901483/jetty2/
[junit4:junit4]   2> 11361 T760 oasc.JmxMonitoredMap.<init> JMX monitoring is enabled. Adding Solr mbeans to JMX Server: com.sun.jmx.mbeanserver.JmxMBeanServer@36298619
[junit4:junit4]   2> 11362 T760 oasc.SolrCore.initDirectoryFactory solr.NRTCachingDirectoryFactory
[junit4:junit4]   2> 11362 T760 oasc.CachingDirectoryFactory.get return new directory for /Users/jenkins/jenkins-slave/workspace/Lucene-Solr-trunk-MacOSX/solr/build/solr-core/test/J0/./org.apache.solr.cloud.BasicDistributedZkTest-1359979901483/jetty2 forceNew:false
[junit4:junit4]   2> 11363 T760 oasc.CachingDirectoryFactory.close Releasing directory:/Users/jenkins/jenkins-slave/workspace/Lucene-Solr-trunk-MacOSX/solr/build/solr-core/test/J0/./org.apache.solr.cloud.BasicDistributedZkTest-1359979901483/jetty2
[junit4:junit4]   2> 11363 T760 oasc.SolrCore.getNewIndexDir New index directory detected: old=null new=./org.apache.solr.cloud.BasicDistributedZkTest-1359979901483/jetty2/index/
[junit4:junit4]   2> 11364 T760 oasc.SolrCore.initIndex WARNING [collection1] Solr index directory './org.apache.solr.cloud.BasicDistributedZkTest-1359979901483/jetty2/index' doesn't exist. Creating new index...
[junit4:junit4]   2> 11365 T760 oasc.CachingDirectoryFactory.get return new directory for /Users/jenkins/jenkins-slave/workspace/Lucene-Solr-trunk-MacOSX/solr/build/solr-core/test/J0/./org.apache.solr.cloud.BasicDistributedZkTest-1359979901483/jetty2/index forceNew:false
[junit4:junit4]   2> 11371 T760 oasc.SolrDeletionPolicy.onCommit SolrDeletionPolicy.onCommit: commits:num=1
[junit4:junit4]   2> 		commit{dir=RateLimitedDirectoryWrapper(NRTCachingDirectory(org.apache.lucene.store.NIOFSDirectory@/Users/jenkins/jenkins-slave/workspace/Lucene-Solr-trunk-MacOSX/solr/build/solr-core/test/J0/org.apache.solr.cloud.BasicDistributedZkTest-1359979901483/jetty2/index lockFactory=org.apache.lucene.store.NativeFSLockFactory@684e8b72; maxCacheMB=48.0 maxMergeSizeMB=4.0)),segFN=segments_1,generation=1,filenames=[segments_1]
[junit4:junit4]   2> 11373 T760 oasc.SolrDeletionPolicy.updateCommits newest commit = 1[segments_1]
[junit4:junit4]   2> 11378 T760 oasc.CachingDirectoryFactory.close Releasing directory:/Users/jenkins/jenkins-slave/workspace/Lucene-Solr-trunk-MacOSX/solr/build/solr-core/test/J0/./org.apache.solr.cloud.BasicDistributedZkTest-1359979901483/jetty2/index
[junit4:junit4]   2> 11382 T760 oasc.SolrCore.initWriters created xml: solr.XMLResponseWriter
[junit4:junit4]   2> 11385 T760 oasup.UpdateRequestProcessorChain.init inserting DistributedUpdateProcessorFactory into updateRequestProcessorChain "dedupe"
[junit4:junit4]   2> 11385 T760 oasup.UpdateRequestProcessorChain.init inserting DistributedUpdateProcessorFactory into updateRequestProcessorChain "dedupe-allfields"
[junit4:junit4]   2> 11385 T760 oasup.UpdateRequestProcessorChain.init inserting DistributedUpdateProcessorFactory into updateRequestProcessorChain "stored_sig"
[junit4:junit4]   2> 11386 T760 oasup.UpdateRequestProcessorChain.init inserting DistributedUpdateProcessorFactory into updateRequestProcessorChain "uniq-fields"
[junit4:junit4]   2> 11387 T760 oasup.UpdateRequestProcessorChain.init inserting DistributedUpdateProcessorFactory into updateRequestProcessorChain "distrib-dup-test-chain-implicit"
[junit4:junit4]   2> 11387 T760 oasc.RequestHandlers.initHandlersFromConfig adding lazy requestHandler: solr.ReplicationHandler
[junit4:junit4]   2> 11387 T760 oasc.RequestHandlers.initHandlersFromConfig created /replication: solr.ReplicationHandler
[junit4:junit4]   2> 11388 T760 oasc.RequestHandlers.initHandlersFromConfig created standard: solr.StandardRequestHandler
[junit4:junit4]   2> 11389 T760 oasc.RequestHandlers.initHandlersFromConfig created /get: solr.RealTimeGetHandler
[junit4:junit4]   2> 11390 T760 oasc.RequestHandlers.initHandlersFromConfig created dismax: solr.SearchHandler
[junit4:junit4]   2> 11390 T760 oasc.RequestHandlers.initHandlersFromConfig created mock: org.apache.solr.core.MockQuerySenderListenerReqHandler
[junit4:junit4]   2> 11391 T760 oasc.RequestHandlers.initHandlersFromConfig created /admin/: org.apache.solr.handler.admin.AdminHandlers
[junit4:junit4]   2> 11392 T760 oasc.RequestHandlers.initHandlersFromConfig created defaults: solr.StandardRequestHandler
[junit4:junit4]   2> 11392 T760 oasc.RequestHandlers.initHandlersFromConfig adding lazy requestHandler: solr.StandardRequestHandler
[junit4:junit4]   2> 11392 T760 oasc.RequestHandlers.initHandlersFromConfig created lazy: solr.StandardRequestHandler
[junit4:junit4]   2> 11393 T760 oasc.RequestHandlers.initHandlersFromConfig created /update: solr.UpdateRequestHandler
[junit4:junit4]   2> 11394 T760 oasc.RequestHandlers.initHandlersFromConfig created /terms: org.apache.solr.handler.component.SearchHandler
[junit4:junit4]   2> 11395 T760 oasc.RequestHandlers.initHandlersFromConfig created spellCheckCompRH: org.apache.solr.handler.component.SearchHandler
[junit4:junit4]   2> 11395 T760 oasc.RequestHandlers.initHandlersFromConfig created spellCheckCompRH_Direct: org.apache.solr.handler.component.SearchHandler
[junit4:junit4]   2> 11396 T760 oasc.RequestHandlers.initHandlersFromConfig created spellCheckWithWordbreak: org.apache.solr.handler.component.SearchHandler
[junit4:junit4]   2> 11397 T760 oasc.RequestHandlers.initHandlersFromConfig created spellCheckWithWordbreak_Direct: org.apache.solr.handler.component.SearchHandler
[junit4:junit4]   2> 11397 T760 oasc.RequestHandlers.initHandlersFromConfig created spellCheckCompRH1: org.apache.solr.handler.component.SearchHandler
[junit4:junit4]   2> 11398 T760 oasc.RequestHandlers.initHandlersFromConfig created mltrh: org.apache.solr.handler.component.SearchHandler
[junit4:junit4]   2> 11399 T760 oasc.RequestHandlers.initHandlersFromConfig created tvrh: org.apache.solr.handler.component.SearchHandler
[junit4:junit4]   2> 11399 T760 oasc.RequestHandlers.initHandlersFromConfig created /mlt: solr.MoreLikeThisHandler
[junit4:junit4]   2> 11400 T760 oasc.RequestHandlers.initHandlersFromConfig created /debug/dump: solr.DumpRequestHandler
[junit4:junit4]   2> 11411 T760 oashl.XMLLoader.init xsltCacheLifetimeSeconds=60
[junit4:junit4]   2> 11414 T760 oasc.SolrCore.initDeprecatedSupport WARNING solrconfig.xml uses deprecated <admin/gettableFiles>, Please update your config to use the ShowFileRequestHandler.
[junit4:junit4]   2> 11427 T760 oasc.SolrCore.initDeprecatedSupport WARNING adding ShowFileRequestHandler with hidden files: [SCHEMA.XML, OLD_SYNONYMS.TXT, STOPWORDS.TXT, PROTWORDS.TXT, OPEN-EXCHANGE-RATES.JSON, SYNONYMS.TXT, CURRENCY.XML, MAPPING-ISOLATIN1ACCENT.TXT]
[junit4:junit4]   2> 11431 T760 oasc.CachingDirectoryFactory.close Releasing directory:/Users/jenkins/jenkins-slave/workspace/Lucene-Solr-trunk-MacOSX/solr/build/solr-core/test/J0/./org.apache.solr.cloud.BasicDistributedZkTest-1359979901483/jetty2
[junit4:junit4]   2> 11433 T760 oass.SolrIndexSearcher.<init> Opening Searcher@6b6a6cfa main
[junit4:junit4]   2> 11435 T760 oasu.CommitTracker.<init> Hard AutoCommit: disabled
[junit4:junit4]   2> 11435 T760 oasu.CommitTracker.<init> Soft AutoCommit: disabled
[junit4:junit4]   2> 11436 T760 oashc.SpellCheckComponent.inform Initializing spell checkers
[junit4:junit4]   2> 11442 T760 oass.DirectSolrSpellChecker.init init: {name=direct,classname=DirectSolrSpellChecker,field=lowerfilt,minQueryLength=3}
[junit4:junit4]   2> 11566 T761 oasc.SolrCore.registerSearcher [collection1] Registered new searcher Searcher@6b6a6cfa main{StandardDirectoryReader(segments_1:1)}
[junit4:junit4]   2> 11576 T760 oasc.ZkController.publish publishing core=collection1 state=down
[junit4:junit4]   2> 11576 T760 oasc.ZkController.publish numShards not found on descriptor - reading it from system property
[junit4:junit4]   2> 11890 T726 oascc.ZkStateReader.updateClusterState Updating cloud state from ZooKeeper... 
[junit4:junit4]   2> 11892 T726 oasc.Overseer$ClusterStateUpdater.updateState Update state numShards=2 message={
[junit4:junit4]   2> 	  "operation":"state",
[junit4:junit4]   2> 	  "numShards":"2",
[junit4:junit4]   2> 	  "shard":null,
[junit4:junit4]   2> 	  "roles":null,
[junit4:junit4]   2> 	  "state":"down",
[junit4:junit4]   2> 	  "core":"collection1",
[junit4:junit4]   2> 	  "collection":"collection1",
[junit4:junit4]   2> 	  "node_name":"127.0.0.1:49318_",
[junit4:junit4]   2> 	  "base_url":"http://127.0.0.1:49318"}
[junit4:junit4]   2> 11892 T726 oasc.Overseer$ClusterStateUpdater.updateState Collection already exists with numShards=2
[junit4:junit4]   2> 11893 T726 oasc.Overseer$ClusterStateUpdater.updateState Assigning new node to shard shard=shard2
[junit4:junit4]   2> 11902 T759 oascc.ZkStateReader$2.process A cluster state change: WatchedEvent state:SyncConnected type:NodeDataChanged path:/clusterstate.json, has occurred - updating... (live nodes size: 3)
[junit4:junit4]   2> 11902 T725 oascc.ZkStateReader$2.process A cluster state change: WatchedEvent state:SyncConnected type:NodeDataChanged path:/clusterstate.json, has occurred - updating... (live nodes size: 3)
[junit4:junit4]   2> 11902 T731 oascc.ZkStateReader$2.process A cluster state change: WatchedEvent state:SyncConnected type:NodeDataChanged path:/clusterstate.json, has occurred - updating... (live nodes size: 3)
[junit4:junit4]   2> 11903 T744 oascc.ZkStateReader$2.process A cluster state change: WatchedEvent state:SyncConnected type:NodeDataChanged path:/clusterstate.json, has occurred - updating... (live nodes size: 3)
[junit4:junit4]   2> 12619 T760 oasc.CoreContainer.registerCore registering core: collection1
[junit4:junit4]   2> 12619 T760 oasc.ZkController.register Register replica - core:collection1 address:http://127.0.0.1:49318 collection:collection1 shard:shard2
[junit4:junit4]   2> 12620 T760 oascc.SolrZkClient.makePath makePath: /collections/collection1/leader_elect/shard2/election
[junit4:junit4]   2> 12633 T708 oazs.PrepRequestProcessor.pRequest Got user-level KeeperException when processing sessionid:0x13ca51e72390008 type:delete cxid:0x44 zxid:0x7e txntype:-1 reqpath:n/a Error Path:/solr/collections/collection1/leaders/shard2 Error:KeeperErrorCode = NoNode for /solr/collections/collection1/leaders/shard2
[junit4:junit4]   2> 12634 T760 oasc.ShardLeaderElectionContext.runLeaderProcess Running the leader process.
[junit4:junit4]   2> 12635 T708 oazs.PrepRequestProcessor.pRequest Got user-level KeeperException when processing sessionid:0x13ca51e72390008 type:create cxid:0x45 zxid:0x7f txntype:-1 reqpath:n/a Error Path:/solr/overseer Error:KeeperErrorCode = NodeExists for /solr/overseer
[junit4:junit4]   2> 12644 T760 oasc.ShardLeaderElectionContext.waitForReplicasToComeUp Enough replicas found to continue.
[junit4:junit4]   2> 12644 T760 oasc.ShardLeaderElectionContext.runLeaderProcess I may be the new leader - try and sync
[junit4:junit4]   2> 12644 T760 oasc.SyncStrategy.sync Sync replicas to http://127.0.0.1:49318/collection1/
[junit4:junit4]   2> 12644 T760 oasc.SyncStrategy.syncReplicas Sync Success - now sync replicas to me
[junit4:junit4]   2> 12645 T760 oasc.SyncStrategy.syncToMe http://127.0.0.1:49318/collection1/ has no replicas
[junit4:junit4]   2> 12645 T760 oasc.ShardLeaderElectionContext.runLeaderProcess I am the new leader: http://127.0.0.1:49318/collection1/
[junit4:junit4]   2> 12645 T760 oascc.SolrZkClient.makePath makePath: /collections/collection1/leaders/shard2
[junit4:junit4]   2> 12652 T708 oazs.PrepRequestProcessor.pRequest Got user-level KeeperException when processing sessionid:0x13ca51e72390008 type:create cxid:0x4e zxid:0x82 txntype:-1 reqpath:n/a Error Path:/solr/overseer Error:KeeperErrorCode = NodeExists for /solr/overseer
[junit4:junit4]   2> 13420 T726 oascc.ZkStateReader.updateClusterState Updating cloud state from ZooKeeper... 
[junit4:junit4]   2> 13459 T759 oascc.ZkStateReader$2.process A cluster state change: WatchedEvent state:SyncConnected type:NodeDataChanged path:/clusterstate.json, has occurred - updating... (live nodes size: 3)
[junit4:junit4]   2> 13463 T731 oascc.ZkStateReader$2.process A cluster state change: WatchedEvent state:SyncConnected type:NodeDataChanged path:/clusterstate.json, has occurred - updating... (live nodes size: 3)
[junit4:junit4]   2> 13464 T744 oascc.ZkStateReader$2.process A cluster state change: WatchedEvent state:SyncConnected type:NodeDataChanged path:/clusterstate.json, has occurred - updating... (live nodes size: 3)
[junit4:junit4]   2> 13464 T725 oascc.ZkStateReader$2.process A cluster state change: WatchedEvent state:SyncConnected type:NodeDataChanged path:/clusterstate.json, has occurred - updating... (live nodes size: 3)
[junit4:junit4]   2> 13486 T760 oasc.ZkController.register We are http://127.0.0.1:49318/collection1/ and leader is http://127.0.0.1:49318/collection1/
[junit4:junit4]   2> 13487 T760 oasc.ZkController.register No LogReplay needed for core=collection1 baseURL=http://127.0.0.1:49318
[junit4:junit4]   2> 13487 T760 oasc.ZkController.checkRecovery I am the leader, no recovery necessary
[junit4:junit4]   2> 13488 T760 oasc.ZkController.publish publishing core=collection1 state=active
[junit4:junit4]   2> 13488 T760 oasc.ZkController.publish numShards not found on descriptor - reading it from system property
[junit4:junit4]   2> 13492 T760 oascc.ZkStateReader.updateClusterState Updating cloud state from ZooKeeper... 
[junit4:junit4]   2> 13494 T703 oass.SolrDispatchFilter.init user.dir=/Users/jenkins/jenkins-slave/workspace/Lucene-Solr-trunk-MacOSX/solr/build/solr-core/test/J0
[junit4:junit4]   2> 13494 T703 oass.SolrDispatchFilter.init SolrDispatchFilter.init() done
[junit4:junit4]   2> 13495 T703 oascsi.HttpClientUtil.createClient Creating new http client, config:maxConnections=128&maxConnectionsPerHost=32&followRedirects=false
[junit4:junit4]   2> 13787 T703 oejs.Server.doStart jetty-8.1.8.v20121106
[junit4:junit4]   2> 13791 T703 oejs.AbstractConnector.doStart Started SelectChannelConnector@127.0.0.1:49321
[junit4:junit4]   2> 13792 T703 oass.SolrDispatchFilter.init SolrDispatchFilter.init()
[junit4:junit4]   2> 13793 T703 oasc.SolrResourceLoader.locateSolrHome JNDI not configured for solr (NoInitialContextEx)
[junit4:junit4]   2> 13793 T703 oasc.SolrResourceLoader.locateSolrHome using system property solr.solr.home: /Users/jenkins/jenkins-slave/workspace/Lucene-Solr-trunk-MacOSX/solr/build/solr-core/test/J0/./org.apache.solr.cloud.BasicDistributedZkTest-jetty3-1359979914979
[junit4:junit4]   2> 13794 T703 oasc.CoreContainer$Initializer.initialize looking for solr.xml: /Users/jenkins/jenkins-slave/workspace/Lucene-Solr-trunk-MacOSX/solr/build/solr-core/test/J0/./org.apache.solr.cloud.BasicDistributedZkTest-jetty3-1359979914979/solr.xml
[junit4:junit4]   2> 13794 T703 oasc.CoreContainer.<init> New CoreContainer 656295850
[junit4:junit4]   2> 13795 T703 oasc.CoreContainer.load Loading CoreContainer using Solr Home: '/Users/jenkins/jenkins-slave/workspace/Lucene-Solr-trunk-MacOSX/solr/build/solr-core/test/J0/./org.apache.solr.cloud.BasicDistributedZkTest-jetty3-1359979914979/'
[junit4:junit4]   2> 13795 T703 oasc.SolrResourceLoader.<init> new SolrResourceLoader for directory: '/Users/jenkins/jenkins-slave/workspace/Lucene-Solr-trunk-MacOSX/solr/build/solr-core/test/J0/./org.apache.solr.cloud.BasicDistributedZkTest-jetty3-1359979914979/'
[junit4:junit4]   2> 13862 T703 oashc.HttpShardHandlerFactory.getParameter Setting socketTimeout to: 60000
[junit4:junit4]   2> 13863 T703 oashc.HttpShardHandlerFactory.getParameter Setting urlScheme to: http://
[junit4:junit4]   2> 13863 T703 oashc.HttpShardHandlerFactory.getParameter Setting connTimeout to: 15000
[junit4:junit4]   2> 13864 T703 oashc.HttpShardHandlerFactory.getParameter Setting maxConnectionsPerHost to: 20
[junit4:junit4]   2> 13864 T703 oashc.HttpShardHandlerFactory.getParameter Setting corePoolSize to: 0
[junit4:junit4]   2> 13865 T703 oashc.HttpShardHandlerFactory.getParameter Setting maximumPoolSize to: 2147483647
[junit4:junit4]   2> 13865 T703 oashc.HttpShardHandlerFactory.getParameter Setting maxThreadIdleTime to: 5
[junit4:junit4]   2> 13866 T703 oashc.HttpShardHandlerFactory.getParameter Setting sizeOfQueue to: -1
[junit4:junit4]   2> 13866 T703 oashc.HttpShardHandlerFactory.getParameter Setting fairnessPolicy to: false
[junit4:junit4]   2> 13866 T703 oascsi.HttpClientUtil.createClient Creating new http client, config:maxConnectionsPerHost=20&maxConnections=10000&socketTimeout=60000&connTimeout=15000&retry=false
[junit4:junit4]   2> 13896 T703 oasc.CoreContainer.load Registering Log Listener
[junit4:junit4]   2> 13913 T703 oasc.CoreContainer.initZooKeeper Zookeeper client=127.0.0.1:49308/solr
[junit4:junit4]   2> 13914 T703 oasc.ZkController.checkChrootPath zkHost includes chroot
[junit4:junit4]   2> 13914 T703 oaz.ZooKeeper.<init> Initiating client connection, connectString=127.0.0.1:49308 sessionTimeout=60000 watcher=org.apache.solr.common.cloud.ConnectionManager@3c24867e
[junit4:junit4]   2> 13916 T703 oascc.ConnectionManager.waitForConnected Waiting for client to connect to ZooKeeper
[junit4:junit4]   2> 13917 T771 oaz.ClientCnxn$SendThread.logStartConnect Opening socket connection to server localhost/127.0.0.1:49308. Will not attempt to authenticate using SASL (access denied ("javax.security.auth.AuthPermission" "getLoginConfiguration"))
[junit4:junit4]   2> 13917 T771 oaz.ClientCnxn$SendThread.primeConnection Socket connection established to localhost/127.0.0.1:49308, initiating session
[junit4:junit4]   2> 13918 T705 oazs.NIOServerCnxnFactory.run Accepted socket connection from /127.0.0.1:49322
[junit4:junit4]   2> 13919 T705 oazs.ZooKeeperServer.processConnectRequest Client attempting to establish new session at /127.0.0.1:49322
[junit4:junit4]   2> 13920 T707 oazs.ZooKeeperServer.finishSessionInit Established session 0x13ca51e72390009 with negotiated timeout 20000 for client /127.0.0.1:49322
[junit4:junit4]   2> 13920 T771 oaz.ClientCnxn$SendThread.onConnected Session establishment complete on server localhost/127.0.0.1:49308, sessionid = 0x13ca51e72390009, negotiated timeout = 20000
[junit4:junit4]   2> 13921 T772 oascc.ConnectionManager.process Watcher org.apache.solr.common.cloud.ConnectionManager@3c24867e name:ZooKeeperConnection Watcher:127.0.0.1:49308 got event WatchedEvent state:SyncConnected type:None path:null path:null type:None
[junit4:junit4]   2> 13921 T703 oascc.ConnectionManager.waitForConnected Client is connected to ZooKeeper
[junit4:junit4]   2> 13924 T708 oazs.PrepRequestProcessor.pRequest2Txn Processed session termination for sessionid: 0x13ca51e72390009
[junit4:junit4]   2> 13925 T705 oazs.NIOServerCnxn.closeSock Closed socket connection for client /127.0.0.1:49322 which had sessionid 0x13ca51e72390009
[junit4:junit4]   2> 13925 T772 oaz.ClientCnxn$EventThread.run EventThread shut down
[junit4:junit4]   2> 13925 T703 oaz.ZooKeeper.close Session: 0x13ca51e72390009 closed
[junit4:junit4]   2> 13926 T703 oascsi.HttpClientUtil.createClient Creating new http client, config:maxConnections=500&maxConnectionsPerHost=16&socketTimeout=60000&connTimeout=15000
[junit4:junit4]   2> 13932 T703 oaz.ZooKeeper.<init> Initiating client connection, connectString=127.0.0.1:49308/solr sessionTimeout=30000 watcher=org.apache.solr.common.cloud.ConnectionManager@296f4446
[junit4:junit4]   2> 13934 T773 oaz.ClientCnxn$SendThread.logStartConnect Opening socket connection to server localhost/127.0.0.1:49308. Will not attempt to authenticate using SASL (access denied ("javax.security.auth.AuthPermission" "getLoginConfiguration"))
[junit4:junit4]   2> 13934 T703 oascc.ConnectionManager.waitForConnected Waiting for client to connect to ZooKeeper
[junit4:junit4]   2> 13935 T773 oaz.ClientCnxn$SendThread.primeConnection Socket connection established to localhost/127.0.0.1:49308, initiating session
[junit4:junit4]   2> 13940 T705 oazs.NIOServerCnxnFactory.run Accepted socket connection from /127.0.0.1:49323
[junit4:junit4]   2> 13942 T705 oazs.ZooKeeperServer.processConnectRequest Client attempting to establish new session at /127.0.0.1:49323
[junit4:junit4]   2> 13943 T707 oazs.ZooKeeperServer.finishSessionInit Established session 0x13ca51e7239000a with negotiated timeout 20000 for client /127.0.0.1:49323
[junit4:junit4]   2> 13943 T773 oaz.ClientCnxn$SendThread.onConnected Session establishment complete on server localhost/127.0.0.1:49308, sessionid = 0x13ca51e7239000a, negotiated timeout = 20000
[junit4:junit4]   2> 13944 T774 oascc.ConnectionManager.process Watcher org.apache.solr.common.cloud.ConnectionManager@296f4446 name:ZooKeeperConnection Watcher:127.0.0.1:49308/solr got event WatchedEvent state:SyncConnected type:None path:null path:null type:None
[junit4:junit4]   2> 13944 T703 oascc.ConnectionManager.waitForConnected Client is connected to ZooKeeper
[junit4:junit4]   2> 13955 T708 oazs.PrepRequestProcessor.pRequest Got user-level KeeperException when processing sessionid:0x13ca51e7239000a type:create cxid:0x1 zxid:0x8f txntype:-1 reqpath:n/a Error Path:/solr/overseer Error:KeeperErrorCode = NodeExists for /solr/overseer
[junit4:junit4]   2> 13957 T708 oazs.PrepRequestProcessor.pRequest Got user-level KeeperException when processing sessionid:0x13ca51e7239000a type:create cxid:0x2 zxid:0x90 txntype:-1 reqpath:n/a Error Path:/solr/overseer Error:KeeperErrorCode = NodeExists for /solr/overseer
[junit4:junit4]   2> 13960 T703 oasc.ZkController.createEphemeralLiveNode Register node as live in ZooKeeper:/live_nodes/127.0.0.1:49321_
[junit4:junit4]   2> 13961 T708 oazs.PrepRequestProcessor.pRequest Got user-level KeeperException when processing sessionid:0x13ca51e7239000a type:delete cxid:0x4 zxid:0x91 txntype:-1 reqpath:n/a Error Path:/solr/live_nodes/127.0.0.1:49321_ Error:KeeperErrorCode = NoNode for /solr/live_nodes/127.0.0.1:49321_
[junit4:junit4]   2> 14019 T703 oascc.SolrZkClient.makePath makePath: /live_nodes/127.0.0.1:49321_
[junit4:junit4]   2> 14025 T744 oascc.ZkStateReader$2.process A cluster state change: WatchedEvent state:SyncConnected type:NodeChildrenChanged path:/live_nodes, has occurred - updating... (live nodes size: 3)
[junit4:junit4]   2> 14025 T759 oascc.ZkStateReader$2.process A cluster state change: WatchedEvent state:SyncConnected type:NodeChildrenChanged path:/live_nodes, has occurred - updating... (live nodes size: 3)
[junit4:junit4]   2> 14026 T731 oascc.ZkStateReader$2.process A cluster state change: WatchedEvent state:SyncConnected type:NodeChildrenChanged path:/live_nodes, has occurred - updating... (live nodes size: 3)
[junit4:junit4]   2> 14026 T725 oascc.ZkStateReader$3.process Updating live nodes... (4)
[junit4:junit4]   2> 14026 T725 oascc.ZkStateReader$2.process A cluster state change: WatchedEvent state:SyncConnected type:NodeChildrenChanged path:/live_nodes, has occurred - updating... (live nodes size: 4)
[junit4:junit4]   2> 14030 T759 oascc.ZkStateReader$3.process Updating live nodes... (4)
[junit4:junit4]   2> 14030 T731 oascc.ZkStateReader$3.process Updating live nodes... (4)
[junit4:junit4]   2> 14031 T744 oascc.ZkStateReader$3.process Updating live nodes... (4)
[junit4:junit4]   2> 14038 T703 oascc.ZkStateReader.createClusterStateWatchersAndUpdate Updating cluster state from ZooKeeper... 
[junit4:junit4]   2> 14046 T775 oasc.CoreContainer.create Creating SolrCore 'collection1' using instanceDir: /Users/jenkins/jenkins-slave/workspace/Lucene-Solr-trunk-MacOSX/solr/build/solr-core/test/J0/./org.apache.solr.cloud.BasicDistributedZkTest-jetty3-1359979914979/collection1
[junit4:junit4]   2> 14046 T775 oasc.ZkController.createCollectionZkNode Check for collection zkNode:collection1
[junit4:junit4]   2> 14047 T775 oasc.ZkController.createCollectionZkNode Collection zkNode exists
[junit4:junit4]   2> 14047 T775 oasc.ZkController.readConfigName Load collection config from:/collections/collection1
[junit4:junit4]   2> 14049 T775 oasc.SolrResourceLoader.<init> new SolrResourceLoader for directory: '/Users/jenkins/jenkins-slave/workspace/Lucene-Solr-trunk-MacOSX/solr/build/solr-core/test/J0/./org.apache.solr.cloud.BasicDistributedZkTest-jetty3-1359979914979/collection1/'
[junit4:junit4]   2> 14050 T775 oasc.SolrResourceLoader.replaceClassLoader Adding 'file:/Users/jenkins/jenkins-slave/workspace/Lucene-Solr-trunk-MacOSX/solr/build/solr-core/test/J0/org.apache.solr.cloud.BasicDistributedZkTest-jetty3-1359979914979/collection1/lib/classes/' to classloader
[junit4:junit4]   2> 14050 T775 oasc.SolrResourceLoader.replaceClassLoader Adding 'file:/Users/jenkins/jenkins-slave/workspace/Lucene-Solr-trunk-MacOSX/solr/build/solr-core/test/J0/org.apache.solr.cloud.BasicDistributedZkTest-jetty3-1359979914979/collection1/lib/README' to classloader
[junit4:junit4]   2> 14123 T775 oasc.SolrConfig.<init> Using Lucene MatchVersion: LUCENE_50
[junit4:junit4]   2> 14225 T775 oasc.SolrConfig.<init> Loaded SolrConfig: solrconfig.xml
[junit4:junit4]   2> 14227 T775 oass.IndexSchema.readSchema Reading Solr Schema
[junit4:junit4]   2> 14238 T775 oass.IndexSchema.readSchema Schema name=test
[junit4:junit4]   2> 14989 T726 oascc.ZkStateReader.updateClusterState Updating cloud state from ZooKeeper... 
[junit4:junit4]   2> 14991 T726 oasc.Overseer$ClusterStateUpdater.updateState Update state numShards=2 message={
[junit4:junit4]   2> 	  "operation":"state",
[junit4:junit4]   2> 	  "numShards":"2",
[junit4:junit4]   2> 	  "shard":"shard2",
[junit4:junit4]   2> 	  "roles":null,
[junit4:junit4]   2> 	  "state":"active",
[junit4:junit4]   2> 	  "core":"collection1",
[junit4:junit4]   2> 	  "collection":"collection1",
[junit4:junit4]   2> 	  "node_name":"127.0.0.1:49318_",
[junit4:junit4]   2> 	  "base_url":"http://127.0.0.1:49318"}
[junit4:junit4]   2> 15029 T725 oascc.ZkStateReader$2.process A cluster state change: WatchedEvent state:SyncConnected type:NodeDataChanged path:/clusterstate.json, has occurred - updating... (live nodes size: 4)
[junit4:junit4]   2> 15030 T731 oascc.ZkStateReader$2.process A cluster state change: WatchedEvent state:SyncConnected type:NodeDataChanged path:/clusterstate.json, has occurred - updating... (live nodes size: 4)
[junit4:junit4]   2> 15038 T759 oascc.ZkStateReader$2.process A cluster state change: WatchedEvent state:SyncConnected type:NodeDataChanged path:/clusterstate.json, has occurred - updating... (live nodes size: 4)
[junit4:junit4]   2> 15040 T744 oascc.ZkStateReader$2.process A cluster state change: WatchedEvent state:SyncConnected type:NodeDataChanged path:/clusterstate.json, has occurred - updating... (live nodes size: 4)
[junit4:junit4]   2> 15041 T774 oascc.ZkStateReader$2.process A cluster state change: WatchedEvent state:SyncConnected type:NodeDataChanged path:/clusterstate.json, has occurred - updating... (live nodes size: 4)
[junit4:junit4]   2> 15139 T775 oass.OpenExchangeRatesOrgProvider.init Initialized with rates=open-exchange-rates.json, refreshInterval=1440.
[junit4:junit4]   2> 15160 T775 oass.IndexSchema.readSchema default search field in schema is text
[junit4:junit4]   2> 15168 T775 oass.IndexSchema.readSchema unique key field: id
[junit4:junit4]   2> 15197 T775 oass.FileExchangeRateProvider.reload Reloading exchange rates from file currency.xml
[junit4:junit4]   2> 15206 T775 oass.FileExchangeRateProvider.reload Reloading exchange rates from file currency.xml
[junit4:junit4]   2> 15214 T775 oass.OpenExchangeRatesOrgProvider.reload Reloading exchange rates from open-exchange-rates.json
[junit4:junit4]   2> 15220 T775 oass.OpenExchangeRatesOrgProvider.reload Reloading exchange rates from open-exchange-rates.json
[junit4:junit4]   2> 15225 T775 oasc.SolrCore.<init> [collection1] Opening new SolrCore at /Users/jenkins/jenkins-slave/workspace/Lucene-Solr-trunk-MacOSX/solr/build/solr-core/test/J0/./org.apache.solr.cloud.BasicDistributedZkTest-jetty3-1359979914979/collection1/, dataDir=./org.apache.solr.cloud.BasicDistributedZkTest-1359979901483/jetty3/
[junit4:junit4]   2> 15226 T775 oasc.JmxMonitoredMap.<init> JMX monitoring is enabled. Adding Solr mbeans to JMX Server: com.sun.jmx.mbeanserver.JmxMBeanServer@36298619
[junit4:junit4]   2> 15226 T775 oasc.SolrCore.initDirectoryFactory solr.NRTCachingDirectoryFactory
[junit4:junit4]   2> 15227 T775 oasc.CachingDirectoryFactory.get return new directory for /Users/jenkins/jenkins-slave/workspace/Lucene-Solr-trunk-MacOSX/solr/build/solr-core/test/J0/./org.apache.solr.cloud.BasicDistributedZkTest-1359979901483/jetty3 forceNew:false
[junit4:junit4]   2> 15228 T775 oasc.CachingDirectoryFactory.close Releasing directory:/Users/jenkins/jenkins-slave/workspace/Lucene-Solr-trunk-MacOSX/solr/build/solr-core/test/J0/./org.apache.solr.cloud.BasicDistributedZkTest-1359979901483/jetty3
[junit4:junit4]   2> 15228 T775 oasc.SolrCore.getNewIndexDir New index directory detected: old=null new=./org.apache.solr.cloud.BasicDistributedZkTest-1359979901483/jetty3/index/
[junit4:junit4]   2> 15228 T775 oasc.SolrCore.initIndex WARNING [collection1] Solr index directory './org.apache.solr.cloud.BasicDistributedZkTest-1359979901483/jetty3/index' doesn't exist. Creating new index...
[junit4:junit4]   2> 15229 T775 oasc.CachingDirectoryFactory.get return new directory for /Users/jenkins/jenkins-slave/workspace/Lucene-Solr-trunk-MacOSX/solr/build/solr-core/test/J0/./org.apache.solr.cloud.BasicDistributedZkTest-1359979901483/jetty3/index forceNew:false
[junit4:junit4]   2> 15238 T775 oasc.SolrDeletionPolicy.onCommit SolrDeletionPolicy.onCommit: commits:num=1
[junit4:junit4]   2> 		commit{dir=RateLimitedDirectoryWrapper(NRTCachingDirectory(org.apache.lucene.store.NIOFSDirectory@/Users/jenkins/jenkins-slave/workspace/Lucene-Solr-trunk-MacOSX/solr/build/solr-core/test/J0/org.apache.solr.cloud.BasicDistributedZkTest-1359979901483/jetty3/index lockFactory=org.apache.lucene.store.NativeFSLockFactory@491e2104; maxCacheMB=48.0 maxMergeSizeMB=4.0)),segFN=segments_1,generation=1,filenames=[segments_1]
[junit4:junit4]   2> 15239 T775 oasc.SolrDeletionPolicy.updateCommits newest commit = 1[segments_1]
[junit4:junit4]   2> 15243 T775 oasc.CachingDirectoryFactory.close Releasing directory:/Users/jenkins/jenkins-slave/workspace/Lucene-Solr-trunk-MacOSX/solr/build/solr-core/test/J0/./org.apache.solr.cloud.BasicDistributedZkTest-1359979901483/jetty3/index
[junit4:junit4]   2> 15244 T775 oasc.SolrCore.initWriters created xml: solr.XMLResponseWriter
[junit4:junit4]   2> 15246 T775 oasup.UpdateRequestProcessorChain.init inserting DistributedUpdateProcessorFactory into updateRequestProcessorChain "dedupe"
[junit4:junit4]   2> 15247 T775 oasup.UpdateRequestProcessorChain.init inserting DistributedUpdateProcessorFactory into updateRequestProcessorChain "dedupe-allfields"
[junit4:junit4]   2> 15247 T775 oasup.UpdateRequestProcessorChain.init inserting DistributedUpdateProcessorFactory into updateRequestProcessorChain "stored_sig"
[junit4:junit4]   2> 15248 T775 oasup.UpdateRequestProcessorChain.init inserting DistributedUpdateProcessorFactory into updateRequestProcessorChain "uniq-fields"
[junit4:junit4]   2> 15248 T775 oasup.UpdateRequestProcessorChain.init inserting DistributedUpdateProcessorFactory into updateRequestProcessorChain "distrib-dup-test-chain-implicit"
[junit4:junit4]   2> 15249 T775 oasc.RequestHandlers.initHandlersFromConfig adding lazy requestHandler: solr.ReplicationHandler
[junit4:junit4]   2> 15249 T775 oasc.RequestHandlers.initHandlersFromConfig created /replication: solr.ReplicationHandler
[junit4:junit4]   2> 15250 T775 oasc.RequestHandlers.initHandlersFromConfig created standard: solr.StandardRequestHandler
[junit4:junit4]   2> 15250 T775 oasc.RequestHandlers.initHandlersFromConfig created /get: solr.RealTimeGetHandler
[junit4:junit4]   2> 15251 T775 oasc.RequestHandlers.initHandlersFromConfig created dismax: solr.SearchHandler
[junit4:junit4]   2> 15252 T775 oasc.RequestHandlers.initHandlersFromConfig created mock: org.apache.solr.core.MockQuerySenderListenerReqHandler
[junit4:junit4]   2> 15252 T775 oasc.RequestHandlers.initHandlersFromConfig created /admin/: org.apache.solr.handler.admin.AdminHandlers
[junit4:junit4]   2> 15253 T775 oasc.RequestHandlers.initHandlersFromConfig created defaults: solr.StandardRequestHandler
[junit4:junit4]   2> 15253 T775 oasc.RequestHandlers.initHandlersFromConfig adding lazy requestHandler: solr.StandardRequestHandler
[junit4:junit4]   2> 15253 T775 oasc.RequestHandlers.initHandlersFromConfig created lazy: solr.StandardRequestHandler
[junit4:junit4]   2> 15255 T775 oasc.RequestHandlers.initHandlersFromConfig created /update: solr.UpdateRequestHandler
[junit4:junit4]   2> 15255 T775 oasc.RequestHandlers.initHandlersFromConfig created /terms: org.apache.solr.handler.component.SearchHandler
[junit4:junit4]   2> 15256 T775 oasc.RequestHandlers.initHandlersFromConfig created spellCheckCompRH: org.apache.solr.handler.component.SearchHandler
[junit4:junit4]   2> 15256 T775 oasc.RequestHandlers.initHandlersFromConfig created spellCheckCompRH_Direct: org.apache.solr.handler.component.SearchHandler
[junit4:junit4]   2> 15257 T775 oasc.RequestHandlers.initHandlersFromConfig created spellCheckWithWordbreak: org.apache.solr.handler.component.SearchHandler
[junit4:junit4]   2> 15258 T775 oasc.RequestHandlers.initHandlersFromConfig created spellCheckWithWordbreak_Direct: org.apache.solr.handler.component.SearchHandler
[junit4:junit4]   2> 15258 T775 oasc.RequestHandlers.initHandlersFromConfig created spellCheckCompRH1: org.apache.solr.handler.component.SearchHandler
[junit4:junit4]   2> 15259 T775 oasc.RequestHandlers.initHandlersFromConfig created mltrh: org.apache.solr.handler.component.SearchHandler
[junit4:junit4]   2> 15260 T775 oasc.RequestHandlers.initHandlersFromConfig created tvrh: org.apache.solr.handler.component.SearchHandler
[junit4:junit4]   2> 15260 T775 oasc.RequestHandlers.initHandlersFromConfig created /mlt: solr.MoreLikeThisHandler
[junit4:junit4]   2> 15261 T775 oasc.RequestHandlers.initHandlersFromConfig created /debug/dump: solr.DumpRequestHandler
[junit4:junit4]   2> 15273 T775 oashl.XMLLoader.init xsltCacheLifetimeSeconds=60
[junit4:junit4]   2> 15276 T775 oasc.SolrCore.initDeprecatedSupport WARNING solrconfig.xml uses deprecated <admin/gettableFiles>, Please update your config to use the ShowFileRequestHandler.
[junit4:junit4]   2> 15278 T775 oasc.SolrCore.initDeprecatedSupport WARNING adding ShowFileRequestHandler with hidden files: [SCHEMA.XML, OLD_SYNONYMS.TXT, STOPWORDS.TXT, PROTWORDS.TXT, OPEN-EXCHANGE-RATES.JSON, SYNONYMS.TXT, CURRENCY.XML, MAPPING-ISOLATIN1ACCENT.TXT]
[junit4:junit4]   2> 15281 T775 oasc.CachingDirectoryFactory.close Releasing directory:/Users/jenkins/jenkins-slave/workspace/Lucene-Solr-trunk-MacOSX/solr/build/solr-core/test/J0/./org.apache.solr.cloud.BasicDistributedZkTest-1359979901483/jetty3
[junit4:junit4]   2> 15282 T775 oass.SolrIndexSearcher.<init> Opening Searcher@590839ce main
[junit4:junit4]   2> 15286 T775 oasu.CommitTracker.<init> Hard AutoCommit: disabled
[junit4:junit4]   2> 15286 T775 oasu.CommitTracker.<init> Soft AutoCommit: disabled
[junit4:junit4]   2> 15286 T775 oashc.SpellCheckComponent.inform Initializing spell checkers
[junit4:junit4]   2> 15293 T775 oass.DirectSolrSpellChecker.init init: {name=direct,classname=DirectSolrSpellChecker,field=lowerfilt,minQueryLength=3}
[junit4:junit4]   2> 15352 T775 oasc.ZkController.publish publishing core=collection1 state=down
[junit4:junit4]   2> 15352 T775 oasc.ZkController.publish numShards not found on descriptor - reading it from system property
[junit4:junit4]   2> 15355 T776 oasc.SolrCore.registerSearcher [collection1] Registered new searcher Searcher@590839ce main{StandardDirectoryReader(segments_1:1)}
[junit4:junit4]   2> 16556 T726 oascc.ZkStateReader.updateClusterState Updating cloud state from ZooKeeper... 
[junit4:junit4]   2> 16558 T726 oasc.Overseer$ClusterStateUpdater.updateState Update state numShards=2 message={
[junit4:junit4]   2> 	  "operation":"state",
[junit4:junit4]   2> 	  "numShards":"2",
[junit4:junit4]   2> 	  "shard":null,
[junit4:junit4]   2> 	  "roles":null,
[junit4:junit4]   2> 	  "state":"down",
[junit4:junit4]   2> 	  "core":"collection1",
[junit4:junit4]   2> 	  "collection":"collection1",
[junit4:junit4]   2> 	  "node_name":"127.0.0.1:49321_",
[junit4:junit4]   2> 	  "base_url":"http://127.0.0.1:49321"}
[junit4:junit4]   2> 16559 T726 oasc.Overseer$ClusterStateUpdater.updateState Collection already exists with numShards=2
[junit4:junit4]   2> 16559 T726 oasc.Overseer$ClusterStateUpdater.updateState Assigning new node to shard shard=shard1
[junit4:junit4]   2> 16572 T725 oascc.ZkStateReader$2.process A cluster state change: WatchedEvent state:SyncConnected type:NodeDataChanged path:/clusterstate.json, has occurred - updating... (live nodes size: 4)
[junit4:junit4]   2> 16572 T731 oascc.ZkStateReader$2.process A cluster state change: WatchedEvent state:SyncConnected type:NodeDataChanged path:/clusterstate.json, has occurred - updating... (live nodes size: 4)
[junit4:junit4]   2> 16573 T744 oascc.ZkStateReader$2.process A cluster state change: WatchedEvent state:SyncConnected type:NodeDataChanged path:/clusterstate.json, has occurred - updating... (live nodes size: 4)
[junit4:junit4]   2> 16572 T774 oascc.ZkStateReader$2.process A cluster state change: WatchedEvent state:SyncConnected type:NodeDataChanged path:/clusterstate.json, has occurred - updating... (live nodes size: 4)
[junit4:junit4]   2> 16573 T759 oascc.ZkStateReader$2.process A cluster state change: WatchedEvent state:SyncConnected type:NodeDataChanged path:/clusterstate.json, has occurred - updating... (live nodes size: 4)
[junit4:junit4]   2> 17373 T775 oasc.CoreContainer.registerCore registering core: collection1
[junit4:junit4]   2> 17374 T775 oasc.ZkController.register Register replica - core:collection1 address:http://127.0.0.1:49321 collection:collection1 shard:shard1
[junit4:junit4]   2> 17379 T775 oasc.ZkController.register We are http://127.0.0.1:49321/collection1/ and leader is http://127.0.0.1:49315/collection1/
[junit4:junit4]   2> 17379 T775 oasc.ZkController.register No LogReplay needed for core=collection1 baseURL=http://127.0.0.1:49321
[junit4:junit4]   2> 17380 T775 oasc.ZkController.checkRecovery Core needs to recover:collection1
[junit4:junit4]   2> 17380 T775 oasu.DefaultSolrCoreState.doRecovery Running recovery - first canceling any ongoing recovery
[junit4:junit4]   2> ASYNC  NEW_CORE C49 name=collection1 org.apache.solr.core.SolrCore@475b32ea url=http://127.0.0.1:49321/collection1 node=127.0.0.1:49321_ C49_STATE=coll:collection1 core:collection1 props:{shard=null, roles=null, state=down, core=collection1, collection=collection1, node_name=127.0.0.1:49321_, base_url=http://127.0.0.1:49321}
[junit4:junit4]   2> 17385 T777 C49 P49321 oasc.RecoveryStrategy.run Starting recovery process.  core=collection1 recoveringAfterStartup=true
[junit4:junit4]   2> 17388 T777 C49 P49321 oasc.RecoveryStrategy.doRecovery ###### startupVersions=[]
[junit4:junit4]   2> 17389 T777 C49 P49321 oasc.ZkController.publish publishing core=collection1 state=recovering
[junit4:junit4]   2> 17389 T777 C49 P49321 oasc.ZkController.publish numShards not found on descriptor - reading it from system property
[junit4:junit4]   2> 17391 T775 oascc.ZkStateReader.updateClusterState Updating cloud state from ZooKeeper... 
[junit4:junit4]   2> 17393 T777 C49 P49321 oascsi.HttpClientUtil.createClient Creating new http client, config:maxConnections=128&maxConnectionsPerHost=32&followRedirects=false
[junit4:junit4]   2> 17393 T703 oass.SolrDispatchFilter.init user.dir=/Users/jenkins/jenkins-slave/workspace/Lucene-Solr-trunk-MacOSX/solr/build/solr-core/test/J0
[junit4:junit4]   2> 17394 T703 oass.SolrDispatchFilter.init SolrDispatchFilter.init() done
[junit4:junit4]   2> 17394 T703 oascsi.HttpClientUtil.createClient Creating new http client, config:maxConnections=128&maxConnectionsPerHost=32&followRedirects=false
[junit4:junit4]   2> 17610 T703 oejs.Server.doStart jetty-8.1.8.v20121106
[junit4:junit4]   2> 17619 T703 oejs.AbstractConnector.doStart Started SelectChannelConnector@127.0.0.1:49325
[junit4:junit4]   2> 17620 T703 oass.SolrDispatchFilter.init SolrDispatchFilter.init()
[junit4:junit4]   2> 17621 T703 oasc.SolrResourceLoader.locateSolrHome JNDI not configured for solr (NoInitialContextEx)
[junit4:junit4]   2> 17621 T703 oasc.SolrResourceLoader.locateSolrHome using system property solr.solr.home: /Users/jenkins/jenkins-slave/workspace/Lucene-Solr-trunk-MacOSX/solr/build/solr-core/test/J0/./org.apache.solr.cloud.BasicDistributedZkTest-jetty4-1359979918872
[junit4:junit4]   2> 17622 T703 oasc.CoreContainer$Initializer.initialize looking for solr.xml: /Users/jenkins/jenkins-slave/workspace/Lucene-Solr-trunk-MacOSX/solr/build/solr-core/test/J0/./org.apache.solr.cloud.BasicDistributedZkTest-jetty4-1359979918872/solr.xml
[junit4:junit4]   2> 17622 T703 oasc.CoreContainer.<init> New CoreContainer 289047866
[junit4:junit4]   2> 17623 T703 oasc.CoreContainer.load Loading CoreContainer using Solr Home: '/Users/jenkins/jenkins-slave/workspace/Lucene-Solr-trunk-MacOSX/solr/build/solr-core/test/J0/./org.apache.solr.cloud.BasicDistributedZkTest-jetty4-1359979918872/'
[junit4:junit4]   2> 17623 T703 oasc.SolrResourceLoader.<init> new SolrResourceLoader for directory: '/Users/jenkins/jenkins-slave/workspace/Lucene-Solr-trunk-MacOSX/solr/build/solr-core/test/J0/./org.apache.solr.cloud.BasicDistributedZkTest-jetty4-1359979918872/'
[junit4:junit4]   2> 17675 T703 oashc.HttpShardHandlerFactory.getParameter Setting socketTimeout to: 60000
[junit4:junit4]   2> 17676 T703 oashc.HttpShardHandlerFactory.getParameter Setting urlScheme to: http://
[junit4:junit4]   2> 17677 T703 oashc.HttpShardHandlerFactory.getParameter Setting connTimeout to: 15000
[junit4:junit4]   2> 17678 T703 oashc.HttpShardHandlerFactory.getParameter Setting maxConnectionsPerHost to: 20
[junit4:junit4]   2> 17678 T703 oashc.HttpShardHandlerFactory.getParameter Setting corePoolSize to: 0
[junit4:junit4]   2> 17679 T703 oashc.HttpShardHandlerFactory.getParameter Setting maximumPoolSize to: 2147483647
[junit4:junit4]   2> 17680 T703 oashc.HttpShardHandlerFactory.getParameter Setting maxThreadIdleTime to: 5
[junit4:junit4]   2> 17680 T703 oashc.HttpShardHandlerFactory.getParameter Setting sizeOfQueue to: -1
[junit4:junit4]   2> 17681 T703 oashc.HttpShardHandlerFactory.getParameter Setting fairnessPolicy to: false
[junit4:junit4]   2> 17682 T703 oascsi.HttpClientUtil.createClient Creating new http client, config:maxConnectionsPerHost=20&maxConnections=10000&socketTimeout=60000&connTimeout=15000&retry=false
[junit4:junit4]   2> 17718 T703 oasc.CoreContainer.load Registering Log Listener
[junit4:junit4]   2> 17788 T703 oasc.CoreContainer.initZooKeeper Zookeeper client=127.0.0.1:49308/solr
[junit4:junit4]   2> 17789 T703 oasc.ZkController.checkChrootPath zkHost includes chroot
[junit4:junit4]   2> 17790 T703 oaz.ZooKeeper.<init> Initiating client connection, connectString=127.0.0.1:49308 sessionTimeout=60000 watcher=org.apache.solr.common.cloud.ConnectionManager@52235873
[junit4:junit4]   2> 17792 T703 oascc.ConnectionManager.waitForConnected Waiting for client to connect to ZooKeeper
[junit4:junit4]   2> 17792 T787 oaz.ClientCnxn$SendThread.logStartConnect Opening socket connection to server localhost/127.0.0.1:49308. Will not attempt to authenticate using SASL (access denied ("javax.security.auth.AuthPermission" "getLoginConfiguration"))
[junit4:junit4]   2> 17794 T787 oaz.ClientCnxn$SendThread.primeConnection Socket connection established to localhost/127.0.0.1:49308, initiating session
[junit4:junit4]   2> 17794 T705 oazs.NIOServerCnxnFactory.run Accepted socket connection from /127.0.0.1:49326
[junit4:junit4]   2> 17795 T705 oazs.ZooKeeperServer.processConnectRequest Client attempting to establish new session at /127.0.0.1:49326
[junit4:junit4]   2> 17797 T707 oazs.ZooKeeperServer.finishSessionInit Established session 0x13ca51e7239000b with negotiated timeout 20000 for client /127.0.0.1:49326
[junit4:junit4]   2> 17797 T787 oaz.ClientCnxn$SendThread.onConnected Session establishment complete on server localhost/127.0.0.1:49308, sessionid = 0x13ca51e7239000b, negotiated timeout = 20000
[junit4:junit4]   2> 17797 T788 oascc.ConnectionManager.process Watcher org.apache.solr.common.cloud.ConnectionManager@52235873 name:ZooKeeperConnection Watcher:127.0.0.1:49308 got event WatchedEvent state:SyncConnected type:None path:null path:null type:None
[junit4:junit4]   2> 17801 T703 oascc.ConnectionManager.waitForConnected Client is connected to ZooKeeper
[junit4:junit4]   2> 17804 T708 oazs.PrepRequestProcessor.pRequest2Txn Processed session termination for sessionid: 0x13ca51e7239000b
[junit4:junit4]   2> 17805 T705 oazs.NIOServerCnxn.closeSock Closed socket connection for client /127.0.0.1:49326 which had sessionid 0x13ca51e7239000b
[junit4:junit4]   2> 17805 T788 oaz.ClientCnxn$EventThread.run EventThread shut down
[junit4:junit4]   2> 17805 T703 oaz.ZooKeeper.close Session: 0x13ca51e7239000b closed
[junit4:junit4]   2> 17806 T703 oascsi.HttpClientUtil.createClient Creating new http client, config:maxConnections=500&maxConnectionsPerHost=16&socketTimeout=60000&connTimeout=15000
[junit4:junit4]   2> 17817 T703 oaz.ZooKeeper.<init> Initiating client connection, connectString=127.0.0.1:49308/solr sessionTimeout=30000 watcher=org.apache.solr.common.cloud.ConnectionManager@7de2d422
[junit4:junit4]   2> 17819 T703 oascc.ConnectionManager.waitForConnected Waiting for client to connect to ZooKeeper
[junit4:junit4]   2> 17820 T789 oaz.ClientCnxn$SendThread.logStartConnect Opening socket connection to server localhost/127.0.0.1:49308. Will not attempt to authenticate using SASL (access denied ("javax.security.auth.AuthPermission" "getLoginConfiguration"))
[junit4:junit4]   2> 17821 T789 oaz.ClientCnxn$SendThread.primeConnection Socket connection established to localhost/127.0.0.1:49308, initiating session
[junit4:junit4]   2> 17822 T705 oazs.NIOServerCnxnFactory.run Accepted socket connection from /127.0.0.1:49327
[junit4:junit4]   2> 17823 T705 oazs.ZooKeeperServer.processConnectRequest Client attempting to establish new session at /127.0.0.1:49327
[junit4:junit4]   2> 17825 T707 oazs.ZooKeeperServer.finishSessionInit Established session 0x13ca51e7239000c with negotiated timeout 20000 for client /127.0.0.1:49327
[junit4:junit4]   2> 17825 T789 oaz.ClientCnxn$SendThread.onConnected Session establishment complete on server localhost/127.0.0.1:49308, sessionid = 0x13ca51e7239000c, negotiated timeout = 20000
[junit4:junit4]   2> 17826 T790 oascc.ConnectionManager.process Watcher org.apache.solr.common.cloud.ConnectionManager@7de2d422 name:ZooKeeperConnection Watcher:127.0.0.1:49308/solr got event WatchedEvent state:SyncConnected type:None path:null path:null type:None
[junit4:junit4]   2> 17826 T703 oascc.ConnectionManager.waitForConnected Client is connected to ZooKeeper
[junit4:junit4]   2> 17828 T708 oazs.PrepRequestProcessor.pRequest Got user-level KeeperException when processing sessionid:0x13ca51e7239000c type:create cxid:0x1 zxid:0xa2 txntype:-1 reqpath:n/a Error Path:/solr/overseer Error:KeeperErrorCode = NodeExists for /solr/overseer
[junit4:junit4]   2> 17830 T708 oazs.PrepRequestProcessor.pRequest Got user-level KeeperException when processing sessionid:0x13ca51e7239000c type:create cxid:0x2 zxid:0xa3 txntype:-1 reqpath:n/a Error Path:/solr/overseer Error:KeeperErrorCode = NodeExists for /solr/overseer
[junit4:junit4]   2> 17833 T703 oasc.ZkController.createEphemeralLiveNode Register node as live in ZooKeeper:/live_nodes/127.0.0.1:49325_
[junit4:junit4]   2> 17835 T708 oazs.PrepRequestProcessor.pRequest Got user-level KeeperException when processing sessionid:0x13ca51e7239000c type:delete cxid:0x4 zxid:0xa4 txntype:-1 reqpath:n/a Error Path:/solr/live_nodes/127.0.0.1:49325_ Error:KeeperErrorCode = NoNode for /solr/live_nodes/127.0.0.1:49325_
[junit4:junit4]   2> 17837 T703 oascc.SolrZkClient.makePath makePath: /live_nodes/127.0.0.1:49325_
[junit4:junit4]   2> 17842 T731 oascc.ZkStateReader$2.process A cluster state change: WatchedEvent state:SyncConnected type:NodeChildrenChanged path:/live_nodes, has occurred - updating... (live nodes size: 4)
[junit4:junit4]   2> 17844 T744 oascc.ZkStateReader$2.process A cluster state change: WatchedEvent state:SyncConnected type:NodeChildrenChanged path:/live_nodes, has occurred - updating... (live nodes size: 4)
[junit4:junit4]   2> 17845 T759 oascc.ZkStateReader$2.process A cluster state change: WatchedEvent state:SyncConnected type:NodeChildrenChanged path:/live_nodes, has occurred - updating... (live nodes size: 4)
[junit4:junit4]   2> 17847 T725 oascc.ZkStateReader$3.process Updating live nodes... (5)
[junit4:junit4]   2> 17848 T725 oascc.ZkStateReader$2.process A cluster state change: WatchedEvent state:SyncConnected type:NodeChildrenChanged path:/live_nodes, has occurred - updating... (live nodes size: 5)
[junit4:junit4]   2> 17859 T744 oascc.ZkStateReader$3.process Updating live nodes... (5)
[junit4:junit4]   2> 17862 T774 oascc.ZkStateReader$3.process Updating live nodes... (5)
[junit4:junit4]   2> 17862 T774 oascc.ZkStateReader$2.process A cluster state change: WatchedEvent state:SyncConnected type:NodeChildrenChanged path:/live_nodes, has occurred - updating... (live nodes size: 5)
[junit4:junit4]   2> 17863 T759 oascc.ZkStateReader$3.process Updating live nodes... (5)
[junit4:junit4]   2> 17865 T731 oascc.ZkStateReader$3.process Updating live nodes... (5)
[junit4:junit4]   2> 17886 T703 oascc.ZkStateReader.createClusterStateWatchersAndUpdate Updating cluster state from ZooKeeper... 
[junit4:junit4]   2> 17896 T791 oasc.CoreContainer.create Creating SolrCore 'collection1' using instanceDir: /Users/jenkins/jenkins-slave/workspace/Lucene-Solr-trunk-MacOSX/solr/build/solr-core/test/J0/./org.apache.solr.cloud.BasicDistributedZkTest-jetty4-1359979918872/collection1
[junit4:junit4]   2> 17896 T791 oasc.ZkController.createCollectionZkNode Check for collection zkNode:collection1
[junit4:junit4]   2> 17897 T791 oasc.ZkController.createCollectionZkNode Collection zkNode exists
[junit4:junit4]   2> 17898 T791 oasc.ZkController.readConfigName Load collection config from:/collections/collection1
[junit4:junit4]   2> 17900 T791 oasc.SolrResourceLoader.<init> new SolrResourceLoader for directory: '/Users/jenkins/jenkins-slave/workspace/Lucene-Solr-trunk-MacOSX/solr/build/solr-core/test/J0/./org.apache.solr.cloud.BasicDistributedZkTest-jetty4-1359979918872/collection1/'
[junit4:junit4]   2> 17901 T791 oasc.SolrResourceLoader.replaceClassLoader Adding 'file:/Users/jenkins/jenkins-slave/workspace/Lucene-Solr-trunk-MacOSX/solr/build/solr-core/test/J0/org.apache.solr.cloud.BasicDistributedZkTest-jetty4-1359979918872/collection1/lib/classes/' to classloader
[junit4:junit4]   2> 17901 T791 oasc.SolrResourceLoader.replaceClassLoader Adding 'file:/Users/jenkins/jenkins-slave/workspace/Lucene-Solr-trunk-MacOSX/solr/build/solr-core/test/J0/org.apache.solr.cloud.BasicDistributedZkTest-jetty4-1359979918872/collection1/lib/README' to classloader
[junit4:junit4]   2> 17952 T791 oasc.SolrConfig.<init> Using Lucene MatchVersion: LUCENE_50
[junit4:junit4]   2> 18056 T791 oasc.SolrConfig.<init> Loaded SolrConfig: solrconfig.xml
[junit4:junit4]   2> 18058 T791 oass.IndexSchema.readSchema Reading Solr Schema
[junit4:junit4]   2> 18063 T791 oass.IndexSchema.readSchema Schema name=test
[junit4:junit4]   2> 18095 T726 oascc.ZkStateReader.updateClusterState Updating cloud state from ZooKeeper... 
[junit4:junit4]   2> 18100 T726 oasc.Overseer$ClusterStateUpdater.updateState Update state numShards=2 message={
[junit4:junit4]   2> 	  "operation":"state",
[junit4:junit4]   2> 	  "numShards":"2",
[junit4:junit4]   2> 	  "shard":"shard1",
[junit4:junit4]   2> 	  "roles":null,
[junit4:junit4]   2> 	  "state":"recovering",
[junit4:junit4]   2> 	  "core":"collection1",
[junit4:junit4]   2> 	  "collection":"collection1",
[junit4:junit4]   2> 	  "node_name":"127.0.0.1:49321_",
[junit4:junit4]   2> 	  "base_url":"http://127.0.0.1:49321"}
[junit4:junit4]   2> 18170 T725 oascc.ZkStateReader$2.process A cluster state change: WatchedEvent state:SyncConnected type:NodeDataChanged path:/clusterstate.json, has occurred - updating... (live nodes size: 5)
[junit4:junit4]   2> 18172 T744 oascc.ZkStateReader$2.process A cluster state change: WatchedEvent state:SyncConnected type:NodeDataChanged path:/clusterstate.json, has occurred - updating... (live nodes size: 5)
[junit4:junit4]   2> 18173 T731 oascc.ZkStateReader$2.process A cluster state change: WatchedEvent state:SyncConnected type:NodeDataChanged path:/clusterstate.json, has occurred - updating... (live nodes size: 5)
[junit4:junit4]   2> 18173 T790 oascc.ZkStateReader$2.process A cluster state change: WatchedEvent state:SyncConnected type:NodeDataChanged path:/clusterstate.json, has occurred - updating... (live nodes size: 5)
[junit4:junit4]   2> 18172 T759 oascc.ZkStateReader$2.process A cluster state change: WatchedEvent state:SyncConnected type:NodeDataChanged path:/clusterstate.json, has occurred - updating... (live nodes size: 5)
[junit4:junit4]   2> 18173 T774 oascc.ZkStateReader$2.process A cluster state change: WatchedEvent state:SyncConnected type:NodeDataChanged path:/clusterstate.json, has occurred - updating... (live nodes size: 5)
[junit4:junit4]   2> 19034 T791 oass.OpenExchangeRatesOrgProvider.init Initialized with rates=open-exchange-rates.json, refreshInterval=1440.
[junit4:junit4]   2> 19050 T791 oass.IndexSchema.readSchema default search field in schema is text
[junit4:junit4]   2> 19055 T791 oass.IndexSchema.readSchema unique key field: id
[junit4:junit4]   2> 19100 T791 oass.FileExchangeRateProvider.reload Reloading exchange rates from file currency.xml
[junit4:junit4]   2> 19106 T791 oass.FileExchangeRateProvider.reload Reloading exchange rates from file currency.xml
[junit4:junit4]   2> 19161 T791 oass.OpenExchangeRatesOrgProvider.reload Reloading exchange rates from open-exchange-rates.json
[junit4:junit4]   2> 19170 T791 oass.OpenExchangeRatesOrgProvider.reload Reloading exchange rates from open-exchange-rates.json
[junit4:junit4]   2> 19173 T791 oasc.SolrCore.<init> [collection1] Opening new SolrCore at /Users/jenkins/jenkins-slave/workspace/Lucene-Solr-trunk-MacOSX/solr/build/solr-core/test/J0/./org.apache.solr.cloud.BasicDistributedZkTest-jetty4-1359979918872/collection1/, dataDir=./org.apache.solr.cloud.BasicDistributedZkTest-1359979901483/jetty4/
[junit4:junit4]   2> 19173 T791 oasc.JmxMonitoredMap.<init> JMX monitoring is enabled. Adding Solr mbeans to JMX Server: com.sun.jmx.mbeanserver.JmxMBeanServer@36298619
[junit4:junit4]   2> 19174 T791 oasc.SolrCore.initDirectoryFactory solr.NRTCachingDirectoryFactory
[junit4:junit4]   2> 19175 T791 oasc.CachingDirectoryFactory.get return new directory for /Users/jenkins/jenkins-slave/workspace/Lucene-Solr-trunk-MacOSX/solr/build/solr-core/test/J0/./org.apache.solr.cloud.BasicDistributedZkTest-1359979901483/jetty4 forceNew:false
[junit4:junit4]   2> 19175 T791 oasc.CachingDirectoryFactory.close Releasing directory:/Users/jenkins/jenkins-slave/workspace/Lucene-Solr-trunk-MacOSX/solr/build/solr-core/test/J0/./org.apache.solr.cloud.BasicDistributedZkTest-1359979901483/jetty4
[junit4:junit4]   2> 19175 T791 oasc.SolrCore.getNewIndexDir New index directory detected: old=null new=./org.apache.solr.cloud.BasicDistributedZkTest-1359979901483/jetty4/index/
[junit4:junit4]   2> 19176 T791 oasc.SolrCore.initIndex WARNING [collection1] Solr index directory './org.apache.solr.cloud.BasicDistributedZkTest-1359979901483/jetty4/index' doesn't exist. Creating new index...
[junit4:junit4]   2> 19177 T791 oasc.CachingDirectoryFactory.get return new directory for /Users/jenkins/jenkins-slave/workspace/Lucene-Solr-trunk-MacOSX/solr/build/solr-core/test/J0/./org.apache.solr.cloud.BasicDistributedZkTest-1359979901483/jetty4/index forceNew:false
[junit4:junit4]   2> 19182 T791 oasc.SolrDeletionPolicy.onCommit SolrDeletionPolicy.onCommit: commits:num=1
[junit4:junit4]   2> 		commit{dir=RateLimitedDirectoryWrapper(NRTCachingDirectory(org.apache.lucene.store.NIOFSDirectory@/Users/jenkins/jenkins-slave/workspace/Lucene-Solr-trunk-MacOSX/solr/build/solr-core/test/J0/org.apache.solr.cloud.BasicDistributedZkTest-1359979901483/jetty4/index lockFactory=org.apache.lucene.store.NativeFSLockFactory@a2b14bd; maxCacheMB=48.0 maxMergeSizeMB=4.0)),segFN=segments_1,generation=1,filenames=[segments_1]
[junit4:junit4]   2> 19183 T791 oasc.SolrDeletionPolicy.updateCommits newest commit = 1[segments_1]
[junit4:junit4]   2> 19184 T791 oasc.CachingDirectoryFactory.close Releasing directory:/Users/jenkins/jenkins-slave/workspace/Lucene-Solr-trunk-MacOSX/solr/build/solr-core/test/J0/./org.apache.solr.cloud.BasicDistributedZkTest-1359979901483/jetty4/index
[junit4:junit4]   2> 19185 T791 oasc.SolrCore.initWriters created xml: solr.XMLResponseWriter
[junit4:junit4]   2> 19188 T791 oasup.UpdateRequestProcessorChain.init inserting DistributedUpdateProcessorFactory into updateRequestProcessorChain "dedupe"
[junit4:junit4]   2> 19188 T791 oasup.UpdateRequestProcessorChain.init inserting DistributedUpdateProcessorFactory into updateRequestProcessorChain "dedupe-allfields"
[junit4:junit4]   2> 19189 T791 oasup.UpdateRequestProcessorChain.init inserting DistributedUpdateProcessorFactory into updateRequestProcessorChain "stored_sig"
[junit4:junit4]   2> 19189 T791 oasup.UpdateRequestProcessorChain.init inserting DistributedUpdateProcessorFactory into updateRequestProcessorChain "uniq-fields"
[junit4:junit4]   2> 19190 T791 oasup.UpdateRequestProcessorChain.init inserting DistributedUpdateProcessorFactory into updateRequestProcessorChain "distrib-dup-test-chain-implicit"
[junit4:junit4]   2> 19191 T791 oasc.RequestHandlers.initHandlersFromConfig adding lazy requestHandler: solr.ReplicationHandler
[junit4:junit4]   2> 19191 T791 oasc.RequestHandlers.initHandlersFromConfig created /replication: solr.ReplicationHandler
[junit4:junit4]   2> 19192 T791 oasc.RequestHandlers.initHandlersFromConfig created standard: solr.StandardRequestHandler
[junit4:junit4]   2> 19192 T791 oasc.RequestHandlers.initHandlersFromConfig created /get: solr.RealTimeGetHandler
[junit4:junit4]   2> 19193 T791 oasc.RequestHandlers.initHandlersFromConfig created dismax: solr.SearchHandler
[junit4:junit4]   2> 19194 T791 oasc.RequestHandlers.initHandlersFromConfig created mock: org.apache.solr.core.MockQuerySenderListenerReqHandler
[junit4:junit4]   2> 19195 T791 oasc.RequestHandlers.initHandlersFromConfig created /admin/: org.apache.solr.handler.admin.AdminHandlers
[junit4:junit4]   2> 19195 T791 oasc.RequestHandlers.initHandlersFromConfig created defaults: solr.StandardRequestHandler
[junit4:junit4]   2> 19195 T791 oasc.RequestHandlers.initHandlersFromConfig adding lazy requestHandler: solr.StandardRequestHandler
[junit4:junit4]   2> 19196 T791 oasc.RequestHandlers.initHandlersFromConfig created lazy: solr.StandardRequestHandler
[junit4:junit4]   2> 19197 T791 oasc.RequestHandlers.initHandlersFromConfig created /update: solr.UpdateRequestHandler
[junit4:junit4]   2> 19198 T791 oasc.RequestHandlers.initHandlersFromConfig created /terms: org.apache.solr.handler.component.SearchHandler
[junit4:junit4]   2> 19199 T791 oasc.RequestHandlers.initHandlersFromConfig created spellCheckCompRH: org.apache.solr.handler.component.SearchHandler
[junit4:junit4]   2> 19200 T791 oasc.RequestHandlers.initHandlersFromConfig created spellCheckCompRH_Direct: org.apache.solr.handler.component.SearchHandler
[junit4:junit4]   2> 19201 T791 oasc.RequestHandlers.initHandlersFromConfig created spellCheckWithWordbreak: org.apache.solr.handler.component.SearchHandler
[junit4:junit4]   2> 19201 T791 oasc.RequestHandlers.initHandlersFromConfig created spellCheckWithWordbreak_Direct: org.apache.solr.handler.component.SearchHandler
[junit4:junit4]   2> 19202 T791 oasc.RequestHandlers.initHandlersFromConfig created spellCheckCompRH1: org.apache.solr.handler.component.SearchHandler
[junit4:junit4]   2> 19203 T791 oasc.RequestHandlers.initHandlersFromConfig created mltrh: org.apache.solr.handler.component.SearchHandler
[junit4:junit4]   2> 19203 T791 oasc.RequestHandlers.initHandlersFromConfig created tvrh: org.apache.solr.handler.component.SearchHandler
[junit4:junit4]   2> 19204 T791 oasc.RequestHandlers.initHandlersFromConfig created /mlt: solr.MoreLikeThisHandler
[junit4:junit4]   2> 19205 T791 oasc.RequestHandlers.initHandlersFromConfig created /debug/dump: solr.DumpRequestHandler
[junit4:junit4]   2> 19212 T791 oashl.XMLLoader.init xsltCacheLifetimeSeconds=60
[junit4:junit4]   2> 19215 T791 oasc.SolrCore.initDeprecatedSupport WARNING solrconfig.xml uses deprecated <admin/gettableFiles>, Please update your config to use the ShowFileRequestHandler.
[junit4:junit4]   2> 19217 T791 oasc.SolrCore.initDeprecatedSupport WARNING adding ShowFileRequestHandler with hidden files: [SCHEMA.XML, OLD_SYNONYMS.TXT, STOPWORDS.TXT, PROTWORDS.TXT, OPEN-EXCHANGE-RATES.JSON, SYNONYMS.TXT, CURRENCY.XML, MAPPING-ISOLATIN1ACCENT.TXT]
[junit4:junit4]   2> 19219 T791 oasc.CachingDirectoryFactory.close Releasing directory:/Users/jenkins/jenkins-slave/workspace/Lucene-Solr-trunk-MacOSX/solr/build/solr-core/test/J0/./org.apache.solr.cloud.BasicDistributedZkTest-1359979901483/jetty4
[junit4:junit4]   2> 19220 T791 oass.SolrIndexSearcher.<init> Opening Searcher@ad54c5d main
[junit4:junit4]   2> 19221 T791 oasu.CommitTracker.<init> Hard AutoCommit: disabled
[junit4:junit4]   2> 19222 T791 oasu.CommitTracker.<init> Soft AutoCommit: disabled
[junit4:junit4]   2> 19222 T791 oashc.SpellCheckComponent.inform Initializing spell checkers
[junit4:junit4]   2> 19236 T791 oass.DirectSolrSpellChecker.init init: {name=direct,classname=DirectSolrSpellChecker,field=lowerfilt,minQueryLength=3}
[junit4:junit4]   2> 19279 T792 oasc.SolrCore.registerSearcher [collection1] Registered new searcher Searcher@ad54c5d main{StandardDirectoryReader(segments_1:1)}
[junit4:junit4]   2> 19300 T791 oasc.ZkController.publish publishing core=collection1 state=down
[junit4:junit4]   2> 19301 T791 oasc.ZkController.publish numShards not found on descriptor - reading it from system property
[junit4:junit4]   2> 19694 T726 oascc.ZkStateReader.updateClusterState Updating cloud state from ZooKeeper... 
[junit4:junit4]   2> 19695 T726 oasc.Overseer$ClusterStateUpdater.updateState Update state numShards=2 message={
[junit4:junit4]   2> 	  "operation":"state",
[junit4:junit4]   2> 	  "numShards":"2",
[junit4:junit4]   2> 	  "shard":null,
[junit4:junit4]   2> 	  "roles":null,
[junit4:junit4]   2> 	  "state":"down",
[junit4:junit4]   2> 	  "core":"collection1",
[junit4:junit4]   2> 	  "collection":"collection1",
[junit4:junit4]   2> 	  "node_name":"127.0.0.1:49325_",
[junit4:junit4]   2> 	  "base_url":"http://127.0.0.1:49325"}
[junit4:junit4]   2> 19696 T726 oasc.Overseer$ClusterStateUpdater.updateState Collection already exists with numShards=2
[junit4:junit4]   2> 19696 T726 oasc.Overseer$ClusterStateUpdater.updateState Assigning new node to shard shard=shard2
[junit4:junit4]   2> 19705 T725 oascc.ZkStateReader$2.process A cluster state change: WatchedEvent state:SyncConnected type:NodeDataChanged path:/clusterstate.json, has occurred - updating... (live nodes size: 5)
[junit4:junit4]   2> 19705 T731 oascc.ZkStateReader$2.process A cluster state change: WatchedEvent state:SyncConnected type:NodeDataChanged path:/clusterstate.json, has occurred - updating... (live nodes size: 5)
[junit4:junit4]   2> 19705 T790 oascc.ZkStateReader$2.process A cluster state change: WatchedEvent state:SyncConnected type:NodeDataChanged path:/clusterstate.json, has occurred - updating... (live nodes size: 5)
[junit4:junit4]   2> 19711 T774 oascc.ZkStateReader$2.process A cluster state change: WatchedEvent state:SyncConnected type:NodeDataChanged path:/clusterstate.json, has occurred - updating... (live nodes size: 5)
[junit4:junit4]   2> 19714 T759 oascc.ZkStateReader$2.process A cluster state change: WatchedEvent state:SyncConnected type:NodeDataChanged path:/clusterstate.json, has occurred - updating... (live nodes size: 5)
[junit4:junit4]   2> 19718 T744 oascc.ZkStateReader$2.process A cluster state change: WatchedEvent state:SyncConnected type:NodeDataChanged path:/clusterstate.json, has occurred - updating... (live nodes size: 5)
[junit4:junit4]   2> 20304 T791 oasc.CoreContainer.registerCore registering core: collection1
[junit4:junit4]   2> 20305 T791 oasc.ZkController.register Register replica - core:collection1 address:http://127.0.0.1:49325 collection:collection1 shard:shard2
[junit4:junit4]   2> 20311 T791 oasc.ZkController.register We are http://127.0.0.1:49325/collection1/ and leader is http://127.0.0.1:49318/collection1/
[junit4:junit4]   2> 20312 T791 oasc.ZkController.register No LogReplay needed for core=collection1 baseURL=http://127.0.0.1:49325
[junit4:junit4]   2> 20312 T791 oasc.ZkController.checkRecovery Core needs to recover:collection1
[junit4:junit4]   2> 20312 T791 oasu.DefaultSolrCoreState.doRecovery Running recovery - first canceling any ongoing recovery
[junit4:junit4]   2> ASYNC  NEW_CORE C50 name=collection1 org.apache.solr.core.SolrCore@9c7edb6 url=http://127.0.0.1:49325/collection1 node=127.0.0.1:49325_ C50_STATE=coll:collection1 core:collection1 props:{shard=null, roles=null, state=down, core=collection1, collection=collection1, node_name=127.0.0.1:49325_, base_url=http://127.0.0.1:49325}
[junit4:junit4]   2> 20313 T793 C50 P49325 oasc.RecoveryStrategy.run Starting recovery process.  core=collection1 recoveringAfterStartup=true
[junit4:junit4]   2> 20313 T793 C50 P49325 oasc.RecoveryStrategy.doRecovery ###### startupVersions=[]
[junit4:junit4]   2> 20313 T793 C50 P49325 oasc.ZkController.publish publishing core=collection1 state=recovering
[junit4:junit4]   2> 20313 T793 C50 P49325 oasc.ZkController.publish numShards not found on descriptor - reading it from system property
[junit4:junit4]   2> 20315 T791 oascc.ZkStateReader.updateClusterState Updating cloud state from ZooKeeper... 
[junit4:junit4]   2> 20317 T793 C50 P49325 oascsi.HttpClientUtil.createClient Creating new http client, config:maxConnections=128&maxConnectionsPerHost=32&followRedirects=false
[junit4:junit4]   2> 20317 T703 oass.SolrDispatchFilter.init user.dir=/Users/jenkins/jenkins-slave/workspace/Lucene-Solr-trunk-MacOSX/solr/build/solr-core/test/J0
[junit4:junit4]   2> 20329 T703 oass.SolrDispatchFilter.init SolrDispatchFilter.init() done
[junit4:junit4]   2> 20329 T703 oascsi.HttpClientUtil.createClient Creating new http client, config:maxConnections=128&maxConnectionsPerHost=32&followRedirects=false
[junit4:junit4]   2> 20335 T703 oascc.ZkStateReader.updateClusterState Updating cloud state from ZooKeeper... 
[junit4:junit4]   2> 20336 T703 oasc.AbstractDistribZkTestBase.waitForRecoveriesToFinish Wait for recoveries to finish - collection: collection1 failOnTimeout:true timeout (sec):230
[junit4:junit4]   2> 20337 T703 oascc.ZkStateReader.updateClusterState Updating cloud state from ZooKeeper... 
[junit4:junit4]   2>  C49_STATE=coll:collection1 core:collection1 props:{shard=shard1, roles=null, state=recovering, core=collection1, collection=collection1, node_name=127.0.0.1:49321_, base_url=http://127.0.0.1:49321}
[junit4:junit4]   2> 20431 T777 C49 P49321 oasc.RecoveryStrategy.doRecovery Attempting to PeerSync from http://127.0.0.1:49315/collection1/ core=collection1 - recoveringAfterStartup=true
[junit4:junit4]   2> 20446 T777 C49 P49321 oascsi.HttpClientUtil.createClient Creating new http client, config:maxConnectionsPerHost=20&maxConnections=10000&connTimeout=30000&socketTimeout=30000&retry=false
[junit4:junit4]   2> 20469 T777 C49 P49321 oasu.PeerSync.sync PeerSync: core=collection1 url=http://127.0.0.1:49321 START replicas=[http://127.0.0.1:49315/collection1/] nUpdates=100
[junit4:junit4]   2> 20470 T777 C49 P49321 oasu.PeerSync.sync WARNING no frame of reference to tell of we've missed updates
[junit4:junit4]   2> 20471 T777 C49 P49321 oasc.RecoveryStrategy.doRecovery PeerSync Recovery was not successful - trying replication. core=collection1
[junit4:junit4]   2> 20471 T777 C49 P49321 oasc.RecoveryStrategy.doRecovery Starting Replication Recovery. core=collection1
[junit4:junit4]   2> 20472 T777 C49 P49321 oasc.RecoveryStrategy.doRecovery Begin buffering updates. core=collection1
[junit4:junit4]   2> 20472 T777 C49 P49321 oasu.UpdateLog.bufferUpdates Starting to buffer updates. FSUpdateLog{state=ACTIVE, tlog=null}
[junit4:junit4]   2> 20472 T777 C49 P49321 oasc.RecoveryStrategy.replicate Attempting to replicate from http://127.0.0.1:49315/collection1/. core=collection1
[junit4:junit4]   2> 20473 T777 C49 P49321 oascsi.HttpClientUtil.createClient Creating new http client, config:maxConnections=128&maxConnectionsPerHost=32&followRedirects=false
[junit4:junit4]   2> ASYNC  NEW_CORE C51 name=collection1 org.apache.solr.core.SolrCore@762c92c1 url=http://127.0.0.1:49315/collection1 node=127.0.0.1:49315_ C51_STATE=coll:collection1 core:collection1 props:{shard=shard1, roles=null, state=active, core=collection1, collection=collection1, node_name=127.0.0.1:49315_, base_url=http://127.0.0.1:49315, leader=true}
[junit4:junit4]   2> 20511 T740 C51 P49315 REQ /get {getVersions=100&distrib=false&wt=javabin&qt=/get&version=2} status=0 QTime=0 
[junit4:junit4]   2> 20562 T739 C51 P49315 oasu.DirectUpdateHandler2.commit start commit{,optimize=false,openSearcher=false,waitSearcher=true,expungeDeletes=false,softCommit=false}
[junit4:junit4]   2> 20564 T739 C51 P49315 oasc.CachingDirectoryFactory.close Releasing directory:/Users/jenkins/jenkins-slave/workspace/Lucene-Solr-trunk-MacOSX/solr/build/solr-core/test/J0/./org.apache.solr.cloud.BasicDistributedZkTest-1359979901483/jetty1
[junit4:junit4]   2> 20568 T739 C51 P49315 oasc.SolrDeletionPolicy.onInit SolrDeletionPolicy.onInit: commits:num=1
[junit4:junit4]   2> 		commit{dir=RateLimitedDirectoryWrapper(NRTCachingDirectory(org.apache.lucene.store.NIOFSDirectory@/Users/jenkins/jenkins-slave/workspace/Lucene-Solr-trunk-MacOSX/solr/build/solr-core/test/J0/org.apache.solr.cloud.BasicDistributedZkTest-1359979901483/jetty1/index lockFactory=org.apache.lucene.store.NativeFSLockFactory@3e40cc10; maxCacheMB=48.0 maxMergeSizeMB=4.0)),segFN=segments_1,generation=1,filenames=[segments_1]
[junit4:junit4]   2> 20569 T739 C51 P49315 oasc.SolrDeletionPolicy.updateCommits newest commit = 1[segments_1]
[junit4:junit4]   2> 20574 T739 C51 P49315 oasc.SolrDeletionPolicy.onCommit SolrDeletionPolicy.onCommit: commits:num=2
[junit4:junit4]   2> 		commit{dir=RateLimitedDirectoryWrapper(NRTCachingDirectory(org.apache.lucene.store.NIOFSDirectory@/Users/jenkins/jenkins-slave/workspace/Lucene-Solr-trunk-MacOSX/solr/build/solr-core/test/J0/org.apache.solr.cloud.BasicDistributedZkTest-1359979901483/jetty1/index lockFactory=org.apache.lucene.store.NativeFSLockFactory@3e40cc10; maxCacheMB=48.0 maxMergeSizeMB=4.0)),segFN=segments_1,generation=1,filenames=[segments_1]
[junit4:junit4]   2> 		commit{dir=RateLimitedDirectoryWrapper(NRTCachingDirectory(org.apache.lucene.store.NIOFSDirectory@/Users/jenkins/jenkins-slave/workspace/Lucene-Solr-trunk-MacOSX/solr/build/solr-core/test/J0/org.apache.solr.cloud.BasicDistributedZkTest-1359979901483/jetty1/index lockFactory=org.apache.lucene.store.NativeFSLockFactory@3e40cc10; maxCacheMB=48.0 maxMergeSizeMB=4.0)),segFN=segments_2,generation=2,filenames=[segments_2]
[junit4:junit4]   2> 20574 T739 C51 P49315 oasc.SolrDeletionPolicy.updateCommits newest commit = 2[segments_2]
[junit4:junit4]   2> 20576 T739 C51 P49315 oasc.CachingDirectoryFactory.close Releasing directory:/Users/jenkins/jenkins-slave/workspace/Lucene-Solr-trunk-MacOSX/solr/build/solr-core/test/J0/./org.apache.solr.cloud.BasicDistributedZkTest-1359979901483/jetty1
[junit4:junit4]   2> 20576 T739 C51 P49315 oass.SolrIndexSearcher.<init> Opening Searcher@59d04f4c realtime
[junit4:junit4]   2> 20576 T739 C51 P49315 oasu.DirectUpdateHandler2.commit end_commit_flush
[junit4:junit4]   2> 20577 T739 C51 P49315 /update {waitSearcher=true&openSearcher=false&commit=true&wt=javabin&commit_end_point=true&version=2&softCommit=false} {commit=} 0 67
[junit4:junit4]   2> 20579 T777 C49 P49321 oash.ReplicationHandler.inform Commits will be reserved for  10000
[junit4:junit4]   2> 20579 T777 C49 P49321 oash.SnapPuller.<init>  No value set for 'pollInterval'. Timer Task not started.
[junit4:junit4]   2> 20585 T737 C51 P49315 oash.ReplicationHandler.inform Commits will be reserved for  10000
[junit4:junit4]   2> 20586 T737 C51 P49315 REQ /replication {command=indexversion&qt=/replication&wt=javabin&version=2} status=0 QTime=2 
[junit4:junit4]   2> 20587 T777 C49 P49321 oash.SnapPuller.fetchLatestIndex Master's generation: 2
[junit4:junit4]   2> 20587 T777 C49 P49321 oash.SnapPuller.fetchLatestIndex Slave's generation: 1
[junit4:junit4]   2> 20587 T777 C49 P49321 oash.SnapPuller.fetchLatestIndex Starting replication process
[junit4:junit4]   2> 20591 T738 C51 P49315 oasc.CachingDirectoryFactory.close Releasing directory:/Users/jenkins/jenkins-slave/workspace/Lucene-Solr-trunk-MacOSX/solr/build/solr-core/test/J0/./org.apache.solr.cloud.BasicDistributedZkTest-1359979901483/jetty1
[junit4:junit4]   2> 20591 T738 C51 P49315 oasc.CachingDirectoryFactory.close Releasing directory:/Users/jenkins/jenkins-slave/workspace/Lucene-Solr-trunk-MacOSX/solr/build/solr-core/test/J0/./org.apache.solr.cloud.BasicDistributedZkTest-1359979901483/jetty1/index
[junit4:junit4]   2> 20592 T738 C51 P49315 REQ /replication {command=filelist&qt=/replication&wt=javabin&generation=2&version=2} status=0 QTime=2 
[junit4:junit4]   2> 20592 T777 C49 P49321 oash.SnapPuller.fetchLatestIndex Number of files in latest index in master: 1
[junit4:junit4]   2> 20593 T777 C49 P49321 oasc.CachingDirectoryFactory.get return new directory for /Users/jenkins/jenkins-slave/workspace/Lucene-Solr-trunk-MacOSX/solr/build/solr-core/test/J0/./org.apache.solr.cloud.BasicDistributedZkTest-1359979901483/jetty3/index.20130204061202061 forceNew:false
[junit4:junit4]   2> 20594 T777 C49 P49321 oasc.CachingDirectoryFactory.close Releasing directory:/Users/jenkins/jenkins-slave/workspace/Lucene-Solr-trunk-MacOSX/solr/build/solr-core/test/J0/./org.apache.solr.cloud.BasicDistributedZkTest-1359979901483/jetty3
[junit4:junit4]   2> 20599 T777 C49 P49321 oash.SnapPuller.fetchLatestIndex Starting download to RateLimitedDirectoryWrapper(NRTCachingDirectory(org.apache.lucene.store.NIOFSDirectory@/Users/jenkins/jenkins-slave/workspace/Lucene-Solr-trunk-MacOSX/solr/build/solr-core/test/J0/org.apache.solr.cloud.BasicDistributedZkTest-1359979901483/jetty3/index.20130204061202061 lockFactory=org.apache.lucene.store.NativeFSLockFactory@4886521b; maxCacheMB=48.0 maxMergeSizeMB=4.0)) fullCopy=true
[junit4:junit4]   2> 20602 T736 C51 P49315 REQ /replication {file=segments_2&command=filecontent&checksum=true&wt=filestream&qt=/replication&generation=2} status=0 QTime=0 
[junit4:junit4]   2> 20607 T777 C49 P49321 oasc.CachingDirectoryFactory.close Releasing directory:/Users/jenkins/jenkins-slave/workspace/Lucene-Solr-trunk-MacOSX/solr/build/solr-core/test/J0/./org.apache.solr.cloud.BasicDistributedZkTest-1359979901483/jetty3/index
[junit4:junit4]   2> 20609 T777 C49 P49321 oash.SnapPuller.fetchLatestIndex Total time taken for download : 0 secs
[junit4:junit4]   2> 20611 T777 C49 P49321 oash.SnapPuller.modifyIndexProps New index installed. Updating index properties... index=index.20130204061202061
[junit4:junit4]   2> 20620 T777 C49 P49321 oasc.CachingDirectoryFactory.close Releasing directory:/Users/jenkins/jenkins-slave/workspace/Lucene-Solr-trunk-MacOSX/solr/build/solr-core/test/J0/./org.apache.solr.cloud.BasicDistributedZkTest-1359979901483/jetty3
[junit4:junit4]   2> 20622 T777 C49 P49321 oasc.CachingDirectoryFactory.close Releasing directory:/Users/jenkins/jenkins-slave/workspace/Lucene-Solr-trunk-MacOSX/solr/build/solr-core/test/J0/./org.apache.solr.cloud.BasicDistributedZkTest-1359979901483/jetty3
[junit4:junit4]   2> 20623 T777 C49 P49321 oasc.SolrCore.getNewIndexDir New index directory detected: old=./org.apache.solr.cloud.BasicDistributedZkTest-1359979901483/jetty3/index/ new=./org.apache.solr.cloud.BasicDistributedZkTest-1359979901483/jetty3/index.20130204061202061
[junit4:junit4]   2> 20627 T777 C49 P49321 oasc.SolrDeletionPolicy.onInit SolrDeletionPolicy.onInit: commits:num=1
[junit4:junit4]   2> 		commit{dir=RateLimitedDirectoryWrapper(NRTCachingDirectory(org.apache.lucene.store.NIOFSDirectory@/Users/jenkins/jenkins-slave/workspace/Lucene-Solr-trunk-MacOSX/solr/build/solr-core/test/J0/org.apache.solr.cloud.BasicDistributedZkTest-1359979901483/jetty3/index.20130204061202061 lockFactory=org.apache.lucene.store.NativeFSLockFactory@4886521b; maxCacheMB=48.0 maxMergeSizeMB=4.0)),segFN=segments_2,generation=2,filenames=[segments_2]
[junit4:junit4]   2> 20628 T777 C49 P49321 oasc.SolrDeletionPolicy.updateCommits newest commit = 2[segments_2]
[junit4:junit4]   2> 20630 T777 C49 P49321 oasc.CachingDirectoryFactory.close Releasing directory:/Users/jenkins/jenkins-slave/workspace/Lucene-Solr-trunk-MacOSX/solr/build/solr-core/test/J0/./org.apache.solr.cloud.BasicDistributedZkTest-1359979901483/jetty3
[junit4:junit4]   2> 20631 T777 C49 P49321 oasu.DefaultSolrCoreState.newIndexWriter Creating new IndexWriter...
[junit4:junit4]   2> 20631 T777 C49 P49321 oasu.DefaultSolrCoreState.newIndexWriter Waiting until IndexWriter is unused... core=collection1
[junit4:junit4]   2> 20631 T777 C49 P49321 oasu.DefaultSolrCoreState.newIndexWriter Rollback old IndexWriter... core=collection1
[junit4:junit4]   2> 20633 T777 C49 P49321 oasc.CachingDirectoryFactory.close Releasing directory:/Users/jenkins/jenkins-slave/workspace/Lucene-Solr-trunk-MacOSX/solr/build/solr-core/test/J0/./org.apache.solr.cloud.BasicDistributedZkTest-1359979901483/jetty3/index.20130204061202061
[junit4:junit4]   2> 20633 T777 C49 P49321 oasc.CachingDirectoryFactory.close Releasing directory:/Users/jenkins/jenkins-slave/workspace/Lucene-Solr-trunk-MacOSX/solr/build/solr-core/test/J0/./org.apache.solr.cloud.BasicDistributedZkTest-1359979901483/jetty3
[junit4:junit4]   2> 20639 T777 C49 P49321 oasc.SolrDeletionPolicy.onInit SolrDeletionPolicy.onInit: commits:num=1
[junit4:junit4]   2> 		commit{dir=RateLimitedDirectoryWrapper(NRTCachingDirectory(org.apache.lucene.store.NIOFSDirectory@/Users/jenkins/jenkins-slave/workspace/Lucene-Solr-trunk-MacOSX/solr/build/solr-core/test/J0/org.apache.solr.cloud.BasicDistributedZkTest-1359979901483/jetty3/index.20130204061202061 lockFactory=org.apache.lucene.store.NativeFSLockFactory@4886521b; maxCacheMB=48.0 maxMergeSizeMB=4.0)),segFN=segments_2,generation=2,filenames=[segments_2]
[junit4:junit4]   2> 20640 T777 C49 P49321 oasc.SolrDeletionPolicy.updateCommits newest commit = 2[segments_2]
[junit4:junit4]   2> 20640 T777 C49 P49321 oasu.DefaultSolrCoreState.newIndexWriter New IndexWriter is ready to be used.
[junit4:junit4]   2> 20641 T777 C49 P49321 oasc.CachingDirectoryFactory.close Releasing directory:/Users/jenkins/jenkins-slave/workspace/Lucene-Solr-trunk-MacOSX/solr/build/solr-core/test/J0/./org.apache.solr.cloud.BasicDistributedZkTest-1359979901483/jetty3
[junit4:junit4]   2> 20641 T777 C49 P49321 oass.SolrIndexSearcher.<init> Opening Searcher@62b585b9 main
[junit4:junit4]   2> 20644 T776 oasc.SolrCore.registerSearcher [collection1] Registered new searcher Searcher@62b585b9 main{StandardDirectoryReader(segments_2:1:nrt)}
[junit4:junit4]   2> 20645 T776 oasc.CachingDirectoryFactory.close Releasing directory:/Users/jenkins/jenkins-slave/workspace/Lucene-Solr-trunk-MacOSX/solr/build/solr-core/test/J0/./org.apache.solr.cloud.BasicDistributedZkTest-1359979901483/jetty3/index
[junit4:junit4]   2> 20645 T777 C49 P49321 oasu.DirectUpdateHandler2.commit start commit{,optimize=false,openSearcher=false,waitSearcher=false,expungeDeletes=false,softCommit=false}
[junit4:junit4]   2> 20649 T777 C49 P49321 oasc.SolrDeletionPolicy.onCommit SolrDeletionPolicy.onCommit: commits:num=2
[junit4:junit4]   2> 		commit{dir=RateLimitedDirectoryWrapper(NRTCachingDirectory(org.apache.lucene.store.NIOFSDirectory@/Users/jenkins/jenkins-slave/workspace/Lucene-Solr-trunk-MacOSX/solr/build/solr-core/test/J0/org.apache.solr.cloud.BasicDistributedZkTest-1359979901483/jetty3/index.20130204061202061 lockFactory=org.apache.lucene.store.NativeFSLockFactory@4886521b; maxCacheMB=48.0 maxMergeSizeMB=4.0)),segFN=segments_2,generation=2,filenames=[segments_2]
[junit4:junit4]   2> 		commit{dir=RateLimitedDirectoryWrapper(NRTCachingDirectory(org.apache.lucene.store.NIOFSDirectory@/Users/jenkins/jenkins-slave/workspace/Lucene-Solr-trunk-MacOSX/solr/build/solr-core/test/J0/org.apache.solr.cloud.BasicDistributedZkTest-1359979901483/jetty3/index.20130204061202061 lockFactory=org.apache.lucene.store.NativeFSLockFactory@4886521b; maxCacheMB=48.0 maxMergeSizeMB=4.0)),segFN=segments_3,generation=3,filenames=[segments_3]
[junit4:junit4]   2> 20649 T777 C49 P49321 oasc.SolrDeletionPolicy.updateCommits newest commit = 3[segments_3]
[junit4:junit4]   2> 20650 T777 C49 P49321 oasc.CachingDirectoryFactory.close Releasing directory:/Users/jenkins/jenkins-slave/workspace/Lucene-Solr-trunk-MacOSX/solr/build/solr-core/test/J0/./org.apache.solr.cloud.BasicDistributedZkTest-1359979901483/jetty3
[junit4:junit4]   2> 20651 T777 C49 P49321 oasu.DirectUpdateHandler2.commit end_commit_flush
[junit4:junit4]   2> 20651 T777 C49 P49321 oasc.CachingDirectoryFactory.close Releasing directory:/Users/jenkins/jenkins-slave/workspace/Lucene-Solr-trunk-MacOSX/solr/build/solr-core/test/J0/./org.apache.solr.cloud.BasicDistributedZkTest-1359979901483/jetty3/index.20130204061202061
[junit4:junit4]   2> 20651 T777 C49 P49321 oasc.CachingDirectoryFactory.close Releasing directory:/Users/jenkins/jenkins-slave/workspace/Lucene-Solr-trunk-MacOSX/solr/build/solr-core/test/J0/./org.apache.solr.cloud.BasicDistributedZkTest-1359979901483/jetty3/index
[junit4:junit4]   2> 20652 T777 C49 P49321 oasc.RecoveryStrategy.replay No replay needed. core=collection1
[junit4:junit4]   2> 20652 T777 C49 P49321 oasc.RecoveryStrategy.doRecovery Replication Recovery was successful - registering as Active. core=collection1
[junit4:junit4]   2> 20652 T777 C49 P49321 oasc.ZkController.publish publishing core=collection1 state=active
[junit4:junit4]   2> 20653 T777 C49 P49321 oasc.ZkController.publish numShards not found on descriptor - reading it from system property
[junit4:junit4]   2> 20660 T777 C49 P49321 oasc.RecoveryStrategy.doRecovery Finished recovery process. core=collection1
[junit4:junit4]   2> 21248 T726 oascc.ZkStateReader.updateClusterState Updating cloud state from ZooKeeper... 
[junit4:junit4]   2> 21249 T726 oasc.Overseer$ClusterStateUpdater.updateState Update state numShards=2 message={
[junit4:junit4]   2> 	  "operation":"state",
[junit4:junit4]   2> 	  "numShards":"2",
[junit4:junit4]   2> 	  "shard":"shard2",
[junit4:junit4]   2> 	  "roles":null,
[junit4:junit4]   2> 	  "state":"recovering",
[junit4:junit4]   2> 	  "core":"collection1",
[junit4:junit4]   2> 	  "collection":"collection1",
[junit4:junit4]   2> 	  "node_name":"127.0.0.1:49325_",
[junit4:junit4]   2> 	  "base_url":"http://127.0.0.1:49325"}
[junit4:junit4]   2> 21259 T726 oasc.Overseer$ClusterStateUpdater.updateState Update state numShards=2 message={
[junit4:junit4]   2> 	  "operation":"state",
[junit4:junit4]   2> 	  "numShards":"2",
[junit4:junit4]   2> 	  "shard":"shard1",
[junit4:junit4]   2> 	  "roles":null,
[junit4:junit4]   2> 	  "state":"active",
[junit4:junit4]   2> 	  "core":"collection1",
[junit4:junit4]   2> 	  "collection":"collection1",
[junit4:junit4]   2> 	  "node_name":"127.0.0.1:49321_",
[junit4:junit4]   2> 	  "base_url":"http://127.0.0.1:49321"}
[junit4:junit4]   2> 21269 T731 oascc.ZkStateReader$2.process A cluster state change: WatchedEvent state:SyncConnected type:NodeDataChanged path:/clusterstate.json, has occurred - updating... (live nodes size: 5)
[junit4:junit4]   2> 21269 T790 oascc.ZkStateReader$2.process A cluster state change: WatchedEvent state:SyncConnected type:NodeDataChanged path:/clusterstate.json, has occurred - updating... (live nodes size: 5)
[junit4:junit4]   2> 21279 T774 oascc.ZkStateReader$2.process A cluster state change: WatchedEvent state:SyncConnected type:NodeDataChanged path:/clusterstate.json, has occurred - updating... (live nodes size: 5)
[junit4:junit4]   2> 21282 T759 oascc.ZkStateReader$2.process A cluster state change: WatchedEvent state:SyncConnected type:NodeDataChanged path:/clusterstate.json, has occurred - updating... (live nodes size: 5)
[junit4:junit4]   2> 21285 T744 oascc.ZkStateReader$2.process A cluster state change: WatchedEvent state:SyncConnected type:NodeDataChanged path:/clusterstate.json, has occurred - updating... (live nodes size: 5)
[junit4:junit4]   2> 21288 T725 oascc.ZkStateReader$2.process A cluster state change: WatchedEvent state:SyncConnected type:NodeDataChanged path:/clusterstate.json, has occurred - updating... (live nodes size: 5)
[junit4:junit4]   2> 21341 T703 oascc.ZkStateReader.updateClusterState Updating cloud state from ZooKeeper... 
[junit4:junit4]   2> 22354 T703 oascc.ZkStateReader.updateClusterState Updating cloud state from ZooKeeper... 
[junit4:junit4]   2>  C50_STATE=coll:collection1 core:collection1 props:{shard=shard2, roles=null, state=recovering, core=collection1, collection=collection1, node_name=127.0.0.1:49325_, base_url=http://127.0.0.1:49325}
[junit4:junit4]   2> 23337 T793 C50 P49325 oasc.RecoveryStrategy.doRecovery Attempting to PeerSync from http://127.0.0.1:49318/collection1/ core=collection1 - recoveringAfterStartup=true
[junit4:junit4]   2> 23337 T793 C50 P49325 oasu.PeerSync.sync PeerSync: core=collection1 url=http://127.0.0.1:49325 START replicas=[http://127.0.0.1:49318/collection1/] nUpdates=100
[junit4:junit4]   2> 23338 T793 C50 P49325 oasu.PeerSync.sync WARNING no frame of reference to tell of we've missed updates
[junit4:junit4]   2> 23338 T793 C50 P49325 oasc.RecoveryStrategy.doRecovery PeerSync Recovery was not successful - trying replication. core=collection1
[junit4:junit4]   2> 23338 T793 C50 P49325 oasc.RecoveryStrategy.doRecovery Starting Replication Recovery. core=collection1
[junit4:junit4]   2> 23338 T793 C50 P49325 oasc.RecoveryStrategy.doRecovery Begin buffering updates. core=collection1
[junit4:junit4]   2> 23338 T793 C50 P49325 oasu.UpdateLog.bufferUpdates Starting to buffer updates. FSUpdateLog{state=ACTIVE, tlog=null}
[junit4:junit4]   2> 23338 T793 C50 P49325 oasc.RecoveryStrategy.replicate Attempting to replicate from http://127.0.0.1:49318/collection1/. core=collection1
[junit4:junit4]   2> 23339 T793 C50 P49325 oascsi.HttpClientUtil.createClient Creating new http client, config:maxConnections=128&maxConnectionsPerHost=32&followRedirects=false
[junit4:junit4]   2> ASYNC  NEW_CORE C52 name=collection1 org.apache.solr.core.SolrCore@6b11cbdc url=http://127.0.0.1:49318/collection1 node=127.0.0.1:49318_ C52_STATE=coll:collection1 core:collection1 props:{shard=shard2, roles=null, state=active, core=collection1, collection=collection1, node_name=127.0.0.1:49318_, base_url=http://127.0.0.1:49318, leader=true}
[junit4:junit4]   2> 23382 T755 C52 P49318 REQ /get {getVersions=100&distrib=false&wt=javabin&qt=/get&version=2} status=0 QTime=1 
[junit4:junit4]   2> 23384 T750 C52 P49318 oasu.DirectUpdateHandler2.commit start commit{,optimize=false,openSearcher=false,waitSearcher=true,expungeDeletes=false,softCommit=false}
[junit4:junit4]   2> 23386 T750 C52 P49318 oasc.CachingDirectoryFactory.close Releasing directory:/Users/jenkins/jenkins-slave/workspace/Lucene-Solr-trunk-MacOSX/solr/build/solr-core/test/J0/./org.apache.solr.cloud.BasicDistributedZkTest-1359979901483/jetty2
[junit4:junit4]   2> 23390 T750 C52 P49318 oasc.SolrDeletionPolicy.onInit SolrDeletionPolicy.onInit: commits:num=1
[junit4:junit4]   2> 		commit{dir=RateLimitedDirectoryWrapper(NRTCachingDirectory(org.apache.lucene.store.NIOFSDirectory@/Users/jenkins/jenkins-slave/workspace/Lucene-Solr-trunk-MacOSX/solr/build/solr-core/test/J0/org.apache.solr.cloud.BasicDistributedZkTest-1359979901483/jetty2/index lockFactory=org.apache.lucene.store.NativeFSLockFactory@684e8b72; maxCacheMB=48.0 maxMergeSizeMB=4.0)),segFN=segments_1,generation=1,filenames=[segments_1]
[junit4:junit4]   2> 23390 T750 C52 P49318 oasc.SolrDeletionPolicy.updateCommits newest commit = 1[segments_1]
[junit4:junit4]   2> 23394 T703 oascc.ZkStateReader.updateClusterState Updating cloud state from ZooKeeper... 
[junit4:junit4]   2> 23395 T750 C52 P49318 oasc.SolrDeletionPolicy.onCommit SolrDeletionPolicy.onCommit: commits:num=2
[junit4:junit4]   2> 		commit{dir=RateLimitedDirectoryWrapper(NRTCachingDirectory(org.apache.lucene.store.NIOFSDirectory@/Users/jenkins/jenkins-slave/workspace/Lucene-Solr-trunk-MacOSX/solr/build/solr-core/test/J0/org.apache.solr.cloud.BasicDistributedZkTest-1359979901483/jetty2/index lockFactory=org.apache.lucene.store.NativeFSLockFactory@684e8b72; maxCacheMB=48.0 maxMergeSizeMB=4.0)),segFN=segments_1,generation=1,filenames=[segments_1]
[junit4:junit4]   2> 		commit{dir=RateLimitedDirectoryWrapper(NRTCachingDirectory(org.apache.lucene.store.NIOFSDirectory@/Users/jenkins/jenkins-slave/workspace/Lucene-Solr-trunk-MacOSX/solr/build/solr-core/test/J0/org.apache.solr.cloud.BasicDistributedZkTest-1359979901483/jetty2/index lockFactory=org.apache.lucene.store.NativeFSLockFactory@684e8b72; maxCacheMB=48.0 maxMergeSizeMB=4.0)),segFN=segments_2,generation=2,filenames=[segments_2]
[junit4:junit4]   2> 23395 T750 C52 P49318 oasc.SolrDeletionPolicy.updateCommits newest commit = 2[segments_2]
[junit4:junit4]   2> 23397 T750 C52 P49318 oasc.CachingDirectoryFactory.close Releasing directory:/Users/jenkins/jenkins-slave/workspace/Lucene-Solr-trunk-MacOSX/solr/build/solr-core/test/J0/./org.apache.solr.cloud.BasicDistributedZkTest-1359979901483/jetty2
[junit4:junit4]   2> 23398 T750 C52 P49318 oass.SolrIndexSearcher.<init> Opening Searcher@7665ed1c realtime
[junit4:junit4]   2> 23398 T750 C52 P49318 oasu.DirectUpdateHandler2.commit end_commit_flush
[junit4:junit4]   2> 23399 T750 C52 P49318 /update {waitSearcher=true&openSearcher=false&commit=true&wt=javabin&commit_end_point=true&version=2&softCommit=false} {commit=} 0 17
[junit4:junit4]   2> 23400 T793 C50 P49325 oash.ReplicationHandler.inform Commits will be reserved for  10000
[junit4:junit4]   2> 23401 T793 C50 P49325 oash.SnapPuller.<init>  No value set for 'pollInterval'. Timer Task not started.
[junit4:junit4]   2> 23405 T753 C52 P49318 oash.ReplicationHandler.inform Commits will be reserved for  10000
[junit4:junit4]   2> 23406 T753 C52 P49318 REQ /replication {command=indexversion&qt=/replication&wt=javabin&version=2} status=0 QTime=1 
[junit4:junit4]   2> 23407 T793 C50 P49325 oash.SnapPuller.fetchLatestIndex Master's generation: 2
[junit4:junit4]   2> 23407 T793 C50 P49325 oash.SnapPuller.fetchLatestIndex Slave's generation: 1
[junit4:junit4]   2> 23408 T793 C50 P49325 oash.SnapPuller.fetchLatestIndex Starting replication process
[junit4:junit4]   2> 23410 T754 C52 P49318 oasc.CachingDirectoryFactory.close Releasing directory:/Users/jenkins/jenkins-slave/workspace/Lucene-Solr-trunk-MacOSX/solr/build/solr-core/test/J0/./org.apache.solr.cloud.BasicDistributedZkTest-1359979901483/jetty2
[junit4:junit4]   2> 23411 T754 C52 P49318 oasc.CachingDirectoryFactory.close Releasing directory:/Users/jenkins/jenkins-slave/workspace/Lucene-Solr-trunk-MacOSX/solr/build/solr-core/test/J0/./org.apache.solr.cloud.BasicDistributedZkTest-1359979901483/jetty2/index
[junit4:junit4]   2> 23411 T754 C52 P49318 REQ /replication {command=filelist&qt=/replication&wt=javabin&generation=2&version=2} status=0 QTime=1 
[junit4:junit4]   2> 23412 T793 C50 P49325 oash.SnapPuller.fetchLatestIndex Number of files in latest index in master: 1
[junit4:junit4]   2> 23413 T793 C50 P49325 oasc.CachingDirectoryFactory.get return new directory for /Users/jenkins/jenkins-slave/workspace/Lucene-Solr-trunk-MacOSX/solr/build/solr-core/test/J0/./org.apache.solr.cloud.BasicDistributedZkTest-1359979901483/jetty4/index.20130204061204880 forceNew:false
[junit4:junit4]   2> 23414 T793 C50 P49325 oasc.CachingDirectoryFactory.close Releasing directory:/Users/jenkins/jenkins-slave/workspace/Lucene-Solr-trunk-MacOSX/solr/build/solr-core/test/J0/./org.apache.solr.cloud.BasicDistributedZkTest-1359979901483/jetty4
[junit4:junit4]   2> 23416 T793 C50 P49325 oash.SnapPuller.fetchLatestIndex Starting download to RateLimitedDirectoryWrapper(NRTCachingDirectory(org.apache.lucene.store.NIOFSDirectory@/Users/jenkins/jenkins-slave/workspace/Lucene-Solr-trunk-MacOSX/solr/build/solr-core/test/J0/org.apache.solr.cloud.BasicDistributedZkTest-1359979901483/jetty4/index.20130204061204880 lockFactory=org.apache.lucene.store.NativeFSLockFactory@7f822e2; maxCacheMB=48.0 maxMergeSizeMB=4.0)) fullCopy=true
[junit4:junit4]   2> 23420 T752 C52 P49318 REQ /replication {file=segments_2&command=filecontent&checksum=true&wt=filestream&qt=/replication&generation=2} status=0 QTime=0 
[junit4:junit4]   2> 23423 T793 C50 P49325 oasc.CachingDirectoryFactory.close Releasing directory:/Users/jenkins/jenkins-slave/workspace/Lucene-Solr-trunk-MacOSX/solr/build/solr-core/test/J0/./org.apache.solr.cloud.BasicDistributedZkTest-1359979901483/jetty4/index
[junit4:junit4]   2> 23423 T793 C50 P49325 oash.SnapPuller.fetchLatestIndex Total time taken for download : 0 secs
[junit4:junit4]   2> 23424 T793 C50 P49325 oash.SnapPuller.modifyIndexProps New index installed. Updating index properties... index=index.20130204061204880
[junit4:junit4]   2> 23425 T793 C50 P49325 oasc.CachingDirectoryFactory.close Releasing directory:/Users/jenkins/jenkins-slave/workspace/Lucene-Solr-trunk-MacOSX/solr/build/solr-core/test/J0/./org.apache.solr.cloud.BasicDistributedZkTest-1359979901483/jetty4
[junit4:junit4]   2> 23426 T793 C50 P49325 oasc.CachingDirectoryFactory.close Releasing directory:/Users/jenkins/jenkins-slave/workspace/Lucene-Solr-trunk-MacOSX/solr/build/solr-core/test/J0/./org.apache.solr.cloud.BasicDistributedZkTest-1359979901483/jetty4
[junit4:junit4]   2> 23427 T793 C50 P49325 oasc.SolrCore.getNewIndexDir New index directory detected: old=./org.apache.solr.cloud.BasicDistributedZkTest-1359979901483/jetty4/index/ new=./org.apache.solr.cloud.BasicDistributedZkTest-1359979901483/jetty4/index.20130204061204880
[junit4:junit4]   2> 23436 T793 C50 P49325 oasc.SolrDeletionPolicy.onInit SolrDeletionPolicy.onInit: commits:num=1
[junit4:junit4]   2> 		commit{dir=RateLimitedDirectoryWrapper(NRTCachingDirectory(org.apache.lucene.store.NIOFSDirectory@/Users/jenkins/jenkins-slave/workspace/Lucene-Solr-trunk-MacOSX/solr/build/solr-core/test/J0/org.apache.solr.cloud.BasicDistributedZkTest-1359979901483/jetty4/index.20130204061204880 lockFactory=org.apache.lucene.store.NativeFSLockFactory@7f822e2; maxCacheMB=48.0 maxMergeSizeMB=4.0)),segFN=segments_2,generation=2,filenames=[segments_2]
[junit4:junit4]   2> 23437 T793 C50 P49325 oasc.SolrDeletionPolicy.updateCommits newest commit = 2[segments_2]
[junit4:junit4]   2> 23438 T793 C50 P49325 oasc.CachingDirectoryFactory.close Releasing directory:/Users/jenkins/jenkins-slave/workspace/Lucene-Solr-trunk-MacOSX/solr/build/solr-core/test/J0/./org.apache.solr.cloud.BasicDistributedZkTest-1359979901483/jetty4
[junit4:junit4]   2> 23439 T793 C50 P49325 oasu.DefaultSolrCoreState.newIndexWriter Creating new IndexWriter...
[junit4:junit4]   2> 23439 T793 C50 P49325 oasu.DefaultSolrCoreState.newIndexWriter Waiting until IndexWriter is unused... core=collection1
[junit4:junit4]   2> 23439 T793 C50 P49325 oasu.DefaultSolrCoreState.newIndexWriter Rollback old IndexWriter... core=collection1
[junit4:junit4]   2> 23440 T793 C50 P49325 oasc.CachingDirectoryFactory.close Releasing directory:/Users/jenkins/jenkins-slave/workspace/Lucene-Solr-trunk-MacOSX/solr/build/solr-core/test/J0/./org.apache.solr.cloud.BasicDistributedZkTest-1359979901483/jetty4/index.20130204061204880
[junit4:junit4]   2> 23441 T793 C50 P49325 oasc.CachingDirectoryFactory.close Releasing directory:/Users/jenkins/jenkins-slave/workspace/Lucene-Solr-trunk-MacOSX/solr/build/solr-core/test/J0/./org.apache.solr.cloud.BasicDistributedZkTest-1359979901483/jetty4
[junit4:junit4]   2> 23444 T793 C50 P49325 oasc.SolrDeletionPolicy.onInit SolrDeletionPolicy.onInit: commits:num=1
[junit4:junit4]   2> 		commit{dir=RateLimitedDirectoryWrapper(NRTCachingDirectory(org.apache.lucene.store.NIOFSDirectory@/Users/jenkins/jenkins-slave/workspace/Lucene-Solr-trunk-MacOSX/solr/build/solr-core/test/J0/org.apache.solr.cloud.BasicDistributedZkTest-1359979901483/jetty4/index.20130204061204880 lockFactory=org.apache.lucene.store.NativeFSLockFactory@7f822e2; maxCacheMB=48.0 maxMergeSizeMB=4.0)),segFN=segments_2,generation=2,filenames=[segments_2]
[junit4:junit4]   2> 23444 T793 C50 P49325 oasc.SolrDeletionPolicy.updateCommits newest commit = 2[segments_2]
[junit4:junit4]   2> 23444 T793 C50 P49325 oasu.DefaultSolrCoreState.newIndexWriter New IndexWriter is ready to be used.
[junit4:junit4]   2> 23445 T793 C50 P49325 oasc.CachingDirectoryFactory.close Releasing directory:/Users/jenkins/jenkins-slave/workspace/Lucene-Solr-trunk-MacOSX/solr/build/solr-core/test/J0/./org.apache.solr.cloud.BasicDistributedZkTest-1359979901483/jetty4
[junit4:junit4]   2> 23446 T793 C50 P49325 oass.SolrIndexSearcher.<init> Opening Searcher@26722fb6 main
[junit4:junit4]   2> 23450 T792 oasc.SolrCore.registerSearcher [collection1] Registered new searcher Searcher@26722fb6 main{StandardDirectoryReader(segments_2:1:nrt)}
[junit4:junit4]   2> 23451 T792 oasc.CachingDirectoryFactory.close Releasing directory:/Users/jenkins/jenkins-slave/workspace/Lucene-Solr-trunk-MacOSX/solr/build/solr-core/test/J0/./org.apache.solr.cloud.BasicDistributedZkTest-1359979901483/jetty4/index
[junit4:junit4]   2> 23452 T793 C50 P49325 oasu.DirectUpdateHandler2.commit start commit{,optimize=false,openSearcher=false,waitSearcher=false,expungeDeletes=false,softCommit=false}
[junit4:junit4]   2> 23462 T793 C50 P49325 oasc.SolrDeletionPolicy.onCommit SolrDeletionPolicy.onCommit: commits:num=2
[junit4:junit4]   2> 		commit{dir=RateLimitedDirectoryWrapper(NRTCachingDirectory(org.apache.lucene.store.NIOFSDirectory@/Users/jenkins/jenkins-slave/workspace/Lucene-Solr-trunk-MacOSX/solr/build/solr-core/test/J0/org.apache.solr.cloud.BasicDistributedZkTest-1359979901483/jetty4/index.20130204061204880 lockFactory=org.apache.lucene.store.NativeFSLockFactory@7f822e2; maxCacheMB=48.0 maxMergeSizeMB=4.0)),segFN=segments_2,generation=2,filenames=[segments_2]
[junit4:junit4]   2> 		commit{dir=RateLimitedDirectoryWrapper(NRTCachingDirectory(org.apache.lucene.store.NIOFSDirectory@/Users/jenkins/jenkins-slave/workspace/Lucene-Solr-trunk-MacOSX/solr/build/solr-core/test/J0/org.apache.solr.cloud.BasicDistributedZkTest-1359979901483/jetty4/index.20130204061204880 lockFactory=org.apache.lucene.store.NativeFSLockFactory@7f822e2; maxCacheMB=48.0 maxMergeSizeMB=4.0)),segFN=segments_3,generation=3,filenames=[segments_3]
[junit4:junit4]   2> 23462 T793 C50 P49325 oasc.SolrDeletionPolicy.updateCommits newest commit = 3[segments_3]
[junit4:junit4]   2> 23463 T793 C50 P49325 oasc.CachingDirectoryFactory.close Releasing directory:/Users/jenkins/jenkins-slave/workspace/Lucene-Solr-trunk-MacOSX/solr/build/solr-core/test/J0/./org.apache.solr.cloud.BasicDistributedZkTest-1359979901483/jetty4
[junit4:junit4]   2> 23464 T793 C50 P49325 oasu.DirectUpdateHandler2.commit end_commit_flush
[junit4:junit4]   2> 23464 T793 C50 P49325 oasc.CachingDirectoryFactory.close Releasing directory:/Users/jenkins/jenkins-slave/workspace/Lucene-Solr-trunk-MacOSX/solr/build/solr-core/test/J0/./org.apache.solr.cloud.BasicDistributedZkTest-1359979901483/jetty4/index.20130204061204880
[junit4:junit4]   2> 23464 T793 C50 P49325 oasc.CachingDirectoryFactory.close Releasing directory:/Users/jenkins/jenkins-slave/workspace/Lucene-Solr-trunk-MacOSX/solr/build/solr-core/test/J0/./org.apache.solr.cloud.BasicDistributedZkTest-1359979901483/jetty4/index
[junit4:junit4]   2> 23465 T793 C50 P49325 oasc.RecoveryStrategy.replay No replay needed. core=collection1
[junit4:junit4]   2> 23465 T793 C50 P49325 oasc.RecoveryStrategy.doRecovery Replication Recovery was successful - registering as Active. core=collection1
[junit4:junit4]   2> 23465 T793 C50 P49325 oasc.ZkController.publish publishing core=collection1 state=active
[junit4:junit4]   2> 23465 T793 C50 P49325 oasc.ZkController.publish numShards not found on descriptor - reading it from system property
[junit4:junit4]   2> 23469 T793 C50 P49325 oasc.RecoveryStrategy.doRecovery Finished recovery process. core=collection1
[junit4:junit4]   2> 24288 T726 oascc.ZkStateReader.updateClusterState Updating cloud state from ZooKeeper... 
[junit4:junit4]   2> 24289 T726 oasc.Overseer$ClusterStateUpdater.updateState Update state numShards=2 message={
[junit4:junit4]   2> 	  "operation":"state",
[junit4:junit4]   2> 	  "numShards":"2",
[junit4:junit4]   2> 	  "shard":"shard2",
[junit4:junit4]   2> 	  "roles":null,
[junit4:junit4]   2> 	  "state":"active",
[junit4:junit4]   2> 	  "core":"collection1",
[junit4:junit4]   2> 	  "collection":"collection1",
[junit4:junit4]   2> 	  "node_name":"127.0.0.1:49325_",
[junit4:junit4]   2> 	  "base_url":"http://127.0.0.1:49325"}
[junit4:junit4]   2> 24305 T774 oascc.ZkStateReader$2.process A cluster state change: WatchedEvent state:SyncConnected type:NodeDataChanged path:/clusterstate.json, has occurred - updating... (live nodes size: 5)
[junit4:junit4]   2> 24306 T725 oascc.ZkStateReader$2.process A cluster state change: WatchedEvent state:SyncConnected type:NodeDataChanged path:/clusterstate.json, has occurred - updating... (live nodes size: 5)
[junit4:junit4]   2> 24306 T759 oascc.ZkStateReader$2.process A cluster state change: WatchedEvent state:SyncConnected type:NodeDataChanged path:/clusterstate.json, has occurred - updating... (live nodes size: 5)
[junit4:junit4]   2> 24307 T744 oascc.ZkStateReader$2.process A cluster state change: WatchedEvent state:SyncConnected type:NodeDataChanged path:/clusterstate.json, has occurred - updating... (live nodes size: 5)
[junit4:junit4]   2> 24307 T790 oascc.ZkStateReader$2.process A cluster state change: WatchedEvent state:SyncConnected type:NodeDataChanged path:/clusterstate.json, has occurred - updating... (live nodes size: 5)
[junit4:junit4]   2> 24306 T731 oascc.ZkStateReader$2.process A cluster state change: WatchedEvent state:SyncConnected type:NodeDataChanged path:/clusterstate.json, has occurred - updating... (live nodes size: 5)
[junit4:junit4]   2> 24406 T703 oascc.ZkStateReader.updateClusterState Updating cloud state from ZooKeeper... 
[junit4:junit4]   2> 24407 T703 oasc.AbstractDistribZkTestBase.waitForRecoveriesToFinish Recoveries finished - collection: collection1
[junit4:junit4]   2> ASYNC  NEW_CORE C53 name=collection1 org.apache.solr.core.SolrCore@d8778c6 url=http://127.0.0.1:49311/collection1 node=127.0.0.1:49311_ C53_STATE=coll:control_collection core:collection1 props:{shard=shard1, roles=null, state=active, core=collection1, collection=control_collection, node_name=127.0.0.1:49311_, base_url=http://127.0.0.1:49311, leader=true}
[junit4:junit4]   2> 24423 T720 C53 P49311 oasc.CachingDirectoryFactory.close Releasing directory:/Users/jenkins/jenkins-slave/workspace/Lucene-Solr-trunk-MacOSX/solr/build/solr-core/test/J0/./org.apache.solr.cloud.BasicDistributedZkTest-1359979901483/control/data
[junit4:junit4]   2> 24434 T720 C53 P49311 oasc.SolrDeletionPolicy.onInit SolrDeletionPolicy.onInit: commits:num=1
[junit4:junit4]   2> 		commit{dir=RateLimitedDirectoryWrapper(NRTCachingDirectory(org.apache.lucene.store.NIOFSDirectory@/Users/jenkins/jenkins-slave/workspace/Lucene-Solr-trunk-MacOSX/solr/build/solr-core/test/J0/org.apache.solr.cloud.BasicDistributedZkTest-1359979901483/control/data/index lockFactory=org.apache.lucene.store.NativeFSLockFactory@45f60505; maxCacheMB=48.0 maxMergeSizeMB=4.0)),segFN=segments_1,generation=1,filenames=[segments_1]
[junit4:junit4]   2> 24436 T720 C53 P49311 oasc.SolrDeletionPolicy.updateCommits newest commit = 1[segments_1]
[junit4:junit4]   2> 24462 T720 C53 P49311 oasc.CachingDirectoryFactory.close Releasing directory:/Users/jenkins/jenkins-slave/workspace/Lucene-Solr-trunk-MacOSX/solr/build/solr-core/test/J0/./org.apache.solr.cloud.BasicDistributedZkTest-1359979901483/control/data
[junit4:junit4]   2> 24463 T720 C53 P49311 oass.SolrIndexSearcher.<init> Opening Searcher@618c90ec realtime
[junit4:junit4]   2> 24465 T720 C53 P49311 /update {wt=javabin&version=2} {deleteByQuery=*:* (-1426042310770032640)} 0 47
[junit4:junit4]   2> 24479 T735 C51 P49315 oasc.CachingDirectoryFactory.close Releasing directory:/Users/jenkins/jenkins-slave/workspace/Lucene-Solr-trunk-MacOSX/solr/build/solr-core/test/J0/./org.apache.solr.cloud.BasicDistributedZkTest-1359979901483/jetty1
[junit4:junit4]   2> 24502 T753 C52 P49318 oasc.CachingDirectoryFactory.close Releasing directory:/Users/jenkins/jenkins-slave/workspace/Lucene-Solr-trunk-MacOSX/solr/build/solr-core/test/J0/./org.apache.solr.cloud.BasicDistributedZkTest-1359979901483/jetty2
[junit4:junit4]   2>  C49_STATE=coll:collection1 core:collection1 props:{shard=shard1, roles=null, state=active, core=collection1, collection=collection1, node_name=127.0.0.1:49321_, base_url=http://127.0.0.1:49321}
[junit4:junit4]   2> 24522 T766 C49 P49321 oasc.CachingDirectoryFactory.close Releasing directory:/Users/jenkins/jenkins-slave/workspace/Lucene-Solr-trunk-MacOSX/solr/build/solr-core/test/J0/./org.apache.solr.cloud.BasicDistributedZkTest-1359979901483/jetty3
[junit4:junit4]   2>  C50_STATE=coll:collection1 core:collection1 props:{shard=shard2, roles=null, state=active, core=collection1, collection=collection1, node_name=127.0.0.1:49325_, base_url=http://127.0.0.1:49325}
[junit4:junit4]   2> 24524 T781 C50 P49325 oasc.CachingDirectoryFactory.close Releasing directory:/Users/jenkins/jenkins-slave/workspace/Lucene-Solr-trunk-MacOSX/solr/build/solr-core/test/J0/./org.apache.solr.cloud.BasicDistributedZkTest-1359979901483/jetty4
[junit4:junit4]   2> 24525 T766 C49 P49321 /update {update.distrib=FROMLEADER&_version_=-1426042310828752896&update.from=http://127.0.0.1:49315/collection1/&wt=javabin&version=2} {deleteByQuery=*:* (-1426042310828752896)} 0 16
[junit4:junit4]   2> 24526 T781 C50 P49325 /update {update.distrib=FROMLEADER&_version_=-1426042310851821568&update.from=http://127.0.0.1:49318/collection1/&wt=javabin&version=2} {deleteByQuery=*:* (-1426042310851821568)} 0 6
[junit4:junit4]   2> 24528 T753 C52 P49318 /update {update.distrib=TOLEADER&wt=javabin&version=2} {deleteByQuery=*:* (-1426042310851821568)} 0 29
[junit4:junit4]   2> 24530 T735 C51 P49315 /update {wt=javabin&version=2} {deleteByQuery=*:* (-1426042310828752896)} 0 59
[junit4:junit4]   2> 24568 T721 C53 P49311 /update {wt=javabin&version=2} {add=[1 (1426042310910541824)]} 0 15
[junit4:junit4]   2> 24596 T767 C49 P49321 /update {distrib.from=http://127.0.0.1:49315/collection1/&update.distrib=FROMLEADER&wt=javabin&version=2} {add=[1 (1426042310927319040)]} 0 4
[junit4

[...truncated too long message...]

DistributedZkTest -Dtests.method=testDistribSearch -Dtests.seed=930688C156120156 -Dtests.slow=true -Dtests.locale=zh_HK -Dtests.timezone=America/Costa_Rica -Dtests.file.encoding=ISO-8859-1
[junit4:junit4] FAILURE  427s | BasicDistributedZkTest.testDistribSearch <<<
[junit4:junit4]    > Throwable #1: java.lang.AssertionError: There are still nodes recoverying - waited for 230 seconds
[junit4:junit4]    > 	at __randomizedtesting.SeedInfo.seed([930688C156120156:12E006D9214D616A]:0)
[junit4:junit4]    > 	at org.junit.Assert.fail(Assert.java:93)
[junit4:junit4]    > 	at org.apache.solr.cloud.AbstractDistribZkTestBase.waitForRecoveriesToFinish(AbstractDistribZkTestBase.java:168)
[junit4:junit4]    > 	at org.apache.solr.cloud.AbstractDistribZkTestBase.waitForRecoveriesToFinish(AbstractDistribZkTestBase.java:126)
[junit4:junit4]    > 	at org.apache.solr.cloud.AbstractDistribZkTestBase.waitForRecoveriesToFinish(AbstractDistribZkTestBase.java:121)
[junit4:junit4]    > 	at org.apache.solr.cloud.BasicDistributedZkTest.testCoreUnloadAndLeaders(BasicDistributedZkTest.java:599)
[junit4:junit4]    > 	at org.apache.solr.cloud.BasicDistributedZkTest.doTest(BasicDistributedZkTest.java:337)
[junit4:junit4]    > 	at org.apache.solr.BaseDistributedSearchTestCase.testDistribSearch(BaseDistributedSearchTestCase.java:794)
[junit4:junit4]    > 	at sun.reflect.NativeMethodAccessorImpl.invoke0(Native Method)
[junit4:junit4]    > 	at sun.reflect.NativeMethodAccessorImpl.invoke(NativeMethodAccessorImpl.java:57)
[junit4:junit4]    > 	at sun.reflect.DelegatingMethodAccessorImpl.invoke(DelegatingMethodAccessorImpl.java:43)
[junit4:junit4]    > 	at java.lang.reflect.Method.invoke(Method.java:601)
[junit4:junit4]    > 	at com.carrotsearch.randomizedtesting.RandomizedRunner.invoke(RandomizedRunner.java:1559)
[junit4:junit4]    > 	at com.carrotsearch.randomizedtesting.RandomizedRunner.access$600(RandomizedRunner.java:79)
[junit4:junit4]    > 	at com.carrotsearch.randomizedtesting.RandomizedRunner$6.evaluate(RandomizedRunner.java:737)
[junit4:junit4]    > 	at com.carrotsearch.randomizedtesting.RandomizedRunner$7.evaluate(RandomizedRunner.java:773)
[junit4:junit4]    > 	at com.carrotsearch.randomizedtesting.RandomizedRunner$8.evaluate(RandomizedRunner.java:787)
[junit4:junit4]    > 	at com.carrotsearch.randomizedtesting.rules.SystemPropertiesRestoreRule$1.evaluate(SystemPropertiesRestoreRule.java:53)
[junit4:junit4]    > 	at org.apache.lucene.util.TestRuleSetupTeardownChained$1.evaluate(TestRuleSetupTeardownChained.java:50)
[junit4:junit4]    > 	at org.apache.lucene.util.TestRuleFieldCacheSanity$1.evaluate(TestRuleFieldCacheSanity.java:51)
[junit4:junit4]    > 	at org.apache.lucene.util.AbstractBeforeAfterRule$1.evaluate(AbstractBeforeAfterRule.java:46)
[junit4:junit4]    > 	at com.carrotsearch.randomizedtesting.rules.SystemPropertiesInvariantRule$1.evaluate(SystemPropertiesInvariantRule.java:55)
[junit4:junit4]    > 	at org.apache.lucene.util.TestRuleThreadAndTestName$1.evaluate(TestRuleThreadAndTestName.java:49)
[junit4:junit4]    > 	at org.apache.lucene.util.TestRuleIgnoreAfterMaxFailures$1.evaluate(TestRuleIgnoreAfterMaxFailures.java:70)
[junit4:junit4]    > 	at org.apache.lucene.util.TestRuleMarkFailure$1.evaluate(TestRuleMarkFailure.java:48)
[junit4:junit4]    > 	at com.carrotsearch.randomizedtesting.rules.StatementAdapter.evaluate(StatementAdapter.java:36)
[junit4:junit4]    > 	at com.carrotsearch.randomizedtesting.ThreadLeakControl$StatementRunner.run(ThreadLeakControl.java:358)
[junit4:junit4]    > 	at com.carrotsearch.randomizedtesting.ThreadLeakControl.forkTimeoutingTask(ThreadLeakControl.java:782)
[junit4:junit4]    > 	at com.carrotsearch.randomizedtesting.ThreadLeakControl$3.evaluate(ThreadLeakControl.java:442)
[junit4:junit4]    > 	at com.carrotsearch.randomizedtesting.RandomizedRunner.runSingleTest(RandomizedRunner.java:746)
[junit4:junit4]    > 	at com.carrotsearch.randomizedtesting.RandomizedRunner$3.evaluate(RandomizedRunner.java:648)
[junit4:junit4]    > 	at com.carrotsearch.randomizedtesting.RandomizedRunner$4.evaluate(RandomizedRunner.java:682)
[junit4:junit4]    > 	at com.carrotsearch.randomizedtesting.RandomizedRunner$5.evaluate(RandomizedRunner.java:693)
[junit4:junit4]    > 	at com.carrotsearch.randomizedtesting.rules.StatementAdapter.evaluate(StatementAdapter.java:36)
[junit4:junit4]    > 	at com.carrotsearch.randomizedtesting.rules.SystemPropertiesRestoreRule$1.evaluate(SystemPropertiesRestoreRule.java:53)
[junit4:junit4]    > 	at org.apache.lucene.util.AbstractBeforeAfterRule$1.evaluate(AbstractBeforeAfterRule.java:46)
[junit4:junit4]    > 	at org.apache.lucene.util.TestRuleStoreClassName$1.evaluate(TestRuleStoreClassName.java:42)
[junit4:junit4]    > 	at com.carrotsearch.randomizedtesting.rules.SystemPropertiesInvariantRule$1.evaluate(SystemPropertiesInvariantRule.java:55)
[junit4:junit4]    > 	at com.carrotsearch.randomizedtesting.rules.NoShadowingOrOverridesOnMethodsRule$1.evaluate(NoShadowingOrOverridesOnMethodsRule.java:39)
[junit4:junit4]    > 	at com.carrotsearch.randomizedtesting.rules.NoShadowingOrOverridesOnMethodsRule$1.evaluate(NoShadowingOrOverridesOnMethodsRule.java:39)
[junit4:junit4]    > 	at com.carrotsearch.randomizedtesting.rules.StatementAdapter.evaluate(StatementAdapter.java:36)
[junit4:junit4]    > 	at org.apache.lucene.util.TestRuleAssertionsRequired$1.evaluate(TestRuleAssertionsRequired.java:43)
[junit4:junit4]    > 	at org.apache.lucene.util.TestRuleMarkFailure$1.evaluate(TestRuleMarkFailure.java:48)
[junit4:junit4]    > 	at org.apache.lucene.util.TestRuleIgnoreAfterMaxFailures$1.evaluate(TestRuleIgnoreAfterMaxFailures.java:70)
[junit4:junit4]    > 	at org.apache.lucene.util.TestRuleIgnoreTestSuites$1.evaluate(TestRuleIgnoreTestSuites.java:55)
[junit4:junit4]    > 	at com.carrotsearch.randomizedtesting.rules.StatementAdapter.evaluate(StatementAdapter.java:36)
[junit4:junit4]    > 	at com.carrotsearch.randomizedtesting.ThreadLeakControl$StatementRunner.run(ThreadLeakControl.java:358)
[junit4:junit4]    > 	at java.lang.Thread.run(Thread.java:722)
[junit4:junit4]   2> 426792 T703 oas.SolrTestCaseJ4.deleteCore ###deleteCore
[junit4:junit4]   2> NOTE: test params are: codec=Lucene42: {n_f1=PostingsFormat(name=NestedPulsing), foo_b=MockVariableIntBlock(baseBlockSize=126), cat=PostingsFormat(name=Asserting), foo_d=Lucene41(blocksize=128), foo_f=MockVariableIntBlock(baseBlockSize=126), n_tl1=PostingsFormat(name=NestedPulsing), n_d1=PostingsFormat(name=Asserting), rnd_b=Lucene41(blocksize=128), intDefault=PostingsFormat(name=NestedPulsing), n_td1=PostingsFormat(name=NestedPulsing), timestamp=PostingsFormat(name=Asserting), id=Lucene41(blocksize=128), range_facet_sl=Lucene41(blocksize=128), range_facet_si=PostingsFormat(name=Asserting), oddField_s=Lucene41(blocksize=128), sequence_i=Lucene41(blocksize=128), name=Lucene41(blocksize=128), foo_i=PostingsFormat(name=NestedPulsing), regex_dup_B_s=PostingsFormat(name=Asserting), multiDefault=PostingsFormat(name=Asserting), n_tf1=PostingsFormat(name=Asserting), n_dt1=PostingsFormat(name=NestedPulsing), genre_s=Lucene41(blocksize=128), author_t=PostingsFormat(name=NestedPulsing), n_ti1=Lucene41(blocksize=128), range_facet_l=PostingsFormat(name=Asserting), text=MockVariableIntBlock(baseBlockSize=126), _version_=PostingsFormat(name=NestedPulsing), val_i=Lucene41(blocksize=128), SubjectTerms_mfacet=PostingsFormat(name=NestedPulsing), series_t=PostingsFormat(name=NestedPulsing), a_t=PostingsFormat(name=Asserting), n_tdt1=PostingsFormat(name=NestedPulsing), regex_dup_A_s=MockVariableIntBlock(baseBlockSize=126), price=MockVariableIntBlock(baseBlockSize=126), other_tl1=PostingsFormat(name=NestedPulsing), n_l1=PostingsFormat(name=Asserting), a_si=PostingsFormat(name=NestedPulsing), inStock=MockVariableIntBlock(baseBlockSize=126)}, sim=RandomSimilarityProvider(queryNorm=false,coord=yes): {}, locale=zh_HK, timezone=America/Costa_Rica
[junit4:junit4]   2> NOTE: Mac OS X 10.8.2 x86_64/Oracle Corporation 1.7.0_10 (64-bit)/cpus=2,threads=1,free=53617144,total=143335424
[junit4:junit4]   2> NOTE: All tests run in this JVM: [TestCoreContainer, TestReplicationHandler, TermVectorComponentTest, FieldAnalysisRequestHandlerTest, AutoCommitTest, AlternateDirectoryTest, TestStressRecovery, ShardRoutingCustomTest, RequestHandlersTest, ZkSolrClientTest, TimeZoneUtilsTest, AnalysisAfterCoreReloadTest, TestSolrCoreProperties, TestCollationField, TestIndexingPerformance, TestSolrQueryParser, ZkCLITest, DistributedSpellCheckComponentTest, BadComponentTest, TestPhraseSuggestions, IndexBasedSpellCheckerTest, CurrencyFieldTest, LukeRequestHandlerTest, TestSystemIdResolver, SolrInfoMBeanTest, TestQuerySenderListener, CSVRequestHandlerTest, BasicDistributedZkTest]
[junit4:junit4] Completed in 427.26s, 1 test, 1 failure <<< FAILURES!

[...truncated 678 lines...]
BUILD FAILED
/Users/jenkins/jenkins-slave/workspace/Lucene-Solr-trunk-MacOSX/build.xml:346: The following error occurred while executing this line:
/Users/jenkins/jenkins-slave/workspace/Lucene-Solr-trunk-MacOSX/build.xml:39: The following error occurred while executing this line:
/Users/jenkins/jenkins-slave/workspace/Lucene-Solr-trunk-MacOSX/solr/build.xml:178: The following error occurred while executing this line:
/Users/jenkins/jenkins-slave/workspace/Lucene-Solr-trunk-MacOSX/solr/common-build.xml:428: The following error occurred while executing this line:
/Users/jenkins/jenkins-slave/workspace/Lucene-Solr-trunk-MacOSX/lucene/common-build.xml:1176: The following error occurred while executing this line:
/Users/jenkins/jenkins-slave/workspace/Lucene-Solr-trunk-MacOSX/lucene/common-build.xml:841: There were test failures: 249 suites, 1038 tests, 1 failure, 14 ignored (3 assumptions)

Total time: 67 minutes 50 seconds
Build step 'Invoke Ant' marked build as failure
Archiving artifacts
Recording test results
Description set: Java: 64bit/jdk1.7.0 -XX:+UseConcMarkSweepGC
Email was triggered for: Failure
Sending email for trigger: Failure



Mime
View raw message