lucene-dev mailing list archives

Site index · List index
Message view « Date » · « Thread »
Top « Date » · « Thread »
From Apache Jenkins Server <jenk...@builds.apache.org>
Subject [JENKINS] Lucene-Solr-Tests-4.x-Java6 - Build # 1301 - Failure
Date Sat, 02 Feb 2013 08:25:13 GMT
Build: https://builds.apache.org/job/Lucene-Solr-Tests-4.x-Java6/1301/

1 tests failed.
REGRESSION:  org.apache.solr.cloud.SyncSliceTest.testDistribSearch

Error Message:
shard1 should have just been set up to be inconsistent - but it's still consistent

Stack Trace:
java.lang.AssertionError: shard1 should have just been set up to be inconsistent - but it's still consistent
	at __randomizedtesting.SeedInfo.seed([474A1B68E474A41A:C6AC9570932BC426]:0)
	at org.junit.Assert.fail(Assert.java:93)
	at org.junit.Assert.assertTrue(Assert.java:43)
	at org.junit.Assert.assertNotNull(Assert.java:526)
	at org.apache.solr.cloud.SyncSliceTest.doTest(SyncSliceTest.java:214)
	at org.apache.solr.BaseDistributedSearchTestCase.testDistribSearch(BaseDistributedSearchTestCase.java:794)
	at sun.reflect.NativeMethodAccessorImpl.invoke0(Native Method)
	at sun.reflect.NativeMethodAccessorImpl.invoke(NativeMethodAccessorImpl.java:57)
	at sun.reflect.DelegatingMethodAccessorImpl.invoke(DelegatingMethodAccessorImpl.java:43)
	at java.lang.reflect.Method.invoke(Method.java:616)
	at com.carrotsearch.randomizedtesting.RandomizedRunner.invoke(RandomizedRunner.java:1559)
	at com.carrotsearch.randomizedtesting.RandomizedRunner.access$600(RandomizedRunner.java:79)
	at com.carrotsearch.randomizedtesting.RandomizedRunner$6.evaluate(RandomizedRunner.java:737)
	at com.carrotsearch.randomizedtesting.RandomizedRunner$7.evaluate(RandomizedRunner.java:773)
	at com.carrotsearch.randomizedtesting.RandomizedRunner$8.evaluate(RandomizedRunner.java:787)
	at com.carrotsearch.randomizedtesting.rules.SystemPropertiesRestoreRule$1.evaluate(SystemPropertiesRestoreRule.java:53)
	at org.apache.lucene.util.TestRuleSetupTeardownChained$1.evaluate(TestRuleSetupTeardownChained.java:50)
	at org.apache.lucene.util.TestRuleFieldCacheSanity$1.evaluate(TestRuleFieldCacheSanity.java:51)
	at org.apache.lucene.util.AbstractBeforeAfterRule$1.evaluate(AbstractBeforeAfterRule.java:46)
	at com.carrotsearch.randomizedtesting.rules.SystemPropertiesInvariantRule$1.evaluate(SystemPropertiesInvariantRule.java:55)
	at org.apache.lucene.util.TestRuleThreadAndTestName$1.evaluate(TestRuleThreadAndTestName.java:49)
	at org.apache.lucene.util.TestRuleIgnoreAfterMaxFailures$1.evaluate(TestRuleIgnoreAfterMaxFailures.java:70)
	at org.apache.lucene.util.TestRuleMarkFailure$1.evaluate(TestRuleMarkFailure.java:48)
	at com.carrotsearch.randomizedtesting.rules.StatementAdapter.evaluate(StatementAdapter.java:36)
	at com.carrotsearch.randomizedtesting.ThreadLeakControl$StatementRunner.run(ThreadLeakControl.java:358)
	at com.carrotsearch.randomizedtesting.ThreadLeakControl.forkTimeoutingTask(ThreadLeakControl.java:782)
	at com.carrotsearch.randomizedtesting.ThreadLeakControl$3.evaluate(ThreadLeakControl.java:442)
	at com.carrotsearch.randomizedtesting.RandomizedRunner.runSingleTest(RandomizedRunner.java:746)
	at com.carrotsearch.randomizedtesting.RandomizedRunner$3.evaluate(RandomizedRunner.java:648)
	at com.carrotsearch.randomizedtesting.RandomizedRunner$4.evaluate(RandomizedRunner.java:682)
	at com.carrotsearch.randomizedtesting.RandomizedRunner$5.evaluate(RandomizedRunner.java:693)
	at com.carrotsearch.randomizedtesting.rules.StatementAdapter.evaluate(StatementAdapter.java:36)
	at com.carrotsearch.randomizedtesting.rules.SystemPropertiesRestoreRule$1.evaluate(SystemPropertiesRestoreRule.java:53)
	at org.apache.lucene.util.AbstractBeforeAfterRule$1.evaluate(AbstractBeforeAfterRule.java:46)
	at org.apache.lucene.util.TestRuleStoreClassName$1.evaluate(TestRuleStoreClassName.java:42)
	at com.carrotsearch.randomizedtesting.rules.SystemPropertiesInvariantRule$1.evaluate(SystemPropertiesInvariantRule.java:55)
	at com.carrotsearch.randomizedtesting.rules.NoShadowingOrOverridesOnMethodsRule$1.evaluate(NoShadowingOrOverridesOnMethodsRule.java:39)
	at com.carrotsearch.randomizedtesting.rules.NoShadowingOrOverridesOnMethodsRule$1.evaluate(NoShadowingOrOverridesOnMethodsRule.java:39)
	at com.carrotsearch.randomizedtesting.rules.StatementAdapter.evaluate(StatementAdapter.java:36)
	at org.apache.lucene.util.TestRuleAssertionsRequired$1.evaluate(TestRuleAssertionsRequired.java:43)
	at org.apache.lucene.util.TestRuleMarkFailure$1.evaluate(TestRuleMarkFailure.java:48)
	at org.apache.lucene.util.TestRuleIgnoreAfterMaxFailures$1.evaluate(TestRuleIgnoreAfterMaxFailures.java:70)
	at org.apache.lucene.util.TestRuleIgnoreTestSuites$1.evaluate(TestRuleIgnoreTestSuites.java:55)
	at com.carrotsearch.randomizedtesting.rules.StatementAdapter.evaluate(StatementAdapter.java:36)
	at com.carrotsearch.randomizedtesting.ThreadLeakControl$StatementRunner.run(ThreadLeakControl.java:358)
	at java.lang.Thread.run(Thread.java:679)




Build Log:
[...truncated 8679 lines...]
[junit4:junit4] Suite: org.apache.solr.cloud.SyncSliceTest
[junit4:junit4]   2> 0 T1882 oas.BaseDistributedSearchTestCase.initHostContext Setting hostContext system property: /_f/
[junit4:junit4]   2> 5 T1882 oas.SolrTestCaseJ4.setUp ###Starting testDistribSearch
[junit4:junit4]   2> Creating dataDir: /usr/home/hudson/hudson-slave/workspace/Lucene-Solr-Tests-4.x-Java6/solr/build/solr-core/test/J0/./solrtest-SyncSliceTest-1359793333857
[junit4:junit4]   2> 7 T1882 oasc.ZkTestServer.run STARTING ZK TEST SERVER
[junit4:junit4]   2> 7 T1883 oasc.ZkTestServer$ZKServerMain.runFromConfig Starting server
[junit4:junit4]   2> 12 T1883 oazs.ZooKeeperServer.setTickTime tickTime set to 1000
[junit4:junit4]   2> 12 T1883 oazs.ZooKeeperServer.setMinSessionTimeout minSessionTimeout set to -1
[junit4:junit4]   2> 13 T1883 oazs.ZooKeeperServer.setMaxSessionTimeout maxSessionTimeout set to -1
[junit4:junit4]   2> 13 T1883 oazs.NIOServerCnxnFactory.configure binding to port 0.0.0.0/0.0.0.0:0
[junit4:junit4]   2> 14 T1883 oazsp.FileTxnSnapLog.save Snapshotting: 0x0 to /usr/home/hudson/hudson-slave/workspace/Lucene-Solr-Tests-4.x-Java6/solr/build/solr-core/test/J0/./org.apache.solr.cloud.SyncSliceTest-1359793333856/zookeeper/server1/data/version-2/snapshot.0
[junit4:junit4]   2> 108 T1882 oasc.ZkTestServer.run start zk server on port:28621
[junit4:junit4]   2> 108 T1882 oaz.ZooKeeper.<init> Initiating client connection, connectString=127.0.0.1:28621 sessionTimeout=10000 watcher=org.apache.solr.common.cloud.ConnectionManager@5c05bbd1
[junit4:junit4]   2> 109 T1882 oascc.ConnectionManager.waitForConnected Waiting for client to connect to ZooKeeper
[junit4:junit4]   2> 110 T1888 oaz.ClientCnxn$SendThread.logStartConnect Opening socket connection to server localhost/127.0.0.1:28621. Will not attempt to authenticate using SASL (access denied (javax.security.auth.AuthPermission getLoginConfiguration))
[junit4:junit4]   2> 110 T1888 oaz.ClientCnxn$SendThread.primeConnection Socket connection established to localhost/127.0.0.1:28621, initiating session
[junit4:junit4]   2> 111 T1884 oazs.NIOServerCnxnFactory.run Accepted socket connection from /140.211.11.196:28622
[junit4:junit4]   2> 111 T1884 oazs.ZooKeeperServer.processConnectRequest Client attempting to establish new session at /140.211.11.196:28622
[junit4:junit4]   2> 111 T1886 oazsp.FileTxnLog.append Creating new log file: log.1
[junit4:junit4]   2> 114 T1886 oazs.ZooKeeperServer.finishSessionInit Established session 0x13c99ffa66b0000 with negotiated timeout 10000 for client /140.211.11.196:28622
[junit4:junit4]   2> 114 T1888 oaz.ClientCnxn$SendThread.onConnected Session establishment complete on server localhost/127.0.0.1:28621, sessionid = 0x13c99ffa66b0000, negotiated timeout = 10000
[junit4:junit4]   2> 114 T1889 oascc.ConnectionManager.process Watcher org.apache.solr.common.cloud.ConnectionManager@5c05bbd1 name:ZooKeeperConnection Watcher:127.0.0.1:28621 got event WatchedEvent state:SyncConnected type:None path:null path:null type:None
[junit4:junit4]   2> 115 T1882 oascc.ConnectionManager.waitForConnected Client is connected to ZooKeeper
[junit4:junit4]   2> 115 T1882 oascc.SolrZkClient.makePath makePath: /solr
[junit4:junit4]   2> 118 T1887 oazs.PrepRequestProcessor.pRequest2Txn Processed session termination for sessionid: 0x13c99ffa66b0000
[junit4:junit4]   2> 126 T1889 oaz.ClientCnxn$EventThread.run EventThread shut down
[junit4:junit4]   2> 126 T1884 oazs.NIOServerCnxn.closeSock Closed socket connection for client /140.211.11.196:28622 which had sessionid 0x13c99ffa66b0000
[junit4:junit4]   2> 126 T1882 oaz.ZooKeeper.close Session: 0x13c99ffa66b0000 closed
[junit4:junit4]   2> 127 T1882 oaz.ZooKeeper.<init> Initiating client connection, connectString=127.0.0.1:28621/solr sessionTimeout=10000 watcher=org.apache.solr.common.cloud.ConnectionManager@1c146e30
[junit4:junit4]   2> 127 T1882 oascc.ConnectionManager.waitForConnected Waiting for client to connect to ZooKeeper
[junit4:junit4]   2> 128 T1890 oaz.ClientCnxn$SendThread.logStartConnect Opening socket connection to server localhost/127.0.0.1:28621. Will not attempt to authenticate using SASL (access denied (javax.security.auth.AuthPermission getLoginConfiguration))
[junit4:junit4]   2> 128 T1890 oaz.ClientCnxn$SendThread.primeConnection Socket connection established to localhost/127.0.0.1:28621, initiating session
[junit4:junit4]   2> 128 T1884 oazs.NIOServerCnxnFactory.run Accepted socket connection from /140.211.11.196:28623
[junit4:junit4]   2> 129 T1884 oazs.ZooKeeperServer.processConnectRequest Client attempting to establish new session at /140.211.11.196:28623
[junit4:junit4]   2> 137 T1886 oazs.ZooKeeperServer.finishSessionInit Established session 0x13c99ffa66b0001 with negotiated timeout 10000 for client /140.211.11.196:28623
[junit4:junit4]   2> 137 T1890 oaz.ClientCnxn$SendThread.onConnected Session establishment complete on server localhost/127.0.0.1:28621, sessionid = 0x13c99ffa66b0001, negotiated timeout = 10000
[junit4:junit4]   2> 137 T1891 oascc.ConnectionManager.process Watcher org.apache.solr.common.cloud.ConnectionManager@1c146e30 name:ZooKeeperConnection Watcher:127.0.0.1:28621/solr got event WatchedEvent state:SyncConnected type:None path:null path:null type:None
[junit4:junit4]   2> 137 T1882 oascc.ConnectionManager.waitForConnected Client is connected to ZooKeeper
[junit4:junit4]   2> 138 T1882 oascc.SolrZkClient.makePath makePath: /collections/collection1
[junit4:junit4]   2> 142 T1882 oascc.SolrZkClient.makePath makePath: /collections/collection1/shards
[junit4:junit4]   2> 145 T1882 oascc.SolrZkClient.makePath makePath: /collections/control_collection
[junit4:junit4]   2> 147 T1882 oascc.SolrZkClient.makePath makePath: /collections/control_collection/shards
[junit4:junit4]   2> 150 T1882 oasc.AbstractZkTestCase.putConfig put /usr/home/hudson/hudson-slave/workspace/Lucene-Solr-Tests-4.x-Java6/solr/build/solr-core/test-files/solr/collection1/conf/solrconfig.xml to /configs/conf1/solrconfig.xml
[junit4:junit4]   2> 151 T1882 oascc.SolrZkClient.makePath makePath: /configs/conf1/solrconfig.xml
[junit4:junit4]   2> 169 T1882 oasc.AbstractZkTestCase.putConfig put /usr/home/hudson/hudson-slave/workspace/Lucene-Solr-Tests-4.x-Java6/solr/build/solr-core/test-files/solr/collection1/conf/schema.xml to /configs/conf1/schema.xml
[junit4:junit4]   2> 170 T1882 oascc.SolrZkClient.makePath makePath: /configs/conf1/schema.xml
[junit4:junit4]   2> 274 T1882 oasc.AbstractZkTestCase.putConfig put /usr/home/hudson/hudson-slave/workspace/Lucene-Solr-Tests-4.x-Java6/solr/build/solr-core/test-files/solr/collection1/conf/stopwords.txt to /configs/conf1/stopwords.txt
[junit4:junit4]   2> 275 T1882 oascc.SolrZkClient.makePath makePath: /configs/conf1/stopwords.txt
[junit4:junit4]   2> 278 T1882 oasc.AbstractZkTestCase.putConfig put /usr/home/hudson/hudson-slave/workspace/Lucene-Solr-Tests-4.x-Java6/solr/build/solr-core/test-files/solr/collection1/conf/protwords.txt to /configs/conf1/protwords.txt
[junit4:junit4]   2> 279 T1882 oascc.SolrZkClient.makePath makePath: /configs/conf1/protwords.txt
[junit4:junit4]   2> 289 T1882 oasc.AbstractZkTestCase.putConfig put /usr/home/hudson/hudson-slave/workspace/Lucene-Solr-Tests-4.x-Java6/solr/build/solr-core/test-files/solr/collection1/conf/currency.xml to /configs/conf1/currency.xml
[junit4:junit4]   2> 290 T1882 oascc.SolrZkClient.makePath makePath: /configs/conf1/currency.xml
[junit4:junit4]   2> 293 T1882 oasc.AbstractZkTestCase.putConfig put /usr/home/hudson/hudson-slave/workspace/Lucene-Solr-Tests-4.x-Java6/solr/build/solr-core/test-files/solr/collection1/conf/open-exchange-rates.json to /configs/conf1/open-exchange-rates.json
[junit4:junit4]   2> 294 T1882 oascc.SolrZkClient.makePath makePath: /configs/conf1/open-exchange-rates.json
[junit4:junit4]   2> 296 T1882 oasc.AbstractZkTestCase.putConfig put /usr/home/hudson/hudson-slave/workspace/Lucene-Solr-Tests-4.x-Java6/solr/build/solr-core/test-files/solr/collection1/conf/mapping-ISOLatin1Accent.txt to /configs/conf1/mapping-ISOLatin1Accent.txt
[junit4:junit4]   2> 297 T1882 oascc.SolrZkClient.makePath makePath: /configs/conf1/mapping-ISOLatin1Accent.txt
[junit4:junit4]   2> 300 T1882 oasc.AbstractZkTestCase.putConfig put /usr/home/hudson/hudson-slave/workspace/Lucene-Solr-Tests-4.x-Java6/solr/build/solr-core/test-files/solr/collection1/conf/old_synonyms.txt to /configs/conf1/old_synonyms.txt
[junit4:junit4]   2> 301 T1882 oascc.SolrZkClient.makePath makePath: /configs/conf1/old_synonyms.txt
[junit4:junit4]   2> 304 T1882 oasc.AbstractZkTestCase.putConfig put /usr/home/hudson/hudson-slave/workspace/Lucene-Solr-Tests-4.x-Java6/solr/build/solr-core/test-files/solr/collection1/conf/synonyms.txt to /configs/conf1/synonyms.txt
[junit4:junit4]   2> 304 T1882 oascc.SolrZkClient.makePath makePath: /configs/conf1/synonyms.txt
[junit4:junit4]   2> 307 T1887 oazs.PrepRequestProcessor.pRequest2Txn Processed session termination for sessionid: 0x13c99ffa66b0001
[junit4:junit4]   2> 314 T1891 oaz.ClientCnxn$EventThread.run EventThread shut down
[junit4:junit4]   2> 314 T1884 oazs.NIOServerCnxn.closeSock Closed socket connection for client /140.211.11.196:28623 which had sessionid 0x13c99ffa66b0001
[junit4:junit4]   2> 314 T1882 oaz.ZooKeeper.close Session: 0x13c99ffa66b0001 closed
[junit4:junit4]   2> 474 T1882 oejs.Server.doStart jetty-8.1.8.v20121106
[junit4:junit4]   2> 477 T1882 oejs.AbstractConnector.doStart Started SocketConnector@127.0.0.1:28624
[junit4:junit4]   2> 478 T1882 oass.SolrDispatchFilter.init SolrDispatchFilter.init()
[junit4:junit4]   2> 478 T1882 oasc.SolrResourceLoader.locateSolrHome JNDI not configured for solr (NoInitialContextEx)
[junit4:junit4]   2> 479 T1882 oasc.SolrResourceLoader.locateSolrHome using system property solr.solr.home: /usr/home/hudson/hudson-slave/workspace/Lucene-Solr-Tests-4.x-Java6/solr/build/solr-core/test/J0/./org.apache.solr.cloud.SyncSliceTest-controljetty-1359793334166
[junit4:junit4]   2> 479 T1882 oasc.CoreContainer$Initializer.initialize looking for solr.xml: /usr/home/hudson/hudson-slave/workspace/Lucene-Solr-Tests-4.x-Java6/solr/build/solr-core/test/J0/./org.apache.solr.cloud.SyncSliceTest-controljetty-1359793334166/solr.xml
[junit4:junit4]   2> 480 T1882 oasc.CoreContainer.<init> New CoreContainer 869460229
[junit4:junit4]   2> 480 T1882 oasc.CoreContainer.load Loading CoreContainer using Solr Home: '/usr/home/hudson/hudson-slave/workspace/Lucene-Solr-Tests-4.x-Java6/solr/build/solr-core/test/J0/./org.apache.solr.cloud.SyncSliceTest-controljetty-1359793334166/'
[junit4:junit4]   2> 481 T1882 oasc.SolrResourceLoader.<init> new SolrResourceLoader for directory: '/usr/home/hudson/hudson-slave/workspace/Lucene-Solr-Tests-4.x-Java6/solr/build/solr-core/test/J0/./org.apache.solr.cloud.SyncSliceTest-controljetty-1359793334166/'
[junit4:junit4]   2> 522 T1882 oashc.HttpShardHandlerFactory.getParameter Setting socketTimeout to: 60000
[junit4:junit4]   2> 523 T1882 oashc.HttpShardHandlerFactory.getParameter Setting urlScheme to: http://
[junit4:junit4]   2> 523 T1882 oashc.HttpShardHandlerFactory.getParameter Setting connTimeout to: 15000
[junit4:junit4]   2> 524 T1882 oashc.HttpShardHandlerFactory.getParameter Setting maxConnectionsPerHost to: 20
[junit4:junit4]   2> 524 T1882 oashc.HttpShardHandlerFactory.getParameter Setting corePoolSize to: 0
[junit4:junit4]   2> 524 T1882 oashc.HttpShardHandlerFactory.getParameter Setting maximumPoolSize to: 2147483647
[junit4:junit4]   2> 525 T1882 oashc.HttpShardHandlerFactory.getParameter Setting maxThreadIdleTime to: 5
[junit4:junit4]   2> 525 T1882 oashc.HttpShardHandlerFactory.getParameter Setting sizeOfQueue to: -1
[junit4:junit4]   2> 526 T1882 oashc.HttpShardHandlerFactory.getParameter Setting fairnessPolicy to: false
[junit4:junit4]   2> 526 T1882 oascsi.HttpClientUtil.createClient Creating new http client, config:maxConnectionsPerHost=20&maxConnections=10000&socketTimeout=60000&connTimeout=15000&retry=false
[junit4:junit4]   2> 545 T1882 oasc.CoreContainer.load Registering Log Listener
[junit4:junit4]   2> 562 T1882 oasc.CoreContainer.initZooKeeper Zookeeper client=127.0.0.1:28621/solr
[junit4:junit4]   2> 563 T1882 oasc.ZkController.checkChrootPath zkHost includes chroot
[junit4:junit4]   2> 563 T1882 oaz.ZooKeeper.<init> Initiating client connection, connectString=127.0.0.1:28621 sessionTimeout=60000 watcher=org.apache.solr.common.cloud.ConnectionManager@33579950
[junit4:junit4]   2> 564 T1882 oascc.ConnectionManager.waitForConnected Waiting for client to connect to ZooKeeper
[junit4:junit4]   2> 565 T1901 oaz.ClientCnxn$SendThread.logStartConnect Opening socket connection to server localhost/127.0.0.1:28621. Will not attempt to authenticate using SASL (access denied (javax.security.auth.AuthPermission getLoginConfiguration))
[junit4:junit4]   2> 565 T1901 oaz.ClientCnxn$SendThread.primeConnection Socket connection established to localhost/127.0.0.1:28621, initiating session
[junit4:junit4]   2> 566 T1884 oazs.NIOServerCnxnFactory.run Accepted socket connection from /140.211.11.196:28625
[junit4:junit4]   2> 566 T1884 oazs.ZooKeeperServer.processConnectRequest Client attempting to establish new session at /140.211.11.196:28625
[junit4:junit4]   2> 568 T1886 oazs.ZooKeeperServer.finishSessionInit Established session 0x13c99ffa66b0002 with negotiated timeout 20000 for client /140.211.11.196:28625
[junit4:junit4]   2> 568 T1901 oaz.ClientCnxn$SendThread.onConnected Session establishment complete on server localhost/127.0.0.1:28621, sessionid = 0x13c99ffa66b0002, negotiated timeout = 20000
[junit4:junit4]   2> 568 T1902 oascc.ConnectionManager.process Watcher org.apache.solr.common.cloud.ConnectionManager@33579950 name:ZooKeeperConnection Watcher:127.0.0.1:28621 got event WatchedEvent state:SyncConnected type:None path:null path:null type:None
[junit4:junit4]   2> 568 T1882 oascc.ConnectionManager.waitForConnected Client is connected to ZooKeeper
[junit4:junit4]   2> 569 T1887 oazs.PrepRequestProcessor.pRequest2Txn Processed session termination for sessionid: 0x13c99ffa66b0002
[junit4:junit4]   2> 570 T1902 oaz.ClientCnxn$EventThread.run EventThread shut down
[junit4:junit4]   2> 570 T1884 oazs.NIOServerCnxn.closeSock Closed socket connection for client /140.211.11.196:28625 which had sessionid 0x13c99ffa66b0002
[junit4:junit4]   2> 570 T1882 oaz.ZooKeeper.close Session: 0x13c99ffa66b0002 closed
[junit4:junit4]   2> 571 T1882 oascsi.HttpClientUtil.createClient Creating new http client, config:maxConnections=500&maxConnectionsPerHost=16&socketTimeout=60000&connTimeout=15000
[junit4:junit4]   2> 580 T1882 oaz.ZooKeeper.<init> Initiating client connection, connectString=127.0.0.1:28621/solr sessionTimeout=30000 watcher=org.apache.solr.common.cloud.ConnectionManager@396957cc
[junit4:junit4]   2> 581 T1882 oascc.ConnectionManager.waitForConnected Waiting for client to connect to ZooKeeper
[junit4:junit4]   2> 581 T1903 oaz.ClientCnxn$SendThread.logStartConnect Opening socket connection to server localhost/127.0.0.1:28621. Will not attempt to authenticate using SASL (access denied (javax.security.auth.AuthPermission getLoginConfiguration))
[junit4:junit4]   2> 582 T1903 oaz.ClientCnxn$SendThread.primeConnection Socket connection established to localhost/127.0.0.1:28621, initiating session
[junit4:junit4]   2> 582 T1884 oazs.NIOServerCnxnFactory.run Accepted socket connection from /140.211.11.196:28626
[junit4:junit4]   2> 582 T1884 oazs.ZooKeeperServer.processConnectRequest Client attempting to establish new session at /140.211.11.196:28626
[junit4:junit4]   2> 583 T1886 oazs.ZooKeeperServer.finishSessionInit Established session 0x13c99ffa66b0003 with negotiated timeout 20000 for client /140.211.11.196:28626
[junit4:junit4]   2> 583 T1903 oaz.ClientCnxn$SendThread.onConnected Session establishment complete on server localhost/127.0.0.1:28621, sessionid = 0x13c99ffa66b0003, negotiated timeout = 20000
[junit4:junit4]   2> 584 T1904 oascc.ConnectionManager.process Watcher org.apache.solr.common.cloud.ConnectionManager@396957cc name:ZooKeeperConnection Watcher:127.0.0.1:28621/solr got event WatchedEvent state:SyncConnected type:None path:null path:null type:None
[junit4:junit4]   2> 584 T1882 oascc.ConnectionManager.waitForConnected Client is connected to ZooKeeper
[junit4:junit4]   2> 586 T1887 oazs.PrepRequestProcessor.pRequest Got user-level KeeperException when processing sessionid:0x13c99ffa66b0003 type:create cxid:0x2 zxid:0x1a txntype:-1 reqpath:n/a Error Path:/solr/overseer Error:KeeperErrorCode = NodeExists for /solr/overseer
[junit4:junit4]   2> 587 T1882 oascc.SolrZkClient.makePath makePath: /live_nodes
[junit4:junit4]   2> 596 T1882 oasc.ZkController.createEphemeralLiveNode Register node as live in ZooKeeper:/live_nodes/127.0.0.1:28624__f
[junit4:junit4]   2> 596 T1887 oazs.PrepRequestProcessor.pRequest Got user-level KeeperException when processing sessionid:0x13c99ffa66b0003 type:delete cxid:0x7 zxid:0x1c txntype:-1 reqpath:n/a Error Path:/solr/live_nodes/127.0.0.1:28624__f Error:KeeperErrorCode = NoNode for /solr/live_nodes/127.0.0.1:28624__f
[junit4:junit4]   2> 597 T1882 oascc.SolrZkClient.makePath makePath: /live_nodes/127.0.0.1:28624__f
[junit4:junit4]   2> 600 T1882 oascc.SolrZkClient.makePath makePath: /overseer_elect/election
[junit4:junit4]   2> 613 T1887 oazs.PrepRequestProcessor.pRequest Got user-level KeeperException when processing sessionid:0x13c99ffa66b0003 type:delete cxid:0x15 zxid:0x21 txntype:-1 reqpath:n/a Error Path:/solr/overseer_elect/leader Error:KeeperErrorCode = NoNode for /solr/overseer_elect/leader
[junit4:junit4]   2> 614 T1882 oascc.SolrZkClient.makePath makePath: /overseer_elect/leader
[junit4:junit4]   2> 616 T1882 oasc.Overseer.start Overseer (id=89115415928307715-127.0.0.1:28624__f-n_0000000000) starting
[junit4:junit4]   2> 617 T1887 oazs.PrepRequestProcessor.pRequest Got user-level KeeperException when processing sessionid:0x13c99ffa66b0003 type:create cxid:0x1a zxid:0x23 txntype:-1 reqpath:n/a Error Path:/solr/overseer Error:KeeperErrorCode = NodeExists for /solr/overseer
[junit4:junit4]   2> 618 T1887 oazs.PrepRequestProcessor.pRequest Got user-level KeeperException when processing sessionid:0x13c99ffa66b0003 type:create cxid:0x1b zxid:0x24 txntype:-1 reqpath:n/a Error Path:/solr/overseer Error:KeeperErrorCode = NodeExists for /solr/overseer
[junit4:junit4]   2> 627 T1887 oazs.PrepRequestProcessor.pRequest Got user-level KeeperException when processing sessionid:0x13c99ffa66b0003 type:create cxid:0x1c zxid:0x25 txntype:-1 reqpath:n/a Error Path:/solr/overseer Error:KeeperErrorCode = NodeExists for /solr/overseer
[junit4:junit4]   2> 628 T1887 oazs.PrepRequestProcessor.pRequest Got user-level KeeperException when processing sessionid:0x13c99ffa66b0003 type:create cxid:0x1d zxid:0x26 txntype:-1 reqpath:n/a Error Path:/solr/overseer Error:KeeperErrorCode = NodeExists for /solr/overseer
[junit4:junit4]   2> 629 T1906 oasc.OverseerCollectionProcessor.run Process current queue of collection creations
[junit4:junit4]   2> 630 T1882 oascc.SolrZkClient.makePath makePath: /clusterstate.json
[junit4:junit4]   2> 643 T1882 oascc.ZkStateReader.createClusterStateWatchersAndUpdate Updating cluster state from ZooKeeper... 
[junit4:junit4]   2> 645 T1905 oasc.Overseer$ClusterStateUpdater.run Starting to work on the main queue
[junit4:junit4]   2> 650 T1907 oasc.CoreContainer.create Creating SolrCore 'collection1' using instanceDir: /usr/home/hudson/hudson-slave/workspace/Lucene-Solr-Tests-4.x-Java6/solr/build/solr-core/test/J0/./org.apache.solr.cloud.SyncSliceTest-controljetty-1359793334166/collection1
[junit4:junit4]   2> 650 T1907 oasc.ZkController.createCollectionZkNode Check for collection zkNode:control_collection
[junit4:junit4]   2> 651 T1907 oasc.ZkController.createCollectionZkNode Collection zkNode exists
[junit4:junit4]   2> 651 T1907 oasc.ZkController.readConfigName Load collection config from:/collections/control_collection
[junit4:junit4]   2> 652 T1907 oasc.SolrResourceLoader.<init> new SolrResourceLoader for directory: '/usr/home/hudson/hudson-slave/workspace/Lucene-Solr-Tests-4.x-Java6/solr/build/solr-core/test/J0/./org.apache.solr.cloud.SyncSliceTest-controljetty-1359793334166/collection1/'
[junit4:junit4]   2> 653 T1907 oasc.SolrResourceLoader.replaceClassLoader Adding 'file:/usr/home/hudson/hudson-slave/workspace/Lucene-Solr-Tests-4.x-Java6/solr/build/solr-core/test/J0/org.apache.solr.cloud.SyncSliceTest-controljetty-1359793334166/collection1/lib/README' to classloader
[junit4:junit4]   2> 654 T1907 oasc.SolrResourceLoader.replaceClassLoader Adding 'file:/usr/home/hudson/hudson-slave/workspace/Lucene-Solr-Tests-4.x-Java6/solr/build/solr-core/test/J0/org.apache.solr.cloud.SyncSliceTest-controljetty-1359793334166/collection1/lib/classes/' to classloader
[junit4:junit4]   2> 704 T1907 oasc.SolrConfig.<init> Using Lucene MatchVersion: LUCENE_42
[junit4:junit4]   2> 774 T1907 oasc.SolrConfig.<init> Loaded SolrConfig: solrconfig.xml
[junit4:junit4]   2> 875 T1907 oass.IndexSchema.readSchema Reading Solr Schema
[junit4:junit4]   2> 881 T1907 oass.IndexSchema.readSchema Schema name=test
[junit4:junit4]   2> 1482 T1907 oass.OpenExchangeRatesOrgProvider.init Initialized with rates=open-exchange-rates.json, refreshInterval=1440.
[junit4:junit4]   2> 1493 T1907 oass.IndexSchema.readSchema default search field in schema is text
[junit4:junit4]   2> 1497 T1907 oass.IndexSchema.readSchema unique key field: id
[junit4:junit4]   2> 1509 T1907 oass.FileExchangeRateProvider.reload Reloading exchange rates from file currency.xml
[junit4:junit4]   2> 1514 T1907 oass.FileExchangeRateProvider.reload Reloading exchange rates from file currency.xml
[junit4:junit4]   2> 1518 T1907 oass.OpenExchangeRatesOrgProvider.reload Reloading exchange rates from open-exchange-rates.json
[junit4:junit4]   2> 1519 T1907 oass.OpenExchangeRatesOrgProvider.reload Reloading exchange rates from open-exchange-rates.json
[junit4:junit4]   2> 1520 T1907 oasc.SolrCore.<init> [collection1] Opening new SolrCore at /usr/home/hudson/hudson-slave/workspace/Lucene-Solr-Tests-4.x-Java6/solr/build/solr-core/test/J0/./org.apache.solr.cloud.SyncSliceTest-controljetty-1359793334166/collection1/, dataDir=./org.apache.solr.cloud.SyncSliceTest-1359793333856/control/data/
[junit4:junit4]   2> 1520 T1907 oasc.JmxMonitoredMap.<init> JMX monitoring is enabled. Adding Solr mbeans to JMX Server: com.sun.jmx.mbeanserver.JmxMBeanServer@2e097617
[junit4:junit4]   2> 1521 T1907 oasc.SolrCore.initDirectoryFactory solr.NRTCachingDirectoryFactory
[junit4:junit4]   2> 1555 T1907 oasc.CachingDirectoryFactory.get return new directory for /usr/home/hudson/hudson-slave/workspace/Lucene-Solr-Tests-4.x-Java6/solr/build/solr-core/test/J0/./org.apache.solr.cloud.SyncSliceTest-1359793333856/control/data forceNew:false
[junit4:junit4]   2> 1556 T1907 oasc.CachingDirectoryFactory.close Releasing directory:/usr/home/hudson/hudson-slave/workspace/Lucene-Solr-Tests-4.x-Java6/solr/build/solr-core/test/J0/./org.apache.solr.cloud.SyncSliceTest-1359793333856/control/data
[junit4:junit4]   2> 1556 T1907 oasc.SolrCore.getNewIndexDir New index directory detected: old=null new=./org.apache.solr.cloud.SyncSliceTest-1359793333856/control/data/index/
[junit4:junit4]   2> 1557 T1907 oasc.SolrCore.initIndex WARNING [collection1] Solr index directory './org.apache.solr.cloud.SyncSliceTest-1359793333856/control/data/index' doesn't exist. Creating new index...
[junit4:junit4]   2> 1558 T1907 oasc.CachingDirectoryFactory.get return new directory for /usr/home/hudson/hudson-slave/workspace/Lucene-Solr-Tests-4.x-Java6/solr/build/solr-core/test/J0/./org.apache.solr.cloud.SyncSliceTest-1359793333856/control/data/index forceNew:false
[junit4:junit4]   2> 1566 T1907 oasc.SolrDeletionPolicy.onCommit SolrDeletionPolicy.onCommit: commits:num=1
[junit4:junit4]   2> 		commit{dir=RateLimitedDirectoryWrapper(NRTCachingDirectory(org.apache.lucene.store.NIOFSDirectory@/usr/home/hudson/hudson-slave/workspace/Lucene-Solr-Tests-4.x-Java6/solr/build/solr-core/test/J0/org.apache.solr.cloud.SyncSliceTest-1359793333856/control/data/index lockFactory=org.apache.lucene.store.NativeFSLockFactory@33c2b8a4; maxCacheMB=48.0 maxMergeSizeMB=4.0)),segFN=segments_1,generation=1,filenames=[segments_1]
[junit4:junit4]   2> 1566 T1907 oasc.SolrDeletionPolicy.updateCommits newest commit = 1[segments_1]
[junit4:junit4]   2> 1567 T1907 oasc.CachingDirectoryFactory.close Releasing directory:/usr/home/hudson/hudson-slave/workspace/Lucene-Solr-Tests-4.x-Java6/solr/build/solr-core/test/J0/./org.apache.solr.cloud.SyncSliceTest-1359793333856/control/data/index
[junit4:junit4]   2> 1567 T1907 oasc.SolrCore.initWriters created xml: solr.XMLResponseWriter
[junit4:junit4]   2> 1569 T1907 oasup.UpdateRequestProcessorChain.init inserting DistributedUpdateProcessorFactory into updateRequestProcessorChain "dedupe"
[junit4:junit4]   2> 1569 T1907 oasup.UpdateRequestProcessorChain.init inserting DistributedUpdateProcessorFactory into updateRequestProcessorChain "dedupe-allfields"
[junit4:junit4]   2> 1570 T1907 oasup.UpdateRequestProcessorChain.init inserting DistributedUpdateProcessorFactory into updateRequestProcessorChain "stored_sig"
[junit4:junit4]   2> 1570 T1907 oasup.UpdateRequestProcessorChain.init inserting DistributedUpdateProcessorFactory into updateRequestProcessorChain "uniq-fields"
[junit4:junit4]   2> 1571 T1907 oasup.UpdateRequestProcessorChain.init inserting DistributedUpdateProcessorFactory into updateRequestProcessorChain "distrib-dup-test-chain-implicit"
[junit4:junit4]   2> 1571 T1907 oasc.RequestHandlers.initHandlersFromConfig adding lazy requestHandler: solr.ReplicationHandler
[junit4:junit4]   2> 1571 T1907 oasc.RequestHandlers.initHandlersFromConfig created /replication: solr.ReplicationHandler
[junit4:junit4]   2> 1572 T1907 oasc.RequestHandlers.initHandlersFromConfig created standard: solr.StandardRequestHandler
[junit4:junit4]   2> 1572 T1907 oasc.RequestHandlers.initHandlersFromConfig created /get: solr.RealTimeGetHandler
[junit4:junit4]   2> 1572 T1907 oasc.RequestHandlers.initHandlersFromConfig created dismax: solr.SearchHandler
[junit4:junit4]   2> 1573 T1907 oasc.RequestHandlers.initHandlersFromConfig created mock: org.apache.solr.core.MockQuerySenderListenerReqHandler
[junit4:junit4]   2> 1573 T1907 oasc.RequestHandlers.initHandlersFromConfig created /admin/: org.apache.solr.handler.admin.AdminHandlers
[junit4:junit4]   2> 1574 T1907 oasc.RequestHandlers.initHandlersFromConfig created defaults: solr.StandardRequestHandler
[junit4:junit4]   2> 1574 T1907 oasc.RequestHandlers.initHandlersFromConfig adding lazy requestHandler: solr.StandardRequestHandler
[junit4:junit4]   2> 1574 T1907 oasc.RequestHandlers.initHandlersFromConfig created lazy: solr.StandardRequestHandler
[junit4:junit4]   2> 1575 T1907 oasc.RequestHandlers.initHandlersFromConfig created /update: solr.UpdateRequestHandler
[junit4:junit4]   2> 1575 T1907 oasc.RequestHandlers.initHandlersFromConfig created /terms: org.apache.solr.handler.component.SearchHandler
[junit4:junit4]   2> 1575 T1907 oasc.RequestHandlers.initHandlersFromConfig created spellCheckCompRH: org.apache.solr.handler.component.SearchHandler
[junit4:junit4]   2> 1576 T1907 oasc.RequestHandlers.initHandlersFromConfig created spellCheckCompRH_Direct: org.apache.solr.handler.component.SearchHandler
[junit4:junit4]   2> 1576 T1907 oasc.RequestHandlers.initHandlersFromConfig created spellCheckWithWordbreak: org.apache.solr.handler.component.SearchHandler
[junit4:junit4]   2> 1577 T1907 oasc.RequestHandlers.initHandlersFromConfig created spellCheckWithWordbreak_Direct: org.apache.solr.handler.component.SearchHandler
[junit4:junit4]   2> 1577 T1907 oasc.RequestHandlers.initHandlersFromConfig created spellCheckCompRH1: org.apache.solr.handler.component.SearchHandler
[junit4:junit4]   2> 1577 T1907 oasc.RequestHandlers.initHandlersFromConfig created mltrh: org.apache.solr.handler.component.SearchHandler
[junit4:junit4]   2> 1578 T1907 oasc.RequestHandlers.initHandlersFromConfig created tvrh: org.apache.solr.handler.component.SearchHandler
[junit4:junit4]   2> 1578 T1907 oasc.RequestHandlers.initHandlersFromConfig created /mlt: solr.MoreLikeThisHandler
[junit4:junit4]   2> 1579 T1907 oasc.RequestHandlers.initHandlersFromConfig created /debug/dump: solr.DumpRequestHandler
[junit4:junit4]   2> 1586 T1907 oashl.XMLLoader.init xsltCacheLifetimeSeconds=60
[junit4:junit4]   2> 1591 T1907 oasc.SolrCore.initDeprecatedSupport WARNING solrconfig.xml uses deprecated <admin/gettableFiles>, Please update your config to use the ShowFileRequestHandler.
[junit4:junit4]   2> 1592 T1907 oasc.SolrCore.initDeprecatedSupport WARNING adding ShowFileRequestHandler with hidden files: [SCHEMA.XML, OLD_SYNONYMS.TXT, STOPWORDS.TXT, PROTWORDS.TXT, OPEN-EXCHANGE-RATES.JSON, SYNONYMS.TXT, CURRENCY.XML, MAPPING-ISOLATIN1ACCENT.TXT]
[junit4:junit4]   2> 1595 T1907 oasc.CachingDirectoryFactory.close Releasing directory:/usr/home/hudson/hudson-slave/workspace/Lucene-Solr-Tests-4.x-Java6/solr/build/solr-core/test/J0/./org.apache.solr.cloud.SyncSliceTest-1359793333856/control/data
[junit4:junit4]   2> 1596 T1907 oass.SolrIndexSearcher.<init> Opening Searcher@2967d2b4 main
[junit4:junit4]   2> 1598 T1907 oasu.CommitTracker.<init> Hard AutoCommit: disabled
[junit4:junit4]   2> 1598 T1907 oasu.CommitTracker.<init> Soft AutoCommit: disabled
[junit4:junit4]   2> 1598 T1907 oashc.SpellCheckComponent.inform Initializing spell checkers
[junit4:junit4]   2> 1606 T1907 oass.DirectSolrSpellChecker.init init: {name=direct,classname=DirectSolrSpellChecker,field=lowerfilt,minQueryLength=3}
[junit4:junit4]   2> 1670 T1908 oasc.SolrCore.registerSearcher [collection1] Registered new searcher Searcher@2967d2b4 main{StandardDirectoryReader(segments_1:1)}
[junit4:junit4]   2> 1674 T1907 oasc.ZkController.publish publishing core=collection1 state=down
[junit4:junit4]   2> 1674 T1907 oasc.ZkController.publish numShards not found on descriptor - reading it from system property
[junit4:junit4]   2> 1675 T1887 oazs.PrepRequestProcessor.pRequest Got user-level KeeperException when processing sessionid:0x13c99ffa66b0003 type:create cxid:0x50 zxid:0x29 txntype:-1 reqpath:n/a Error Path:/solr/overseer/queue Error:KeeperErrorCode = NoNode for /solr/overseer/queue
[junit4:junit4]   2> 2148 T1905 oascc.ZkStateReader.updateClusterState Updating cloud state from ZooKeeper... 
[junit4:junit4]   2> 2149 T1905 oasc.Overseer$ClusterStateUpdater.updateState Update state numShards=1 message={
[junit4:junit4]   2> 	  "operation":"state",
[junit4:junit4]   2> 	  "numShards":"1",
[junit4:junit4]   2> 	  "shard":null,
[junit4:junit4]   2> 	  "roles":null,
[junit4:junit4]   2> 	  "state":"down",
[junit4:junit4]   2> 	  "core":"collection1",
[junit4:junit4]   2> 	  "collection":"control_collection",
[junit4:junit4]   2> 	  "node_name":"127.0.0.1:28624__f",
[junit4:junit4]   2> 	  "base_url":"http://127.0.0.1:28624/_f"}
[junit4:junit4]   2> 2149 T1905 oasc.Overseer$ClusterStateUpdater.createCollection Create collection control_collection with numShards 1
[junit4:junit4]   2> 2149 T1905 oasc.Overseer$ClusterStateUpdater.updateState Assigning new node to shard shard=shard1
[junit4:junit4]   2> 2150 T1887 oazs.PrepRequestProcessor.pRequest Got user-level KeeperException when processing sessionid:0x13c99ffa66b0003 type:create cxid:0x58 zxid:0x2c txntype:-1 reqpath:n/a Error Path:/solr/overseer/queue-work Error:KeeperErrorCode = NoNode for /solr/overseer/queue-work
[junit4:junit4]   2> 2170 T1904 oascc.ZkStateReader$2.process A cluster state change: WatchedEvent state:SyncConnected type:NodeDataChanged path:/clusterstate.json, has occurred - updating... (live nodes size: 1)
[junit4:junit4]   2> 2688 T1907 oasc.CoreContainer.registerCore registering core: collection1
[junit4:junit4]   2> 2688 T1907 oasc.ZkController.register Register replica - core:collection1 address:http://127.0.0.1:28624/_f collection:control_collection shard:shard1
[junit4:junit4]   2> 2689 T1907 oascc.SolrZkClient.makePath makePath: /collections/control_collection/leader_elect/shard1/election
[junit4:junit4]   2> 2714 T1887 oazs.PrepRequestProcessor.pRequest Got user-level KeeperException when processing sessionid:0x13c99ffa66b0003 type:delete cxid:0x72 zxid:0x36 txntype:-1 reqpath:n/a Error Path:/solr/collections/control_collection/leaders Error:KeeperErrorCode = NoNode for /solr/collections/control_collection/leaders
[junit4:junit4]   2> 2724 T1907 oasc.ShardLeaderElectionContext.runLeaderProcess Running the leader process.
[junit4:junit4]   2> 2725 T1887 oazs.PrepRequestProcessor.pRequest Got user-level KeeperException when processing sessionid:0x13c99ffa66b0003 type:create cxid:0x73 zxid:0x37 txntype:-1 reqpath:n/a Error Path:/solr/overseer Error:KeeperErrorCode = NodeExists for /solr/overseer
[junit4:junit4]   2> 2749 T1907 oasc.ShardLeaderElectionContext.waitForReplicasToComeUp Enough replicas found to continue.
[junit4:junit4]   2> 2749 T1907 oasc.ShardLeaderElectionContext.runLeaderProcess I may be the new leader - try and sync
[junit4:junit4]   2> 2749 T1907 oasc.SyncStrategy.sync Sync replicas to http://127.0.0.1:28624/_f/collection1/
[junit4:junit4]   2> 2749 T1907 oasc.SyncStrategy.syncReplicas Sync Success - now sync replicas to me
[junit4:junit4]   2> 2750 T1907 oasc.SyncStrategy.syncToMe http://127.0.0.1:28624/_f/collection1/ has no replicas
[junit4:junit4]   2> 2750 T1907 oasc.ShardLeaderElectionContext.runLeaderProcess I am the new leader: http://127.0.0.1:28624/_f/collection1/
[junit4:junit4]   2> 2750 T1907 oascc.SolrZkClient.makePath makePath: /collections/control_collection/leaders/shard1
[junit4:junit4]   2> 2767 T1887 oazs.PrepRequestProcessor.pRequest Got user-level KeeperException when processing sessionid:0x13c99ffa66b0003 type:create cxid:0x7d zxid:0x3b txntype:-1 reqpath:n/a Error Path:/solr/overseer Error:KeeperErrorCode = NodeExists for /solr/overseer
[junit4:junit4]   2> 3674 T1905 oascc.ZkStateReader.updateClusterState Updating cloud state from ZooKeeper... 
[junit4:junit4]   2> 3719 T1904 oascc.ZkStateReader$2.process A cluster state change: WatchedEvent state:SyncConnected type:NodeDataChanged path:/clusterstate.json, has occurred - updating... (live nodes size: 1)
[junit4:junit4]   2> 3753 T1907 oasc.ZkController.register We are http://127.0.0.1:28624/_f/collection1/ and leader is http://127.0.0.1:28624/_f/collection1/
[junit4:junit4]   2> 3753 T1907 oasc.ZkController.register No LogReplay needed for core=collection1 baseURL=http://127.0.0.1:28624/_f
[junit4:junit4]   2> 3753 T1907 oasc.ZkController.checkRecovery I am the leader, no recovery necessary
[junit4:junit4]   2> 3753 T1907 oasc.ZkController.publish publishing core=collection1 state=active
[junit4:junit4]   2> 3753 T1907 oasc.ZkController.publish numShards not found on descriptor - reading it from system property
[junit4:junit4]   2> 3755 T1907 oascc.ZkStateReader.updateClusterState Updating cloud state from ZooKeeper... 
[junit4:junit4]   2> 3756 T1882 oass.SolrDispatchFilter.init user.dir=/usr/home/hudson/hudson-slave/workspace/Lucene-Solr-Tests-4.x-Java6/solr/build/solr-core/test/J0
[junit4:junit4]   2> 3757 T1882 oass.SolrDispatchFilter.init SolrDispatchFilter.init() done
[junit4:junit4]   2> 3757 T1882 oascsi.HttpClientUtil.createClient Creating new http client, config:maxConnections=128&maxConnectionsPerHost=32&followRedirects=false
[junit4:junit4]   2> 3770 T1882 oascsi.HttpClientUtil.createClient Creating new http client, config:
[junit4:junit4]   2> 3778 T1882 oaz.ZooKeeper.<init> Initiating client connection, connectString=127.0.0.1:28621/solr sessionTimeout=10000 watcher=org.apache.solr.common.cloud.ConnectionManager@3e144c38
[junit4:junit4]   2> 3779 T1882 oascc.ConnectionManager.waitForConnected Waiting for client to connect to ZooKeeper
[junit4:junit4]   2> 3780 T1909 oaz.ClientCnxn$SendThread.logStartConnect Opening socket connection to server localhost/127.0.0.1:28621. Will not attempt to authenticate using SASL (access denied (javax.security.auth.AuthPermission getLoginConfiguration))
[junit4:junit4]   2> 3780 T1909 oaz.ClientCnxn$SendThread.primeConnection Socket connection established to localhost/127.0.0.1:28621, initiating session
[junit4:junit4]   2> 3780 T1884 oazs.NIOServerCnxnFactory.run Accepted socket connection from /140.211.11.196:28652
[junit4:junit4]   2> 3781 T1884 oazs.ZooKeeperServer.processConnectRequest Client attempting to establish new session at /140.211.11.196:28652
[junit4:junit4]   2> 3782 T1886 oazs.ZooKeeperServer.finishSessionInit Established session 0x13c99ffa66b0004 with negotiated timeout 10000 for client /140.211.11.196:28652
[junit4:junit4]   2> 3782 T1909 oaz.ClientCnxn$SendThread.onConnected Session establishment complete on server localhost/127.0.0.1:28621, sessionid = 0x13c99ffa66b0004, negotiated timeout = 10000
[junit4:junit4]   2> 3782 T1910 oascc.ConnectionManager.process Watcher org.apache.solr.common.cloud.ConnectionManager@3e144c38 name:ZooKeeperConnection Watcher:127.0.0.1:28621/solr got event WatchedEvent state:SyncConnected type:None path:null path:null type:None
[junit4:junit4]   2> 3783 T1882 oascc.ConnectionManager.waitForConnected Client is connected to ZooKeeper
[junit4:junit4]   2> 3784 T1882 oascc.ZkStateReader.createClusterStateWatchersAndUpdate Updating cluster state from ZooKeeper... 
[junit4:junit4]   2> 3786 T1882 oasc.ChaosMonkey.monkeyLog monkey: init - expire sessions:true cause connection loss:true
[junit4:junit4]   2> 3946 T1882 oejs.Server.doStart jetty-8.1.8.v20121106
[junit4:junit4]   2> 3949 T1882 oejs.AbstractConnector.doStart Started SocketConnector@127.0.0.1:28653
[junit4:junit4]   2> 3949 T1882 oass.SolrDispatchFilter.init SolrDispatchFilter.init()
[junit4:junit4]   2> 3950 T1882 oasc.SolrResourceLoader.locateSolrHome JNDI not configured for solr (NoInitialContextEx)
[junit4:junit4]   2> 3950 T1882 oasc.SolrResourceLoader.locateSolrHome using system property solr.solr.home: /usr/home/hudson/hudson-slave/workspace/Lucene-Solr-Tests-4.x-Java6/solr/build/solr-core/test/J0/./org.apache.solr.cloud.SyncSliceTest-jetty1-1359793337637
[junit4:junit4]   2> 3951 T1882 oasc.CoreContainer$Initializer.initialize looking for solr.xml: /usr/home/hudson/hudson-slave/workspace/Lucene-Solr-Tests-4.x-Java6/solr/build/solr-core/test/J0/./org.apache.solr.cloud.SyncSliceTest-jetty1-1359793337637/solr.xml
[junit4:junit4]   2> 3951 T1882 oasc.CoreContainer.<init> New CoreContainer 1102158838
[junit4:junit4]   2> 3952 T1882 oasc.CoreContainer.load Loading CoreContainer using Solr Home: '/usr/home/hudson/hudson-slave/workspace/Lucene-Solr-Tests-4.x-Java6/solr/build/solr-core/test/J0/./org.apache.solr.cloud.SyncSliceTest-jetty1-1359793337637/'
[junit4:junit4]   2> 3952 T1882 oasc.SolrResourceLoader.<init> new SolrResourceLoader for directory: '/usr/home/hudson/hudson-slave/workspace/Lucene-Solr-Tests-4.x-Java6/solr/build/solr-core/test/J0/./org.apache.solr.cloud.SyncSliceTest-jetty1-1359793337637/'
[junit4:junit4]   2> 3993 T1882 oashc.HttpShardHandlerFactory.getParameter Setting socketTimeout to: 60000
[junit4:junit4]   2> 3994 T1882 oashc.HttpShardHandlerFactory.getParameter Setting urlScheme to: http://
[junit4:junit4]   2> 3994 T1882 oashc.HttpShardHandlerFactory.getParameter Setting connTimeout to: 15000
[junit4:junit4]   2> 3995 T1882 oashc.HttpShardHandlerFactory.getParameter Setting maxConnectionsPerHost to: 20
[junit4:junit4]   2> 3995 T1882 oashc.HttpShardHandlerFactory.getParameter Setting corePoolSize to: 0
[junit4:junit4]   2> 3995 T1882 oashc.HttpShardHandlerFactory.getParameter Setting maximumPoolSize to: 2147483647
[junit4:junit4]   2> 3996 T1882 oashc.HttpShardHandlerFactory.getParameter Setting maxThreadIdleTime to: 5
[junit4:junit4]   2> 3996 T1882 oashc.HttpShardHandlerFactory.getParameter Setting sizeOfQueue to: -1
[junit4:junit4]   2> 3997 T1882 oashc.HttpShardHandlerFactory.getParameter Setting fairnessPolicy to: false
[junit4:junit4]   2> 3997 T1882 oascsi.HttpClientUtil.createClient Creating new http client, config:maxConnectionsPerHost=20&maxConnections=10000&socketTimeout=60000&connTimeout=15000&retry=false
[junit4:junit4]   2> 4015 T1882 oasc.CoreContainer.load Registering Log Listener
[junit4:junit4]   2> 4033 T1882 oasc.CoreContainer.initZooKeeper Zookeeper client=127.0.0.1:28621/solr
[junit4:junit4]   2> 4034 T1882 oasc.ZkController.checkChrootPath zkHost includes chroot
[junit4:junit4]   2> 4034 T1882 oaz.ZooKeeper.<init> Initiating client connection, connectString=127.0.0.1:28621 sessionTimeout=60000 watcher=org.apache.solr.common.cloud.ConnectionManager@5dd1b545
[junit4:junit4]   2> 4035 T1882 oascc.ConnectionManager.waitForConnected Waiting for client to connect to ZooKeeper
[junit4:junit4]   2> 4036 T1920 oaz.ClientCnxn$SendThread.logStartConnect Opening socket connection to server localhost/127.0.0.1:28621. Will not attempt to authenticate using SASL (access denied (javax.security.auth.AuthPermission getLoginConfiguration))
[junit4:junit4]   2> 4037 T1920 oaz.ClientCnxn$SendThread.primeConnection Socket connection established to localhost/127.0.0.1:28621, initiating session
[junit4:junit4]   2> 4037 T1884 oazs.NIOServerCnxnFactory.run Accepted socket connection from /140.211.11.196:28654
[junit4:junit4]   2> 4037 T1884 oazs.ZooKeeperServer.processConnectRequest Client attempting to establish new session at /140.211.11.196:28654
[junit4:junit4]   2> 4039 T1886 oazs.ZooKeeperServer.finishSessionInit Established session 0x13c99ffa66b0005 with negotiated timeout 20000 for client /140.211.11.196:28654
[junit4:junit4]   2> 4039 T1920 oaz.ClientCnxn$SendThread.onConnected Session establishment complete on server localhost/127.0.0.1:28621, sessionid = 0x13c99ffa66b0005, negotiated timeout = 20000
[junit4:junit4]   2> 4039 T1921 oascc.ConnectionManager.process Watcher org.apache.solr.common.cloud.ConnectionManager@5dd1b545 name:ZooKeeperConnection Watcher:127.0.0.1:28621 got event WatchedEvent state:SyncConnected type:None path:null path:null type:None
[junit4:junit4]   2> 4040 T1882 oascc.ConnectionManager.waitForConnected Client is connected to ZooKeeper
[junit4:junit4]   2> 4041 T1887 oazs.PrepRequestProcessor.pRequest2Txn Processed session termination for sessionid: 0x13c99ffa66b0005
[junit4:junit4]   2> 4042 T1921 oaz.ClientCnxn$EventThread.run EventThread shut down
[junit4:junit4]   2> 4042 T1884 oazs.NIOServerCnxn.closeSock Closed socket connection for client /140.211.11.196:28654 which had sessionid 0x13c99ffa66b0005
[junit4:junit4]   2> 4042 T1882 oaz.ZooKeeper.close Session: 0x13c99ffa66b0005 closed
[junit4:junit4]   2> 4043 T1882 oascsi.HttpClientUtil.createClient Creating new http client, config:maxConnections=500&maxConnectionsPerHost=16&socketTimeout=60000&connTimeout=15000
[junit4:junit4]   2> 4052 T1882 oaz.ZooKeeper.<init> Initiating client connection, connectString=127.0.0.1:28621/solr sessionTimeout=30000 watcher=org.apache.solr.common.cloud.ConnectionManager@4774ddcf
[junit4:junit4]   2> 4053 T1882 oascc.ConnectionManager.waitForConnected Waiting for client to connect to ZooKeeper
[junit4:junit4]   2> 4053 T1922 oaz.ClientCnxn$SendThread.logStartConnect Opening socket connection to server localhost/127.0.0.1:28621. Will not attempt to authenticate using SASL (access denied (javax.security.auth.AuthPermission getLoginConfiguration))
[junit4:junit4]   2> 4054 T1922 oaz.ClientCnxn$SendThread.primeConnection Socket connection established to localhost/127.0.0.1:28621, initiating session
[junit4:junit4]   2> 4054 T1884 oazs.NIOServerCnxnFactory.run Accepted socket connection from /140.211.11.196:28655
[junit4:junit4]   2> 4054 T1884 oazs.ZooKeeperServer.processConnectRequest Client attempting to establish new session at /140.211.11.196:28655
[junit4:junit4]   2> 4056 T1886 oazs.ZooKeeperServer.finishSessionInit Established session 0x13c99ffa66b0006 with negotiated timeout 20000 for client /140.211.11.196:28655
[junit4:junit4]   2> 4056 T1922 oaz.ClientCnxn$SendThread.onConnected Session establishment complete on server localhost/127.0.0.1:28621, sessionid = 0x13c99ffa66b0006, negotiated timeout = 20000
[junit4:junit4]   2> 4056 T1923 oascc.ConnectionManager.process Watcher org.apache.solr.common.cloud.ConnectionManager@4774ddcf name:ZooKeeperConnection Watcher:127.0.0.1:28621/solr got event WatchedEvent state:SyncConnected type:None path:null path:null type:None
[junit4:junit4]   2> 4056 T1882 oascc.ConnectionManager.waitForConnected Client is connected to ZooKeeper
[junit4:junit4]   2> 4057 T1887 oazs.PrepRequestProcessor.pRequest Got user-level KeeperException when processing sessionid:0x13c99ffa66b0006 type:create cxid:0x1 zxid:0x49 txntype:-1 reqpath:n/a Error Path:/solr/overseer Error:KeeperErrorCode = NodeExists for /solr/overseer
[junit4:junit4]   2> 4058 T1887 oazs.PrepRequestProcessor.pRequest Got user-level KeeperException when processing sessionid:0x13c99ffa66b0006 type:create cxid:0x2 zxid:0x4a txntype:-1 reqpath:n/a Error Path:/solr/overseer Error:KeeperErrorCode = NodeExists for /solr/overseer
[junit4:junit4]   2> 4068 T1882 oasc.ZkController.createEphemeralLiveNode Register node as live in ZooKeeper:/live_nodes/127.0.0.1:28653__f
[junit4:junit4]   2> 4069 T1887 oazs.PrepRequestProcessor.pRequest Got user-level KeeperException when processing sessionid:0x13c99ffa66b0006 type:delete cxid:0x4 zxid:0x4b txntype:-1 reqpath:n/a Error Path:/solr/live_nodes/127.0.0.1:28653__f Error:KeeperErrorCode = NoNode for /solr/live_nodes/127.0.0.1:28653__f
[junit4:junit4]   2> 4070 T1882 oascc.SolrZkClient.makePath makePath: /live_nodes/127.0.0.1:28653__f
[junit4:junit4]   2> 4073 T1904 oascc.ZkStateReader$3.process Updating live nodes... (2)
[junit4:junit4]   2> 4073 T1910 oascc.ZkStateReader$3.process Updating live nodes... (2)
[junit4:junit4]   2> 4073 T1904 oascc.ZkStateReader$2.process A cluster state change: WatchedEvent state:SyncConnected type:NodeChildrenChanged path:/live_nodes, has occurred - updating... (live nodes size: 2)
[junit4:junit4]   2> 4080 T1882 oascc.ZkStateReader.createClusterStateWatchersAndUpdate Updating cluster state from ZooKeeper... 
[junit4:junit4]   2> 4087 T1924 oasc.CoreContainer.create Creating SolrCore 'collection1' using instanceDir: /usr/home/hudson/hudson-slave/workspace/Lucene-Solr-Tests-4.x-Java6/solr/build/solr-core/test/J0/./org.apache.solr.cloud.SyncSliceTest-jetty1-1359793337637/collection1
[junit4:junit4]   2> 4087 T1924 oasc.ZkController.createCollectionZkNode Check for collection zkNode:collection1
[junit4:junit4]   2> 4088 T1924 oasc.ZkController.createCollectionZkNode Collection zkNode exists
[junit4:junit4]   2> 4088 T1924 oasc.ZkController.readConfigName Load collection config from:/collections/collection1
[junit4:junit4]   2> 4089 T1924 oasc.SolrResourceLoader.<init> new SolrResourceLoader for directory: '/usr/home/hudson/hudson-slave/workspace/Lucene-Solr-Tests-4.x-Java6/solr/build/solr-core/test/J0/./org.apache.solr.cloud.SyncSliceTest-jetty1-1359793337637/collection1/'
[junit4:junit4]   2> 4090 T1924 oasc.SolrResourceLoader.replaceClassLoader Adding 'file:/usr/home/hudson/hudson-slave/workspace/Lucene-Solr-Tests-4.x-Java6/solr/build/solr-core/test/J0/org.apache.solr.cloud.SyncSliceTest-jetty1-1359793337637/collection1/lib/README' to classloader
[junit4:junit4]   2> 4091 T1924 oasc.SolrResourceLoader.replaceClassLoader Adding 'file:/usr/home/hudson/hudson-slave/workspace/Lucene-Solr-Tests-4.x-Java6/solr/build/solr-core/test/J0/org.apache.solr.cloud.SyncSliceTest-jetty1-1359793337637/collection1/lib/classes/' to classloader
[junit4:junit4]   2> 4141 T1924 oasc.SolrConfig.<init> Using Lucene MatchVersion: LUCENE_42
[junit4:junit4]   2> 4211 T1924 oasc.SolrConfig.<init> Loaded SolrConfig: solrconfig.xml
[junit4:junit4]   2> 4312 T1924 oass.IndexSchema.readSchema Reading Solr Schema
[junit4:junit4]   2> 4318 T1924 oass.IndexSchema.readSchema Schema name=test
[junit4:junit4]   2> 4913 T1924 oass.OpenExchangeRatesOrgProvider.init Initialized with rates=open-exchange-rates.json, refreshInterval=1440.
[junit4:junit4]   2> 4924 T1924 oass.IndexSchema.readSchema default search field in schema is text
[junit4:junit4]   2> 4928 T1924 oass.IndexSchema.readSchema unique key field: id
[junit4:junit4]   2> 4942 T1924 oass.FileExchangeRateProvider.reload Reloading exchange rates from file currency.xml
[junit4:junit4]   2> 4947 T1924 oass.FileExchangeRateProvider.reload Reloading exchange rates from file currency.xml
[junit4:junit4]   2> 4951 T1924 oass.OpenExchangeRatesOrgProvider.reload Reloading exchange rates from open-exchange-rates.json
[junit4:junit4]   2> 4952 T1924 oass.OpenExchangeRatesOrgProvider.reload Reloading exchange rates from open-exchange-rates.json
[junit4:junit4]   2> 4953 T1924 oasc.SolrCore.<init> [collection1] Opening new SolrCore at /usr/home/hudson/hudson-slave/workspace/Lucene-Solr-Tests-4.x-Java6/solr/build/solr-core/test/J0/./org.apache.solr.cloud.SyncSliceTest-jetty1-1359793337637/collection1/, dataDir=./org.apache.solr.cloud.SyncSliceTest-1359793333856/jetty1/
[junit4:junit4]   2> 4953 T1924 oasc.JmxMonitoredMap.<init> JMX monitoring is enabled. Adding Solr mbeans to JMX Server: com.sun.jmx.mbeanserver.JmxMBeanServer@2e097617
[junit4:junit4]   2> 4954 T1924 oasc.SolrCore.initDirectoryFactory solr.NRTCachingDirectoryFactory
[junit4:junit4]   2> 4955 T1924 oasc.CachingDirectoryFactory.get return new directory for /usr/home/hudson/hudson-slave/workspace/Lucene-Solr-Tests-4.x-Java6/solr/build/solr-core/test/J0/./org.apache.solr.cloud.SyncSliceTest-1359793333856/jetty1 forceNew:false
[junit4:junit4]   2> 4955 T1924 oasc.CachingDirectoryFactory.close Releasing directory:/usr/home/hudson/hudson-slave/workspace/Lucene-Solr-Tests-4.x-Java6/solr/build/solr-core/test/J0/./org.apache.solr.cloud.SyncSliceTest-1359793333856/jetty1
[junit4:junit4]   2> 4956 T1924 oasc.SolrCore.getNewIndexDir New index directory detected: old=null new=./org.apache.solr.cloud.SyncSliceTest-1359793333856/jetty1/index/
[junit4:junit4]   2> 4956 T1924 oasc.SolrCore.initIndex WARNING [collection1] Solr index directory './org.apache.solr.cloud.SyncSliceTest-1359793333856/jetty1/index' doesn't exist. Creating new index...
[junit4:junit4]   2> 4957 T1924 oasc.CachingDirectoryFactory.get return new directory for /usr/home/hudson/hudson-slave/workspace/Lucene-Solr-Tests-4.x-Java6/solr/build/solr-core/test/J0/./org.apache.solr.cloud.SyncSliceTest-1359793333856/jetty1/index forceNew:false
[junit4:junit4]   2> 4963 T1924 oasc.SolrDeletionPolicy.onCommit SolrDeletionPolicy.onCommit: commits:num=1
[junit4:junit4]   2> 		commit{dir=RateLimitedDirectoryWrapper(NRTCachingDirectory(org.apache.lucene.store.NIOFSDirectory@/usr/home/hudson/hudson-slave/workspace/Lucene-Solr-Tests-4.x-Java6/solr/build/solr-core/test/J0/org.apache.solr.cloud.SyncSliceTest-1359793333856/jetty1/index lockFactory=org.apache.lucene.store.NativeFSLockFactory@1f7884c3; maxCacheMB=48.0 maxMergeSizeMB=4.0)),segFN=segments_1,generation=1,filenames=[segments_1]
[junit4:junit4]   2> 4964 T1924 oasc.SolrDeletionPolicy.updateCommits newest commit = 1[segments_1]
[junit4:junit4]   2> 4965 T1924 oasc.CachingDirectoryFactory.close Releasing directory:/usr/home/hudson/hudson-slave/workspace/Lucene-Solr-Tests-4.x-Java6/solr/build/solr-core/test/J0/./org.apache.solr.cloud.SyncSliceTest-1359793333856/jetty1/index
[junit4:junit4]   2> 4965 T1924 oasc.SolrCore.initWriters created xml: solr.XMLResponseWriter
[junit4:junit4]   2> 4967 T1924 oasup.UpdateRequestProcessorChain.init inserting DistributedUpdateProcessorFactory into updateRequestProcessorChain "dedupe"
[junit4:junit4]   2> 4967 T1924 oasup.UpdateRequestProcessorChain.init inserting DistributedUpdateProcessorFactory into updateRequestProcessorChain "dedupe-allfields"
[junit4:junit4]   2> 4967 T1924 oasup.UpdateRequestProcessorChain.init inserting DistributedUpdateProcessorFactory into updateRequestProcessorChain "stored_sig"
[junit4:junit4]   2> 4968 T1924 oasup.UpdateRequestProcessorChain.init inserting DistributedUpdateProcessorFactory into updateRequestProcessorChain "uniq-fields"
[junit4:junit4]   2> 4968 T1924 oasup.UpdateRequestProcessorChain.init inserting DistributedUpdateProcessorFactory into updateRequestProcessorChain "distrib-dup-test-chain-implicit"
[junit4:junit4]   2> 4968 T1924 oasc.RequestHandlers.initHandlersFromConfig adding lazy requestHandler: solr.ReplicationHandler
[junit4:junit4]   2> 4969 T1924 oasc.RequestHandlers.initHandlersFromConfig created /replication: solr.ReplicationHandler
[junit4:junit4]   2> 4969 T1924 oasc.RequestHandlers.initHandlersFromConfig created standard: solr.StandardRequestHandler
[junit4:junit4]   2> 4970 T1924 oasc.RequestHandlers.initHandlersFromConfig created /get: solr.RealTimeGetHandler
[junit4:junit4]   2> 4970 T1924 oasc.RequestHandlers.initHandlersFromConfig created dismax: solr.SearchHandler
[junit4:junit4]   2> 4971 T1924 oasc.RequestHandlers.initHandlersFromConfig created mock: org.apache.solr.core.MockQuerySenderListenerReqHandler
[junit4:junit4]   2> 4971 T1924 oasc.RequestHandlers.initHandlersFromConfig created /admin/: org.apache.solr.handler.admin.AdminHandlers
[junit4:junit4]   2> 4972 T1924 oasc.RequestHandlers.initHandlersFromConfig created defaults: solr.StandardRequestHandler
[junit4:junit4]   2> 4972 T1924 oasc.RequestHandlers.initHandlersFromConfig adding lazy requestHandler: solr.StandardRequestHandler
[junit4:junit4]   2> 4972 T1924 oasc.RequestHandlers.initHandlersFromConfig created lazy: solr.StandardRequestHandler
[junit4:junit4]   2> 4973 T1924 oasc.RequestHandlers.initHandlersFromConfig created /update: solr.UpdateRequestHandler
[junit4:junit4]   2> 4973 T1924 oasc.RequestHandlers.initHandlersFromConfig created /terms: org.apache.solr.handler.component.SearchHandler
[junit4:junit4]   2> 4974 T1924 oasc.RequestHandlers.initHandlersFromConfig created spellCheckCompRH: org.apache.solr.handler.component.SearchHandler
[junit4:junit4]   2> 4974 T1924 oasc.RequestHandlers.initHandlersFromConfig created spellCheckCompRH_Direct: org.apache.solr.handler.component.SearchHandler
[junit4:junit4]   2> 4975 T1924 oasc.RequestHandlers.initHandlersFromConfig created spellCheckWithWordbreak: org.apache.solr.handler.component.SearchHandler
[junit4:junit4]   2> 4975 T1924 oasc.RequestHandlers.initHandlersFromConfig created spellCheckWithWordbreak_Direct: org.apache.solr.handler.component.SearchHandler
[junit4:junit4]   2> 4976 T1924 oasc.RequestHandlers.initHandlersFromConfig created spellCheckCompRH1: org.apache.solr.handler.component.SearchHandler
[junit4:junit4]   2> 4976 T1924 oasc.RequestHandlers.initHandlersFromConfig created mltrh: org.apache.solr.handler.component.SearchHandler
[junit4:junit4]   2> 4977 T1924 oasc.RequestHandlers.initHandlersFromConfig created tvrh: org.apache.solr.handler.component.SearchHandler
[junit4:junit4]   2> 4977 T1924 oasc.RequestHandlers.initHandlersFromConfig created /mlt: solr.MoreLikeThisHandler
[junit4:junit4]   2> 4978 T1924 oasc.RequestHandlers.initHandlersFromConfig created /debug/dump: solr.DumpRequestHandler
[junit4:junit4]   2> 4985 T1924 oashl.XMLLoader.init xsltCacheLifetimeSeconds=60
[junit4:junit4]   2> 4989 T1924 oasc.SolrCore.initDeprecatedSupport WARNING solrconfig.xml uses deprecated <admin/gettableFiles>, Please update your config to use the ShowFileRequestHandler.
[junit4:junit4]   2> 4990 T1924 oasc.SolrCore.initDeprecatedSupport WARNING adding ShowFileRequestHandler with hidden files: [SCHEMA.XML, OLD_SYNONYMS.TXT, STOPWORDS.TXT, PROTWORDS.TXT, OPEN-EXCHANGE-RATES.JSON, SYNONYMS.TXT, CURRENCY.XML, MAPPING-ISOLATIN1ACCENT.TXT]
[junit4:junit4]   2> 4992 T1924 oasc.CachingDirectoryFactory.close Releasing directory:/usr/home/hudson/hudson-slave/workspace/Lucene-Solr-Tests-4.x-Java6/solr/build/solr-core/test/J0/./org.apache.solr.cloud.SyncSliceTest-1359793333856/jetty1
[junit4:junit4]   2> 4994 T1924 oass.SolrIndexSearcher.<init> Opening Searcher@3229e1cf main
[junit4:junit4]   2> 4995 T1924 oasu.CommitTracker.<init> Hard AutoCommit: disabled
[junit4:junit4]   2> 4995 T1924 oasu.CommitTracker.<init> Soft AutoCommit: disabled
[junit4:junit4]   2> 4996 T1924 oashc.SpellCheckComponent.inform Initializing spell checkers
[junit4:junit4]   2> 5003 T1924 oass.DirectSolrSpellChecker.init init: {name=direct,classname=DirectSolrSpellChecker,field=lowerfilt,minQueryLength=3}
[junit4:junit4]   2> 5062 T1925 oasc.SolrCore.registerSearcher [collection1] Registered new searcher Searcher@3229e1cf main{StandardDirectoryReader(segments_1:1)}
[junit4:junit4]   2> 5066 T1924 oasc.ZkController.publish publishing core=collection1 state=down
[junit4:junit4]   2> 5067 T1924 oasc.ZkController.publish numShards not found on descriptor - reading it from system property
[junit4:junit4]   2> 5232 T1905 oascc.ZkStateReader.updateClusterState Updating cloud state from ZooKeeper... 
[junit4:junit4]   2> 5233 T1905 oasc.Overseer$ClusterStateUpdater.updateState Update state numShards=1 message={
[junit4:junit4]   2> 	  "operation":"state",
[junit4:junit4]   2> 	  "numShards":"1",
[junit4:junit4]   2> 	  "shard":"shard1",
[junit4:junit4]   2> 	  "roles":null,
[junit4:junit4]   2> 	  "state":"active",
[junit4:junit4]   2> 	  "core":"collection1",
[junit4:junit4]   2> 	  "collection":"control_collection",
[junit4:junit4]   2> 	  "node_name":"127.0.0.1:28624__f",
[junit4:junit4]   2> 	  "base_url":"http://127.0.0.1:28624/_f"}
[junit4:junit4]   2> 5236 T1905 oasc.Overseer$ClusterStateUpdater.updateState Update state numShards=1 message={
[junit4:junit4]   2> 	  "operation":"state",
[junit4:junit4]   2> 	  "numShards":"1",
[junit4:junit4]   2> 	  "shard":null,
[junit4:junit4]   2> 	  "roles":null,
[junit4:junit4]   2> 	  "state":"down",
[junit4:junit4]   2> 	  "core":"collection1",
[junit4:junit4]   2> 	  "collection":"collection1",
[junit4:junit4]   2> 	  "node_name":"127.0.0.1:28653__f",
[junit4:junit4]   2> 	  "base_url":"http://127.0.0.1:28653/_f"}
[junit4:junit4]   2> 5237 T1905 oasc.Overseer$ClusterStateUpdater.createCollection Create collection collection1 with numShards 1
[junit4:junit4]   2> 5237 T1905 oasc.Overseer$ClusterStateUpdater.updateState Assigning new node to shard shard=shard1
[junit4:junit4]   2> 5247 T1923 oascc.ZkStateReader$2.process A cluster state change: WatchedEvent state:SyncConnected type:NodeDataChanged path:/clusterstate.json, has occurred - updating... (live nodes size: 2)
[junit4:junit4]   2> 5247 T1910 oascc.ZkStateReader$2.process A cluster state change: WatchedEvent state:SyncConnected type:NodeDataChanged path:/clusterstate.json, has occurred - updating... (live nodes size: 2)
[junit4:junit4]   2> 5247 T1904 oascc.ZkStateReader$2.process A cluster state change: WatchedEvent state:SyncConnected type:NodeDataChanged path:/clusterstate.json, has occurred - updating... (live nodes size: 2)
[junit4:junit4]   2> 6069 T1924 oasc.CoreContainer.registerCore registering core: collection1
[junit4:junit4]   2> 6069 T1924 oasc.ZkController.register Register replica - core:collection1 address:http://127.0.0.1:28653/_f collection:collection1 shard:shard1
[junit4:junit4]   2> 6070 T1924 oascc.SolrZkClient.makePath makePath: /collections/collection1/leader_elect/shard1/election
[junit4:junit4]   2> 6117 T1887 oazs.PrepRequestProcessor.pRequest Got user-level KeeperException when processing sessionid:0x13c99ffa66b0006 type:delete cxid:0x43 zxid:0x5a txntype:-1 reqpath:n/a Error Path:/solr/collections/collection1/leaders Error:KeeperErrorCode = NoNode for /solr/collections/collection1/leaders
[junit4:junit4]   2> 6117 T1924 oasc.ShardLeaderElectionContext.runLeaderProcess Running the leader process.
[junit4:junit4]   2> 6118 T1887 oazs.PrepRequestProcessor.pRequest Got user-level KeeperException when processing sessionid:0x13c99ffa66b0006 type:create cxid:0x44 zxid:0x5b txntype:-1 reqpath:n/a Error Path:/solr/overseer Error:KeeperErrorCode = NodeExists for /solr/overseer
[junit4:junit4]   2> 6128 T1924 oasc.ShardLeaderElectionContext.waitForReplicasToComeUp Enough replicas found to continue.
[junit4:junit4]   2> 6128 T1924 oasc.ShardLeaderElectionContext.runLeaderProcess I may be the new leader - try and sync
[junit4:junit4]   2> 6129 T1924 oasc.SyncStrategy.sync Sync replicas to http://127.0.0.1:28653/_f/collection1/
[junit4:junit4]   2> 6129 T1924 oasc.SyncStrategy.syncReplicas Sync Success - now sync replicas to me
[junit4:junit4]   2> 6129 T1924 oasc.SyncStrategy.syncToMe http://127.0.0.1:28653/_f/collection1/ has no replicas
[junit4:junit4]   2> 6129 T1924 oasc.ShardLeaderElectionContext.runLeaderProcess I am the new leader: http://127.0.0.1:28653/_f/collection1/
[junit4:junit4]   2> 6129 T1924 oascc.SolrZkClient.makePath makePath: /collections/collection1/leaders/shard1
[junit4:junit4]   2> 6134 T1887 oazs.PrepRequestProcessor.pRequest Got user-level KeeperException when processing sessionid:0x13c99ffa66b0006 type:create cxid:0x4e zxid:0x5f txntype:-1 reqpath:n/a Error Path:/solr/overseer Error:KeeperErrorCode = NodeExists for /solr/overseer
[junit4:junit4]   2> 6763 T1905 oascc.ZkStateReader.updateClusterState Updating cloud state from ZooKeeper... 
[junit4:junit4]   2> 6801 T1904 oascc.ZkStateReader$2.process A cluster state change: WatchedEvent state:SyncConnected type:NodeDataChanged path:/clusterstate.json, has occurred - updating... (live nodes size: 2)
[junit4:junit4]   2> 6801 T1923 oascc.ZkStateReader$2.process A cluster state change: WatchedEvent state:SyncConnected type:NodeDataChanged path:/clusterstate.json, has occurred - updating... (live nodes size: 2)
[junit4:junit4]   2> 6801 T1910 oascc.ZkStateReader$2.process A cluster state change: WatchedEvent state:SyncConnected type:NodeDataChanged path:/clusterstate.json, has occurred - updating... (live nodes size: 2)
[junit4:junit4]   2> 6855 T1924 oasc.ZkController.register We are http://127.0.0.1:28653/_f/collection1/ and leader is http://127.0.0.1:28653/_f/collection1/
[junit4:junit4]   2> 6855 T1924 oasc.ZkController.register No LogReplay needed for core=collection1 baseURL=http://127.0.0.1:28653/_f
[junit4:junit4]   2> 6855 T1924 oasc.ZkController.checkRecovery I am the leader, no recovery necessary
[junit4:junit4]   2> 6855 T1924 oasc.ZkController.publish publishing core=collection1 state=active
[junit4:junit4]   2> 6856 T1924 oasc.ZkController.publish numShards not found on descriptor - reading it from system property
[junit4:junit4]   2> 6858 T1924 oascc.ZkStateReader.updateClusterState Updating cloud state from ZooKeeper... 
[junit4:junit4]   2> 6859 T1882 oass.SolrDispatchFilter.init user.dir=/usr/home/hudson/hudson-slave/workspace/Lucene-Solr-Tests-4.x-Java6/solr/build/solr-core/test/J0
[junit4:junit4]   2> 6859 T1882 oass.SolrDispatchFilter.init SolrDispatchFilter.init() done
[junit4:junit4]   2> 6860 T1882 oascsi.HttpClientUtil.createClient Creating new http client, config:maxConnections=128&maxConnectionsPerHost=32&followRedirects=false
[junit4:junit4]   2> 7063 T1882 oejs.Server.doStart jetty-8.1.8.v20121106
[junit4:junit4]   2> 7066 T1882 oejs.AbstractConnector.doStart Started SocketConnector@127.0.0.1:28687
[junit4:junit4]   2> 7067 T1882 oass.SolrDispatchFilter.init SolrDispatchFilter.init()
[junit4:junit4]   2> 7067 T1882 oasc.SolrResourceLoader.locateSolrHome JNDI not configured for solr (NoInitialContextEx)
[junit4:junit4]   2> 7068 T1882 oasc.SolrResourceLoader.locateSolrHome using system property solr.solr.home: /usr/home/hudson/hudson-slave/workspace/Lucene-Solr-Tests-4.x-Java6/solr/build/solr-core/test/J0/./org.apache.solr.cloud.SyncSliceTest-jetty2-1359793340733
[junit4:junit4]   2> 7068 T1882 oasc.CoreContainer$Initializer.initialize looking for solr.xml: /usr/home/hudson/hudson-slave/workspace/Lucene-Solr-Tests-4.x-Java6/solr/build/solr-core/test/J0/./org.apache.solr.cloud.SyncSliceTest-jetty2-1359793340733/solr.xml
[junit4:junit4]   2> 7068 T1882 oasc.CoreContainer.<init> New CoreContainer 1029438987
[junit4:junit4]   2> 7069 T1882 oasc.CoreContainer.load Loading CoreContainer using Solr Home: '/usr/home/hudson/hudson-slave/workspace/Lucene-Solr-Tests-4.x-Java6/solr/build/solr-core/test/J0/./org.apache.solr.cloud.SyncSliceTest-jetty2-1359793340733/'
[junit4:junit4]   2> 7070 T1882 oasc.SolrResourceLoader.<init> new SolrResourceLoader for directory: '/usr/home/hudson/hudson-slave/workspace/Lucene-Solr-Tests-4.x-Java6/solr/build/solr-core/test/J0/./org.apache.solr.cloud.SyncSliceTest-jetty2-1359793340733/'
[junit4:junit4]   2> 7111 T1882 oashc.HttpShardHandlerFactory.getParameter Setting socketTimeout to: 60000
[junit4:junit4]   2> 7111 T1882 oashc.HttpShardHandlerFactory.getParameter Setting urlScheme to: http://
[junit4:junit4]   2> 7112 T1882 oashc.HttpShardHandlerFactory.getParameter Setting connTimeout to: 15000
[junit4:junit4]   2> 7112 T1882 oashc.HttpShardHandlerFactory.getParameter Setting maxConnectionsPerHost to: 20
[junit4:junit4]   2> 7113 T1882 oashc.HttpShardHandlerFactory.getParameter Setting corePoolSize to: 0
[junit4:junit4]   2> 7113 T1882 oashc.HttpShardHandlerFactory.getParameter Setting maximumPoolSize to: 2147483647
[junit4:junit4]   2> 7113 T1882 oashc.HttpShardHandlerFactory.getParameter Setting maxThreadIdleTime to: 5
[junit4:junit4]   2> 7114 T1882 oashc.HttpShardHandlerFactory.getParameter Setting sizeOfQueue to: -1
[junit4:junit4]   2> 7114 T1882 oashc.HttpShardHandlerFactory.getParameter Setting fairnessPolicy to: false
[junit4:junit4]   2> 7115 T1882 oascsi.HttpClientUtil.createClient Creating new http client, config:maxConnectionsPerHost=20&maxConnections=10000&socketTimeout=60000&connTimeout=15000&retry=false
[junit4:junit4]   2> 7133 T1882 oasc.CoreContainer.load Registering Log Listener
[junit4:junit4]   2> 7151 T1882 oasc.CoreContainer.initZooKeeper Zookeeper client=127.0.0.1:28621/solr
[junit4:junit4]   2> 7151 T1882 oasc.ZkController.checkChrootPath zkHost includes chroot
[junit4:junit4]   2> 7152 T1882 oaz.ZooKeeper.<init> Initiating client connection, connectString=127.0.0.1:28621 sessionTimeout=60000 watcher=org.apache.solr.common.cloud.ConnectionManager@39e3c63c
[junit4:junit4]   2> 7153 T1882 oascc.ConnectionManager.waitForConnected Waiting for client to connect to ZooKeeper
[junit4:junit4]   2> 7153 T1935 oaz.ClientCnxn$SendThread.logStartConnect Opening socket connection to server localhost/127.0.0.1:28621. Will not attempt to authenticate using SASL (access denied (javax.security.auth.AuthPermission getLoginConfiguration))
[junit4:junit4]   2> 7154 T1935 oaz.ClientCnxn$SendThread.primeConnection Socket connection established to localhost/127.0.0.1:28621, initiating session
[junit4:junit4]   2> 7154 T1884 oazs.NIOServerCnxnFactory.run Accepted socket connection from /140.211.11.196:28688
[junit4:junit4]   2> 7154 T1884 oazs.ZooKeeperServer.processConnectRequest Client attempting to establish new session at /140.211.11.196:28688
[junit4:junit4]   2> 7156 T1886 oazs.ZooKeeperServer.finishSessionInit Established session 0x13c99ffa66b0007 with negotiated timeout 20000 for client /140.211.11.196:28688
[junit4:junit4]   2> 7156 T1935 oaz.ClientCnxn$SendThread.onConnected Session establishment complete on server localhost/127.0.0.1:28621, sessionid = 0x13c99ffa66b0007, negotiated timeout = 20000
[junit4:junit4]   2> 7156 T1936 oascc.ConnectionManager.process Watcher org.apache.solr.common.cloud.ConnectionManager@39e3c63c name:ZooKeeperConnection Watcher:127.0.0.1:28621 got event WatchedEvent state:SyncConnected type:None path:null path:null type:None
[junit4:junit4]   2> 7156 T1882 oascc.ConnectionManager.waitForConnected Client is connected to ZooKeeper
[junit4:junit4]   2> 7157 T1887 oazs.PrepRequestProcessor.pRequest2Txn Processed session termination for sessionid: 0x13c99ffa66b0007
[junit4:junit4]   2> 7158 T1936 oaz.ClientCnxn$EventThread.run EventThread shut down
[junit4:junit4]   2> 7158 T1884 oazs.NIOServerCnxn.closeSock Closed socket connection for client /140.211.11.196:28688 which had sessionid 0x13c99ffa66b0007
[junit4:junit4]   2> 7158 T1882 oaz.ZooKeeper.close Session: 0x13c99ffa66b0007 closed
[junit4:junit4]   2> 7159 T1882 oascsi.HttpClientUtil.createClient Creating new http client, config:maxConnections=500&maxConnectionsPerHost=16&socketTimeout=60000&connTimeout=15000
[junit4:junit4]   2> 7168 T1882 oaz.ZooKeeper.<init> Initiating client connection, connectString=127.0.0.1:28621/solr sessionTimeout=30000 watcher=org.apache.solr.common.cloud.ConnectionManager@386758db
[junit4:junit4]   2> 7169 T1882 oascc.ConnectionManager.waitForConnected Waiting for client to connect to ZooKeeper
[junit4:junit4]   2> 7169 T1937 oaz.ClientCnxn$SendThread.logStartConnect Opening socket connection to server localhost/127.0.0.1:28621. Will not attempt to authenticate using SASL (access denied (javax.security.auth.AuthPermission getLoginConfiguration))
[junit4:junit4]   2> 7170 T1937 oaz.ClientCnxn$SendThread.primeConnection Socket connection established to localhost/127.0.0.1:28621, initiating session
[junit4:junit4]   2> 7170 T1884 oazs.NIOServerCnxnFactory.run Accepted socket connection from /140.211.11.196:28689
[junit4:junit4]   2> 7170 T1884 oazs.ZooKeeperServer.processConnectRequest Client attempting to establish new session at /140.211.11.196:28689
[junit4:junit4]   2> 7171 T1886 oazs.ZooKeeperServer.finishSessionInit Established session 0x13c99ffa66b0008 with negotiated timeout 20000 for client /140.211.11.196:28689
[junit4:junit4]   2> 7171 T1937 oaz.ClientCnxn$SendThread.onConnected Session establishment complete on server localhost/127.0.0.1:28621, sessionid = 0x13c99ffa66b0008, negotiated timeout = 20000
[junit4:junit4]   2> 7171 T1938 oascc.ConnectionManager.process Watcher org.apache.solr.common.cloud.ConnectionManager@386758db name:ZooKeeperConnection Watcher:127.0.0.1:28621/solr got event WatchedEvent state:SyncConnected type:None path:null path:null type:None
[junit4:junit4]   2> 7172 T1882 oascc.ConnectionManager.waitForConnected Client is connected to ZooKeeper
[junit4:junit4]   2> 7173 T1887 oazs.PrepRequestProcessor.pRequest Got user-level KeeperException when processing sessionid:0x13c99ffa66b0008 type:create cxid:0x1 zxid:0x6c txntype:-1 reqpath:n/a Error Path:/solr/overseer Error:KeeperErrorCode = NodeExists for /solr/overseer
[junit4:junit4]   2> 7174 T1887 oazs.PrepRequestProcessor.pRequest Got user-level KeeperException when processing sessionid:0x13c99ffa66b0008 type:create cxid:0x2 zxid:0x6d txntype:-1 reqpath:n/a Error Path:/solr/overseer Error:KeeperErrorCode = NodeExists for /solr/overseer
[junit4:junit4]   2> 7175 T1882 oasc.ZkController.createEphemeralLiveNode Register node as live in ZooKeeper:/live_nodes/127.0.0.1:28687__f
[junit4:junit4]   2> 7176 T1887 oazs.PrepRequestProcessor.pRequest Got user-level KeeperException when processing sessionid:0x13c99ffa66b0008 type:delete cxid:0x4 zxid:0x6e txntype:-1 reqpath:n/a Error Path:/solr/live_nodes/127.0.0.1:28687__f Error:KeeperErrorCode = NoNode for /solr/live_nodes/127.0.0.1:28687__f
[junit4:junit4]   2> 7184 T1882 oascc.SolrZkClient.makePath makePath: /live_nodes/127.0.0.1:28687__f
[junit4:junit4]   2> 7186 T1923 oascc.ZkStateReader$2.process A cluster state change: WatchedEvent state:SyncConnected type:NodeChildrenChanged path:/live_nodes, has occurred - updating... (live nodes size: 2)
[junit4:junit4]   2> 7186 T1910 oascc.ZkStateReader$3.process Updating live nodes... (3)
[junit4:junit4]   2> 7187 T1904 oascc.ZkStateReader$3.process Updating live nodes... (3)
[junit4:junit4]   2> 7187 T1910 oascc.ZkStateReader$2.process A cluster state change: WatchedEvent state:SyncConnected type:NodeChildrenChanged path:/live_nodes, has occurred - updating... (live nodes size: 3)
[junit4:junit4]   2> 7187 T1904 oascc.ZkStateReader$2.process A cluster state change: WatchedEvent state:SyncConnected type:NodeChildrenChanged path:/live_nodes, has occurred - updating... (live nodes size: 3)
[junit4:junit4]   2> 7188 T1923 oascc.ZkStateReader$3.process Updating live nodes... (3)
[junit4:junit4]   2> 7197 T1882 oascc.ZkStateReader.createClusterStateWatchersAndUpdate Updating cluster state from ZooKeeper... 
[junit4:junit4]   2> 7209 T1939 oasc.CoreContainer.create Creating SolrCore 'collection1' using instanceDir: /usr/home/hudson/hudson-slave/workspace/Lucene-Solr-Tests-4.x-Java6/solr/build/solr-core/test/J0/./org.apache.solr.cloud.SyncSliceTest-jetty2-1359793340733/collection1
[junit4:junit4]   2> 7209 T1939 oasc.ZkController.createCollectionZkNode Check for collection zkNode:collection1
[junit4:junit4]   2> 7210 T1939 oasc.ZkController.createCollectionZkNode Collection zkNode exists
[junit4:junit4]   2> 7210 T1939 oasc.ZkController.readConfigName Load collection config from:/collections/collection1
[junit4:junit4]   2> 7211 T1939 oasc.SolrResourceLoader.<init> new SolrResourceLoader for directory: '/usr/home/hudson/hudson-slave/workspace/Lucene-Solr-Tests-4.x-Java6/solr/build/solr-core/test/J0/./org.apache.solr.cloud.SyncSliceTest-jetty2-1359793340733/collection1/'
[junit4:junit4]   2> 7212 T1939 oasc.SolrResourceLoader.replaceClassLoader Adding 'file:/usr/home/hudson/hudson-slave/workspace/Lucene-Solr-Tests-4.x-Java6/solr/build/solr-core/test/J0/org.apache.solr.cloud.SyncSliceTest-jetty2-1359793340733/collection1/lib/README' to classloader
[junit4:junit4]   2> 7213 T1939 oasc.SolrResourceLoader.replaceClassLoader Adding 'file:/usr/home/hudson/hudson-slave/workspace/Lucene-Solr-Tests-4.x-Java6/solr/build/solr-core/test/J0/org.apache.solr.cloud.SyncSliceTest-jetty2-1359793340733/collection1/lib/classes/' to classloader
[junit4:junit4]   2> 7264 T1939 oasc.SolrConfig.<init> Using Lucene MatchVersion: LUCENE_42
[junit4:junit4]   2> 7335 T1939 oasc.SolrConfig.<init> Loaded SolrConfig: solrconfig.xml
[junit4:junit4]   2> 7435 T1939 oass.IndexSchema.readSchema Reading Solr Schema
[junit4:junit4]   2> 7440 T1939 oass.IndexSchema.readSchema Schema name=test
[junit4:junit4]   2> 8187 T1939 oass.OpenExchangeRatesOrgProvider.init Initialized with rates=open-exchange-rates.json, refreshInterval=1440.
[junit4:junit4]   2> 8198 T1939 oass.IndexSchema.readSchema default search field in schema is text
[junit4:junit4]   2> 8202 T1939 oass.IndexSchema.readSchema unique key field: id
[junit4:junit4]   2> 8215 T1939 oass.FileExchangeRateProvider.reload Reloading exchange rates from file currency.xml
[junit4:junit4]   2> 8220 T1939 oass.FileExchangeRateProvider.reload Reloading exchange rates from file currency.xml
[junit4:junit4]   2> 8224 T1939 oass.OpenExchangeRatesOrgProvider.reload Reloading exchange rates from open-exchange-rates.json
[junit4:junit4]   2> 8225 T1939 oass.OpenExchangeRatesOrgProvider.reload Reloading exchange rates from open-exchange-rates.json
[junit4:junit4]   2> 8227 T1939 oasc.SolrCore.<init> [collection1] Opening new SolrCore at /usr/home/hudson/hudson-slave/workspace/Lucene-Solr-Tests-4.x-Java6/solr/build/solr-core/test/J0/./org.apache.solr.cloud.SyncSliceTest-jetty2-1359793340733/collection1/, dataDir=./org.apache.solr.cloud.SyncSliceTest-1359793333856/jetty2/
[junit4:junit4]   2> 8227 T1939 oasc.JmxMonitoredMap.<init> JMX monitoring is enabled. Adding Solr mbeans to JMX Server: com.sun.jmx.mbeanserver.JmxMBeanServer@2e097617
[junit4:junit4]   2> 8227 T1939 oasc.SolrCore.initDirectoryFactory solr.NRTCachingDirectoryFactory
[junit4:junit4]   2> 8228 T1939 oasc.CachingDirectoryFactory.get return new directory for /usr/home/hudson/hudson-slave/workspace/Lucene-Solr-Tests-4.x-Java6/solr/build/solr-core/test/J0/./org.apache.solr.cloud.SyncSliceTest-1359793333856/jetty2 forceNew:false
[junit4:junit4]   2> 8229 T1939 oasc.CachingDirectoryFactory.close Releasing directory:/usr/home/hudson/hudson-slave/workspace/Lucene-Solr-Tests-4.x-Java6/solr/build/solr-core/test/J0/./org.apache.solr.cloud.SyncSliceTest-1359793333856/jetty2
[junit4:junit4]   2> 8229 T1939 oasc.SolrCore.getNewIndexDir New index directory detected: old=null new=./org.apache.solr.cloud.SyncSliceTest-1359793333856/jetty2/index/
[junit4:junit4]   2> 8230 T1939 oasc.SolrCore.initIndex WARNING [collection1] Solr index directory './org.apache.solr.cloud.SyncSliceTest-1359793333856/jetty2/index' doesn't exist. Creating new index...
[junit4:junit4]   2> 8231 T1939 oasc.CachingDirectoryFactory.get return new directory for /usr/home/hudson/hudson-slave/workspace/Lucene-Solr-Tests-4.x-Java6/solr/build/solr-core/test/J0/./org.apache.solr.cloud.SyncSliceTest-1359793333856/jetty2/index forceNew:false
[junit4:junit4]   2> 8239 T1939 oasc.SolrDeletionPolicy.onCommit SolrDeletionPolicy.onCommit: commits:num=1
[junit4:junit4]   2> 		commit{dir=RateLimitedDirectoryWrapper(NRTCachingDirectory(org.apache.lucene.store.NIOFSDirectory@/usr/home/hudson/hudson-slave/workspace/Lucene-Solr-Tests-4.x-Java6/solr/build/solr-core/test/J0/org.apache.solr.cloud.SyncSliceTest-1359793333856/jetty2/index lockFactory=org.apache.lucene.store.NativeFSLockFactory@579b5027; maxCacheMB=48.0 maxMergeSizeMB=4.0)),segFN=segments_1,generation=1,filenames=[segments_1]
[junit4:junit4]   2> 8239 T1939 oasc.SolrDeletionPolicy.updateCommits newest commit = 1[segments_1]
[junit4:junit4]   2> 8240 T1939 oasc.CachingDirectoryFactory.close Releasing directory:/usr/home/hudson/hudson-slave/workspace/Lucene-Solr-Tests-4.x-Java6/solr/build/solr-core/test/J0/./org.apache.solr.cloud.SyncSliceTest-1359793333856/jetty2/index
[junit4:junit4]   2> 8241 T1939 oasc.SolrCore.initWriters created xml: solr.XMLResponseWriter
[junit4:junit4]   2> 8243 T1939 oasup.UpdateRequestProcessorChain.init inserting DistributedUpdateProcessorFactory into updateRequestProcessorChain "dedupe"
[junit4:junit4]   2> 8243 T1939 oasup.UpdateRequestProcessorChain.init inserting DistributedUpdateProcessorFactory into updateRequestProcessorChain "dedupe-allfields"
[junit4:junit4]   2> 8243 T1939 oasup.UpdateRequestProcessorChain.init inserting DistributedUpdateProcessorFactory into updateRequestProcessorChain "stored_sig"
[junit4:junit4]   2> 8243 T1939 oasup.UpdateRequestProcessorChain.init inserting DistributedUpdateProcessorFactory into updateRequestProcessorChain "uniq-fields"
[junit4:junit4]   2> 8244 T1939 oasup.UpdateRequestProcessorChain.init inserting DistributedUpdateProcessorFactory into updateRequestProcessorChain "distrib-dup-test-chain-implicit"
[junit4:junit4]   2> 8244 T1939 oasc.RequestHandlers.initHandlersFromConfig adding lazy requestHandler: solr.ReplicationHandler
[junit4:junit4]   2> 8245 T1939 oasc.RequestHandlers.initHandlersFromConfig created /replication: solr.ReplicationHandler
[junit4:junit4]   2> 8245 T1939 oasc.RequestHandlers.initHandlersFromConfig created standard: solr.StandardRequestHandler
[junit4:junit4]   2> 8246 T1939 oasc.RequestHandlers.initHandlersFromConfig created /get: solr.RealTimeGetHandler
[junit4:junit4]   2> 8246 T1939 oasc.RequestHandlers.initHandlersFromConfig created dismax: solr.SearchHandler
[junit4:junit4]   2> 8247 T1939 oasc.RequestHandlers.initHandlersFromConfig created mock: org.apache.solr.core.MockQuerySenderListenerReqHandler
[junit4:junit4]   2> 8247 T1939 oasc.RequestHandlers.initHandlersFromConfig created /admin/: org.apache.solr.handler.admin.AdminHandlers
[junit4:junit4]   2> 8248 T1939 oasc.RequestHandlers.initHandlersFromConfig created defaults: solr.StandardRequestHandler
[junit4:junit4]   2> 8248 T1939 oasc.RequestHandlers.initHandlersFromConfig adding lazy requestHandler: solr.StandardRequestHandler
[junit4:junit4]   2> 8248 T1939 oasc.RequestHandlers.initHandlersFromConfig created lazy: solr.StandardRequestHandler
[junit4:junit4]   2> 8249 T1939 oasc.RequestHandlers.initHandlersFromConfig created /update: solr.UpdateRequestHandler
[junit4:junit4]   2> 8249 T1939 oasc.RequestHandlers.initHandlersFromConfig created /terms: org.apache.solr.handler.component.SearchHandler
[junit4:junit4]   2> 8250 T1939 oasc.RequestHandlers.initHandlersFromConfig created spellCheckCompRH: org.apache.solr.handler.component.SearchHandler
[junit4:junit4]   2> 8250 T1939 oasc.RequestHandlers.initHandlersFromConfig created spellCheckCompRH_Direct: org.apache.solr.handler.component.SearchHandler
[junit4:junit4]   2> 8250 T1939 oasc.RequestHandlers.initHandlersFromConfig created spellCheckWithWordbreak: org.apache.solr.handler.component.SearchHandler
[junit4:junit4]   2> 8251 T1939 oasc.RequestHandlers.initHandlersFromConfig created spellCheckWithWordbreak_Direct: org.apache.solr.handler.component.SearchHandler
[junit4:junit4]   2> 8251 T1939 oasc.RequestHandlers.initHandlersFromConfig created spellCheckCompRH1: org.apache.solr.handler.component.SearchHandler
[junit4:junit4]   2> 8252 T1939 oasc.RequestHandlers.initHandlersFromConfig created mltrh: org.apache.solr.handler.component.SearchHandler
[junit4:junit4]   2> 8252 T1939 oasc.RequestHandlers.initHandlersFromConfig created tvrh: org.apache.solr.handler.component.SearchHandler
[junit4:junit4]   2> 8253 T1939 oasc.RequestHandlers.initHandlersFromConfig created /mlt: solr.MoreLikeThisHandler
[junit4:junit4]   2> 8253 T1939 oasc.RequestHandlers.initHandlersFromConfig created /debug/dump: solr.DumpRequestHandler
[junit4:junit4]   2> 8261 T1939 oashl.XMLLoader.init xsltCacheLifetimeSeconds=60
[junit4:junit4]   2> 8265 T1939 oasc.SolrCore.initDeprecatedSupport WARNING solrconfig.xml uses deprecated <admin/gettableFiles>, Please update your config to use the ShowFileRequestHandler.
[junit4:junit4]   2> 8267 T1939 oasc.SolrCore.initDeprecatedSupport WARNING adding ShowFileRequestHandler with hidden files: [SCHEMA.XML, OLD_SYNONYMS.TXT, STOPWORDS.TXT, PROTWORDS.TXT, OPEN-EXCHANGE-RATES.JSON, SYNONYMS.TXT, CURRENCY.XML, MAPPING-ISOLATIN1ACCENT.TXT]
[junit4:junit4]   2> 8270 T1939 oasc.CachingDirectoryFactory.close Releasing directory:/usr/home/hudson/hudson-slave/workspace/Lucene-Solr-Tests-4.x-Java6/solr/build/solr-core/test/J0/./org.apache.solr.cloud.SyncSliceTest-1359793333856/jetty2
[junit4:junit4]   2> 8273 T1939 oass.SolrIndexSearcher.<init> Opening Searcher@6d356b59 main
[junit4:junit4]   2> 8276 T1939 oasu.CommitTracker.<init> Hard AutoCommit: disabled
[junit4:junit4]   2> 8276 T1939 oasu.CommitTracker.<init> Soft AutoCommit: disabled
[junit4:junit4]   2> 8277 T1939 oashc.SpellCheckComponent.inform Initializing spell checkers
[junit4:junit4]   2> 8351 T1905 oascc.ZkStateReader.updateClusterState Updating cloud state from ZooKeeper... 
[junit4:junit4]   2> 8357 T1905 oasc.Overseer$ClusterStateUpdater.updateState Update state numShards=1 message={
[junit4:junit4]   2> 	  "operation":"state",
[junit4:junit4]   2> 	  "numShards":"1",
[junit4:junit4]   2> 	  "shard":"shard1",
[junit4:junit4]   2> 	  "roles":null,
[junit4:junit4]   2> 	  "state":"active",
[junit4:junit4]   2> 	  "core":"collection1",
[junit4:junit4]   2> 	  "collection":"collection1",
[junit4:junit4]   2> 	  "node_name":"127.0.0.1:28653__f",
[junit4:junit4]   2> 	  "base_url":"http://127.0.0.1:28653/_f"}
[junit4:junit4]   2> 8400 T1923 oascc.ZkStateReader$2.process A cluster state change: WatchedEvent state:SyncConnected type:NodeDataChanged path:/clusterstate.json, has occurred - updating... (live nodes size: 3)
[junit4:junit4]   2> 8402 T1938 oascc.ZkStateReader$2.process A cluster state change: WatchedEvent state:SyncConnected type:NodeDataChanged path:/clusterstate.json, has occurred - updating... (live nodes size: 3)
[junit4:junit4]   2> 8423 T1904 oascc.ZkStateReader$2.process A cluster state change: WatchedEvent state:SyncConnected type:NodeDataChanged path:/clusterstate.json, has occurred - updating... (live nodes size: 3)
[junit4:junit4]   2> 8423 T1910 oascc.ZkStateReader$2.process A cluster state change: WatchedEvent state:SyncConnected type:NodeDataChanged path:/clusterstate.json, has occurred - updating... (live nodes size: 3)
[junit4:junit4]   2> 8438 T1939 oass.DirectSolrSpellChecker.init init: {name=direct,classname=DirectSolrSpellChecker,field=lowerfilt,minQueryLength=3}
[junit4:junit4]   2> 8587 T1940 oasc.SolrCore.registerSearcher [collection1] Registered new searcher Searcher@6d356b59 main{StandardDirectoryReader(segments_1:1)}
[junit4:junit4]   2> 8592 T1939 oasc.ZkController.publish publishing core=collection1 state=down
[junit4:junit4]   2> 8593 T1939 oasc.ZkController.publish numShards not found on descriptor - reading it from system property
[junit4:junit4]   2> 9930 T1905 oascc.ZkStateReader.updateClusterState Updating cloud state from ZooKeeper... 
[junit4:junit4]   2> 9933 T1905 oasc.Overseer$ClusterStateUpdater.updateState Update state numShards=1 message={
[junit4:junit4]   2> 	  "operation":"state",
[junit4:junit4]   2> 	  "numShards":"1",
[junit4:junit4]   2> 	  "shard":null,
[junit4:junit4]   2> 	  "roles":null,
[junit4:junit4]   2> 	  "state":"down",
[junit4:junit4]   2> 	  "core":"collection1",
[junit4:junit4]   2> 	  "collection":"collection1",
[junit4:junit4]   2> 	  "node_name":"127.0.0.1:28687__f",
[junit4:junit4]   2> 	  "base_url":"http://127.0.0.1:28687/_f"}
[junit4:junit4]   2> 9934 T1905 oasc.Overseer$ClusterStateUpdater.updateState Collection already exists with numShards=1
[junit4:junit4]   2> 9934 T1905 oasc.Overseer$ClusterStateUpdater.updateState Assigning new node to shard shard=shard1
[junit4:junit4]   2> 9958 T1904 oascc.ZkStateReader$2.process A cluster state change: WatchedEvent state:SyncConnected type:NodeDataChanged path:/clusterstate.json, has occurred - updating... (live nodes size: 3)
[junit4:junit4]   2> 9958 T1910 oascc.ZkStateReader$2.process A cluster state change: WatchedEvent state:SyncConnected type:NodeDataChanged path:/clusterstate.json, has occurred - updating... (live nodes size: 3)
[junit4:junit4]   2> 9958 T1938 oascc.ZkStateReader$2.process A cluster state change: WatchedEvent state:SyncConnected type:NodeDataChanged path:/clusterstate.json, has occurred - updating... (live nodes size: 3)
[junit4:junit4]   2> 9958 T1923 oascc.ZkStateReader$2.process A cluster state change: WatchedEvent state:SyncConnected type:NodeDataChanged path:/clusterstate.json, has occurred - updating... (live nodes size: 3)
[junit4:junit4]   2> 10598 T1939 oasc.CoreContainer.registerCore registering core: collection1
[junit4:junit4]   2> 10598 T1939 oasc.ZkController.register Register replica - core:collection1 address:http://127.0.0.1:28687/_f collection:collection1 shard:shard1
[junit4:junit4]   2> 10611 T1939 oasc.ZkController.register We are http://127.0.0.1:28687/_f/collection1/ and leader is http://127.0.0.1:28653/_f/collection1/
[junit4:junit4]   2> 10612 T1939 oasc.ZkController.register No LogReplay needed for core=collection1 baseURL=http://127.0.0.1:28687/_f
[junit4:junit4]   2> 10612 T1939 oasc.ZkController.checkRecovery Core needs to recover:collection1
[junit4:junit4]   2> 10612 T1939 oasu.DefaultSolrCoreState.doRecovery Running recovery - first canceling any ongoing recovery
[junit4:junit4]   2> ASYNC  NEW_CORE C103 name=collection1 org.apache.solr.core.SolrCore@3fd51fb7 url=http://127.0.0.1:28687/_f/collection1 node=127.0.0.1:28687__f C103_STATE=coll:collection1 core:collection1 props:{shard=null, roles=null, state=down, core=collection1, collection=collection1, node_name=127.0.0.1:28687__f, base_url=http://127.0.0.1:28687/_f}
[junit4:junit4]   2> 10613 T1941 C103 P28687 oasc.RecoveryStrategy.run Starting recovery process.  core=collection1 recoveringAfterStartup=true
[junit4:junit4]   2> 10614 T1941 C103 P28687 oasc.RecoveryStrategy.doRecovery ###### startupVersions=[]
[junit4:junit4]   2> 10614 T1941 C103 P28687 oasc.ZkController.publish publishing core=collection1 state=recovering
[junit4:junit4]   2> 10614 T1939 oascc.ZkStateReader.updateClusterState Updating cloud state from ZooKeeper... 
[junit4:junit4]   2> 10614 T1941 C103 P28687 oasc.ZkController.publish numShards not found on descriptor - reading it from system property
[junit4:junit4]   2> 10616 T1882 oass.SolrDispatchFilter.init user.dir=/usr/home/hudson/hudson-slave/workspace/Lucene-Solr-Tests-4.x-Java6/solr/build/solr-core/test/J0
[junit4:junit4]   2> 10617 T1882 oass.SolrDispatchFilter.init SolrDispatchFilter.init() done
[junit4:junit4]   2> 10617 T1941 C103 P28687 oascsi.HttpClientUtil.createClient Creating new http client, config:maxConnections=128&maxConnectionsPerHost=32&followRedirects=false
[junit4:junit4]   2> 10618 T1882 oascsi.HttpClientUtil.createClient Creating new http client, config:maxConnections=128&maxConnectionsPerHost=32&followRedirects=false
[junit4:junit4]   2> 11085 T1882 oejs.Server.doStart jetty-8.1.8.v20121106
[junit4:junit4]   2> 11093 T1882 oejs.AbstractConnector.doStart Started SocketConnector@127.0.0.1:28737
[junit4:junit4]   2> 11094 T1882 oass.SolrDispatchFilter.init SolrDispatchFilter.init()
[junit4:junit4]   2> 11094 T1882 oasc.SolrResourceLoader.locateSolrHome JNDI not configured for solr (NoInitialContextEx)
[junit4:junit4]   2> 11095 T1882 oasc.SolrResourceLoader.locateSolrHome using system property solr.solr.home: /usr/home/hudson/hudson-slave/workspace/Lucene-Solr-Tests-4.x-Java6/solr/build/solr-core/test/J0/./org.apache.solr.cloud.SyncSliceTest-jetty3-1359793344506
[junit4:junit4]   2> 11096 T1882 oasc.CoreContainer$Initializer.initialize looking for solr.xml: /usr/home/hudson/hudson-slave/workspace/Lucene-Solr-Tests-4.x-Java6/solr/build/solr-core/test/J0/./org.apache.solr.cloud.SyncSliceTest-jetty3-1359793344506/solr.xml
[junit4:junit4]   2> 11096 T1882 oasc.CoreContainer.<init> New CoreContainer 1548716978
[junit4:junit4]   2> 11098 T1882 oasc.CoreContainer.load Loading CoreContainer using Solr Home: '/usr/home/hudson/hudson-slave/workspace/Lucene-Solr-Tests-4.x-Java6/solr/build/solr-core/test/J0/./org.apache.solr.cloud.SyncSliceTest-jetty3-1359793344506/'
[junit4:junit4]   2> 11098 T1882 oasc.SolrResourceLoader.<init> new SolrResourceLoader for directory: '/usr/home/hudson/hudson-slave/workspace/Lucene-Solr-Tests-4.x-Java6/solr/build/solr-core/test/J0/./org.apache.solr.cloud.SyncSliceTest-jetty3-1359793344506/'
[junit4:junit4]   2> 11236 T1882 oashc.HttpShardHandlerFactory.getParameter Setting socketTimeout to: 60000
[junit4:junit4]   2> 11236 T1882 oashc.HttpShardHandlerFactory.getParameter Setting urlScheme to: http://
[junit4:junit4]   2> 11237 T1882 oashc.HttpShardHandlerFactory.getParameter Setting connTimeout to: 15000
[junit4:junit4]   2> 11238 T1882 oashc.HttpShardHandlerFactory.getParameter Setting maxConnectionsPerHost to: 20
[junit4:junit4]   2> 11238 T1882 oashc.HttpShardHandlerFactory.getParameter Setting corePoolSize to: 0
[junit4:junit4]   2> 11239 T1882 oashc.HttpShardHandlerFactory.getParameter Setting maximumPoolSize to: 2147483647
[junit4:junit4]   2> 11239 T1882 oashc.HttpShardHandlerFactory.getParameter Setting maxThreadIdleTime to: 5
[junit4:junit4]   2> 11240 T1882 oashc.HttpShardHandlerFactory.getParameter Setting sizeOfQueue to: -1
[junit4:junit4]   2> 11241 T1882 oashc.HttpShardHandlerFactory.getParameter Setting fairnessPolicy to: false
[junit4:junit4]   2> 11241 T1882 oascsi.HttpClientUtil.createClient Creating new http client, config:maxConnectionsPerHost=20&maxConnections=10000&socketTimeout=60000&connTimeout=15000&retry=false
[junit4:junit4]   2> 11292 T1882 oasc.CoreContainer.load Registering Log Listener
[junit4:junit4]   2> 11339 T1882 oasc.CoreContainer.initZooKeeper Zookeeper client=127.0.0.1:28621/solr
[junit4:junit4]   2> 11340 T1882 oasc.ZkController.checkChrootPath zkHost includes chroot
[junit4:junit4]   2> 11341 T1882 oaz.ZooKeeper.<init> Initiating client connection, connectString=127.0.0.1:28621 sessionTimeout=60000 watcher=org.apache.solr.common.cloud.ConnectionManager@5f794787
[junit4:junit4]   2> 11342 T1882 oascc.ConnectionManager.waitForConnected Waiting for client to connect to ZooKeeper
[junit4:junit4]   2> 11345 T1951 oaz.ClientCnxn$SendThread.logStartConnect Opening socket connection to server localhost/127.0.0.1:28621. Will not attempt to authenticate using SASL (access denied (javax.security.auth.AuthPermission getLoginConfiguration))
[junit4:junit4]   2> 11346 T1951 oaz.ClientCnxn$SendThread.primeConnection Socket connection established to localhost/127.0.0.1:28621, initiating session
[junit4:junit4]   2> 11347 T1884 oazs.NIOServerCnxnFactory.run Accepted socket connection from /140.211.11.196:28738
[junit4:junit4]   2> 11347 T1884 oazs.ZooKeeperServer.processConnectRequest Client attempting to establish new session at /140.211.11.196:28738
[junit4:junit4]   2> 11350 T1886 oazs.ZooKeeperServer.finishSessionInit Established session 0x13c99ffa66b0009 with negotiated timeout 20000 for client /140.211.11.196:28738
[junit4:junit4]   2> 11350 T1951 oaz.ClientCnxn$SendThread.onConnected Session establishment complete on server localhost/127.0.0.1:28621, sessionid = 0x13c99ffa66b0009, negotiated timeout = 20000
[junit4:junit4]   2> 11350 T1952 oascc.ConnectionManager.process Watcher org.apache.solr.common.cloud.ConnectionManager@5f794787 name:ZooKeeperConnection Watcher:127.0.0.1:28621 got event WatchedEvent state:SyncConnected type:None path:null path:null type:None
[junit4:junit4]   2> 11351 T1882 oascc.ConnectionManager.waitForConnected Client is connected to ZooKeeper
[junit4:junit4]   2> 11352 T1887 oazs.PrepRequestProcessor.pRequest2Txn Processed session termination for sessionid: 0x13c99ffa66b0009
[junit4:junit4]   2> 11381 T1952 oaz.ClientCnxn$EventThread.run EventThread shut down
[junit4:junit4]   2> 11381 T1884 oazs.NIOServerCnxn.closeSock Closed socket connection for client /140.211.11.196:28738 which had sessionid 0x13c99ffa66b0009
[junit4:junit4]   2> 11381 T1882 oaz.ZooKeeper.close Session: 0x13c99ffa66b0009 closed
[junit4:junit4]   2> 11383 T1882 oascsi.HttpClientUtil.createClient Creating new http client, config:maxConnections=500&maxConnectionsPerHost=16&socketTimeout=60000&connTimeout=15000
[junit4:junit4]   2> 11400 T1882 oaz.ZooKeeper.<init> Initiating client connection, connectString=127.0.0.1:28621/solr sessionTimeout=30000 watcher=org.apache.solr.common.cloud.ConnectionManager@6ebb7703
[junit4:junit4]   2> 11403 T1882 oascc.ConnectionManager.waitForConnected Waiting for client to connect to ZooKeeper
[junit4:junit4]   2> 11404 T1953 oaz.ClientCnxn$SendThread.logStartConnect Opening socket connection to server localhost/127.0.0.1:28621. Will not attempt to authenticate using SASL (access denied (javax.security.auth.AuthPermission getLoginConfiguration))
[junit4:junit4]   2> 11404 T1953 oaz.ClientCnxn$SendThread.primeConnection Socket connection established to localhost/127.0.0.1:28621, initiating session
[junit4:junit4]   2> 11405 T1884 oazs.NIOServerCnxnFactory.run Accepted socket connection from /140.211.11.196:28739
[junit4:junit4]   2> 11405 T1884 oazs.ZooKeeperServer.processConnectRequest Client attempting to establish new session at /140.211.11.196:28739
[junit4:junit4]   2> 11407 T1886 oazs.ZooKeeperServer.finishSessionInit Established session 0x13c99ffa66b000a with negotiated timeout 20000 for client /140.211.11.196:28739
[junit4:junit4]   2> 11408 T1953 oaz.ClientCnxn$SendThread.onConnected Session establishment complete on server localhost/127.0.0.1:28621, sessionid = 0x13c99ffa66b000a, negotiated timeout = 20000
[junit4:junit4]   2> 11408 T1954 oascc.ConnectionManager.process Watcher org.apache.solr.common.cloud.ConnectionManager@6ebb7703 name:ZooKeeperConnection Watcher:127.0.0.1:28621/solr got event WatchedEvent state:SyncConnected type:None path:null path:null type:None
[junit4:junit4]   2> 11408 T1882 oascc.ConnectionManager.waitForConnected Client is connected to ZooKeeper
[junit4:junit4]   2> 11411 T1887 oazs.PrepRequestProcessor.pRequest Got user-level KeeperException when processing sessionid:0x13c99ffa66b000a type:create cxid:0x1 zxid:0x7f txntype:-1 reqpath:n/a Error Path:/solr/overseer Error:KeeperErrorCode = NodeExists for /solr/overseer
[junit4:junit4]   2> 11441 T1887 oazs.PrepRequestProcessor.pRequest Got user-level KeeperException when processing sessionid:0x13c99ffa66b000a type:create cxid:0x2 zxid:0x80 txntype:-1 reqpath:n/a Error Path:/solr/overseer Error:KeeperErrorCode = NodeExists for /solr/overseer
[junit4:junit4]   2> 11443 T1882 oasc.ZkController.createEphemeralLiveNode Register node as live in ZooKeeper:/live_nodes/127.0.0.1:28737__f
[junit4:junit4]   2> 11444 T1887 oazs.PrepRequestProcessor.pRequest Got user-level KeeperException when processing sessionid:0x13c99ffa66b000a type:delete cxid:0x4 zxid:0x81 txntype:-1 reqpath:n/a Error Path:/solr/live_nodes/127.0.0.1:28737__f Error:KeeperErrorCode = NoNode for /solr/live_nodes/127.0.0.1:28737__f
[junit4:junit4]   2> 11446 T1882 oascc.SolrZkClient.makePath makePath: /live_nodes/127.0.0.1:28737__f
[junit4:junit4]   2> 11471 T1938 oascc.ZkStateReader$2.process A cluster state change: WatchedEvent state:SyncConnected type:NodeChildrenChanged path:/live_nodes, has occurred - updating... (live nodes size: 3)
[junit4:junit4]   2> 11471 T1923 oascc.ZkStateReader$2.process A cluster state change: WatchedEvent state:SyncConnected type:NodeChildrenChanged path:/live_nodes, has occurred - updating... (live nodes size: 3)
[junit4:junit4]   2> 11471 T1910 oascc.ZkStateReader$3.process Updating live nodes... (4)
[junit4:junit4]   2> 11472 T1904 oascc.ZkStateReader$3.process Updating live nodes... (4)
[junit4:junit4]   2> 11472 T1910 oascc.ZkStateReader$2.process A cluster state change: WatchedEvent state:SyncConnected type:NodeChildrenChanged path:/live_nodes, has occurred - updating... (live nodes size: 4)
[junit4:junit4]   2> 11472 T1904 oascc.ZkStateReader$2.process A cluster state change: WatchedEvent state:SyncConnected type:NodeChildrenChanged path:/live_nodes, has occurred - updating... (live nodes size: 4)
[junit4:junit4]   2> 11475 T1923 oascc.ZkStateReader$3.process Updating live nodes... (4)
[junit4:junit4]   2> 11476 T1938 oascc.ZkStateReader$3.process Updating live nodes... (4)
[junit4:junit4]   2> 11476 T1905 oascc.ZkStateReader.updateClusterState Updating cloud state from ZooKeeper... 
[junit4:junit4]   2> 11477 T1905 oasc.Overseer$ClusterStateUpdater.updateState Update state numShards=1 message={
[junit4:junit4]   2> 	  "operation":"state",
[junit4:junit4]   2> 	  "numShards":"1",
[junit4:junit4]   2> 	  "shard":"shard1",
[junit4:junit4]   2> 	  "roles":null,
[junit4:junit4]   2> 	  "state":"recovering",
[junit4:junit4]   2> 	  "core":"collection1",
[junit4:junit4]   2> 	  "collection":"collection1",
[junit4:junit4]   2> 	  "node_name":"127.0.0.1:28687__f",
[junit4:junit4]   2> 	  "base_url":"http://127.0.0.1:28687/_f"}
[junit4:junit4]   2> 11477 T1882 oascc.ZkStateReader.createClusterStateWatchersAndUpdate Updating cluster state from ZooKeeper... 
[junit4:junit4]   2> 11488 T1923 oascc.ZkStateReader$2.process A cluster state change: WatchedEvent state:SyncConnected type:NodeDataChanged path:/clusterstate.json, has occurred - updating... (live nodes size: 4)
[junit4:junit4]   2> 11489 T1954 oascc.ZkStateReader$2.process A cluster state change: WatchedEvent state:SyncConnected type:NodeDataChanged path:/clusterstate.json, has occurred - updating... (live nodes size: 4)
[junit4:junit4]   2> 11489 T1938 oascc.ZkStateReader$2.process A cluster state change: WatchedEvent state:SyncConnected type:NodeDataChanged path:/clusterstate.json, has occurred - updating... (live nodes size: 4)
[junit4:junit4]   2> 11489 T1910 oascc.ZkStateReader$2.process A cluster state change: WatchedEvent state:SyncConnected type:NodeDataChanged path:/clusterstate.json, has occurred - updating... (live nodes size: 4)
[junit4:junit4]   2> 11496 T1904 oascc.ZkStateReader$2.process A cluster state change: WatchedEvent state:SyncConnected type:NodeDataChanged path:/clusterstate.json, has occurred - updating... (live nodes size: 4)
[junit4:junit4]   2> 11497 T1955 oasc.CoreContainer.create Creating SolrCore 'collection1' using instanceDir: /usr/home/hudson/hudson-slave/workspace/Lucene-Solr-Tests-4.x-Java6/solr/build/solr-core/test/J0/./org.apache.solr.cloud.SyncSliceTest-jetty3-1359793344506/collection1
[junit4:junit4]   2> 11497 T1955 oasc.ZkController.createCollectionZkNode Check for collection zkNode:collection1
[junit4:junit4]   2> 11498 T1955 oasc.ZkController.createCollectionZkNode Collection zkNode exists
[junit4:junit4]   2> 11498 T1955 oasc.ZkController.readConfigName Load collection config from:/collections/collection1
[junit4:junit4]   2> 11500 T1955 oasc.SolrResourceLoader.<init> new SolrResourceLoader for directory: '/usr/home/hudson/hudson-slave/workspace/Lucene-Solr-Tests-4.x-Java6/solr/build/solr-core/test/J0/./org.apache.solr.cloud.SyncSliceTest-jetty3-1359793344506/collection1/'
[junit4:junit4]   2> 11502 T1955 oasc.SolrResourceLoader.replaceClassLoader Adding 'file:/usr/home/hudson/hudson-slave/workspace/Lucene-Solr-Tests-4.x-Java6/solr/build/solr-core/test/J0/org.apache.solr.cloud.SyncSliceTest-jetty3-1359793344506/collection1/lib/README' to classloader
[junit4:junit4]   2> 11503 T1955 oasc.SolrResourceLoader.replaceClassLoader Adding 'file:/usr/home/hudson/hudson-slave/workspace/Lucene-Solr-Tests-4.x-Java6/solr/build/solr-core/test/J0/org.apache.solr.cloud.SyncSliceTest-jetty3-1359793344506/collection1/lib/classes/' to classloader
[junit4:junit4]   2> 11609 T1955 oasc.SolrConfig.<init> Using Lucene MatchVersion: LUCENE_42
[junit4:junit4]   2> 11750 T1955 oasc.SolrConfig.<init> Loaded SolrConfig: solrconfig.xml
[junit4:junit4]   2> 11851 T1955 oass.IndexSchema.readSchema Reading Solr Schema
[junit4:junit4]   2> 11862 T1955 oass.IndexSchema.readSchema Schema name=test
[junit4:junit4]   2> 12543 T1955 oass.OpenExchangeRatesOrgProvider.init Initialized with rates=open-exchange-rates.json, refreshInterval=1440.
[junit4:junit4]   2> 12554 T1955 oass.IndexSchema.readSchema default search field in schema is text
[junit4:junit4]   2> 12558 T1955 oass.IndexSchema.readSchema unique key field: id
[junit4:junit4]   2> 12572 T1955 oass.FileExchangeRateProvider.reload Reloading exchange rates from file currency.xml
[junit4:junit4]   2> 12577 T1955 oass.FileExchangeRateProvider.reload Reloading exchange rates from file currency.xml
[junit4:junit4]   2> 12581 T1955 oass.OpenExchangeRatesOrgProvider.reload Reloading exchange rates from open-exchange-rates.json
[junit4:junit4]   2> 12582 T1955 oass.OpenExchangeRatesOrgProvider.reload Reloading exchange rates from open-exchange-rates.json
[junit4:junit4]   2> 12583 T1955 oasc.SolrCore.<init> [collection1] Opening new SolrCore at /usr/home/hudson/hudson-slave/workspace/Lucene-Solr-Tests-4.x-Java6/solr/build/solr-core/test/J0/./org.apache.solr.cloud.SyncSliceTest-jetty3-1359793344506/collection1/, dataDir=./org.apache.solr.cloud.SyncSliceTest-1359793333856/jetty3/
[junit4:junit4]   2> 12584 T1955 oasc.JmxMonitoredMap.<init> JMX monitoring is enabled. Adding Solr mbeans to JMX Server: com.sun.jmx.mbeanserver.JmxMBeanServer@2e097617
[junit4:junit4]   2> 12584 T1955 oasc.SolrCore.initDirectoryFactory solr.NRTCachingDirectoryFactory
[junit4:junit4]   2> 12585 T1955 oasc.CachingDirectoryFactory.get return new directory for /usr/home/hudson/hudson-slave/workspace/Lucene-Solr-Tests-4.x-Java6/solr/build/solr-core/test/J0/./org.apache.solr.cloud.SyncSliceTest-1359793333856/jetty3 forceNew:false
[junit4:junit4]   2> 12586 T1955 oasc.CachingDirectoryFactory.close Releasing directory:/usr/home/hudson/hudson-slave/workspace/Lucene-Solr-Tests-4.x-Java6/solr/build/solr-core/test/J0/./org.apache.solr.cloud.SyncSliceTest-1359793333856/jetty3
[junit4:junit4]   2> 12586 T1955 oasc.SolrCore.getNewIndexDir New index directory detected: old=null new=./org.apache.solr.cloud.SyncSliceTest-1359793333856/jetty3/index/
[junit4:junit4]   2> 12587 T1955 oasc.SolrCore.initIndex WARNING [collection1] Solr index directory './org.apache.solr.cloud.SyncSliceTest-1359793333856/jetty3/index' doesn't exist. Creating new index...
[junit4:junit4]   2> 12588 T1955 oasc.CachingDirectoryFactory.get return new directory for /usr/home/hudson/hudson-slave/workspace/Lucene-Solr-Tests-4.x-Java6/solr/build/solr-core/test/J0/./org.apache.solr.cloud.SyncSliceTest-1359793333856/jetty3/index forceNew:false
[junit4:junit4]   2> 12596 T1955 oasc.SolrDeletionPolicy.onCommit SolrDeletionPolicy.onCommit: commits:num=1
[junit4:junit4]   2> 		commit{dir=RateLimitedDirectoryWrapper(NRTCachingDirectory(org.apache.lucene.store.NIOFSDirectory@/usr/home/hudson/hudson-slave/workspace/Lucene-Solr-Tests-4.x-Java6/solr/build/solr-core/test/J0/org.apache.solr.cloud.SyncSliceTest-1359793333856/jetty3/index lockFactory=org.apache.lucene.store.NativeFSLockFactory@52799e79; maxCacheMB=48.0 maxMergeSizeMB=4.0)),segFN=segments_1,generation=1,filenames=[segments_1]
[junit4:junit4]   2> 12596 T1955 oasc.SolrDeletionPolicy.updateCommits newest commit = 1[segments_1]
[junit4:junit4]   2> 12597 T1955 oasc.CachingDirectoryFactory.close Releasing directory:/usr/home/hudson/hudson-slave/workspace/Lucene-Solr-Tests-4.x-Java6/solr/build/solr-core/test/J0/./org.apache.solr.cloud.SyncSliceTest-1359793333856/jetty3/index
[junit4:junit4]   2> 12597 T1955 oasc.SolrCore.initWriters created xml: solr.XMLResponseWriter
[junit4:junit4]   2> 12599 T1955 oasup.UpdateRequestProcessorChain.init inserting DistributedUpdateProcessorFactory into updateRequestProcessorChain "dedupe"
[junit4:junit4]   2> 12600 T1955 oasup.UpdateRequestProcessorChain.init inserting DistributedUpdateProcessorFactory into updateRequestProcessorChain "dedupe-allfields"
[junit4:junit4]   2> 12600 T1955 oasup.UpdateRequestProcessorChain.init inserting DistributedUpdateProcessorFactory into updateRequestProcessorChain "stored_sig"
[junit4:junit4]   2> 12600 T1955 oasup.UpdateRequestProcessorChain.init inserting DistributedUpdateProcessorFactory into updateRequestProcessorChain "uniq-fields"
[junit4:junit4]   2> 12601 T1955 oasup.UpdateRequestProcessorChain.init inserting DistributedUpdateProcessorFactory into updateRequestProcessorChain "distrib-dup-test-chain-implicit"
[junit4:junit4]   2> 12601 T1955 oasc.RequestHandlers.initHandlersFromConfig adding lazy requestHandler: solr.ReplicationHandler
[junit4:junit4]   2> 12601 T1955 oasc.RequestHandlers.initHandlersFromConfig created /replication: solr.ReplicationHandler
[junit4:junit4]   2> 12602 T1955 oasc.RequestHandlers.initHandlersFromConfig created standard: solr.StandardRequestHandler
[junit4:junit4]   2> 12602 T1955 oasc.RequestHandlers.initHandlersFromConfig created /get: solr.RealTimeGetHandler
[junit4:junit4]   2> 12603 T1955 oasc.RequestHandlers.initHandlersFromConfig created dismax: solr.SearchHandler
[junit4:junit4]   2> 12603 T1955 oasc.RequestHandlers.initHandlersFromConfig created mock: org.apache.solr.core.MockQuerySenderListenerReqHandler
[junit4:junit4]   2> 12604 T1955 oasc.RequestHandlers.initHandlersFromConfig created /admin/: org.apache.solr.handler.admin.AdminHandlers
[junit4:junit4]   2> 12604 T1955 oasc.RequestHandlers.initHandlersFromConfig created defaults: solr.StandardRequestHandler
[junit4:junit4]   2> 12604 T1955 oasc.RequestHandlers.initHandlersFromConfig adding lazy requestHandler: solr.StandardRequestHandler
[junit4:junit4]   2> 12605 T1955 oasc.RequestHandlers.initHandlersFromConfig created lazy: solr.StandardRequestHandler
[junit4:junit4]   2> 12605 T1955 oasc.RequestHandlers.initHandlersFromConfig created /update: solr.UpdateRequestHandler
[junit4:junit4]   2> 12606 T1955 oasc.RequestHandlers.initHandlersFromConfig created /terms: org.apache.solr.handler.component.SearchHandler
[junit4:junit4]   2> 12606 T1955 oasc.RequestHandlers.initHandlersFromConfig created spellCheckCompRH: org.apache.solr.handler.component.SearchHandler
[junit4:junit4]   2> 12607 T1955 oasc.RequestHandlers.initHandlersFromConfig created spellCheckCompRH_Direct: org.apache.solr.handler.component.SearchHandler
[junit4:junit4]   2> 12607 T1955 oasc.RequestHandlers.initHandlersFromConfig created spellCheckWithWordbreak: org.apache.solr.handler.component.SearchHandler
[junit4:junit4]   2> 12608 T1955 oasc.RequestHandlers.initHandlersFromConfig created spellCheckWithWordbreak_Direct: org.apache.solr.handler.component.SearchHandler
[junit4:junit4]   2> 12608 T1955 oasc.RequestHandlers.initHandlersFromConfig created spellCheckCompRH1: org.apache.solr.handler.component.SearchHandler
[junit4:junit4]   2> 12609 T1955 oasc.RequestHandlers.initHandlersFromConfig created mltrh: org.apache.solr.handler.component.SearchHandler
[junit4:junit4]   2> 12609 T1955 oasc.RequestHandlers.initHandlersFromConfig created tvrh: org.apache.solr.handler.component.SearchHandler
[junit4:junit4]   2> 12609 T1955 oasc.RequestHandlers.initHandlersFromConfig created /mlt: solr.MoreLikeThisHandler
[junit4:junit4]   2> 12610 T1955 oasc.RequestHandlers.initHandlersFromConfig created /debug/dump: solr.DumpRequestHandler
[junit4:junit4]   2> 12617 T1955 oashl.XMLLoader.init xsltCacheLifetimeSeconds=60
[junit4:junit4]   2> 12621 T1955 oasc.SolrCore.initDeprecatedSupport WARNING solrconfig.xml uses deprecated <admin/gettableFiles>, Please update your config to use the ShowFileRequestHandler.
[junit4:junit4]   2> 12622 T1955 oasc.SolrCore.initDeprecatedSupport WARNING adding ShowFileRequestHandler with hidden files: [SCHEMA.XML, OLD_SYNONYMS.TXT, STOPWORDS.TXT, PROTWORDS.TXT, OPEN-EXCHANGE-RATES.JSON, SYNONYMS.TXT, CURRENCY.XML, MAPPING-ISOLATIN1ACCENT.TXT]
[junit4:junit4]   2> 12624 T1955 oasc.CachingDirectoryFactory.close Releasing directory:/usr/home/hudson/hudson-slave/workspace/Lucene-Solr-Tests-4.x-Java6/solr/build/solr-core/test/J0/./org.apache.solr.cloud.SyncSliceTest-1359793333856/jetty3
[junit4:junit4]   2> 12626 T1955 oass.SolrIndexSearcher.<init> Opening Searcher@53e2c0ce main
[junit4:junit4]   2> 12627 T1955 oasu.CommitTracker.<init> Hard AutoCommit: disabled
[junit4:junit4]   2> 12627 T1955 oasu.CommitTracker.<init> Soft AutoCommit: disabled
[junit4:junit4]   2> 12627 T1955 oashc.SpellCheckComponent.inform Initializing spell checkers
[junit4:junit4]   2> 12639 T1955 oass.DirectSolrSpellChecker.init init: {name=direct,classname=DirectSolrSpellChecker,field=lowerfilt,minQueryLength=3}
[junit4:junit4]   2> 12705 T1956 oasc.SolrCore.registerSearcher [collection1] Registered new searcher Searcher@53e2c0ce main{StandardDirectoryReader(segments_1:1)}
[junit4:junit4]   2> 12715 T1955 oasc.ZkController.publish publishing core=collection1 state=down
[junit4:junit4]   2> 12715 T1955 oasc.ZkController.publish numShards not found on descriptor - reading it from system property
[junit4:junit4]   2> 12996 T1905 oascc.ZkStateReader.updateClusterState Updating cloud state from ZooKeeper... 
[junit4:junit4]   2> 12997 T1905 oasc.Overseer$ClusterStateUpdater.updateState Update state numShards=1 message={
[junit4:junit4]   2> 	  "operation":"state",
[junit4:junit4]   2> 	  "numShards":"1",
[junit4:junit4]   2> 	  "shard":null,
[junit4:junit4]   2> 	  "roles":null,
[junit4:junit4]   2> 	  "state":"down",
[junit4:junit4]   2> 	  "core":"collection1",
[junit4:junit4]   2> 	  "collection":"collection1",
[junit4:junit4]   2> 	  "node_name":"127.0.0.1:28737__f",
[junit4:junit4]   2> 	  "base_url":"http://127.0.0.1:28737/_f"}
[junit4:junit4]   2> 12997 T1905 oasc.Overseer$ClusterStateUpdater.updateState Collection already exists with numShards=1
[junit4:junit4]   2> 12998 T1905 oasc.Overseer$ClusterStateUpdater.updateState Assigning new node to shard shard=shard1
[junit4:junit4]   2> 13013 T1904 oascc.ZkStateReader$2.process A cluster state change: WatchedEvent state:SyncConnected type:NodeDataChanged path:/clusterstate.json, has occurred - updating... (live nodes size: 4)
[junit4:junit4]   2> 13013 T1938 oascc.ZkStateReader$2.process A cluster state change: WatchedEvent state:SyncConnected type:NodeDataChanged path:/clusterstate.json, has occurred - updating... (live nodes size: 4)
[junit4:junit4]   2> 13013 T1954 oascc.ZkStateReader$2.process A cluster state change: WatchedEvent state:SyncConnected type:NodeDataChanged path:/clusterstate.json, has occurred - updating... (live nodes size: 4)
[junit4:junit4]   2> 13013 T1923 oascc.ZkStateReader$2.process A cluster state change: WatchedEvent state:SyncConnected type:NodeDataChanged path:/clusterstate.json, has occurred - updating... (live nodes size: 4)
[junit4:junit4]   2> 13013 T1910 oascc.ZkStateReader$2.process A cluster state change: WatchedEvent state:SyncConnected type:NodeDataChanged path:/clusterstate.json, has occurred - updating... (live nodes size: 4)
[junit4:junit4]   2>  C103_STATE=coll:collection1 core:collection1 props:{shard=shard1, roles=null, state=recovering, core=collection1, collection=collection1, node_name=127.0.0.1:28687__f, base_url=http://127.0.0.1:28687/_f}
[junit4:junit4]   2> 13669 T1941 C103 P28687 oasc.RecoveryStrategy.doRecovery Attempting to PeerSync from http://127.0.0.1:28653/_f/collection1/ core=collection1 - recoveringAfterStartup=true
[junit4:junit4]   2> 13669 T1941 C103 P28687 oasu.PeerSync.sync PeerSync: core=collection1 url=http://127.0.0.1:28687/_f START replicas=[http://127.0.0.1:28653/_f/collection1/] nUpdates=100
[junit4:junit4]   2> 13671 T1941 C103 P28687 oasu.PeerSync.sync WARNING no frame of reference to tell of we've missed updates
[junit4:junit4]   2> 13676 T1941 C103 P28687 oasc.RecoveryStrategy.doRecovery PeerSync Recovery was not successful - trying replication. core=collection1
[junit4:junit4]   2> 13676 T1941 C103 P28687 oasc.RecoveryStrategy.doRecovery Starting Replication Recovery. core=collection1
[junit4:junit4]   2> 13677 T1941 C103 P28687 oasc.RecoveryStrategy.doRecovery Begin buffering updates. core=collection1
[junit4:junit4]   2> 13677 T1941 C103 P28687 oasu.UpdateLog.bufferUpdates Starting to buffer updates. FSUpdateLog{state=ACTIVE, tlog=null}
[junit4:junit4]   2> 13677 T1941 C103 P28687 oasc.RecoveryStrategy.replicate Attempting to replicate from http://127.0.0.1:28653/_f/collection1/. core=collection1
[junit4:junit4]   2> 13677 T1941 C103 P28687 oascsi.HttpClientUtil.createClient Creating new http client, config:maxConnections=128&maxConnectionsPerHost=32&followRedirects=false
[junit4:junit4]   2> 13719 T1955 oasc.CoreContainer.registerCore registering core: collection1
[junit4:junit4]   2> 13720 T1955 oasc.ZkController.register Register replica - core:collection1 address:http://127.0.0.1:28737/_f collection:collection1 shard:shard1
[junit4:junit4]   2> ASYNC  NEW_CORE C104 name=collection1 org.apache.solr.core.SolrCore@1964b8c9 url=http://127.0.0.1:28653/_f/collection1 node=127.0.0.1:28653__f C104_STATE=coll:collection1 core:collection1 props:{shard=shard1, roles=null, state=active, core=collection1, collection=collection1, node_name=127.0.0.1:28653__f, base_url=http://127.0.0.1:28653/_f, leader=true}
[junit4:junit4]   2> 13756 T1914 C104 P28653 REQ /get {getVersions=100&distrib=false&wt=javabin&qt=/get&version=2} status=0 QTime=2 
[junit4:junit4]   2> 13764 T1955 oasc.ZkController.register We are http://127.0.0.1:28737/_f/collection1/ and leader is http://127.0.0.1:28653/_f/collection1/
[junit4:junit4]   2> 13764 T1955 oasc.ZkController.register No LogReplay needed for core=collection1 baseURL=http://127.0.0.1:28737/_f
[junit4:junit4]   2> 13765 T1955 oasc.ZkController.checkRecovery Core needs to recover:collection1
[junit4:junit4]   2> 13765 T1955 oasu.DefaultSolrCoreState.doRecovery Running recovery - first canceling any ongoing recovery
[junit4:junit4]   2> ASYNC  NEW_CORE C105 name=collection1 org.apache.solr.core.SolrCore@185a5fb5 url=http://127.0.0.1:28737/_f/collection1 node=127.0.0.1:28737__f C105_STATE=coll:collection1 core:collection1 props:{shard=null, roles=null, state=down, core=collection1, collection=collection1, node_name=127.0.0.1:28737__f, base_url=http://127.0.0.1:28737/_f}
[junit4:junit4]   2> 13765 T1958 C105 P28737 oasc.RecoveryStrategy.run Starting recovery process.  core=collection1 recoveringAfterStartup=true
[junit4:junit4]   2> 13766 T1958 C105 P28737 oasc.RecoveryStrategy.doRecovery ###### startupVersions=[]
[junit4:junit4]   2> 13766 T1958 C105 P28737 oasc.ZkController.publish publishing core=collection1 state=recovering
[junit4:junit4]   2> 13766 T1958 C105 P28737 oasc.ZkController.publish numShards not found on descriptor - reading it from system property
[junit4:junit4]   2> 13774 T1955 oascc.ZkStateReader.updateClusterState Updating cloud state from ZooKeeper... 
[junit4:junit4]   2> 13776 T1882 oass.SolrDispatchFilter.init user.dir=/usr/home/hudson/hudson-slave/workspace/Lucene-Solr-Tests-4.x-Java6/solr/build/solr-core/test/J0
[junit4:junit4]   2> 13777 T1882 oass.SolrDispatchFilter.init SolrDispatchFilter.init() done
[junit4:junit4]   2> 13777 T1882 oascsi.HttpClientUtil.createClient Creating new http client, config:maxConnections=128&maxConnectionsPerHost=32&followRedirects=false
[junit4:junit4]   2> 13777 T1958 C105 P28737 oascsi.HttpClientUtil.createClient Creating new http client, config:maxConnections=128&maxConnectionsPerHost=32&followRedirects=false
[junit4:junit4]   2> 13792 T1915 C104 P28653 oasu.DirectUpdateHandler2.commit start commit{,optimize=false,openSearcher=false,waitSearcher=true,expungeDeletes=false,softCommit=false}
[junit4:junit4]   2> 13824 T1915 C104 P28653 oasc.CachingDirectoryFactory.close Releasing directory:/usr/home/hudson/hudson-slave/workspace/Lucene-Solr-Tests-4.x-Java6/solr/build/solr-core/test/J0/./org.apache.solr.cloud.SyncSliceTest-1359793333856/jetty1
[junit4:junit4]   2> 13864 T1915 C104 P28653 oasc.SolrDeletionPolicy.onInit SolrDeletionPolicy.onInit: commits:num=1
[junit4:junit4]   2> 		commit{dir=RateLimitedDirectoryWrapper(NRTCachingDirectory(org.apache.lucene.store.NIOFSDirectory@/usr/home/hudson/hudson-slave/workspace/Lucene-Solr-Tests-4.x-Java6/solr/build/solr-core/test/J0/org.apache.solr.cloud.SyncSliceTest-1359793333856/jetty1/index lockFactory=org.apache.lucene.store.NativeFSLockFactory@1f7884c3; maxCacheMB=48.0 maxMergeSizeMB=4.0)),segFN=segments_1,generation=1,filenames=[segments_1]
[junit4:junit4]   2> 13869 T1915 C104 P28653 oasc.SolrDeletionPolicy.updateCommits newest commit = 1[segments_1]
[junit4:junit4]   2> 13908 T1915 C104 P28653 oasc.SolrDeletionPolicy.onCommit SolrDeletionPolicy.onCommit: commits:num=2
[junit4:junit4]   2> 		commit{dir=RateLimitedDirectoryWrapper(NRTCachingDirectory(org.apache.lucene.store.NIOFSDirectory@/usr/home/hudson/hudson-slave/workspace/Lucene-Solr-Tests-4.x-Java6/solr/build/solr-core/test/J0/org.apache.solr.cloud.SyncSliceTest-1359793333856/jetty1/index lockFactory=org.apache.lucene.store.NativeFSLockFactory@1f7884c3; maxCacheMB=48.0 maxMergeSizeMB=4.0)),segFN=segments_1,generation=1,filenames=[segments_1]
[junit4:junit4]   2> 		commit{dir=RateLimitedDirectoryWrapper(NRTCachingDirectory(org.apache.lucene.store.NIOFSDirectory@/usr/home/hudson/hudson-slave/workspace/Lucene-Solr-Tests-4.x-Java6/solr/build/solr-core/test/J0/org.apache.solr.cloud.SyncSliceTest-1359793333856/jetty1/index lockFactory=org.apache.lucene.store.NativeFSLockFactory@1f7884c3; maxCacheMB=48.0 maxMergeSizeMB=4.0)),segFN=segments_2,generation=2,filenames=[segments_2]
[junit4:junit4]   2> 13908 T1915 C104 P28653 oasc.SolrDeletionPolicy.updateCommits newest commit = 2[segments_2]
[junit4:junit4]   2> 13916 T1915 C104 P28653 oasc.CachingDirectoryFactory.close Releasing directory:/usr/home/hudson/hudson-slave/workspace/Lucene-Solr-Tests-4.x-Java6/solr/build/solr-core/test/J0/./org.apache.solr.cloud.SyncSliceTest-1359793333856/jetty1
[junit4:junit4]   2> 13917 T1915 C104 P28653 oass.SolrIndexSearcher.<init> Opening Searcher@232d3cc7 realtime
[junit4:junit4]   2> 13918 T1915 C104 P28653 oasu.DirectUpdateHandler2.commit end_commit_flush
[junit4:junit4]   2> 13918 T1915 C104 P28653 /update {waitSearcher=true&openSearcher=false&commit=true&wt=javabin&commit_end_point=true&version=2&softCommit=false} {commit=} 0 126
[junit4:junit4]   2> 13921 T1941 C103 P28687 oash.ReplicationHandler.inform Commits will be reserved for  10000
[junit4:junit4]   2> 13921 T1941 C103 P28687 oash.SnapPuller.<init>  No value set for 'pollInterval'. Timer Task not started.
[junit4:junit4]   2> 13923 T1916 C104 P28653 oash.ReplicationHandler.inform Commits will be reserved for  10000
[junit4:junit4]   2> 13923 T1916 C104 P28653 REQ /replication {command=indexversion&qt=/replication&wt=javabin&version=2} status=0 QTime=1 
[junit4:junit4]   2> 13924 T1941 C103 P28687 oash.SnapPuller.fetchLatestIndex Master's generation: 2
[junit4:junit4]   2> 13924 T1941 C103 P28687 oash.SnapPuller.fetchLatestIndex Slave's generation: 1
[junit4:junit4]   2> 13925 T1941 C103 P28687 oash.SnapPuller.fetchLatestIndex Starting replication process
[junit4:junit4]   2> 13929 T1916 C104 P28653 oasc.CachingDirectoryFactory.close Releasing directory:/usr/home/hudson/hudson-slave/workspace/Lucene-Solr-Tests-4.x-Java6/solr/build/solr-core/test/J0/./org.apache.solr.cloud.SyncSliceTest-1359793333856/jetty1
[junit4:junit4]   2> 13933 T1916 C104 P28653 oasc.CachingDirectoryFactory.close Releasing directory:/usr/home/hudson/hudson-slave/workspace/Lucene-Solr-Tests-4.x-Java6/solr/build/solr-core/test/J0/./org.apache.solr.cloud.SyncSliceTest-1359793333856/jetty1/index
[junit4:junit4]   2> 13934 T1916 C104 P28653 REQ /replication {command=filelist&qt=/replication&wt=javabin&generation=2&version=2} status=0 QTime=5 
[junit4:junit4]   2> 13940 T1941 C103 P28687 oash.SnapPuller.fetchLatestIndex Number of files in latest index in master: 1
[junit4:junit4]   2> 13947 T1941 C103 P28687 oasc.CachingDirectoryFactory.get return new directory for /usr/home/hudson/hudson-slave/workspace/Lucene-Solr-Tests-4.x-Java6/solr/build/solr-core/test/J0/./org.apache.solr.cloud.SyncSliceTest-1359793333856/jetty2/index.20130202022227792 forceNew:false
[junit4:junit4]   2> 13951 T1941 C103 P28687 oasc.CachingDirectoryFactory.close Releasing directory:/usr/home/hudson/hudson-slave/workspace/Lucene-Solr-Tests-4.x-Java6/solr/build/solr-core/test/J0/./org.apache.solr.cloud.SyncSliceTest-1359793333856/jetty2
[junit4:junit4]   2> 13955 T1941 C103 P28687 oash.SnapPuller.fetchLatestIndex Starting download to RateLimitedDirectoryWrapper(NRTCachingDirectory(org.apache.lucene.store.NIOFSDirectory@/usr/home/hudson/hudson-slave/workspace/Lucene-Solr-Tests-4.x-Java6/solr/build/solr-core/test/J0/org.apache.solr.cloud.SyncSliceTest-1359793333856/jetty2/index.20130202022227792 lockFactory=org.apache.lucene.store.NativeFSLockFactory@25c9aac9; maxCacheMB=48.0 maxMergeSizeMB=4.0)) fullCopy=true
[junit4:junit4]   2> 13965 T1916 C104 P28653 REQ /replication {file=segments_2&command=filecontent&checksum=true&wt=filestream&qt=/replication&generation=2} status=0 QTime=0 
[junit4:junit4]   2> 13980 T1941 C103 P28687 oasc.CachingDirectoryFactory.close Releasing directory:/usr/home/hudson/hudson-slave/workspace/Lucene-Solr-Tests-4.x-Java6/solr/build/solr-core/test/J0/./org.apache.solr.cloud.SyncSliceTest-1359793333856/jetty2/index
[junit4:junit4]   2> 13980 T1941 C103 P28687 oash.SnapPuller.fetchLatestIndex Total time taken for download : 0 secs
[junit4:junit4]   2> 13982 T1941 C103 P28687 oash.SnapPuller.modifyIndexProps New index installed. Updating index properties... index=index.20130202022227792
[junit4:junit4]   2> 13990 T1941 C103 P28687 oasc.CachingDirectoryFactory.close Releasing directory:/usr/home/hudson/hudson-slave/workspace/Lucene-Solr-Tests-4.x-Java6/solr/build/solr-core/test/J0/./org.apache.solr.cloud.SyncSliceTest-1359793333856/jetty2
[junit4:junit4]   2> 13991 T1941 C103 P28687 oasc.CachingDirectoryFactory.close Releasing directory:/usr/home/hudson/hudson-slave/workspace/Lucene-Solr-Tests-4.x-Java6/solr/build/solr-core/test/J0/./org.apache.solr.cloud.SyncSliceTest-1359793333856/jetty2
[junit4:junit4]   2> 13991 T1941 C103 P28687 oasc.SolrCore.getNewIndexDir New index directory detected: old=./org.apache.solr.cloud.SyncSliceTest-1359793333856/jetty2/index/ new=./org.apache.solr.cloud.SyncSliceTest-1359793333856/jetty2/index.20130202022227792
[junit4:junit4]   2> 13997 T1941 C103 P28687 oasc.SolrDeletionPolicy.onInit SolrDeletionPolicy.onInit: commits:num=1
[junit4:junit4]   2> 		commit{dir=RateLimitedDirectoryWrapper(NRTCachingDirectory(org.apache.lucene.store.NIOFSDirectory@/usr/home/hudson/hudson-slave/workspace/Lucene-Solr-Tests-4.x-Java6/solr/build/solr-core/test/J0/org.apache.solr.cloud.SyncSliceTest-1359793333856/jetty2/index.20130202022227792 lockFactory=org.apache.lucene.store.NativeFSLockFactory@25c9aac9; maxCacheMB=48.0 maxMergeSizeMB=4.0)),segFN=segments_2,generation=2,filenames=[segments_2]
[junit4:junit4]   2> 13998 T1941 C103 P28687 oasc.SolrDeletionPolicy.updateCommits newest commit = 2[segments_2]
[junit4:junit4]   2> 14005 T1941 C103 P28687 oasc.CachingDirectoryFactory.close Releasing directory:/usr/home/hudson/hudson-slave/workspace/Lucene-Solr-Tests-4.x-Java6/solr/build/solr-core/test/J0/./org.apache.solr.cloud.SyncSliceTest-1359793333856/jetty2
[junit4:junit4]   2> 14005 T1941 C103 P28687 oasu.DefaultSolrCoreState.newIndexWriter Creating new IndexWriter...
[junit4:junit4]   2> 14005 T1941 C103 P28687 oasu.DefaultSolrCoreState.newIndexWriter Waiting until IndexWriter is unused... core=collection1
[junit4:junit4]   2> 14005 T1941 C103 P28687 oasu.DefaultSolrCoreState.newIndexWriter Rollback old IndexWriter... core=collection1
[junit4:junit4]   2> 14008 T1941 C103 P28687 oasc.CachingDirectoryFactory.close Releasing directory:/usr/home/hudson/hudson-slave/workspace/Lucene-Solr-Tests-4.x-Java6/solr/build/solr-core/test/J0/./org.apache.solr.cloud.SyncSliceTest-1359793333856/jetty2/index.20130202022227792
[junit4:junit4]   2> 14012 T1941 C103 P28687 oasc.CachingDirectoryFactory.close Releasing directory:/usr/home/hudson/hudson-slave/workspace/Lucene-Solr-Tests-4.x-Java6/solr/build/solr-core/test/J0/./org.apache.solr.cloud.SyncSliceTest-1359793333856/jetty2
[junit4:junit4]   2> 14037 T1941 C103 P28687 oasc.SolrDeletionPolicy.onInit SolrDeletionPolicy.onInit: commits:num=1
[junit4:junit4]   2> 		commit{dir=RateLimitedDirectoryWrapper(NRTCachingDirectory(org.apache.lucene.store.NIOFSDirectory@/usr/home/hudson/hudson-slave/workspace/Lucene-Solr-Tests-4.x-Java6/solr/build/solr-core/test/J0/org.apache.solr.cloud.SyncSliceTest-1359793333856/jetty2/index.20130202022227792 lockFactory=org.apache.lucene.store.NativeFSLockFactory@25c9aac9; maxCacheMB=48.0 maxMergeSizeMB=4.0)),segFN=segments_2,generation=2,filenames=[segments_2]
[junit4:junit4]   2> 14037 T1941 C103 P28687 oasc.SolrDeletionPolicy.updateCommits newest commit = 2[segments_2]
[junit4:junit4]   2> 14038 T1941 C103 P28687 oasu.DefaultSolrCoreState.newIndexWriter New IndexWriter is ready to be used.
[junit4:junit4]   2> 14039 T1941 C103 P28687 oasc.CachingDirectoryFactory.close Releasing directory:/usr/home/hudson/hudson-slave/workspace/Lucene-Solr-Tests-4.x-Java6/solr/build/solr-core/test/J0/./org.apache.solr.cloud.SyncSliceTest-1359793333856/jetty2
[junit4:junit4]   2> 14039 T1941 C103 P28687 oass.SolrIndexSearcher.<init> Opening Searcher@4c97afa5 main
[junit4:junit4]   2> 14042 T1940 oasc.SolrCore.registerSearcher [collection1] Registered new searcher Searcher@4c97afa5 main{StandardDirectoryReader(segments_2:1:nrt)}
[junit4:junit4]   2> 14043 T1940 oasc.CachingDirectoryFactory.close Releasing directory:/usr/home/hudson/hudson-slave/workspace/Lucene-Solr-Tests-4.x-Java6/solr/build/solr-core/test/J0/./org.apache.solr.cloud.SyncSliceTest-1359793333856/jetty2/index
[junit4:junit4]   2> 14043 T1941 C103 P28687 oasu.DirectUpdateHandler2.commit start commit{,optimize=false,openSearcher=false,waitSearcher=false,expungeDeletes=false,softCommit=false}
[junit4:junit4]   2> 14076 T1941 C103 P28687 oasc.SolrDeletionPolicy.onCommit SolrDeletionPolicy.onCommit: commits:num=2
[junit4:junit4]   2> 		commit{dir=RateLimitedDirectoryWrapper(NRTCachingDirectory(org.apache.lucene.store.NIOFSDirectory@/usr/home/hudson/hudson-slave/workspace/Lucene-Solr-Tests-4.x-Java6/solr/build/solr-core/test/J0/org.apache.solr.cloud.SyncSliceTest-1359793333856/jetty2/index.20130202022227792 lockFactory=org.apache.lucene.store.NativeFSLockFactory@25c9aac9; maxCacheMB=48.0 maxMergeSizeMB=4.0)),segFN=segments_2,generation=2,filenames=[segments_2]
[junit4:junit4]   2> 		commit{dir=RateLimitedDirectoryWrapper(NRTCachingDirectory(org.apache.lucene.store.NIOFSDirectory@/usr/home/hudson/hudson-slave/workspace/Lucene-Solr-Tests-4.x-Java6/solr/build/solr-core/test/J0/org.apache.solr.cloud.SyncSliceTest-1359793333856/jetty2/index.20130202022227792 lockFactory=org.apache.lucene.store.NativeFSLockFactory@25c9aac9; maxCacheMB=48.0 maxMergeSizeMB=4.0)),segFN=segments_3,generation=3,filenames=[segments_3]
[junit4:junit4]   2> 14077 T1941 C103 P28687 oasc.SolrDeletionPolicy.updateCommits newest commit = 3[segments_3]
[junit4:junit4]   2> 14078 T1941 C103 P28687 oasc.CachingDirectoryFactory.close Releasing directory:/usr/home/hudson/hudson-slave/workspace/Lucene-Solr-Tests-4.x-Java6/solr/build/solr-core/test/J0/./org.apache.solr.cloud.SyncSliceTest-1359793333856/jetty2
[junit4:junit4]   2> 14079 T1941 C103 P28687 oasu.DirectUpdateHandler2.commit end_commit_flush
[junit4:junit4]   2> 14079 T1941 C103 P28687 oasc.CachingDirectoryFactory.close Releasing directory:/usr/home/hudson/hudson-slave/workspace/Lucene-Solr-Tests-4.x-Java6/solr/build/solr-core/test/J0/./org.apache.solr.cloud.SyncSliceTest-1359793333856/jetty2/index.20130202022227792
[junit4:junit4]   2> 14079 T1941 C103 P28687 oasc.CachingDirectoryFactory.close Releasing directory:/usr/home/hudson/hudson-slave/workspace/Lucene-Solr-Tests-4.x-Java6/solr/build/solr-core/test/J0/./org.apache.solr.cloud.SyncSliceTest-1359793333856/jetty2/index
[junit4:junit4]   2> 14079 T1941 C103 P28687 oasc.RecoveryStrategy.replay No replay needed. core=collection1
[junit4:junit4]   2> 14080 T1941 C103 P28687 oasc.RecoveryStrategy.doRecovery Replication Recovery was successful - registering as Active. core=collection1
[junit4:junit4]   2> 14080 T1941 C103 P28687 oasc.ZkController.publish publishing core=collection1 state=active
[junit4:junit4]   2> 14080 T1941 C103 P28687 oasc.ZkController.publish numShards not found on descriptor - reading it from system property
[junit4:junit4]   2> 14083 T1941 C103 P28687 oasc.RecoveryStrategy.doRecovery Finished recovery process. core=collection1
[junit4:junit4]   2> 14257 T1882 oejs.Server.doStart jetty-8.1.8.v20121106
[junit4:junit4]   2> 14260 T1882 oejs.AbstractConnector.doStart Started SocketConnector@127.0.0.1:28765
[junit4:junit4]   2> 14262 T1882 oass.SolrDispatchFilter.init SolrDispatchFilter.init()
[junit4:junit4]   2> 14262 T1882 oasc.SolrResourceLoader.locateSolrHome JNDI not configured for solr (NoInitialContextEx)
[junit4:junit4]   2> 14263 T1882 oasc.SolrResourceLoader.locateSolrHome using system property solr.solr.home: /usr/home/hudson/hudson-slave/workspace/Lucene-Solr-Tests-4.x-Java6/solr/build/solr-core/test/J0/./org.apache.solr.cloud.SyncSliceTest-jetty4-1359793347669
[junit4:junit4]   2> 14263 T1882 oasc.CoreContainer$Initializer.initialize looking for solr.xml: /usr/home/hudson/hudson-slave/workspace/Lucene-Solr-Tests-4.x-Java6/solr/build/solr-core/test/J0/./org.apache.solr.cloud.SyncSliceTest-jetty4-1359793347669/solr.xml
[junit4:junit4]   2> 14264 T1882 oasc.CoreContainer.<init> New CoreContainer 1370240142
[junit4:junit4]   2> 14265 T1882 oasc.CoreContainer.load Loading CoreContainer using Solr Home: '/usr/home/hudson/hudson-slave/workspace/Lucene-Solr-Tests-4.x-Java6/solr/build/solr-core/test/J0/./org.apache.solr.cloud.SyncSliceTest-jetty4-1359793347669/'
[junit4:junit4]   2> 14266 T1882 oasc.SolrResourceLoader.<init> new SolrResourceLoader for directory: '/usr/home/hudson/hudson-slave/workspace/Lucene-Solr-Tests-4.x-Java6/solr/build/solr-core/test/J0/./org.apache.solr.cloud.SyncSliceTest-jetty4-1359793347669/'
[junit4:junit4]   2> 14351 T1882 oashc.HttpShardHandlerFactory.getParameter Setting socketTimeout to: 60000
[junit4:junit4]   2> 14352 T1882 oashc.HttpShardHandlerFactory.getParameter Setting urlScheme to: http://
[junit4:junit4]   2> 14352 T1882 oashc.HttpShardHandlerFactory.getParameter Setting connTimeout to: 15000
[junit4:junit4]   2> 14353 T1882 oashc.HttpShardHandlerFactory.getParameter Setting maxConnectionsPerHost to: 20
[junit4:junit4]   2> 14354 T1882 oashc.HttpShardHandlerFactory.getParameter Setting corePoolSize to: 0
[junit4:junit4]   2> 14354 T1882 oashc.HttpShardHandlerFactory.getParameter Setting maximumPoolSize to: 2147483647
[junit4:junit4]   2> 14355 T1882 oashc.HttpShardHandlerFactory.getParameter Setting maxThreadIdleTime to: 5
[junit4:junit4]   2> 14355 T1882 oashc.HttpShardHandlerFactory.getParameter Setting sizeOfQueue to: -1
[junit4:junit4]   2> 14356 T1882 oashc.HttpShardHandlerFactory.getParameter Setting fairnessPolicy to: false
[junit4:junit4]   2> 14356 T1882 oascsi.HttpClientUtil.createClient Creating new http client, config:maxConnectionsPerHost=20&maxConnections=10000&socketTimeout=60000&connTimeout=15000&retry=false
[junit4:junit4]   2> 14383 T1882 oasc.CoreContainer.load Registering Log Listener
[junit4:junit4]   2> 14407 T1882 oasc.CoreContainer.initZooKeeper Zookeeper client=127.0.0.1:28621/solr
[junit4:junit4]   2> 14408 T1882 oasc.ZkController.checkChrootPath zkHost includes chroot
[junit4:junit4]   2> 14409 T1882 oaz.ZooKeeper.<init> Initiating client connection, connectString=127.0.0.1:28621 sessionTimeout=60000 watcher=org.apache.solr.common.cloud.ConnectionManager@4077ddc3
[junit4:junit4]   2> 14410 T1882 oascc.ConnectionManager.waitForConnected Waiting for client to connect to ZooKeeper
[junit4:junit4]   2> 14411 T1969 oaz.ClientCnxn$SendThread.logStartConnect Opening socket connection to server localhost/127.0.0.1:28621. Will not attempt to authenticate using SASL (access denied (javax.security.auth.AuthPermission getLoginConfiguration))
[junit4:junit4]   2> 14412 T1969 oaz.ClientCnxn$SendThread.primeConnection Socket connection established to localhost/127.0.0.1:28621, initiating session
[junit4:junit4]   2> 14412 T1884 oazs.NIOServerCnxnFactory.run Accepted socket connection from /140.211.11.196:28766
[junit4:junit4]   2> 14412 T1884 oazs.ZooKeeperServer.processConnectRequest Client attempting to establish new session at /140.211.11.196:28766
[junit4:junit4]   2> 14417 T1886 oazs.ZooKeeperServer.finishSessionInit Established session 0x13c99ffa66b000b with negotiated timeout 20000 for client /140.211.11.196:28766
[junit4:junit4]   2> 14417 T1969 oaz.ClientCnxn$SendThread.onConnected Session establishment complete on server localhost/127.0.0.1:28621, sessionid = 0x13c99ffa66b000b, negotiated timeout = 20000
[junit4:junit4]   2> 14417 T1970 oascc.ConnectionManager.process Watcher org.apache.solr.common.cloud.ConnectionManager@4077ddc3 name:ZooKeeperConnection Watcher:127.0.0.1:28621 got event WatchedEvent state:SyncConnected type:None path:null path:null type:None
[junit4:junit4]   2> 14418 T1882 oascc.ConnectionManager.waitForConnected Client is connected to ZooKeeper
[junit4:junit4]   2> 14419 T1887 oazs.PrepRequestProcessor.pRequest2Txn Processed session termination for sessionid: 0x13c99ffa66b000b
[junit4:junit4]   2> 14425 T1970 oaz.ClientCnxn$EventThread.run EventThread shut down
[junit4:junit4]   2> 14425 T1884 oazs.NIOServerCnxn.closeSock Closed socket connection for client /140.211.11.196:28766 which had sessionid 0x13c99ffa66b000b
[junit4:junit4]   2> 14425 T1882 oaz.ZooKeeper.close Session: 0x13c99ffa66b000b closed
[junit4:junit4]   2> 14426 T1882 oascsi.HttpClientUtil.createClient Creating new http client, config:maxConnections=500&maxConnectionsPerHost=16&socketTimeout=60000&connTimeout=15000
[junit4:junit4]   2> 14440 T1882 oaz.ZooKeeper.<init> Initiating client connection, connectString=127.0.0.1:28621/solr sessionTimeout=30000 watcher=org.apache.solr.common.cloud.ConnectionManager@328e20b8
[junit4:junit4]   2> 14441 T1882 oascc.ConnectionManager.waitForConnected Waiting for client to connect to ZooKeeper
[junit4:junit4]   2> 14442 T1971 oaz.ClientCnxn$SendThread.logStartConnect Opening socket connection to server localhost/127.0.0.1:28621. Will not attempt to authenticate using SASL (access denied (javax.security.auth.AuthPermission getLoginConfiguration))
[junit4:junit4]   2> 14442 T1971 oaz.ClientCnxn$SendThread.primeConnection Socket connection established to localhost/127.0.0.1:28621, initiating session
[junit4:junit4]   2> 14443 T1884 oazs.NIOServerCnxnFactory.run Accepted socket connection from /140.211.11.196:28767
[junit4:junit4]   2> 14443 T1884 oazs.ZooKeeperServer.processConnectRequest Client attempting to establish new session at /140.211.11.196:28767
[junit4:junit4]   2> 14448 T1886 oazs.ZooKeeperServer.finishSessionInit Established session 0x13c99ffa66b000c with negotiated timeout 20000 for client /140.211.11.196:28767
[junit4:junit4]   2> 14448 T1971 oaz.ClientCnxn$SendThread.onConnected Session establishment complete on server localhost/127.0.0.1:28621, sessionid = 0x13c99ffa66b000c, negotiated timeout = 20000
[junit4:junit4]   2> 14448 T1972 oascc.ConnectionManager.process Watcher org.apache.solr.common.cloud.ConnectionManager@328e20b8 name:ZooKeeperConnection Watcher:127.0.0.1:28621/solr got event WatchedEvent state:SyncConnected type:None path:null path:null type:None
[junit4:junit4]   2> 14448 T1882 oascc.ConnectionManager.waitForConnected Client is connected to ZooKeeper
[junit4:junit4]   2> 14449 T1887 oazs.PrepRequestProcessor.pRequest Got user-level KeeperException when processing sessionid:0x13c99ffa66b000c type:create cxid:0x1 zxid:0x93 txntype:-1 reqpath:n/a Error Path:/solr/overseer Error:KeeperErrorCode = NodeExists for /solr/overseer
[junit4:junit4]   2> 14458 T1887 oazs.PrepRequestProcessor.pRequest Got user-level KeeperException when processing sessionid:0x13c99ffa66b000c type:create cxid:0x2 zxid:0x94 txntype:-1 reqpath:n/a Error Path:/solr/overseer Error:KeeperErrorCode = NodeExists for /solr/overseer
[junit4:junit4]   2> 14460 T1882 oasc.ZkController.createEphemeralLiveNode Register node as live in ZooKeeper:/live_nodes/127.0.0.1:28765__f
[junit4:junit4]   2> 14460 T1887 oazs.PrepRequestProcessor.pRequest Got user-level KeeperException when processing sessionid:0x13c99ffa66b000c type:delete cxid:0x4 zxid:0x95 txntype:-1 reqpath:n/a Error Path:/solr/live_nodes/127.0.0.1:28765__f Error:KeeperErrorCode = NoNode for /solr/live_nodes/127.0.0.1:28765__f
[junit4:junit4]   2> 14461 T1882 oascc.SolrZkClient.makePath makePath: /live_nodes/127.0.0.1:28765__f
[junit4:junit4]   2> 14463 T1954 oascc.ZkStateReader$2.process A cluster state change: WatchedEvent state:SyncConnected type:NodeChildrenChanged path:/live_nodes, has occurred - updating... (live nodes size: 4)
[junit4:junit4]   2> 14463 T1923 oascc.ZkStateReader$2.process A cluster state change: WatchedEvent state:SyncConnected type:NodeChildrenChanged path:/live_nodes, has occurred - updating... (live nodes size: 4)
[junit4:junit4]   2> 14464 T1938 oascc.ZkStateReader$2.process A cluster state change: WatchedEvent state:SyncConnected type:NodeChildrenChanged path:/live_nodes, has occurred - updating... (live nodes size: 4)
[junit4:junit4]   2> 14464 T1904 oascc.ZkStateReader$3.process Updating live nodes... (5)
[junit4:junit4]   2> 14464 T1910 oascc.ZkStateReader$3.process Updating live nodes... (5)
[junit4:junit4]   2> 14464 T1904 oascc.ZkStateReader$2.process A cluster state change: WatchedEvent state:SyncConnected type:NodeChildrenChanged path:/live_nodes, has occurred - updating... (live nodes size: 5)
[junit4:junit4]   2> 14464 T1910 oascc.ZkStateReader$2.process A cluster state change: WatchedEvent state:SyncConnected type:NodeChildrenChanged path:/live_nodes, has occurred - updating... (live nodes size: 5)
[junit4:junit4]   2> 14465 T1954 oascc.ZkStateReader$3.process Updating live nodes... (5)
[junit4:junit4]   2> 14465 T1923 oascc.ZkStateReader$3.process Updating live nodes... (5)
[junit4:junit4]   2> 14465 T1938 oascc.ZkStateReader$3.process Updating live nodes... (5)
[junit4:junit4]   2> 14468 T1882 oascc.ZkStateReader.createClusterStateWatchersAndUpdate Updating cluster state from ZooKeeper... 
[junit4:junit4]   2> 14475 T1973 oasc.CoreContainer.create Creating SolrCore 'collection1' using instanceDir: /usr/home/hudson/hudson-slave/workspace/Lucene-Solr-Tests-4.x-Java6/solr/build/solr-core/test/J0/./org.apache.solr.cloud.SyncSliceTest-jetty4-1359793347669/collection1
[junit4:junit4]   2> 14475 T1973 oasc.ZkController.createCollectionZkNode Check for collection zkNode:collection1
[junit4:junit4]   2> 14476 T1973 oasc.ZkController.createCollectionZkNode Collection zkNode exists
[junit4:junit4]   2> 14476 T1973 oasc.ZkController.readConfigName Load collection config from:/collections/collection1
[junit4:junit4]   2> 14478 T1973 oasc.SolrResourceLoader.<init> new SolrResourceLoader for directory: '/usr/home/hudson/hudson-slave/workspace/Lucene-Solr-Tests-4.x-Java6/solr/build/solr-core/test/J0/./org.apache.solr.cloud.SyncSliceTest-jetty4-1359793347669/collection1/'
[junit4:junit4]   2> 14479 T1973 oasc.SolrResourceLoader.replaceClassLoader Adding 'file:/usr/home/hudson/hudson-slave/workspace/Lucene-Solr-Tests-4.x-Java6/solr/build/solr-core/test/J0/org.apache.solr.cloud.SyncSliceTest-jetty4-1359793347669/collection1/lib/classes/' to classloader
[junit4:junit4]   2> 14479 T1973 oasc.SolrResourceLoader.replaceClassLoader Adding 'file:/usr/home/hudson/hudson-slave/workspace/Lucene-Solr-Tests-4.x-Java6/solr/build/solr-core/test/J0/org.apache.solr.cloud.SyncSliceTest-jetty4-1359793347669/collection1/lib/README' to classloader
[junit4:junit4]   2> 14525 T1905 oascc.ZkStateReader.updateClusterState Updating cloud state from ZooKeeper... 
[junit4:junit4]   2> 14526 T1905 oasc.Overseer$ClusterStateUpdater.updateState Update state numShards=1 message={
[junit4:junit4]   2> 	  "operation":"state",
[junit4:junit4]   2> 	  "numShards":"1",
[junit4:junit4]   2> 	  "shard":"shard1",
[junit4:junit4]   2> 	  "roles":null,
[junit4:junit4]   2> 	  "state":"recovering",
[junit4:junit4]   2> 	  "core":"collection1",
[junit4:junit4]   2> 	  "collection":"collection1",
[junit4:junit4]   2> 	  "node_name":"127.0.0.1:28737__f",
[junit4:junit4]   2> 	  "base_url":"http://127.0.0.1:28737/_f"}
[junit4:junit4]   2> 14534 T1973 oasc.SolrConfig.<init> Using Lucene MatchVersion: LUCENE_42
[junit4:junit4]   2> 14539 T1905 oasc.Overseer$ClusterStateUpdater.updateState Update state numShards=1 message={
[junit4:junit4]   2> 	  "operation":"state",
[junit4:junit4]   2> 	  "numShards":"1",
[junit4:junit4]   2> 	  "shard":"shard1",
[junit4:junit4]   2> 	  "roles":null,
[junit4:junit4]   2> 	  "state":"active",
[junit4:junit4]   2> 	  "core":"collection1",
[junit4:junit4]   2> 	  "collection":"collection1",
[junit4:junit4]   2> 	  "node_name":"127.0.0.1:28687__f",
[junit4:junit4]   2> 	  "base_url":"http://127.0.0.1:28687/_f"}
[junit4:junit4]   2> 14566 T1904 oascc.ZkStateReader$2.process A cluster state change: WatchedEvent state:SyncConnected type:NodeDataChanged path:/clusterstate.json, has occurred - updating... (live nodes size: 5)
[junit4:junit4]   2> 14565 T1910 oascc.ZkStateReader$2.process A cluster state change: WatchedEvent state:SyncConnected type:NodeDataChanged path:/clusterstate.json, has occurred - updating... (live nodes size: 5)
[junit4:junit4]   2> 14566 T1954 oascc.ZkStateReader$2.process A cluster state change: WatchedEvent state:SyncConnected type:NodeDataChanged path:/clusterstate.json, has occurred - updating... (live nodes size: 5)
[junit4:junit4]   2> 14566 T1938 oascc.ZkStateReader$2.process A cluster state change: WatchedEvent state:SyncConnected type:NodeDataChanged path:/clusterstate.json, has occurred - updating... (live nodes size: 5)
[junit4:junit4]   2> 14566 T1923 oascc.ZkStateReader$2.process A cluster state change: WatchedEvent state:SyncConnected type:NodeDataChanged path:/clusterstate.json, has occurred - updating... (live nodes size: 5)
[junit4:junit4]   2> 14566 T1972 oascc.ZkStateReader$2.process A cluster state change: WatchedEvent state:SyncConnected type:NodeDataChanged path:/clusterstate.json, has occurred - updating... (live nodes size: 5)
[junit4:junit4]   2> 14603 T1973 oasc.SolrConfig.<init> Loaded SolrConfig: solrconfig.xml
[junit4:junit4]   2> 14704 T1973 oass.IndexSchema.readSchema Reading Solr Schema
[junit4:junit4]   2> 14708 T1973 oass.IndexSchema.readSchema Schema name=test
[junit4:junit4]   2> 15170 T1973 oass.OpenExchangeRatesOrgProvider.init Initialized with rates=open-exchange-rates.json, refreshInterval=1440.
[junit4:junit4]   2> 15178 T1973 oass.IndexSchema.readSchema default search field in schema is text
[junit4:junit4]   2> 15181 T1973 oass.IndexSchema.readSchema unique key field: id
[junit4:junit4]   2> 15191 T1973 oass.FileExchangeRateProvider.reload Reloading exchange rates from file currency.xml
[junit4:junit4]   2> 15194 T1973 oass.FileExchangeRateProvider.reload Reloading exchange rates from file currency.xml
[junit4:junit4]   2> 15197 T1973 oass.OpenExchangeRatesOrgProvider.reload Reloading exchange rates from open-exchange-rates.json
[junit4:junit4]   2> 15198 T1973 oass.OpenExchangeRatesOrgProvider.reload Reloading exchange rates from open-exchange-rates.json
[junit4:junit4]   2> 15199 T1973 oasc.SolrCore.<init> [collection1] Opening new SolrCore at /usr/home/hudson/hudson-slave/workspace/Lucene-Solr-Tests-4.x-Java6/solr/build/solr-core/test/J0/./org.apache.solr.cloud.SyncSliceTest-jetty4-1359793347669/collection1/, dataDir=./org.apache.solr.cloud.SyncSliceTest-1359793333856/jetty4/
[junit4:junit4]   2> 15199 T1973 oasc.JmxMonitoredMap.<init> JMX monitoring is enabled. Adding Solr mbeans to JMX Server: com.sun.jmx.mbeanserver.JmxMBeanServer@2e097617
[junit4:junit4]   2> 15200 T1973 oasc.SolrCore.initDirectoryFactory solr.NRTCachingDirectoryFactory
[junit4:junit4]   2> 15200 T1973 oasc.CachingDirectoryFactory.get return new directory for /usr/home/hudson/hudson-slave/workspace/Lucene-Solr-Tests-4.x-Java6/solr/build/solr-core/test/J0/./org.apache.solr.cloud.SyncSliceTest-1359793333856/jetty4 forceNew:false
[junit4:junit4]   2> 15201 T1973 oasc.CachingDirectoryFactory.close Releasing directory:/usr/home/hudson/hudson-slave/workspace/Lucene-Solr-Tests-4.x-Java6/solr/build/solr-core/test/J0/./org.apache.solr.cloud.SyncSliceTest-1359793333856/jetty4
[junit4:junit4]   2> 15201 T1973 oasc.SolrCore.getNewIndexDir New index directory detected: old=null new=./org.apache.solr.cloud.SyncSliceTest-1359793333856/jetty4/index/
[junit4:junit4]   2> 15201 T1973 oasc.SolrCore.initIndex WARNING [collection1] Solr index directory './org.apache.solr.cloud.SyncSliceTest-1359793333856/jetty4/index' doesn't exist. Creating new index...
[junit4:junit4]   2> 15202 T1973 oasc.CachingDirectoryFactory.get return new directory for /usr/home/hudson/hudson-slave/workspace/Lucene-Solr-Tests-4.x-Java6/solr/build/solr-core/test/J0/./org.apache.solr.cloud.SyncSliceTest-1359793333856/jetty4/index forceNew:false
[junit4:junit4]   2> 15206 T1973 oasc.SolrDeletionPolicy.onCommit SolrDeletionPolicy.onCommit: commits:num=1
[junit4:junit4]   2> 		commit{dir=RateLimitedDirectoryWrapper(NRTCachingDirectory(org.apache.lucene.store.NIOFSDirectory@/usr/home/hudson/hudson-slave/workspace/Lucene-Solr-Tests-4.x-Java6/solr/build/solr-core/test/J0/org.apache.solr.cloud.SyncSliceTest-1359793333856/jetty4/index lockFactory=org.apache.lucene.store.NativeFSLockFactory@6fedf49; maxCacheMB=48.0 maxMergeSizeMB=4.0)),segFN=segments_1,generation=1,filenames=[segments_1]
[junit4:junit4]   2> 15207 T1973 oasc.SolrDeletionPolicy.updateCommits newest commit = 1[segments_1]
[junit4:junit4]   2> 15208 T1973 oasc.CachingDirectoryFactory.close Releasing directory:/usr/home/hudson/hudson-slave/workspace/Lucene-Solr-Tests-4.x-Java6/solr/build/solr-core/test/J0/./org.apache.solr.cloud.SyncSliceTest-1359793333856/jetty4/index
[junit4:junit4]   2> 15208 T1973 oasc.SolrCore.initWriters created xml: solr.XMLResponseWriter
[junit4:junit4]   2> 15210 T1973 oasup.UpdateRequestProcessorChain.init inserting DistributedUpdateProcessorFactory into updateRequestProcessorChain "dedupe"
[junit4:junit4]   2> 15210 T1973 oasup.UpdateRequestProcessorChain.init inserting DistributedUpdateProcessorFactory into updateRequestProcessorChain "dedupe-allfields"
[junit4:junit4]   2> 15210 T1973 oasup.UpdateRequestProcessorChain.init inserting DistributedUpdateProcessorFactory into updateRequestProcessorChain "stored_sig"
[junit4:junit4]   2> 15211 T1973 oasup.UpdateRequestProcessorChain.init inserting DistributedUpdateProcessorFactory into updateRequestProcessorChain "uniq-fields"
[junit4:junit4]   2> 15211 T1973 oasup.UpdateRequestProcessorChain.init inserting DistributedUpdateProcessorFactory into updateRequestProcessorChain "distrib-dup-test-chain-implicit"
[junit4:junit4]   2> 15212 T1973 oasc.RequestHandlers.initHandlersFromConfig adding lazy requestHandler: solr.ReplicationHandler
[junit4:junit4]   2> 15212 T1973 oasc.RequestHandlers.initHandlersFromConfig created /replication: solr.ReplicationHandler
[junit4:junit4]   2> 15212 T1973 oasc.RequestHandlers.initHandlersFromConfig created standard: solr.StandardRequestHandler
[junit4:junit4]   2> 15213 T1973 oasc.RequestHandlers.initHandlersFromConfig created /get: solr.RealTimeGetHandler
[junit4:junit4]   2> 15214 T1973 oasc.RequestHandlers.initHandlersFromConfig created dismax: solr.SearchHandler
[junit4:junit4]   2> 15214 T1973 oasc.RequestHandlers.initHandlersFromConfig created mock: org.apache.solr.core.MockQuerySenderListenerReqHandler
[junit4:junit4]   2> 15214 T1973 oasc.RequestHandlers.initHandlersFromConfig created /admin/: org.apache.solr.handler.admin.AdminHandlers
[junit4:junit4]   2> 15215 T1973 oasc.RequestHandlers.initHandlersFromConfig created defaults: solr.StandardRequestHandler
[junit4:junit4]   2> 15215 T1973 oasc.RequestHandlers.initHandlersFromConfig adding lazy requestHandler: solr.StandardRequestHandler
[junit4:junit4]   2> 15215 T1973 oasc.RequestHandlers.initHandlersFromConfig created lazy: solr.StandardRequestHandler
[junit4:junit4]   2> 15216 T1973 oasc.RequestHandlers.initHandlersFromConfig created /update: solr.UpdateRequestHandler
[junit4:junit4]   2> 15216 T1973 oasc.RequestHandlers.initHandlersFromConfig created /terms: org.apache.solr.handler.component.SearchHandler
[junit4:junit4]   2> 15217 T1973 oasc.RequestHandlers.initHandlersFromConfig created spellCheckCompRH: org.apache.solr.handler.component.SearchHandler
[junit4:junit4]   2> 15217 T1973 oasc.RequestHandlers.initHandlersFromConfig created spellCheckCompRH_Direct: org.apache.solr.handler.component.SearchHandler
[junit4:junit4]   2> 15218 T1973 oasc.RequestHandlers.initHandlersFromConfig created spellCheckWithWordbreak: org.apache.solr.handler.component.SearchHandler
[junit4:junit4]   2> 15218 T1973 oasc.RequestHandlers.initHandlersFromConfig created spellCheckWithWordbreak_Direct: org.apache.solr.handler.component.SearchHandler
[junit4:junit4]   2> 15219 T1973 oasc.RequestHandlers.initHandlersFromConfig created spellCheckCompRH1: org.apache.solr.handler.component.SearchHandler
[junit4:junit4]   2> 15219 T1973 oasc.RequestHandlers.initHandlersFromConfig created mltrh: org.apache.solr.handler.component.SearchHandler
[junit4:junit4]   2> 15220 T1973 oasc.RequestHandlers.initHandlersFromConfig created tvrh: org.apache.solr.handler.component.SearchHandler
[junit4:junit4]   2> 15220 T1973 oasc.RequestHandlers.initHandlersFromConfig created /mlt: solr.MoreLikeThisHandler
[junit4:junit4]   2> 15221 T1973 oasc.RequestHandlers.initHandlersFromConfig created /debug/dump: solr.DumpRequestHandler
[junit4:junit4]   2> 15229 T1973 oashl.XMLLoader.init xsltCacheLifetimeSeconds=60
[junit4:junit4]   2> 15234 T1973 oasc.SolrCore.initDeprecatedSupport WARNING solrconfig.xml uses deprecated <admin/gettableFiles>, Please update your config to use the ShowFileRequestHandler.
[junit4:junit4]   2> 15236 T1973 oasc.SolrCore.initDeprecatedSupport WARNING adding ShowFileRequestHandler with hidden files: [SCHEMA.XML, OLD_SYNONYMS.TXT, STOPWORDS.TXT, PROTWORDS.TXT, OPEN-EXCHANGE-RATES.JSON, SYNONYMS.TXT, CURRENCY.XML, MAPPING-ISOLATIN1ACCENT.TXT]
[junit4:junit4]   2> 15238 T1973 oasc.CachingDirectoryFactory.close Releasing directory:/usr/home/hudson/hudson-slave/workspace/Lucene-Solr-Tests-4.x-Java6/solr/build/solr-core/test/J0/./org.apache.solr.cloud.SyncSliceTest-1359793333856/jetty4
[junit4:junit4]   2> 15240 T1973 oass.SolrIndexSearcher.<init> Opening Searcher@68ab638b main
[junit4:junit4]   2> 15241 T1973 oasu.CommitTracker.<init> Hard AutoCommit: disabled
[junit4:junit4]   2> 15241 T1973 oasu.CommitTracker.<init> Soft AutoCommit: disabled
[junit4:junit4]   2> 15242 T1973 oashc.SpellCheckComponent.inform Initializing spell checkers
[junit4:junit4]   2> 15258 T1973 oass.DirectSolrSpellChecker.init init: {name=direct,classname=DirectSolrSpellChecker,field=lowerfilt,minQueryLength=3}
[junit4:junit4]   2> 15315 T1974 oasc.SolrCore.registerSearcher [collection1] Registered new searcher Searcher@68ab638b main{StandardDirectoryReader(segments_1:1)}
[junit4:junit4]   2> 15320 T1973 oasc.ZkController.publish publishing core=collection1 state=down
[junit4:junit4]   2> 15320 T1973 oasc.ZkController.publish numShards not found on descriptor - reading it from system property
[junit4:junit4]   2> 16088 T1905 oascc.ZkStateReader.updateClusterState Updating cloud state from ZooKeeper... 
[junit4:junit4]   2> 16089 T1905 oasc.Overseer$ClusterStateUpdater.updateState Update state numShards=1 message={
[junit4:junit4]   2> 	  "operation":"state",
[junit4:junit4]   2> 	  "numShards":"1",
[junit4:junit4]   2> 	  "shard":null,
[junit4:junit4]   2> 	  "roles":null,
[junit4:junit4]   2> 	  "state":"down",
[junit4:junit4]   2> 	  "core":"collection1",
[junit4:junit4]   2> 	  "collection":"collection1",
[junit4:junit4]   2> 	  "node_name":"127.0.0.1:28765__f",
[junit4:junit4]   2> 	  "base_url":"http://127.0.0.1:28765/_f"}
[junit4:junit4]   2> 16089 T1905 oasc.Overseer$ClusterStateUpdater.updateState Collection already exists with numShards=1
[junit4:junit4]   2> 16090 T1905 oasc.Overseer$ClusterStateUpdater.updateState Assigning new node to shard shard=shard1
[junit4:junit4]   2> 16102 T1910 oascc.ZkStateReader$2.process A cluster state change: WatchedEvent state:SyncConnected type:NodeDataChanged path:/clusterstate.json, has occurred - updating... (live nodes size: 5)
[junit4:junit4]   2> 16102 T1972 oascc.ZkStateReader$2.process A cluster state change: WatchedEvent state:SyncConnected type:NodeDataChanged path:/clusterstate.json, has occurred - updating... (live nodes size: 5)
[junit4:junit4]   2> 16102 T1954 oascc.ZkStateReader$2.process A cluster state change: WatchedEvent state:SyncConnected type:NodeDataChanged path:/clusterstate.json, has occurred - updating... (live nodes size: 5)
[junit4:junit4]   2> 16102 T1938 oascc.ZkStateReader$2.process A cluster state change: WatchedEvent state:SyncConnected type:NodeDataChanged path:/clusterstate.json, has occurred - updating... (live nodes size: 5)
[junit4:junit4]   2> 16102 T1923 oascc.ZkStateReader$2.process A cluster state change: WatchedEvent state:SyncConnected type:NodeDataChanged path:/clusterstate.json, has occurred - updating... (live nodes size: 5)
[junit4:junit4]   2> 16102 T1904 oascc.ZkStateReader$2.process A cluster state change: WatchedEvent state:SyncConnected type:NodeDataChanged path:/clusterstate.json, has occurred - updating... (live nodes size: 5)
[junit4:junit4]   2> 16322 T1973 oasc.CoreContainer.registerCore registering core: collection1
[junit4:junit4]   2> 16322 T1973 oasc.ZkController.register Register replica - core:collection1 address:http://127.0.0.1:28765/_f collection:collection1 shard:shard1
[junit4:junit4]   2> 16325 T1973 oasc.ZkController.register We are http://127.0.0.1:28765/_f/collection1/ and leader is http://127.0.0.1:28653/_f/collection1/
[junit4:junit4]   2> 16325 T1973 oasc.ZkController.register No LogReplay needed for core=collection1 baseURL=http://127.0.0.1:28765/_f
[junit4:junit4]   2> 16326 T1973 oasc.ZkController.checkRecovery Core needs to recover:collection1
[junit4:junit4]   2> 16326 T1973 oasu.DefaultSolrCoreState.doRecovery Running recovery - first canceling any ongoing recovery
[junit4:junit4]   2> ASYNC  NEW_CORE C106 name=collection1 org.apache.solr.core.SolrCore@42cd554 url=http://127.0.0.1:28765/_f/collection1 node=127.0.0.1:28765__f C106_STATE=coll:collection1 core:collection1 props:{shard=null, roles=null, state=down, core=collection1, collection=collection1, node_name=127.0.0.1:28765__f, base_url=http://127.0.0.1:28765/_f}
[junit4:junit4]   2> 16326 T1975 C106 P28765 oasc.RecoveryStrategy.run Starting recovery process.  core=collection1 recoveringAfterStartup=true
[junit4:junit4]   2> 16327 T1973 oascc.ZkStateReader.updateClusterState Updating cloud state from ZooKeeper... 
[junit4:junit4]   2> 16327 T1975 C106 P28765 oasc.RecoveryStrategy.doRecovery ###### startupVersions=[]
[junit4:junit4]   2> 16328 T1975 C106 P28765 oasc.ZkController.publish publishing core=collection1 state=recovering
[junit4:junit4]   2> 16328 T1975 C106 P28765 oasc.ZkController.publish numShards not found on descriptor - reading it from system property
[junit4:junit4]   2> 16328 T1882 oass.SolrDispatchFilter.init user.dir=/usr/home/hudson/hudson-slave/workspace/Lucene-Solr-Tests-4.x-Java6/solr/build/solr-core/test/J0
[junit4:junit4]   2> 16329 T1882 oass.SolrDispatchFilter.init SolrDispatchFilter.init() done
[junit4:junit4]   2> 16329 T1975 C106 P28765 oascsi.HttpClientUtil.createClient Creating new http client, config:maxConnections=128&maxConnectionsPerHost=32&followRedirects=false
[junit4:junit4]   2> 16329 T1882 oascsi.HttpClientUtil.createClient Creating new http client, config:maxConnections=128&maxConnectionsPerHost=32&followRedirects=false
[junit4:junit4]   2> 16345 T1882 oascc.ZkStateReader.updateClusterState Updating cloud state from ZooKeeper... 
[junit4:junit4]   2> 16346 T1882 oasc.AbstractFullDistribZkTestBase.waitForThingsToLevelOut Wait for recoveries to finish - wait 15 for each attempt
[junit4:junit4]   2> 16346 T1882 oasc.AbstractDistribZkTestBase.waitForRecoveriesToFinish Wait for recoveries to finish - collection: collection1 failOnTimeout:true timeout (sec):15
[junit4:junit4]   2> 16347 T1882 oascc.ZkStateReader.updateClusterState Updating cloud state from ZooKeeper... 
[junit4:junit4]   2>  C105_STATE=coll:collection1 core:collection1 props:{shard=shard1, roles=null, state=recovering, core=collection1, collection=collection1, node_name=127.0.0.1:28737__f, base_url=http://127.0.0.1:28737/_f}
[junit4:junit4]   2> 17004 T1958 C105 P28737 oasc.RecoveryStrategy.doRecovery Attempting to PeerSync from http://127.0.0.1:28653/_f/collection1/ core=collection1 - recoveringAfterStartup=true
[junit4:junit4]   2> 17004 T1958 C105 P28737 oasu.PeerSync.sync PeerSync: core=collection1 url=http://127.0.0.1:28737/_f START replicas=[http://127.0.0.1:28653/_f/collection1/] nUpdates=100
[junit4:junit4]   2> 17004 T1958 C105 P28737 oasu.PeerSync.sync WARNING no frame of reference to tell of we've missed updates
[junit4:junit4]   2> 17005 T1958 C105 P28737 oasc.RecoveryStrategy.doRecovery PeerSync Recovery was not successful - trying replication. core=collection1
[junit4:junit4]   2> 17005 T1958 C105 P28737 oasc.RecoveryStrategy.doRecovery Starting Replication Recovery. core=collection1
[junit4:junit4]   2> 17006 T1958 C105 P28737 oasc.RecoveryStrategy.doRecovery Begin buffering updates. core=collection1
[junit4:junit4]   2> 17006 T1958 C105 P28737 oasu.UpdateLog.bufferUpdates Starting to buffer updates. FSUpdateLog{state=ACTIVE, tlog=null}
[junit4:junit4]   2> 17006 T1958 C105 P28737 oasc.RecoveryStrategy.replicate Attempting to replicate from http://127.0.0.1:28653/_f/collection1/. core=collection1
[junit4:junit4]   2> 17006 T1958 C105 P28737 oascsi.HttpClientUtil.createClient Creating new http client, config:maxConnections=128&maxConnectionsPerHost=32&followRedirects=false
[junit4:junit4]   2> 17007 T1914 C104 P28653 REQ /get {getVersions=100&distrib=false&wt=javabin&qt=/get&version=2} status=0 QTime=0 
[junit4:junit4]   2> 17016 T1919 C104 P28653 oasu.DirectUpdateHandler2.commit start commit{,optimize=false,openSearcher=false,waitSearcher=true,expungeDeletes=false,softCommit=false}
[junit4:junit4]   2> 17020 T1919 C104 P28653 oasc.SolrDeletionPolicy.onCommit SolrDeletionPolicy.onCommit: commits:num=2
[junit4:junit4]   2> 		commit{dir=RateLimitedDirectoryWrapper(NRTCachingDirectory(org.apache.lucene.store.NIOFSDirectory@/usr/home/hudson/hudson-slave/workspace/Lucene-Solr-Tests-4.x-Java6/solr/build/solr-core/test/J0/org.apache.solr.cloud.SyncSliceTest-1359793333856/jetty1/index lockFactory=org.apache.lucene.store.NativeFSLockFactory@1f7884c3; maxCacheMB=48.0 maxMergeSizeMB=4.0)),segFN=segments_2,generation=2,filenames=[segments_2]
[junit4:junit4]   2> 		commit{dir=RateLimitedDirectoryWrapper(NRTCachingDirectory(org.apache.lucene.store.NIOFSDirectory@/usr/home/hudson/hudson-slave/workspace/Lucene-Solr-Tests-4.x-Java6/solr/build/solr-core/test/J0/org.apache.solr.cloud.SyncSliceTest-1359793333856/jetty1/index lockFactory=org.apache.lucene.store.NativeFSLockFactory@1f7884c3; maxCacheMB=48.0 maxMergeSizeMB=4.0)),segFN=segments_3,generation=3,filenames=[segments_3]
[junit4:junit4]   2> 17021 T1919 C104 P28653 oasc.SolrDeletionPolicy.updateCommits newest commit = 3[segments_3]
[junit4:junit4]   2> 17022 T1919 C104 P28653 oasc.CachingDirectoryFactory.close Releasing directory:/usr/home/hudson/hudson-slave/workspace/Lucene-Solr-Tests-4.x-Java6/solr/build/solr-core/test/J0/./org.apache.solr.cloud.SyncSliceTest-1359793333856/jetty1
[junit4:junit4]   2> 17022 T1919 C104 P28653 oasu.DirectUpdateHandler2.commit end_commit_flush
[junit4:junit4]   2> 17022 T1919 C104 P28653 /update {waitSearcher=true&openSearcher=false&commit=true&wt=javabin&commit_end_point=true&version=2&softCommit=false} {commit=} 0 6
[junit4:junit4]   2> 17023 T1958 C105 P28737 oash.ReplicationHandler.inform Commits will be reserved for  10000
[junit4:junit4]   2> 17023 T1958 C105 P28737 oash.SnapPuller.<init>  No value set for 'pollInterval'. Timer Task not started.
[junit4:junit4]   2> 17025 T1916 C104 P28653 REQ /replication {command=indexversion&qt=/replication&wt=javabin&version=2} status=0 QTime=0 
[junit4:junit4]   2> 17026 T1958 C105 P28737 oash.SnapPuller.fetchLatestIndex Master's generation: 3
[junit4:junit4]   2> 17026 T1958 C105 P28737 oash.SnapPuller.fetchLatestIndex Slave's generation: 1
[junit4:junit4]   2> 17026 T1958 C105 P28737 oash.SnapPuller.fetchLatestIndex Starting replication process
[junit4:junit4]   2> 17028 T1916 C104 P28653 oasc.CachingDirectoryFactory.close Releasing directory:/usr/home/hudson/hudson-slave/workspace/Lucene-Solr-Tests-4.x-Java6/solr/build/solr-core/test/J0/./org.apache.solr.cloud.SyncSliceTest-1359793333856/jetty1
[junit4:junit4]   2> 17029 T1916 C104 P28653 oasc.CachingDirectoryFactory.close Releasing directory:/usr/home/hudson/hudson-slave/workspace/Lucene-Solr-Tests-4.x-Java6/solr/build/solr-core/test/J0/./org.apache.solr.cloud.SyncSliceTest-1359793333856/jetty1/index
[junit4:junit4]   2> 17029 T1916 C104 P28653 REQ /replication {command=filelist&qt=/replication&wt=javabin&generation=3&version=2} status=0 QTime=1 
[junit4:junit4]   2> 17030 T1958 C105 P28737 oash.SnapPuller.fetchLatestIndex Number of files in latest index in master: 1
[junit4:junit4]   2> 17031 T1958 C105 P28737 oasc.CachingDirectoryFactory.get return new directory for /usr/home/hudson/hudson-slave/workspace/Lucene-Solr-Tests-4.x-Java6/solr/build/solr-core/test/J0/./org.apache.solr.cloud.SyncSliceTest-1359793333856/jetty3/index.20130202022230881 forceNew:false
[junit4:junit4]   2> 17032 T1958 C105 P28737 oasc.CachingDirectoryFactory.close Releasing directory:/usr/home/hudson/hudson-slave/workspace/Lucene-Solr-Tests-4.x-Java6/solr/build/solr-core/test/J0/./org.apache.solr.cloud.SyncSliceTest-1359793333856/jetty3
[junit4:junit4]   2> 17032 T1958 C105 P28737 oash.SnapPuller.fetchLatestIndex Starting download to RateLimitedDirectoryWrapper(NRTCachingDirectory(org.apache.lucene.store.NIOFSDirectory@/usr/home/hudson/hudson-slave/workspace/Lucene-Solr-Tests-4.x-Java6/solr/build/solr-core/test/J0/org.apache.solr.cloud.SyncSliceTest-1359793333856/jetty3/index.20130202022230881 lockFactory=org.apache.lucene.store.NativeFSLockFactory@11e940d6; maxCacheMB=48.0 maxMergeSizeMB=4.0)) fullCopy=true
[junit4:junit4]   2> 17036 T1916 C104 P28653 REQ /replication {file=segments_3&command=filecontent&checksum=true&wt=filestream&qt=/replication&generation=3} status=0 QTime=0 
[junit4:junit4]   2> 17038 T1958 C105 P28737 oasc.CachingDirectoryFactory.close Releasing directory:/usr/home/hudson/hudson-slave/workspace/Lucene-Solr-Tests-4.x-Java6/solr/build/solr-core/test/J0/./org.apache.solr.cloud.SyncSliceTest-1359793333856/jetty3/index
[junit4:junit4]   2> 17038 T1958 C105 P28737 oash.SnapPuller.fetchLatestIndex Total time taken for download : 0 secs
[junit4:junit4]   2> 17039 T1958 C105 P28737 oash.SnapPuller.modifyIndexProps New index installed. Updating index properties... index=index.20130202022230881
[junit4:junit4]   2> 17040 T1958 C105 P28737 oasc.CachingDirectoryFactory.close Releasing directory:/usr/home/hudson/hudson-slave/workspace/Lucene-Solr-Tests-4.x-Java6/solr/build/solr-core/test/J0/./org.apache.solr.cloud.SyncSliceTest-1359793333856/jetty3
[junit4:junit4]   2> 17040 T1958 C105 P28737 oasc.CachingDirectoryFactory.close Releasing directory:/usr/home/hudson/hudson-slave/workspace/Lucene-Solr-Tests-4.x-Java6/solr/build/solr-core/test/J0/./org.apache.solr.cloud.SyncSliceTest-1359793333856/jetty3
[junit4:junit4]   2> 17040 T1958 C105 P28737 oasc.SolrCore.getNewIndexDir New index directory detected: old=./org.apache.solr.cloud.SyncSliceTest-1359793333856/jetty3/index/ new=./org.apache.solr.cloud.SyncSliceTest-1359793333856/jetty3/index.20130202022230881
[junit4:junit4]   2> 17044 T1958 C105 P28737 oasc.SolrDeletionPolicy.onInit SolrDeletionPolicy.onInit: commits:num=1
[junit4:junit4]   2> 		commit{dir=RateLimitedDirectoryWrapper(NRTCachingDirectory(org.apache.lucene.store.NIOFSDirectory@/usr/home/hudson/hudson-slave/workspace/Lucene-Solr-Tests-4.x-Java6/solr/build/solr-core/test/J0/org.apache.solr.cloud.SyncSliceTest-1359793333856/jetty3/index.20130202022230881 lockFactory=org.apache.lucene.store.NativeFSLockFactory@11e940d6; maxCacheMB=48.0 maxMergeSizeMB=4.0)),segFN=segments_3,generation=3,filenames=[segments_3]
[junit4:junit4]   2> 17044 T1958 C105 P28737 oasc.SolrDeletionPolicy.updateCommits newest commit = 3[segments_3]
[junit4:junit4]   2> 17046 T1958 C105 P28737 oasc.CachingDirectoryFactory.close Releasing directory:/usr/home/hudson/hudson-slave/workspace/Lucene-Solr-Tests-4.x-Java6/solr/build/solr-core/test/J0/./org.apache.solr.cloud.SyncSliceTest-1359793333856/jetty3
[junit4:junit4]   2> 17046 T1958 C105 P28737 oasu.DefaultSolrCoreState.newIndexWriter Creating new IndexWriter...
[junit4:junit4]   2> 17046 T1958 C105 P28737 oasu.DefaultSolrCoreState.newIndexWriter Waiting until IndexWriter is unused... core=collection1
[junit4:junit4]   2> 17046 T1958 C105 P28737 oasu.DefaultSolrCoreState.newIndexWriter Rollback old IndexWriter... core=collection1
[junit4:junit4]   2> 17047 T1958 C105 P28737 oasc.CachingDirectoryFactory.close Releasing directory:/usr/home/hudson/hudson-slave/workspace/Lucene-Solr-Tests-4.x-Java6/solr/build/solr-core/test/J0/./org.apache.solr.cloud.SyncSliceTest-1359793333856/jetty3/index.20130202022230881
[junit4:junit4]   2> 17047 T1958 C105 P28737 oasc.CachingDirectoryFactory.close Releasing directory:/usr/home/hudson/hudson-slave/workspace/Lucene-Solr-Tests-4.x-Java6/solr/build/solr-core/test/J0/./org.apache.solr.cloud.SyncSliceTest-1359793333856/jetty3
[junit4:junit4]   2> 17050 T1958 C105 P28737 oasc.SolrDeletionPolicy.onInit SolrDeletionPolicy.onInit: commits:num=1
[junit4:junit4]   2> 		commit{dir=RateLimitedDirectoryWrapper(NRTCachingDirectory(org.apache.lucene.store.NIOFSDirectory@/usr/home/hudson/hudson-slave/workspace/Lucene-Solr-Tests-4.x-Java6/solr/build/solr-core/test/J0/org.apache.solr.cloud.SyncSliceTest-1359793333856/jetty3/index.20130202022230881 lockFactory=org.apache.lucene.store.NativeFSLockFactory@11e940d6; maxCacheMB=48.0 maxMergeSizeMB=4.0)),segFN=segments_3,generation=3,filenames=[segments_3]
[junit4:junit4]   2> 17051 T1958 C105 P28737 oasc.SolrDeletionPolicy.updateCommits newest commit = 3[segments_3]
[junit4:junit4]   2> 17051 T1958 C105 P28737 oasu.DefaultSolrCoreState.newIndexWriter New IndexWriter is ready to be used.
[junit4:junit4]   2> 17051 T1958 C105 P28737 oasc.CachingDirectoryFactory.close Releasing directory:/usr/home/hudson/hudson-slave/workspace/Lucene-Solr-Tests-4.x-Java6/solr/build/solr-core/test/J0/./org.apache.solr.cloud.SyncSliceTest-1359793333856/jetty3
[junit4:junit4]   2> 17052 T1958 C105 P28737 oass.SolrIndexSearcher.<init> Opening Searcher@204cc616 main
[junit4:junit4]   2> 17053 T1956 oasc.SolrCore.registerSearcher [collection1] Registered new searcher Searcher@204cc616 main{StandardDirectoryReader(segments_3:1:nrt)}
[junit4:junit4]   2> 17053 T1956 oasc.CachingDirectoryFactory.close Releasing directory:/usr/home/hudson/hudson-slave/workspace/Lucene-Solr-Tests-4.x-Java6/solr/build/solr-core/test/J0/./org.apache.solr.cloud.SyncSliceTest-1359793333856/jetty3/index
[junit4:junit4]   2> 17054 T1958 C105 P28737 oasu.DirectUpdateHandler2.commit start commit{,optimize=false,openSearcher=false,waitSearcher=false,expungeDeletes=false,softCommit=false}
[junit4:junit4]   2> 17057 T1958 C105 P28737 oasc.SolrDeletionPolicy.onCommit SolrDeletionPolicy.onCommit: commits:num=2
[junit4:junit4]   2> 		commit{dir=RateLimitedDirectoryWrapper(NRTCachingDirectory(org.apache.lucene.store.NIOFSDirectory@/usr/home/hudson/hudson-slave/workspace/Lucene-Solr-Tests-4.x-Java6/solr/build/solr-core/test/J0/org.apache.solr.cloud.SyncSliceTest-1359793333856/jetty3/index.20130202022230881 lockFactory=org.apache.lucene.store.NativeFSLockFactory@11e940d6; maxCacheMB=48.0 maxMergeSizeMB=4.0)),segFN=segments_3,generation=3,filenames=[segments_3]
[junit4:junit4]   2> 		commit{dir=RateLimitedDirectoryWrapper(NRTCachingDirectory(org.apache.lucene.store.NIOFSDirectory@/usr/home/hudson/hudson-slave/workspace/Lucene-Solr-Tests-4.x-Java6/solr/build/solr-core/test/J0/org.apache.solr.cloud.SyncSliceTest-1359793333856/jetty3/index.20130202022230881 lockFactory=org.apache.lucene.store.NativeFSLockFactory@11e940d6; maxCacheMB=48.0 maxMergeSizeMB=4.0)),segFN=segments_4,generation=4,filenames=[segments_4]
[junit4:junit4]   2> 17057 T1958 C105 P28737 oasc.SolrDeletionPolicy.updateCommits newest commit = 4[segments_4]
[junit4:junit4]   2> 17058 T1958 C105 P28737 oasc.CachingDirectoryFactory.close Releasing directory:/usr/home/hudson/hudson-slave/workspace/Lucene-Solr-Tests-4.x-Java6/solr/build/solr-core/test/J0/./org.apache.solr.cloud.SyncSliceTest-1359793333856/jetty3
[junit4:junit4]   2> 17058 T1958 C105 P28737 oasu.DirectUpdateHandler2.commit end_commit_flush
[junit4:junit4]   2> 17059 T1958 C105 P28737 oasc.CachingDirectoryFactory.close Releasing directory:/usr/home/hudson/hudson-slave/workspace/Lucene-Solr-Tests-4.x-Java6/solr/build/solr-core/test/J0/./org.apache.solr.cloud.SyncSliceTest-1359793333856/jetty3/index.20130202022230881
[junit4:junit4]   2> 17059 T1958 C105 P28737 oasc.CachingDirectoryFactory.close Releasing directory:/usr/home/hudson/hudson-slave/workspace/Lucene-Solr-Tests-4.x-Java6/solr/build/solr-core/test/J0/./org.apache.solr.cloud.SyncSliceTest-1359793333856/jetty3/index
[junit4:junit4]   2> 17059 T1958 C105 P28737 oasc.RecoveryStrategy.replay No replay needed. core=collection1
[junit4:junit4]   2> 17059 T1958 C105 P28737 oasc.RecoveryStrategy.doRecovery Replication Recovery was successful - registering as Active. core=collection1
[junit4:junit4]   2> 17059 T1958 C105 P28737 oasc.ZkController.publish publishing core=collection1 state=active
[junit4:junit4]   2> 17059 T1958 C105 P28737 oasc.ZkController.publish numShards not found on descriptor - reading it from system property
[junit4:junit4]   2> 17067 T1958 C105 P28737 oasc.RecoveryStrategy.doRecovery Finished recovery process. core=collection1
[junit4:junit4]   2> 17349 T1882 oascc.ZkStateReader.updateClusterState Updating cloud state from ZooKeeper... 
[junit4:junit4]   2> 17606 T1905 oascc.ZkStateReader.updateClusterState Updating cloud state from ZooKeeper... 
[junit4:junit4]   2> 17607 T1905 oasc.Overseer$ClusterStateUpdater.updateState Update state numShards=1 message={
[junit4:junit4]   2> 	  "operation":"state",
[junit4:junit4]   2> 	  "numShards":"1",
[junit4:junit4]   2> 	  "shard":"shard1",
[junit4:junit4]   2> 	  "roles":null,
[junit4:junit4]   2> 	  "state":"recovering",
[junit4:junit4]   2> 	  "core":"collection1",
[junit4:junit4]   2> 	  "collection":"collection1",
[junit4:junit4]   2> 	  "node_name":"127.0.0.1:28765__f",
[junit4:junit4]   2> 	  "base_url":"http://127.0.0.1:28765/_f"}
[junit4:junit4]   2> 17612 T1905 oasc.Overseer$ClusterStateUpdater.updateState Update state numShards=1 message={
[junit4:junit4]   2> 	  "operation":"state",
[junit4:junit4]   2> 	  "numShards":"1",
[junit4:junit4]   2> 	  "shard":"shard1",
[junit4:junit4]   2> 	  "roles":null,
[junit4:junit4]   2> 	  "state":"active",
[junit4:junit4]   2> 	  "core":"collection1",
[junit4:junit4]   2> 	  "collection":"collection1",
[junit4:junit4]   2> 	  "node_name":"127.0.0.1:28737__f",
[junit4:junit4]   2> 	  "base_url":"http://127.0.0.1:28737/_f"}
[junit4:junit4]   2> 17635 T1904 oascc.ZkStateReader$2.process A cluster state change: WatchedEvent state:SyncConnected type:NodeDataChanged path:/clusterstate.json, has occurred - updating... (live nodes size: 5)
[junit4:junit4]   2> 17635 T1972 oascc.ZkStateReader$2.process A cluster state change: WatchedEvent state:SyncConnected type:NodeDataChanged path:/clusterstate.json, has occurred - updating... (live nodes size: 5)
[junit4:junit4]   2> 17635 T1938 oascc.ZkStateReader$2.process A cluster state change: WatchedEvent state:SyncConnected type:NodeDataChanged path:/clusterstate.json, has occurred - updating... (live nodes size: 5)
[junit4:junit4]   2> 17635 T1923 oascc.ZkStateReader$2.process A cluster state change: WatchedEvent state:SyncConnected type:NodeDataChanged path:/clusterstate.json, has occurred - updating... (live nodes size: 5)
[junit4:junit4]   2> 17635 T1954 oascc.ZkStateReader$2.process A cluster state change: WatchedEvent state:SyncConnected type:NodeDataChanged path:/clusterstate.json, has occurred - updating... (live nodes size: 5)
[junit4:junit4]   2> 17635 T1910 oascc.ZkStateReader$2.process A cluster state change: WatchedEvent state:SyncConnected type:NodeDataChanged path:/clusterstate.json, has occurred - updating... (live nodes size: 5)
[junit4:junit4]   2> 18351 T1882 oascc.ZkStateReader.updateClusterState Updating cloud state from ZooKeeper... 
[junit4:junit4]   2> 19353 T1882 oascc.ZkStateReader.updateClusterState Updating cloud state from ZooKeeper... 
[junit4:junit4]   2>  C106_STATE=coll:collection1 core:collection1 props:{shard=shard1, roles=null, state=recovering, core=collection1, collection=collection1, node_name=127.0.0.1:28765__f, base_url=http://127.0.0.1:28765/_f}
[junit4:junit4]   2> 20348 T1975 C106 P28765 oasc.RecoveryStrategy.doRecovery Attempting to PeerSync from http://127.0.0.1:28653/_f/collection1/ core=collection1 - recoveringAfterStartup=true
[junit4:junit4]   2> 20348 T1975 C106 P28765 oasu.PeerSync.sync PeerSync: core=collection1 url=http://127.0.0.1:28765/_f START replicas=[http://127.0.0.1:28653/_f/collection1/] nUpdates=100
[junit4:junit4]   2> 20349 T1975 C106 P28765 oasu.PeerSync.sync WARNING no frame of reference to tell of we've missed updates
[junit4:junit4]   2> 20349 T1975 C106 P28765 oasc.RecoveryStrategy.doRecovery PeerSync Recovery was not successful - trying replication. core=collection1
[junit4:junit4]   2> 20349 T1975 C106 P28765 oasc.RecoveryStrategy.doRecovery Starting Replication Recovery. core=collection1
[junit4:junit4]   2> 20349 T1975 C106 P28765 oasc.RecoveryStrategy.doRecovery Begin buffering updates. core=collection1
[junit4:junit4]   2> 20349 T1975 C106 P28765 oasu.UpdateLog.bufferUpdates Starting to buffer updates. FSUpdateLog{state=ACTIVE, tlog=null}
[junit4:junit4]   2> 20350 T1975 C106 P28765 oasc.RecoveryStrategy.replicate Attempting to replicate from http://127.0.0.1:28653/_f/collection1/. core=collection1
[junit4:junit4]   2> 20350 T1975 C106 P28765 oascsi.HttpClientUtil.createClient Creating new http client, config:maxConnections=128&maxConnectionsPerHost=32&followRedirects=false
[junit4:junit4]   2> 20351 T1914 C104 P28653 REQ /get {getVersions=100&distrib=false&wt=javabin&qt=/get&version=2} status=0 QTime=0 
[junit4:junit4]   2> 20355 T1882 oascc.ZkStateReader.updateClusterState Updating cloud state from ZooKeeper... 
[junit4:junit4]   2> 20364 T1913 C104 P28653 oasu.DirectUpdateHandler2.commit start commit{,optimize=false,openSearcher=false,waitSearcher=true,expungeDeletes=false,softCommit=false}
[junit4:junit4]   2> 20368 T1913 C104 P28653 oasc.SolrDeletionPolicy.onCommit SolrDeletionPolicy.onCommit: commits:num=3
[junit4:junit4]   2> 		commit{dir=RateLimitedDirectoryWrapper(NRTCachingDirectory(org.apache.lucene.store.NIOFSDirectory@/usr/home/hudson/hudson-slave/workspace/Lucene-Solr-Tests-4.x-Java6/solr/build/solr-core/test/J0/org.apache.solr.cloud.SyncSliceTest-1359793333856/jetty1/index lockFactory=org.apache.lucene.store.NativeFSLockFactory@1f7884c3; maxCacheMB=48.0 maxMergeSizeMB=4.0)),segFN=segments_2,generation=2,filenames=[segments_2]
[junit4:junit4]   2> 		commit{dir=RateLimitedDirectoryWrapper(NRTCachingDirectory(org.apache.lucene.store.NIOFSDirectory@/usr/home/hudson/hudson-slave/workspace/Lucene-Solr-Tests-4.x-Java6/solr/build/solr-core/test/J0/org.apache.solr.cloud.SyncSliceTest-1359793333856/jetty1/index lockFactory=org.apache.lucene.store.NativeFSLockFactory@1f7884c3; maxCacheMB=48.0 maxMergeSizeMB=4.0)),segFN=segments_3,generation=3,filenames=[segments_3]
[junit4:junit4]   2> 		commit{dir=RateLimitedDirectoryWrapper(NRTCachingDirectory(org.apache.lucene.store.NIOFSDirectory@/usr/home/hudson/hudson-slave/workspace/Lucene-Solr-Tests-4.x-Java6/solr/build/solr-core/test/J0/org.apache.solr.cloud.SyncSliceTest-1359793333856/jetty1/index lockFactory=org.apache.lucene.store.NativeFSLockFactory@1f7884c3; maxCacheMB=48.0 maxMergeSizeMB=4.0)),segFN=segments_4,generation=4,filenames=[segments_4]
[junit4:junit4]   2> 20369 T1913 C104 P28653 oasc.SolrDeletionPolicy.updateCommits newest commit = 4[segments_4]
[junit4:junit4]   2> 20370 T1913 C104 P28653 oasc.CachingDirectoryFactory.close Releasing directory:/usr/home/hudson/hudson-slave/workspace/Lucene-Solr-Tests-4.x-Java6/solr/build/solr-core/test/J0/./org.apache.solr.cloud.SyncSliceTest-1359793333856/jetty1
[junit4:junit4]   2> 20370 T1913 C104 P28653 oasu.DirectUpdateHandler2.commit end_commit_flush
[junit4:junit4]   2> 20371 T1913 C104 P28653 /update {waitSearcher=true&openSearcher=false&commit=true&wt=javabin&commit_end_point=true&version=2&softCommit=false} {commit=} 0 7
[junit4:junit4]   2> 20371 T1975 C106 P28765 oash.ReplicationHandler.inform Commits will be reserved for  10000
[junit4:junit4]   2> 20372 T1975 C106 P28765 oash.SnapPuller.<init>  No value set for 'pollInterval'. Timer Task not started.
[junit4:junit4]   2> 20374 T1916 C104 P28653 REQ /replication {command=indexversion&qt=/replication&wt=javabin&version=2} status=0 QTime=0 
[junit4:junit4]   2> 20375 T1975 C106 P28765 oash.SnapPuller.fetchLatestIndex Master's generation: 4
[junit4:junit4]   2> 20375 T1975 C106 P28765 oash.SnapPuller.fetchLatestIndex Slave's generation: 1
[junit4:junit4]   2> 20375 T1975 C106 P28765 oash.SnapPuller.fetchLatestIndex Starting replication process
[junit4:junit4]   2> 20377 T1916 C104 P28653 oasc.CachingDirectoryFactory.close Releasing directory:/usr/home/hudson/hudson-slave/workspace/Lucene-Solr-Tests-4.x-Java6/solr/build/solr-core/test/J0/./org.apache.solr.cloud.SyncSliceTest-1359793333856/jetty1
[junit4:junit4]   2> 20378 T1916 C104 P28653 oasc.CachingDirectoryFactory.close Releasing directory:/usr/home/hudson/hudson-slave/workspace/Lucene-Solr-Tests-4.x-Java6/solr/build/solr-core/test/J0/./org.apache.solr.cloud.SyncSliceTest-1359793333856/jetty1/index
[junit4:junit4]   2> 20378 T1916 C104 P28653 REQ /replication {command=filelist&qt=/replication&wt=javabin&generation=4&version=2} status=0 QTime=1 
[junit4:junit4]   2> 20379 T1975 C106 P28765 oash.SnapPuller.fetchLatestIndex Number of files in latest index in master: 1
[junit4:junit4]   2> 20380 T1975 C106 P28765 oasc.CachingDirectoryFactory.get return new directory for /usr/home/hudson/hudson-slave/workspace/Lucene-Solr-Tests-4.x-Java6/solr/build/solr-core/test/J0/./org.apache.solr.cloud.SyncSliceTest-1359793333856/jetty4/index.20130202022234230 forceNew:false
[junit4:junit4]   2> 20381 T1975 C106 P28765 oasc.CachingDirectoryFactory.close Releasing directory:/usr/home/hudson/hudson-slave/workspace/Lucene-Solr-Tests-4.x-Java6/solr/build/solr-core/test/J0/./org.apache.solr.cloud.SyncSliceTest-1359793333856/jetty4
[junit4:junit4]   2> 20382 T1975 C106 P28765 oash.SnapPuller.fetchLatestIndex Starting download to RateLimitedDirectoryWrapper(NRTCachingDirectory(org.apache.lucene.store.NIOFSDirectory@/usr/home/hudson/hudson-slave/workspace/Lucene-Solr-Tests-4.x-Java6/solr/build/solr-core/test/J0/org.apache.solr.cloud.SyncSliceTest-1359793333856/jetty4/index.20130202022234230 lockFactory=org.apache.lucene.store.NativeFSLockFactory@3cbef088; maxCacheMB=48.0 maxMergeSizeMB=4.0)) fullCopy=true
[junit4:junit4]   2> 20385 T1916 C104 P28653 REQ /replication {file=segments_4&command=filecontent&checksum=true&wt=filestream&qt=/replication&generation=4} status=0 QTime=0 
[junit4:junit4]   2> 20386 T1975 C106 P28765 oasc.CachingDirectoryFactory.close Releasing directory:/usr/home/hudson/hudson-slave/workspace/Lucene-Solr-Tests-4.x-Java6/solr/build/solr-core/test/J0/./org.apache.solr.cloud.SyncSliceTest-1359793333856/jetty4/index
[junit4:junit4]   2> 20387 T1975 C106 P28765 oash.SnapPuller.fetchLatestIndex Total time taken for download : 0 secs
[junit4:junit4]   2> 20387 T1975 C106 P28765 oash.SnapPuller.modifyIndexProps New index installed. Updating index properties... index=index.20130202022234230
[junit4:junit4]   2> 20388 T1975 C106 P28765 oasc.CachingDirectoryFactory.close Releasing directory:/usr/home/hudson/hudson-slave/workspace/Lucene-Solr-Tests-4.x-Java6/solr/build/solr-core/test/J0/./org.apache.solr.cloud.SyncSliceTest-1359793333856/jetty4
[junit4:junit4]   2> 20389 T1975 C106 P28765 oasc.CachingDirectoryFactory.close Releasing directory:/usr/home/hudson/hudson-slave/workspace/Lucene-Solr-Tests-4.x-Java6/solr/build/solr-core/test/J0/./org.apache.solr.cloud.SyncSliceTest-1359793333856/jetty4
[junit4:junit4]   2> 20389 T1975 C106 P28765 oasc.SolrCore.getNewIndexDir New index directory detected: old=./org.apache.solr.cloud.SyncSliceTest-1359793333856/jetty4/index/ new=./org.apache.solr.cloud.SyncSliceTest-1359793333856/jetty4/index.20130202022234230
[junit4:junit4]   2> 20392 T1975 C106 P28765 oasc.SolrDeletionPolicy.onInit SolrDeletionPolicy.onInit: commits:num=1
[junit4:junit4]   2> 		commit{dir=RateLimitedDirectoryWrapper(NRTCachingDirectory(org.apache.lucene.store.NIOFSDirectory@/usr/home/hudson/hudson-slave/workspace/Lucene-Solr-Tests-4.x-Java6/solr/build/solr-core/test/J0/org.apache.solr.cloud.SyncSliceTest-1359793333856/jetty4/index.20130202022234230 lockFactory=org.apache.lucene.store.NativeFSLockFactory@3cbef088; maxCacheMB=48.0 maxMergeSizeMB=4.0)),segFN=segments_4,generation=4,filenames=[segments_4]
[junit4:junit4]   2> 20393 T1975 C106 P28765 oasc.SolrDeletionPolicy.updateCommits newest commit = 4[segments_4]
[junit4:junit4]   2> 20394 T1975 C106 P28765 oasc.CachingDirectoryFactory.close Releasing directory:/usr/home/hudson/hudson-slave/workspace/Lucene-Solr-Tests-4.x-Java6/solr/build/solr-core/test/J0/./org.apache.solr.cloud.SyncSliceTest-1359793333856/jetty4
[junit4:junit4]   2> 20394 T1975 C106 P28765 oasu.DefaultSolrCoreState.newIndexWriter Creating new IndexWriter...
[junit4:junit4]   2> 20394 T1975 C106 P28765 oasu.DefaultSolrCoreState.newIndexWriter Waiting until IndexWriter is unused... core=collection1
[junit4:junit4]   2> 20394 T1975 C106 P28765 oasu.DefaultSolrCoreState.newIndexWriter Rollback old IndexWriter... core=collection1
[junit4:junit4]   2> 20395 T1975 C106 P28765 oasc.CachingDirectoryFactory.close Releasing directory:/usr/home/hudson/hudson-slave/workspace/Lucene-Solr-Tests-4.x-Java6/solr/build/solr-core/test/J0/./org.apache.solr.cloud.SyncSliceTest-1359793333856/jetty4/index.20130202022234230
[junit4:junit4]   2> 20396 T1975 C106 P28765 oasc.CachingDirectoryFactory.close Releasing directory:/usr/home/hudson/hudson-slave/workspace/Lucene-Solr-Tests-4.x-Java6/solr/build/solr-core/test/J0/./org.apache.solr.cloud.SyncSliceTest-1359793333856/jetty4
[junit4:junit4]   2> 20399 T1975 C106 P28765 oasc.SolrDeletionPolicy.onInit SolrDeletionPolicy.onInit: commits:num=1
[junit4:junit4]   2> 		commit{dir=RateLimitedDirectoryWrapper(NRTCachingDirectory(org.apache.lucene.store.NIOFSDirectory@/usr/home/hudson/hudson-slave/workspace/Lucene-Solr-Tests-4.x-Java6/solr/build/solr-core/test/J0/org.apache.solr.cloud.SyncSliceTest-1359793333856/jetty4/index.2013

[...truncated too long message...]

a6/solr/build/solr-core/test/J0/./org.apache.solr.cloud.SyncSliceTest-1359793333856/jetty4
[junit4:junit4]   2> 167411 T1972 oaz.ClientCnxn$EventThread.run EventThread shut down
[junit4:junit4]   2> 167411 T1882 oaz.ZooKeeper.close Session: 0x13c99ffa66b000c closed
[junit4:junit4]   2> 167412 T1882 oejsh.ContextHandler.doStop stopped o.e.j.s.ServletContextHandler{/_f,null}
[junit4:junit4]   2> 167723 T1882 oas.SolrTestCaseJ4.tearDown ###Ending testDistribSearch
[junit4:junit4]   1> client port:0.0.0.0/0.0.0.0:0
[junit4:junit4]   2> NOTE: reproduce with: ant test  -Dtestcase=SyncSliceTest -Dtests.method=testDistribSearch -Dtests.seed=474A1B68E474A41A -Dtests.multiplier=3 -Dtests.slow=true -Dtests.locale=be -Dtests.timezone=SystemV/CST6 -Dtests.file.encoding=US-ASCII
[junit4:junit4] FAILURE  168s J0 | SyncSliceTest.testDistribSearch <<<
[junit4:junit4]    > Throwable #1: java.lang.AssertionError: shard1 should have just been set up to be inconsistent - but it's still consistent
[junit4:junit4]    > 	at __randomizedtesting.SeedInfo.seed([474A1B68E474A41A:C6AC9570932BC426]:0)
[junit4:junit4]    > 	at org.junit.Assert.fail(Assert.java:93)
[junit4:junit4]    > 	at org.junit.Assert.assertTrue(Assert.java:43)
[junit4:junit4]    > 	at org.junit.Assert.assertNotNull(Assert.java:526)
[junit4:junit4]    > 	at org.apache.solr.cloud.SyncSliceTest.doTest(SyncSliceTest.java:214)
[junit4:junit4]    > 	at org.apache.solr.BaseDistributedSearchTestCase.testDistribSearch(BaseDistributedSearchTestCase.java:794)
[junit4:junit4]    > 	at sun.reflect.NativeMethodAccessorImpl.invoke0(Native Method)
[junit4:junit4]    > 	at sun.reflect.NativeMethodAccessorImpl.invoke(NativeMethodAccessorImpl.java:57)
[junit4:junit4]    > 	at sun.reflect.DelegatingMethodAccessorImpl.invoke(DelegatingMethodAccessorImpl.java:43)
[junit4:junit4]    > 	at java.lang.reflect.Method.invoke(Method.java:616)
[junit4:junit4]    > 	at com.carrotsearch.randomizedtesting.RandomizedRunner.invoke(RandomizedRunner.java:1559)
[junit4:junit4]    > 	at com.carrotsearch.randomizedtesting.RandomizedRunner.access$600(RandomizedRunner.java:79)
[junit4:junit4]    > 	at com.carrotsearch.randomizedtesting.RandomizedRunner$6.evaluate(RandomizedRunner.java:737)
[junit4:junit4]    > 	at com.carrotsearch.randomizedtesting.RandomizedRunner$7.evaluate(RandomizedRunner.java:773)
[junit4:junit4]    > 	at com.carrotsearch.randomizedtesting.RandomizedRunner$8.evaluate(RandomizedRunner.java:787)
[junit4:junit4]    > 	at com.carrotsearch.randomizedtesting.rules.SystemPropertiesRestoreRule$1.evaluate(SystemPropertiesRestoreRule.java:53)
[junit4:junit4]    > 	at org.apache.lucene.util.TestRuleSetupTeardownChained$1.evaluate(TestRuleSetupTeardownChained.java:50)
[junit4:junit4]    > 	at org.apache.lucene.util.TestRuleFieldCacheSanity$1.evaluate(TestRuleFieldCacheSanity.java:51)
[junit4:junit4]    > 	at org.apache.lucene.util.AbstractBeforeAfterRule$1.evaluate(AbstractBeforeAfterRule.java:46)
[junit4:junit4]    > 	at com.carrotsearch.randomizedtesting.rules.SystemPropertiesInvariantRule$1.evaluate(SystemPropertiesInvariantRule.java:55)
[junit4:junit4]    > 	at org.apache.lucene.util.TestRuleThreadAndTestName$1.evaluate(TestRuleThreadAndTestName.java:49)
[junit4:junit4]    > 	at org.apache.lucene.util.TestRuleIgnoreAfterMaxFailures$1.evaluate(TestRuleIgnoreAfterMaxFailures.java:70)
[junit4:junit4]    > 	at org.apache.lucene.util.TestRuleMarkFailure$1.evaluate(TestRuleMarkFailure.java:48)
[junit4:junit4]    > 	at com.carrotsearch.randomizedtesting.rules.StatementAdapter.evaluate(StatementAdapter.java:36)
[junit4:junit4]    > 	at com.carrotsearch.randomizedtesting.ThreadLeakControl$StatementRunner.run(ThreadLeakControl.java:358)
[junit4:junit4]    > 	at com.carrotsearch.randomizedtesting.ThreadLeakControl.forkTimeoutingTask(ThreadLeakControl.java:782)
[junit4:junit4]    > 	at com.carrotsearch.randomizedtesting.ThreadLeakControl$3.evaluate(ThreadLeakControl.java:442)
[junit4:junit4]    > 	at com.carrotsearch.randomizedtesting.RandomizedRunner.runSingleTest(RandomizedRunner.java:746)
[junit4:junit4]    > 	at com.carrotsearch.randomizedtesting.RandomizedRunner$3.evaluate(RandomizedRunner.java:648)
[junit4:junit4]    > 	at com.carrotsearch.randomizedtesting.RandomizedRunner$4.evaluate(RandomizedRunner.java:682)
[junit4:junit4]    > 	at com.carrotsearch.randomizedtesting.RandomizedRunner$5.evaluate(RandomizedRunner.java:693)
[junit4:junit4]    > 	at com.carrotsearch.randomizedtesting.rules.StatementAdapter.evaluate(StatementAdapter.java:36)
[junit4:junit4]    > 	at com.carrotsearch.randomizedtesting.rules.SystemPropertiesRestoreRule$1.evaluate(SystemPropertiesRestoreRule.java:53)
[junit4:junit4]    > 	at org.apache.lucene.util.AbstractBeforeAfterRule$1.evaluate(AbstractBeforeAfterRule.java:46)
[junit4:junit4]    > 	at org.apache.lucene.util.TestRuleStoreClassName$1.evaluate(TestRuleStoreClassName.java:42)
[junit4:junit4]    > 	at com.carrotsearch.randomizedtesting.rules.SystemPropertiesInvariantRule$1.evaluate(SystemPropertiesInvariantRule.java:55)
[junit4:junit4]    > 	at com.carrotsearch.randomizedtesting.rules.NoShadowingOrOverridesOnMethodsRule$1.evaluate(NoShadowingOrOverridesOnMethodsRule.java:39)
[junit4:junit4]    > 	at com.carrotsearch.randomizedtesting.rules.NoShadowingOrOverridesOnMethodsRule$1.evaluate(NoShadowingOrOverridesOnMethodsRule.java:39)
[junit4:junit4]    > 	at com.carrotsearch.randomizedtesting.rules.StatementAdapter.evaluate(StatementAdapter.java:36)
[junit4:junit4]    > 	at org.apache.lucene.util.TestRuleAssertionsRequired$1.evaluate(TestRuleAssertionsRequired.java:43)
[junit4:junit4]    > 	at org.apache.lucene.util.TestRuleMarkFailure$1.evaluate(TestRuleMarkFailure.java:48)
[junit4:junit4]    > 	at org.apache.lucene.util.TestRuleIgnoreAfterMaxFailures$1.evaluate(TestRuleIgnoreAfterMaxFailures.java:70)
[junit4:junit4]    > 	at org.apache.lucene.util.TestRuleIgnoreTestSuites$1.evaluate(TestRuleIgnoreTestSuites.java:55)
[junit4:junit4]    > 	at com.carrotsearch.randomizedtesting.rules.StatementAdapter.evaluate(StatementAdapter.java:36)
[junit4:junit4]    > 	at com.carrotsearch.randomizedtesting.ThreadLeakControl$StatementRunner.run(ThreadLeakControl.java:358)
[junit4:junit4]    > 	at java.lang.Thread.run(Thread.java:679)
[junit4:junit4]   2> 167741 T1882 oas.SolrTestCaseJ4.deleteCore ###deleteCore
[junit4:junit4]   2> NOTE: test params are: codec=Lucene42: {range_facet_l=PostingsFormat(name=NestedPulsing), text=Pulsing41(freqCutoff=20 minBlockSize=94 maxBlockSize=253), _version_=Pulsing41(freqCutoff=2 minBlockSize=94 maxBlockSize=253), rnd_b=Lucene41(blocksize=128), intDefault=Pulsing41(freqCutoff=2 minBlockSize=94 maxBlockSize=253), id=Lucene41(blocksize=128), timestamp=PostingsFormat(name=NestedPulsing), a_t=PostingsFormat(name=NestedPulsing), range_facet_sl=Lucene41(blocksize=128), range_facet_si=PostingsFormat(name=NestedPulsing), other_tl1=Pulsing41(freqCutoff=2 minBlockSize=94 maxBlockSize=253), multiDefault=PostingsFormat(name=NestedPulsing), a_si=Pulsing41(freqCutoff=2 minBlockSize=94 maxBlockSize=253)}, sim=DefaultSimilarity, locale=be, timezone=SystemV/CST6
[junit4:junit4]   2> NOTE: FreeBSD 9.0-RELEASE amd64/Sun Microsystems Inc. 1.6.0_32 (64-bit)/cpus=16,threads=2,free=192805760,total=357629952
[junit4:junit4]   2> NOTE: All tests run in this JVM: [SpellCheckCollatorTest, PreAnalyzedFieldTest, TestBinaryResponseWriter, TestIBSimilarityFactory, CoreAdminHandlerTest, SuggesterFSTTest, MoreLikeThisHandlerTest, DirectSolrConnectionTest, DistanceFunctionTest, FieldAnalysisRequestHandlerTest, JSONWriterTest, TestFaceting, SpellPossibilityIteratorTest, AutoCommitTest, SimplePostToolTest, SolrCmdDistributorTest, ChaosMonkeySafeLeaderTest, QueryElevationComponentTest, BasicDistributedZkTest, TestElisionMultitermQuery, TestComponentsName, CSVRequestHandlerTest, HighlighterConfigTest, TestSolrIndexConfig, CoreContainerCoreInitFailuresTest, UniqFieldsUpdateProcessorFactoryTest, TestFuzzyAnalyzedSuggestions, TestRandomFaceting, TestLMJelinekMercerSimilarityFactory, DateFieldTest, FastVectorHighlighterTest, CurrencyFieldTest, TestExtendedDismaxParser, TestConfig, WordBreakSolrSpellCheckerTest, TestSystemIdResolver, TestJmxMonitoredMap, ScriptEngineTest, TestJoin, DistributedTermsComponentTest, LeaderElectionIntegrationTest, TestPHPSerializedResponseWriter, TestGroupingSearch, ChaosMonkeyNothingIsSafeTest, TestDocumentBuilder, UpdateRequestProcessorFactoryTest, TestZkChroot, TestLazyCores, DirectUpdateHandlerOptimizeTest, DefaultValueUpdateProcessorTest, SOLR749Test, BinaryUpdateRequestHandlerTest, MBeansHandlerTest, ExternalFileFieldSortTest, AlternateDirectoryTest, TestLMDirichletSimilarityFactory, SolrCoreCheckLockOnStartupTest, SpatialFilterTest, ShardRoutingTest, SyncSliceTest]
[junit4:junit4] Completed on J0 in 167.77s, 1 test, 1 failure <<< FAILURES!

[...truncated 10 lines...]
BUILD FAILED
/usr/home/hudson/hudson-slave/workspace/Lucene-Solr-Tests-4.x-Java6/build.xml:346: The following error occurred while executing this line:
/usr/home/hudson/hudson-slave/workspace/Lucene-Solr-Tests-4.x-Java6/build.xml:39: The following error occurred while executing this line:
/usr/home/hudson/hudson-slave/workspace/Lucene-Solr-Tests-4.x-Java6/solr/build.xml:178: The following error occurred while executing this line:
/usr/home/hudson/hudson-slave/workspace/Lucene-Solr-Tests-4.x-Java6/solr/common-build.xml:428: The following error occurred while executing this line:
/usr/home/hudson/hudson-slave/workspace/Lucene-Solr-Tests-4.x-Java6/lucene/common-build.xml:1176: The following error occurred while executing this line:
/usr/home/hudson/hudson-slave/workspace/Lucene-Solr-Tests-4.x-Java6/lucene/common-build.xml:841: There were test failures: 250 suites, 1041 tests, 1 failure, 23 ignored (5 assumptions)

Total time: 34 minutes 31 seconds
Build step 'Invoke Ant' marked build as failure
Archiving artifacts
Recording test results
Email was triggered for: Failure
Sending email for trigger: Failure



Mime
View raw message