lucene-dev mailing list archives

Site index · List index
Message view « Date » · « Thread »
Top « Date » · « Thread »
From Policeman Jenkins Server <jenk...@thetaphi.de>
Subject [JENKINS] Lucene-Solr-4.x-MacOSX (64bit/jdk1.6.0) - Build # 209 - Failure!
Date Wed, 13 Feb 2013 22:25:41 GMT
Build: http://jenkins.thetaphi.de/job/Lucene-Solr-4.x-MacOSX/209/
Java: 64bit/jdk1.6.0 -XX:+UseParallelGC

1 tests failed.
FAILED:  junit.framework.TestSuite.org.apache.solr.update.SoftAutoCommitTest

Error Message:
ERROR: SolrIndexSearcher opens=13 closes=12

Stack Trace:
java.lang.AssertionError: ERROR: SolrIndexSearcher opens=13 closes=12
	at __randomizedtesting.SeedInfo.seed([43FDCEA5291B5AD9]:0)
	at org.junit.Assert.fail(Assert.java:93)
	at org.apache.solr.SolrTestCaseJ4.endTrackingSearchers(SolrTestCaseJ4.java:246)
	at org.apache.solr.SolrTestCaseJ4.afterClass(SolrTestCaseJ4.java:97)
	at sun.reflect.NativeMethodAccessorImpl.invoke0(Native Method)
	at sun.reflect.NativeMethodAccessorImpl.invoke(NativeMethodAccessorImpl.java:39)
	at sun.reflect.DelegatingMethodAccessorImpl.invoke(DelegatingMethodAccessorImpl.java:25)
	at java.lang.reflect.Method.invoke(Method.java:597)
	at com.carrotsearch.randomizedtesting.RandomizedRunner.invoke(RandomizedRunner.java:1559)
	at com.carrotsearch.randomizedtesting.RandomizedRunner.access$600(RandomizedRunner.java:79)
	at com.carrotsearch.randomizedtesting.RandomizedRunner$5.evaluate(RandomizedRunner.java:700)
	at com.carrotsearch.randomizedtesting.rules.StatementAdapter.evaluate(StatementAdapter.java:36)
	at com.carrotsearch.randomizedtesting.rules.SystemPropertiesRestoreRule$1.evaluate(SystemPropertiesRestoreRule.java:53)
	at org.apache.lucene.util.AbstractBeforeAfterRule$1.evaluate(AbstractBeforeAfterRule.java:46)
	at org.apache.lucene.util.TestRuleStoreClassName$1.evaluate(TestRuleStoreClassName.java:42)
	at com.carrotsearch.randomizedtesting.rules.SystemPropertiesInvariantRule$1.evaluate(SystemPropertiesInvariantRule.java:55)
	at com.carrotsearch.randomizedtesting.rules.NoShadowingOrOverridesOnMethodsRule$1.evaluate(NoShadowingOrOverridesOnMethodsRule.java:39)
	at com.carrotsearch.randomizedtesting.rules.NoShadowingOrOverridesOnMethodsRule$1.evaluate(NoShadowingOrOverridesOnMethodsRule.java:39)
	at com.carrotsearch.randomizedtesting.rules.StatementAdapter.evaluate(StatementAdapter.java:36)
	at org.apache.lucene.util.TestRuleAssertionsRequired$1.evaluate(TestRuleAssertionsRequired.java:43)
	at org.apache.lucene.util.TestRuleMarkFailure$1.evaluate(TestRuleMarkFailure.java:48)
	at org.apache.lucene.util.TestRuleIgnoreAfterMaxFailures$1.evaluate(TestRuleIgnoreAfterMaxFailures.java:70)
	at org.apache.lucene.util.TestRuleIgnoreTestSuites$1.evaluate(TestRuleIgnoreTestSuites.java:55)
	at com.carrotsearch.randomizedtesting.rules.StatementAdapter.evaluate(StatementAdapter.java:36)
	at com.carrotsearch.randomizedtesting.ThreadLeakControl$StatementRunner.run(ThreadLeakControl.java:358)
	at java.lang.Thread.run(Thread.java:680)




Build Log:
[...truncated 7941 lines...]
[junit4:junit4] Suite: org.apache.solr.update.SoftAutoCommitTest
[junit4:junit4]   2> 1 T67 oas.SolrTestCaseJ4.initCore ####initCore
[junit4:junit4]   2> Creating dataDir: /Users/jenkins/jenkins-slave/workspace/Lucene-Solr-4.x-MacOSX/solr/build/solr-core/test/J0/./solrtest-SoftAutoCommitTest-1360792238687
[junit4:junit4]   2> 2 T67 oasc.SolrResourceLoader.<init> new SolrResourceLoader for directory: '/Users/jenkins/jenkins-slave/workspace/Lucene-Solr-4.x-MacOSX/solr/build/solr-core/test-files/solr/collection1/'
[junit4:junit4]   2> 3 T67 oasc.SolrResourceLoader.replaceClassLoader Adding 'file:/Users/jenkins/jenkins-slave/workspace/Lucene-Solr-4.x-MacOSX/solr/build/solr-core/test-files/solr/collection1/lib/classes/' to classloader
[junit4:junit4]   2> 11 T67 oasc.SolrResourceLoader.replaceClassLoader Adding 'file:/Users/jenkins/jenkins-slave/workspace/Lucene-Solr-4.x-MacOSX/solr/build/solr-core/test-files/solr/collection1/lib/README' to classloader
[junit4:junit4]   2> 86 T67 oasc.SolrConfig.<init> Using Lucene MatchVersion: LUCENE_42
[junit4:junit4]   2> 157 T67 oasc.SolrConfig.<init> Loaded SolrConfig: solrconfig.xml
[junit4:junit4]   2> 159 T67 oass.IndexSchema.readSchema Reading Solr Schema
[junit4:junit4]   2> 199 T67 oass.IndexSchema.readSchema Schema name=test
[junit4:junit4]   2> 836 T67 oass.OpenExchangeRatesOrgProvider.init Initialized with rates=open-exchange-rates.json, refreshInterval=1440.
[junit4:junit4]   2> 855 T67 oass.IndexSchema.readSchema default search field in schema is text
[junit4:junit4]   2> 859 T67 oass.IndexSchema.readSchema unique key field: id
[junit4:junit4]   2> 887 T67 oass.FileExchangeRateProvider.reload Reloading exchange rates from file currency.xml
[junit4:junit4]   2> 893 T67 oass.FileExchangeRateProvider.reload Reloading exchange rates from file currency.xml
[junit4:junit4]   2> 900 T67 oass.OpenExchangeRatesOrgProvider.reload Reloading exchange rates from open-exchange-rates.json
[junit4:junit4]   2> 902 T67 oass.OpenExchangeRatesOrgProvider.reload Reloading exchange rates from open-exchange-rates.json
[junit4:junit4]   2> 905 T67 oasc.SolrResourceLoader.locateSolrHome JNDI not configured for solr (NoInitialContextEx)
[junit4:junit4]   2> 905 T67 oasc.SolrResourceLoader.locateSolrHome using system property solr.solr.home: /Users/jenkins/jenkins-slave/workspace/Lucene-Solr-4.x-MacOSX/solr/build/solr-core/test-files/solr
[junit4:junit4]   2> 906 T67 oasc.SolrResourceLoader.<init> new SolrResourceLoader for directory: '/Users/jenkins/jenkins-slave/workspace/Lucene-Solr-4.x-MacOSX/solr/build/solr-core/test-files/solr/'
[junit4:junit4]   2> 919 T67 oasc.CoreContainer.<init> New CoreContainer 126607146
[junit4:junit4]   2> 920 T67 oasc.SolrCore.<init> [collection1] Opening new SolrCore at /Users/jenkins/jenkins-slave/workspace/Lucene-Solr-4.x-MacOSX/solr/build/solr-core/test-files/solr/collection1/, dataDir=/Users/jenkins/jenkins-slave/workspace/Lucene-Solr-4.x-MacOSX/solr/build/solr-core/test/J0/./solrtest-SoftAutoCommitTest-1360792238687/
[junit4:junit4]   2> 920 T67 oasc.JmxMonitoredMap.<init> JMX monitoring is enabled. Adding Solr mbeans to JMX Server: com.sun.jmx.mbeanserver.JmxMBeanServer@7ae0c7c3
[junit4:junit4]   2> 921 T67 oasc.SolrCore.initDirectoryFactory org.apache.solr.core.MockDirectoryFactory
[junit4:junit4]   2> 922 T67 oasc.CachingDirectoryFactory.get return new directory for /Users/jenkins/jenkins-slave/workspace/Lucene-Solr-4.x-MacOSX/solr/build/solr-core/test/J0/./solrtest-SoftAutoCommitTest-1360792238687 forceNew:false
[junit4:junit4]   2> 923 T67 oasc.CachingDirectoryFactory.close Releasing directory:/Users/jenkins/jenkins-slave/workspace/Lucene-Solr-4.x-MacOSX/solr/build/solr-core/test/J0/./solrtest-SoftAutoCommitTest-1360792238687
[junit4:junit4]   2> 923 T67 oasc.SolrCore.getNewIndexDir New index directory detected: old=null new=/Users/jenkins/jenkins-slave/workspace/Lucene-Solr-4.x-MacOSX/solr/build/solr-core/test/J0/./solrtest-SoftAutoCommitTest-1360792238687/index/
[junit4:junit4]   2> 924 T67 oasc.SolrCore.initIndex WARNING [collection1] Solr index directory '/Users/jenkins/jenkins-slave/workspace/Lucene-Solr-4.x-MacOSX/solr/build/solr-core/test/J0/./solrtest-SoftAutoCommitTest-1360792238687/index' doesn't exist. Creating new index...
[junit4:junit4]   2> 925 T67 oasc.CachingDirectoryFactory.get return new directory for /Users/jenkins/jenkins-slave/workspace/Lucene-Solr-4.x-MacOSX/solr/build/solr-core/test/J0/./solrtest-SoftAutoCommitTest-1360792238687/index forceNew:false
[junit4:junit4]   2> 927 T67 oasc.SolrDeletionPolicy.onCommit SolrDeletionPolicy.onCommit: commits:num=1
[junit4:junit4]   2> 		commit{dir=RateLimitedDirectoryWrapper(MockDirWrapper(org.apache.lucene.store.RAMDirectory@4bfa79c8 lockFactory=org.apache.lucene.store.NativeFSLockFactory@1d926e41)),segFN=segments_1,generation=1,filenames=[segments_1]
[junit4:junit4]   2> 927 T67 oasc.SolrDeletionPolicy.updateCommits newest commit = 1[segments_1]
[junit4:junit4]   2> 928 T67 oasc.CachingDirectoryFactory.close Releasing directory:/Users/jenkins/jenkins-slave/workspace/Lucene-Solr-4.x-MacOSX/solr/build/solr-core/test/J0/./solrtest-SoftAutoCommitTest-1360792238687/index
[junit4:junit4]   2> 928 T67 oasc.SolrCore.initWriters created xml: solr.XMLResponseWriter
[junit4:junit4]   2> 931 T67 oasup.UpdateRequestProcessorChain.init inserting DistributedUpdateProcessorFactory into updateRequestProcessorChain "dedupe"
[junit4:junit4]   2> 932 T67 oasup.UpdateRequestProcessorChain.init inserting DistributedUpdateProcessorFactory into updateRequestProcessorChain "dedupe-allfields"
[junit4:junit4]   2> 932 T67 oasup.UpdateRequestProcessorChain.init inserting DistributedUpdateProcessorFactory into updateRequestProcessorChain "stored_sig"
[junit4:junit4]   2> 933 T67 oasup.UpdateRequestProcessorChain.init inserting DistributedUpdateProcessorFactory into updateRequestProcessorChain "uniq-fields"
[junit4:junit4]   2> 934 T67 oasup.UpdateRequestProcessorChain.init inserting DistributedUpdateProcessorFactory into updateRequestProcessorChain "distrib-dup-test-chain-implicit"
[junit4:junit4]   2> 935 T67 oasc.RequestHandlers.initHandlersFromConfig adding lazy requestHandler: solr.ReplicationHandler
[junit4:junit4]   2> 935 T67 oasc.RequestHandlers.initHandlersFromConfig created /replication: solr.ReplicationHandler
[junit4:junit4]   2> 936 T67 oasc.RequestHandlers.initHandlersFromConfig created standard: solr.StandardRequestHandler
[junit4:junit4]   2> 937 T67 oasc.RequestHandlers.initHandlersFromConfig created /get: solr.RealTimeGetHandler
[junit4:junit4]   2> 938 T67 oasc.RequestHandlers.initHandlersFromConfig created dismax: solr.SearchHandler
[junit4:junit4]   2> 939 T67 oasc.RequestHandlers.initHandlersFromConfig created mock: org.apache.solr.core.MockQuerySenderListenerReqHandler
[junit4:junit4]   2> 940 T67 oasc.RequestHandlers.initHandlersFromConfig created /admin/: org.apache.solr.handler.admin.AdminHandlers
[junit4:junit4]   2> 940 T67 oasc.RequestHandlers.initHandlersFromConfig created defaults: solr.StandardRequestHandler
[junit4:junit4]   2> 941 T67 oasc.RequestHandlers.initHandlersFromConfig adding lazy requestHandler: solr.StandardRequestHandler
[junit4:junit4]   2> 941 T67 oasc.RequestHandlers.initHandlersFromConfig created lazy: solr.StandardRequestHandler
[junit4:junit4]   2> 942 T67 oasc.RequestHandlers.initHandlersFromConfig created /update: solr.UpdateRequestHandler
[junit4:junit4]   2> 943 T67 oasc.RequestHandlers.initHandlersFromConfig created /terms: org.apache.solr.handler.component.SearchHandler
[junit4:junit4]   2> 944 T67 oasc.RequestHandlers.initHandlersFromConfig created spellCheckCompRH: org.apache.solr.handler.component.SearchHandler
[junit4:junit4]   2> 945 T67 oasc.RequestHandlers.initHandlersFromConfig created spellCheckCompRH_Direct: org.apache.solr.handler.component.SearchHandler
[junit4:junit4]   2> 946 T67 oasc.RequestHandlers.initHandlersFromConfig created spellCheckWithWordbreak: org.apache.solr.handler.component.SearchHandler
[junit4:junit4]   2> 947 T67 oasc.RequestHandlers.initHandlersFromConfig created spellCheckWithWordbreak_Direct: org.apache.solr.handler.component.SearchHandler
[junit4:junit4]   2> 948 T67 oasc.RequestHandlers.initHandlersFromConfig created spellCheckCompRH1: org.apache.solr.handler.component.SearchHandler
[junit4:junit4]   2> 948 T67 oasc.RequestHandlers.initHandlersFromConfig created mltrh: org.apache.solr.handler.component.SearchHandler
[junit4:junit4]   2> 950 T67 oasc.RequestHandlers.initHandlersFromConfig created tvrh: org.apache.solr.handler.component.SearchHandler
[junit4:junit4]   2> 950 T67 oasc.RequestHandlers.initHandlersFromConfig created /mlt: solr.MoreLikeThisHandler
[junit4:junit4]   2> 951 T67 oasc.RequestHandlers.initHandlersFromConfig created /debug/dump: solr.DumpRequestHandler
[junit4:junit4]   2> 956 T67 oashl.XMLLoader.init xsltCacheLifetimeSeconds=60
[junit4:junit4]   2> 959 T67 oasc.SolrCore.initDeprecatedSupport WARNING solrconfig.xml uses deprecated <admin/gettableFiles>, Please update your config to use the ShowFileRequestHandler.
[junit4:junit4]   2> 961 T67 oasc.SolrCore.initDeprecatedSupport WARNING adding ShowFileRequestHandler with hidden files: [THROW.ERROR.ON.ADD.UPDATEPROCESSOR.JS, SOLRCONFIG-HIGHLIGHT.XML, SCHEMA-REQUIRED-FIELDS.XML, TRIVIAL.UPDATEPROCESSOR1.JS, BAD-SCHEMA-DUP-DYNAMICFIELD.XML, SCHEMA-MINIMAL.XML, SCHEMA-REPLICATION2.XML, SOLRCONFIG-CACHING.XML, SCHEMA-POSTINGSHIGHLIGHT.XML, SOLRCONFIG-REPEATER.XML, REGEX-BOOST-PROCESSOR-TEST.TXT, SOLRCONFIG-MERGEPOLICY.XML, CURRENCY.XML, BAD-SCHEMA-NONTEXT-ANALYZER.XML, SOLRCONFIG-TLOG.XML, SOLRCONFIG-MASTER.XML, SOLRCONFIG-COMPONENTS-NAME.XML, BAD-SCHEMA-UNIQUEKEY-MULTIVALUED.XML, SCHEMA11.XML, SOLRCONFIG-BASIC.XML, DA_COMPOUNDDICTIONARY.TXT, MISSLEADING.EXTENSION.UPDATEPROCESSOR.JS.TXT, SCHEMA-COPYFIELD-TEST.XML, SOLRCONFIG-SLAVE.XML, SOLRCONFIG-PROPINJECT-INDEXDEFAULT.XML, ELEVATE.XML, TRIVIAL.UPDATEPROCESSOR0.JS, BAD-SOLRCONFIG-BOGUS-SCRIPTENGINE-NAME.XML, SCHEMA-CHARFILTERS.XML, SCHEMA-IB.XML, SOLRCONFIG-QUERYSENDER.XML, SOLRCONFIG-SNIPPET-PROCESSOR.XML, DA_UTF8.XML, SCHEMA-REPLICATION1.XML, CONDITIONAL.UPDATEPROCESSOR.JS, MISSING.FUNCTIONS.UPDATEPROCESSOR.JS, HYPHENATION.DTD, SOLRCONFIG-ENABLEPLUGIN.XML, STEMDICT.TXT, SCHEMA-PHRASESUGGEST.XML, HUNSPELL-TEST.AFF, SCHEMA-SNIPPET-TYPE.XML, STOPTYPES-1.TXT, STOPWORDSWRONGENCODING.TXT, SCHEMA-NUMERIC.XML, SOLRCONFIG-TRANSFORMERS.XML, SOLRCONFIG-PROPINJECT.XML, BAD-SCHEMA-NOT-INDEXED-BUT-TF.XML, SOLRCONFIG-SIMPLELOCK.XML, WDFTYPES.TXT, STOPTYPES-2.TXT, SCHEMA-REVERSED.XML, BAD-SCHEMA-CURRENCY-FT-MULTIVALUED.XML, SOLRCONFIG-SPELLCHECKCOMPONENT.XML, SOLRCONFIG-PHRASESUGGEST.XML, BAD-SCHEMA-CURRENCY-MULTIVALUED.XML, SCHEMA-DFR.XML, BAD-SCHEMA-NOT-INDEXED-BUT-POS.XML, KEEP-1.TXT, OPEN-EXCHANGE-RATES.JSON, SCHEMA-SPATIAL.XML, STOPWITHBOM.TXT, SOLRCONFIG-SPELLCHECKER.XML, SOLRCONFIG-POSTINGSHIGHLIGHT.XML, SCHEMA-BINARYFIELD.XML, SOLRCONFIG-UPDATE-PROCESSOR-CHAINS.XML, BAD-SCHEMA-OMIT-TF-BUT-NOT-POS.XML, BAD-SCHEMA-DUP-FIELDTYPE.XML, SCHEMA-XINCLUDE.XML, SOLRCONFIG-MASTER1.XML, SCHEMA-BEHAVIOR.XML, SYNONYMS.TXT, BAD-SCHEMA-CURRENCY-DYNAMIC-MULTIVALUED.XML, SCHEMA.XML, SCHEMA_CODEC.XML, SOLRCONFIG-SOLR-749.XML, SOLRCONFIG-MASTER1-KEEPONEBACKUP.XML, SCHEMA-EFF.XML, STOP-2.TXT, SOLRCONFIG-FUNCTIONQUERY.XML, SOLRCONFIG-TERMINDEX.XML, SCHEMA-LMDIRICHLET.XML, SOLRCONFIG-ELEVATE.XML, STOPWORDS.TXT, SCHEMA-FOLDING.XML, SCHEMA-STOP-KEEP.XML, FUZZYSUGGEST.TXT, BAD-SCHEMA-NOT-INDEXED-BUT-NORMS.XML, SOLRCONFIG-SOLCOREPROPERTIES.XML, STOP-1.TXT, SOLRCONFIG-MASTER2.XML, SCHEMA-SPELLCHECKER.XML, SOLRCONFIG-RESPONSE-LOG-COMPONENT.XML, SOLRCONFIG-LAZYWRITER.XML, SCHEMA-LUCENEMATCHVERSION.XML, FRENCHARTICLES.TXT, BAD-MP-SOLRCONFIG.XML, SCHEMA15.XML, SOLRCONFIG-REQHANDLER.INCL, SCHEMASURROUND.XML, SCHEMA-COLLATEFILTER.XML, SOLRCONFIG-MASTER3.XML, HUNSPELL-TEST.DIC, SOLRCONFIG-XINCLUDE.XML, BAD-SCHEMA-CODEC-GLOBAL-VS-FT-MISMATCH.XML, SOLRCONFIG-SLAVE1.XML, SOLRCONFIG-DELPOLICY1.XML, SCHEMA-SIM.XML, SCHEMA-SNIPPET-FIELD.XML, SCHEMA-COLLATE.XML, STOP-SNOWBALL.TXT, BAD-SCHEMA-SIM-GLOBAL-VS-FT-MISMATCH.XML, PROTWORDS.TXT, SCHEMA-TRIE.XML, SOLRCONFIG_CODEC.XML, SCHEMA-SYNONYM-TOKENIZER.XML, BAD-SOLRCONFIG-INVALID-SCRIPTFILE.XML, JASUGGEST.TXT, SCHEMA-TFIDF.XML, SOLRCONFIG-SCRIPT-UPDATEPROCESSOR.XML, SCHEMA-LMJELINEKMERCER.XML, PHRASESUGGEST.TXT, BAD-SOLRCONFIG-MISSING-SCRIPTFILE.XML, SOLRCONFIG-BASIC-LUCENEVERSION31.XML, BAD-SCHEMA-UNIQUEKEY-USES-DEFAULT.XML, OLD_SYNONYMS.TXT, SOLRCONFIG-DELPOLICY2.XML, XSLT, SOLRCONFIG-NATIVELOCK.XML, BAD-SCHEMA-DUP-FIELD.XML, SOLRCONFIG-NOCACHE.XML, SCHEMA-BM25.XML, ADDFIELDS.UPDATEPROCESSOR.JS, SOLRCONFIG-QUERYSENDER-NOQUERY.XML, SOLRCONFIG-ALTDIRECTORY.XML, COMPOUNDDICTIONARY.TXT, SOLRCONFIG_PERF.XML, SOLRCONFIG-INDEXCONFIG.XML, BAD-SCHEMA-ANALYZER-CLASS-AND-NESTED.XML, SCHEMA-NOT-REQUIRED-UNIQUE-KEY.XML, KEEP-2.TXT, BAD-SCHEMA-UNIQUEKEY-IS-COPYFIELD-DEST.XML, SCHEMA12.XML, MAPPING-ISOLATIN1ACCENT.TXT, BAD_SOLRCONFIG.XML, BAD-SCHEMA-EXTERNAL-FILEFIELD.XML]
[junit4:junit4]   2> 964 T67 oasc.CachingDirectoryFactory.close Releasing directory:/Users/jenkins/jenkins-slave/workspace/Lucene-Solr-4.x-MacOSX/solr/build/solr-core/test/J0/./solrtest-SoftAutoCommitTest-1360792238687
[junit4:junit4]   2> 965 T67 oass.SolrIndexSearcher.<init> Opening Searcher@20e1bfee main
[junit4:junit4]   2> 966 T67 oasu.CommitTracker.<init> Hard AutoCommit: disabled
[junit4:junit4]   2> 966 T67 oasu.CommitTracker.<init> Soft AutoCommit: disabled
[junit4:junit4]   2> 967 T67 oashc.SpellCheckComponent.inform Initializing spell checkers
[junit4:junit4]   2> 973 T67 oass.DirectSolrSpellChecker.init init: {name=direct,classname=DirectSolrSpellChecker,field=lowerfilt,minQueryLength=3}
[junit4:junit4]   2> 1006 T68 oasc.SolrCore.registerSearcher [collection1] Registered new searcher Searcher@20e1bfee main{StandardDirectoryReader(segments_1:1)}
[junit4:junit4]   2> 1017 T67 oasc.CoreContainer.registerCore registering core: collection1
[junit4:junit4]   2> 1021 T67 oas.SolrTestCaseJ4.initCore ####initCore end
[junit4:junit4]   2> 1027 T67 oas.SolrTestCaseJ4.setUp ###Starting testSoftAndHardCommitMaxTimeMixedAdds
[junit4:junit4]   2> 1028 T67 oasc.CoreContainer.reload Reloading SolrCore 'collection1' using instanceDir: /Users/jenkins/jenkins-slave/workspace/Lucene-Solr-4.x-MacOSX/solr/build/solr-core/test-files/solr/collection1
[junit4:junit4]   2> 1029 T67 oasc.SolrResourceLoader.<init> new SolrResourceLoader for directory: '/Users/jenkins/jenkins-slave/workspace/Lucene-Solr-4.x-MacOSX/solr/build/solr-core/test-files/solr/collection1/'
[junit4:junit4]   2> 1030 T67 oasc.SolrResourceLoader.replaceClassLoader Adding 'file:/Users/jenkins/jenkins-slave/workspace/Lucene-Solr-4.x-MacOSX/solr/build/solr-core/test-files/solr/collection1/lib/classes/' to classloader
[junit4:junit4]   2> 1030 T67 oasc.SolrResourceLoader.replaceClassLoader Adding 'file:/Users/jenkins/jenkins-slave/workspace/Lucene-Solr-4.x-MacOSX/solr/build/solr-core/test-files/solr/collection1/lib/README' to classloader
[junit4:junit4]   2> 1118 T67 oasc.SolrConfig.<init> Using Lucene MatchVersion: LUCENE_42
[junit4:junit4]   2> 1220 T67 oasc.SolrConfig.<init> Loaded SolrConfig: solrconfig.xml
[junit4:junit4]   2> 1221 T67 oass.IndexSchema.readSchema Reading Solr Schema
[junit4:junit4]   2> 1237 T67 oass.IndexSchema.readSchema Schema name=test
[junit4:junit4]   2> 2804 T67 oass.OpenExchangeRatesOrgProvider.init Initialized with rates=open-exchange-rates.json, refreshInterval=1440.
[junit4:junit4]   2> 2818 T67 oass.IndexSchema.readSchema default search field in schema is text
[junit4:junit4]   2> 2822 T67 oass.IndexSchema.readSchema unique key field: id
[junit4:junit4]   2> 2840 T67 oass.FileExchangeRateProvider.reload Reloading exchange rates from file currency.xml
[junit4:junit4]   2> 2845 T67 oass.FileExchangeRateProvider.reload Reloading exchange rates from file currency.xml
[junit4:junit4]   2> 2850 T67 oass.OpenExchangeRatesOrgProvider.reload Reloading exchange rates from open-exchange-rates.json
[junit4:junit4]   2> 2852 T67 oass.OpenExchangeRatesOrgProvider.reload Reloading exchange rates from open-exchange-rates.json
[junit4:junit4]   2> 2854 T67 oasc.SolrCore.<init> [collection1] Opening new SolrCore at /Users/jenkins/jenkins-slave/workspace/Lucene-Solr-4.x-MacOSX/solr/build/solr-core/test-files/solr/collection1/, dataDir=/Users/jenkins/jenkins-slave/workspace/Lucene-Solr-4.x-MacOSX/solr/build/solr-core/test/J0/./solrtest-SoftAutoCommitTest-1360792238687/
[junit4:junit4]   2> 2854 T67 oasc.JmxMonitoredMap.<init> JMX monitoring is enabled. Adding Solr mbeans to JMX Server: com.sun.jmx.mbeanserver.JmxMBeanServer@7ae0c7c3
[junit4:junit4]   2> 2855 T67 oasc.CachingDirectoryFactory.close Releasing directory:/Users/jenkins/jenkins-slave/workspace/Lucene-Solr-4.x-MacOSX/solr/build/solr-core/test/J0/./solrtest-SoftAutoCommitTest-1360792238687
[junit4:junit4]   2> 2856 T67 oasc.SolrCore.getNewIndexDir New index directory detected: old=null new=/Users/jenkins/jenkins-slave/workspace/Lucene-Solr-4.x-MacOSX/solr/build/solr-core/test/J0/./solrtest-SoftAutoCommitTest-1360792238687/index/
[junit4:junit4]   2> 2857 T67 oasc.SolrCore.initWriters created xml: solr.XMLResponseWriter
[junit4:junit4]   2> 2860 T67 oasup.UpdateRequestProcessorChain.init inserting DistributedUpdateProcessorFactory into updateRequestProcessorChain "dedupe"
[junit4:junit4]   2> 2861 T67 oasup.UpdateRequestProcessorChain.init inserting DistributedUpdateProcessorFactory into updateRequestProcessorChain "dedupe-allfields"
[junit4:junit4]   2> 2861 T67 oasup.UpdateRequestProcessorChain.init inserting DistributedUpdateProcessorFactory into updateRequestProcessorChain "stored_sig"
[junit4:junit4]   2> 2862 T67 oasup.UpdateRequestProcessorChain.init inserting DistributedUpdateProcessorFactory into updateRequestProcessorChain "uniq-fields"
[junit4:junit4]   2> 2863 T67 oasup.UpdateRequestProcessorChain.init inserting DistributedUpdateProcessorFactory into updateRequestProcessorChain "distrib-dup-test-chain-implicit"
[junit4:junit4]   2> 2863 T67 oasc.RequestHandlers.initHandlersFromConfig adding lazy requestHandler: solr.ReplicationHandler
[junit4:junit4]   2> 2864 T67 oasc.RequestHandlers.initHandlersFromConfig created /replication: solr.ReplicationHandler
[junit4:junit4]   2> 2865 T67 oasc.RequestHandlers.initHandlersFromConfig created standard: solr.StandardRequestHandler
[junit4:junit4]   2> 2866 T67 oasc.RequestHandlers.initHandlersFromConfig created /get: solr.RealTimeGetHandler
[junit4:junit4]   2> 2867 T67 oasc.RequestHandlers.initHandlersFromConfig created dismax: solr.SearchHandler
[junit4:junit4]   2> 2868 T67 oasc.RequestHandlers.initHandlersFromConfig created mock: org.apache.solr.core.MockQuerySenderListenerReqHandler
[junit4:junit4]   2> 2870 T67 oasc.RequestHandlers.initHandlersFromConfig created /admin/: org.apache.solr.handler.admin.AdminHandlers
[junit4:junit4]   2> 2871 T67 oasc.RequestHandlers.initHandlersFromConfig created defaults: solr.StandardRequestHandler
[junit4:junit4]   2> 2871 T67 oasc.RequestHandlers.initHandlersFromConfig adding lazy requestHandler: solr.StandardRequestHandler
[junit4:junit4]   2> 2872 T67 oasc.RequestHandlers.initHandlersFromConfig created lazy: solr.StandardRequestHandler
[junit4:junit4]   2> 2873 T67 oasc.RequestHandlers.initHandlersFromConfig created /update: solr.UpdateRequestHandler
[junit4:junit4]   2> 2874 T67 oasc.RequestHandlers.initHandlersFromConfig created /terms: org.apache.solr.handler.component.SearchHandler
[junit4:junit4]   2> 2875 T67 oasc.RequestHandlers.initHandlersFromConfig created spellCheckCompRH: org.apache.solr.handler.component.SearchHandler
[junit4:junit4]   2> 2876 T67 oasc.RequestHandlers.initHandlersFromConfig created spellCheckCompRH_Direct: org.apache.solr.handler.component.SearchHandler
[junit4:junit4]   2> 2877 T67 oasc.RequestHandlers.initHandlersFromConfig created spellCheckWithWordbreak: org.apache.solr.handler.component.SearchHandler
[junit4:junit4]   2> 2878 T67 oasc.RequestHandlers.initHandlersFromConfig created spellCheckWithWordbreak_Direct: org.apache.solr.handler.component.SearchHandler
[junit4:junit4]   2> 2880 T67 oasc.RequestHandlers.initHandlersFromConfig created spellCheckCompRH1: org.apache.solr.handler.component.SearchHandler
[junit4:junit4]   2> 2881 T67 oasc.RequestHandlers.initHandlersFromConfig created mltrh: org.apache.solr.handler.component.SearchHandler
[junit4:junit4]   2> 2882 T67 oasc.RequestHandlers.initHandlersFromConfig created tvrh: org.apache.solr.handler.component.SearchHandler
[junit4:junit4]   2> 2883 T67 oasc.RequestHandlers.initHandlersFromConfig created /mlt: solr.MoreLikeThisHandler
[junit4:junit4]   2> 2884 T67 oasc.RequestHandlers.initHandlersFromConfig created /debug/dump: solr.DumpRequestHandler
[junit4:junit4]   2> 2886 T67 oashl.XMLLoader.init xsltCacheLifetimeSeconds=60
[junit4:junit4]   2> 2888 T67 oasc.SolrCore.initDeprecatedSupport WARNING solrconfig.xml uses deprecated <admin/gettableFiles>, Please update your config to use the ShowFileRequestHandler.
[junit4:junit4]   2> 2890 T67 oasc.SolrCore.initDeprecatedSupport WARNING adding ShowFileRequestHandler with hidden files: [THROW.ERROR.ON.ADD.UPDATEPROCESSOR.JS, SOLRCONFIG-HIGHLIGHT.XML, SCHEMA-REQUIRED-FIELDS.XML, TRIVIAL.UPDATEPROCESSOR1.JS, BAD-SCHEMA-DUP-DYNAMICFIELD.XML, SCHEMA-MINIMAL.XML, SCHEMA-REPLICATION2.XML, SOLRCONFIG-CACHING.XML, SCHEMA-POSTINGSHIGHLIGHT.XML, SOLRCONFIG-REPEATER.XML, REGEX-BOOST-PROCESSOR-TEST.TXT, SOLRCONFIG-MERGEPOLICY.XML, CURRENCY.XML, BAD-SCHEMA-NONTEXT-ANALYZER.XML, SOLRCONFIG-TLOG.XML, SOLRCONFIG-MASTER.XML, SOLRCONFIG-COMPONENTS-NAME.XML, BAD-SCHEMA-UNIQUEKEY-MULTIVALUED.XML, SCHEMA11.XML, SOLRCONFIG-BASIC.XML, DA_COMPOUNDDICTIONARY.TXT, MISSLEADING.EXTENSION.UPDATEPROCESSOR.JS.TXT, SCHEMA-COPYFIELD-TEST.XML, SOLRCONFIG-SLAVE.XML, SOLRCONFIG-PROPINJECT-INDEXDEFAULT.XML, ELEVATE.XML, TRIVIAL.UPDATEPROCESSOR0.JS, BAD-SOLRCONFIG-BOGUS-SCRIPTENGINE-NAME.XML, SCHEMA-CHARFILTERS.XML, SCHEMA-IB.XML, SOLRCONFIG-QUERYSENDER.XML, SOLRCONFIG-SNIPPET-PROCESSOR.XML, DA_UTF8.XML, SCHEMA-REPLICATION1.XML, CONDITIONAL.UPDATEPROCESSOR.JS, MISSING.FUNCTIONS.UPDATEPROCESSOR.JS, HYPHENATION.DTD, SOLRCONFIG-ENABLEPLUGIN.XML, STEMDICT.TXT, SCHEMA-PHRASESUGGEST.XML, HUNSPELL-TEST.AFF, SCHEMA-SNIPPET-TYPE.XML, STOPTYPES-1.TXT, STOPWORDSWRONGENCODING.TXT, SCHEMA-NUMERIC.XML, SOLRCONFIG-TRANSFORMERS.XML, SOLRCONFIG-PROPINJECT.XML, BAD-SCHEMA-NOT-INDEXED-BUT-TF.XML, SOLRCONFIG-SIMPLELOCK.XML, WDFTYPES.TXT, STOPTYPES-2.TXT, SCHEMA-REVERSED.XML, BAD-SCHEMA-CURRENCY-FT-MULTIVALUED.XML, SOLRCONFIG-SPELLCHECKCOMPONENT.XML, SOLRCONFIG-PHRASESUGGEST.XML, BAD-SCHEMA-CURRENCY-MULTIVALUED.XML, SCHEMA-DFR.XML, BAD-SCHEMA-NOT-INDEXED-BUT-POS.XML, KEEP-1.TXT, OPEN-EXCHANGE-RATES.JSON, SCHEMA-SPATIAL.XML, STOPWITHBOM.TXT, SOLRCONFIG-SPELLCHECKER.XML, SOLRCONFIG-POSTINGSHIGHLIGHT.XML, SCHEMA-BINARYFIELD.XML, SOLRCONFIG-UPDATE-PROCESSOR-CHAINS.XML, BAD-SCHEMA-OMIT-TF-BUT-NOT-POS.XML, BAD-SCHEMA-DUP-FIELDTYPE.XML, SCHEMA-XINCLUDE.XML, SOLRCONFIG-MASTER1.XML, SCHEMA-BEHAVIOR.XML, SYNONYMS.TXT, BAD-SCHEMA-CURRENCY-DYNAMIC-MULTIVALUED.XML, SCHEMA.XML, SCHEMA_CODEC.XML, SOLRCONFIG-SOLR-749.XML, SOLRCONFIG-MASTER1-KEEPONEBACKUP.XML, SCHEMA-EFF.XML, STOP-2.TXT, SOLRCONFIG-FUNCTIONQUERY.XML, SOLRCONFIG-TERMINDEX.XML, SCHEMA-LMDIRICHLET.XML, SOLRCONFIG-ELEVATE.XML, STOPWORDS.TXT, SCHEMA-FOLDING.XML, SCHEMA-STOP-KEEP.XML, FUZZYSUGGEST.TXT, BAD-SCHEMA-NOT-INDEXED-BUT-NORMS.XML, SOLRCONFIG-SOLCOREPROPERTIES.XML, STOP-1.TXT, SOLRCONFIG-MASTER2.XML, SCHEMA-SPELLCHECKER.XML, SOLRCONFIG-RESPONSE-LOG-COMPONENT.XML, SOLRCONFIG-LAZYWRITER.XML, SCHEMA-LUCENEMATCHVERSION.XML, FRENCHARTICLES.TXT, BAD-MP-SOLRCONFIG.XML, SCHEMA15.XML, SOLRCONFIG-REQHANDLER.INCL, SCHEMASURROUND.XML, SCHEMA-COLLATEFILTER.XML, SOLRCONFIG-MASTER3.XML, HUNSPELL-TEST.DIC, SOLRCONFIG-XINCLUDE.XML, BAD-SCHEMA-CODEC-GLOBAL-VS-FT-MISMATCH.XML, SOLRCONFIG-SLAVE1.XML, SOLRCONFIG-DELPOLICY1.XML, SCHEMA-SIM.XML, SCHEMA-SNIPPET-FIELD.XML, SCHEMA-COLLATE.XML, STOP-SNOWBALL.TXT, BAD-SCHEMA-SIM-GLOBAL-VS-FT-MISMATCH.XML, PROTWORDS.TXT, SCHEMA-TRIE.XML, SOLRCONFIG_CODEC.XML, SCHEMA-SYNONYM-TOKENIZER.XML, BAD-SOLRCONFIG-INVALID-SCRIPTFILE.XML, JASUGGEST.TXT, SCHEMA-TFIDF.XML, SOLRCONFIG-SCRIPT-UPDATEPROCESSOR.XML, SCHEMA-LMJELINEKMERCER.XML, PHRASESUGGEST.TXT, BAD-SOLRCONFIG-MISSING-SCRIPTFILE.XML, SOLRCONFIG-BASIC-LUCENEVERSION31.XML, BAD-SCHEMA-UNIQUEKEY-USES-DEFAULT.XML, OLD_SYNONYMS.TXT, SOLRCONFIG-DELPOLICY2.XML, XSLT, SOLRCONFIG-NATIVELOCK.XML, BAD-SCHEMA-DUP-FIELD.XML, SOLRCONFIG-NOCACHE.XML, SCHEMA-BM25.XML, ADDFIELDS.UPDATEPROCESSOR.JS, SOLRCONFIG-QUERYSENDER-NOQUERY.XML, SOLRCONFIG-ALTDIRECTORY.XML, COMPOUNDDICTIONARY.TXT, SOLRCONFIG_PERF.XML, SOLRCONFIG-INDEXCONFIG.XML, BAD-SCHEMA-ANALYZER-CLASS-AND-NESTED.XML, SCHEMA-NOT-REQUIRED-UNIQUE-KEY.XML, KEEP-2.TXT, BAD-SCHEMA-UNIQUEKEY-IS-COPYFIELD-DEST.XML, SCHEMA12.XML, MAPPING-ISOLATIN1ACCENT.TXT, BAD_SOLRCONFIG.XML, BAD-SCHEMA-EXTERNAL-FILEFIELD.XML]
[junit4:junit4]   2> 2893 T67 oasc.CachingDirectoryFactory.close Releasing directory:/Users/jenkins/jenkins-slave/workspace/Lucene-Solr-4.x-MacOSX/solr/build/solr-core/test/J0/./solrtest-SoftAutoCommitTest-1360792238687
[junit4:junit4]   2> 2894 T67 oass.SolrIndexSearcher.<init> Opening Searcher@8a353ed main
[junit4:junit4]   2> 2895 T67 oasu.CommitTracker.<init> Hard AutoCommit: disabled
[junit4:junit4]   2> 2896 T67 oasu.CommitTracker.<init> Soft AutoCommit: disabled
[junit4:junit4]   2> 2897 T67 oashc.SpellCheckComponent.inform Initializing spell checkers
[junit4:junit4]   2> 2899 T67 oass.DirectSolrSpellChecker.init init: {name=direct,classname=DirectSolrSpellChecker,field=lowerfilt,minQueryLength=3}
[junit4:junit4]   2> 2933 T69 oasc.SolrCore.registerSearcher [collection1] Registered new searcher Searcher@8a353ed main{StandardDirectoryReader(segments_1:1)}
[junit4:junit4]   2> 2940 T67 oasc.CoreContainer.registerCore replacing core: collection1
[junit4:junit4]   2> 2941 T67 oasc.SolrCore.close [collection1]  CLOSING SolrCore org.apache.solr.core.SolrCore@6fe84244
[junit4:junit4]   2> 2965 T67 oasu.DirectUpdateHandler2.close closing DirectUpdateHandler2{commits=0,autocommits=0,soft autocommits=0,optimizes=0,rollbacks=0,expungeDeletes=0,docsPending=0,adds=0,deletesById=0,deletesByQuery=0,errors=0,cumulative_adds=0,cumulative_deletesById=0,cumulative_deletesByQuery=0,cumulative_errors=0}
[junit4:junit4]   2> 2966 T67 oasc.SolrCore.closeSearcher [collection1] Closing main searcher on request.
[junit4:junit4]   2> 2966 T67 oasc.CachingDirectoryFactory.close Releasing directory:/Users/jenkins/jenkins-slave/workspace/Lucene-Solr-4.x-MacOSX/solr/build/solr-core/test/J0/./solrtest-SoftAutoCommitTest-1360792238687/index
[junit4:junit4]   2> ASYNC  NEW_CORE C3 name=collection1 org.apache.solr.core.SolrCore@4019eb89
[junit4:junit4]   2> 2975 T67 C3 oasc.CachingDirectoryFactory.close Releasing directory:/Users/jenkins/jenkins-slave/workspace/Lucene-Solr-4.x-MacOSX/solr/build/solr-core/test/J0/./solrtest-SoftAutoCommitTest-1360792238687
[junit4:junit4]   2> 2977 T67 C3 oasc.SolrDeletionPolicy.onInit SolrDeletionPolicy.onInit: commits:num=1
[junit4:junit4]   2> 		commit{dir=RateLimitedDirectoryWrapper(MockDirWrapper(org.apache.lucene.store.RAMDirectory@4bfa79c8 lockFactory=org.apache.lucene.store.NativeFSLockFactory@1d926e41)),segFN=segments_1,generation=1,filenames=[segments_1]
[junit4:junit4]   2> 2978 T67 C3 oasc.SolrDeletionPolicy.updateCommits newest commit = 1[segments_1]
[junit4:junit4]   2> 2983 T67 C3 UPDATE [collection1] webapp=null path=null params={} {add=[529]} 0 8
[junit4:junit4]   2> 3488 T71 oasu.DirectUpdateHandler2.commit start commit{,optimize=false,openSearcher=true,waitSearcher=true,expungeDeletes=false,softCommit=true}
[junit4:junit4]   2> 3490 T71 oasc.CachingDirectoryFactory.close Releasing directory:/Users/jenkins/jenkins-slave/workspace/Lucene-Solr-4.x-MacOSX/solr/build/solr-core/test/J0/./solrtest-SoftAutoCommitTest-1360792238687
[junit4:junit4]   2> 3530 T71 oass.SolrIndexSearcher.<init> Opening Searcher@38c9aa93 main
[junit4:junit4]   2> 3534 T71 oasu.DirectUpdateHandler2.commit end_commit_flush
[junit4:junit4]   2> 3549 T69 oasc.SolrCore.registerSearcher [collection1] Registered new searcher Searcher@38c9aa93 main{StandardDirectoryReader(segments_1:3:nrt _0(4.2):C1)}
[junit4:junit4]   2> 3550 T69 oasc.CachingDirectoryFactory.close Releasing directory:/Users/jenkins/jenkins-slave/workspace/Lucene-Solr-4.x-MacOSX/solr/build/solr-core/test/J0/./solrtest-SoftAutoCommitTest-1360792238687/index
[junit4:junit4]   2> 3562 T67 C3 UPDATE [collection1] webapp=null path=null params={} {add=[530]} 0 4
[junit4:junit4]   2> 4063 T71 oasu.DirectUpdateHandler2.commit start commit{,optimize=false,openSearcher=true,waitSearcher=true,expungeDeletes=false,softCommit=true}
[junit4:junit4]   2> 4064 T71 oasc.CachingDirectoryFactory.close Releasing directory:/Users/jenkins/jenkins-slave/workspace/Lucene-Solr-4.x-MacOSX/solr/build/solr-core/test/J0/./solrtest-SoftAutoCommitTest-1360792238687
[junit4:junit4]   2> 4073 T71 oass.SolrIndexSearcher.<init> Opening Searcher@531bedec main
[junit4:junit4]   2> 4074 T71 oasu.DirectUpdateHandler2.commit end_commit_flush
[junit4:junit4]   2> 4077 T69 oasc.SolrCore.registerSearcher [collection1] Registered new searcher Searcher@531bedec main{StandardDirectoryReader(segments_1:5:nrt _0(4.2):C1 _1(4.2):C1)}
[junit4:junit4]   2> 4078 T69 oasc.CachingDirectoryFactory.close Releasing directory:/Users/jenkins/jenkins-slave/workspace/Lucene-Solr-4.x-MacOSX/solr/build/solr-core/test/J0/./solrtest-SoftAutoCommitTest-1360792238687/index
[junit4:junit4]   2> 4184 T70 oasu.DirectUpdateHandler2.commit start commit{,optimize=false,openSearcher=true,waitSearcher=true,expungeDeletes=false,softCommit=false}
[junit4:junit4]   2> 4186 T70 oasc.SolrDeletionPolicy.onCommit SolrDeletionPolicy.onCommit: commits:num=2
[junit4:junit4]   2> 		commit{dir=RateLimitedDirectoryWrapper(MockDirWrapper(org.apache.lucene.store.RAMDirectory@4bfa79c8 lockFactory=org.apache.lucene.store.NativeFSLockFactory@1d926e41)),segFN=segments_1,generation=1,filenames=[segments_1]
[junit4:junit4]   2> 		commit{dir=RateLimitedDirectoryWrapper(MockDirWrapper(org.apache.lucene.store.RAMDirectory@4bfa79c8 lockFactory=org.apache.lucene.store.NativeFSLockFactory@1d926e41)),segFN=segments_2,generation=2,filenames=[_0_Asserting_0.tim, _1_MockVariableIntBlock_0.skp, _1_Lucene41_0.doc, _0_Asserting_0.tip, _0_Lucene41_0.pos, _0_MockVariableIntBlock_0.doc, _1_Asserting_0.doc, _1_MockVariableIntBlock_0.pyl, _0_MockVariableIntBlock_0.skp, _1.fnm, _1_Asserting_0.tim, _0_MockVariableIntBlock_0.pyl, _1_Memory_0.ram, _0_MockVariableIntBlock_0.tib, _1_Asserting_0.tip, _1_MockVariableIntBlock_0.doc, _0.nvd, _0_MockVariableIntBlock_0.pos, _0.si, _0_Lucene41_0.tim, _0_Asserting_0.doc, _0_Lucene41_0.tip, _0_MockVariableIntBlock_0.tii, _1_Asserting_0.pos, _1.nvm, _0.fnm, _1_MockVariableIntBlock_0.tii, _0_Memory_0.ram, _1_Lucene41_0.tim, _1_MockVariableIntBlock_0.pos, _1.nvd, _1_Lucene41_0.tip, _0.nvm, _1_MockVariableIntBlock_0.tib, _1_Lucene41_0.pos, _1_MockVariableIntBlock_0.frq, _1.fdx, _1.fdt, _0_Lucene41_0.doc, _1.si, _0_MockVariableIntBlock_0.frq, segments_2, _0.fdx, _0_Asserting_0.pos, _0.fdt]
[junit4:junit4]   2> 4186 T70 oasc.SolrDeletionPolicy.updateCommits newest commit = 2[_0_Asserting_0.tim, _1_MockVariableIntBlock_0.skp, _1_Lucene41_0.doc, _0_Asserting_0.tip, _0_Lucene41_0.pos, _0_MockVariableIntBlock_0.doc, _1_Asserting_0.doc, _1_MockVariableIntBlock_0.pyl, _0_MockVariableIntBlock_0.skp, _1.fnm, _1_Asserting_0.tim, _0_MockVariableIntBlock_0.pyl, _1_Memory_0.ram, _0_MockVariableIntBlock_0.tib, _1_Asserting_0.tip, _1_MockVariableIntBlock_0.doc, _0.nvd, _0_MockVariableIntBlock_0.pos, _0.si, _0_Lucene41_0.tim, _0_Asserting_0.doc, _0_Lucene41_0.tip, _0_MockVariableIntBlock_0.tii, _1_Asserting_0.pos, _1.nvm, _0.fnm, _1_MockVariableIntBlock_0.tii, _0_Memory_0.ram, _1_Lucene41_0.tim, _1_MockVariableIntBlock_0.pos, _1.nvd, _1_Lucene41_0.tip, _0.nvm, _1_MockVariableIntBlock_0.tib, _1_Lucene41_0.pos, _1_MockVariableIntBlock_0.frq, _1.fdx, _1.fdt, _0_Lucene41_0.doc, _1.si, _0_MockVariableIntBlock_0.frq, segments_2, _0.fdx, _0_Asserting_0.pos, _0.fdt]
[junit4:junit4]   2> 4187 T70 oasc.CachingDirectoryFactory.close Releasing directory:/Users/jenkins/jenkins-slave/workspace/Lucene-Solr-4.x-MacOSX/solr/build/solr-core/test/J0/./solrtest-SoftAutoCommitTest-1360792238687
[junit4:junit4]   2> 4187 T70 oass.SolrIndexSearcher.<init> Opening Searcher@38764254 main
[junit4:junit4]   2> 4188 T70 oasu.DirectUpdateHandler2.commit end_commit_flush
[junit4:junit4]   2> 4190 T69 oasc.SolrCore.registerSearcher [collection1] Registered new searcher Searcher@38764254 main{StandardDirectoryReader(segments_1:5:nrt _0(4.2):C1 _1(4.2):C1)}
[junit4:junit4]   2> 4191 T69 oasc.CachingDirectoryFactory.close Releasing directory:/Users/jenkins/jenkins-slave/workspace/Lucene-Solr-4.x-MacOSX/solr/build/solr-core/test/J0/./solrtest-SoftAutoCommitTest-1360792238687/index
[junit4:junit4]   2> 7401 T67 oas.SolrTestCaseJ4.tearDown ###Ending testSoftAndHardCommitMaxTimeMixedAdds
[junit4:junit4]   2> 7408 T67 oas.SolrTestCaseJ4.setUp ###Starting testSoftAndHardCommitMaxTimeRapidAdds
[junit4:junit4]   2> 7408 T67 oasc.CoreContainer.reload Reloading SolrCore 'collection1' using instanceDir: /Users/jenkins/jenkins-slave/workspace/Lucene-Solr-4.x-MacOSX/solr/build/solr-core/test-files/solr/collection1
[junit4:junit4]   2> 7409 T67 oasc.SolrResourceLoader.<init> new SolrResourceLoader for directory: '/Users/jenkins/jenkins-slave/workspace/Lucene-Solr-4.x-MacOSX/solr/build/solr-core/test-files/solr/collection1/'
[junit4:junit4]   2> 7409 T67 oasc.SolrResourceLoader.replaceClassLoader Adding 'file:/Users/jenkins/jenkins-slave/workspace/Lucene-Solr-4.x-MacOSX/solr/build/solr-core/test-files/solr/collection1/lib/classes/' to classloader
[junit4:junit4]   2> 7410 T67 oasc.SolrResourceLoader.replaceClassLoader Adding 'file:/Users/jenkins/jenkins-slave/workspace/Lucene-Solr-4.x-MacOSX/solr/build/solr-core/test-files/solr/collection1/lib/README' to classloader
[junit4:junit4]   2> 7463 T67 oasc.SolrConfig.<init> Using Lucene MatchVersion: LUCENE_42
[junit4:junit4]   2> 7533 T67 oasc.SolrConfig.<init> Loaded SolrConfig: solrconfig.xml
[junit4:junit4]   2> 7534 T67 oass.IndexSchema.readSchema Reading Solr Schema
[junit4:junit4]   2> 7544 T67 oass.IndexSchema.readSchema Schema name=test
[junit4:junit4]   2> 8199 T67 oass.OpenExchangeRatesOrgProvider.init Initialized with rates=open-exchange-rates.json, refreshInterval=1440.
[junit4:junit4]   2> 8213 T67 oass.IndexSchema.readSchema default search field in schema is text
[junit4:junit4]   2> 8219 T67 oass.IndexSchema.readSchema unique key field: id
[junit4:junit4]   2> 8238 T67 oass.FileExchangeRateProvider.reload Reloading exchange rates from file currency.xml
[junit4:junit4]   2> 8244 T67 oass.FileExchangeRateProvider.reload Reloading exchange rates from file currency.xml
[junit4:junit4]   2> 8249 T67 oass.OpenExchangeRatesOrgProvider.reload Reloading exchange rates from open-exchange-rates.json
[junit4:junit4]   2> 8283 T67 oass.OpenExchangeRatesOrgProvider.reload Reloading exchange rates from open-exchange-rates.json
[junit4:junit4]   2> 8285 T67 oasc.SolrCore.<init> [collection1] Opening new SolrCore at /Users/jenkins/jenkins-slave/workspace/Lucene-Solr-4.x-MacOSX/solr/build/solr-core/test-files/solr/collection1/, dataDir=/Users/jenkins/jenkins-slave/workspace/Lucene-Solr-4.x-MacOSX/solr/build/solr-core/test/J0/./solrtest-SoftAutoCommitTest-1360792238687/
[junit4:junit4]   2> 8286 T67 oasc.JmxMonitoredMap.<init> JMX monitoring is enabled. Adding Solr mbeans to JMX Server: com.sun.jmx.mbeanserver.JmxMBeanServer@7ae0c7c3
[junit4:junit4]   2> 8290 T67 oasc.CachingDirectoryFactory.close Releasing directory:/Users/jenkins/jenkins-slave/workspace/Lucene-Solr-4.x-MacOSX/solr/build/solr-core/test/J0/./solrtest-SoftAutoCommitTest-1360792238687
[junit4:junit4]   2> 8290 T67 oasc.SolrCore.getNewIndexDir New index directory detected: old=null new=/Users/jenkins/jenkins-slave/workspace/Lucene-Solr-4.x-MacOSX/solr/build/solr-core/test/J0/./solrtest-SoftAutoCommitTest-1360792238687/index/
[junit4:junit4]   2> 8291 T67 oasc.SolrCore.initWriters created xml: solr.XMLResponseWriter
[junit4:junit4]   2> 8295 T67 oasup.UpdateRequestProcessorChain.init inserting DistributedUpdateProcessorFactory into updateRequestProcessorChain "dedupe"
[junit4:junit4]   2> 8296 T67 oasup.UpdateRequestProcessorChain.init inserting DistributedUpdateProcessorFactory into updateRequestProcessorChain "dedupe-allfields"
[junit4:junit4]   2> 8296 T67 oasup.UpdateRequestProcessorChain.init inserting DistributedUpdateProcessorFactory into updateRequestProcessorChain "stored_sig"
[junit4:junit4]   2> 8297 T67 oasup.UpdateRequestProcessorChain.init inserting DistributedUpdateProcessorFactory into updateRequestProcessorChain "uniq-fields"
[junit4:junit4]   2> 8298 T67 oasup.UpdateRequestProcessorChain.init inserting DistributedUpdateProcessorFactory into updateRequestProcessorChain "distrib-dup-test-chain-implicit"
[junit4:junit4]   2> 8298 T67 oasc.RequestHandlers.initHandlersFromConfig adding lazy requestHandler: solr.ReplicationHandler
[junit4:junit4]   2> 8299 T67 oasc.RequestHandlers.initHandlersFromConfig created /replication: solr.ReplicationHandler
[junit4:junit4]   2> 8305 T67 oasc.RequestHandlers.initHandlersFromConfig created standard: solr.StandardRequestHandler
[junit4:junit4]   2> 8307 T67 oasc.RequestHandlers.initHandlersFromConfig created /get: solr.RealTimeGetHandler
[junit4:junit4]   2> 8309 T67 oasc.RequestHandlers.initHandlersFromConfig created dismax: solr.SearchHandler
[junit4:junit4]   2> 8313 T67 oasc.RequestHandlers.initHandlersFromConfig created mock: org.apache.solr.core.MockQuerySenderListenerReqHandler
[junit4:junit4]   2> 8314 T67 oasc.RequestHandlers.initHandlersFromConfig created /admin/: org.apache.solr.handler.admin.AdminHandlers
[junit4:junit4]   2> 8319 T67 oasc.RequestHandlers.initHandlersFromConfig created defaults: solr.StandardRequestHandler
[junit4:junit4]   2> 8319 T67 oasc.RequestHandlers.initHandlersFromConfig adding lazy requestHandler: solr.StandardRequestHandler
[junit4:junit4]   2> 8320 T67 oasc.RequestHandlers.initHandlersFromConfig created lazy: solr.StandardRequestHandler
[junit4:junit4]   2> 8321 T67 oasc.RequestHandlers.initHandlersFromConfig created /update: solr.UpdateRequestHandler
[junit4:junit4]   2> 8322 T67 oasc.RequestHandlers.initHandlersFromConfig created /terms: org.apache.solr.handler.component.SearchHandler
[junit4:junit4]   2> 8323 T67 oasc.RequestHandlers.initHandlersFromConfig created spellCheckCompRH: org.apache.solr.handler.component.SearchHandler
[junit4:junit4]   2> 8324 T67 oasc.RequestHandlers.initHandlersFromConfig created spellCheckCompRH_Direct: org.apache.solr.handler.component.SearchHandler
[junit4:junit4]   2> 8325 T67 oasc.RequestHandlers.initHandlersFromConfig created spellCheckWithWordbreak: org.apache.solr.handler.component.SearchHandler
[junit4:junit4]   2> 8326 T67 oasc.RequestHandlers.initHandlersFromConfig created spellCheckWithWordbreak_Direct: org.apache.solr.handler.component.SearchHandler
[junit4:junit4]   2> 8327 T67 oasc.RequestHandlers.initHandlersFromConfig created spellCheckCompRH1: org.apache.solr.handler.component.SearchHandler
[junit4:junit4]   2> 8328 T67 oasc.RequestHandlers.initHandlersFromConfig created mltrh: org.apache.solr.handler.component.SearchHandler
[junit4:junit4]   2> 8329 T67 oasc.RequestHandlers.initHandlersFromConfig created tvrh: org.apache.solr.handler.component.SearchHandler
[junit4:junit4]   2> 8330 T67 oasc.RequestHandlers.initHandlersFromConfig created /mlt: solr.MoreLikeThisHandler
[junit4:junit4]   2> 8331 T67 oasc.RequestHandlers.initHandlersFromConfig created /debug/dump: solr.DumpRequestHandler
[junit4:junit4]   2> 8348 T67 oashl.XMLLoader.init xsltCacheLifetimeSeconds=60
[junit4:junit4]   2> 8350 T67 oasc.SolrCore.initDeprecatedSupport WARNING solrconfig.xml uses deprecated <admin/gettableFiles>, Please update your config to use the ShowFileRequestHandler.
[junit4:junit4]   2> 8352 T67 oasc.SolrCore.initDeprecatedSupport WARNING adding ShowFileRequestHandler with hidden files: [THROW.ERROR.ON.ADD.UPDATEPROCESSOR.JS, SOLRCONFIG-HIGHLIGHT.XML, SCHEMA-REQUIRED-FIELDS.XML, TRIVIAL.UPDATEPROCESSOR1.JS, BAD-SCHEMA-DUP-DYNAMICFIELD.XML, SCHEMA-MINIMAL.XML, SCHEMA-REPLICATION2.XML, SOLRCONFIG-CACHING.XML, SCHEMA-POSTINGSHIGHLIGHT.XML, SOLRCONFIG-REPEATER.XML, REGEX-BOOST-PROCESSOR-TEST.TXT, SOLRCONFIG-MERGEPOLICY.XML, CURRENCY.XML, BAD-SCHEMA-NONTEXT-ANALYZER.XML, SOLRCONFIG-TLOG.XML, SOLRCONFIG-MASTER.XML, SOLRCONFIG-COMPONENTS-NAME.XML, BAD-SCHEMA-UNIQUEKEY-MULTIVALUED.XML, SCHEMA11.XML, SOLRCONFIG-BASIC.XML, DA_COMPOUNDDICTIONARY.TXT, MISSLEADING.EXTENSION.UPDATEPROCESSOR.JS.TXT, SCHEMA-COPYFIELD-TEST.XML, SOLRCONFIG-SLAVE.XML, SOLRCONFIG-PROPINJECT-INDEXDEFAULT.XML, ELEVATE.XML, TRIVIAL.UPDATEPROCESSOR0.JS, BAD-SOLRCONFIG-BOGUS-SCRIPTENGINE-NAME.XML, SCHEMA-CHARFILTERS.XML, SCHEMA-IB.XML, SOLRCONFIG-QUERYSENDER.XML, SOLRCONFIG-SNIPPET-PROCESSOR.XML, DA_UTF8.XML, SCHEMA-REPLICATION1.XML, CONDITIONAL.UPDATEPROCESSOR.JS, MISSING.FUNCTIONS.UPDATEPROCESSOR.JS, HYPHENATION.DTD, SOLRCONFIG-ENABLEPLUGIN.XML, STEMDICT.TXT, SCHEMA-PHRASESUGGEST.XML, HUNSPELL-TEST.AFF, SCHEMA-SNIPPET-TYPE.XML, STOPTYPES-1.TXT, STOPWORDSWRONGENCODING.TXT, SCHEMA-NUMERIC.XML, SOLRCONFIG-TRANSFORMERS.XML, SOLRCONFIG-PROPINJECT.XML, BAD-SCHEMA-NOT-INDEXED-BUT-TF.XML, SOLRCONFIG-SIMPLELOCK.XML, WDFTYPES.TXT, STOPTYPES-2.TXT, SCHEMA-REVERSED.XML, BAD-SCHEMA-CURRENCY-FT-MULTIVALUED.XML, SOLRCONFIG-SPELLCHECKCOMPONENT.XML, SOLRCONFIG-PHRASESUGGEST.XML, BAD-SCHEMA-CURRENCY-MULTIVALUED.XML, SCHEMA-DFR.XML, BAD-SCHEMA-NOT-INDEXED-BUT-POS.XML, KEEP-1.TXT, OPEN-EXCHANGE-RATES.JSON, SCHEMA-SPATIAL.XML, STOPWITHBOM.TXT, SOLRCONFIG-SPELLCHECKER.XML, SOLRCONFIG-POSTINGSHIGHLIGHT.XML, SCHEMA-BINARYFIELD.XML, SOLRCONFIG-UPDATE-PROCESSOR-CHAINS.XML, BAD-SCHEMA-OMIT-TF-BUT-NOT-POS.XML, BAD-SCHEMA-DUP-FIELDTYPE.XML, SCHEMA-XINCLUDE.XML, SOLRCONFIG-MASTER1.XML, SCHEMA-BEHAVIOR.XML, SYNONYMS.TXT, BAD-SCHEMA-CURRENCY-DYNAMIC-MULTIVALUED.XML, SCHEMA.XML, SCHEMA_CODEC.XML, SOLRCONFIG-SOLR-749.XML, SOLRCONFIG-MASTER1-KEEPONEBACKUP.XML, SCHEMA-EFF.XML, STOP-2.TXT, SOLRCONFIG-FUNCTIONQUERY.XML, SOLRCONFIG-TERMINDEX.XML, SCHEMA-LMDIRICHLET.XML, SOLRCONFIG-ELEVATE.XML, STOPWORDS.TXT, SCHEMA-FOLDING.XML, SCHEMA-STOP-KEEP.XML, FUZZYSUGGEST.TXT, BAD-SCHEMA-NOT-INDEXED-BUT-NORMS.XML, SOLRCONFIG-SOLCOREPROPERTIES.XML, STOP-1.TXT, SOLRCONFIG-MASTER2.XML, SCHEMA-SPELLCHECKER.XML, SOLRCONFIG-RESPONSE-LOG-COMPONENT.XML, SOLRCONFIG-LAZYWRITER.XML, SCHEMA-LUCENEMATCHVERSION.XML, FRENCHARTICLES.TXT, BAD-MP-SOLRCONFIG.XML, SCHEMA15.XML, SOLRCONFIG-REQHANDLER.INCL, SCHEMASURROUND.XML, SCHEMA-COLLATEFILTER.XML, SOLRCONFIG-MASTER3.XML, HUNSPELL-TEST.DIC, SOLRCONFIG-XINCLUDE.XML, BAD-SCHEMA-CODEC-GLOBAL-VS-FT-MISMATCH.XML, SOLRCONFIG-SLAVE1.XML, SOLRCONFIG-DELPOLICY1.XML, SCHEMA-SIM.XML, SCHEMA-SNIPPET-FIELD.XML, SCHEMA-COLLATE.XML, STOP-SNOWBALL.TXT, BAD-SCHEMA-SIM-GLOBAL-VS-FT-MISMATCH.XML, PROTWORDS.TXT, SCHEMA-TRIE.XML, SOLRCONFIG_CODEC.XML, SCHEMA-SYNONYM-TOKENIZER.XML, BAD-SOLRCONFIG-INVALID-SCRIPTFILE.XML, JASUGGEST.TXT, SCHEMA-TFIDF.XML, SOLRCONFIG-SCRIPT-UPDATEPROCESSOR.XML, SCHEMA-LMJELINEKMERCER.XML, PHRASESUGGEST.TXT, BAD-SOLRCONFIG-MISSING-SCRIPTFILE.XML, SOLRCONFIG-BASIC-LUCENEVERSION31.XML, BAD-SCHEMA-UNIQUEKEY-USES-DEFAULT.XML, OLD_SYNONYMS.TXT, SOLRCONFIG-DELPOLICY2.XML, XSLT, SOLRCONFIG-NATIVELOCK.XML, BAD-SCHEMA-DUP-FIELD.XML, SOLRCONFIG-NOCACHE.XML, SCHEMA-BM25.XML, ADDFIELDS.UPDATEPROCESSOR.JS, SOLRCONFIG-QUERYSENDER-NOQUERY.XML, SOLRCONFIG-ALTDIRECTORY.XML, COMPOUNDDICTIONARY.TXT, SOLRCONFIG_PERF.XML, SOLRCONFIG-INDEXCONFIG.XML, BAD-SCHEMA-ANALYZER-CLASS-AND-NESTED.XML, SCHEMA-NOT-REQUIRED-UNIQUE-KEY.XML, KEEP-2.TXT, BAD-SCHEMA-UNIQUEKEY-IS-COPYFIELD-DEST.XML, SCHEMA12.XML, MAPPING-ISOLATIN1ACCENT.TXT, BAD_SOLRCONFIG.XML, BAD-SCHEMA-EXTERNAL-FILEFIELD.XML]
[junit4:junit4]   2> 8365 T67 oasc.CachingDirectoryFactory.close Releasing directory:/Users/jenkins/jenkins-slave/workspace/Lucene-Solr-4.x-MacOSX/solr/build/solr-core/test/J0/./solrtest-SoftAutoCommitTest-1360792238687
[junit4:junit4]   2> 8366 T67 oass.SolrIndexSearcher.<init> Opening Searcher@15b1dd12 main
[junit4:junit4]   2> 8366 T67 oasu.CommitTracker.<init> Hard AutoCommit: disabled
[junit4:junit4]   2> 8367 T67 oasu.CommitTracker.<init> Soft AutoCommit: disabled
[junit4:junit4]   2> 8368 T67 oashc.SpellCheckComponent.inform Initializing spell checkers
[junit4:junit4]   2> 8370 T67 oass.DirectSolrSpellChecker.init init: {name=direct,classname=DirectSolrSpellChecker,field=lowerfilt,minQueryLength=3}
[junit4:junit4]   2> 8406 T67 oasc.CoreContainer.registerCore replacing core: collection1
[junit4:junit4]   2> 8406 T67 oasc.SolrCore.close [collection1]  CLOSING SolrCore org.apache.solr.core.SolrCore@4019eb89
[junit4:junit4]   2> 8446 T72 oasc.SolrCore.registerSearcher [collection1] Registered new searcher Searcher@15b1dd12 main{StandardDirectoryReader(segments_2:5:nrt _0(4.2):C1 _1(4.2):C1)}
[junit4:junit4]   2> 8457 T67 oasu.DirectUpdateHandler2.close closing DirectUpdateHandler2{commits=3,autocommit maxTime=1200ms,autocommits=1,soft autocommit maxTime=500ms,soft autocommits=2,optimizes=0,rollbacks=0,expungeDeletes=0,docsPending=0,adds=0,deletesById=0,deletesByQuery=0,errors=0,cumulative_adds=2,cumulative_deletesById=0,cumulative_deletesByQuery=0,cumulative_errors=0}
[junit4:junit4]   2> 8458 T67 oasc.SolrCore.closeSearcher [collection1] Closing main searcher on request.
[junit4:junit4]   2> 8459 T67 oasc.CachingDirectoryFactory.close Releasing directory:/Users/jenkins/jenkins-slave/workspace/Lucene-Solr-4.x-MacOSX/solr/build/solr-core/test/J0/./solrtest-SoftAutoCommitTest-1360792238687/index
[junit4:junit4]   2> ASYNC  NEW_CORE C4 name=collection1 org.apache.solr.core.SolrCore@192eb04e
[junit4:junit4]   2> 8469 T67 C4 UPDATE [collection1] webapp=null path=null params={} {add=[5000]} 0 3
[junit4:junit4]   2> 8532 T67 C4 UPDATE [collection1] webapp=null path=null params={} {add=[5001]} 0 48
[junit4:junit4]   2> 8558 T67 C4 UPDATE [collection1] webapp=null path=null params={} {add=[5002]} 0 1
[junit4:junit4]   2> 8576 T67 C4 UPDATE [collection1] webapp=null path=null params={} {add=[5003]} 0 1
[junit4:junit4]   2> 8588 T67 C4 UPDATE [collection1] webapp=null path=null params={} {add=[5004]} 0 3
[junit4:junit4]   2> 8591 T67 oas.SolrTestCaseJ4.tearDown ###Ending testSoftAndHardCommitMaxTimeRapidAdds
[junit4:junit4]   2> 8639 T67 oas.SolrTestCaseJ4.setUp ###Starting testSoftAndHardCommitMaxTimeDelete
[junit4:junit4]   2> 8640 T67 oasc.CoreContainer.reload Reloading SolrCore 'collection1' using instanceDir: /Users/jenkins/jenkins-slave/workspace/Lucene-Solr-4.x-MacOSX/solr/build/solr-core/test-files/solr/collection1
[junit4:junit4]   2> 8640 T67 oasc.SolrResourceLoader.<init> new SolrResourceLoader for directory: '/Users/jenkins/jenkins-slave/workspace/Lucene-Solr-4.x-MacOSX/solr/build/solr-core/test-files/solr/collection1/'
[junit4:junit4]   2> 8641 T67 oasc.SolrResourceLoader.replaceClassLoader Adding 'file:/Users/jenkins/jenkins-slave/workspace/Lucene-Solr-4.x-MacOSX/solr/build/solr-core/test-files/solr/collection1/lib/classes/' to classloader
[junit4:junit4]   2> 8642 T67 oasc.SolrResourceLoader.replaceClassLoader Adding 'file:/Users/jenkins/jenkins-slave/workspace/Lucene-Solr-4.x-MacOSX/solr/build/solr-core/test-files/solr/collection1/lib/README' to classloader
[junit4:junit4]   2> 8752 T67 oasc.SolrConfig.<init> Using Lucene MatchVersion: LUCENE_42
[junit4:junit4]   2> 8850 T67 oasc.SolrConfig.<init> Loaded SolrConfig: solrconfig.xml
[junit4:junit4]   2> 8850 T67 oass.IndexSchema.readSchema Reading Solr Schema
[junit4:junit4]   2> 8896 T67 oass.IndexSchema.readSchema Schema name=test
[junit4:junit4]   2> 8972 T74 oasu.DirectUpdateHandler2.commit start commit{,optimize=false,openSearcher=true,waitSearcher=true,expungeDeletes=false,softCommit=true}
[junit4:junit4]   2> 8973 T74 oasc.CachingDirectoryFactory.close Releasing directory:/Users/jenkins/jenkins-slave/workspace/Lucene-Solr-4.x-MacOSX/solr/build/solr-core/test/J0/./solrtest-SoftAutoCommitTest-1360792238687
[junit4:junit4]   2> 8988 T74 oass.SolrIndexSearcher.<init> Opening Searcher@618c5880 main
[junit4:junit4]   2> 8989 T74 oasu.DirectUpdateHandler2.commit end_commit_flush
[junit4:junit4]   2> 8992 T72 oasc.SolrCore.registerSearcher [collection1] Registered new searcher Searcher@618c5880 main{StandardDirectoryReader(segments_2:7:nrt _0(4.2):C1 _1(4.2):C1 _2(4.2):C5)}
[junit4:junit4]   2> 8992 T72 oasc.CachingDirectoryFactory.close Releasing directory:/Users/jenkins/jenkins-slave/workspace/Lucene-Solr-4.x-MacOSX/solr/build/solr-core/test/J0/./solrtest-SoftAutoCommitTest-1360792238687/index
[junit4:junit4]   2> 9535 T67 oass.OpenExchangeRatesOrgProvider.init Initialized with rates=open-exchange-rates.json, refreshInterval=1440.
[junit4:junit4]   2> 9548 T67 oass.IndexSchema.readSchema default search field in schema is text
[junit4:junit4]   2> 9553 T67 oass.IndexSchema.readSchema unique key field: id
[junit4:junit4]   2> 9573 T67 oass.FileExchangeRateProvider.reload Reloading exchange rates from file currency.xml
[junit4:junit4]   2> 9578 T67 oass.FileExchangeRateProvider.reload Reloading exchange rates from file currency.xml
[junit4:junit4]   2> 9584 T67 oass.OpenExchangeRatesOrgProvider.reload Reloading exchange rates from open-exchange-rates.json
[junit4:junit4]   2> 9586 T67 oass.OpenExchangeRatesOrgProvider.reload Reloading exchange rates from open-exchange-rates.json
[junit4:junit4]   2> 9587 T67 oasc.SolrCore.<init> [collection1] Opening new SolrCore at /Users/jenkins/jenkins-slave/workspace/Lucene-Solr-4.x-MacOSX/solr/build/solr-core/test-files/solr/collection1/, dataDir=/Users/jenkins/jenkins-slave/workspace/Lucene-Solr-4.x-MacOSX/solr/build/solr-core/test/J0/./solrtest-SoftAutoCommitTest-1360792238687/
[junit4:junit4]   2> 9588 T67 oasc.JmxMonitoredMap.<init> JMX monitoring is enabled. Adding Solr mbeans to JMX Server: com.sun.jmx.mbeanserver.JmxMBeanServer@7ae0c7c3
[junit4:junit4]   2> 9588 T67 oasc.CachingDirectoryFactory.close Releasing directory:/Users/jenkins/jenkins-slave/workspace/Lucene-Solr-4.x-MacOSX/solr/build/solr-core/test/J0/./solrtest-SoftAutoCommitTest-1360792238687
[junit4:junit4]   2> 9589 T67 oasc.SolrCore.getNewIndexDir New index directory detected: old=null new=/Users/jenkins/jenkins-slave/workspace/Lucene-Solr-4.x-MacOSX/solr/build/solr-core/test/J0/./solrtest-SoftAutoCommitTest-1360792238687/index/
[junit4:junit4]   2> 9589 T67 oasc.SolrCore.initWriters created xml: solr.XMLResponseWriter
[junit4:junit4]   2> 9592 T67 oasup.UpdateRequestProcessorChain.init inserting DistributedUpdateProcessorFactory into updateRequestProcessorChain "dedupe"
[junit4:junit4]   2> 9593 T67 oasup.UpdateRequestProcessorChain.init inserting DistributedUpdateProcessorFactory into updateRequestProcessorChain "dedupe-allfields"
[junit4:junit4]   2> 9594 T67 oasup.UpdateRequestProcessorChain.init inserting DistributedUpdateProcessorFactory into updateRequestProcessorChain "stored_sig"
[junit4:junit4]   2> 9594 T67 oasup.UpdateRequestProcessorChain.init inserting DistributedUpdateProcessorFactory into updateRequestProcessorChain "uniq-fields"
[junit4:junit4]   2> 9595 T67 oasup.UpdateRequestProcessorChain.init inserting DistributedUpdateProcessorFactory into updateRequestProcessorChain "distrib-dup-test-chain-implicit"
[junit4:junit4]   2> 9596 T67 oasc.RequestHandlers.initHandlersFromConfig adding lazy requestHandler: solr.ReplicationHandler
[junit4:junit4]   2> 9596 T67 oasc.RequestHandlers.initHandlersFromConfig created /replication: solr.ReplicationHandler
[junit4:junit4]   2> 9597 T67 oasc.RequestHandlers.initHandlersFromConfig created standard: solr.StandardRequestHandler
[junit4:junit4]   2> 9598 T67 oasc.RequestHandlers.initHandlersFromConfig created /get: solr.RealTimeGetHandler
[junit4:junit4]   2> 9599 T67 oasc.RequestHandlers.initHandlersFromConfig created dismax: solr.SearchHandler
[junit4:junit4]   2> 9600 T67 oasc.RequestHandlers.initHandlersFromConfig created mock: org.apache.solr.core.MockQuerySenderListenerReqHandler
[junit4:junit4]   2> 9601 T67 oasc.RequestHandlers.initHandlersFromConfig created /admin/: org.apache.solr.handler.admin.AdminHandlers
[junit4:junit4]   2> 9602 T67 oasc.RequestHandlers.initHandlersFromConfig created defaults: solr.StandardRequestHandler
[junit4:junit4]   2> 9602 T67 oasc.RequestHandlers.initHandlersFromConfig adding lazy requestHandler: solr.StandardRequestHandler
[junit4:junit4]   2> 9602 T67 oasc.RequestHandlers.initHandlersFromConfig created lazy: solr.StandardRequestHandler
[junit4:junit4]   2> 9603 T67 oasc.RequestHandlers.initHandlersFromConfig created /update: solr.UpdateRequestHandler
[junit4:junit4]   2> 9604 T67 oasc.RequestHandlers.initHandlersFromConfig created /terms: org.apache.solr.handler.component.SearchHandler
[junit4:junit4]   2> 9604 T67 oasc.RequestHandlers.initHandlersFromConfig created spellCheckCompRH: org.apache.solr.handler.component.SearchHandler
[junit4:junit4]   2> 9606 T67 oasc.RequestHandlers.initHandlersFromConfig created spellCheckCompRH_Direct: org.apache.solr.handler.component.SearchHandler
[junit4:junit4]   2> 9607 T67 oasc.RequestHandlers.initHandlersFromConfig created spellCheckWithWordbreak: org.apache.solr.handler.component.SearchHandler
[junit4:junit4]   2> 9608 T67 oasc.RequestHandlers.initHandlersFromConfig created spellCheckWithWordbreak_Direct: org.apache.solr.handler.component.SearchHandler
[junit4:junit4]   2> 9609 T67 oasc.RequestHandlers.initHandlersFromConfig created spellCheckCompRH1: org.apache.solr.handler.component.SearchHandler
[junit4:junit4]   2> 9609 T67 oasc.RequestHandlers.initHandlersFromConfig created mltrh: org.apache.solr.handler.component.SearchHandler
[junit4:junit4]   2> 9610 T67 oasc.RequestHandlers.initHandlersFromConfig created tvrh: org.apache.solr.handler.component.SearchHandler
[junit4:junit4]   2> 9611 T67 oasc.RequestHandlers.initHandlersFromConfig created /mlt: solr.MoreLikeThisHandler
[junit4:junit4]   2> 9612 T67 oasc.RequestHandlers.initHandlersFromConfig created /debug/dump: solr.DumpRequestHandler
[junit4:junit4]   2> 9614 T67 oashl.XMLLoader.init xsltCacheLifetimeSeconds=60
[junit4:junit4]   2> 9616 T67 oasc.SolrCore.initDeprecatedSupport WARNING solrconfig.xml uses deprecated <admin/gettableFiles>, Please update your config to use the ShowFileRequestHandler.
[junit4:junit4]   2> 9618 T67 oasc.SolrCore.initDeprecatedSupport WARNING adding ShowFileRequestHandler with hidden files: [THROW.ERROR.ON.ADD.UPDATEPROCESSOR.JS, SOLRCONFIG-HIGHLIGHT.XML, SCHEMA-REQUIRED-FIELDS.XML, TRIVIAL.UPDATEPROCESSOR1.JS, BAD-SCHEMA-DUP-DYNAMICFIELD.XML, SCHEMA-MINIMAL.XML, SCHEMA-REPLICATION2.XML, SOLRCONFIG-CACHING.XML, SCHEMA-POSTINGSHIGHLIGHT.XML, SOLRCONFIG-REPEATER.XML, REGEX-BOOST-PROCESSOR-TEST.TXT, SOLRCONFIG-MERGEPOLICY.XML, CURRENCY.XML, BAD-SCHEMA-NONTEXT-ANALYZER.XML, SOLRCONFIG-TLOG.XML, SOLRCONFIG-MASTER.XML, SOLRCONFIG-COMPONENTS-NAME.XML, BAD-SCHEMA-UNIQUEKEY-MULTIVALUED.XML, SCHEMA11.XML, SOLRCONFIG-BASIC.XML, DA_COMPOUNDDICTIONARY.TXT, MISSLEADING.EXTENSION.UPDATEPROCESSOR.JS.TXT, SCHEMA-COPYFIELD-TEST.XML, SOLRCONFIG-SLAVE.XML, SOLRCONFIG-PROPINJECT-INDEXDEFAULT.XML, ELEVATE.XML, TRIVIAL.UPDATEPROCESSOR0.JS, BAD-SOLRCONFIG-BOGUS-SCRIPTENGINE-NAME.XML, SCHEMA-CHARFILTERS.XML, SCHEMA-IB.XML, SOLRCONFIG-QUERYSENDER.XML, SOLRCONFIG-SNIPPET-PROCESSOR.XML, DA_UTF8.XML, SCHEMA-REPLICATION1.XML, CONDITIONAL.UPDATEPROCESSOR.JS, MISSING.FUNCTIONS.UPDATEPROCESSOR.JS, HYPHENATION.DTD, SOLRCONFIG-ENABLEPLUGIN.XML, STEMDICT.TXT, SCHEMA-PHRASESUGGEST.XML, HUNSPELL-TEST.AFF, SCHEMA-SNIPPET-TYPE.XML, STOPTYPES-1.TXT, STOPWORDSWRONGENCODING.TXT, SCHEMA-NUMERIC.XML, SOLRCONFIG-TRANSFORMERS.XML, SOLRCONFIG-PROPINJECT.XML, BAD-SCHEMA-NOT-INDEXED-BUT-TF.XML, SOLRCONFIG-SIMPLELOCK.XML, WDFTYPES.TXT, STOPTYPES-2.TXT, SCHEMA-REVERSED.XML, BAD-SCHEMA-CURRENCY-FT-MULTIVALUED.XML, SOLRCONFIG-SPELLCHECKCOMPONENT.XML, SOLRCONFIG-PHRASESUGGEST.XML, BAD-SCHEMA-CURRENCY-MULTIVALUED.XML, SCHEMA-DFR.XML, BAD-SCHEMA-NOT-INDEXED-BUT-POS.XML, KEEP-1.TXT, OPEN-EXCHANGE-RATES.JSON, SCHEMA-SPATIAL.XML, STOPWITHBOM.TXT, SOLRCONFIG-SPELLCHECKER.XML, SOLRCONFIG-POSTINGSHIGHLIGHT.XML, SCHEMA-BINARYFIELD.XML, SOLRCONFIG-UPDATE-PROCESSOR-CHAINS.XML, BAD-SCHEMA-OMIT-TF-BUT-NOT-POS.XML, BAD-SCHEMA-DUP-FIELDTYPE.XML, SCHEMA-XINCLUDE.XML, SOLRCONFIG-MASTER1.XML, SCHEMA-BEHAVIOR.XML, SYNONYMS.TXT, BAD-SCHEMA-CURRENCY-DYNAMIC-MULTIVALUED.XML, SCHEMA.XML, SCHEMA_CODEC.XML, SOLRCONFIG-SOLR-749.XML, SOLRCONFIG-MASTER1-KEEPONEBACKUP.XML, SCHEMA-EFF.XML, STOP-2.TXT, SOLRCONFIG-FUNCTIONQUERY.XML, SOLRCONFIG-TERMINDEX.XML, SCHEMA-LMDIRICHLET.XML, SOLRCONFIG-ELEVATE.XML, STOPWORDS.TXT, SCHEMA-FOLDING.XML, SCHEMA-STOP-KEEP.XML, FUZZYSUGGEST.TXT, BAD-SCHEMA-NOT-INDEXED-BUT-NORMS.XML, SOLRCONFIG-SOLCOREPROPERTIES.XML, STOP-1.TXT, SOLRCONFIG-MASTER2.XML, SCHEMA-SPELLCHECKER.XML, SOLRCONFIG-RESPONSE-LOG-COMPONENT.XML, SOLRCONFIG-LAZYWRITER.XML, SCHEMA-LUCENEMATCHVERSION.XML, FRENCHARTICLES.TXT, BAD-MP-SOLRCONFIG.XML, SCHEMA15.XML, SOLRCONFIG-REQHANDLER.INCL, SCHEMASURROUND.XML, SCHEMA-COLLATEFILTER.XML, SOLRCONFIG-MASTER3.XML, HUNSPELL-TEST.DIC, SOLRCONFIG-XINCLUDE.XML, BAD-SCHEMA-CODEC-GLOBAL-VS-FT-MISMATCH.XML, SOLRCONFIG-SLAVE1.XML, SOLRCONFIG-DELPOLICY1.XML, SCHEMA-SIM.XML, SCHEMA-SNIPPET-FIELD.XML, SCHEMA-COLLATE.XML, STOP-SNOWBALL.TXT, BAD-SCHEMA-SIM-GLOBAL-VS-FT-MISMATCH.XML, PROTWORDS.TXT, SCHEMA-TRIE.XML, SOLRCONFIG_CODEC.XML, SCHEMA-SYNONYM-TOKENIZER.XML, BAD-SOLRCONFIG-INVALID-SCRIPTFILE.XML, JASUGGEST.TXT, SCHEMA-TFIDF.XML, SOLRCONFIG-SCRIPT-UPDATEPROCESSOR.XML, SCHEMA-LMJELINEKMERCER.XML, PHRASESUGGEST.TXT, BAD-SOLRCONFIG-MISSING-SCRIPTFILE.XML, SOLRCONFIG-BASIC-LUCENEVERSION31.XML, BAD-SCHEMA-UNIQUEKEY-USES-DEFAULT.XML, OLD_SYNONYMS.TXT, SOLRCONFIG-DELPOLICY2.XML, XSLT, SOLRCONFIG-NATIVELOCK.XML, BAD-SCHEMA-DUP-FIELD.XML, SOLRCONFIG-NOCACHE.XML, SCHEMA-BM25.XML, ADDFIELDS.UPDATEPROCESSOR.JS, SOLRCONFIG-QUERYSENDER-NOQUERY.XML, SOLRCONFIG-ALTDIRECTORY.XML, COMPOUNDDICTIONARY.TXT, SOLRCONFIG_PERF.XML, SOLRCONFIG-INDEXCONFIG.XML, BAD-SCHEMA-ANALYZER-CLASS-AND-NESTED.XML, SCHEMA-NOT-REQUIRED-UNIQUE-KEY.XML, KEEP-2.TXT, BAD-SCHEMA-UNIQUEKEY-IS-COPYFIELD-DEST.XML, SCHEMA12.XML, MAPPING-ISOLATIN1ACCENT.TXT, BAD_SOLRCONFIG.XML, BAD-SCHEMA-EXTERNAL-FILEFIELD.XML]
[junit4:junit4]   2> 9621 T67 oasc.CachingDirectoryFactory.close Releasing directory:/Users/jenkins/jenkins-slave/workspace/Lucene-Solr-4.x-MacOSX/solr/build/solr-core/test/J0/./solrtest-SoftAutoCommitTest-1360792238687
[junit4:junit4]   2> 9621 T67 oass.SolrIndexSearcher.<init> Opening Searcher@6d347991 main
[junit4:junit4]   2> 9622 T67 oasu.CommitTracker.<init> Hard AutoCommit: disabled
[junit4:junit4]   2> 9622 T67 oasu.CommitTracker.<init> Soft AutoCommit: disabled
[junit4:junit4]   2> 9623 T67 oashc.SpellCheckComponent.inform Initializing spell checkers
[junit4:junit4]   2> 9625 T67 oass.DirectSolrSpellChecker.init init: {name=direct,classname=DirectSolrSpellChecker,field=lowerfilt,minQueryLength=3}
[junit4:junit4]   2> 9650 T75 oasc.SolrCore.registerSearcher [collection1] Registered new searcher Searcher@6d347991 main{StandardDirectoryReader(segments_2:7:nrt _0(4.2):C1 _1(4.2):C1 _2(4.2):C5)}
[junit4:junit4]   2> 9659 T67 oasc.CoreContainer.registerCore replacing core: collection1
[junit4:junit4]   2> 9660 T67 oasc.SolrCore.close [collection1]  CLOSING SolrCore org.apache.solr.core.SolrCore@192eb04e
[junit4:junit4]   2> 9670 T67 oasu.DirectUpdateHandler2.close closing DirectUpdateHandler2{commits=1,autocommit maxTime=1200ms,autocommits=0,soft autocommit maxTime=500ms,soft autocommits=1,optimizes=0,rollbacks=0,expungeDeletes=0,docsPending=5,adds=0,deletesById=0,deletesByQuery=0,errors=0,cumulative_adds=5,cumulative_deletesById=0,cumulative_deletesByQuery=0,cumulative_errors=0}
[junit4:junit4]   2> 9676 T73 oasu.DirectUpdateHandler2.commit start commit{,optimize=false,openSearcher=true,waitSearcher=true,expungeDeletes=false,softCommit=false}
[junit4:junit4]   2> 9677 T67 oasc.SolrCore.closeSearcher [collection1] Closing main searcher on request.
[junit4:junit4]   2> 9679 T67 oasc.CachingDirectoryFactory.close Releasing directory:/Users/jenkins/jenkins-slave/workspace/Lucene-Solr-4.x-MacOSX/solr/build/solr-core/test/J0/./solrtest-SoftAutoCommitTest-1360792238687/index
[junit4:junit4]   2> 9679 T73 oasc.SolrDeletionPolicy.onCommit SolrDeletionPolicy.onCommit: commits:num=2
[junit4:junit4]   2> 		commit{dir=RateLimitedDirectoryWrapper(MockDirWrapper(org.apache.lucene.store.RAMDirectory@4bfa79c8 lockFactory=org.apache.lucene.store.NativeFSLockFactory@1d926e41)),segFN=segments_2,generation=2,filenames=[_0_Asserting_0.tim, _1_MockVariableIntBlock_0.skp, _1_Lucene41_0.doc, _0_Asserting_0.tip, _0_Lucene41_0.pos, _0_MockVariableIntBlock_0.doc, _1_Asserting_0.doc, _1_MockVariableIntBlock_0.pyl, _0_MockVariableIntBlock_0.skp, _1.fnm, _1_Asserting_0.tim, _0_MockVariableIntBlock_0.pyl, _1_Memory_0.ram, _0_MockVariableIntBlock_0.tib, _1_Asserting_0.tip, _1_MockVariableIntBlock_0.doc, _0.nvd, _0_MockVariableIntBlock_0.pos, _0.si, _0_Lucene41_0.tim, _0_Asserting_0.doc, _0_Lucene41_0.tip, _0_MockVariableIntBlock_0.tii, _1_Asserting_0.pos, _1.nvm, _0.fnm, _1_MockVariableIntBlock_0.tii, _0_Memory_0.ram, _1_Lucene41_0.tim, _1_MockVariableIntBlock_0.pos, _1.nvd, _1_Lucene41_0.tip, _0.nvm, _1_MockVariableIntBlock_0.tib, _1_Lucene41_0.pos, _1_MockVariableIntBlock_0.frq, _1.fdx, _1.fdt, _0_Lucene41_0.doc, _1.si, _0_MockVariableIntBlock_0.frq, segments_2, _0.fdx, _0_Asserting_0.pos, _0.fdt]
[junit4:junit4]   2> 		commit{dir=RateLimitedDirectoryWrapper(MockDirWrapper(org.apache.lucene.store.RAMDirectory@4bfa79c8 lockFactory=org.apache.lucene.store.NativeFSLockFactory@1d926e41)),segFN=segments_3,generation=3,filenames=[_2_Lucene41_0.pos, _1_Lucene41_0.doc, _2_Lucene41_0.tim, _2_Asserting_0.pos, _0_Lucene41_0.pos, _0_MockVariableIntBlock_0.skp, _2_Lucene41_0.tip, _1.fnm, _1_Asserting_0.tim, _1_Asserting_0.tip, _0_Lucene41_0.tim, _0_Lucene41_0.tip, _0_Asserting_0.doc, _2_MockVariableIntBlock_0.pos, _1.nvm, _1_Asserting_0.pos, _0.fnm, _0_Memory_0.ram, _1_MockVariableIntBlock_0.tii, _1.nvd, _2.fdt, _2_Lucene41_0.doc, _2.fdx, _1_MockVariableIntBlock_0.tib, _2_Asserting_0.tim, _1.fdx, _1_Lucene41_0.pos, _2.nvm, _2_Asserting_0.tip, _0_Lucene41_0.doc, _1.fdt, _2.nvd, _0_MockVariableIntBlock_0.frq, _2_MockVariableIntBlock_0.skp, _1_MockVariableIntBlock_0.skp, _0_Asserting_0.tim, _2.si, _2_MockVariableIntBlock_0.pyl, _0_Asserting_0.tip, _0_MockVariableIntBlock_0.doc, _1_Asserting_0.doc, _2_MockVariableIntBlock_0.frq, _1_MockVariableIntBlock_0.pyl, _2_MockVariableIntBlock_0.doc, _0_MockVariableIntBlock_0.pyl, _1_Memory_0.ram, _0_MockVariableIntBlock_0.tib, _2_Asserting_0.doc, _1_MockVariableIntBlock_0.doc, _0.nvd, _0_MockVariableIntBlock_0.pos, _2_Memory_0.ram, _0.si, _0_MockVariableIntBlock_0.tii, _2_MockVariableIntBlock_0.tii, _2_MockVariableIntBlock_0.tib, _1_MockVariableIntBlock_0.pos, _1_Lucene41_0.tim, _1_Lucene41_0.tip, _0.nvm, _2.fnm, _1_MockVariableIntBlock_0.frq, _1.si, _0.fdx, _0_Asserting_0.pos, _0.fdt, segments_3]
[junit4:junit4]   2> 9680 T73 oasc.SolrDeletionPolicy.updateCommits newest commit = 3[_2_Lucene41_0.pos, _1_Lucene41_0.doc, _2_Lucene41_0.tim, _2_Asserting_0.pos, _0_Lucene41_0.pos, _0_MockVariableIntBlock_0.skp, _2_Lucene41_0.tip, _1.fnm, _1_Asserting_0.tim, _1_Asserting_0.tip, _0_Lucene41_0.tim, _0_Lucene41_0.tip, _0_Asserting_0.doc, _2_MockVariableIntBlock_0.pos, _1.nvm, _1_Asserting_0.pos, _0.fnm, _0_Memory_0.ram, _1_MockVariableIntBlock_0.tii, _1.nvd, _2.fdt, _2_Lucene41_0.doc, _2.fdx, _1_MockVariableIntBlock_0.tib, _2_Asserting_0.tim, _1.fdx, _1_Lucene41_0.pos, _2.nvm, _2_Asserting_0.tip, _0_Lucene41_0.doc, _1.fdt, _2.nvd, _0_MockVariableIntBlock_0.frq, _2_MockVariableIntBlock_0.skp, _1_MockVariableIntBlock_0.skp, _0_Asserting_0.tim, _2.si, _2_MockVariableIntBlock_0.pyl, _0_Asserting_0.tip, _0_MockVariableIntBlock_0.doc, _1_Asserting_0.doc, _2_MockVariableIntBlock_0.frq, _1_MockVariableIntBlock_0.pyl, _2_MockVariableIntBlock_0.doc, _0_MockVariableIntBlock_0.pyl, _1_Memory_0.ram, _0_MockVariableIntBlock_0.tib, _2_Asserting_0.doc, _1_MockVariableIntBlock_0.doc, _0.nvd, _0_MockVariableIntBlock_0.pos, _2_Memory_0.ram, _0.si, _0_MockVariableIntBlock_0.tii, _2_MockVariableIntBlock_0.tii, _2_MockVariableIntBlock_0.tib, _1_MockVariableIntBlock_0.pos, _1_Lucene41_0.tim, _1_Lucene41_0.tip, _0.nvm, _2.fnm, _1_MockVariableIntBlock_0.frq, _1.si, _0.fdx, _0_Asserting_0.pos, _0.fdt, segments_3]
[junit4:junit4]   2> 9680 T73 oasc.CachingDirectoryFactory.close Releasing directory:/Users/jenkins/jenkins-slave/workspace/Lucene-Solr-4.x-MacOSX/solr/build/solr-core/test/J0/./solrtest-SoftAutoCommitTest-1360792238687
[junit4:junit4]   2> ASYNC  NEW_CORE C5 name=collection1 org.apache.solr.core.SolrCore@fbe496b
[junit4:junit4]   2> 9692 T67 C5 UPDATE [collection1] webapp=null path=null params={} {add=[529]} 0 7
[junit4:junit4]   2> 9693 T73 oass.SolrIndexSearcher.<init> Opening Searcher@5d325877 main
[junit4:junit4]   2> 9696 T73 oasc.SolrException.log SEVERE auto commit error...:org.apache.solr.common.SolrException: java.util.concurrent.RejectedExecutionException
[junit4:junit4]   2> 		at org.apache.solr.core.SolrCore.getSearcher(SolrCore.java:1660)
[junit4:junit4]   2> 		at org.apache.solr.core.SolrCore.getSearcher(SolrCore.java:1312)
[junit4:junit4]   2> 		at org.apache.solr.update.DirectUpdateHandler2.commit(DirectUpdateHandler2.java:570)
[junit4:junit4]   2> 		at org.apache.solr.update.CommitTracker.run(CommitTracker.java:216)
[junit4:junit4]   2> 		at java.util.concurrent.Executors$RunnableAdapter.call(Executors.java:439)
[junit4:junit4]   2> 		at java.util.concurrent.FutureTask$Sync.innerRun(FutureTask.java:303)
[junit4:junit4]   2> 		at java.util.concurrent.FutureTask.run(FutureTask.java:138)
[junit4:junit4]   2> 		at java.util.concurrent.ScheduledThreadPoolExecutor$ScheduledFutureTask.access$301(ScheduledThreadPoolExecutor.java:98)
[junit4:junit4]   2> 		at java.util.concurrent.ScheduledThreadPoolExecutor$ScheduledFutureTask.run(ScheduledThreadPoolExecutor.java:206)
[junit4:junit4]   2> 		at java.util.concurrent.ThreadPoolExecutor$Worker.runTask(ThreadPoolExecutor.java:886)
[junit4:junit4]   2> 		at java.util.concurrent.ThreadPoolExecutor$Worker.run(ThreadPoolExecutor.java:908)
[junit4:junit4]   2> 		at java.lang.Thread.run(Thread.java:680)
[junit4:junit4]   2> 	Caused by: java.util.concurrent.RejectedExecutionException
[junit4:junit4]   2> 		at java.util.concurrent.ThreadPoolExecutor$AbortPolicy.rejectedExecution(ThreadPoolExecutor.java:1768)
[junit4:junit4]   2> 		at java.util.concurrent.ThreadPoolExecutor.reject(ThreadPoolExecutor.java:767)
[junit4:junit4]   2> 		at java.util.concurrent.ThreadPoolExecutor.execute(ThreadPoolExecutor.java:658)
[junit4:junit4]   2> 		at java.util.concurrent.AbstractExecutorService.submit(AbstractExecutorService.java:92)
[junit4:junit4]   2> 		at java.util.concurrent.Executors$DelegatedExecutorService.submit(Executors.java:602)
[junit4:junit4]   2> 		at org.apache.solr.core.SolrCore.getSearcher(SolrCore.java:1588)
[junit4:junit4]   2> 		... 11 more
[junit4:junit4]   2> 	
[junit4:junit4]   2> 9702 T67 C5 oasu.DirectUpdateHandler2.commit start commit{,optimize=false,openSearcher=true,waitSearcher=true,expungeDeletes=false,softCommit=false}
[junit4:junit4]   2> 9713 T67 C5 oasc.SolrDeletionPolicy.onCommit SolrDeletionPolicy.onCommit: commits:num=2
[junit4:junit4]   2> 		commit{dir=RateLimitedDirectoryWrapper(MockDirWrapper(org.apache.lucene.store.RAMDirectory@4bfa79c8 lockFactory=org.apache.lucene.store.NativeFSLockFactory@1d926e41)),segFN=segments_3,generation=3,filenames=[_2_Lucene41_0.pos, _1_Lucene41_0.doc, _2_Lucene41_0.tim, _2_Asserting_0.pos, _0_Lucene41_0.pos, _0_MockVariableIntBlock_0.skp, _2_Lucene41_0.tip, _1.fnm, _1_Asserting_0.tim, _1_Asserting_0.tip, _0_Lucene41_0.tim, _0_Lucene41_0.tip, _0_Asserting_0.doc, _2_MockVariableIntBlock_0.pos, _1.nvm, _1_Asserting_0.pos, _0.fnm, _0_Memory_0.ram, _1_MockVariableIntBlock_0.tii, _1.nvd, _2.fdt, _2_Lucene41_0.doc, _2.fdx, _1_MockVariableIntBlock_0.tib, _2_Asserting_0.tim, _1.fdx, _1_Lucene41_0.pos, _2.nvm, _2_Asserting_0.tip, _0_Lucene41_0.doc, _1.fdt, _2.nvd, _0_MockVariableIntBlock_0.frq, _2_MockVariableIntBlock_0.skp, _1_MockVariableIntBlock_0.skp, _0_Asserting_0.tim, _2.si, _2_MockVariableIntBlock_0.pyl, _0_Asserting_0.tip, _0_MockVariableIntBlock_0.doc, _1_Asserting_0.doc, _2_MockVariableIntBlock_0.frq, _1_MockVariableIntBlock_0.pyl, _2_MockVariableIntBlock_0.doc, _0_MockVariableIntBlock_0.pyl, _1_Memory_0.ram, _0_MockVariableIntBlock_0.tib, _2_Asserting_0.doc, _1_MockVariableIntBlock_0.doc, _0.nvd, _0_MockVariableIntBlock_0.pos, _2_Memory_0.ram, _0.si, _0_MockVariableIntBlock_0.tii, _2_MockVariableIntBlock_0.tii, _2_MockVariableIntBlock_0.tib, _1_MockVariableIntBlock_0.pos, _1_Lucene41_0.tim, _1_Lucene41_0.tip, _0.nvm, _2.fnm, _1_MockVariableIntBlock_0.frq, _1.si, _0.fdx, _0_Asserting_0.pos, _0.fdt, segments_3]
[junit4:junit4]   2> 		commit{dir=RateLimitedDirectoryWrapper(MockDirWrapper(org.apache.lucene.store.RAMDirectory@4bfa79c8 lockFactory=org.apache.lucene.store.NativeFSLockFactory@1d926e41)),segFN=segments_4,generation=4,filenames=[_2_Lucene41_0.pos, _1_Lucene41_0.doc, _2_Lucene41_0.tim, _2_Asserting_0.pos, _3_MockVariableIntBlock_0.frq, _3.fdt, _2_Lucene41_0.tip, _1.fnm, _1_Asserting_0.tim, _3.nvd, _3_Lucene41_0.pos, _1_Asserting_0.tip, _3.nvm, _2_MockVariableIntBlock_0.pos, _1.nvm, _1_Asserting_0.pos, _1_MockVariableIntBlock_0.tii, _1.nvd, _3_MockVariableIntBlock_0.doc, _2.fdt, _2_Lucene41_0.doc, _2.fdx, _1_MockVariableIntBlock_0.tib, _1_Lucene41_0.pos, _1.fdx, _2_Asserting_0.tim, _2.nvm, _3_Lucene41_0.doc, _2_Asserting_0.tip, _1.fdt, _2.nvd, _3_MockVariableIntBlock_0.tib, _3.si, _2_MockVariableIntBlock_0.skp, _2.si, _1_MockVariableIntBlock_0.skp, _2_MockVariableIntBlock_0.pyl, _1_Asserting_0.doc, _1_MockVariableIntBlock_0.pyl, _2_MockVariableIntBlock_0.frq, _3.fnm, _3_Asserting_0.pos, _3_MockVariableIntBlock_0.tii, _2_MockVariableIntBlock_0.doc, _1_Memory_0.ram, _3_Lucene41_0.tip, _2_Asserting_0.doc, _1_MockVariableIntBlock_0.doc, _3_Lucene41_0.tim, _2_Memory_0.ram, _3_Memory_0.ram, _2_MockVariableIntBlock_0.tii, _2_MockVariableIntBlock_0.tib, _1_MockVariableIntBlock_0.pos, _1_Lucene41_0.tim, _1_Lucene41_0.tip, _2.fnm, _3.fdx, _1_MockVariableIntBlock_0.frq, _3_Asserting_0.tim, _3_Asserting_0.tip, _3_Asserting_0.doc, _1.si, _3_MockVariableIntBlock_0.pyl, _3_MockVariableIntBlock_0.skp, _3_MockVariableIntBlock_0.pos, segments_4]
[junit4:junit4]   2> 9714 T67 C5 oasc.SolrDeletionPolicy.updateCommits newest commit = 4[_2_Lucene41_0.pos, _1_Lucene41_0.doc, _2_Lucene41_0.tim, _2_Asserting_0.pos, _3_MockVariableIntBlock_0.frq, _3.fdt, _2_Lucene41_0.tip, _1.fnm, _1_Asserting_0.tim, _3.nvd, _3_Lucene41_0.pos, _1_Asserting_0.tip, _3.nvm, _2_MockVariableIntBlock_0.pos, _1.nvm, _1_Asserting_0.pos, _1_MockVariableIntBlock_0.tii, _1.nvd, _3_MockVariableIntBlock_0.doc, _2.fdt, _2_Lucene41_0.doc, _2.fdx, _1_MockVariableIntBlock_0.tib, _1_Lucene41_0.pos, _1.fdx, _2_Asserting_0.tim, _2.nvm, _3_Lucene41_0.doc, _2_Asserting_0.tip, _1.fdt, _2.nvd, _3_MockVariableIntBlock_0.tib, _3.si, _2_MockVariableIntBlock_0.skp, _2.si, _1_MockVariableIntBlock_0.skp, _2_MockVariableIntBlock_0.pyl, _1_Asserting_0.doc, _1_MockVariableIntBlock_0.pyl, _2_MockVariableIntBlock_0.frq, _3.fnm, _3_Asserting_0.pos, _3_MockVariableIntBlock_0.tii, _2_MockVariableIntBlock_0.doc, _1_Memory_0.ram, _3_Lucene41_0.tip, _2_Asserting_0.doc, _1_MockVariableIntBlock_0.doc, _3_Lucene41_0.tim, _2_Memory_0.ram, _3_Memory_0.ram, _2_MockVariableIntBlock_0.tii, _2_MockVariableIntBlock_0.tib, _1_MockVariableIntBlock_0.pos, _1_Lucene41_0.tim, _1_Lucene41_0.tip, _2.fnm, _3.fdx, _1_MockVariableIntBlock_0.frq, _3_Asserting_0.tim, _3_Asserting_0.tip, _3_Asserting_0.doc, _1.si, _3_MockVariableIntBlock_0.pyl, _3_MockVariableIntBlock_0.skp, _3_MockVariableIntBlock_0.pos, segments_4]
[junit4:junit4]   2> 9716 T67 C5 oasc.CachingDirectoryFactory.close Releasing directory:/Users/jenkins/jenkins-slave/workspace/Lucene-Solr-4.x-MacOSX/solr/build/solr-core/test/J0/./solrtest-SoftAutoCommitTest-1360792238687
[junit4:junit4]   2> 9719 T67 C5 oass.SolrIndexSearcher.<init> Opening Searcher@d5efe34 main
[junit4:junit4]   2> 9720 T67 C5 oasu.DirectUpdateHandler2.commit end_commit_flush
[junit4:junit4]   2> 9722 T75 oasc.SolrCore.registerSearcher [collection1] Registered new searcher Searcher@d5efe34 main{StandardDirectoryReader(segments_4:11:nrt _1(4.2):C1 _2(4.2):C5 _3(4.2):C1)}
[junit4:junit4]   2> 9724 T75 oasc.CachingDirectoryFactory.close Releasing directory:/Users/jenkins/jenkins-slave/workspace/Lucene-Solr-4.x-MacOSX/solr/build/solr-core/test/J0/./solrtest-SoftAutoCommitTest-1360792238687/index
[junit4:junit4]   2> 9725 T67 C5 UPDATE [collection1] webapp=null path=null params={} {commit=} 0 23
[junit4:junit4]   2> 9733 T67 C5 UPDATE [collection1] webapp=null path=null params={} {delete=[529]} 0 0
[junit4:junit4]   2> 10236 T77 oasu.DirectUpdateHandler2.commit start commit{,optimize=false,openSearcher=true,waitSearcher=true,expungeDeletes=false,softCommit=true}
[junit4:junit4]   2> 10237 T77 oasc.CachingDirectoryFactory.close Releasing directory:/Users/jenkins/jenkins-slave/workspace/Lucene-Solr-4.x-MacOSX/solr/build/solr-core/test/J0/./solrtest-SoftAutoCommitTest-1360792238687
[junit4:junit4]   2> 10246 T77 oass.SolrIndexSearcher.<init> Opening Searcher@2e661950 main
[junit4:junit4]   2> 10247 T77 oasu.DirectUpdateHandler2.commit end_commit_flush
[junit4:junit4]   2> 10254 T75 oasc.SolrCore.registerSearcher [collection1] Registered new searcher Searcher@2e661950 main{StandardDirectoryReader(segments_4:13:nrt _1(4.2):C1 _2(4.2):C5)}
[junit4:junit4]   2> 10260 T67 C5 UPDATE [collection1] webapp=null path=null params={} {add=[550]} 0 3
[junit4:junit4]   2> 10262 T75 oasc.CachingDirectoryFactory.close Releasing directory:/Users/jenkins/jenkins-slave/workspace/Lucene-Solr-4.x-MacOSX/solr/build/solr-core/test/J0/./solrtest-SoftAutoCommitTest-1360792238687/index
[junit4:junit4]   2> 10760 T77 oasu.DirectUpdateHandler2.commit start commit{,optimize=false,openSearcher=true,waitSearcher=true,expungeDeletes=false,softCommit=true}
[junit4:junit4]   2> 10761 T77 oasc.CachingDirectoryFactory.close Releasing directory:/Users/jenkins/jenkins-slave/workspace/Lucene-Solr-4.x-MacOSX/solr/build/solr-core/test/J0/./solrtest-SoftAutoCommitTest-1360792238687
[junit4:junit4]   2> 10773 T77 oass.SolrIndexSearcher.<init> Opening Searcher@55661f7b main
[junit4:junit4]   2> 10773 T77 oasu.DirectUpdateHandler2.commit end_commit_flush
[junit4:junit4]   2> 10775 T75 oasc.SolrCore.registerSearcher [collection1] Registered new searcher Searcher@55661f7b main{StandardDirectoryReader(segments_4:15:nrt _1(4.2):C1 _2(4.2):C5 _4(4.2):C1)}
[junit4:junit4]   2> 10777 T75 oasc.CachingDirectoryFactory.close Releasing directory:/Users/jenkins/jenkins-slave/workspace/Lucene-Solr-4.x-MacOSX/solr/build/solr-core/test/J0/./solrtest-SoftAutoCommitTest-1360792238687/index
[junit4:junit4]   2> 10937 T76 oasu.DirectUpdateHandler2.commit start commit{,optimize=false,openSearcher=true,waitSearcher=true,expungeDeletes=false,softCommit=false}
[junit4:junit4]   2> 10942 T76 oasc.SolrDeletionPolicy.onCommit SolrDeletionPolicy.onCommit: commits:num=2
[junit4:junit4]   2> 		commit{dir=RateLimitedDirectoryWrapper(MockDirWrapper(org.apache.lucene.store.RAMDirectory@4bfa79c8 lockFactory=org.apache.lucene.store.NativeFSLockFactory@1d926e41)),segFN=segments_4,generation=4,filenames=[_2_Lucene41_0.pos, _1_Lucene41_0.doc, _2_Lucene41_0.tim, _2_Asserting_0.pos, _3_MockVariableIntBlock_0.frq, _3.fdt, _2_Lucene41_0.tip, _1.fnm, _1_Asserting_0.tim, _3.nvd, _3_Lucene41_0.pos, _1_Asserting_0.tip, _3.nvm, _2_MockVariableIntBlock_0.pos, _1.nvm, _1_Asserting_0.pos, _1_MockVariableIntBlock_0.tii, _1.nvd, _3_MockVariableIntBlock_0.doc, _2.fdt, _2_Lucene41_0.doc, _2.fdx, _1_MockVariableIntBlock_0.tib, _1_Lucene41_0.pos, _1.fdx, _2_Asserting_0.tim, _2.nvm, _3_Lucene41_0.doc, _2_Asserting_0.tip, _1.fdt, _2.nvd, _3_MockVariableIntBlock_0.tib, _3.si, _2_MockVariableIntBlock_0.skp, _2.si, _1_MockVariableIntBlock_0.skp, _2_MockVariableIntBlock_0.pyl, _1_Asserting_0.doc, _1_MockVariableIntBlock_0.pyl, _2_MockVariableIntBlock_0.frq, _3.fnm, _3_Asserting_0.pos, _3_MockVariableIntBlock_0.tii, _2_MockVariableIntBlock_0.doc, _1_Memory_0.ram, _3_Lucene41_0.tip, _2_Asserting_0.doc, _1_MockVariableIntBlock_0.doc, _3_Lucene41_0.tim, _2_Memory_0.ram, _3_Memory_0.ram, _2_MockVariableIntBlock_0.tii, _2_MockVariableIntBlock_0.tib, _1_MockVariableIntBlock_0.pos, _1_Lucene41_0.tim, _1_Lucene41_0.tip, _2.fnm, _3.fdx, _1_MockVariableIntBlock_0.frq, _3_Asserting_0.tim, _3_Asserting_0.tip, _3_Asserting_0.doc, _1.si, _3_MockVariableIntBlock_0.pyl, _3_MockVariableIntBlock_0.skp, _3_MockVariableIntBlock_0.pos, segments_4]
[junit4:junit4]   2> 		commit{dir=RateLimitedDirectoryWrapper(MockDirWrapper(org.apache.lucene.store.RAMDirectory@4bfa79c8 lockFactory=org.apache.lucene.store.NativeFSLockFactory@1d926e41)),segFN=segments_5,generation=5,filenames=[_2_Lucene41_0.pos, _1_Lucene41_0.doc, _2_Lucene41_0.tim, _2_Asserting_0.pos, _4_Lucene41_0.doc, _4.fnm, _4_MockVariableIntBlock_0.tii, _2_Lucene41_0.tip, _1.fnm, _4.fdx, _1_Asserting_0.tim, _1_Asserting_0.tip, _4_Lucene41_0.pos, _4_Asserting_0.doc, _2_MockVariableIntBlock_0.pos, _1.nvm, _1_Asserting_0.pos, _1_MockVariableIntBlock_0.tii, _1.nvd, _4_MockVariableIntBlock_0.doc, _2.fdt, _2_Lucene41_0.doc, _4_Lucene41_0.tip, _2.fdx, _4_Lucene41_0.tim, _1_MockVariableIntBlock_0.tib, _1_Lucene41_0.pos, _1.fdx, _2_Asserting_0.tim, _4_MockVariableIntBlock_0.pyl, _2.nvm, _4_MockVariableIntBlock_0.tib, _2_Asserting_0.tip, _1.fdt, _4_Memory_0.ram, _2.nvd, _2_MockVariableIntBlock_0.skp, _2.si, _1_MockVariableIntBlock_0.skp, _2_MockVariableIntBlock_0.pyl, _1_Asserting_0.doc, _1_MockVariableIntBlock_0.pyl, _2_MockVariableIntBlock_0.frq, _4_Asserting_0.tip, _2_MockVariableIntBlock_0.doc, _4_Asserting_0.pos, _1_Memory_0.ram, _4_MockVariableIntBlock_0.skp, _4_Asserting_0.tim, _2_Asserting_0.doc, _4_MockVariableIntBlock_0.pos, _1_MockVariableIntBlock_0.doc, _2_Memory_0.ram, _2_MockVariableIntBlock_0.tii, _2_MockVariableIntBlock_0.tib, _1_MockVariableIntBlock_0.pos, _1_Lucene41_0.tim, _4_MockVariableIntBlock_0.frq, _1_Lucene41_0.tip, _4.si, _4.fdt, _2.fnm, _1_MockVariableIntBlock_0.frq, _4.nvd, _1.si, segments_5, _4.nvm]
[junit4:junit4]   2> 10944 T76 oasc.SolrDeletionPolicy.updateCommits newest commit = 5[_2_Lucene41_0.pos, _1_Lucene41_0.doc, _2_Lucene41_0.tim, _2_Asserting_0.pos, _4_Lucene41_0.doc, _4.fnm, _4_MockVariableIntBlock_0.tii, _2_Lucene41_0.tip, _1.fnm, _4.fdx, _1_Asserting_0.tim, _1_Asserting_0.tip, _4_Lucene41_0.pos, _4_Asserting_0.doc, _2_MockVariableIntBlock_0.pos, _1.nvm, _1_Asserting_0.pos, _1_MockVariableIntBlock_0.tii, _1.nvd, _4_MockVariableIntBlock_0.doc, _2.fdt, _2_Lucene41_0.doc, _4_Lucene41_0.tip, _2.fdx, _4_Lucene41_0.tim, _1_MockVariableIntBlock_0.tib, _1_Lucene41_0.pos, _1.fdx, _2_Asserting_0.tim, _4_MockVariableIntBlock_0.pyl, _2.nvm, _4_MockVariableIntBlock_0.tib, _2_Asserting_0.tip, _1.fdt, _4_Memory_0.ram, _2.nvd, _2_MockVariableIntBlock_0.skp, _2.si, _1_MockVariableIntBlock_0.skp, _2_MockVariableIntBlock_0.pyl, _1_Asserting_0.doc, _1_MockVariableIntBlock_0.pyl, _2_MockVariableIntBlock_0.frq, _4_Asserting_0.tip, _2_MockVariableIntBlock_0.doc, _4_Asserting_0.pos, _1_Memory_0.ram, _4_MockVariableIntBlock_0.skp, _4_Asserting_0.tim, _2_Asserting_0.doc, _4_MockVariableIntBlock_0.pos, _1_MockVariableIntBlock_0.doc, _2_Memory_0.ram, _2_MockVariableIntBlock_0.tii, _2_MockVariableIntBlock_0.tib, _1_MockVariableIntBlock_0.pos, _1_Lucene41_0.tim, _4_MockVariableIntBlock_0.frq, _1_Lucene41_0.tip, _4.si, _4.fdt, _2.fnm, _1_MockVariableIntBlock_0.frq, _4.nvd, _1.si, segments_5, _4.nvm]
[junit4:junit4]   2> 10946 T76 oasc.CachingDirectoryFactory.close Releasing directory:/Users/jenkins/jenkins-slave/workspace/Lucene-Solr-4.x-MacOSX/solr/build/solr-core/test/J0/./solrtest-SoftAutoCommitTest-1360792238687
[junit4:junit4]   2> 10946 T76 oass.SolrIndexSearcher.<init> Opening Searcher@3e6755b6 main
[junit4:junit4]   2> 10947 T76 oasu.DirectUpdateHandler2.commit end_commit_flush
[junit4:junit4]   2> 10951 T75 oasc.SolrCore.registerSearcher [collection1] Registered new searcher Searcher@3e6755b6 main{StandardDirectoryReader(segments_4:15:nrt _1(4.2):C1 _2(4.2):C5 _4(4.2):C1)}
[junit4:junit4]   2> 10952 T75 oasc.CachingDirectoryFactory.close Releasing directory:/Users/jenkins/jenkins-slave/workspace/Lucene-Solr-4.x-MacOSX/solr/build/solr-core/test/J0/./solrtest-SoftAutoCommitTest-1360792238687/index
[junit4:junit4]   2> 12957 T67 oas.SolrTestCaseJ4.tearDown ###Ending testSoftAndHardCommitMaxTimeDelete
[junit4:junit4]   2> 12958 T67 oas.SolrTestCaseJ4.deleteCore ###deleteCore
[junit4:junit4]   2> 12958 T67 oasc.CoreContainer.shutdown Shutting down CoreContainer instance=126607146
[junit4:junit4]   2> 12959 T67 oasc.SolrCore.close [collection1]  CLOSING SolrCore org.apache.solr.core.SolrCore@fbe496b
[junit4:junit4]   2> 12971 T67 oasu.DirectUpdateHandler2.close closing DirectUpdateHandler2{commits=4,autocommit maxTime=1200ms,autocommits=1,soft autocommit maxTime=500ms,soft autocommits=2,optimizes=0,rollbacks=0,expungeDeletes=0,docsPending=0,adds=0,deletesById=0,deletesByQuery=0,errors=0,cumulative_adds=2,cumulative_deletesById=1,cumulative_deletesByQuery=0,cumulative_errors=0}
[junit4:junit4]   2> 12971 T67 oasc.SolrCore.decrefSolrCoreState Closing SolrCoreState
[junit4:junit4]   2> 12977 T67 oasu.DefaultSolrCoreState.closeIndexWriter SolrCoreState ref count has reached 0 - closing IndexWriter
[junit4:junit4]   2> 12978 T67 oasu.DefaultSolrCoreState.closeIndexWriter closing IndexWriter with IndexWriterCloser
[junit4:junit4]   2> 12980 T67 C5 oasc.CachingDirectoryFactory.close Releasing directory:/Users/jenkins/jenkins-slave/workspace/Lucene-Solr-4.x-MacOSX/solr/build/solr-core/test/J0/./solrtest-SoftAutoCommitTest-1360792238687/index
[junit4:junit4]   2> 12982 T67 oasc.SolrCore.closeSearcher [collection1] Closing main searcher on request.
[junit4:junit4]   2> 12984 T67 oasc.CachingDirectoryFactory.close Releasing directory:/Users/jenkins/jenkins-slave/workspace/Lucene-Solr-4.x-MacOSX/solr/build/solr-core/test/J0/./solrtest-SoftAutoCommitTest-1360792238687/index
[junit4:junit4]   2> 12984 T67 oasc.CachingDirectoryFactory.close Closing directory when closing factory:/Users/jenkins/jenkins-slave/workspace/Lucene-Solr-4.x-MacOSX/solr/build/solr-core/test/J0/./solrtest-SoftAutoCommitTest-1360792238687
[junit4:junit4]   2> 12985 T67 oasc.CachingDirectoryFactory.closeDirectory Closing directory:/Users/jenkins/jenkins-slave/workspace/Lucene-Solr-4.x-MacOSX/solr/build/solr-core/test/J0/./solrtest-SoftAutoCommitTest-1360792238687
[junit4:junit4]   2> 135151 T67 oasc.CachingDirectoryFactory.close SEVERE Timeout waiting for all directory ref counts to be released
[junit4:junit4]   2> 135152 T67 oasc.SolrException.log SEVERE Error closing directory:java.lang.AssertionError: 1
[junit4:junit4]   2> 		at org.apache.solr.core.CachingDirectoryFactory.close(CachingDirectoryFactory.java:139)
[junit4:junit4]   2> 		at org.apache.solr.core.SolrCore.close(SolrCore.java:1011)
[junit4:junit4]   2> 		at org.apache.solr.core.CoreContainer.shutdown(CoreContainer.java:754)
[junit4:junit4]   2> 		at org.apache.solr.util.TestHarness.close(TestHarness.java:449)
[junit4:junit4]   2> 		at org.apache.solr.SolrTestCaseJ4.deleteCore(SolrTestCaseJ4.java:418)
[junit4:junit4]   2> 		at org.apache.solr.SolrTestCaseJ4.afterClass(SolrTestCaseJ4.java:95)
[junit4:junit4]   2> 		at sun.reflect.NativeMethodAccessorImpl.invoke0(Native Method)
[junit4:junit4]   2> 		at sun.reflect.NativeMethodAccessorImpl.invoke(NativeMethodAccessorImpl.java:39)
[junit4:junit4]   2> 		at sun.reflect.DelegatingMethodAccessorImpl.invoke(DelegatingMethodAccessorImpl.java:25)
[junit4:junit4]   2> 		at java.lang.reflect.Method.invoke(Method.java:597)
[junit4:junit4]   2> 		at com.carrotsearch.randomizedtesting.RandomizedRunner.invoke(RandomizedRunner.java:1559)
[junit4:junit4]   2> 		at com.carrotsearch.randomizedtesting.RandomizedRunner.access$600(RandomizedRunner.java:79)
[junit4:junit4]   2> 		at com.carrotsearch.randomizedtesting.RandomizedRunner$5.evaluate(RandomizedRunner.java:700)
[junit4:junit4]   2> 		at com.carrotsearch.randomizedtesting.rules.StatementAdapter.evaluate(StatementAdapter.java:36)
[junit4:junit4]   2> 		at com.carrotsearch.randomizedtesting.rules.SystemPropertiesRestoreRule$1.evaluate(SystemPropertiesRestoreRule.java:53)
[junit4:junit4]   2> 		at org.apache.lucene.util.AbstractBeforeAfterRule$1.evaluate(AbstractBeforeAfterRule.java:46)
[junit4:junit4]   2> 		at org.apache.lucene.util.TestRuleStoreClassName$1.evaluate(TestRuleStoreClassName.java:42)
[junit4:junit4]   2> 		at com.carrotsearch.randomizedtesting.rules.SystemPropertiesInvariantRule$1.evaluate(SystemPropertiesInvariantRule.java:55)
[junit4:junit4]   2> 		at com.carrotsearch.randomizedtesting.rules.NoShadowingOrOverridesOnMethodsRule$1.evaluate(NoShadowingOrOverridesOnMethodsRule.java:39)
[junit4:junit4]   2> 		at com.carrotsearch.randomizedtesting.rules.NoShadowingOrOverridesOnMethodsRule$1.evaluate(NoShadowingOrOverridesOnMethodsRule.java:39)
[junit4:junit4]   2> 		at com.carrotsearch.randomizedtesting.rules.StatementAdapter.evaluate(StatementAdapter.java:36)
[junit4:junit4]   2> 		at org.apache.lucene.util.TestRuleAssertionsRequired$1.evaluate(TestRuleAssertionsRequired.java:43)
[junit4:junit4]   2> 		at org.apache.lucene.util.TestRuleMarkFailure$1.evaluate(TestRuleMarkFailure.java:48)
[junit4:junit4]   2> 		at org.apache.lucene.util.TestRuleIgnoreAfterMaxFailures$1.evaluate(TestRuleIgnoreAfterMaxFailures.java:70)
[junit4:junit4]   2> 		at org.apache.lucene.util.TestRuleIgnoreTestSuites$1.evaluate(TestRuleIgnoreTestSuites.java:55)
[junit4:junit4]   2> 		at com.carrotsearch.randomizedtesting.rules.StatementAdapter.evaluate(StatementAdapter.java:36)
[junit4:junit4]   2> 		at com.carrotsearch.randomizedtesting.ThreadLeakControl$StatementRunner.run(ThreadLeakControl.java:358)
[junit4:junit4]   2> 		at java.lang.Thread.run(Thread.java:680)
[junit4:junit4]   2> 	
[junit4:junit4]   2> 256500 T67 oas.SolrTestCaseJ4.endTrackingSearchers SEVERE ERROR: SolrIndexSearcher opens=13 closes=12
[junit4:junit4]   2> NOTE: test params are: codec=Lucene42: {timestamp=PostingsFormat(name=Memory doPackFST= false), range_facet_l=PostingsFormat(name=Memory doPackFST= false), id=MockVariableIntBlock(baseBlockSize=22), range_facet_sl=PostingsFormat(name=Asserting), text=PostingsFormat(name=Asserting), range_facet_si=Lucene41(blocksize=128), subject=Lucene41(blocksize=128), multiDefault=Lucene41(blocksize=128), intDefault=PostingsFormat(name=Memory doPackFST= false)}, docValues:{}, sim=DefaultSimilarity, locale=it_IT, timezone=Indian/Comoro
[junit4:junit4]   2> NOTE: Mac OS X 10.8.2 x86_64/Apple Inc. 1.6.0_37 (64-bit)/cpus=2,threads=1,free=44214624,total=100204544
[junit4:junit4]   2> NOTE: All tests run in this JVM: [TestStressReorder, DocumentAnalysisRequestHandlerTest, DefaultValueUpdateProcessorTest, LukeRequestHandlerTest, RequiredFieldsTest, SoftAutoCommitTest]
[junit4:junit4]   2> NOTE: reproduce with: ant test  -Dtestcase=SoftAutoCommitTest -Dtests.seed=43FDCEA5291B5AD9 -Dtests.slow=true -Dtests.locale=it_IT -Dtests.timezone=Indian/Comoro -Dtests.file.encoding=US-ASCII
[junit4:junit4] ERROR   0.00s | SoftAutoCommitTest (suite) <<<
[junit4:junit4]    > Throwable #1: java.lang.AssertionError: ERROR: SolrIndexSearcher opens=13 closes=12
[junit4:junit4]    > 	at __randomizedtesting.SeedInfo.seed([43FDCEA5291B5AD9]:0)
[junit4:junit4]    > 	at org.junit.Assert.fail(Assert.java:93)
[junit4:junit4]    > 	at org.apache.solr.SolrTestCaseJ4.endTrackingSearchers(SolrTestCaseJ4.java:246)
[junit4:junit4]    > 	at org.apache.solr.SolrTestCaseJ4.afterClass(SolrTestCaseJ4.java:97)
[junit4:junit4]    > 	at sun.reflect.NativeMethodAccessorImpl.invoke0(Native Method)
[junit4:junit4]    > 	at sun.reflect.NativeMethodAccessorImpl.invoke(NativeMethodAccessorImpl.java:39)
[junit4:junit4]    > 	at sun.reflect.DelegatingMethodAccessorImpl.invoke(DelegatingMethodAccessorImpl.java:25)
[junit4:junit4]    > 	at java.lang.reflect.Method.invoke(Method.java:597)
[junit4:junit4]    > 	at com.carrotsearch.randomizedtesting.RandomizedRunner.invoke(RandomizedRunner.java:1559)
[junit4:junit4]    > 	at com.carrotsearch.randomizedtesting.RandomizedRunner.access$600(RandomizedRunner.java:79)
[junit4:junit4]    > 	at com.carrotsearch.randomizedtesting.RandomizedRunner$5.evaluate(RandomizedRunner.java:700)
[junit4:junit4]    > 	at com.carrotsearch.randomizedtesting.rules.StatementAdapter.evaluate(StatementAdapter.java:36)
[junit4:junit4]    > 	at com.carrotsearch.randomizedtesting.rules.SystemPropertiesRestoreRule$1.evaluate(SystemPropertiesRestoreRule.java:53)
[junit4:junit4]    > 	at org.apache.lucene.util.AbstractBeforeAfterRule$1.evaluate(AbstractBeforeAfterRule.java:46)
[junit4:junit4]    > 	at org.apache.lucene.util.TestRuleStoreClassName$1.evaluate(TestRuleStoreClassName.java:42)
[junit4:junit4]    > 	at com.carrotsearch.randomizedtesting.rules.SystemPropertiesInvariantRule$1.evaluate(SystemPropertiesInvariantRule.java:55)
[junit4:junit4]    > 	at com.carrotsearch.randomizedtesting.rules.NoShadowingOrOverridesOnMethodsRule$1.evaluate(NoShadowingOrOverridesOnMethodsRule.java:39)
[junit4:junit4]    > 	at com.carrotsearch.randomizedtesting.rules.NoShadowingOrOverridesOnMethodsRule$1.evaluate(NoShadowingOrOverridesOnMethodsRule.java:39)
[junit4:junit4]    > 	at com.carrotsearch.randomizedtesting.rules.StatementAdapter.evaluate(StatementAdapter.java:36)
[junit4:junit4]    > 	at org.apache.lucene.util.TestRuleAssertionsRequired$1.evaluate(TestRuleAssertionsRequired.java:43)
[junit4:junit4]    > 	at org.apache.lucene.util.TestRuleMarkFailure$1.evaluate(TestRuleMarkFailure.java:48)
[junit4:junit4]    > 	at org.apache.lucene.util.TestRuleIgnoreAfterMaxFailures$1.evaluate(TestRuleIgnoreAfterMaxFailures.java:70)
[junit4:junit4]    > 	at org.apache.lucene.util.TestRuleIgnoreTestSuites$1.evaluate(TestRuleIgnoreTestSuites.java:55)
[junit4:junit4]    > 	at com.carrotsearch.randomizedtesting.rules.StatementAdapter.evaluate(StatementAdapter.java:36)
[junit4:junit4]    > 	at com.carrotsearch.randomizedtesting.ThreadLeakControl$StatementRunner.run(ThreadLeakControl.java:358)
[junit4:junit4]    > 	at java.lang.Thread.run(Thread.java:680)
[junit4:junit4] Completed in 256.67s, 3 tests, 1 failure <<< FAILURES!

[...truncated 757 lines...]
BUILD FAILED
/Users/jenkins/jenkins-slave/workspace/Lucene-Solr-4.x-MacOSX/build.xml:381: The following error occurred while executing this line:
/Users/jenkins/jenkins-slave/workspace/Lucene-Solr-4.x-MacOSX/build.xml:361: The following error occurred while executing this line:
/Users/jenkins/jenkins-slave/workspace/Lucene-Solr-4.x-MacOSX/build.xml:39: The following error occurred while executing this line:
/Users/jenkins/jenkins-slave/workspace/Lucene-Solr-4.x-MacOSX/solr/build.xml:183: The following error occurred while executing this line:
/Users/jenkins/jenkins-slave/workspace/Lucene-Solr-4.x-MacOSX/solr/common-build.xml:447: The following error occurred while executing this line:
/Users/jenkins/jenkins-slave/workspace/Lucene-Solr-4.x-MacOSX/lucene/common-build.xml:1202: The following error occurred while executing this line:
/Users/jenkins/jenkins-slave/workspace/Lucene-Solr-4.x-MacOSX/lucene/common-build.xml:865: There were test failures: 251 suites, 1043 tests, 1 suite-level error, 13 ignored (2 assumptions)

Total time: 69 minutes 41 seconds
Build step 'Invoke Ant' marked build as failure
Archiving artifacts
Recording test results
Description set: Java: 64bit/jdk1.6.0 -XX:+UseParallelGC
Email was triggered for: Failure
Sending email for trigger: Failure



Mime
View raw message