lucene-dev mailing list archives

Site index · List index
Message view « Date » · « Thread »
Top « Date » · « Thread »
From Policeman Jenkins Server <jenk...@thetaphi.de>
Subject [JENKINS] Lucene-Solr-trunk-MacOSX (64bit/jdk1.7.0) - Build # 178 - Still Failing!
Date Sun, 03 Feb 2013 15:47:30 GMT
Build: http://jenkins.thetaphi.de/job/Lucene-Solr-trunk-MacOSX/178/
Java: 64bit/jdk1.7.0 -XX:+UseParallelGC

1 tests failed.
REGRESSION:  org.apache.solr.cloud.BasicDistributedZkTest.testDistribSearch

Error Message:
There are still nodes recoverying - waited for 230 seconds

Stack Trace:
java.lang.AssertionError: There are still nodes recoverying - waited for 230 seconds
	at __randomizedtesting.SeedInfo.seed([3C821F5DBFE87C0C:BD649145C8B71C30]:0)
	at org.junit.Assert.fail(Assert.java:93)
	at org.apache.solr.cloud.AbstractDistribZkTestBase.waitForRecoveriesToFinish(AbstractDistribZkTestBase.java:168)
	at org.apache.solr.cloud.AbstractDistribZkTestBase.waitForRecoveriesToFinish(AbstractDistribZkTestBase.java:126)
	at org.apache.solr.cloud.AbstractDistribZkTestBase.waitForRecoveriesToFinish(AbstractDistribZkTestBase.java:121)
	at org.apache.solr.cloud.BasicDistributedZkTest.testCoreUnloadAndLeaders(BasicDistributedZkTest.java:458)
	at org.apache.solr.cloud.BasicDistributedZkTest.doTest(BasicDistributedZkTest.java:337)
	at org.apache.solr.BaseDistributedSearchTestCase.testDistribSearch(BaseDistributedSearchTestCase.java:794)
	at sun.reflect.NativeMethodAccessorImpl.invoke0(Native Method)
	at sun.reflect.NativeMethodAccessorImpl.invoke(NativeMethodAccessorImpl.java:57)
	at sun.reflect.DelegatingMethodAccessorImpl.invoke(DelegatingMethodAccessorImpl.java:43)
	at java.lang.reflect.Method.invoke(Method.java:601)
	at com.carrotsearch.randomizedtesting.RandomizedRunner.invoke(RandomizedRunner.java:1559)
	at com.carrotsearch.randomizedtesting.RandomizedRunner.access$600(RandomizedRunner.java:79)
	at com.carrotsearch.randomizedtesting.RandomizedRunner$6.evaluate(RandomizedRunner.java:737)
	at com.carrotsearch.randomizedtesting.RandomizedRunner$7.evaluate(RandomizedRunner.java:773)
	at com.carrotsearch.randomizedtesting.RandomizedRunner$8.evaluate(RandomizedRunner.java:787)
	at com.carrotsearch.randomizedtesting.rules.SystemPropertiesRestoreRule$1.evaluate(SystemPropertiesRestoreRule.java:53)
	at org.apache.lucene.util.TestRuleSetupTeardownChained$1.evaluate(TestRuleSetupTeardownChained.java:50)
	at org.apache.lucene.util.TestRuleFieldCacheSanity$1.evaluate(TestRuleFieldCacheSanity.java:51)
	at org.apache.lucene.util.AbstractBeforeAfterRule$1.evaluate(AbstractBeforeAfterRule.java:46)
	at com.carrotsearch.randomizedtesting.rules.SystemPropertiesInvariantRule$1.evaluate(SystemPropertiesInvariantRule.java:55)
	at org.apache.lucene.util.TestRuleThreadAndTestName$1.evaluate(TestRuleThreadAndTestName.java:49)
	at org.apache.lucene.util.TestRuleIgnoreAfterMaxFailures$1.evaluate(TestRuleIgnoreAfterMaxFailures.java:70)
	at org.apache.lucene.util.TestRuleMarkFailure$1.evaluate(TestRuleMarkFailure.java:48)
	at com.carrotsearch.randomizedtesting.rules.StatementAdapter.evaluate(StatementAdapter.java:36)
	at com.carrotsearch.randomizedtesting.ThreadLeakControl$StatementRunner.run(ThreadLeakControl.java:358)
	at com.carrotsearch.randomizedtesting.ThreadLeakControl.forkTimeoutingTask(ThreadLeakControl.java:782)
	at com.carrotsearch.randomizedtesting.ThreadLeakControl$3.evaluate(ThreadLeakControl.java:442)
	at com.carrotsearch.randomizedtesting.RandomizedRunner.runSingleTest(RandomizedRunner.java:746)
	at com.carrotsearch.randomizedtesting.RandomizedRunner$3.evaluate(RandomizedRunner.java:648)
	at com.carrotsearch.randomizedtesting.RandomizedRunner$4.evaluate(RandomizedRunner.java:682)
	at com.carrotsearch.randomizedtesting.RandomizedRunner$5.evaluate(RandomizedRunner.java:693)
	at com.carrotsearch.randomizedtesting.rules.StatementAdapter.evaluate(StatementAdapter.java:36)
	at com.carrotsearch.randomizedtesting.rules.SystemPropertiesRestoreRule$1.evaluate(SystemPropertiesRestoreRule.java:53)
	at org.apache.lucene.util.AbstractBeforeAfterRule$1.evaluate(AbstractBeforeAfterRule.java:46)
	at org.apache.lucene.util.TestRuleStoreClassName$1.evaluate(TestRuleStoreClassName.java:42)
	at com.carrotsearch.randomizedtesting.rules.SystemPropertiesInvariantRule$1.evaluate(SystemPropertiesInvariantRule.java:55)
	at com.carrotsearch.randomizedtesting.rules.NoShadowingOrOverridesOnMethodsRule$1.evaluate(NoShadowingOrOverridesOnMethodsRule.java:39)
	at com.carrotsearch.randomizedtesting.rules.NoShadowingOrOverridesOnMethodsRule$1.evaluate(NoShadowingOrOverridesOnMethodsRule.java:39)
	at com.carrotsearch.randomizedtesting.rules.StatementAdapter.evaluate(StatementAdapter.java:36)
	at org.apache.lucene.util.TestRuleAssertionsRequired$1.evaluate(TestRuleAssertionsRequired.java:43)
	at org.apache.lucene.util.TestRuleMarkFailure$1.evaluate(TestRuleMarkFailure.java:48)
	at org.apache.lucene.util.TestRuleIgnoreAfterMaxFailures$1.evaluate(TestRuleIgnoreAfterMaxFailures.java:70)
	at org.apache.lucene.util.TestRuleIgnoreTestSuites$1.evaluate(TestRuleIgnoreTestSuites.java:55)
	at com.carrotsearch.randomizedtesting.rules.StatementAdapter.evaluate(StatementAdapter.java:36)
	at com.carrotsearch.randomizedtesting.ThreadLeakControl$StatementRunner.run(ThreadLeakControl.java:358)
	at java.lang.Thread.run(Thread.java:722)




Build Log:
[...truncated 8980 lines...]
[junit4:junit4] Suite: org.apache.solr.cloud.BasicDistributedZkTest
[junit4:junit4]   2> 0 T2237 oas.BaseDistributedSearchTestCase.initHostContext Setting hostContext system property: /
[junit4:junit4]   2> 7 T2237 oas.SolrTestCaseJ4.setUp ###Starting testDistribSearch
[junit4:junit4]   2> Creating dataDir: /Users/jenkins/jenkins-slave/workspace/Lucene-Solr-trunk-MacOSX/solr/build/solr-core/test/J0/./solrtest-BasicDistributedZkTest-1359905507479
[junit4:junit4]   2> 9 T2237 oasc.ZkTestServer.run STARTING ZK TEST SERVER
[junit4:junit4]   2> 10 T2238 oasc.ZkTestServer$ZKServerMain.runFromConfig Starting server
[junit4:junit4]   2> 13 T2238 oazs.ZooKeeperServer.setTickTime tickTime set to 1000
[junit4:junit4]   2> 13 T2238 oazs.ZooKeeperServer.setMinSessionTimeout minSessionTimeout set to -1
[junit4:junit4]   2> 14 T2238 oazs.ZooKeeperServer.setMaxSessionTimeout maxSessionTimeout set to -1
[junit4:junit4]   2> 14 T2238 oazs.NIOServerCnxnFactory.configure binding to port 0.0.0.0/0.0.0.0:0
[junit4:junit4]   2> 16 T2238 oazsp.FileTxnSnapLog.save Snapshotting: 0x0 to /Users/jenkins/jenkins-slave/workspace/Lucene-Solr-trunk-MacOSX/solr/build/solr-core/test/J0/./org.apache.solr.cloud.BasicDistributedZkTest-1359905507479/zookeeper/server1/data/version-2/snapshot.0
[junit4:junit4]   2> 114 T2237 oasc.ZkTestServer.run start zk server on port:49872
[junit4:junit4]   2> 115 T2237 oaz.ZooKeeper.<init> Initiating client connection, connectString=127.0.0.1:49872 sessionTimeout=10000 watcher=org.apache.solr.common.cloud.ConnectionManager@6ef101c9
[junit4:junit4]   2> 116 T2237 oascc.ConnectionManager.waitForConnected Waiting for client to connect to ZooKeeper
[junit4:junit4]   2> 117 T2243 oaz.ClientCnxn$SendThread.logStartConnect Opening socket connection to server localhost/127.0.0.1:49872. Will not attempt to authenticate using SASL (access denied ("javax.security.auth.AuthPermission" "getLoginConfiguration"))
[junit4:junit4]   2> 117 T2243 oaz.ClientCnxn$SendThread.primeConnection Socket connection established to localhost/127.0.0.1:49872, initiating session
[junit4:junit4]   2> 118 T2239 oazs.NIOServerCnxnFactory.run Accepted socket connection from /127.0.0.1:49873
[junit4:junit4]   2> 118 T2239 oazs.ZooKeeperServer.processConnectRequest Client attempting to establish new session at /127.0.0.1:49873
[junit4:junit4]   2> 119 T2241 oazsp.FileTxnLog.append Creating new log file: log.1
[junit4:junit4]   2> 120 T2241 oazs.ZooKeeperServer.finishSessionInit Established session 0x13ca0af48aa0000 with negotiated timeout 10000 for client /127.0.0.1:49873
[junit4:junit4]   2> 121 T2243 oaz.ClientCnxn$SendThread.onConnected Session establishment complete on server localhost/127.0.0.1:49872, sessionid = 0x13ca0af48aa0000, negotiated timeout = 10000
[junit4:junit4]   2> 121 T2244 oascc.ConnectionManager.process Watcher org.apache.solr.common.cloud.ConnectionManager@6ef101c9 name:ZooKeeperConnection Watcher:127.0.0.1:49872 got event WatchedEvent state:SyncConnected type:None path:null path:null type:None
[junit4:junit4]   2> 122 T2237 oascc.ConnectionManager.waitForConnected Client is connected to ZooKeeper
[junit4:junit4]   2> 122 T2237 oascc.SolrZkClient.makePath makePath: /solr
[junit4:junit4]   2> 128 T2242 oazs.PrepRequestProcessor.pRequest2Txn Processed session termination for sessionid: 0x13ca0af48aa0000
[junit4:junit4]   2> 129 T2239 oazs.NIOServerCnxn.closeSock Closed socket connection for client /127.0.0.1:49873 which had sessionid 0x13ca0af48aa0000
[junit4:junit4]   2> 129 T2237 oaz.ZooKeeper.close Session: 0x13ca0af48aa0000 closed
[junit4:junit4]   2> 129 T2244 oaz.ClientCnxn$EventThread.run EventThread shut down
[junit4:junit4]   2> 130 T2237 oaz.ZooKeeper.<init> Initiating client connection, connectString=127.0.0.1:49872/solr sessionTimeout=10000 watcher=org.apache.solr.common.cloud.ConnectionManager@63bc10cb
[junit4:junit4]   2> 131 T2237 oascc.ConnectionManager.waitForConnected Waiting for client to connect to ZooKeeper
[junit4:junit4]   2> 131 T2245 oaz.ClientCnxn$SendThread.logStartConnect Opening socket connection to server localhost/127.0.0.1:49872. Will not attempt to authenticate using SASL (access denied ("javax.security.auth.AuthPermission" "getLoginConfiguration"))
[junit4:junit4]   2> 132 T2245 oaz.ClientCnxn$SendThread.primeConnection Socket connection established to localhost/127.0.0.1:49872, initiating session
[junit4:junit4]   2> 132 T2239 oazs.NIOServerCnxnFactory.run Accepted socket connection from /127.0.0.1:49874
[junit4:junit4]   2> 133 T2239 oazs.ZooKeeperServer.processConnectRequest Client attempting to establish new session at /127.0.0.1:49874
[junit4:junit4]   2> 134 T2241 oazs.ZooKeeperServer.finishSessionInit Established session 0x13ca0af48aa0001 with negotiated timeout 10000 for client /127.0.0.1:49874
[junit4:junit4]   2> 134 T2245 oaz.ClientCnxn$SendThread.onConnected Session establishment complete on server localhost/127.0.0.1:49872, sessionid = 0x13ca0af48aa0001, negotiated timeout = 10000
[junit4:junit4]   2> 135 T2246 oascc.ConnectionManager.process Watcher org.apache.solr.common.cloud.ConnectionManager@63bc10cb name:ZooKeeperConnection Watcher:127.0.0.1:49872/solr got event WatchedEvent state:SyncConnected type:None path:null path:null type:None
[junit4:junit4]   2> 135 T2237 oascc.ConnectionManager.waitForConnected Client is connected to ZooKeeper
[junit4:junit4]   2> 136 T2237 oascc.SolrZkClient.makePath makePath: /collections/collection1
[junit4:junit4]   2> 142 T2237 oascc.SolrZkClient.makePath makePath: /collections/collection1/shards
[junit4:junit4]   2> 147 T2237 oascc.SolrZkClient.makePath makePath: /collections/control_collection
[junit4:junit4]   2> 151 T2237 oascc.SolrZkClient.makePath makePath: /collections/control_collection/shards
[junit4:junit4]   2> 155 T2237 oasc.AbstractZkTestCase.putConfig put /Users/jenkins/jenkins-slave/workspace/Lucene-Solr-trunk-MacOSX/solr/build/solr-core/test-files/solr/collection1/conf/solrconfig.xml to /configs/conf1/solrconfig.xml
[junit4:junit4]   2> 155 T2237 oascc.SolrZkClient.makePath makePath: /configs/conf1/solrconfig.xml
[junit4:junit4]   2> 161 T2237 oasc.AbstractZkTestCase.putConfig put /Users/jenkins/jenkins-slave/workspace/Lucene-Solr-trunk-MacOSX/solr/build/solr-core/test-files/solr/collection1/conf/schema.xml to /configs/conf1/schema.xml
[junit4:junit4]   2> 161 T2237 oascc.SolrZkClient.makePath makePath: /configs/conf1/schema.xml
[junit4:junit4]   2> 167 T2237 oasc.AbstractZkTestCase.putConfig put /Users/jenkins/jenkins-slave/workspace/Lucene-Solr-trunk-MacOSX/solr/build/solr-core/test-files/solr/collection1/conf/stopwords.txt to /configs/conf1/stopwords.txt
[junit4:junit4]   2> 168 T2237 oascc.SolrZkClient.makePath makePath: /configs/conf1/stopwords.txt
[junit4:junit4]   2> 173 T2237 oasc.AbstractZkTestCase.putConfig put /Users/jenkins/jenkins-slave/workspace/Lucene-Solr-trunk-MacOSX/solr/build/solr-core/test-files/solr/collection1/conf/protwords.txt to /configs/conf1/protwords.txt
[junit4:junit4]   2> 174 T2237 oascc.SolrZkClient.makePath makePath: /configs/conf1/protwords.txt
[junit4:junit4]   2> 178 T2237 oasc.AbstractZkTestCase.putConfig put /Users/jenkins/jenkins-slave/workspace/Lucene-Solr-trunk-MacOSX/solr/build/solr-core/test-files/solr/collection1/conf/currency.xml to /configs/conf1/currency.xml
[junit4:junit4]   2> 179 T2237 oascc.SolrZkClient.makePath makePath: /configs/conf1/currency.xml
[junit4:junit4]   2> 184 T2237 oasc.AbstractZkTestCase.putConfig put /Users/jenkins/jenkins-slave/workspace/Lucene-Solr-trunk-MacOSX/solr/build/solr-core/test-files/solr/collection1/conf/open-exchange-rates.json to /configs/conf1/open-exchange-rates.json
[junit4:junit4]   2> 185 T2237 oascc.SolrZkClient.makePath makePath: /configs/conf1/open-exchange-rates.json
[junit4:junit4]   2> 191 T2237 oasc.AbstractZkTestCase.putConfig put /Users/jenkins/jenkins-slave/workspace/Lucene-Solr-trunk-MacOSX/solr/build/solr-core/test-files/solr/collection1/conf/mapping-ISOLatin1Accent.txt to /configs/conf1/mapping-ISOLatin1Accent.txt
[junit4:junit4]   2> 191 T2237 oascc.SolrZkClient.makePath makePath: /configs/conf1/mapping-ISOLatin1Accent.txt
[junit4:junit4]   2> 197 T2237 oasc.AbstractZkTestCase.putConfig put /Users/jenkins/jenkins-slave/workspace/Lucene-Solr-trunk-MacOSX/solr/build/solr-core/test-files/solr/collection1/conf/old_synonyms.txt to /configs/conf1/old_synonyms.txt
[junit4:junit4]   2> 198 T2237 oascc.SolrZkClient.makePath makePath: /configs/conf1/old_synonyms.txt
[junit4:junit4]   2> 203 T2237 oasc.AbstractZkTestCase.putConfig put /Users/jenkins/jenkins-slave/workspace/Lucene-Solr-trunk-MacOSX/solr/build/solr-core/test-files/solr/collection1/conf/synonyms.txt to /configs/conf1/synonyms.txt
[junit4:junit4]   2> 203 T2237 oascc.SolrZkClient.makePath makePath: /configs/conf1/synonyms.txt
[junit4:junit4]   2> 210 T2242 oazs.PrepRequestProcessor.pRequest2Txn Processed session termination for sessionid: 0x13ca0af48aa0001
[junit4:junit4]   2> 211 T2239 oazs.NIOServerCnxn.closeSock Closed socket connection for client /127.0.0.1:49874 which had sessionid 0x13ca0af48aa0001
[junit4:junit4]   2> 211 T2246 oaz.ClientCnxn$EventThread.run EventThread shut down
[junit4:junit4]   2> 211 T2237 oaz.ZooKeeper.close Session: 0x13ca0af48aa0001 closed
[junit4:junit4]   2> 403 T2237 oejs.Server.doStart jetty-8.1.8.v20121106
[junit4:junit4]   2> 407 T2237 oejs.AbstractConnector.doStart Started SelectChannelConnector@127.0.0.1:49875
[junit4:junit4]   2> 409 T2237 oass.SolrDispatchFilter.init SolrDispatchFilter.init()
[junit4:junit4]   2> 410 T2237 oasc.SolrResourceLoader.locateSolrHome JNDI not configured for solr (NoInitialContextEx)
[junit4:junit4]   2> 410 T2237 oasc.SolrResourceLoader.locateSolrHome using system property solr.solr.home: /Users/jenkins/jenkins-slave/workspace/Lucene-Solr-trunk-MacOSX/solr/build/solr-core/test/J0/./org.apache.solr.cloud.BasicDistributedZkTest-controljetty-1359905507683
[junit4:junit4]   2> 411 T2237 oasc.CoreContainer$Initializer.initialize looking for solr.xml: /Users/jenkins/jenkins-slave/workspace/Lucene-Solr-trunk-MacOSX/solr/build/solr-core/test/J0/./org.apache.solr.cloud.BasicDistributedZkTest-controljetty-1359905507683/solr.xml
[junit4:junit4]   2> 412 T2237 oasc.CoreContainer.<init> New CoreContainer 1814343678
[junit4:junit4]   2> 413 T2237 oasc.CoreContainer.load Loading CoreContainer using Solr Home: '/Users/jenkins/jenkins-slave/workspace/Lucene-Solr-trunk-MacOSX/solr/build/solr-core/test/J0/./org.apache.solr.cloud.BasicDistributedZkTest-controljetty-1359905507683/'
[junit4:junit4]   2> 414 T2237 oasc.SolrResourceLoader.<init> new SolrResourceLoader for directory: '/Users/jenkins/jenkins-slave/workspace/Lucene-Solr-trunk-MacOSX/solr/build/solr-core/test/J0/./org.apache.solr.cloud.BasicDistributedZkTest-controljetty-1359905507683/'
[junit4:junit4]   2> 482 T2237 oashc.HttpShardHandlerFactory.getParameter Setting socketTimeout to: 60000
[junit4:junit4]   2> 484 T2237 oashc.HttpShardHandlerFactory.getParameter Setting urlScheme to: http://
[junit4:junit4]   2> 485 T2237 oashc.HttpShardHandlerFactory.getParameter Setting connTimeout to: 15000
[junit4:junit4]   2> 485 T2237 oashc.HttpShardHandlerFactory.getParameter Setting maxConnectionsPerHost to: 20
[junit4:junit4]   2> 486 T2237 oashc.HttpShardHandlerFactory.getParameter Setting corePoolSize to: 0
[junit4:junit4]   2> 487 T2237 oashc.HttpShardHandlerFactory.getParameter Setting maximumPoolSize to: 2147483647
[junit4:junit4]   2> 488 T2237 oashc.HttpShardHandlerFactory.getParameter Setting maxThreadIdleTime to: 5
[junit4:junit4]   2> 489 T2237 oashc.HttpShardHandlerFactory.getParameter Setting sizeOfQueue to: -1
[junit4:junit4]   2> 489 T2237 oashc.HttpShardHandlerFactory.getParameter Setting fairnessPolicy to: false
[junit4:junit4]   2> 490 T2237 oascsi.HttpClientUtil.createClient Creating new http client, config:maxConnectionsPerHost=20&maxConnections=10000&socketTimeout=60000&connTimeout=15000&retry=false
[junit4:junit4]   2> 506 T2237 oasc.CoreContainer.load Registering Log Listener
[junit4:junit4]   2> 527 T2237 oasc.CoreContainer.initZooKeeper Zookeeper client=127.0.0.1:49872/solr
[junit4:junit4]   2> 528 T2237 oasc.ZkController.checkChrootPath zkHost includes chroot
[junit4:junit4]   2> 528 T2237 oaz.ZooKeeper.<init> Initiating client connection, connectString=127.0.0.1:49872 sessionTimeout=60000 watcher=org.apache.solr.common.cloud.ConnectionManager@7f27b6e1
[junit4:junit4]   2> 530 T2256 oaz.ClientCnxn$SendThread.logStartConnect Opening socket connection to server localhost/127.0.0.1:49872. Will not attempt to authenticate using SASL (access denied ("javax.security.auth.AuthPermission" "getLoginConfiguration"))
[junit4:junit4]   2> 529 T2237 oascc.ConnectionManager.waitForConnected Waiting for client to connect to ZooKeeper
[junit4:junit4]   2> 530 T2256 oaz.ClientCnxn$SendThread.primeConnection Socket connection established to localhost/127.0.0.1:49872, initiating session
[junit4:junit4]   2> 531 T2239 oazs.NIOServerCnxnFactory.run Accepted socket connection from /127.0.0.1:49876
[junit4:junit4]   2> 532 T2239 oazs.ZooKeeperServer.processConnectRequest Client attempting to establish new session at /127.0.0.1:49876
[junit4:junit4]   2> 533 T2241 oazs.ZooKeeperServer.finishSessionInit Established session 0x13ca0af48aa0002 with negotiated timeout 20000 for client /127.0.0.1:49876
[junit4:junit4]   2> 533 T2256 oaz.ClientCnxn$SendThread.onConnected Session establishment complete on server localhost/127.0.0.1:49872, sessionid = 0x13ca0af48aa0002, negotiated timeout = 20000
[junit4:junit4]   2> 534 T2257 oascc.ConnectionManager.process Watcher org.apache.solr.common.cloud.ConnectionManager@7f27b6e1 name:ZooKeeperConnection Watcher:127.0.0.1:49872 got event WatchedEvent state:SyncConnected type:None path:null path:null type:None
[junit4:junit4]   2> 535 T2237 oascc.ConnectionManager.waitForConnected Client is connected to ZooKeeper
[junit4:junit4]   2> 537 T2242 oazs.PrepRequestProcessor.pRequest2Txn Processed session termination for sessionid: 0x13ca0af48aa0002
[junit4:junit4]   2> 539 T2239 oazs.NIOServerCnxn.closeSock Closed socket connection for client /127.0.0.1:49876 which had sessionid 0x13ca0af48aa0002
[junit4:junit4]   2> 539 T2237 oaz.ZooKeeper.close Session: 0x13ca0af48aa0002 closed
[junit4:junit4]   2> 539 T2257 oaz.ClientCnxn$EventThread.run EventThread shut down
[junit4:junit4]   2> 540 T2237 oascsi.HttpClientUtil.createClient Creating new http client, config:maxConnections=500&maxConnectionsPerHost=16&socketTimeout=60000&connTimeout=15000
[junit4:junit4]   2> 545 T2237 oaz.ZooKeeper.<init> Initiating client connection, connectString=127.0.0.1:49872/solr sessionTimeout=30000 watcher=org.apache.solr.common.cloud.ConnectionManager@d43d404
[junit4:junit4]   2> 546 T2237 oascc.ConnectionManager.waitForConnected Waiting for client to connect to ZooKeeper
[junit4:junit4]   2> 547 T2258 oaz.ClientCnxn$SendThread.logStartConnect Opening socket connection to server localhost/127.0.0.1:49872. Will not attempt to authenticate using SASL (access denied ("javax.security.auth.AuthPermission" "getLoginConfiguration"))
[junit4:junit4]   2> 548 T2258 oaz.ClientCnxn$SendThread.primeConnection Socket connection established to localhost/127.0.0.1:49872, initiating session
[junit4:junit4]   2> 549 T2239 oazs.NIOServerCnxnFactory.run Accepted socket connection from /127.0.0.1:49877
[junit4:junit4]   2> 550 T2239 oazs.ZooKeeperServer.processConnectRequest Client attempting to establish new session at /127.0.0.1:49877
[junit4:junit4]   2> 551 T2241 oazs.ZooKeeperServer.finishSessionInit Established session 0x13ca0af48aa0003 with negotiated timeout 20000 for client /127.0.0.1:49877
[junit4:junit4]   2> 551 T2258 oaz.ClientCnxn$SendThread.onConnected Session establishment complete on server localhost/127.0.0.1:49872, sessionid = 0x13ca0af48aa0003, negotiated timeout = 20000
[junit4:junit4]   2> 552 T2259 oascc.ConnectionManager.process Watcher org.apache.solr.common.cloud.ConnectionManager@d43d404 name:ZooKeeperConnection Watcher:127.0.0.1:49872/solr got event WatchedEvent state:SyncConnected type:None path:null path:null type:None
[junit4:junit4]   2> 553 T2237 oascc.ConnectionManager.waitForConnected Client is connected to ZooKeeper
[junit4:junit4]   2> 556 T2242 oazs.PrepRequestProcessor.pRequest Got user-level KeeperException when processing sessionid:0x13ca0af48aa0003 type:create cxid:0x2 zxid:0x1a txntype:-1 reqpath:n/a Error Path:/solr/overseer Error:KeeperErrorCode = NodeExists for /solr/overseer
[junit4:junit4]   2> 558 T2237 oascc.SolrZkClient.makePath makePath: /live_nodes
[junit4:junit4]   2> 570 T2237 oasc.ZkController.createEphemeralLiveNode Register node as live in ZooKeeper:/live_nodes/127.0.0.1:49875_
[junit4:junit4]   2> 572 T2242 oazs.PrepRequestProcessor.pRequest Got user-level KeeperException when processing sessionid:0x13ca0af48aa0003 type:delete cxid:0x7 zxid:0x1c txntype:-1 reqpath:n/a Error Path:/solr/live_nodes/127.0.0.1:49875_ Error:KeeperErrorCode = NoNode for /solr/live_nodes/127.0.0.1:49875_
[junit4:junit4]   2> 573 T2237 oascc.SolrZkClient.makePath makePath: /live_nodes/127.0.0.1:49875_
[junit4:junit4]   2> 578 T2237 oascc.SolrZkClient.makePath makePath: /overseer_elect/election
[junit4:junit4]   2> 587 T2242 oazs.PrepRequestProcessor.pRequest Got user-level KeeperException when processing sessionid:0x13ca0af48aa0003 type:delete cxid:0x15 zxid:0x21 txntype:-1 reqpath:n/a Error Path:/solr/overseer_elect/leader Error:KeeperErrorCode = NoNode for /solr/overseer_elect/leader
[junit4:junit4]   2> 588 T2237 oascc.SolrZkClient.makePath makePath: /overseer_elect/leader
[junit4:junit4]   2> 592 T2237 oasc.Overseer.start Overseer (id=89122767339388931-127.0.0.1:49875_-n_0000000000) starting
[junit4:junit4]   2> 593 T2242 oazs.PrepRequestProcessor.pRequest Got user-level KeeperException when processing sessionid:0x13ca0af48aa0003 type:create cxid:0x1a zxid:0x23 txntype:-1 reqpath:n/a Error Path:/solr/overseer Error:KeeperErrorCode = NodeExists for /solr/overseer
[junit4:junit4]   2> 594 T2242 oazs.PrepRequestProcessor.pRequest Got user-level KeeperException when processing sessionid:0x13ca0af48aa0003 type:create cxid:0x1b zxid:0x24 txntype:-1 reqpath:n/a Error Path:/solr/overseer Error:KeeperErrorCode = NodeExists for /solr/overseer
[junit4:junit4]   2> 595 T2242 oazs.PrepRequestProcessor.pRequest Got user-level KeeperException when processing sessionid:0x13ca0af48aa0003 type:create cxid:0x1c zxid:0x25 txntype:-1 reqpath:n/a Error Path:/solr/overseer Error:KeeperErrorCode = NodeExists for /solr/overseer
[junit4:junit4]   2> 597 T2242 oazs.PrepRequestProcessor.pRequest Got user-level KeeperException when processing sessionid:0x13ca0af48aa0003 type:create cxid:0x1d zxid:0x26 txntype:-1 reqpath:n/a Error Path:/solr/overseer Error:KeeperErrorCode = NodeExists for /solr/overseer
[junit4:junit4]   2> 598 T2261 oasc.OverseerCollectionProcessor.run Process current queue of collection creations
[junit4:junit4]   2> 600 T2237 oascc.SolrZkClient.makePath makePath: /clusterstate.json
[junit4:junit4]   2> 605 T2237 oascc.ZkStateReader.createClusterStateWatchersAndUpdate Updating cluster state from ZooKeeper... 
[junit4:junit4]   2> 615 T2262 oasc.CoreContainer.create Creating SolrCore 'collection1' using instanceDir: /Users/jenkins/jenkins-slave/workspace/Lucene-Solr-trunk-MacOSX/solr/build/solr-core/test/J0/./org.apache.solr.cloud.BasicDistributedZkTest-controljetty-1359905507683/collection1
[junit4:junit4]   2> 615 T2262 oasc.ZkController.createCollectionZkNode Check for collection zkNode:control_collection
[junit4:junit4]   2> 616 T2260 oasc.Overseer$ClusterStateUpdater.run Starting to work on the main queue
[junit4:junit4]   2> 617 T2262 oasc.ZkController.createCollectionZkNode Collection zkNode exists
[junit4:junit4]   2> 617 T2262 oasc.ZkController.readConfigName Load collection config from:/collections/control_collection
[junit4:junit4]   2> 620 T2262 oasc.SolrResourceLoader.<init> new SolrResourceLoader for directory: '/Users/jenkins/jenkins-slave/workspace/Lucene-Solr-trunk-MacOSX/solr/build/solr-core/test/J0/./org.apache.solr.cloud.BasicDistributedZkTest-controljetty-1359905507683/collection1/'
[junit4:junit4]   2> 621 T2262 oasc.SolrResourceLoader.replaceClassLoader Adding 'file:/Users/jenkins/jenkins-slave/workspace/Lucene-Solr-trunk-MacOSX/solr/build/solr-core/test/J0/org.apache.solr.cloud.BasicDistributedZkTest-controljetty-1359905507683/collection1/lib/classes/' to classloader
[junit4:junit4]   2> 621 T2262 oasc.SolrResourceLoader.replaceClassLoader Adding 'file:/Users/jenkins/jenkins-slave/workspace/Lucene-Solr-trunk-MacOSX/solr/build/solr-core/test/J0/org.apache.solr.cloud.BasicDistributedZkTest-controljetty-1359905507683/collection1/lib/README' to classloader
[junit4:junit4]   2> 672 T2262 oasc.SolrConfig.<init> Using Lucene MatchVersion: LUCENE_50
[junit4:junit4]   2> 734 T2262 oasc.SolrConfig.<init> Loaded SolrConfig: solrconfig.xml
[junit4:junit4]   2> 736 T2262 oass.IndexSchema.readSchema Reading Solr Schema
[junit4:junit4]   2> 740 T2262 oass.IndexSchema.readSchema Schema name=test
[junit4:junit4]   2> 1305 T2262 oass.OpenExchangeRatesOrgProvider.init Initialized with rates=open-exchange-rates.json, refreshInterval=1440.
[junit4:junit4]   2> 1316 T2262 oass.IndexSchema.readSchema default search field in schema is text
[junit4:junit4]   2> 1322 T2262 oass.IndexSchema.readSchema unique key field: id
[junit4:junit4]   2> 1349 T2262 oass.FileExchangeRateProvider.reload Reloading exchange rates from file currency.xml
[junit4:junit4]   2> 1354 T2262 oass.FileExchangeRateProvider.reload Reloading exchange rates from file currency.xml
[junit4:junit4]   2> 1359 T2262 oass.OpenExchangeRatesOrgProvider.reload Reloading exchange rates from open-exchange-rates.json
[junit4:junit4]   2> 1361 T2262 oass.OpenExchangeRatesOrgProvider.reload Reloading exchange rates from open-exchange-rates.json
[junit4:junit4]   2> 1363 T2262 oasc.SolrCore.<init> [collection1] Opening new SolrCore at /Users/jenkins/jenkins-slave/workspace/Lucene-Solr-trunk-MacOSX/solr/build/solr-core/test/J0/./org.apache.solr.cloud.BasicDistributedZkTest-controljetty-1359905507683/collection1/, dataDir=./org.apache.solr.cloud.BasicDistributedZkTest-1359905507479/control/data/
[junit4:junit4]   2> 1364 T2262 oasc.JmxMonitoredMap.<init> JMX monitoring is enabled. Adding Solr mbeans to JMX Server: com.sun.jmx.mbeanserver.JmxMBeanServer@685d72cd
[junit4:junit4]   2> 1364 T2262 oasc.SolrCore.initDirectoryFactory solr.NRTCachingDirectoryFactory
[junit4:junit4]   2> 1365 T2262 oasc.CachingDirectoryFactory.get return new directory for /Users/jenkins/jenkins-slave/workspace/Lucene-Solr-trunk-MacOSX/solr/build/solr-core/test/J0/./org.apache.solr.cloud.BasicDistributedZkTest-1359905507479/control/data forceNew:false
[junit4:junit4]   2> 1365 T2262 oasc.CachingDirectoryFactory.close Releasing directory:/Users/jenkins/jenkins-slave/workspace/Lucene-Solr-trunk-MacOSX/solr/build/solr-core/test/J0/./org.apache.solr.cloud.BasicDistributedZkTest-1359905507479/control/data
[junit4:junit4]   2> 1366 T2262 oasc.SolrCore.getNewIndexDir New index directory detected: old=null new=./org.apache.solr.cloud.BasicDistributedZkTest-1359905507479/control/data/index/
[junit4:junit4]   2> 1366 T2262 oasc.SolrCore.initIndex WARNING [collection1] Solr index directory './org.apache.solr.cloud.BasicDistributedZkTest-1359905507479/control/data/index' doesn't exist. Creating new index...
[junit4:junit4]   2> 1367 T2262 oasc.CachingDirectoryFactory.get return new directory for /Users/jenkins/jenkins-slave/workspace/Lucene-Solr-trunk-MacOSX/solr/build/solr-core/test/J0/./org.apache.solr.cloud.BasicDistributedZkTest-1359905507479/control/data/index forceNew:false
[junit4:junit4]   2> 1370 T2262 oasc.SolrDeletionPolicy.onCommit SolrDeletionPolicy.onCommit: commits:num=1
[junit4:junit4]   2> 		commit{dir=RateLimitedDirectoryWrapper(NRTCachingDirectory(org.apache.lucene.store.NIOFSDirectory@/Users/jenkins/jenkins-slave/workspace/Lucene-Solr-trunk-MacOSX/solr/build/solr-core/test/J0/org.apache.solr.cloud.BasicDistributedZkTest-1359905507479/control/data/index lockFactory=org.apache.lucene.store.NativeFSLockFactory@5bb5272b; maxCacheMB=48.0 maxMergeSizeMB=4.0)),segFN=segments_1,generation=1,filenames=[segments_1]
[junit4:junit4]   2> 1371 T2262 oasc.SolrDeletionPolicy.updateCommits newest commit = 1[segments_1]
[junit4:junit4]   2> 1372 T2262 oasc.CachingDirectoryFactory.close Releasing directory:/Users/jenkins/jenkins-slave/workspace/Lucene-Solr-trunk-MacOSX/solr/build/solr-core/test/J0/./org.apache.solr.cloud.BasicDistributedZkTest-1359905507479/control/data/index
[junit4:junit4]   2> 1372 T2262 oasc.SolrCore.initWriters created xml: solr.XMLResponseWriter
[junit4:junit4]   2> 1374 T2262 oasup.UpdateRequestProcessorChain.init inserting DistributedUpdateProcessorFactory into updateRequestProcessorChain "dedupe"
[junit4:junit4]   2> 1374 T2262 oasup.UpdateRequestProcessorChain.init inserting DistributedUpdateProcessorFactory into updateRequestProcessorChain "dedupe-allfields"
[junit4:junit4]   2> 1374 T2262 oasup.UpdateRequestProcessorChain.init inserting DistributedUpdateProcessorFactory into updateRequestProcessorChain "stored_sig"
[junit4:junit4]   2> 1375 T2262 oasup.UpdateRequestProcessorChain.init inserting DistributedUpdateProcessorFactory into updateRequestProcessorChain "uniq-fields"
[junit4:junit4]   2> 1375 T2262 oasup.UpdateRequestProcessorChain.init inserting DistributedUpdateProcessorFactory into updateRequestProcessorChain "distrib-dup-test-chain-implicit"
[junit4:junit4]   2> 1376 T2262 oasc.RequestHandlers.initHandlersFromConfig adding lazy requestHandler: solr.ReplicationHandler
[junit4:junit4]   2> 1376 T2262 oasc.RequestHandlers.initHandlersFromConfig created /replication: solr.ReplicationHandler
[junit4:junit4]   2> 1376 T2262 oasc.RequestHandlers.initHandlersFromConfig created standard: solr.StandardRequestHandler
[junit4:junit4]   2> 1377 T2262 oasc.RequestHandlers.initHandlersFromConfig created /get: solr.RealTimeGetHandler
[junit4:junit4]   2> 1377 T2262 oasc.RequestHandlers.initHandlersFromConfig created dismax: solr.SearchHandler
[junit4:junit4]   2> 1378 T2262 oasc.RequestHandlers.initHandlersFromConfig created mock: org.apache.solr.core.MockQuerySenderListenerReqHandler
[junit4:junit4]   2> 1378 T2262 oasc.RequestHandlers.initHandlersFromConfig created /admin/: org.apache.solr.handler.admin.AdminHandlers
[junit4:junit4]   2> 1379 T2262 oasc.RequestHandlers.initHandlersFromConfig created defaults: solr.StandardRequestHandler
[junit4:junit4]   2> 1379 T2262 oasc.RequestHandlers.initHandlersFromConfig adding lazy requestHandler: solr.StandardRequestHandler
[junit4:junit4]   2> 1379 T2262 oasc.RequestHandlers.initHandlersFromConfig created lazy: solr.StandardRequestHandler
[junit4:junit4]   2> 1380 T2262 oasc.RequestHandlers.initHandlersFromConfig created /update: solr.UpdateRequestHandler
[junit4:junit4]   2> 1380 T2262 oasc.RequestHandlers.initHandlersFromConfig created /terms: org.apache.solr.handler.component.SearchHandler
[junit4:junit4]   2> 1381 T2262 oasc.RequestHandlers.initHandlersFromConfig created spellCheckCompRH: org.apache.solr.handler.component.SearchHandler
[junit4:junit4]   2> 1381 T2262 oasc.RequestHandlers.initHandlersFromConfig created spellCheckCompRH_Direct: org.apache.solr.handler.component.SearchHandler
[junit4:junit4]   2> 1381 T2262 oasc.RequestHandlers.initHandlersFromConfig created spellCheckWithWordbreak: org.apache.solr.handler.component.SearchHandler
[junit4:junit4]   2> 1383 T2262 oasc.RequestHandlers.initHandlersFromConfig created spellCheckWithWordbreak_Direct: org.apache.solr.handler.component.SearchHandler
[junit4:junit4]   2> 1383 T2262 oasc.RequestHandlers.initHandlersFromConfig created spellCheckCompRH1: org.apache.solr.handler.component.SearchHandler
[junit4:junit4]   2> 1384 T2262 oasc.RequestHandlers.initHandlersFromConfig created mltrh: org.apache.solr.handler.component.SearchHandler
[junit4:junit4]   2> 1384 T2262 oasc.RequestHandlers.initHandlersFromConfig created tvrh: org.apache.solr.handler.component.SearchHandler
[junit4:junit4]   2> 1385 T2262 oasc.RequestHandlers.initHandlersFromConfig created /mlt: solr.MoreLikeThisHandler
[junit4:junit4]   2> 1385 T2262 oasc.RequestHandlers.initHandlersFromConfig created /debug/dump: solr.DumpRequestHandler
[junit4:junit4]   2> 1391 T2262 oashl.XMLLoader.init xsltCacheLifetimeSeconds=60
[junit4:junit4]   2> 1395 T2262 oasc.SolrCore.initDeprecatedSupport WARNING solrconfig.xml uses deprecated <admin/gettableFiles>, Please update your config to use the ShowFileRequestHandler.
[junit4:junit4]   2> 1397 T2262 oasc.SolrCore.initDeprecatedSupport WARNING adding ShowFileRequestHandler with hidden files: [SCHEMA.XML, OLD_SYNONYMS.TXT, STOPWORDS.TXT, PROTWORDS.TXT, OPEN-EXCHANGE-RATES.JSON, SYNONYMS.TXT, CURRENCY.XML, MAPPING-ISOLATIN1ACCENT.TXT]
[junit4:junit4]   2> 1400 T2262 oasc.CachingDirectoryFactory.close Releasing directory:/Users/jenkins/jenkins-slave/workspace/Lucene-Solr-trunk-MacOSX/solr/build/solr-core/test/J0/./org.apache.solr.cloud.BasicDistributedZkTest-1359905507479/control/data
[junit4:junit4]   2> 1401 T2262 oass.SolrIndexSearcher.<init> Opening Searcher@22fa1cde main
[junit4:junit4]   2> 1402 T2262 oasu.CommitTracker.<init> Hard AutoCommit: disabled
[junit4:junit4]   2> 1402 T2262 oasu.CommitTracker.<init> Soft AutoCommit: disabled
[junit4:junit4]   2> 1403 T2262 oashc.SpellCheckComponent.inform Initializing spell checkers
[junit4:junit4]   2> 1410 T2262 oass.DirectSolrSpellChecker.init init: {name=direct,classname=DirectSolrSpellChecker,field=lowerfilt,minQueryLength=3}
[junit4:junit4]   2> 1442 T2263 oasc.SolrCore.registerSearcher [collection1] Registered new searcher Searcher@22fa1cde main{StandardDirectoryReader(segments_1:1)}
[junit4:junit4]   2> 1447 T2262 oasc.ZkController.publish publishing core=collection1 state=down
[junit4:junit4]   2> 1447 T2262 oasc.ZkController.publish numShards not found on descriptor - reading it from system property
[junit4:junit4]   2> 1448 T2242 oazs.PrepRequestProcessor.pRequest Got user-level KeeperException when processing sessionid:0x13ca0af48aa0003 type:create cxid:0x50 zxid:0x29 txntype:-1 reqpath:n/a Error Path:/solr/overseer/queue Error:KeeperErrorCode = NoNode for /solr/overseer/queue
[junit4:junit4]   2> 2125 T2260 oascc.ZkStateReader.updateClusterState Updating cloud state from ZooKeeper... 
[junit4:junit4]   2> 2126 T2260 oasc.Overseer$ClusterStateUpdater.updateState Update state numShards=1 message={
[junit4:junit4]   2> 	  "operation":"state",
[junit4:junit4]   2> 	  "numShards":"1",
[junit4:junit4]   2> 	  "shard":null,
[junit4:junit4]   2> 	  "roles":null,
[junit4:junit4]   2> 	  "state":"down",
[junit4:junit4]   2> 	  "core":"collection1",
[junit4:junit4]   2> 	  "collection":"control_collection",
[junit4:junit4]   2> 	  "node_name":"127.0.0.1:49875_",
[junit4:junit4]   2> 	  "base_url":"http://127.0.0.1:49875"}
[junit4:junit4]   2> 2126 T2260 oasc.Overseer$ClusterStateUpdater.createCollection Create collection control_collection with numShards 1
[junit4:junit4]   2> 2126 T2260 oasc.Overseer$ClusterStateUpdater.updateState Assigning new node to shard shard=shard1
[junit4:junit4]   2> 2127 T2242 oazs.PrepRequestProcessor.pRequest Got user-level KeeperException when processing sessionid:0x13ca0af48aa0003 type:create cxid:0x58 zxid:0x2c txntype:-1 reqpath:n/a Error Path:/solr/overseer/queue-work Error:KeeperErrorCode = NoNode for /solr/overseer/queue-work
[junit4:junit4]   2> 2134 T2259 oascc.ZkStateReader$2.process A cluster state change: WatchedEvent state:SyncConnected type:NodeDataChanged path:/clusterstate.json, has occurred - updating... (live nodes size: 1)
[junit4:junit4]   2> 2453 T2262 oasc.CoreContainer.registerCore registering core: collection1
[junit4:junit4]   2> 2453 T2262 oasc.ZkController.register Register replica - core:collection1 address:http://127.0.0.1:49875 collection:control_collection shard:shard1
[junit4:junit4]   2> 2455 T2262 oascc.SolrZkClient.makePath makePath: /collections/control_collection/leader_elect/shard1/election
[junit4:junit4]   2> 2467 T2242 oazs.PrepRequestProcessor.pRequest Got user-level KeeperException when processing sessionid:0x13ca0af48aa0003 type:delete cxid:0x72 zxid:0x36 txntype:-1 reqpath:n/a Error Path:/solr/collections/control_collection/leaders Error:KeeperErrorCode = NoNode for /solr/collections/control_collection/leaders
[junit4:junit4]   2> 2469 T2262 oasc.ShardLeaderElectionContext.runLeaderProcess Running the leader process.
[junit4:junit4]   2> 2469 T2242 oazs.PrepRequestProcessor.pRequest Got user-level KeeperException when processing sessionid:0x13ca0af48aa0003 type:create cxid:0x73 zxid:0x37 txntype:-1 reqpath:n/a Error Path:/solr/overseer Error:KeeperErrorCode = NodeExists for /solr/overseer
[junit4:junit4]   2> 2472 T2262 oasc.ShardLeaderElectionContext.waitForReplicasToComeUp Enough replicas found to continue.
[junit4:junit4]   2> 2472 T2262 oasc.ShardLeaderElectionContext.runLeaderProcess I may be the new leader - try and sync
[junit4:junit4]   2> 2473 T2262 oasc.SyncStrategy.sync Sync replicas to http://127.0.0.1:49875/collection1/
[junit4:junit4]   2> 2473 T2262 oasc.SyncStrategy.syncReplicas Sync Success - now sync replicas to me
[junit4:junit4]   2> 2473 T2262 oasc.SyncStrategy.syncToMe http://127.0.0.1:49875/collection1/ has no replicas
[junit4:junit4]   2> 2474 T2262 oasc.ShardLeaderElectionContext.runLeaderProcess I am the new leader: http://127.0.0.1:49875/collection1/
[junit4:junit4]   2> 2474 T2262 oascc.SolrZkClient.makePath makePath: /collections/control_collection/leaders/shard1
[junit4:junit4]   2> 2481 T2242 oazs.PrepRequestProcessor.pRequest Got user-level KeeperException when processing sessionid:0x13ca0af48aa0003 type:create cxid:0x7d zxid:0x3b txntype:-1 reqpath:n/a Error Path:/solr/overseer Error:KeeperErrorCode = NodeExists for /solr/overseer
[junit4:junit4]   2> 3644 T2260 oascc.ZkStateReader.updateClusterState Updating cloud state from ZooKeeper... 
[junit4:junit4]   2> 3657 T2259 oascc.ZkStateReader$2.process A cluster state change: WatchedEvent state:SyncConnected type:NodeDataChanged path:/clusterstate.json, has occurred - updating... (live nodes size: 1)
[junit4:junit4]   2> 3712 T2262 oasc.ZkController.register We are http://127.0.0.1:49875/collection1/ and leader is http://127.0.0.1:49875/collection1/
[junit4:junit4]   2> 3712 T2262 oasc.ZkController.register No LogReplay needed for core=collection1 baseURL=http://127.0.0.1:49875
[junit4:junit4]   2> 3712 T2262 oasc.ZkController.checkRecovery I am the leader, no recovery necessary
[junit4:junit4]   2> 3713 T2262 oasc.ZkController.publish publishing core=collection1 state=active
[junit4:junit4]   2> 3713 T2262 oasc.ZkController.publish numShards not found on descriptor - reading it from system property
[junit4:junit4]   2> 3715 T2262 oascc.ZkStateReader.updateClusterState Updating cloud state from ZooKeeper... 
[junit4:junit4]   2> 3717 T2237 oass.SolrDispatchFilter.init user.dir=/Users/jenkins/jenkins-slave/workspace/Lucene-Solr-trunk-MacOSX/solr/build/solr-core/test/J0
[junit4:junit4]   2> 3718 T2237 oass.SolrDispatchFilter.init SolrDispatchFilter.init() done
[junit4:junit4]   2> 3718 T2237 oascsi.HttpClientUtil.createClient Creating new http client, config:maxConnections=128&maxConnectionsPerHost=32&followRedirects=false
[junit4:junit4]   2> 3723 T2237 oascsi.HttpClientUtil.createClient Creating new http client, config:
[junit4:junit4]   2> 3727 T2237 oaz.ZooKeeper.<init> Initiating client connection, connectString=127.0.0.1:49872/solr sessionTimeout=10000 watcher=org.apache.solr.common.cloud.ConnectionManager@16aef4d8
[junit4:junit4]   2> 3728 T2264 oaz.ClientCnxn$SendThread.logStartConnect Opening socket connection to server localhost/127.0.0.1:49872. Will not attempt to authenticate using SASL (access denied ("javax.security.auth.AuthPermission" "getLoginConfiguration"))
[junit4:junit4]   2> 3729 T2264 oaz.ClientCnxn$SendThread.primeConnection Socket connection established to localhost/127.0.0.1:49872, initiating session
[junit4:junit4]   2> 3729 T2239 oazs.NIOServerCnxnFactory.run Accepted socket connection from /127.0.0.1:49878
[junit4:junit4]   2> 3730 T2239 oazs.ZooKeeperServer.processConnectRequest Client attempting to establish new session at /127.0.0.1:49878
[junit4:junit4]   2> 3730 T2237 oascc.ConnectionManager.waitForConnected Waiting for client to connect to ZooKeeper
[junit4:junit4]   2> 3731 T2241 oazs.ZooKeeperServer.finishSessionInit Established session 0x13ca0af48aa0004 with negotiated timeout 10000 for client /127.0.0.1:49878
[junit4:junit4]   2> 3731 T2264 oaz.ClientCnxn$SendThread.onConnected Session establishment complete on server localhost/127.0.0.1:49872, sessionid = 0x13ca0af48aa0004, negotiated timeout = 10000
[junit4:junit4]   2> 3732 T2265 oascc.ConnectionManager.process Watcher org.apache.solr.common.cloud.ConnectionManager@16aef4d8 name:ZooKeeperConnection Watcher:127.0.0.1:49872/solr got event WatchedEvent state:SyncConnected type:None path:null path:null type:None
[junit4:junit4]   2> 3732 T2237 oascc.ConnectionManager.waitForConnected Client is connected to ZooKeeper
[junit4:junit4]   2> 3734 T2237 oascc.ZkStateReader.createClusterStateWatchersAndUpdate Updating cluster state from ZooKeeper... 
[junit4:junit4]   2> 3737 T2237 oasc.ChaosMonkey.monkeyLog monkey: init - expire sessions:true cause connection loss:true
[junit4:junit4]   2> 3899 T2237 oejs.Server.doStart jetty-8.1.8.v20121106
[junit4:junit4]   2> 3903 T2237 oejs.AbstractConnector.doStart Started SelectChannelConnector@127.0.0.1:49879
[junit4:junit4]   2> 3904 T2237 oass.SolrDispatchFilter.init SolrDispatchFilter.init()
[junit4:junit4]   2> 3904 T2237 oasc.SolrResourceLoader.locateSolrHome JNDI not configured for solr (NoInitialContextEx)
[junit4:junit4]   2> 3905 T2237 oasc.SolrResourceLoader.locateSolrHome using system property solr.solr.home: /Users/jenkins/jenkins-slave/workspace/Lucene-Solr-trunk-MacOSX/solr/build/solr-core/test/J0/./org.apache.solr.cloud.BasicDistributedZkTest-jetty1-1359905511209
[junit4:junit4]   2> 3905 T2237 oasc.CoreContainer$Initializer.initialize looking for solr.xml: /Users/jenkins/jenkins-slave/workspace/Lucene-Solr-trunk-MacOSX/solr/build/solr-core/test/J0/./org.apache.solr.cloud.BasicDistributedZkTest-jetty1-1359905511209/solr.xml
[junit4:junit4]   2> 3906 T2237 oasc.CoreContainer.<init> New CoreContainer 1639387465
[junit4:junit4]   2> 3906 T2237 oasc.CoreContainer.load Loading CoreContainer using Solr Home: '/Users/jenkins/jenkins-slave/workspace/Lucene-Solr-trunk-MacOSX/solr/build/solr-core/test/J0/./org.apache.solr.cloud.BasicDistributedZkTest-jetty1-1359905511209/'
[junit4:junit4]   2> 3907 T2237 oasc.SolrResourceLoader.<init> new SolrResourceLoader for directory: '/Users/jenkins/jenkins-slave/workspace/Lucene-Solr-trunk-MacOSX/solr/build/solr-core/test/J0/./org.apache.solr.cloud.BasicDistributedZkTest-jetty1-1359905511209/'
[junit4:junit4]   2> 3942 T2237 oashc.HttpShardHandlerFactory.getParameter Setting socketTimeout to: 60000
[junit4:junit4]   2> 3942 T2237 oashc.HttpShardHandlerFactory.getParameter Setting urlScheme to: http://
[junit4:junit4]   2> 3943 T2237 oashc.HttpShardHandlerFactory.getParameter Setting connTimeout to: 15000
[junit4:junit4]   2> 3943 T2237 oashc.HttpShardHandlerFactory.getParameter Setting maxConnectionsPerHost to: 20
[junit4:junit4]   2> 3944 T2237 oashc.HttpShardHandlerFactory.getParameter Setting corePoolSize to: 0
[junit4:junit4]   2> 3944 T2237 oashc.HttpShardHandlerFactory.getParameter Setting maximumPoolSize to: 2147483647
[junit4:junit4]   2> 3945 T2237 oashc.HttpShardHandlerFactory.getParameter Setting maxThreadIdleTime to: 5
[junit4:junit4]   2> 3945 T2237 oashc.HttpShardHandlerFactory.getParameter Setting sizeOfQueue to: -1
[junit4:junit4]   2> 3946 T2237 oashc.HttpShardHandlerFactory.getParameter Setting fairnessPolicy to: false
[junit4:junit4]   2> 3946 T2237 oascsi.HttpClientUtil.createClient Creating new http client, config:maxConnectionsPerHost=20&maxConnections=10000&socketTimeout=60000&connTimeout=15000&retry=false
[junit4:junit4]   2> 3961 T2237 oasc.CoreContainer.load Registering Log Listener
[junit4:junit4]   2> 3979 T2237 oasc.CoreContainer.initZooKeeper Zookeeper client=127.0.0.1:49872/solr
[junit4:junit4]   2> 3980 T2237 oasc.ZkController.checkChrootPath zkHost includes chroot
[junit4:junit4]   2> 3980 T2237 oaz.ZooKeeper.<init> Initiating client connection, connectString=127.0.0.1:49872 sessionTimeout=60000 watcher=org.apache.solr.common.cloud.ConnectionManager@5dbf0973
[junit4:junit4]   2> 3982 T2275 oaz.ClientCnxn$SendThread.logStartConnect Opening socket connection to server localhost/127.0.0.1:49872. Will not attempt to authenticate using SASL (access denied ("javax.security.auth.AuthPermission" "getLoginConfiguration"))
[junit4:junit4]   2> 3983 T2275 oaz.ClientCnxn$SendThread.primeConnection Socket connection established to localhost/127.0.0.1:49872, initiating session
[junit4:junit4]   2> 3984 T2239 oazs.NIOServerCnxnFactory.run Accepted socket connection from /127.0.0.1:49880
[junit4:junit4]   2> 3984 T2239 oazs.ZooKeeperServer.processConnectRequest Client attempting to establish new session at /127.0.0.1:49880
[junit4:junit4]   2> 3985 T2237 oascc.ConnectionManager.waitForConnected Waiting for client to connect to ZooKeeper
[junit4:junit4]   2> 3990 T2241 oazs.ZooKeeperServer.finishSessionInit Established session 0x13ca0af48aa0005 with negotiated timeout 20000 for client /127.0.0.1:49880
[junit4:junit4]   2> 3991 T2275 oaz.ClientCnxn$SendThread.onConnected Session establishment complete on server localhost/127.0.0.1:49872, sessionid = 0x13ca0af48aa0005, negotiated timeout = 20000
[junit4:junit4]   2> 3991 T2276 oascc.ConnectionManager.process Watcher org.apache.solr.common.cloud.ConnectionManager@5dbf0973 name:ZooKeeperConnection Watcher:127.0.0.1:49872 got event WatchedEvent state:SyncConnected type:None path:null path:null type:None
[junit4:junit4]   2> 3991 T2237 oascc.ConnectionManager.waitForConnected Client is connected to ZooKeeper
[junit4:junit4]   2> 3993 T2242 oazs.PrepRequestProcessor.pRequest2Txn Processed session termination for sessionid: 0x13ca0af48aa0005
[junit4:junit4]   2> 3994 T2239 oazs.NIOServerCnxn.closeSock Closed socket connection for client /127.0.0.1:49880 which had sessionid 0x13ca0af48aa0005
[junit4:junit4]   2> 3994 T2237 oaz.ZooKeeper.close Session: 0x13ca0af48aa0005 closed
[junit4:junit4]   2> 3995 T2237 oascsi.HttpClientUtil.createClient Creating new http client, config:maxConnections=500&maxConnectionsPerHost=16&socketTimeout=60000&connTimeout=15000
[junit4:junit4]   2> 4000 T2237 oaz.ZooKeeper.<init> Initiating client connection, connectString=127.0.0.1:49872/solr sessionTimeout=30000 watcher=org.apache.solr.common.cloud.ConnectionManager@ddf927e
[junit4:junit4]   2> 4001 T2276 oaz.ClientCnxn$EventThread.run EventThread shut down
[junit4:junit4]   2> 4002 T2237 oascc.ConnectionManager.waitForConnected Waiting for client to connect to ZooKeeper
[junit4:junit4]   2> 4003 T2277 oaz.ClientCnxn$SendThread.logStartConnect Opening socket connection to server localhost/127.0.0.1:49872. Will not attempt to authenticate using SASL (access denied ("javax.security.auth.AuthPermission" "getLoginConfiguration"))
[junit4:junit4]   2> 4005 T2277 oaz.ClientCnxn$SendThread.primeConnection Socket connection established to localhost/127.0.0.1:49872, initiating session
[junit4:junit4]   2> 4005 T2239 oazs.NIOServerCnxnFactory.run Accepted socket connection from /127.0.0.1:49881
[junit4:junit4]   2> 4006 T2239 oazs.ZooKeeperServer.processConnectRequest Client attempting to establish new session at /127.0.0.1:49881
[junit4:junit4]   2> 4007 T2241 oazs.ZooKeeperServer.finishSessionInit Established session 0x13ca0af48aa0006 with negotiated timeout 20000 for client /127.0.0.1:49881
[junit4:junit4]   2> 4007 T2277 oaz.ClientCnxn$SendThread.onConnected Session establishment complete on server localhost/127.0.0.1:49872, sessionid = 0x13ca0af48aa0006, negotiated timeout = 20000
[junit4:junit4]   2> 4008 T2278 oascc.ConnectionManager.process Watcher org.apache.solr.common.cloud.ConnectionManager@ddf927e name:ZooKeeperConnection Watcher:127.0.0.1:49872/solr got event WatchedEvent state:SyncConnected type:None path:null path:null type:None
[junit4:junit4]   2> 4008 T2237 oascc.ConnectionManager.waitForConnected Client is connected to ZooKeeper
[junit4:junit4]   2> 4009 T2242 oazs.PrepRequestProcessor.pRequest Got user-level KeeperException when processing sessionid:0x13ca0af48aa0006 type:create cxid:0x1 zxid:0x49 txntype:-1 reqpath:n/a Error Path:/solr/overseer Error:KeeperErrorCode = NodeExists for /solr/overseer
[junit4:junit4]   2> 4010 T2242 oazs.PrepRequestProcessor.pRequest Got user-level KeeperException when processing sessionid:0x13ca0af48aa0006 type:create cxid:0x2 zxid:0x4a txntype:-1 reqpath:n/a Error Path:/solr/overseer Error:KeeperErrorCode = NodeExists for /solr/overseer
[junit4:junit4]   2> 4012 T2237 oasc.ZkController.createEphemeralLiveNode Register node as live in ZooKeeper:/live_nodes/127.0.0.1:49879_
[junit4:junit4]   2> 4013 T2242 oazs.PrepRequestProcessor.pRequest Got user-level KeeperException when processing sessionid:0x13ca0af48aa0006 type:delete cxid:0x4 zxid:0x4b txntype:-1 reqpath:n/a Error Path:/solr/live_nodes/127.0.0.1:49879_ Error:KeeperErrorCode = NoNode for /solr/live_nodes/127.0.0.1:49879_
[junit4:junit4]   2> 4014 T2237 oascc.SolrZkClient.makePath makePath: /live_nodes/127.0.0.1:49879_
[junit4:junit4]   2> 4018 T2259 oascc.ZkStateReader$2.process A cluster state change: WatchedEvent state:SyncConnected type:NodeChildrenChanged path:/live_nodes, has occurred - updating... (live nodes size: 1)
[junit4:junit4]   2> 4021 T2265 oascc.ZkStateReader$3.process Updating live nodes... (2)
[junit4:junit4]   2> 4023 T2259 oascc.ZkStateReader$3.process Updating live nodes... (2)
[junit4:junit4]   2> 4026 T2237 oascc.ZkStateReader.createClusterStateWatchersAndUpdate Updating cluster state from ZooKeeper... 
[junit4:junit4]   2> 4034 T2279 oasc.CoreContainer.create Creating SolrCore 'collection1' using instanceDir: /Users/jenkins/jenkins-slave/workspace/Lucene-Solr-trunk-MacOSX/solr/build/solr-core/test/J0/./org.apache.solr.cloud.BasicDistributedZkTest-jetty1-1359905511209/collection1
[junit4:junit4]   2> 4035 T2279 oasc.ZkController.createCollectionZkNode Check for collection zkNode:collection1
[junit4:junit4]   2> 4036 T2279 oasc.ZkController.createCollectionZkNode Collection zkNode exists
[junit4:junit4]   2> 4036 T2279 oasc.ZkController.readConfigName Load collection config from:/collections/collection1
[junit4:junit4]   2> 4038 T2279 oasc.SolrResourceLoader.<init> new SolrResourceLoader for directory: '/Users/jenkins/jenkins-slave/workspace/Lucene-Solr-trunk-MacOSX/solr/build/solr-core/test/J0/./org.apache.solr.cloud.BasicDistributedZkTest-jetty1-1359905511209/collection1/'
[junit4:junit4]   2> 4039 T2279 oasc.SolrResourceLoader.replaceClassLoader Adding 'file:/Users/jenkins/jenkins-slave/workspace/Lucene-Solr-trunk-MacOSX/solr/build/solr-core/test/J0/org.apache.solr.cloud.BasicDistributedZkTest-jetty1-1359905511209/collection1/lib/classes/' to classloader
[junit4:junit4]   2> 4040 T2279 oasc.SolrResourceLoader.replaceClassLoader Adding 'file:/Users/jenkins/jenkins-slave/workspace/Lucene-Solr-trunk-MacOSX/solr/build/solr-core/test/J0/org.apache.solr.cloud.BasicDistributedZkTest-jetty1-1359905511209/collection1/lib/README' to classloader
[junit4:junit4]   2> 4091 T2279 oasc.SolrConfig.<init> Using Lucene MatchVersion: LUCENE_50
[junit4:junit4]   2> 4150 T2279 oasc.SolrConfig.<init> Loaded SolrConfig: solrconfig.xml
[junit4:junit4]   2> 4151 T2279 oass.IndexSchema.readSchema Reading Solr Schema
[junit4:junit4]   2> 4168 T2279 oass.IndexSchema.readSchema Schema name=test
[junit4:junit4]   2> 4637 T2279 oass.OpenExchangeRatesOrgProvider.init Initialized with rates=open-exchange-rates.json, refreshInterval=1440.
[junit4:junit4]   2> 4645 T2279 oass.IndexSchema.readSchema default search field in schema is text
[junit4:junit4]   2> 4648 T2279 oass.IndexSchema.readSchema unique key field: id
[junit4:junit4]   2> 4671 T2279 oass.FileExchangeRateProvider.reload Reloading exchange rates from file currency.xml
[junit4:junit4]   2> 4677 T2279 oass.FileExchangeRateProvider.reload Reloading exchange rates from file currency.xml
[junit4:junit4]   2> 4684 T2279 oass.OpenExchangeRatesOrgProvider.reload Reloading exchange rates from open-exchange-rates.json
[junit4:junit4]   2> 4686 T2279 oass.OpenExchangeRatesOrgProvider.reload Reloading exchange rates from open-exchange-rates.json
[junit4:junit4]   2> 4688 T2279 oasc.SolrCore.<init> [collection1] Opening new SolrCore at /Users/jenkins/jenkins-slave/workspace/Lucene-Solr-trunk-MacOSX/solr/build/solr-core/test/J0/./org.apache.solr.cloud.BasicDistributedZkTest-jetty1-1359905511209/collection1/, dataDir=./org.apache.solr.cloud.BasicDistributedZkTest-1359905507479/jetty1/
[junit4:junit4]   2> 4688 T2279 oasc.JmxMonitoredMap.<init> JMX monitoring is enabled. Adding Solr mbeans to JMX Server: com.sun.jmx.mbeanserver.JmxMBeanServer@685d72cd
[junit4:junit4]   2> 4689 T2279 oasc.SolrCore.initDirectoryFactory solr.NRTCachingDirectoryFactory
[junit4:junit4]   2> 4689 T2279 oasc.CachingDirectoryFactory.get return new directory for /Users/jenkins/jenkins-slave/workspace/Lucene-Solr-trunk-MacOSX/solr/build/solr-core/test/J0/./org.apache.solr.cloud.BasicDistributedZkTest-1359905507479/jetty1 forceNew:false
[junit4:junit4]   2> 4690 T2279 oasc.CachingDirectoryFactory.close Releasing directory:/Users/jenkins/jenkins-slave/workspace/Lucene-Solr-trunk-MacOSX/solr/build/solr-core/test/J0/./org.apache.solr.cloud.BasicDistributedZkTest-1359905507479/jetty1
[junit4:junit4]   2> 4690 T2279 oasc.SolrCore.getNewIndexDir New index directory detected: old=null new=./org.apache.solr.cloud.BasicDistributedZkTest-1359905507479/jetty1/index/
[junit4:junit4]   2> 4691 T2279 oasc.SolrCore.initIndex WARNING [collection1] Solr index directory './org.apache.solr.cloud.BasicDistributedZkTest-1359905507479/jetty1/index' doesn't exist. Creating new index...
[junit4:junit4]   2> 4691 T2279 oasc.CachingDirectoryFactory.get return new directory for /Users/jenkins/jenkins-slave/workspace/Lucene-Solr-trunk-MacOSX/solr/build/solr-core/test/J0/./org.apache.solr.cloud.BasicDistributedZkTest-1359905507479/jetty1/index forceNew:false
[junit4:junit4]   2> 4696 T2279 oasc.SolrDeletionPolicy.onCommit SolrDeletionPolicy.onCommit: commits:num=1
[junit4:junit4]   2> 		commit{dir=RateLimitedDirectoryWrapper(NRTCachingDirectory(org.apache.lucene.store.NIOFSDirectory@/Users/jenkins/jenkins-slave/workspace/Lucene-Solr-trunk-MacOSX/solr/build/solr-core/test/J0/org.apache.solr.cloud.BasicDistributedZkTest-1359905507479/jetty1/index lockFactory=org.apache.lucene.store.NativeFSLockFactory@6b12cd20; maxCacheMB=48.0 maxMergeSizeMB=4.0)),segFN=segments_1,generation=1,filenames=[segments_1]
[junit4:junit4]   2> 4696 T2279 oasc.SolrDeletionPolicy.updateCommits newest commit = 1[segments_1]
[junit4:junit4]   2> 4697 T2279 oasc.CachingDirectoryFactory.close Releasing directory:/Users/jenkins/jenkins-slave/workspace/Lucene-Solr-trunk-MacOSX/solr/build/solr-core/test/J0/./org.apache.solr.cloud.BasicDistributedZkTest-1359905507479/jetty1/index
[junit4:junit4]   2> 4697 T2279 oasc.SolrCore.initWriters created xml: solr.XMLResponseWriter
[junit4:junit4]   2> 4700 T2279 oasup.UpdateRequestProcessorChain.init inserting DistributedUpdateProcessorFactory into updateRequestProcessorChain "dedupe"
[junit4:junit4]   2> 4700 T2279 oasup.UpdateRequestProcessorChain.init inserting DistributedUpdateProcessorFactory into updateRequestProcessorChain "dedupe-allfields"
[junit4:junit4]   2> 4701 T2279 oasup.UpdateRequestProcessorChain.init inserting DistributedUpdateProcessorFactory into updateRequestProcessorChain "stored_sig"
[junit4:junit4]   2> 4701 T2279 oasup.UpdateRequestProcessorChain.init inserting DistributedUpdateProcessorFactory into updateRequestProcessorChain "uniq-fields"
[junit4:junit4]   2> 4702 T2279 oasup.UpdateRequestProcessorChain.init inserting DistributedUpdateProcessorFactory into updateRequestProcessorChain "distrib-dup-test-chain-implicit"
[junit4:junit4]   2> 4702 T2279 oasc.RequestHandlers.initHandlersFromConfig adding lazy requestHandler: solr.ReplicationHandler
[junit4:junit4]   2> 4702 T2279 oasc.RequestHandlers.initHandlersFromConfig created /replication: solr.ReplicationHandler
[junit4:junit4]   2> 4703 T2279 oasc.RequestHandlers.initHandlersFromConfig created standard: solr.StandardRequestHandler
[junit4:junit4]   2> 4704 T2279 oasc.RequestHandlers.initHandlersFromConfig created /get: solr.RealTimeGetHandler
[junit4:junit4]   2> 4704 T2279 oasc.RequestHandlers.initHandlersFromConfig created dismax: solr.SearchHandler
[junit4:junit4]   2> 4705 T2279 oasc.RequestHandlers.initHandlersFromConfig created mock: org.apache.solr.core.MockQuerySenderListenerReqHandler
[junit4:junit4]   2> 4705 T2279 oasc.RequestHandlers.initHandlersFromConfig created /admin/: org.apache.solr.handler.admin.AdminHandlers
[junit4:junit4]   2> 4706 T2279 oasc.RequestHandlers.initHandlersFromConfig created defaults: solr.StandardRequestHandler
[junit4:junit4]   2> 4706 T2279 oasc.RequestHandlers.initHandlersFromConfig adding lazy requestHandler: solr.StandardRequestHandler
[junit4:junit4]   2> 4707 T2279 oasc.RequestHandlers.initHandlersFromConfig created lazy: solr.StandardRequestHandler
[junit4:junit4]   2> 4708 T2279 oasc.RequestHandlers.initHandlersFromConfig created /update: solr.UpdateRequestHandler
[junit4:junit4]   2> 4708 T2279 oasc.RequestHandlers.initHandlersFromConfig created /terms: org.apache.solr.handler.component.SearchHandler
[junit4:junit4]   2> 4709 T2279 oasc.RequestHandlers.initHandlersFromConfig created spellCheckCompRH: org.apache.solr.handler.component.SearchHandler
[junit4:junit4]   2> 4709 T2279 oasc.RequestHandlers.initHandlersFromConfig created spellCheckCompRH_Direct: org.apache.solr.handler.component.SearchHandler
[junit4:junit4]   2> 4710 T2279 oasc.RequestHandlers.initHandlersFromConfig created spellCheckWithWordbreak: org.apache.solr.handler.component.SearchHandler
[junit4:junit4]   2> 4711 T2279 oasc.RequestHandlers.initHandlersFromConfig created spellCheckWithWordbreak_Direct: org.apache.solr.handler.component.SearchHandler
[junit4:junit4]   2> 4711 T2279 oasc.RequestHandlers.initHandlersFromConfig created spellCheckCompRH1: org.apache.solr.handler.component.SearchHandler
[junit4:junit4]   2> 4712 T2279 oasc.RequestHandlers.initHandlersFromConfig created mltrh: org.apache.solr.handler.component.SearchHandler
[junit4:junit4]   2> 4712 T2279 oasc.RequestHandlers.initHandlersFromConfig created tvrh: org.apache.solr.handler.component.SearchHandler
[junit4:junit4]   2> 4713 T2279 oasc.RequestHandlers.initHandlersFromConfig created /mlt: solr.MoreLikeThisHandler
[junit4:junit4]   2> 4713 T2279 oasc.RequestHandlers.initHandlersFromConfig created /debug/dump: solr.DumpRequestHandler
[junit4:junit4]   2> 4722 T2279 oashl.XMLLoader.init xsltCacheLifetimeSeconds=60
[junit4:junit4]   2> 4727 T2279 oasc.SolrCore.initDeprecatedSupport WARNING solrconfig.xml uses deprecated <admin/gettableFiles>, Please update your config to use the ShowFileRequestHandler.
[junit4:junit4]   2> 4729 T2279 oasc.SolrCore.initDeprecatedSupport WARNING adding ShowFileRequestHandler with hidden files: [SCHEMA.XML, OLD_SYNONYMS.TXT, STOPWORDS.TXT, PROTWORDS.TXT, OPEN-EXCHANGE-RATES.JSON, SYNONYMS.TXT, CURRENCY.XML, MAPPING-ISOLATIN1ACCENT.TXT]
[junit4:junit4]   2> 4732 T2279 oasc.CachingDirectoryFactory.close Releasing directory:/Users/jenkins/jenkins-slave/workspace/Lucene-Solr-trunk-MacOSX/solr/build/solr-core/test/J0/./org.apache.solr.cloud.BasicDistributedZkTest-1359905507479/jetty1
[junit4:junit4]   2> 4734 T2279 oass.SolrIndexSearcher.<init> Opening Searcher@7db1b132 main
[junit4:junit4]   2> 4735 T2279 oasu.CommitTracker.<init> Hard AutoCommit: disabled
[junit4:junit4]   2> 4735 T2279 oasu.CommitTracker.<init> Soft AutoCommit: disabled
[junit4:junit4]   2> 4736 T2279 oashc.SpellCheckComponent.inform Initializing spell checkers
[junit4:junit4]   2> 4741 T2279 oass.DirectSolrSpellChecker.init init: {name=direct,classname=DirectSolrSpellChecker,field=lowerfilt,minQueryLength=3}
[junit4:junit4]   2> 4774 T2280 oasc.SolrCore.registerSearcher [collection1] Registered new searcher Searcher@7db1b132 main{StandardDirectoryReader(segments_1:1)}
[junit4:junit4]   2> 4780 T2279 oasc.ZkController.publish publishing core=collection1 state=down
[junit4:junit4]   2> 4780 T2279 oasc.ZkController.publish numShards not found on descriptor - reading it from system property
[junit4:junit4]   2> 5182 T2260 oascc.ZkStateReader.updateClusterState Updating cloud state from ZooKeeper... 
[junit4:junit4]   2> 5185 T2260 oasc.Overseer$ClusterStateUpdater.updateState Update state numShards=1 message={
[junit4:junit4]   2> 	  "operation":"state",
[junit4:junit4]   2> 	  "numShards":"1",
[junit4:junit4]   2> 	  "shard":"shard1",
[junit4:junit4]   2> 	  "roles":null,
[junit4:junit4]   2> 	  "state":"active",
[junit4:junit4]   2> 	  "core":"collection1",
[junit4:junit4]   2> 	  "collection":"control_collection",
[junit4:junit4]   2> 	  "node_name":"127.0.0.1:49875_",
[junit4:junit4]   2> 	  "base_url":"http://127.0.0.1:49875"}
[junit4:junit4]   2> 5198 T2260 oasc.Overseer$ClusterStateUpdater.updateState Update state numShards=2 message={
[junit4:junit4]   2> 	  "operation":"state",
[junit4:junit4]   2> 	  "numShards":"2",
[junit4:junit4]   2> 	  "shard":null,
[junit4:junit4]   2> 	  "roles":null,
[junit4:junit4]   2> 	  "state":"down",
[junit4:junit4]   2> 	  "core":"collection1",
[junit4:junit4]   2> 	  "collection":"collection1",
[junit4:junit4]   2> 	  "node_name":"127.0.0.1:49879_",
[junit4:junit4]   2> 	  "base_url":"http://127.0.0.1:49879"}
[junit4:junit4]   2> 5199 T2260 oasc.Overseer$ClusterStateUpdater.createCollection Create collection collection1 with numShards 2
[junit4:junit4]   2> 5199 T2260 oasc.Overseer$ClusterStateUpdater.updateState Assigning new node to shard shard=shard1
[junit4:junit4]   2> 5214 T2259 oascc.ZkStateReader$2.process A cluster state change: WatchedEvent state:SyncConnected type:NodeDataChanged path:/clusterstate.json, has occurred - updating... (live nodes size: 2)
[junit4:junit4]   2> 5214 T2265 oascc.ZkStateReader$2.process A cluster state change: WatchedEvent state:SyncConnected type:NodeDataChanged path:/clusterstate.json, has occurred - updating... (live nodes size: 2)
[junit4:junit4]   2> 5215 T2278 oascc.ZkStateReader$2.process A cluster state change: WatchedEvent state:SyncConnected type:NodeDataChanged path:/clusterstate.json, has occurred - updating... (live nodes size: 2)
[junit4:junit4]   2> 5784 T2279 oasc.CoreContainer.registerCore registering core: collection1
[junit4:junit4]   2> 5785 T2279 oasc.ZkController.register Register replica - core:collection1 address:http://127.0.0.1:49879 collection:collection1 shard:shard1
[junit4:junit4]   2> 5788 T2279 oascc.SolrZkClient.makePath makePath: /collections/collection1/leader_elect/shard1/election
[junit4:junit4]   2> 5813 T2242 oazs.PrepRequestProcessor.pRequest Got user-level KeeperException when processing sessionid:0x13ca0af48aa0006 type:delete cxid:0x43 zxid:0x5a txntype:-1 reqpath:n/a Error Path:/solr/collections/collection1/leaders Error:KeeperErrorCode = NoNode for /solr/collections/collection1/leaders
[junit4:junit4]   2> 5815 T2279 oasc.ShardLeaderElectionContext.runLeaderProcess Running the leader process.
[junit4:junit4]   2> 5817 T2242 oazs.PrepRequestProcessor.pRequest Got user-level KeeperException when processing sessionid:0x13ca0af48aa0006 type:create cxid:0x44 zxid:0x5b txntype:-1 reqpath:n/a Error Path:/solr/overseer Error:KeeperErrorCode = NodeExists for /solr/overseer
[junit4:junit4]   2> 5824 T2279 oasc.ShardLeaderElectionContext.waitForReplicasToComeUp Enough replicas found to continue.
[junit4:junit4]   2> 5824 T2279 oasc.ShardLeaderElectionContext.runLeaderProcess I may be the new leader - try and sync
[junit4:junit4]   2> 5825 T2279 oasc.SyncStrategy.sync Sync replicas to http://127.0.0.1:49879/collection1/
[junit4:junit4]   2> 5825 T2279 oasc.SyncStrategy.syncReplicas Sync Success - now sync replicas to me
[junit4:junit4]   2> 5826 T2279 oasc.SyncStrategy.syncToMe http://127.0.0.1:49879/collection1/ has no replicas
[junit4:junit4]   2> 5826 T2279 oasc.ShardLeaderElectionContext.runLeaderProcess I am the new leader: http://127.0.0.1:49879/collection1/
[junit4:junit4]   2> 5827 T2279 oascc.SolrZkClient.makePath makePath: /collections/collection1/leaders/shard1
[junit4:junit4]   2> 5842 T2242 oazs.PrepRequestProcessor.pRequest Got user-level KeeperException when processing sessionid:0x13ca0af48aa0006 type:create cxid:0x4e zxid:0x5f txntype:-1 reqpath:n/a Error Path:/solr/overseer Error:KeeperErrorCode = NodeExists for /solr/overseer
[junit4:junit4]   2> 6744 T2260 oascc.ZkStateReader.updateClusterState Updating cloud state from ZooKeeper... 
[junit4:junit4]   2> 6759 T2259 oascc.ZkStateReader$2.process A cluster state change: WatchedEvent state:SyncConnected type:NodeDataChanged path:/clusterstate.json, has occurred - updating... (live nodes size: 2)
[junit4:junit4]   2> 6763 T2278 oascc.ZkStateReader$2.process A cluster state change: WatchedEvent state:SyncConnected type:NodeDataChanged path:/clusterstate.json, has occurred - updating... (live nodes size: 2)
[junit4:junit4]   2> 6766 T2265 oascc.ZkStateReader$2.process A cluster state change: WatchedEvent state:SyncConnected type:NodeDataChanged path:/clusterstate.json, has occurred - updating... (live nodes size: 2)
[junit4:junit4]   2> 6805 T2279 oasc.ZkController.register We are http://127.0.0.1:49879/collection1/ and leader is http://127.0.0.1:49879/collection1/
[junit4:junit4]   2> 6806 T2279 oasc.ZkController.register No LogReplay needed for core=collection1 baseURL=http://127.0.0.1:49879
[junit4:junit4]   2> 6806 T2279 oasc.ZkController.checkRecovery I am the leader, no recovery necessary
[junit4:junit4]   2> 6806 T2279 oasc.ZkController.publish publishing core=collection1 state=active
[junit4:junit4]   2> 6806 T2279 oasc.ZkController.publish numShards not found on descriptor - reading it from system property
[junit4:junit4]   2> 6811 T2279 oascc.ZkStateReader.updateClusterState Updating cloud state from ZooKeeper... 
[junit4:junit4]   2> 6814 T2237 oass.SolrDispatchFilter.init user.dir=/Users/jenkins/jenkins-slave/workspace/Lucene-Solr-trunk-MacOSX/solr/build/solr-core/test/J0
[junit4:junit4]   2> 6815 T2237 oass.SolrDispatchFilter.init SolrDispatchFilter.init() done
[junit4:junit4]   2> 6815 T2237 oascsi.HttpClientUtil.createClient Creating new http client, config:maxConnections=128&maxConnectionsPerHost=32&followRedirects=false
[junit4:junit4]   2> 6998 T2237 oejs.Server.doStart jetty-8.1.8.v20121106
[junit4:junit4]   2> 7006 T2237 oejs.AbstractConnector.doStart Started SelectChannelConnector@127.0.0.1:49882
[junit4:junit4]   2> 7008 T2237 oass.SolrDispatchFilter.init SolrDispatchFilter.init()
[junit4:junit4]   2> 7011 T2237 oasc.SolrResourceLoader.locateSolrHome JNDI not configured for solr (NoInitialContextEx)
[junit4:junit4]   2> 7011 T2237 oasc.SolrResourceLoader.locateSolrHome using system property solr.solr.home: /Users/jenkins/jenkins-slave/workspace/Lucene-Solr-trunk-MacOSX/solr/build/solr-core/test/J0/./org.apache.solr.cloud.BasicDistributedZkTest-jetty2-1359905514296
[junit4:junit4]   2> 7012 T2237 oasc.CoreContainer$Initializer.initialize looking for solr.xml: /Users/jenkins/jenkins-slave/workspace/Lucene-Solr-trunk-MacOSX/solr/build/solr-core/test/J0/./org.apache.solr.cloud.BasicDistributedZkTest-jetty2-1359905514296/solr.xml
[junit4:junit4]   2> 7013 T2237 oasc.CoreContainer.<init> New CoreContainer 883532060
[junit4:junit4]   2> 7013 T2237 oasc.CoreContainer.load Loading CoreContainer using Solr Home: '/Users/jenkins/jenkins-slave/workspace/Lucene-Solr-trunk-MacOSX/solr/build/solr-core/test/J0/./org.apache.solr.cloud.BasicDistributedZkTest-jetty2-1359905514296/'
[junit4:junit4]   2> 7014 T2237 oasc.SolrResourceLoader.<init> new SolrResourceLoader for directory: '/Users/jenkins/jenkins-slave/workspace/Lucene-Solr-trunk-MacOSX/solr/build/solr-core/test/J0/./org.apache.solr.cloud.BasicDistributedZkTest-jetty2-1359905514296/'
[junit4:junit4]   2> 7046 T2237 oashc.HttpShardHandlerFactory.getParameter Setting socketTimeout to: 60000
[junit4:junit4]   2> 7047 T2237 oashc.HttpShardHandlerFactory.getParameter Setting urlScheme to: http://
[junit4:junit4]   2> 7047 T2237 oashc.HttpShardHandlerFactory.getParameter Setting connTimeout to: 15000
[junit4:junit4]   2> 7048 T2237 oashc.HttpShardHandlerFactory.getParameter Setting maxConnectionsPerHost to: 20
[junit4:junit4]   2> 7048 T2237 oashc.HttpShardHandlerFactory.getParameter Setting corePoolSize to: 0
[junit4:junit4]   2> 7049 T2237 oashc.HttpShardHandlerFactory.getParameter Setting maximumPoolSize to: 2147483647
[junit4:junit4]   2> 7049 T2237 oashc.HttpShardHandlerFactory.getParameter Setting maxThreadIdleTime to: 5
[junit4:junit4]   2> 7050 T2237 oashc.HttpShardHandlerFactory.getParameter Setting sizeOfQueue to: -1
[junit4:junit4]   2> 7050 T2237 oashc.HttpShardHandlerFactory.getParameter Setting fairnessPolicy to: false
[junit4:junit4]   2> 7051 T2237 oascsi.HttpClientUtil.createClient Creating new http client, config:maxConnectionsPerHost=20&maxConnections=10000&socketTimeout=60000&connTimeout=15000&retry=false
[junit4:junit4]   2> 7063 T2237 oasc.CoreContainer.load Registering Log Listener
[junit4:junit4]   2> 7079 T2237 oasc.CoreContainer.initZooKeeper Zookeeper client=127.0.0.1:49872/solr
[junit4:junit4]   2> 7079 T2237 oasc.ZkController.checkChrootPath zkHost includes chroot
[junit4:junit4]   2> 7080 T2237 oaz.ZooKeeper.<init> Initiating client connection, connectString=127.0.0.1:49872 sessionTimeout=60000 watcher=org.apache.solr.common.cloud.ConnectionManager@29239796
[junit4:junit4]   2> 7081 T2237 oascc.ConnectionManager.waitForConnected Waiting for client to connect to ZooKeeper
[junit4:junit4]   2> 7081 T2290 oaz.ClientCnxn$SendThread.logStartConnect Opening socket connection to server localhost/127.0.0.1:49872. Will not attempt to authenticate using SASL (access denied ("javax.security.auth.AuthPermission" "getLoginConfiguration"))
[junit4:junit4]   2> 7082 T2290 oaz.ClientCnxn$SendThread.primeConnection Socket connection established to localhost/127.0.0.1:49872, initiating session
[junit4:junit4]   2> 7083 T2239 oazs.NIOServerCnxnFactory.run Accepted socket connection from /127.0.0.1:49883
[junit4:junit4]   2> 7083 T2239 oazs.ZooKeeperServer.processConnectRequest Client attempting to establish new session at /127.0.0.1:49883
[junit4:junit4]   2> 7085 T2241 oazs.ZooKeeperServer.finishSessionInit Established session 0x13ca0af48aa0007 with negotiated timeout 20000 for client /127.0.0.1:49883
[junit4:junit4]   2> 7085 T2290 oaz.ClientCnxn$SendThread.onConnected Session establishment complete on server localhost/127.0.0.1:49872, sessionid = 0x13ca0af48aa0007, negotiated timeout = 20000
[junit4:junit4]   2> 7085 T2291 oascc.ConnectionManager.process Watcher org.apache.solr.common.cloud.ConnectionManager@29239796 name:ZooKeeperConnection Watcher:127.0.0.1:49872 got event WatchedEvent state:SyncConnected type:None path:null path:null type:None
[junit4:junit4]   2> 7086 T2237 oascc.ConnectionManager.waitForConnected Client is connected to ZooKeeper
[junit4:junit4]   2> 7088 T2242 oazs.PrepRequestProcessor.pRequest2Txn Processed session termination for sessionid: 0x13ca0af48aa0007
[junit4:junit4]   2> 7088 T2239 oazs.NIOServerCnxn.closeSock Closed socket connection for client /127.0.0.1:49883 which had sessionid 0x13ca0af48aa0007
[junit4:junit4]   2> 7089 T2291 oaz.ClientCnxn$EventThread.run EventThread shut down
[junit4:junit4]   2> 7089 T2237 oaz.ZooKeeper.close Session: 0x13ca0af48aa0007 closed
[junit4:junit4]   2> 7089 T2237 oascsi.HttpClientUtil.createClient Creating new http client, config:maxConnections=500&maxConnectionsPerHost=16&socketTimeout=60000&connTimeout=15000
[junit4:junit4]   2> 7094 T2237 oaz.ZooKeeper.<init> Initiating client connection, connectString=127.0.0.1:49872/solr sessionTimeout=30000 watcher=org.apache.solr.common.cloud.ConnectionManager@2e5ec4d6
[junit4:junit4]   2> 7096 T2237 oascc.ConnectionManager.waitForConnected Waiting for client to connect to ZooKeeper
[junit4:junit4]   2> 7096 T2292 oaz.ClientCnxn$SendThread.logStartConnect Opening socket connection to server localhost/127.0.0.1:49872. Will not attempt to authenticate using SASL (access denied ("javax.security.auth.AuthPermission" "getLoginConfiguration"))
[junit4:junit4]   2> 7097 T2292 oaz.ClientCnxn$SendThread.primeConnection Socket connection established to localhost/127.0.0.1:49872, initiating session
[junit4:junit4]   2> 7098 T2239 oazs.NIOServerCnxnFactory.run Accepted socket connection from /127.0.0.1:49884
[junit4:junit4]   2> 7098 T2239 oazs.ZooKeeperServer.processConnectRequest Client attempting to establish new session at /127.0.0.1:49884
[junit4:junit4]   2> 7099 T2241 oazs.ZooKeeperServer.finishSessionInit Established session 0x13ca0af48aa0008 with negotiated timeout 20000 for client /127.0.0.1:49884
[junit4:junit4]   2> 7099 T2292 oaz.ClientCnxn$SendThread.onConnected Session establishment complete on server localhost/127.0.0.1:49872, sessionid = 0x13ca0af48aa0008, negotiated timeout = 20000
[junit4:junit4]   2> 7100 T2293 oascc.ConnectionManager.process Watcher org.apache.solr.common.cloud.ConnectionManager@2e5ec4d6 name:ZooKeeperConnection Watcher:127.0.0.1:49872/solr got event WatchedEvent state:SyncConnected type:None path:null path:null type:None
[junit4:junit4]   2> 7100 T2237 oascc.ConnectionManager.waitForConnected Client is connected to ZooKeeper
[junit4:junit4]   2> 7101 T2242 oazs.PrepRequestProcessor.pRequest Got user-level KeeperException when processing sessionid:0x13ca0af48aa0008 type:create cxid:0x1 zxid:0x6c txntype:-1 reqpath:n/a Error Path:/solr/overseer Error:KeeperErrorCode = NodeExists for /solr/overseer
[junit4:junit4]   2> 7103 T2242 oazs.PrepRequestProcessor.pRequest Got user-level KeeperException when processing sessionid:0x13ca0af48aa0008 type:create cxid:0x2 zxid:0x6d txntype:-1 reqpath:n/a Error Path:/solr/overseer Error:KeeperErrorCode = NodeExists for /solr/overseer
[junit4:junit4]   2> 7104 T2237 oasc.ZkController.createEphemeralLiveNode Register node as live in ZooKeeper:/live_nodes/127.0.0.1:49882_
[junit4:junit4]   2> 7105 T2242 oazs.PrepRequestProcessor.pRequest Got user-level KeeperException when processing sessionid:0x13ca0af48aa0008 type:delete cxid:0x4 zxid:0x6e txntype:-1 reqpath:n/a Error Path:/solr/live_nodes/127.0.0.1:49882_ Error:KeeperErrorCode = NoNode for /solr/live_nodes/127.0.0.1:49882_
[junit4:junit4]   2> 7106 T2237 oascc.SolrZkClient.makePath makePath: /live_nodes/127.0.0.1:49882_
[junit4:junit4]   2> 7110 T2259 oascc.ZkStateReader$2.process A cluster state change: WatchedEvent state:SyncConnected type:NodeChildrenChanged path:/live_nodes, has occurred - updating... (live nodes size: 2)
[junit4:junit4]   2> 7110 T2278 oascc.ZkStateReader$2.process A cluster state change: WatchedEvent state:SyncConnected type:NodeChildrenChanged path:/live_nodes, has occurred - updating... (live nodes size: 2)
[junit4:junit4]   2> 7112 T2265 oascc.ZkStateReader$3.process Updating live nodes... (3)
[junit4:junit4]   2> 7112 T2265 oascc.ZkStateReader$2.process A cluster state change: WatchedEvent state:SyncConnected type:NodeChildrenChanged path:/live_nodes, has occurred - updating... (live nodes size: 3)
[junit4:junit4]   2> 7115 T2278 oascc.ZkStateReader$3.process Updating live nodes... (3)
[junit4:junit4]   2> 7115 T2259 oascc.ZkStateReader$3.process Updating live nodes... (3)
[junit4:junit4]   2> 7119 T2237 oascc.ZkStateReader.createClusterStateWatchersAndUpdate Updating cluster state from ZooKeeper... 
[junit4:junit4]   2> 7128 T2294 oasc.CoreContainer.create Creating SolrCore 'collection1' using instanceDir: /Users/jenkins/jenkins-slave/workspace/Lucene-Solr-trunk-MacOSX/solr/build/solr-core/test/J0/./org.apache.solr.cloud.BasicDistributedZkTest-jetty2-1359905514296/collection1
[junit4:junit4]   2> 7128 T2294 oasc.ZkController.createCollectionZkNode Check for collection zkNode:collection1
[junit4:junit4]   2> 7129 T2294 oasc.ZkController.createCollectionZkNode Collection zkNode exists
[junit4:junit4]   2> 7129 T2294 oasc.ZkController.readConfigName Load collection config from:/collections/collection1
[junit4:junit4]   2> 7131 T2294 oasc.SolrResourceLoader.<init> new SolrResourceLoader for directory: '/Users/jenkins/jenkins-slave/workspace/Lucene-Solr-trunk-MacOSX/solr/build/solr-core/test/J0/./org.apache.solr.cloud.BasicDistributedZkTest-jetty2-1359905514296/collection1/'
[junit4:junit4]   2> 7132 T2294 oasc.SolrResourceLoader.replaceClassLoader Adding 'file:/Users/jenkins/jenkins-slave/workspace/Lucene-Solr-trunk-MacOSX/solr/build/solr-core/test/J0/org.apache.solr.cloud.BasicDistributedZkTest-jetty2-1359905514296/collection1/lib/classes/' to classloader
[junit4:junit4]   2> 7133 T2294 oasc.SolrResourceLoader.replaceClassLoader Adding 'file:/Users/jenkins/jenkins-slave/workspace/Lucene-Solr-trunk-MacOSX/solr/build/solr-core/test/J0/org.apache.solr.cloud.BasicDistributedZkTest-jetty2-1359905514296/collection1/lib/README' to classloader
[junit4:junit4]   2> 7180 T2294 oasc.SolrConfig.<init> Using Lucene MatchVersion: LUCENE_50
[junit4:junit4]   2> 7239 T2294 oasc.SolrConfig.<init> Loaded SolrConfig: solrconfig.xml
[junit4:junit4]   2> 7240 T2294 oass.IndexSchema.readSchema Reading Solr Schema
[junit4:junit4]   2> 7245 T2294 oass.IndexSchema.readSchema Schema name=test
[junit4:junit4]   2> 7764 T2294 oass.OpenExchangeRatesOrgProvider.init Initialized with rates=open-exchange-rates.json, refreshInterval=1440.
[junit4:junit4]   2> 7771 T2294 oass.IndexSchema.readSchema default search field in schema is text
[junit4:junit4]   2> 7774 T2294 oass.IndexSchema.readSchema unique key field: id
[junit4:junit4]   2> 7795 T2294 oass.FileExchangeRateProvider.reload Reloading exchange rates from file currency.xml
[junit4:junit4]   2> 7800 T2294 oass.FileExchangeRateProvider.reload Reloading exchange rates from file currency.xml
[junit4:junit4]   2> 7805 T2294 oass.OpenExchangeRatesOrgProvider.reload Reloading exchange rates from open-exchange-rates.json
[junit4:junit4]   2> 7807 T2294 oass.OpenExchangeRatesOrgProvider.reload Reloading exchange rates from open-exchange-rates.json
[junit4:junit4]   2> 7809 T2294 oasc.SolrCore.<init> [collection1] Opening new SolrCore at /Users/jenkins/jenkins-slave/workspace/Lucene-Solr-trunk-MacOSX/solr/build/solr-core/test/J0/./org.apache.solr.cloud.BasicDistributedZkTest-jetty2-1359905514296/collection1/, dataDir=./org.apache.solr.cloud.BasicDistributedZkTest-1359905507479/jetty2/
[junit4:junit4]   2> 7809 T2294 oasc.JmxMonitoredMap.<init> JMX monitoring is enabled. Adding Solr mbeans to JMX Server: com.sun.jmx.mbeanserver.JmxMBeanServer@685d72cd
[junit4:junit4]   2> 7810 T2294 oasc.SolrCore.initDirectoryFactory solr.NRTCachingDirectoryFactory
[junit4:junit4]   2> 7810 T2294 oasc.CachingDirectoryFactory.get return new directory for /Users/jenkins/jenkins-slave/workspace/Lucene-Solr-trunk-MacOSX/solr/build/solr-core/test/J0/./org.apache.solr.cloud.BasicDistributedZkTest-1359905507479/jetty2 forceNew:false
[junit4:junit4]   2> 7811 T2294 oasc.CachingDirectoryFactory.close Releasing directory:/Users/jenkins/jenkins-slave/workspace/Lucene-Solr-trunk-MacOSX/solr/build/solr-core/test/J0/./org.apache.solr.cloud.BasicDistributedZkTest-1359905507479/jetty2
[junit4:junit4]   2> 7811 T2294 oasc.SolrCore.getNewIndexDir New index directory detected: old=null new=./org.apache.solr.cloud.BasicDistributedZkTest-1359905507479/jetty2/index/
[junit4:junit4]   2> 7812 T2294 oasc.SolrCore.initIndex WARNING [collection1] Solr index directory './org.apache.solr.cloud.BasicDistributedZkTest-1359905507479/jetty2/index' doesn't exist. Creating new index...
[junit4:junit4]   2> 7812 T2294 oasc.CachingDirectoryFactory.get return new directory for /Users/jenkins/jenkins-slave/workspace/Lucene-Solr-trunk-MacOSX/solr/build/solr-core/test/J0/./org.apache.solr.cloud.BasicDistributedZkTest-1359905507479/jetty2/index forceNew:false
[junit4:junit4]   2> 7817 T2294 oasc.SolrDeletionPolicy.onCommit SolrDeletionPolicy.onCommit: commits:num=1
[junit4:junit4]   2> 		commit{dir=RateLimitedDirectoryWrapper(NRTCachingDirectory(org.apache.lucene.store.NIOFSDirectory@/Users/jenkins/jenkins-slave/workspace/Lucene-Solr-trunk-MacOSX/solr/build/solr-core/test/J0/org.apache.solr.cloud.BasicDistributedZkTest-1359905507479/jetty2/index lockFactory=org.apache.lucene.store.NativeFSLockFactory@14a82974; maxCacheMB=48.0 maxMergeSizeMB=4.0)),segFN=segments_1,generation=1,filenames=[segments_1]
[junit4:junit4]   2> 7818 T2294 oasc.SolrDeletionPolicy.updateCommits newest commit = 1[segments_1]
[junit4:junit4]   2> 7819 T2294 oasc.CachingDirectoryFactory.close Releasing directory:/Users/jenkins/jenkins-slave/workspace/Lucene-Solr-trunk-MacOSX/solr/build/solr-core/test/J0/./org.apache.solr.cloud.BasicDistributedZkTest-1359905507479/jetty2/index
[junit4:junit4]   2> 7819 T2294 oasc.SolrCore.initWriters created xml: solr.XMLResponseWriter
[junit4:junit4]   2> 7822 T2294 oasup.UpdateRequestProcessorChain.init inserting DistributedUpdateProcessorFactory into updateRequestProcessorChain "dedupe"
[junit4:junit4]   2> 7822 T2294 oasup.UpdateRequestProcessorChain.init inserting DistributedUpdateProcessorFactory into updateRequestProcessorChain "dedupe-allfields"
[junit4:junit4]   2> 7823 T2294 oasup.UpdateRequestProcessorChain.init inserting DistributedUpdateProcessorFactory into updateRequestProcessorChain "stored_sig"
[junit4:junit4]   2> 7823 T2294 oasup.UpdateRequestProcessorChain.init inserting DistributedUpdateProcessorFactory into updateRequestProcessorChain "uniq-fields"
[junit4:junit4]   2> 7824 T2294 oasup.UpdateRequestProcessorChain.init inserting DistributedUpdateProcessorFactory into updateRequestProcessorChain "distrib-dup-test-chain-implicit"
[junit4:junit4]   2> 7824 T2294 oasc.RequestHandlers.initHandlersFromConfig adding lazy requestHandler: solr.ReplicationHandler
[junit4:junit4]   2> 7825 T2294 oasc.RequestHandlers.initHandlersFromConfig created /replication: solr.ReplicationHandler
[junit4:junit4]   2> 7825 T2294 oasc.RequestHandlers.initHandlersFromConfig created standard: solr.StandardRequestHandler
[junit4:junit4]   2> 7826 T2294 oasc.RequestHandlers.initHandlersFromConfig created /get: solr.RealTimeGetHandler
[junit4:junit4]   2> 7827 T2294 oasc.RequestHandlers.initHandlersFromConfig created dismax: solr.SearchHandler
[junit4:junit4]   2> 7827 T2294 oasc.RequestHandlers.initHandlersFromConfig created mock: org.apache.solr.core.MockQuerySenderListenerReqHandler
[junit4:junit4]   2> 7828 T2294 oasc.RequestHandlers.initHandlersFromConfig created /admin/: org.apache.solr.handler.admin.AdminHandlers
[junit4:junit4]   2> 7828 T2294 oasc.RequestHandlers.initHandlersFromConfig created defaults: solr.StandardRequestHandler
[junit4:junit4]   2> 7829 T2294 oasc.RequestHandlers.initHandlersFromConfig adding lazy requestHandler: solr.StandardRequestHandler
[junit4:junit4]   2> 7829 T2294 oasc.RequestHandlers.initHandlersFromConfig created lazy: solr.StandardRequestHandler
[junit4:junit4]   2> 7830 T2294 oasc.RequestHandlers.initHandlersFromConfig created /update: solr.UpdateRequestHandler
[junit4:junit4]   2> 7830 T2294 oasc.RequestHandlers.initHandlersFromConfig created /terms: org.apache.solr.handler.component.SearchHandler
[junit4:junit4]   2> 7831 T2294 oasc.RequestHandlers.initHandlersFromConfig created spellCheckCompRH: org.apache.solr.handler.component.SearchHandler
[junit4:junit4]   2> 7831 T2294 oasc.RequestHandlers.initHandlersFromConfig created spellCheckCompRH_Direct: org.apache.solr.handler.component.SearchHandler
[junit4:junit4]   2> 7832 T2294 oasc.RequestHandlers.initHandlersFromConfig created spellCheckWithWordbreak: org.apache.solr.handler.component.SearchHandler
[junit4:junit4]   2> 7833 T2294 oasc.RequestHandlers.initHandlersFromConfig created spellCheckWithWordbreak_Direct: org.apache.solr.handler.component.SearchHandler
[junit4:junit4]   2> 7833 T2294 oasc.RequestHandlers.initHandlersFromConfig created spellCheckCompRH1: org.apache.solr.handler.component.SearchHandler
[junit4:junit4]   2> 7834 T2294 oasc.RequestHandlers.initHandlersFromConfig created mltrh: org.apache.solr.handler.component.SearchHandler
[junit4:junit4]   2> 7834 T2294 oasc.RequestHandlers.initHandlersFromConfig created tvrh: org.apache.solr.handler.component.SearchHandler
[junit4:junit4]   2> 7835 T2294 oasc.RequestHandlers.initHandlersFromConfig created /mlt: solr.MoreLikeThisHandler
[junit4:junit4]   2> 7836 T2294 oasc.RequestHandlers.initHandlersFromConfig created /debug/dump: solr.DumpRequestHandler
[junit4:junit4]   2> 7842 T2294 oashl.XMLLoader.init xsltCacheLifetimeSeconds=60
[junit4:junit4]   2> 7847 T2294 oasc.SolrCore.initDeprecatedSupport WARNING solrconfig.xml uses deprecated <admin/gettableFiles>, Please update your config to use the ShowFileRequestHandler.
[junit4:junit4]   2> 7848 T2294 oasc.SolrCore.initDeprecatedSupport WARNING adding ShowFileRequestHandler with hidden files: [SCHEMA.XML, OLD_SYNONYMS.TXT, STOPWORDS.TXT, PROTWORDS.TXT, OPEN-EXCHANGE-RATES.JSON, SYNONYMS.TXT, CURRENCY.XML, MAPPING-ISOLATIN1ACCENT.TXT]
[junit4:junit4]   2> 7851 T2294 oasc.CachingDirectoryFactory.close Releasing directory:/Users/jenkins/jenkins-slave/workspace/Lucene-Solr-trunk-MacOSX/solr/build/solr-core/test/J0/./org.apache.solr.cloud.BasicDistributedZkTest-1359905507479/jetty2
[junit4:junit4]   2> 7852 T2294 oass.SolrIndexSearcher.<init> Opening Searcher@43571abe main
[junit4:junit4]   2> 7853 T2294 oasu.CommitTracker.<init> Hard AutoCommit: disabled
[junit4:junit4]   2> 7853 T2294 oasu.CommitTracker.<init> Soft AutoCommit: disabled
[junit4:junit4]   2> 7854 T2294 oashc.SpellCheckComponent.inform Initializing spell checkers
[junit4:junit4]   2> 7859 T2294 oass.DirectSolrSpellChecker.init init: {name=direct,classname=DirectSolrSpellChecker,field=lowerfilt,minQueryLength=3}
[junit4:junit4]   2> 7890 T2295 oasc.SolrCore.registerSearcher [collection1] Registered new searcher Searcher@43571abe main{StandardDirectoryReader(segments_1:1)}
[junit4:junit4]   2> 7896 T2294 oasc.ZkController.publish publishing core=collection1 state=down
[junit4:junit4]   2> 7896 T2294 oasc.ZkController.publish numShards not found on descriptor - reading it from system property
[junit4:junit4]   2> 8269 T2260 oascc.ZkStateReader.updateClusterState Updating cloud state from ZooKeeper... 
[junit4:junit4]   2> 8270 T2260 oasc.Overseer$ClusterStateUpdater.updateState Update state numShards=2 message={
[junit4:junit4]   2> 	  "operation":"state",
[junit4:junit4]   2> 	  "numShards":"2",
[junit4:junit4]   2> 	  "shard":"shard1",
[junit4:junit4]   2> 	  "roles":null,
[junit4:junit4]   2> 	  "state":"active",
[junit4:junit4]   2> 	  "core":"collection1",
[junit4:junit4]   2> 	  "collection":"collection1",
[junit4:junit4]   2> 	  "node_name":"127.0.0.1:49879_",
[junit4:junit4]   2> 	  "base_url":"http://127.0.0.1:49879"}
[junit4:junit4]   2> 8276 T2260 oasc.Overseer$ClusterStateUpdater.updateState Update state numShards=2 message={
[junit4:junit4]   2> 	  "operation":"state",
[junit4:junit4]   2> 	  "numShards":"2",
[junit4:junit4]   2> 	  "shard":null,
[junit4:junit4]   2> 	  "roles":null,
[junit4:junit4]   2> 	  "state":"down",
[junit4:junit4]   2> 	  "core":"collection1",
[junit4:junit4]   2> 	  "collection":"collection1",
[junit4:junit4]   2> 	  "node_name":"127.0.0.1:49882_",
[junit4:junit4]   2> 	  "base_url":"http://127.0.0.1:49882"}
[junit4:junit4]   2> 8276 T2260 oasc.Overseer$ClusterStateUpdater.updateState Collection already exists with numShards=2
[junit4:junit4]   2> 8276 T2260 oasc.Overseer$ClusterStateUpdater.updateState Assigning new node to shard shard=shard2
[junit4:junit4]   2> 8283 T2293 oascc.ZkStateReader$2.process A cluster state change: WatchedEvent state:SyncConnected type:NodeDataChanged path:/clusterstate.json, has occurred - updating... (live nodes size: 3)
[junit4:junit4]   2> 8283 T2278 oascc.ZkStateReader$2.process A cluster state change: WatchedEvent state:SyncConnected type:NodeDataChanged path:/clusterstate.json, has occurred - updating... (live nodes size: 3)
[junit4:junit4]   2> 8283 T2259 oascc.ZkStateReader$2.process A cluster state change: WatchedEvent state:SyncConnected type:NodeDataChanged path:/clusterstate.json, has occurred - updating... (live nodes size: 3)
[junit4:junit4]   2> 8283 T2265 oascc.ZkStateReader$2.process A cluster state change: WatchedEvent state:SyncConnected type:NodeDataChanged path:/clusterstate.json, has occurred - updating... (live nodes size: 3)
[junit4:junit4]   2> 8899 T2294 oasc.CoreContainer.registerCore registering core: collection1
[junit4:junit4]   2> 8900 T2294 oasc.ZkController.register Register replica - core:collection1 address:http://127.0.0.1:49882 collection:collection1 shard:shard2
[junit4:junit4]   2> 8902 T2294 oascc.SolrZkClient.makePath makePath: /collections/collection1/leader_elect/shard2/election
[junit4:junit4]   2> 8922 T2242 oazs.PrepRequestProcessor.pRequest Got user-level KeeperException when processing sessionid:0x13ca0af48aa0008 type:delete cxid:0x42 zxid:0x7c txntype:-1 reqpath:n/a Error Path:/solr/collections/collection1/leaders/shard2 Error:KeeperErrorCode = NoNode for /solr/collections/collection1/leaders/shard2
[junit4:junit4]   2> 8924 T2294 oasc.ShardLeaderElectionContext.runLeaderProcess Running the leader process.
[junit4:junit4]   2> 8925 T2242 oazs.PrepRequestProcessor.pRequest Got user-level KeeperException when processing sessionid:0x13ca0af48aa0008 type:create cxid:0x43 zxid:0x7d txntype:-1 reqpath:n/a Error Path:/solr/overseer Error:KeeperErrorCode = NodeExists for /solr/overseer
[junit4:junit4]   2> 8929 T2294 oasc.ShardLeaderElectionContext.waitForReplicasToComeUp Enough replicas found to continue.
[junit4:junit4]   2> 8930 T2294 oasc.ShardLeaderElectionContext.runLeaderProcess I may be the new leader - try and sync
[junit4:junit4]   2> 8930 T2294 oasc.SyncStrategy.sync Sync replicas to http://127.0.0.1:49882/collection1/
[junit4:junit4]   2> 8931 T2294 oasc.SyncStrategy.syncReplicas Sync Success - now sync replicas to me
[junit4:junit4]   2> 8931 T2294 oasc.SyncStrategy.syncToMe http://127.0.0.1:49882/collection1/ has no replicas
[junit4:junit4]   2> 8932 T2294 oasc.ShardLeaderElectionContext.runLeaderProcess I am the new leader: http://127.0.0.1:49882/collection1/
[junit4:junit4]   2> 8932 T2294 oascc.SolrZkClient.makePath makePath: /collections/collection1/leaders/shard2
[junit4:junit4]   2> 8943 T2242 oazs.PrepRequestProcessor.pRequest Got user-level KeeperException when processing sessionid:0x13ca0af48aa0008 type:create cxid:0x4c zxid:0x80 txntype:-1 reqpath:n/a Error Path:/solr/overseer Error:KeeperErrorCode = NodeExists for /solr/overseer
[junit4:junit4]   2> 9797 T2260 oascc.ZkStateReader.updateClusterState Updating cloud state from ZooKeeper... 
[junit4:junit4]   2> 9817 T2265 oascc.ZkStateReader$2.process A cluster state change: WatchedEvent state:SyncConnected type:NodeDataChanged path:/clusterstate.json, has occurred - updating... (live nodes size: 3)
[junit4:junit4]   2> 9817 T2293 oascc.ZkStateReader$2.process A cluster state change: WatchedEvent state:SyncConnected type:NodeDataChanged path:/clusterstate.json, has occurred - updating... (live nodes size: 3)
[junit4:junit4]   2> 9817 T2259 oascc.ZkStateReader$2.process A cluster state change: WatchedEvent state:SyncConnected type:NodeDataChanged path:/clusterstate.json, has occurred - updating... (live nodes size: 3)
[junit4:junit4]   2> 9817 T2278 oascc.ZkStateReader$2.process A cluster state change: WatchedEvent state:SyncConnected type:NodeDataChanged path:/clusterstate.json, has occurred - updating... (live nodes size: 3)
[junit4:junit4]   2> 9832 T2294 oasc.ZkController.register We are http://127.0.0.1:49882/collection1/ and leader is http://127.0.0.1:49882/collection1/
[junit4:junit4]   2> 9832 T2294 oasc.ZkController.register No LogReplay needed for core=collection1 baseURL=http://127.0.0.1:49882
[junit4:junit4]   2> 9832 T2294 oasc.ZkController.checkRecovery I am the leader, no recovery necessary
[junit4:junit4]   2> 9832 T2294 oasc.ZkController.publish publishing core=collection1 state=active
[junit4:junit4]   2> 9833 T2294 oasc.ZkController.publish numShards not found on descriptor - reading it from system property
[junit4:junit4]   2> 9835 T2294 oascc.ZkStateReader.updateClusterState Updating cloud state from ZooKeeper... 
[junit4:junit4]   2> 9836 T2237 oass.SolrDispatchFilter.init user.dir=/Users/jenkins/jenkins-slave/workspace/Lucene-Solr-trunk-MacOSX/solr/build/solr-core/test/J0
[junit4:junit4]   2> 9837 T2237 oass.SolrDispatchFilter.init SolrDispatchFilter.init() done
[junit4:junit4]   2> 9838 T2237 oascsi.HttpClientUtil.createClient Creating new http client, config:maxConnections=128&maxConnectionsPerHost=32&followRedirects=false
[junit4:junit4]   2> 9994 T2237 oejs.Server.doStart jetty-8.1.8.v20121106
[junit4:junit4]   2> 9999 T2237 oejs.AbstractConnector.doStart Started SelectChannelConnector@127.0.0.1:49885
[junit4:junit4]   2> 10000 T2237 oass.SolrDispatchFilter.init SolrDispatchFilter.init()
[junit4:junit4]   2> 10001 T2237 oasc.SolrResourceLoader.locateSolrHome JNDI not configured for solr (NoInitialContextEx)
[junit4:junit4]   2> 10001 T2237 oasc.SolrResourceLoader.locateSolrHome using system property solr.solr.home: /Users/jenkins/jenkins-slave/workspace/Lucene-Solr-trunk-MacOSX/solr/build/solr-core/test/J0/./org.apache.solr.cloud.BasicDistributedZkTest-jetty3-1359905517315
[junit4:junit4]   2> 10002 T2237 oasc.CoreContainer$Initializer.initialize looking for solr.xml: /Users/jenkins/jenkins-slave/workspace/Lucene-Solr-trunk-MacOSX/solr/build/solr-core/test/J0/./org.apache.solr.cloud.BasicDistributedZkTest-jetty3-1359905517315/solr.xml
[junit4:junit4]   2> 10002 T2237 oasc.CoreContainer.<init> New CoreContainer 1478444421
[junit4:junit4]   2> 10003 T2237 oasc.CoreContainer.load Loading CoreContainer using Solr Home: '/Users/jenkins/jenkins-slave/workspace/Lucene-Solr-trunk-MacOSX/solr/build/solr-core/test/J0/./org.apache.solr.cloud.BasicDistributedZkTest-jetty3-1359905517315/'
[junit4:junit4]   2> 10003 T2237 oasc.SolrResourceLoader.<init> new SolrResourceLoader for directory: '/Users/jenkins/jenkins-slave/workspace/Lucene-Solr-trunk-MacOSX/solr/build/solr-core/test/J0/./org.apache.solr.cloud.BasicDistributedZkTest-jetty3-1359905517315/'
[junit4:junit4]   2> 10047 T2237 oashc.HttpShardHandlerFactory.getParameter Setting socketTimeout to: 60000
[junit4:junit4]   2> 10048 T2237 oashc.HttpShardHandlerFactory.getParameter Setting urlScheme to: http://
[junit4:junit4]   2> 10048 T2237 oashc.HttpShardHandlerFactory.getParameter Setting connTimeout to: 15000
[junit4:junit4]   2> 10049 T2237 oashc.HttpShardHandlerFactory.getParameter Setting maxConnectionsPerHost to: 20
[junit4:junit4]   2> 10050 T2237 oashc.HttpShardHandlerFactory.getParameter Setting corePoolSize to: 0
[junit4:junit4]   2> 10050 T2237 oashc.HttpShardHandlerFactory.getParameter Setting maximumPoolSize to: 2147483647
[junit4:junit4]   2> 10051 T2237 oashc.HttpShardHandlerFactory.getParameter Setting maxThreadIdleTime to: 5
[junit4:junit4]   2> 10051 T2237 oashc.HttpShardHandlerFactory.getParameter Setting sizeOfQueue to: -1
[junit4:junit4]   2> 10052 T2237 oashc.HttpShardHandlerFactory.getParameter Setting fairnessPolicy to: false
[junit4:junit4]   2> 10052 T2237 oascsi.HttpClientUtil.createClient Creating new http client, config:maxConnectionsPerHost=20&maxConnections=10000&socketTimeout=60000&connTimeout=15000&retry=false
[junit4:junit4]   2> 10065 T2237 oasc.CoreContainer.load Registering Log Listener
[junit4:junit4]   2> 10083 T2237 oasc.CoreContainer.initZooKeeper Zookeeper client=127.0.0.1:49872/solr
[junit4:junit4]   2> 10084 T2237 oasc.ZkController.checkChrootPath zkHost includes chroot
[junit4:junit4]   2> 10085 T2237 oaz.ZooKeeper.<init> Initiating client connection, connectString=127.0.0.1:49872 sessionTimeout=60000 watcher=org.apache.solr.common.cloud.ConnectionManager@642e29e1
[junit4:junit4]   2> 10086 T2237 oascc.ConnectionManager.waitForConnected Waiting for client to connect to ZooKeeper
[junit4:junit4]   2> 10086 T2305 oaz.ClientCnxn$SendThread.logStartConnect Opening socket connection to server localhost/127.0.0.1:49872. Will not attempt to authenticate using SASL (access denied ("javax.security.auth.AuthPermission" "getLoginConfiguration"))
[junit4:junit4]   2> 10088 T2305 oaz.ClientCnxn$SendThread.primeConnection Socket connection established to localhost/127.0.0.1:49872, initiating session
[junit4:junit4]   2> 10088 T2239 oazs.NIOServerCnxnFactory.run Accepted socket connection from /127.0.0.1:49886
[junit4:junit4]   2> 10089 T2239 oazs.ZooKeeperServer.processConnectRequest Client attempting to establish new session at /127.0.0.1:49886
[junit4:junit4]   2> 10089 T2241 oazs.ZooKeeperServer.finishSessionInit Established session 0x13ca0af48aa0009 with negotiated timeout 20000 for client /127.0.0.1:49886
[junit4:junit4]   2> 10090 T2305 oaz.ClientCnxn$SendThread.onConnected Session establishment complete on server localhost/127.0.0.1:49872, sessionid = 0x13ca0af48aa0009, negotiated timeout = 20000
[junit4:junit4]   2> 10090 T2306 oascc.ConnectionManager.process Watcher org.apache.solr.common.cloud.ConnectionManager@642e29e1 name:ZooKeeperConnection Watcher:127.0.0.1:49872 got event WatchedEvent state:SyncConnected type:None path:null path:null type:None
[junit4:junit4]   2> 10090 T2237 oascc.ConnectionManager.waitForConnected Client is connected to ZooKeeper
[junit4:junit4]   2> 10092 T2242 oazs.PrepRequestProcessor.pRequest2Txn Processed session termination for sessionid: 0x13ca0af48aa0009
[junit4:junit4]   2> 10093 T2239 oazs.NIOServerCnxn.closeSock Closed socket connection for client /127.0.0.1:49886 which had sessionid 0x13ca0af48aa0009
[junit4:junit4]   2> 10094 T2306 oaz.ClientCnxn$EventThread.run EventThread shut down
[junit4:junit4]   2> 10093 T2237 oaz.ZooKeeper.close Session: 0x13ca0af48aa0009 closed
[junit4:junit4]   2> 10094 T2237 oascsi.HttpClientUtil.createClient Creating new http client, config:maxConnections=500&maxConnectionsPerHost=16&socketTimeout=60000&connTimeout=15000
[junit4:junit4]   2> 10099 T2237 oaz.ZooKeeper.<init> Initiating client connection, connectString=127.0.0.1:49872/solr sessionTimeout=30000 watcher=org.apache.solr.common.cloud.ConnectionManager@3507d0fd
[junit4:junit4]   2> 10100 T2237 oascc.ConnectionManager.waitForConnected Waiting for client to connect to ZooKeeper
[junit4:junit4]   2> 10100 T2307 oaz.ClientCnxn$SendThread.logStartConnect Opening socket connection to server localhost/127.0.0.1:49872. Will not attempt to authenticate using SASL (access denied ("javax.security.auth.AuthPermission" "getLoginConfiguration"))
[junit4:junit4]   2> 10101 T2307 oaz.ClientCnxn$SendThread.primeConnection Socket connection established to localhost/127.0.0.1:49872, initiating session
[junit4:junit4]   2> 10101 T2239 oazs.NIOServerCnxnFactory.run Accepted socket connection from /127.0.0.1:49887
[junit4:junit4]   2> 10102 T2239 oazs.ZooKeeperServer.processConnectRequest Client attempting to establish new session at /127.0.0.1:49887
[junit4:junit4]   2> 10103 T2241 oazs.ZooKeeperServer.finishSessionInit Established session 0x13ca0af48aa000a with negotiated timeout 20000 for client /127.0.0.1:49887
[junit4:junit4]   2> 10104 T2307 oaz.ClientCnxn$SendThread.onConnected Session establishment complete on server localhost/127.0.0.1:49872, sessionid = 0x13ca0af48aa000a, negotiated timeout = 20000
[junit4:junit4]   2> 10104 T2308 oascc.ConnectionManager.process Watcher org.apache.solr.common.cloud.ConnectionManager@3507d0fd name:ZooKeeperConnection Watcher:127.0.0.1:49872/solr got event WatchedEvent state:SyncConnected type:None path:null path:null type:None
[junit4:junit4]   2> 10104 T2237 oascc.ConnectionManager.waitForConnected Client is connected to ZooKeeper
[junit4:junit4]   2> 10106 T2242 oazs.PrepRequestProcessor.pRequest Got user-level KeeperException when processing sessionid:0x13ca0af48aa000a type:create cxid:0x1 zxid:0x8d txntype:-1 reqpath:n/a Error Path:/solr/overseer Error:KeeperErrorCode = NodeExists for /solr/overseer
[junit4:junit4]   2> 10108 T2242 oazs.PrepRequestProcessor.pRequest Got user-level KeeperException when processing sessionid:0x13ca0af48aa000a type:create cxid:0x2 zxid:0x8e txntype:-1 reqpath:n/a Error Path:/solr/overseer Error:KeeperErrorCode = NodeExists for /solr/overseer
[junit4:junit4]   2> 10110 T2237 oasc.ZkController.createEphemeralLiveNode Register node as live in ZooKeeper:/live_nodes/127.0.0.1:49885_
[junit4:junit4]   2> 10111 T2242 oazs.PrepRequestProcessor.pRequest Got user-level KeeperException when processing sessionid:0x13ca0af48aa000a type:delete cxid:0x4 zxid:0x8f txntype:-1 reqpath:n/a Error Path:/solr/live_nodes/127.0.0.1:49885_ Error:KeeperErrorCode = NoNode for /solr/live_nodes/127.0.0.1:49885_
[junit4:junit4]   2> 10112 T2237 oascc.SolrZkClient.makePath makePath: /live_nodes/127.0.0.1:49885_
[junit4:junit4]   2> 10115 T2293 oascc.ZkStateReader$2.process A cluster state change: WatchedEvent state:SyncConnected type:NodeChildrenChanged path:/live_nodes, has occurred - updating... (live nodes size: 3)
[junit4:junit4]   2> 10116 T2259 oascc.ZkStateReader$2.process A cluster state change: WatchedEvent state:SyncConnected type:NodeChildrenChanged path:/live_nodes, has occurred - updating... (live nodes size: 3)
[junit4:junit4]   2> 10116 T2278 oascc.ZkStateReader$2.process A cluster state change: WatchedEvent state:SyncConnected type:NodeChildrenChanged path:/live_nodes, has occurred - updating... (live nodes size: 3)
[junit4:junit4]   2> 10117 T2265 oascc.ZkStateReader$3.process Updating live nodes... (4)
[junit4:junit4]   2> 10117 T2265 oascc.ZkStateReader$2.process A cluster state change: WatchedEvent state:SyncConnected type:NodeChildrenChanged path:/live_nodes, has occurred - updating... (live nodes size: 4)
[junit4:junit4]   2> 10121 T2293 oascc.ZkStateReader$3.process Updating live nodes... (4)
[junit4:junit4]   2> 10121 T2259 oascc.ZkStateReader$3.process Updating live nodes... (4)
[junit4:junit4]   2> 10121 T2278 oascc.ZkStateReader$3.process Updating live nodes... (4)
[junit4:junit4]   2> 10125 T2237 oascc.ZkStateReader.createClusterStateWatchersAndUpdate Updating cluster state from ZooKeeper... 
[junit4:junit4]   2> 10133 T2309 oasc.CoreContainer.create Creating SolrCore 'collection1' using instanceDir: /Users/jenkins/jenkins-slave/workspace/Lucene-Solr-trunk-MacOSX/solr/build/solr-core/test/J0/./org.apache.solr.cloud.BasicDistributedZkTest-jetty3-1359905517315/collection1
[junit4:junit4]   2> 10134 T2309 oasc.ZkController.createCollectionZkNode Check for collection zkNode:collection1
[junit4:junit4]   2> 10135 T2309 oasc.ZkController.createCollectionZkNode Collection zkNode exists
[junit4:junit4]   2> 10135 T2309 oasc.ZkController.readConfigName Load collection config from:/collections/collection1
[junit4:junit4]   2> 10137 T2309 oasc.SolrResourceLoader.<init> new SolrResourceLoader for directory: '/Users/jenkins/jenkins-slave/workspace/Lucene-Solr-trunk-MacOSX/solr/build/solr-core/test/J0/./org.apache.solr.cloud.BasicDistributedZkTest-jetty3-1359905517315/collection1/'
[junit4:junit4]   2> 10138 T2309 oasc.SolrResourceLoader.replaceClassLoader Adding 'file:/Users/jenkins/jenkins-slave/workspace/Lucene-Solr-trunk-MacOSX/solr/build/solr-core/test/J0/org.apache.solr.cloud.BasicDistributedZkTest-jetty3-1359905517315/collection1/lib/classes/' to classloader
[junit4:junit4]   2> 10139 T2309 oasc.SolrResourceLoader.replaceClassLoader Adding 'file:/Users/jenkins/jenkins-slave/workspace/Lucene-Solr-trunk-MacOSX/solr/build/solr-core/test/J0/org.apache.solr.cloud.BasicDistributedZkTest-jetty3-1359905517315/collection1/lib/README' to classloader
[junit4:junit4]   2> 10186 T2309 oasc.SolrConfig.<init> Using Lucene MatchVersion: LUCENE_50
[junit4:junit4]   2> 10255 T2309 oasc.SolrConfig.<init> Loaded SolrConfig: solrconfig.xml
[junit4:junit4]   2> 10257 T2309 oass.IndexSchema.readSchema Reading Solr Schema
[junit4:junit4]   2> 10262 T2309 oass.IndexSchema.readSchema Schema name=test
[junit4:junit4]   2> 10784 T2309 oass.OpenExchangeRatesOrgProvider.init Initialized with rates=open-exchange-rates.json, refreshInterval=1440.
[junit4:junit4]   2> 10792 T2309 oass.IndexSchema.readSchema default search field in schema is text
[junit4:junit4]   2> 10795 T2309 oass.IndexSchema.readSchema unique key field: id
[junit4:junit4]   2> 10817 T2309 oass.FileExchangeRateProvider.reload Reloading exchange rates from file currency.xml
[junit4:junit4]   2> 10823 T2309 oass.FileExchangeRateProvider.reload Reloading exchange rates from file currency.xml
[junit4:junit4]   2> 10828 T2309 oass.OpenExchangeRatesOrgProvider.reload Reloading exchange rates from open-exchange-rates.json
[junit4:junit4]   2> 10830 T2309 oass.OpenExchangeRatesOrgProvider.reload Reloading exchange rates from open-exchange-rates.json
[junit4:junit4]   2> 10832 T2309 oasc.SolrCore.<init> [collection1] Opening new SolrCore at /Users/jenkins/jenkins-slave/workspace/Lucene-Solr-trunk-MacOSX/solr/build/solr-core/test/J0/./org.apache.solr.cloud.BasicDistributedZkTest-jetty3-1359905517315/collection1/, dataDir=./org.apache.solr.cloud.BasicDistributedZkTest-1359905507479/jetty3/
[junit4:junit4]   2> 10832 T2309 oasc.JmxMonitoredMap.<init> JMX monitoring is enabled. Adding Solr mbeans to JMX Server: com.sun.jmx.mbeanserver.JmxMBeanServer@685d72cd
[junit4:junit4]   2> 10833 T2309 oasc.SolrCore.initDirectoryFactory solr.NRTCachingDirectoryFactory
[junit4:junit4]   2> 10834 T2309 oasc.CachingDirectoryFactory.get return new directory for /Users/jenkins/jenkins-slave/workspace/Lucene-Solr-trunk-MacOSX/solr/build/solr-core/test/J0/./org.apache.solr.cloud.BasicDistributedZkTest-1359905507479/jetty3 forceNew:false
[junit4:junit4]   2> 10834 T2309 oasc.CachingDirectoryFactory.close Releasing directory:/Users/jenkins/jenkins-slave/workspace/Lucene-Solr-trunk-MacOSX/solr/build/solr-core/test/J0/./org.apache.solr.cloud.BasicDistributedZkTest-1359905507479/jetty3
[junit4:junit4]   2> 10834 T2309 oasc.SolrCore.getNewIndexDir New index directory detected: old=null new=./org.apache.solr.cloud.BasicDistributedZkTest-1359905507479/jetty3/index/
[junit4:junit4]   2> 10835 T2309 oasc.SolrCore.initIndex WARNING [collection1] Solr index directory './org.apache.solr.cloud.BasicDistributedZkTest-1359905507479/jetty3/index' doesn't exist. Creating new index...
[junit4:junit4]   2> 10836 T2309 oasc.CachingDirectoryFactory.get return new directory for /Users/jenkins/jenkins-slave/workspace/Lucene-Solr-trunk-MacOSX/solr/build/solr-core/test/J0/./org.apache.solr.cloud.BasicDistributedZkTest-1359905507479/jetty3/index forceNew:false
[junit4:junit4]   2> 10842 T2309 oasc.SolrDeletionPolicy.onCommit SolrDeletionPolicy.onCommit: commits:num=1
[junit4:junit4]   2> 		commit{dir=RateLimitedDirectoryWrapper(NRTCachingDirectory(org.apache.lucene.store.NIOFSDirectory@/Users/jenkins/jenkins-slave/workspace/Lucene-Solr-trunk-MacOSX/solr/build/solr-core/test/J0/org.apache.solr.cloud.BasicDistributedZkTest-1359905507479/jetty3/index lockFactory=org.apache.lucene.store.NativeFSLockFactory@6360c6d3; maxCacheMB=48.0 maxMergeSizeMB=4.0)),segFN=segments_1,generation=1,filenames=[segments_1]
[junit4:junit4]   2> 10842 T2309 oasc.SolrDeletionPolicy.updateCommits newest commit = 1[segments_1]
[junit4:junit4]   2> 10843 T2309 oasc.CachingDirectoryFactory.close Releasing directory:/Users/jenkins/jenkins-slave/workspace/Lucene-Solr-trunk-MacOSX/solr/build/solr-core/test/J0/./org.apache.solr.cloud.BasicDistributedZkTest-1359905507479/jetty3/index
[junit4:junit4]   2> 10844 T2309 oasc.SolrCore.initWriters created xml: solr.XMLResponseWriter
[junit4:junit4]   2> 10846 T2309 oasup.UpdateRequestProcessorChain.init inserting DistributedUpdateProcessorFactory into updateRequestProcessorChain "dedupe"
[junit4:junit4]   2> 10847 T2309 oasup.UpdateRequestProcessorChain.init inserting DistributedUpdateProcessorFactory into updateRequestProcessorChain "dedupe-allfields"
[junit4:junit4]   2> 10847 T2309 oasup.UpdateRequestProcessorChain.init inserting DistributedUpdateProcessorFactory into updateRequestProcessorChain "stored_sig"
[junit4:junit4]   2> 10848 T2309 oasup.UpdateRequestProcessorChain.init inserting DistributedUpdateProcessorFactory into updateRequestProcessorChain "uniq-fields"
[junit4:junit4]   2> 10849 T2309 oasup.UpdateRequestProcessorChain.init inserting DistributedUpdateProcessorFactory into updateRequestProcessorChain "distrib-dup-test-chain-implicit"
[junit4:junit4]   2> 10849 T2309 oasc.RequestHandlers.initHandlersFromConfig adding lazy requestHandler: solr.ReplicationHandler
[junit4:junit4]   2> 10850 T2309 oasc.RequestHandlers.initHandlersFromConfig created /replication: solr.ReplicationHandler
[junit4:junit4]   2> 10851 T2309 oasc.RequestHandlers.initHandlersFromConfig created standard: solr.StandardRequestHandler
[junit4:junit4]   2> 10852 T2309 oasc.RequestHandlers.initHandlersFromConfig created /get: solr.RealTimeGetHandler
[junit4:junit4]   2> 10853 T2309 oasc.RequestHandlers.initHandlersFromConfig created dismax: solr.SearchHandler
[junit4:junit4]   2> 10854 T2309 oasc.RequestHandlers.initHandlersFromConfig created mock: org.apache.solr.core.MockQuerySenderListenerReqHandler
[junit4:junit4]   2> 10854 T2309 oasc.RequestHandlers.initHandlersFromConfig created /admin/: org.apache.solr.handler.admin.AdminHandlers
[junit4:junit4]   2> 10855 T2309 oasc.RequestHandlers.initHandlersFromConfig created defaults: solr.StandardRequestHandler
[junit4:junit4]   2> 10855 T2309 oasc.RequestHandlers.initHandlersFromConfig adding lazy requestHandler: solr.StandardRequestHandler
[junit4:junit4]   2> 10856 T2309 oasc.RequestHandlers.initHandlersFromConfig created lazy: solr.StandardRequestHandler
[junit4:junit4]   2> 10856 T2309 oasc.RequestHandlers.initHandlersFromConfig created /update: solr.UpdateRequestHandler
[junit4:junit4]   2> 10857 T2309 oasc.RequestHandlers.initHandlersFromConfig created /terms: org.apache.solr.handler.component.SearchHandler
[junit4:junit4]   2> 10857 T2309 oasc.RequestHandlers.initHandlersFromConfig created spellCheckCompRH: org.apache.solr.handler.component.SearchHandler
[junit4:junit4]   2> 10858 T2309 oasc.RequestHandlers.initHandlersFromConfig created spellCheckCompRH_Direct: org.apache.solr.handler.component.SearchHandler
[junit4:junit4]   2> 10859 T2309 oasc.RequestHandlers.initHandlersFromConfig created spellCheckWithWordbreak: org.apache.solr.handler.component.SearchHandler
[junit4:junit4]   2> 10860 T2309 oasc.RequestHandlers.initHandlersFromConfig created spellCheckWithWordbreak_Direct: org.apache.solr.handler.component.SearchHandler
[junit4:junit4]   2> 10861 T2309 oasc.RequestHandlers.initHandlersFromConfig created spellCheckCompRH1: org.apache.solr.handler.component.SearchHandler
[junit4:junit4]   2> 10861 T2309 oasc.RequestHandlers.initHandlersFromConfig created mltrh: org.apache.solr.handler.component.SearchHandler
[junit4:junit4]   2> 10862 T2309 oasc.RequestHandlers.initHandlersFromConfig created tvrh: org.apache.solr.handler.component.SearchHandler
[junit4:junit4]   2> 10862 T2309 oasc.RequestHandlers.initHandlersFromConfig created /mlt: solr.MoreLikeThisHandler
[junit4:junit4]   2> 10863 T2309 oasc.RequestHandlers.initHandlersFromConfig created /debug/dump: solr.DumpRequestHandler
[junit4:junit4]   2> 10869 T2309 oashl.XMLLoader.init xsltCacheLifetimeSeconds=60
[junit4:junit4]   2> 10871 T2309 oasc.SolrCore.initDeprecatedSupport WARNING solrconfig.xml uses deprecated <admin/gettableFiles>, Please update your config to use the ShowFileRequestHandler.
[junit4:junit4]   2> 10873 T2309 oasc.SolrCore.initDeprecatedSupport WARNING adding ShowFileRequestHandler with hidden files: [SCHEMA.XML, OLD_SYNONYMS.TXT, STOPWORDS.TXT, PROTWORDS.TXT, OPEN-EXCHANGE-RATES.JSON, SYNONYMS.TXT, CURRENCY.XML, MAPPING-ISOLATIN1ACCENT.TXT]
[junit4:junit4]   2> 10875 T2309 oasc.CachingDirectoryFactory.close Releasing directory:/Users/jenkins/jenkins-slave/workspace/Lucene-Solr-trunk-MacOSX/solr/build/solr-core/test/J0/./org.apache.solr.cloud.BasicDistributedZkTest-1359905507479/jetty3
[junit4:junit4]   2> 10877 T2309 oass.SolrIndexSearcher.<init> Opening Searcher@682615b3 main
[junit4:junit4]   2> 10878 T2309 oasu.CommitTracker.<init> Hard AutoCommit: disabled
[junit4:junit4]   2> 10878 T2309 oasu.CommitTracker.<init> Soft AutoCommit: disabled
[junit4:junit4]   2> 10878 T2309 oashc.SpellCheckComponent.inform Initializing spell checkers
[junit4:junit4]   2> 10883 T2309 oass.DirectSolrSpellChecker.init init: {name=direct,classname=DirectSolrSpellChecker,field=lowerfilt,minQueryLength=3}
[junit4:junit4]   2> 10913 T2310 oasc.SolrCore.registerSearcher [collection1] Registered new searcher Searcher@682615b3 main{StandardDirectoryReader(segments_1:1)}
[junit4:junit4]   2> 10919 T2309 oasc.ZkController.publish publishing core=collection1 state=down
[junit4:junit4]   2> 10919 T2309 oasc.ZkController.publish numShards not found on descriptor - reading it from system property
[junit4:junit4]   2> 11333 T2260 oascc.ZkStateReader.updateClusterState Updating cloud state from ZooKeeper... 
[junit4:junit4]   2> 11336 T2260 oasc.Overseer$ClusterStateUpdater.updateState Update state numShards=2 message={
[junit4:junit4]   2> 	  "operation":"state",
[junit4:junit4]   2> 	  "numShards":"2",
[junit4:junit4]   2> 	  "shard":"shard2",
[junit4:junit4]   2> 	  "roles":null,
[junit4:junit4]   2> 	  "state":"active",
[junit4:junit4]   2> 	  "core":"collection1",
[junit4:junit4]   2> 	  "collection":"collection1",
[junit4:junit4]   2> 	  "node_name":"127.0.0.1:49882_",
[junit4:junit4]   2> 	  "base_url":"http://127.0.0.1:49882"}
[junit4:junit4]   2> 11349 T2260 oasc.Overseer$ClusterStateUpdater.updateState Update state numShards=2 message={
[junit4:junit4]   2> 	  "operation":"state",
[junit4:junit4]   2> 	  "numShards":"2",
[junit4:junit4]   2> 	  "shard":null,
[junit4:junit4]   2> 	  "roles":null,
[junit4:junit4]   2> 	  "state":"down",
[junit4:junit4]   2> 	  "core":"collection1",
[junit4:junit4]   2> 	  "collection":"collection1",
[junit4:junit4]   2> 	  "node_name":"127.0.0.1:49885_",
[junit4:junit4]   2> 	  "base_url":"http://127.0.0.1:49885"}
[junit4:junit4]   2> 11350 T2260 oasc.Overseer$ClusterStateUpdater.updateState Collection already exists with numShards=2
[junit4:junit4]   2> 11351 T2260 oasc.Overseer$ClusterStateUpdater.updateState Assigning new node to shard shard=shard1
[junit4:junit4]   2> 11367 T2265 oascc.ZkStateReader$2.process A cluster state change: WatchedEvent state:SyncConnected type:NodeDataChanged path:/clusterstate.json, has occurred - updating... (live nodes size: 4)
[junit4:junit4]   2> 11368 T2259 oascc.ZkStateReader$2.process A cluster state change: WatchedEvent state:SyncConnected type:NodeDataChanged path:/clusterstate.json, has occurred - updating... (live nodes size: 4)
[junit4:junit4]   2> 11368 T2308 oascc.ZkStateReader$2.process A cluster state change: WatchedEvent state:SyncConnected type:NodeDataChanged path:/clusterstate.json, has occurred - updating... (live nodes size: 4)
[junit4:junit4]   2> 11369 T2293 oascc.ZkStateReader$2.process A cluster state change: WatchedEvent state:SyncConnected type:NodeDataChanged path:/clusterstate.json, has occurred - updating... (live nodes size: 4)
[junit4:junit4]   2> 11369 T2278 oascc.ZkStateReader$2.process A cluster state change: WatchedEvent state:SyncConnected type:NodeDataChanged path:/clusterstate.json, has occurred - updating... (live nodes size: 4)
[junit4:junit4]   2> 11922 T2309 oasc.CoreContainer.registerCore registering core: collection1
[junit4:junit4]   2> 11923 T2309 oasc.ZkController.register Register replica - core:collection1 address:http://127.0.0.1:49885 collection:collection1 shard:shard1
[junit4:junit4]   2> 11932 T2309 oasc.ZkController.register We are http://127.0.0.1:49885/collection1/ and leader is http://127.0.0.1:49879/collection1/
[junit4:junit4]   2> 11933 T2309 oasc.ZkController.register No LogReplay needed for core=collection1 baseURL=http://127.0.0.1:49885
[junit4:junit4]   2> 11934 T2309 oasc.ZkController.checkRecovery Core needs to recover:collection1
[junit4:junit4]   2> 11934 T2309 oasu.DefaultSolrCoreState.doRecovery Running recovery - first canceling any ongoing recovery
[junit4:junit4]   2> ASYNC  NEW_CORE C170 name=collection1 org.apache.solr.core.SolrCore@258a35 url=http://127.0.0.1:49885/collection1 node=127.0.0.1:49885_ C170_STATE=coll:collection1 core:collection1 props:{shard=null, roles=null, state=down, core=collection1, collection=collection1, node_name=127.0.0.1:49885_, base_url=http://127.0.0.1:49885}
[junit4:junit4]   2> 11935 T2311 C170 P49885 oasc.RecoveryStrategy.run Starting recovery process.  core=collection1 recoveringAfterStartup=true
[junit4:junit4]   2> 11936 T2309 oascc.ZkStateReader.updateClusterState Updating cloud state from ZooKeeper... 
[junit4:junit4]   2> 11938 T2311 C170 P49885 oasc.RecoveryStrategy.doRecovery ###### startupVersions=[]
[junit4:junit4]   2> 11939 T2311 C170 P49885 oasc.ZkController.publish publishing core=collection1 state=recovering
[junit4:junit4]   2> 11939 T2311 C170 P49885 oasc.ZkController.publish numShards not found on descriptor - reading it from system property
[junit4:junit4]   2> 11940 T2237 oass.SolrDispatchFilter.init user.dir=/Users/jenkins/jenkins-slave/workspace/Lucene-Solr-trunk-MacOSX/solr/build/solr-core/test/J0
[junit4:junit4]   2> 11941 T2237 oass.SolrDispatchFilter.init SolrDispatchFilter.init() done
[junit4:junit4]   2> 11943 T2311 C170 P49885 oascsi.HttpClientUtil.createClient Creating new http client, config:maxConnections=128&maxConnectionsPerHost=32&followRedirects=false
[junit4:junit4]   2> 11944 T2237 oascsi.HttpClientUtil.createClient Creating new http client, config:maxConnections=128&maxConnectionsPerHost=32&followRedirects=false
[junit4:junit4]   2> 12120 T2237 oejs.Server.doStart jetty-8.1.8.v20121106
[junit4:junit4]   2> 12124 T2237 oejs.AbstractConnector.doStart Started SelectChannelConnector@127.0.0.1:49889
[junit4:junit4]   2> 12125 T2237 oass.SolrDispatchFilter.init SolrDispatchFilter.init()
[junit4:junit4]   2> 12125 T2237 oasc.SolrResourceLoader.locateSolrHome JNDI not configured for solr (NoInitialContextEx)
[junit4:junit4]   2> 12126 T2237 oasc.SolrResourceLoader.locateSolrHome using system property solr.solr.home: /Users/jenkins/jenkins-slave/workspace/Lucene-Solr-trunk-MacOSX/solr/build/solr-core/test/J0/./org.apache.solr.cloud.BasicDistributedZkTest-jetty4-1359905519427
[junit4:junit4]   2> 12126 T2237 oasc.CoreContainer$Initializer.initialize looking for solr.xml: /Users/jenkins/jenkins-slave/workspace/Lucene-Solr-trunk-MacOSX/solr/build/solr-core/test/J0/./org.apache.solr.cloud.BasicDistributedZkTest-jetty4-1359905519427/solr.xml
[junit4:junit4]   2> 12127 T2237 oasc.CoreContainer.<init> New CoreContainer 1310203382
[junit4:junit4]   2> 12127 T2237 oasc.CoreContainer.load Loading CoreContainer using Solr Home: '/Users/jenkins/jenkins-slave/workspace/Lucene-Solr-trunk-MacOSX/solr/build/solr-core/test/J0/./org.apache.solr.cloud.BasicDistributedZkTest-jetty4-1359905519427/'
[junit4:junit4]   2> 12128 T2237 oasc.SolrResourceLoader.<init> new SolrResourceLoader for directory: '/Users/jenkins/jenkins-slave/workspace/Lucene-Solr-trunk-MacOSX/solr/build/solr-core/test/J0/./org.apache.solr.cloud.BasicDistributedZkTest-jetty4-1359905519427/'
[junit4:junit4]   2> 12160 T2237 oashc.HttpShardHandlerFactory.getParameter Setting socketTimeout to: 60000
[junit4:junit4]   2> 12161 T2237 oashc.HttpShardHandlerFactory.getParameter Setting urlScheme to: http://
[junit4:junit4]   2> 12161 T2237 oashc.HttpShardHandlerFactory.getParameter Setting connTimeout to: 15000
[junit4:junit4]   2> 12162 T2237 oashc.HttpShardHandlerFactory.getParameter Setting maxConnectionsPerHost to: 20
[junit4:junit4]   2> 12162 T2237 oashc.HttpShardHandlerFactory.getParameter Setting corePoolSize to: 0
[junit4:junit4]   2> 12163 T2237 oashc.HttpShardHandlerFactory.getParameter Setting maximumPoolSize to: 2147483647
[junit4:junit4]   2> 12163 T2237 oashc.HttpShardHandlerFactory.getParameter Setting maxThreadIdleTime to: 5
[junit4:junit4]   2> 12164 T2237 oashc.HttpShardHandlerFactory.getParameter Setting sizeOfQueue to: -1
[junit4:junit4]   2> 12164 T2237 oashc.HttpShardHandlerFactory.getParameter Setting fairnessPolicy to: false
[junit4:junit4]   2> 12165 T2237 oascsi.HttpClientUtil.createClient Creating new http client, config:maxConnectionsPerHost=20&maxConnections=10000&socketTimeout=60000&connTimeout=15000&retry=false
[junit4:junit4]   2> 12175 T2237 oasc.CoreContainer.load Registering Log Listener
[junit4:junit4]   2> 12192 T2237 oasc.CoreContainer.initZooKeeper Zookeeper client=127.0.0.1:49872/solr
[junit4:junit4]   2> 12193 T2237 oasc.ZkController.checkChrootPath zkHost includes chroot
[junit4:junit4]   2> 12193 T2237 oaz.ZooKeeper.<init> Initiating client connection, connectString=127.0.0.1:49872 sessionTimeout=60000 watcher=org.apache.solr.common.cloud.ConnectionManager@4df75a83
[junit4:junit4]   2> 12195 T2237 oascc.ConnectionManager.waitForConnected Waiting for client to connect to ZooKeeper
[junit4:junit4]   2> 12195 T2321 oaz.ClientCnxn$SendThread.logStartConnect Opening socket connection to server localhost/127.0.0.1:49872. Will not attempt to authenticate using SASL (access denied ("javax.security.auth.AuthPermission" "getLoginConfiguration"))
[junit4:junit4]   2> 12196 T2321 oaz.ClientCnxn$SendThread.primeConnection Socket connection established to localhost/127.0.0.1:49872, initiating session
[junit4:junit4]   2> 12196 T2239 oazs.NIOServerCnxnFactory.run Accepted socket connection from /127.0.0.1:49890
[junit4:junit4]   2> 12197 T2239 oazs.ZooKeeperServer.processConnectRequest Client attempting to establish new session at /127.0.0.1:49890
[junit4:junit4]   2> 12289 T2241 oazs.ZooKeeperServer.finishSessionInit Established session 0x13ca0af48aa000b with negotiated timeout 20000 for client /127.0.0.1:49890
[junit4:junit4]   2> 12289 T2321 oaz.ClientCnxn$SendThread.onConnected Session establishment complete on server localhost/127.0.0.1:49872, sessionid = 0x13ca0af48aa000b, negotiated timeout = 20000
[junit4:junit4]   2> 12290 T2322 oascc.ConnectionManager.process Watcher org.apache.solr.common.cloud.ConnectionManager@4df75a83 name:ZooKeeperConnection Watcher:127.0.0.1:49872 got event WatchedEvent state:SyncConnected type:None path:null path:null type:None
[junit4:junit4]   2> 12291 T2237 oascc.ConnectionManager.waitForConnected Client is connected to ZooKeeper
[junit4:junit4]   2> 12294 T2242 oazs.PrepRequestProcessor.pRequest2Txn Processed session termination for sessionid: 0x13ca0af48aa000b
[junit4:junit4]   2> 12295 T2237 oaz.ZooKeeper.close Session: 0x13ca0af48aa000b closed
[junit4:junit4]   2> 12295 T2239 oazs.NIOServerCnxn.closeSock Closed socket connection for client /127.0.0.1:49890 which had sessionid 0x13ca0af48aa000b
[junit4:junit4]   2> 12296 T2237 oascsi.HttpClientUtil.createClient Creating new http client, config:maxConnections=500&maxConnectionsPerHost=16&socketTimeout=60000&connTimeout=15000
[junit4:junit4]   2> 12297 T2322 oaz.ClientCnxn$EventThread.run EventThread shut down
[junit4:junit4]   2> 12304 T2237 oaz.ZooKeeper.<init> Initiating client connection, connectString=127.0.0.1:49872/solr sessionTimeout=30000 watcher=org.apache.solr.common.cloud.ConnectionManager@20c3f9e4
[junit4:junit4]   2> 12305 T2237 oascc.ConnectionManager.waitForConnected Waiting for client to connect to ZooKeeper
[junit4:junit4]   2> 12307 T2323 oaz.ClientCnxn$SendThread.logStartConnect Opening socket connection to server localhost/127.0.0.1:49872. Will not attempt to authenticate using SASL (access denied ("javax.security.auth.AuthPermission" "getLoginConfiguration"))
[junit4:junit4]   2> 12308 T2323 oaz.ClientCnxn$SendThread.primeConnection Socket connection established to localhost/127.0.0.1:49872, initiating session
[junit4:junit4]   2> 12309 T2239 oazs.NIOServerCnxnFactory.run Accepted socket connection from /127.0.0.1:49891
[junit4:junit4]   2> 12310 T2239 oazs.ZooKeeperServer.processConnectRequest Client attempting to establish new session at /127.0.0.1:49891
[junit4:junit4]   2> 12313 T2241 oazs.ZooKeeperServer.finishSessionInit Established session 0x13ca0af48aa000c with negotiated timeout 20000 for client /127.0.0.1:49891
[junit4:junit4]   2> 12313 T2323 oaz.ClientCnxn$SendThread.onConnected Session establishment complete on server localhost/127.0.0.1:49872, sessionid = 0x13ca0af48aa000c, negotiated timeout = 20000
[junit4:junit4]   2> 12314 T2324 oascc.ConnectionManager.process Watcher org.apache.solr.common.cloud.ConnectionManager@20c3f9e4 name:ZooKeeperConnection Watcher:127.0.0.1:49872/solr got event WatchedEvent state:SyncConnected type:None path:null path:null type:None
[junit4:junit4]   2> 12314 T2237 oascc.ConnectionManager.waitForConnected Client is connected to ZooKeeper
[junit4:junit4]   2> 12316 T2242 oazs.PrepRequestProcessor.pRequest Got user-level KeeperException when processing sessionid:0x13ca0af48aa000c type:create cxid:0x1 zxid:0x9f txntype:-1 reqpath:n/a Error Path:/solr/overseer Error:KeeperErrorCode = NodeExists for /solr/overseer
[junit4:junit4]   2> 12317 T2242 oazs.PrepRequestProcessor.pRequest Got user-level KeeperException when processing sessionid:0x13ca0af48aa000c type:create cxid:0x2 zxid:0xa0 txntype:-1 reqpath:n/a Error Path:/solr/overseer Error:KeeperErrorCode = NodeExists for /solr/overseer
[junit4:junit4]   2> 12319 T2237 oasc.ZkController.createEphemeralLiveNode Register node as live in ZooKeeper:/live_nodes/127.0.0.1:49889_
[junit4:junit4]   2> 12320 T2242 oazs.PrepRequestProcessor.pRequest Got user-level KeeperException when processing sessionid:0x13ca0af48aa000c type:delete cxid:0x4 zxid:0xa1 txntype:-1 reqpath:n/a Error Path:/solr/live_nodes/127.0.0.1:49889_ Error:KeeperErrorCode = NoNode for /solr/live_nodes/127.0.0.1:49889_
[junit4:junit4]   2> 12321 T2237 oascc.SolrZkClient.makePath makePath: /live_nodes/127.0.0.1:49889_
[junit4:junit4]   2> 12325 T2259 oascc.ZkStateReader$2.process A cluster state change: WatchedEvent state:SyncConnected type:NodeChildrenChanged path:/live_nodes, has occurred - updating... (live nodes size: 4)
[junit4:junit4]   2> 12325 T2293 oascc.ZkStateReader$2.process A cluster state change: WatchedEvent state:SyncConnected type:NodeChildrenChanged path:/live_nodes, has occurred - updating... (live nodes size: 4)
[junit4:junit4]   2> 12325 T2278 oascc.ZkStateReader$2.process A cluster state change: WatchedEvent state:SyncConnected type:NodeChildrenChanged path:/live_nodes, has occurred - updating... (live nodes size: 4)
[junit4:junit4]   2> 12326 T2265 oascc.ZkStateReader$3.process Updating live nodes... (5)
[junit4:junit4]   2> 12327 T2265 oascc.ZkStateReader$2.process A cluster state change: WatchedEvent state:SyncConnected type:NodeChildrenChanged path:/live_nodes, has occurred - updating... (live nodes size: 5)
[junit4:junit4]   2> 12327 T2308 oascc.ZkStateReader$3.process Updating live nodes... (5)
[junit4:junit4]   2> 12327 T2308 oascc.ZkStateReader$2.process A cluster state change: WatchedEvent state:SyncConnected type:NodeChildrenChanged path:/live_nodes, has occurred - updating... (live nodes size: 5)
[junit4:junit4]   2> 12330 T2293 oascc.ZkStateReader$3.process Updating live nodes... (5)
[junit4:junit4]   2> 12331 T2278 oascc.ZkStateReader$3.process Updating live nodes... (5)
[junit4:junit4]   2> 12332 T2259 oascc.ZkStateReader$3.process Updating live nodes... (5)
[junit4:junit4]   2> 12335 T2237 oascc.ZkStateReader.createClusterStateWatchersAndUpdate Updating cluster state from ZooKeeper... 
[junit4:junit4]   2> 12343 T2325 oasc.CoreContainer.create Creating SolrCore 'collection1' using instanceDir: /Users/jenkins/jenkins-slave/workspace/Lucene-Solr-trunk-MacOSX/solr/build/solr-core/test/J0/./org.apache.solr.cloud.BasicDistributedZkTest-jetty4-1359905519427/collection1
[junit4:junit4]   2> 12343 T2325 oasc.ZkController.createCollectionZkNode Check for collection zkNode:collection1
[junit4:junit4]   2> 12344 T2325 oasc.ZkController.createCollectionZkNode Collection zkNode exists
[junit4:junit4]   2> 12344 T2325 oasc.ZkController.readConfigName Load collection config from:/collections/collection1
[junit4:junit4]   2> 12346 T2325 oasc.SolrResourceLoader.<init> new SolrResourceLoader for directory: '/Users/jenkins/jenkins-slave/workspace/Lucene-Solr-trunk-MacOSX/solr/build/solr-core/test/J0/./org.apache.solr.cloud.BasicDistributedZkTest-jetty4-1359905519427/collection1/'
[junit4:junit4]   2> 12347 T2325 oasc.SolrResourceLoader.replaceClassLoader Adding 'file:/Users/jenkins/jenkins-slave/workspace/Lucene-Solr-trunk-MacOSX/solr/build/solr-core/test/J0/org.apache.solr.cloud.BasicDistributedZkTest-jetty4-1359905519427/collection1/lib/classes/' to classloader
[junit4:junit4]   2> 12347 T2325 oasc.SolrResourceLoader.replaceClassLoader Adding 'file:/Users/jenkins/jenkins-slave/workspace/Lucene-Solr-trunk-MacOSX/solr/build/solr-core/test/J0/org.apache.solr.cloud.BasicDistributedZkTest-jetty4-1359905519427/collection1/lib/README' to classloader
[junit4:junit4]   2> 12391 T2325 oasc.SolrConfig.<init> Using Lucene MatchVersion: LUCENE_50
[junit4:junit4]   2> 12452 T2325 oasc.SolrConfig.<init> Loaded SolrConfig: solrconfig.xml
[junit4:junit4]   2> 12454 T2325 oass.IndexSchema.readSchema Reading Solr Schema
[junit4:junit4]   2> 12460 T2325 oass.IndexSchema.readSchema Schema name=test
[junit4:junit4]   2> 12897 T2260 oascc.ZkStateReader.updateClusterState Updating cloud state from ZooKeeper... 
[junit4:junit4]   2> 12899 T2260 oasc.Overseer$ClusterStateUpdater.updateState Update state numShards=2 message={
[junit4:junit4]   2> 	  "operation":"state",
[junit4:junit4]   2> 	  "numShards":"2",
[junit4:junit4]   2> 	  "shard":"shard1",
[junit4:junit4]   2> 	  "roles":null,
[junit4:junit4]   2> 	  "state":"recovering",
[junit4:junit4]   2> 	  "core":"collection1",
[junit4:junit4]   2> 	  "collection":"collection1",
[junit4:junit4]   2> 	  "node_name":"127.0.0.1:49885_",
[junit4:junit4]   2> 	  "base_url":"http://127.0.0.1:49885"}
[junit4:junit4]   2> 12905 T2259 oascc.ZkStateReader$2.process A cluster state change: WatchedEvent state:SyncConnected type:NodeDataChanged path:/clusterstate.json, has occurred - updating... (live nodes size: 5)
[junit4:junit4]   2> 12906 T2308 oascc.ZkStateReader$2.process A cluster state change: WatchedEvent state:SyncConnected type:NodeDataChanged path:/clusterstate.json, has occurred - updating... (live nodes size: 5)
[junit4:junit4]   2> 12906 T2278 oascc.ZkStateReader$2.process A cluster state change: WatchedEvent state:SyncConnected type:NodeDataChanged path:/clusterstate.json, has occurred - updating... (live nodes size: 5)
[junit4:junit4]   2> 12907 T2324 oascc.ZkStateReader$2.process A cluster state change: WatchedEvent state:SyncConnected type:NodeDataChanged path:/clusterstate.json, has occurred - updating... (live nodes size: 5)
[junit4:junit4]   2> 12910 T2265 oascc.ZkStateReader$2.process A cluster state change: WatchedEvent state:SyncConnected type:NodeDataChanged path:/clusterstate.json, has occurred - updating... (live nodes size: 5)
[junit4:junit4]   2> 12913 T2293 oascc.ZkStateReader$2.process A cluster state change: WatchedEvent state:SyncConnected type:NodeDataChanged path:/clusterstate.json, has occurred - updating... (live nodes size: 5)
[junit4:junit4]   2> 13012 T2325 oass.OpenExchangeRatesOrgProvider.init Initialized with rates=open-exchange-rates.json, refreshInterval=1440.
[junit4:junit4]   2> 13019 T2325 oass.IndexSchema.readSchema default search field in schema is text
[junit4:junit4]   2> 13022 T2325 oass.IndexSchema.readSchema unique key field: id
[junit4:junit4]   2> 13045 T2325 oass.FileExchangeRateProvider.reload Reloading exchange rates from file currency.xml
[junit4:junit4]   2> 13050 T2325 oass.FileExchangeRateProvider.reload Reloading exchange rates from file currency.xml
[junit4:junit4]   2> 13055 T2325 oass.OpenExchangeRatesOrgProvider.reload Reloading exchange rates from open-exchange-rates.json
[junit4:junit4]   2> 13057 T2325 oass.OpenExchangeRatesOrgProvider.reload Reloading exchange rates from open-exchange-rates.json
[junit4:junit4]   2> 13060 T2325 oasc.SolrCore.<init> [collection1] Opening new SolrCore at /Users/jenkins/jenkins-slave/workspace/Lucene-Solr-trunk-MacOSX/solr/build/solr-core/test/J0/./org.apache.solr.cloud.BasicDistributedZkTest-jetty4-1359905519427/collection1/, dataDir=./org.apache.solr.cloud.BasicDistributedZkTest-1359905507479/jetty4/
[junit4:junit4]   2> 13060 T2325 oasc.JmxMonitoredMap.<init> JMX monitoring is enabled. Adding Solr mbeans to JMX Server: com.sun.jmx.mbeanserver.JmxMBeanServer@685d72cd
[junit4:junit4]   2> 13061 T2325 oasc.SolrCore.initDirectoryFactory solr.NRTCachingDirectoryFactory
[junit4:junit4]   2> 13061 T2325 oasc.CachingDirectoryFactory.get return new directory for /Users/jenkins/jenkins-slave/workspace/Lucene-Solr-trunk-MacOSX/solr/build/solr-core/test/J0/./org.apache.solr.cloud.BasicDistributedZkTest-1359905507479/jetty4 forceNew:false
[junit4:junit4]   2> 13062 T2325 oasc.CachingDirectoryFactory.close Releasing directory:/Users/jenkins/jenkins-slave/workspace/Lucene-Solr-trunk-MacOSX/solr/build/solr-core/test/J0/./org.apache.solr.cloud.BasicDistributedZkTest-1359905507479/jetty4
[junit4:junit4]   2> 13062 T2325 oasc.SolrCore.getNewIndexDir New index directory detected: old=null new=./org.apache.solr.cloud.BasicDistributedZkTest-1359905507479/jetty4/index/
[junit4:junit4]   2> 13063 T2325 oasc.SolrCore.initIndex WARNING [collection1] Solr index directory './org.apache.solr.cloud.BasicDistributedZkTest-1359905507479/jetty4/index' doesn't exist. Creating new index...
[junit4:junit4]   2> 13064 T2325 oasc.CachingDirectoryFactory.get return new directory for /Users/jenkins/jenkins-slave/workspace/Lucene-Solr-trunk-MacOSX/solr/build/solr-core/test/J0/./org.apache.solr.cloud.BasicDistributedZkTest-1359905507479/jetty4/index forceNew:false
[junit4:junit4]   2> 13068 T2325 oasc.SolrDeletionPolicy.onCommit SolrDeletionPolicy.onCommit: commits:num=1
[junit4:junit4]   2> 		commit{dir=RateLimitedDirectoryWrapper(NRTCachingDirectory(org.apache.lucene.store.NIOFSDirectory@/Users/jenkins/jenkins-slave/workspace/Lucene-Solr-trunk-MacOSX/solr/build/solr-core/test/J0/org.apache.solr.cloud.BasicDistributedZkTest-1359905507479/jetty4/index lockFactory=org.apache.lucene.store.NativeFSLockFactory@40dcf3a3; maxCacheMB=48.0 maxMergeSizeMB=4.0)),segFN=segments_1,generation=1,filenames=[segments_1]
[junit4:junit4]   2> 13069 T2325 oasc.SolrDeletionPolicy.updateCommits newest commit = 1[segments_1]
[junit4:junit4]   2> 13069 T2325 oasc.CachingDirectoryFactory.close Releasing directory:/Users/jenkins/jenkins-slave/workspace/Lucene-Solr-trunk-MacOSX/solr/build/solr-core/test/J0/./org.apache.solr.cloud.BasicDistributedZkTest-1359905507479/jetty4/index
[junit4:junit4]   2> 13070 T2325 oasc.SolrCore.initWriters created xml: solr.XMLResponseWriter
[junit4:junit4]   2> 13072 T2325 oasup.UpdateRequestProcessorChain.init inserting DistributedUpdateProcessorFactory into updateRequestProcessorChain "dedupe"
[junit4:junit4]   2> 13073 T2325 oasup.UpdateRequestProcessorChain.init inserting DistributedUpdateProcessorFactory into updateRequestProcessorChain "dedupe-allfields"
[junit4:junit4]   2> 13073 T2325 oasup.UpdateRequestProcessorChain.init inserting DistributedUpdateProcessorFactory into updateRequestProcessorChain "stored_sig"
[junit4:junit4]   2> 13074 T2325 oasup.UpdateRequestProcessorChain.init inserting DistributedUpdateProcessorFactory into updateRequestProcessorChain "uniq-fields"
[junit4:junit4]   2> 13074 T2325 oasup.UpdateRequestProcessorChain.init inserting DistributedUpdateProcessorFactory into updateRequestProcessorChain "distrib-dup-test-chain-implicit"
[junit4:junit4]   2> 13075 T2325 oasc.RequestHandlers.initHandlersFromConfig adding lazy requestHandler: solr.ReplicationHandler
[junit4:junit4]   2> 13075 T2325 oasc.RequestHandlers.initHandlersFromConfig created /replication: solr.ReplicationHandler
[junit4:junit4]   2> 13077 T2325 oasc.RequestHandlers.initHandlersFromConfig created standard: solr.StandardRequestHandler
[junit4:junit4]   2> 13077 T2325 oasc.RequestHandlers.initHandlersFromConfig created /get: solr.RealTimeGetHandler
[junit4:junit4]   2> 13078 T2325 oasc.RequestHandlers.initHandlersFromConfig created dismax: solr.SearchHandler
[junit4:junit4]   2> 13078 T2325 oasc.RequestHandlers.initHandlersFromConfig created mock: org.apache.solr.core.MockQuerySenderListenerReqHandler
[junit4:junit4]   2> 13079 T2325 oasc.RequestHandlers.initHandlersFromConfig created /admin/: org.apache.solr.handler.admin.AdminHandlers
[junit4:junit4]   2> 13080 T2325 oasc.RequestHandlers.initHandlersFromConfig created defaults: solr.StandardRequestHandler
[junit4:junit4]   2> 13080 T2325 oasc.RequestHandlers.initHandlersFromConfig adding lazy requestHandler: solr.StandardRequestHandler
[junit4:junit4]   2> 13080 T2325 oasc.RequestHandlers.initHandlersFromConfig created lazy: solr.StandardRequestHandler
[junit4:junit4]   2> 13081 T2325 oasc.RequestHandlers.initHandlersFromConfig created /update: solr.UpdateRequestHandler
[junit4:junit4]   2> 13082 T2325 oasc.RequestHandlers.initHandlersFromConfig created /terms: org.apache.solr.handler.component.SearchHandler
[junit4:junit4]   2> 13082 T2325 oasc.RequestHandlers.initHandlersFromConfig created spellCheckCompRH: org.apache.solr.handler.component.SearchHandler
[junit4:junit4]   2> 13083 T2325 oasc.RequestHandlers.initHandlersFromConfig created spellCheckCompRH_Direct: org.apache.solr.handler.component.SearchHandler
[junit4:junit4]   2> 13084 T2325 oasc.RequestHandlers.initHandlersFromConfig created spellCheckWithWordbreak: org.apache.solr.handler.component.SearchHandler
[junit4:junit4]   2> 13084 T2325 oasc.RequestHandlers.initHandlersFromConfig created spellCheckWithWordbreak_Direct: org.apache.solr.handler.component.SearchHandler
[junit4:junit4]   2> 13085 T2325 oasc.RequestHandlers.initHandlersFromConfig created spellCheckCompRH1: org.apache.solr.handler.component.SearchHandler
[junit4:junit4]   2> 13085 T2325 oasc.RequestHandlers.initHandlersFromConfig created mltrh: org.apache.solr.handler.component.SearchHandler
[junit4:junit4]   2> 13086 T2325 oasc.RequestHandlers.initHandlersFromConfig created tvrh: org.apache.solr.handler.component.SearchHandler
[junit4:junit4]   2> 13086 T2325 oasc.RequestHandlers.initHandlersFromConfig created /mlt: solr.MoreLikeThisHandler
[junit4:junit4]   2> 13087 T2325 oasc.RequestHandlers.initHandlersFromConfig created /debug/dump: solr.DumpRequestHandler
[junit4:junit4]   2> 13093 T2325 oashl.XMLLoader.init xsltCacheLifetimeSeconds=60
[junit4:junit4]   2> 13096 T2325 oasc.SolrCore.initDeprecatedSupport WARNING solrconfig.xml uses deprecated <admin/gettableFiles>, Please update your config to use the ShowFileRequestHandler.
[junit4:junit4]   2> 13098 T2325 oasc.SolrCore.initDeprecatedSupport WARNING adding ShowFileRequestHandler with hidden files: [SCHEMA.XML, OLD_SYNONYMS.TXT, STOPWORDS.TXT, PROTWORDS.TXT, OPEN-EXCHANGE-RATES.JSON, SYNONYMS.TXT, CURRENCY.XML, MAPPING-ISOLATIN1ACCENT.TXT]
[junit4:junit4]   2> 13100 T2325 oasc.CachingDirectoryFactory.close Releasing directory:/Users/jenkins/jenkins-slave/workspace/Lucene-Solr-trunk-MacOSX/solr/build/solr-core/test/J0/./org.apache.solr.cloud.BasicDistributedZkTest-1359905507479/jetty4
[junit4:junit4]   2> 13101 T2325 oass.SolrIndexSearcher.<init> Opening Searcher@76850ab4 main
[junit4:junit4]   2> 13102 T2325 oasu.CommitTracker.<init> Hard AutoCommit: disabled
[junit4:junit4]   2> 13102 T2325 oasu.CommitTracker.<init> Soft AutoCommit: disabled
[junit4:junit4]   2> 13103 T2325 oashc.SpellCheckComponent.inform Initializing spell checkers
[junit4:junit4]   2> 13162 T2325 oass.DirectSolrSpellChecker.init init: {name=direct,classname=DirectSolrSpellChecker,field=lowerfilt,minQueryLength=3}
[junit4:junit4]   2> 13202 T2326 oasc.SolrCore.registerSearcher [collection1] Registered new searcher Searcher@76850ab4 main{StandardDirectoryReader(segments_1:1)}
[junit4:junit4]   2> 13208 T2325 oasc.ZkController.publish publishing core=collection1 state=down
[junit4:junit4]   2> 13208 T2325 oasc.ZkController.publish numShards not found on descriptor - reading it from system property
[junit4:junit4]   2> 14416 T2260 oascc.ZkStateReader.updateClusterState Updating cloud state from ZooKeeper... 
[junit4:junit4]   2> 14418 T2260 oasc.Overseer$ClusterStateUpdater.updateState Update state numShards=2 message={
[junit4:junit4]   2> 	  "operation":"state",
[junit4:junit4]   2> 	  "numShards":"2",
[junit4:junit4]   2> 	  "shard":null,
[junit4:junit4]   2> 	  "roles":null,
[junit4:junit4]   2> 	  "state":"down",
[junit4:junit4]   2> 	  "core":"collection1",
[junit4:junit4]   2> 	  "collection":"collection1",
[junit4:junit4]   2> 	  "node_name":"127.0.0.1:49889_",
[junit4:junit4]   2> 	  "base_url":"http://127.0.0.1:49889"}
[junit4:junit4]   2> 14418 T2260 oasc.Overseer$ClusterStateUpdater.updateState Collection already exists with numShards=2
[junit4:junit4]   2> 14418 T2260 oasc.Overseer$ClusterStateUpdater.updateState Assigning new node to shard shard=shard2
[junit4:junit4]   2> 14431 T2265 oascc.ZkStateReader$2.process A cluster state change: WatchedEvent state:SyncConnected type:NodeDataChanged path:/clusterstate.json, has occurred - updating... (live nodes size: 5)
[junit4:junit4]   2> 14431 T2293 oascc.ZkStateReader$2.process A cluster state change: WatchedEvent state:SyncConnected type:NodeDataChanged path:/clusterstate.json, has occurred - updating... (live nodes size: 5)
[junit4:junit4]   2> 14432 T2308 oascc.ZkStateReader$2.process A cluster state change: WatchedEvent state:SyncConnected type:NodeDataChanged path:/clusterstate.json, has occurred - updating... (live nodes size: 5)
[junit4:junit4]   2> 14432 T2259 oascc.ZkStateReader$2.process A cluster state change: WatchedEvent state:SyncConnected type:NodeDataChanged path:/clusterstate.json, has occurred - updating... (live nodes size: 5)
[junit4:junit4]   2> 14432 T2324 oascc.ZkStateReader$2.process A cluster state change: WatchedEvent state:SyncConnected type:NodeDataChanged path:/clusterstate.json, has occurred - updating... (live nodes size: 5)
[junit4:junit4]   2> 14432 T2278 oascc.ZkStateReader$2.process A cluster state change: WatchedEvent state:SyncConnected type:NodeDataChanged path:/clusterstate.json, has occurred - updating... (live nodes size: 5)
[junit4:junit4]   2>  C170_STATE=coll:collection1 core:collection1 props:{shard=shard1, roles=null, state=recovering, core=collection1, collection=collection1, node_name=127.0.0.1:49885_, base_url=http://127.0.0.1:49885}
[junit4:junit4]   2> 14960 T2311 C170 P49885 oasc.RecoveryStrategy.doRecovery Attempting to PeerSync from http://127.0.0.1:49879/collection1/ core=collection1 - recoveringAfterStartup=true
[junit4:junit4]   2> 14961 T2311 C170 P49885 oasu.PeerSync.sync PeerSync: core=collection1 url=http://127.0.0.1:49885 START replicas=[http://127.0.0.1:49879/collection1/] nUpdates=100
[junit4:junit4]   2> 14962 T2311 C170 P49885 oasu.PeerSync.sync WARNING no frame of reference to tell of we've missed updates
[junit4:junit4]   2> 14962 T2311 C170 P49885 oasc.RecoveryStrategy.doRecovery PeerSync Recovery was not successful - trying replication. core=collection1
[junit4:junit4]   2> 14962 T2311 C170 P49885 oasc.RecoveryStrategy.doRecovery Starting Replication Recovery. core=collection1
[junit4:junit4]   2> 14963 T2311 C170 P49885 oasc.RecoveryStrategy.doRecovery Begin buffering updates. core=collection1
[junit4:junit4]   2> 14963 T2311 C170 P49885 oasu.UpdateLog.bufferUpdates Starting to buffer updates. FSUpdateLog{state=ACTIVE, tlog=null}
[junit4:junit4]   2> 14964 T2311 C170 P49885 oasc.RecoveryStrategy.replicate Attempting to replicate from http://127.0.0.1:49879/collection1/. core=collection1
[junit4:junit4]   2> 14964 T2311 C170 P49885 oascsi.HttpClientUtil.createClient Creating new http client, config:maxConnections=128&maxConnectionsPerHost=32&followRedirects=false
[junit4:junit4]   2> ASYNC  NEW_CORE C171 name=collection1 org.apache.solr.core.SolrCore@54e69ff4 url=http://127.0.0.1:49879/collection1 node=127.0.0.1:49879_ C171_STATE=coll:collection1 core:collection1 props:{shard=shard1, roles=null, state=active, core=collection1, collection=collection1, node_name=127.0.0.1:49879_, base_url=http://127.0.0.1:49879, leader=true}
[junit4:junit4]   2> 14983 T2271 C171 P49879 REQ /get {getVersions=100&distrib=false&wt=javabin&qt=/get&version=2} status=0 QTime=0 
[junit4:junit4]   2> 14984 T2268 C171 P49879 oasu.DirectUpdateHandler2.commit start commit{,optimize=false,openSearcher=false,waitSearcher=true,expungeDeletes=false,softCommit=false}
[junit4:junit4]   2> 14985 T2268 C171 P49879 oasc.CachingDirectoryFactory.close Releasing directory:/Users/jenkins/jenkins-slave/workspace/Lucene-Solr-trunk-MacOSX/solr/build/solr-core/test/J0/./org.apache.solr.cloud.BasicDistributedZkTest-1359905507479/jetty1
[junit4:junit4]   2> 14987 T2268 C171 P49879 oasc.SolrDeletionPolicy.onInit SolrDeletionPolicy.onInit: commits:num=1
[junit4:junit4]   2> 		commit{dir=RateLimitedDirectoryWrapper(NRTCachingDirectory(org.apache.lucene.store.NIOFSDirectory@/Users/jenkins/jenkins-slave/workspace/Lucene-Solr-trunk-MacOSX/solr/build/solr-core/test/J0/org.apache.solr.cloud.BasicDistributedZkTest-1359905507479/jetty1/index lockFactory=org.apache.lucene.store.NativeFSLockFactory@6b12cd20; maxCacheMB=48.0 maxMergeSizeMB=4.0)),segFN=segments_1,generation=1,filenames=[segments_1]
[junit4:junit4]   2> 14988 T2268 C171 P49879 oasc.SolrDeletionPolicy.updateCommits newest commit = 1[segments_1]
[junit4:junit4]   2> 14990 T2268 C171 P49879 oasc.SolrDeletionPolicy.onCommit SolrDeletionPolicy.onCommit: commits:num=2
[junit4:junit4]   2> 		commit{dir=RateLimitedDirectoryWrapper(NRTCachingDirectory(org.apache.lucene.store.NIOFSDirectory@/Users/jenkins/jenkins-slave/workspace/Lucene-Solr-trunk-MacOSX/solr/build/solr-core/test/J0/org.apache.solr.cloud.BasicDistributedZkTest-1359905507479/jetty1/index lockFactory=org.apache.lucene.store.NativeFSLockFactory@6b12cd20; maxCacheMB=48.0 maxMergeSizeMB=4.0)),segFN=segments_1,generation=1,filenames=[segments_1]
[junit4:junit4]   2> 		commit{dir=RateLimitedDirectoryWrapper(NRTCachingDirectory(org.apache.lucene.store.NIOFSDirectory@/Users/jenkins/jenkins-slave/workspace/Lucene-Solr-trunk-MacOSX/solr/build/solr-core/test/J0/org.apache.solr.cloud.BasicDistributedZkTest-1359905507479/jetty1/index lockFactory=org.apache.lucene.store.NativeFSLockFactory@6b12cd20; maxCacheMB=48.0 maxMergeSizeMB=4.0)),segFN=segments_2,generation=2,filenames=[segments_2]
[junit4:junit4]   2> 14991 T2268 C171 P49879 oasc.SolrDeletionPolicy.updateCommits newest commit = 2[segments_2]
[junit4:junit4]   2> 14992 T2268 C171 P49879 oasc.CachingDirectoryFactory.close Releasing directory:/Users/jenkins/jenkins-slave/workspace/Lucene-Solr-trunk-MacOSX/solr/build/solr-core/test/J0/./org.apache.solr.cloud.BasicDistributedZkTest-1359905507479/jetty1
[junit4:junit4]   2> 14993 T2268 C171 P49879 oass.SolrIndexSearcher.<init> Opening Searcher@7915d36a realtime
[junit4:junit4]   2> 14993 T2268 C171 P49879 oasu.DirectUpdateHandler2.commit end_commit_flush
[junit4:junit4]   2> 14994 T2268 C171 P49879 /update {waitSearcher=true&openSearcher=false&commit=true&wt=javabin&commit_end_point=true&version=2&softCommit=false} {commit=} 0 10
[junit4:junit4]   2> 14995 T2311 C170 P49885 oash.ReplicationHandler.inform Commits will be reserved for  10000
[junit4:junit4]   2> 14995 T2311 C170 P49885 oash.SnapPuller.<init>  No value set for 'pollInterval'. Timer Task not started.
[junit4:junit4]   2> 14998 T2272 C171 P49879 oash.ReplicationHandler.inform Commits will be reserved for  10000
[junit4:junit4]   2> 14999 T2272 C171 P49879 REQ /replication {command=indexversion&qt=/replication&wt=javabin&version=2} status=0 QTime=2 
[junit4:junit4]   2> 14999 T2311 C170 P49885 oash.SnapPuller.fetchLatestIndex Master's generation: 2
[junit4:junit4]   2> 15000 T2311 C170 P49885 oash.SnapPuller.fetchLatestIndex Slave's generation: 1
[junit4:junit4]   2> 15000 T2311 C170 P49885 oash.SnapPuller.fetchLatestIndex Starting replication process
[junit4:junit4]   2> 15002 T2273 C171 P49879 oasc.CachingDirectoryFactory.close Releasing directory:/Users/jenkins/jenkins-slave/workspace/Lucene-Solr-trunk-MacOSX/solr/build/solr-core/test/J0/./org.apache.solr.cloud.BasicDistributedZkTest-1359905507479/jetty1
[junit4:junit4]   2> 15003 T2273 C171 P49879 oasc.CachingDirectoryFactory.close Releasing directory:/Users/jenkins/jenkins-slave/workspace/Lucene-Solr-trunk-MacOSX/solr/build/solr-core/test/J0/./org.apache.solr.cloud.BasicDistributedZkTest-1359905507479/jetty1/index
[junit4:junit4]   2> 15003 T2273 C171 P49879 REQ /replication {command=filelist&qt=/replication&wt=javabin&generation=2&version=2} status=0 QTime=1 
[junit4:junit4]   2> 15005 T2311 C170 P49885 oash.SnapPuller.fetchLatestIndex Number of files in latest index in master: 1
[junit4:junit4]   2> 15005 T2311 C170 P49885 oasc.CachingDirectoryFactory.get return new directory for /Users/jenkins/jenkins-slave/workspace/Lucene-Solr-trunk-MacOSX/solr/build/solr-core/test/J0/./org.apache.solr.cloud.BasicDistributedZkTest-1359905507479/jetty3/index.20130203133202476 forceNew:false
[junit4:junit4]   2> 15006 T2311 C170 P49885 oasc.CachingDirectoryFactory.close Releasing directory:/Users/jenkins/jenkins-slave/workspace/Lucene-Solr-trunk-MacOSX/solr/build/solr-core/test/J0/./org.apache.solr.cloud.BasicDistributedZkTest-1359905507479/jetty3
[junit4:junit4]   2> 15007 T2311 C170 P49885 oash.SnapPuller.fetchLatestIndex Starting download to RateLimitedDirectoryWrapper(NRTCachingDirectory(org.apache.lucene.store.NIOFSDirectory@/Users/jenkins/jenkins-slave/workspace/Lucene-Solr-trunk-MacOSX/solr/build/solr-core/test/J0/org.apache.solr.cloud.BasicDistributedZkTest-1359905507479/jetty3/index.20130203133202476 lockFactory=org.apache.lucene.store.NativeFSLockFactory@4dd5cce5; maxCacheMB=48.0 maxMergeSizeMB=4.0)) fullCopy=true
[junit4:junit4]   2> 15016 T2269 C171 P49879 REQ /replication {file=segments_2&command=filecontent&checksum=true&wt=filestream&qt=/replication&generation=2} status=0 QTime=0 
[junit4:junit4]   2> 15018 T2311 C170 P49885 oasc.CachingDirectoryFactory.close Releasing directory:/Users/jenkins/jenkins-slave/workspace/Lucene-Solr-trunk-MacOSX/solr/build/solr-core/test/J0/./org.apache.solr.cloud.BasicDistributedZkTest-1359905507479/jetty3/index
[junit4:junit4]   2> 15018 T2311 C170 P49885 oash.SnapPuller.fetchLatestIndex Total time taken for download : 0 secs
[junit4:junit4]   2> 15019 T2311 C170 P49885 oash.SnapPuller.modifyIndexProps New index installed. Updating index properties... index=index.20130203133202476
[junit4:junit4]   2> 15020 T2311 C170 P49885 oasc.CachingDirectoryFactory.close Releasing directory:/Users/jenkins/jenkins-slave/workspace/Lucene-Solr-trunk-MacOSX/solr/build/solr-core/test/J0/./org.apache.solr.cloud.BasicDistributedZkTest-1359905507479/jetty3
[junit4:junit4]   2> 15021 T2311 C170 P49885 oasc.CachingDirectoryFactory.close Releasing directory:/Users/jenkins/jenkins-slave/workspace/Lucene-Solr-trunk-MacOSX/solr/build/solr-core/test/J0/./org.apache.solr.cloud.BasicDistributedZkTest-1359905507479/jetty3
[junit4:junit4]   2> 15021 T2311 C170 P49885 oasc.SolrCore.getNewIndexDir New index directory detected: old=./org.apache.solr.cloud.BasicDistributedZkTest-1359905507479/jetty3/index/ new=./org.apache.solr.cloud.BasicDistributedZkTest-1359905507479/jetty3/index.20130203133202476
[junit4:junit4]   2> 15024 T2311 C170 P49885 oasc.SolrDeletionPolicy.onInit SolrDeletionPolicy.onInit: commits:num=1
[junit4:junit4]   2> 		commit{dir=RateLimitedDirectoryWrapper(NRTCachingDirectory(org.apache.lucene.store.NIOFSDirectory@/Users/jenkins/jenkins-slave/workspace/Lucene-Solr-trunk-MacOSX/solr/build/solr-core/test/J0/org.apache.solr.cloud.BasicDistributedZkTest-1359905507479/jetty3/index.20130203133202476 lockFactory=org.apache.lucene.store.NativeFSLockFactory@4dd5cce5; maxCacheMB=48.0 maxMergeSizeMB=4.0)),segFN=segments_2,generation=2,filenames=[segments_2]
[junit4:junit4]   2> 15025 T2311 C170 P49885 oasc.SolrDeletionPolicy.updateCommits newest commit = 2[segments_2]
[junit4:junit4]   2> 15026 T2311 C170 P49885 oasc.CachingDirectoryFactory.close Releasing directory:/Users/jenkins/jenkins-slave/workspace/Lucene-Solr-trunk-MacOSX/solr/build/solr-core/test/J0/./org.apache.solr.cloud.BasicDistributedZkTest-1359905507479/jetty3
[junit4:junit4]   2> 15027 T2311 C170 P49885 oasu.DefaultSolrCoreState.newIndexWriter Creating new IndexWriter...
[junit4:junit4]   2> 15027 T2311 C170 P49885 oasu.DefaultSolrCoreState.newIndexWriter Waiting until IndexWriter is unused... core=collection1
[junit4:junit4]   2> 15027 T2311 C170 P49885 oasu.DefaultSolrCoreState.newIndexWriter Rollback old IndexWriter... core=collection1
[junit4:junit4]   2> 15028 T2311 C170 P49885 oasc.CachingDirectoryFactory.close Releasing directory:/Users/jenkins/jenkins-slave/workspace/Lucene-Solr-trunk-MacOSX/solr/build/solr-core/test/J0/./org.apache.solr.cloud.BasicDistributedZkTest-1359905507479/jetty3/index.20130203133202476
[junit4:junit4]   2> 15028 T2311 C170 P49885 oasc.CachingDirectoryFactory.close Releasing directory:/Users/jenkins/jenkins-slave/workspace/Lucene-Solr-trunk-MacOSX/solr/build/solr-core/test/J0/./org.apache.solr.cloud.BasicDistributedZkTest-1359905507479/jetty3
[junit4:junit4]   2> 15030 T2311 C170 P49885 oasc.SolrDeletionPolicy.onInit SolrDeletionPolicy.onInit: commits:num=1
[junit4:junit4]   2> 		commit{dir=RateLimitedDirectoryWrapper(NRTCachingDirectory(org.apache.lucene.store.NIOFSDirectory@/Users/jenkins/jenkins-slave/workspace/Lucene-Solr-trunk-MacOSX/solr/build/solr-core/test/J0/org.apache.solr.cloud.BasicDistributedZkTest-1359905507479/jetty3/index.20130203133202476 lockFactory=org.apache.lucene.store.NativeFSLockFactory@4dd5cce5; maxCacheMB=48.0 maxMergeSizeMB=4.0)),segFN=segments_2,generation=2,filenames=[segments_2]
[junit4:junit4]   2> 15030 T2311 C170 P49885 oasc.SolrDeletionPolicy.updateCommits newest commit = 2[segments_2]
[junit4:junit4]   2> 15030 T2311 C170 P49885 oasu.DefaultSolrCoreState.newIndexWriter New IndexWriter is ready to be used.
[junit4:junit4]   2> 15031 T2311 C170 P49885 oasc.CachingDirectoryFactory.close Releasing directory:/Users/jenkins/jenkins-slave/workspace/Lucene-Solr-trunk-MacOSX/solr/build/solr-core/test/J0/./org.apache.solr.cloud.BasicDistributedZkTest-1359905507479/jetty3
[junit4:junit4]   2> 15031 T2311 C170 P49885 oass.SolrIndexSearcher.<init> Opening Searcher@11568f93 main
[junit4:junit4]   2> 15033 T2310 oasc.SolrCore.registerSearcher [collection1] Registered new searcher Searcher@11568f93 main{StandardDirectoryReader(segments_2:1:nrt)}
[junit4:junit4]   2> 15034 T2310 oasc.CachingDirectoryFactory.close Releasing directory:/Users/jenkins/jenkins-slave/workspace/Lucene-Solr-trunk-MacOSX/solr/build/solr-core/test/J0/./org.apache.solr.cloud.BasicDistributedZkTest-1359905507479/jetty3/index
[junit4:junit4]   2> 15034 T2311 C170 P49885 oasu.DirectUpdateHandler2.commit start commit{,optimize=false,openSearcher=false,waitSearcher=false,expungeDeletes=false,softCommit=false}
[junit4:junit4]   2> 15036 T2311 C170 P49885 oasc.SolrDeletionPolicy.onCommit SolrDeletionPolicy.onCommit: commits:num=2
[junit4:junit4]   2> 		commit{dir=RateLimitedDirectoryWrapper(NRTCachingDirectory(org.apache.lucene.store.NIOFSDirectory@/Users/jenkins/jenkins-slave/workspace/Lucene-Solr-trunk-MacOSX/solr/build/solr-core/test/J0/org.apache.solr.cloud.BasicDistributedZkTest-1359905507479/jetty3/index.20130203133202476 lockFactory=org.apache.lucene.store.NativeFSLockFactory@4dd5cce5; maxCacheMB=48.0 maxMergeSizeMB=4.0)),segFN=segments_2,generation=2,filenames=[segments_2]
[junit4:junit4]   2> 		commit{dir=RateLimitedDirectoryWrapper(NRTCachingDirectory(org.apache.lucene.store.NIOFSDirectory@/Users/jenkins/jenkins-slave/workspace/Lucene-Solr-trunk-MacOSX/solr/build/solr-core/test/J0/org.apache.solr.cloud.BasicDistributedZkTest-1359905507479/jetty3/index.20130203133202476 lockFactory=org.apache.lucene.store.NativeFSLockFactory@4dd5cce5; maxCacheMB=48.0 maxMergeSizeMB=4.0)),segFN=segments_3,generation=3,filenames=[segments_3]
[junit4:junit4]   2> 15036 T2311 C170 P49885 oasc.SolrDeletionPolicy.updateCommits newest commit = 3[segments_3]
[junit4:junit4]   2> 15037 T2311 C170 P49885 oasc.CachingDirectoryFactory.close Releasing directory:/Users/jenkins/jenkins-slave/workspace/Lucene-Solr-trunk-MacOSX/solr/build/solr-core/test/J0/./org.apache.solr.cloud.BasicDistributedZkTest-1359905507479/jetty3
[junit4:junit4]   2> 15037 T2311 C170 P49885 oasu.DirectUpdateHandler2.commit end_commit_flush
[junit4:junit4]   2> 15037 T2311 C170 P49885 oasc.CachingDirectoryFactory.close Releasing directory:/Users/jenkins/jenkins-slave/workspace/Lucene-Solr-trunk-MacOSX/solr/build/solr-core/test/J0/./org.apache.solr.cloud.BasicDistributedZkTest-1359905507479/jetty3/index.20130203133202476
[junit4:junit4]   2> 15038 T2311 C170 P49885 oasc.CachingDirectoryFactory.close Releasing directory:/Users/jenkins/jenkins-slave/workspace/Lucene-Solr-trunk-MacOSX/solr/build/solr-core/test/J0/./org.apache.solr.cloud.BasicDistributedZkTest-1359905507479/jetty3/index
[junit4:junit4]   2> 15038 T2311 C170 P49885 oasc.RecoveryStrategy.replay No replay needed. core=collection1
[junit4:junit4]   2> 15038 T2311 C170 P49885 oasc.RecoveryStrategy.doRecovery Replication Recovery was successful - registering as Active. core=collection1
[junit4:junit4]   2> 15038 T2311 C170 P49885 oasc.ZkController.publish publishing core=collection1 state=active
[junit4:junit4]   2> 15038 T2311 C170 P49885 oasc.ZkController.publish numShards not found on descriptor - reading it from system property
[junit4:junit4]   2> 15040 T2311 C170 P49885 oasc.RecoveryStrategy.doRecovery Finished recovery process. core=collection1
[junit4:junit4]   2> 15211 T2325 oasc.CoreContainer.registerCore registering core: collection1
[junit4:junit4]   2> 15212 T2325 oasc.ZkController.register Register replica - core:collection1 address:http://127.0.0.1:49889 collection:collection1 shard:shard2
[junit4:junit4]   2> 15217 T2325 oasc.ZkController.register We are http://127.0.0.1:49889/collection1/ and leader is http://127.0.0.1:49882/collection1/
[junit4:junit4]   2> 15217 T2325 oasc.ZkController.register No LogReplay needed for core=collection1 baseURL=http://127.0.0.1:49889
[junit4:junit4]   2> 15218 T2325 oasc.ZkController.checkRecovery Core needs to recover:collection1
[junit4:junit4]   2> 15218 T2325 oasu.DefaultSolrCoreState.doRecovery Running recovery - first canceling any ongoing recovery
[junit4:junit4]   2> ASYNC  NEW_CORE C172 name=collection1 org.apache.solr.core.SolrCore@7ea77b6d url=http://127.0.0.1:49889/collection1 node=127.0.0.1:49889_ C172_STATE=coll:collection1 core:collection1 props:{shard=null, roles=null, state=down, core=collection1, collection=collection1, node_name=127.0.0.1:49889_, base_url=http://127.0.0.1:49889}
[junit4:junit4]   2> 15219 T2329 C172 P49889 oasc.RecoveryStrategy.run Starting recovery process.  core=collection1 recoveringAfterStartup=true
[junit4:junit4]   2> 15219 T2325 oascc.ZkStateReader.updateClusterState Updating cloud state from ZooKeeper... 
[junit4:junit4]   2> 15221 T2329 C172 P49889 oasc.RecoveryStrategy.doRecovery ###### startupVersions=[]
[junit4:junit4]   2> 15221 T2329 C172 P49889 oasc.ZkController.publish publishing core=collection1 state=recovering
[junit4:junit4]   2> 15221 T2329 C172 P49889 oasc.ZkController.publish numShards not found on descriptor - reading it from system property
[junit4:junit4]   2> 15222 T2237 oass.SolrDispatchFilter.init user.dir=/Users/jenkins/jenkins-slave/workspace/Lucene-Solr-trunk-MacOSX/solr/build/solr-core/test/J0
[junit4:junit4]   2> 15223 T2329 C172 P49889 oascsi.HttpClientUtil.createClient Creating new http client, config:maxConnections=128&maxConnectionsPerHost=32&followRedirects=false
[junit4:junit4]   2> 15223 T2237 oass.SolrDispatchFilter.init SolrDispatchFilter.init() done
[junit4:junit4]   2> 15224 T2237 oascsi.HttpClientUtil.createClient Creating new http client, config:maxConnections=128&maxConnectionsPerHost=32&followRedirects=false
[junit4:junit4]   2> 15230 T2237 oascc.ZkStateReader.updateClusterState Updating cloud state from ZooKeeper... 
[junit4:junit4]   2> 15232 T2237 oasc.AbstractDistribZkTestBase.waitForRecoveriesToFinish Wait for recoveries to finish - collection: collection1 failOnTimeout:true timeout (sec):230
[junit4:junit4]   2> 15234 T2237 oascc.ZkStateReader.updateClusterState Updating cloud state from ZooKeeper... 
[junit4:junit4]   2> 15948 T2260 oascc.ZkStateReader.updateClusterState Updating cloud state from ZooKeeper... 
[junit4:junit4]   2> 15950 T2260 oasc.Overseer$ClusterStateUpdater.updateState Update state numShards=2 message={
[junit4:junit4]   2> 	  "operation":"state",
[junit4:junit4]   2> 	  "numShards":"2",
[junit4:junit4]   2> 	  "shard":"shard1",
[junit4:junit4]   2> 	  "roles":null,
[junit4:junit4]   2> 	  "state":"active",
[junit4:junit4]   2> 	  "core":"collection1",
[junit4:junit4]   2> 	  "collection":"collection1",
[junit4:junit4]   2> 	  "node_name":"127.0.0.1:49885_",
[junit4:junit4]   2> 	  "base_url":"http://127.0.0.1:49885"}
[junit4:junit4]   2> 15964 T2260 oasc.Overseer$ClusterStateUpdater.updateState Update state numShards=2 message={
[junit4:junit4]   2> 	  "operation":"state",
[junit4:junit4]   2> 	  "numShards":"2",
[junit4:junit4]   2> 	  "shard":"shard2",
[junit4:junit4]   2> 	  "roles":null,
[junit4:junit4]   2> 	  "state":"recovering",
[junit4:junit4]   2> 	  "core":"collection1",
[junit4:junit4]   2> 	  "collection":"collection1",
[junit4:junit4]   2> 	  "node_name":"127.0.0.1:49889_",
[junit4:junit4]   2> 	  "base_url":"http://127.0.0.1:49889"}
[junit4:junit4]   2> 15980 T2259 oascc.ZkStateReader$2.process A cluster state change: WatchedEvent state:SyncConnected type:NodeDataChanged path:/clusterstate.json, has occurred - updating... (live nodes size: 5)
[junit4:junit4]   2> 15981 T2308 oascc.ZkStateReader$2.process A cluster state change: WatchedEvent state:SyncConnected type:NodeDataChanged path:/clusterstate.json, has occurred - updating... (live nodes size: 5)
[junit4:junit4]   2> 15982 T2324 oascc.ZkStateReader$2.process A cluster state change: WatchedEvent state:SyncConnected type:NodeDataChanged path:/clusterstate.json, has occurred - updating... (live nodes size: 5)
[junit4:junit4]   2> 15983 T2278 oascc.ZkStateReader$2.process A cluster state change: WatchedEvent state:SyncConnected type:NodeDataChanged path:/clusterstate.json, has occurred - updating... (live nodes size: 5)
[junit4:junit4]   2> 15980 T2265 oascc.ZkStateReader$2.process A cluster state change: WatchedEvent state:SyncConnected type:NodeDataChanged path:/clusterstate.json, has occurred - updating... (live nodes size: 5)
[junit4:junit4]   2> 15982 T2293 oascc.ZkStateReader$2.process A cluster state change: WatchedEvent state:SyncConnected type:NodeDataChanged path:/clusterstate.json, has occurred - updating... (live nodes size: 5)
[junit4:junit4]   2> 16242 T2237 oascc.ZkStateReader.updateClusterState Updating cloud state from ZooKeeper... 
[junit4:junit4]   2> 17250 T2237 oascc.ZkStateReader.updateClusterState Updating cloud state from ZooKeeper... 
[junit4:junit4]   2>  C172_STATE=coll:collection1 core:collection1 props:{shard=shard2, roles=null, state=recovering, core=collection1, collection=collection1, node_name=127.0.0.1:49889_, base_url=http://127.0.0.1:49889}
[junit4:junit4]   2> 18233 T2329 C172 P49889 oasc.RecoveryStrategy.doRecovery Attempting to PeerSync from http://127.0.0.1:49882/collection1/ core=collection1 - recoveringAfterStartup=true
[junit4:junit4]   2> 18233 T2329 C172 P49889 oasu.PeerSync.sync PeerSync: core=collection1 url=http://127.0.0.1:49889 START replicas=[http://127.0.0.1:49882/collection1/] nUpdates=100
[junit4:junit4]   2> 18234 T2329 C172 P49889 oasu.PeerSync.sync WARNING no frame of reference to tell of we've missed updates
[junit4:junit4]   2> 18234 T2329 C172 P49889 oasc.RecoveryStrategy.doRecovery PeerSync Recovery was not successful - trying replication. core=collection1
[junit4:junit4]   2> 18234 T2329 C172 P49889 oasc.RecoveryStrategy.doRecovery Starting Replication Recovery. core=collection1
[junit4:junit4]   2> 18234 T2329 C172 P49889 oasc.RecoveryStrategy.doRecovery Begin buffering updates. core=collection1
[junit4:junit4]   2> 18234 T2329 C172 P49889 oasu.UpdateLog.bufferUpdates Starting to buffer updates. FSUpdateLog{state=ACTIVE, tlog=null}
[junit4:junit4]   2> 18234 T2329 C172 P49889 oasc.RecoveryStrategy.replicate Attempting to replicate from http://127.0.0.1:49882/collection1/. core=collection1
[junit4:junit4]   2> 18235 T2329 C172 P49889 oascsi.HttpClientUtil.createClient Creating new http client, config:maxConnections=128&maxConnectionsPerHost=32&followRedirects=false
[junit4:junit4]   2> ASYNC  NEW_CORE C173 name=collection1 org.apache.solr.core.SolrCore@41549a80 url=http://127.0.0.1:49882/collection1 node=127.0.0.1:49882_ C173_STATE=coll:collection1 core:collection1 props:{shard=shard2, roles=null, state=active, core=collection1, collection=collection1, node_name=127.0.0.1:49882_, base_url=http://127.0.0.1:49882, leader=true}
[junit4:junit4]   2> 18241 T2289 C173 P49882 REQ /get {getVersions=100&distrib=false&wt=javabin&qt=/get&version=2} status=0 QTime=1 
[junit4:junit4]   2> 18244 T2287 C173 P49882 oasu.DirectUpdateHandler2.commit start commit{,optimize=false,openSearcher=false,waitSearcher=true,expungeDeletes=false,softCommit=false}
[junit4:junit4]   2> 18246 T2287 C173 P49882 oasc.CachingDirectoryFactory.close Releasing directory:/Users/jenkins/jenkins-slave/workspace/Lucene-Solr-trunk-MacOSX/solr/build/solr-core/test/J0/./org.apache.solr.cloud.BasicDistributedZkTest-1359905507479/jetty2
[junit4:junit4]   2> 18248 T2287 C173 P49882 oasc.SolrDeletionPolicy.onInit SolrDeletionPolicy.onInit: commits:num=1
[junit4:junit4]   2> 		commit{dir=RateLimitedDirectoryWrapper(NRTCachingDirectory(org.apache.lucene.store.NIOFSDirectory@/Users/jenkins/jenkins-slave/workspace/Lucene-Solr-trunk-MacOSX/solr/build/solr-core/test/J0/org.apache.solr.cloud.BasicDistributedZkTest-1359905507479/jetty2/index lockFactory=org.apache.lucene.store.NativeFSLockFactory@14a82974; maxCacheMB=48.0 maxMergeSizeMB=4.0)),segFN=segments_1,generation=1,filenames=[segments_1]
[junit4:junit4]   2> 18250 T2287 C173 P49882 oasc.SolrDeletionPolicy.updateCommits newest commit = 1[segments_1]
[junit4:junit4]   2> 18253 T2237 oascc.ZkStateReader.updateClusterState Updating cloud state from ZooKeeper... 
[junit4:junit4]   2> 18253 T2287 C173 P49882 oasc.SolrDeletionPolicy.onCommit SolrDeletionPolicy.onCommit: commits:num=2
[junit4:junit4]   2> 		commit{dir=RateLimitedDirectoryWrapper(NRTCachingDirectory(org.apache.lucene.store.NIOFSDirectory@/Users/jenkins/jenkins-slave/workspace/Lucene-Solr-trunk-MacOSX/solr/build/solr-core/test/J0/org.apache.solr.cloud.BasicDistributedZkTest-1359905507479/jetty2/index lockFactory=org.apache.lucene.store.NativeFSLockFactory@14a82974; maxCacheMB=48.0 maxMergeSizeMB=4.0)),segFN=segments_1,generation=1,filenames=[segments_1]
[junit4:junit4]   2> 		commit{dir=RateLimitedDirectoryWrapper(NRTCachingDirectory(org.apache.lucene.store.NIOFSDirectory@/Users/jenkins/jenkins-slave/workspace/Lucene-Solr-trunk-MacOSX/solr/build/solr-core/test/J0/org.apache.solr.cloud.BasicDistributedZkTest-1359905507479/jetty2/index lockFactory=org.apache.lucene.store.NativeFSLockFactory@14a82974; maxCacheMB=48.0 maxMergeSizeMB=4.0)),segFN=segments_2,generation=2,filenames=[segments_2]
[junit4:junit4]   2> 18253 T2287 C173 P49882 oasc.SolrDeletionPolicy.updateCommits newest commit = 2[segments_2]
[junit4:junit4]   2> 18254 T2287 C173 P49882 oasc.CachingDirectoryFactory.close Releasing directory:/Users/jenkins/jenkins-slave/workspace/Lucene-Solr-trunk-MacOSX/solr/build/solr-core/test/J0/./org.apache.solr.cloud.BasicDistributedZkTest-1359905507479/jetty2
[junit4:junit4]   2> 18255 T2287 C173 P49882 oass.SolrIndexSearcher.<init> Opening Searcher@33a54dcd realtime
[junit4:junit4]   2> 18255 T2287 C173 P49882 oasu.DirectUpdateHandler2.commit end_commit_flush
[junit4:junit4]   2> 18256 T2287 C173 P49882 /update {waitSearcher=true&openSearcher=false&commit=true&wt=javabin&commit_end_point=true&version=2&softCommit=false} {commit=} 0 12
[junit4:junit4]   2> 18257 T2329 C172 P49889 oash.ReplicationHandler.inform Commits will be reserved for  10000
[junit4:junit4]   2> 18258 T2329 C172 P49889 oash.SnapPuller.<init>  No value set for 'pollInterval'. Timer Task not started.
[junit4:junit4]   2> 18261 T2285 C173 P49882 oash.ReplicationHandler.inform Commits will be reserved for  10000
[junit4:junit4]   2> 18261 T2285 C173 P49882 REQ /replication {command=indexversion&qt=/replication&wt=javabin&version=2} status=0 QTime=1 
[junit4:junit4]   2> 18262 T2329 C172 P49889 oash.SnapPuller.fetchLatestIndex Master's generation: 2
[junit4:junit4]   2> 18262 T2329 C172 P49889 oash.SnapPuller.fetchLatestIndex Slave's generation: 1
[junit4:junit4]   2> 18262 T2329 C172 P49889 oash.SnapPuller.fetchLatestIndex Starting replication process
[junit4:junit4]   2> 18265 T2286 C173 P49882 oasc.CachingDirectoryFactory.close Releasing directory:/Users/jenkins/jenkins-slave/workspace/Lucene-Solr-trunk-MacOSX/solr/build/solr-core/test/J0/./org.apache.solr.cloud.BasicDistributedZkTest-1359905507479/jetty2
[junit4:junit4]   2> 18266 T2286 C173 P49882 oasc.CachingDirectoryFactory.close Releasing directory:/Users/jenkins/jenkins-slave/workspace/Lucene-Solr-trunk-MacOSX/solr/build/solr-core/test/J0/./org.apache.solr.cloud.BasicDistributedZkTest-1359905507479/jetty2/index
[junit4:junit4]   2> 18266 T2286 C173 P49882 REQ /replication {command=filelist&qt=/replication&wt=javabin&generation=2&version=2} status=0 QTime=1 
[junit4:junit4]   2> 18267 T2329 C172 P49889 oash.SnapPuller.fetchLatestIndex Number of files in latest index in master: 1
[junit4:junit4]   2> 18268 T2329 C172 P49889 oasc.CachingDirectoryFactory.get return new directory for /Users/jenkins/jenkins-slave/workspace/Lucene-Solr-trunk-MacOSX/solr/build/solr-core/test/J0/./org.apache.solr.cloud.BasicDistributedZkTest-1359905507479/jetty4/index.20130203133205739 forceNew:false
[junit4:junit4]   2> 18269 T2329 C172 P49889 oasc.CachingDirectoryFactory.close Releasing directory:/Users/jenkins/jenkins-slave/workspace/Lucene-Solr-trunk-MacOSX/solr/build/solr-core/test/J0/./org.apache.solr.cloud.BasicDistributedZkTest-1359905507479/jetty4
[junit4:junit4]   2> 18270 T2329 C172 P49889 oash.SnapPuller.fetchLatestIndex Starting download to RateLimitedDirectoryWrapper(NRTCachingDirectory(org.apache.lucene.store.NIOFSDirectory@/Users/jenkins/jenkins-slave/workspace/Lucene-Solr-trunk-MacOSX/solr/build/solr-core/test/J0/org.apache.solr.cloud.BasicDistributedZkTest-1359905507479/jetty4/index.20130203133205739 lockFactory=org.apache.lucene.store.NativeFSLockFactory@9c2249a; maxCacheMB=48.0 maxMergeSizeMB=4.0)) fullCopy=true
[junit4:junit4]   2> 18272 T2289 C173 P49882 REQ /replication {file=segments_2&command=filecontent&checksum=true&wt=filestream&qt=/replication&generation=2} status=0 QTime=0 
[junit4:junit4]   2> 18274 T2329 C172 P49889 oasc.CachingDirectoryFactory.close Releasing directory:/Users/jenkins/jenkins-slave/workspace/Lucene-Solr-trunk-MacOSX/solr/build/solr-core/test/J0/./org.apache.solr.cloud.BasicDistributedZkTest-1359905507479/jetty4/index
[junit4:junit4]   2> 18275 T2329 C172 P49889 oash.SnapPuller.fetchLatestIndex Total time taken for download : 0 secs
[junit4:junit4]   2> 18275 T2329 C172 P49889 oash.SnapPuller.modifyIndexProps New index installed. Updating index properties... index=index.20130203133205739
[junit4:junit4]   2> 18276 T2329 C172 P49889 oasc.CachingDirectoryFactory.close Releasing directory:/Users/jenkins/jenkins-slave/workspace/Lucene-Solr-trunk-MacOSX/solr/build/solr-core/test/J0/./org.apache.solr.cloud.BasicDistributedZkTest-1359905507479/jetty4
[junit4:junit4]   2> 18276 T2329 C172 P49889 oasc.CachingDirectoryFactory.close Releasing directory:/Users/jenkins/jenkins-slave/workspace/Lucene-Solr-trunk-MacOSX/solr/build/solr-core/test/J0/./org.apache.solr.cloud.BasicDistributedZkTest-1359905507479/jetty4
[junit4:junit4]   2> 18276 T2329 C172 P49889 oasc.SolrCore.getNewIndexDir New index directory detected: old=./org.apache.solr.cloud.BasicDistributedZkTest-1359905507479/jetty4/index/ new=./org.apache.solr.cloud.BasicDistributedZkTest-1359905507479/jetty4/index.20130203133205739
[junit4:junit4]   2> 18279 T2329 C172 P49889 oasc.SolrDeletionPolicy.onInit SolrDeletionPolicy.onInit: commits:num=1
[junit4:junit4]   2> 		commit{dir=RateLimitedDirectoryWrapper(NRTCachingDirectory(org.apache.lucene.store.NIOFSDirectory@/Users/jenkins/jenkins-slave/workspace/Lucene-Solr-trunk-MacOSX/solr/build/solr-core/test/J0/org.apache.solr.cloud.BasicDistributedZkTest-1359905507479/jetty4/index.20130203133205739 lockFactory=org.apache.lucene.store.NativeFSLockFactory@9c2249a; maxCacheMB=48.0 maxMergeSizeMB=4.0)),segFN=segments_2,generation=2,filenames=[segments_2]
[junit4:junit4]   2> 18280 T2329 C172 P49889 oasc.SolrDeletionPolicy.updateCommits newest commit = 2[segments_2]
[junit4:junit4]   2> 18281 T2329 C172 P49889 oasc.CachingDirectoryFactory.close Releasing directory:/Users/jenkins/jenkins-slave/workspace/Lucene-Solr-trunk-MacOSX/solr/build/solr-core/test/J0/./org.apache.solr.cloud.BasicDistributedZkTest-1359905507479/jetty4
[junit4:junit4]   2> 18281 T2329 C172 P49889 oasu.DefaultSolrCoreState.newIndexWriter Creating new IndexWriter...
[junit4:junit4]   2> 18281 T2329 C172 P49889 oasu.DefaultSolrCoreState.newIndexWriter Waiting until IndexWriter is unused... core=collection1
[junit4:junit4]   2> 18281 T2329 C172 P49889 oasu.DefaultSolrCoreState.newIndexWriter Rollback old IndexWriter... core=collection1
[junit4:junit4]   2> 18282 T2329 C172 P49889 oasc.CachingDirectoryFactory.close Releasing directory:/Users/jenkins/jenkins-slave/workspace/Lucene-Solr-trunk-MacOSX/solr/build/solr-core/test/J0/./org.apache.solr.cloud.BasicDistributedZkTest-1359905507479/jetty4/index.20130203133205739
[junit4:junit4]   2> 18282 T2329 C172 P49889 oasc.CachingDirectoryFactory.close Releasing directory:/Users/jenkins/jenkins-slave/workspace/Lucene-Solr-trunk-MacOSX/solr/build/solr-core/test/J0/./org.apache.solr.cloud.BasicDistributedZkTest-1359905507479/jetty4
[junit4:junit4]   2> 18284 T2329 C172 P49889 oasc.SolrDeletionPolicy.onInit SolrDeletionPolicy.onInit: commits:num=1
[junit4:junit4]   2> 		commit{dir=RateLimitedDirectoryWrapper(NRTCachingDirectory(org.apache.lucene.store.NIOFSDirectory@/Users/jenkins/jenkins-slave/workspace/Lucene-Solr-trunk-MacOSX/solr/build/solr-core/test/J0/org.apache.solr.cloud.BasicDistributedZkTest-1359905507479/jetty4/index.20130203133205739 lockFactory=org.apache.lucene.store.NativeFSLockFactory@9c2249a; maxCacheMB=48.0 maxMergeSizeMB=4.0)),segFN=segments_2,generation=2,filenames=[segments_2]
[junit4:junit4]   2> 18284 T2329 C172 P49889 oasc.SolrDeletionPolicy.updateCommits newest commit = 2[segments_2]
[junit4:junit4]   2> 18284 T2329 C172 P49889 oasu.DefaultSolrCoreState.newIndexWriter New IndexWriter is ready to be used.
[junit4:junit4]   2> 18285 T2329 C172 P49889 oasc.CachingDirectoryFactory.close Releasing directory:/Users/jenkins/jenkins-slave/workspace/Lucene-Solr-trunk-MacOSX/solr/build/solr-core/test/J0/./org.apache.solr.cloud.BasicDistributedZkTest-1359905507479/jetty4
[junit4:junit4]   2> 18285 T2329 C172 P49889 oass.SolrIndexSearcher.<init> Opening Searcher@2b6d99f5 main
[junit4:junit4]   2> 18287 T2326 oasc.SolrCore.registerSearcher [collection1] Registered new searcher Searcher@2b6d99f5 main{StandardDirectoryReader(segments_2:1:nrt)}
[junit4:junit4]   2> 18287 T2326 oasc.CachingDirectoryFactory.close Releasing directory:/Users/jenkins/jenkins-slave/workspace/Lucene-Solr-trunk-MacOSX/solr/build/solr-core/test/J0/./org.apache.solr.cloud.BasicDistributedZkTest-1359905507479/jetty4/index
[junit4:junit4]   2> 18288 T2329 C172 P49889 oasu.DirectUpdateHandler2.commit start commit{,optimize=false,openSearcher=false,waitSearcher=false,expungeDeletes=false,softCommit=false}
[junit4:junit4]   2> 18290 T2329 C172 P49889 oasc.SolrDeletionPolicy.onCommit SolrDeletionPolicy.onCommit: commits:num=2
[junit4:junit4]   2> 		commit{dir=RateLimitedDirectoryWrapper(NRTCachingDirectory(org.apache.lucene.store.NIOFSDirectory@/Users/jenkins/jenkins-slave/workspace/Lucene-Solr-trunk-MacOSX/solr/build/solr-core/test/J0/org.apache.solr.cloud.BasicDistributedZkTest-1359905507479/jetty4/index.20130203133205739 lockFactory=org.apache.lucene.store.NativeFSLockFactory@9c2249a; maxCacheMB=48.0 maxMergeSizeMB=4.0)),segFN=segments_2,generation=2,filenames=[segments_2]
[junit4:junit4]   2> 		commit{dir=RateLimitedDirectoryWrapper(NRTCachingDirectory(org.apache.lucene.store.NIOFSDirectory@/Users/jenkins/jenkins-slave/workspace/Lucene-Solr-trunk-MacOSX/solr/build/solr-core/test/J0/org.apache.solr.cloud.BasicDistributedZkTest-1359905507479/jetty4/index.20130203133205739 lockFactory=org.apache.lucene.store.NativeFSLockFactory@9c2249a; maxCacheMB=48.0 maxMergeSizeMB=4.0)),segFN=segments_3,generation=3,filenames=[segments_3]
[junit4:junit4]   2> 18290 T2329 C172 P49889 oasc.SolrDeletionPolicy.updateCommits newest commit = 3[segments_3]
[junit4:junit4]   2> 18291 T2329 C172 P49889 oasc.CachingDirectoryFactory.close Releasing directory:/Users/jenkins/jenkins-slave/workspace/Lucene-Solr-trunk-MacOSX/solr/build/solr-core/test/J0/./org.apache.solr.cloud.BasicDistributedZkTest-1359905507479/jetty4
[junit4:junit4]   2> 18291 T2329 C172 P49889 oasu.DirectUpdateHandler2.commit end_commit_flush
[junit4:junit4]   2> 18291 T2329 C172 P49889 oasc.CachingDirectoryFactory.close Releasing directory:/Users/jenkins/jenkins-slave/workspace/Lucene-Solr-trunk-MacOSX/solr/build/solr-core/test/J0/./org.apache.solr.cloud.BasicDistributedZkTest-1359905507479/jetty4/index.20130203133205739
[junit4:junit4]   2> 18291 T2329 C172 P49889 oasc.CachingDirectoryFactory.close Releasing directory:/Users/jenkins/jenkins-slave/workspace/Lucene-Solr-trunk-MacOSX/solr/build/solr-core/test/J0/./org.apache.solr.cloud.BasicDistributedZkTest-1359905507479/jetty4/index
[junit4:junit4]   2> 18291 T2329 C172 P49889 oasc.RecoveryStrategy.replay No replay needed. core=collection1
[junit4:junit4]   2> 18292 T2329 C172 P49889 oasc.RecoveryStrategy.doRecovery Replication Recovery was successful - registering as Active. core=collection1
[junit4:junit4]   2> 18292 T2329 C172 P49889 oasc.ZkController.publish publishing core=collection1 state=active
[junit4:junit4]   2> 18292 T2329 C172 P49889 oasc.ZkController.publish numShards not found on descriptor - reading it from system property
[junit4:junit4]   2> 18294 T2329 C172 P49889 oasc.RecoveryStrategy.doRecovery Finished recovery process. core=collection1
[junit4:junit4]   2> 19014 T2260 oascc.ZkStateReader.updateClusterState Updating cloud state from ZooKeeper... 
[junit4:junit4]   2> 19015 T2260 oasc.Overseer$ClusterStateUpdater.updateState Update state numShards=2 message={
[junit4:junit4]   2> 	  "operation":"state",
[junit4:junit4]   2> 	  "numShards":"2",
[junit4:junit4]   2> 	  "shard":"shard2",
[junit4:junit4]   2> 	  "roles":null,
[junit4:junit4]   2> 	  "state":"active",
[junit4:junit4]   2> 	  "core":"collection1",
[junit4:junit4]   2> 	  "collection":"collection1",
[junit4:junit4]   2> 	  "node_name":"127.0.0.1:49889_",
[junit4:junit4]   2> 	  "base_url":"http://127.0.0.1:49889"}
[junit4:junit4]   2> 19021 T2265 oascc.ZkStateReader$2.process A cluster state change: WatchedEvent state:SyncConnected type:NodeDataChanged path:/clusterstate.json, has occurred - updating... (live nodes size: 5)
[junit4:junit4]   2> 19021 T2259 oascc.ZkStateReader$2.process A cluster state change: WatchedEvent state:SyncConnected type:NodeDataChanged path:/clusterstate.json, has occurred - updating... (live nodes size: 5)
[junit4:junit4]   2> 19022 T2278 oascc.ZkStateReader$2.process A cluster state change: WatchedEvent state:SyncConnected type:NodeDataChanged path:/clusterstate.json, has occurred - updating... (live nodes size: 5)
[junit4:junit4]   2> 19022 T2324 oascc.ZkStateReader$2.process A cluster state change: WatchedEvent state:SyncConnected type:NodeDataChanged path:/clusterstate.json, has occurred - updating... (live nodes size: 5)
[junit4:junit4]   2> 19022 T2293 oascc.ZkStateReader$2.process A cluster state change: WatchedEvent state:SyncConnected type:NodeDataChanged path:/clusterstate.json, has occurred - updating... (live nodes size: 5)
[junit4:junit4]   2> 19022 T2308 oascc.ZkStateReader$2.process A cluster state change: WatchedEvent state:SyncConnected type:NodeDataChanged path:/clusterstate.json, has occurred - updating... (live nodes size: 5)
[junit4:junit4]   2> 19256 T2237 oascc.ZkStateReader.updateClusterState Updating cloud state from ZooKeeper... 
[junit4:junit4]   2> 19257 T2237 oasc.AbstractDistribZkTestBase.waitForRecoveriesToFinish Recoveries finished - collection: collection1
[junit4:junit4]   2> ASYNC  NEW_CORE C174 name=collection1 org.apache.solr.core.SolrCore@31b27d14 url=http://127.0.0.1:49875/collection1 node=127.0.0.1:49875_ C174_STATE=coll:control_collection core:collection1 props:{shard=shard1, roles=null, state=active, core=collection1, collection=control_collection, node_name=127.0.0.1:49875_, base_url=http://127.0.0.1:49875, leader=true}
[junit4:junit4]   2> 19265 T2251 C174 P49875 oasc.CachingDirectoryFactory.close Releasing directory:/Users/jenkins/jenkins-slave/workspace/Lucene-Solr-trunk-MacOSX/solr/build/solr-core/test/J0/./org.apache.solr.cloud.BasicDistributedZkTest-1359905507479/control/data
[junit4:junit4]   2> 19269 T2251 C174 P49875 oasc.SolrDeletionPolicy.onInit SolrDeletionPolicy.onInit: commits:num=1
[junit4:junit4]   2> 		commit{dir=RateLimitedDirectoryWrapper(NRTCachingDirectory(org.apache.lucene.store.NIOFSDirectory@/Users/jenkins/jenkins-slave/workspace/Lucene-Solr-trunk-MacOSX/solr/build/solr-core/test/J0/org.apache.solr.cloud.BasicDistributedZkTest-1359905507479/control/data/index lockFactory=org.apache.lucene.store.NativeFSLockFactory@5bb5272b; maxCacheMB=48.0 maxMergeSizeMB=4.0)),segFN=segments_1,generation=1,filenames=[segments_1]
[junit4:junit4]   2> 19269 T2251 C174 P49875 oasc.SolrDeletionPolicy.updateCommits newest commit = 1[segments_1]
[junit4:junit4]   2> 19270 T2251 C174 P49875 oasc.CachingDirectoryFactory.close Releasing directory:/Users/jenkins/jenkins-slave/workspace/Lucene-Solr-trunk-MacOSX/solr/build/solr-core/test/J0/./org.apache.solr.cloud.BasicDistributedZkTest-1359905507479/control/data
[junit4:junit4]   2> 19271 T2251 C174 P49875 oass.SolrIndexSearcher.<init> Opening Searcher@d328104 realtime
[junit4:junit4]   2> 19271 T2251 C174 P49875 /update {wt=javabin&version=2} {deleteByQuery=*:* (-1425964297601679360)} 0 7
[junit4:junit4]   2> 19275 T2273 C171 P49879 oasc.CachingDirectoryFactory.close Releasing directory:/Users/jenkins/jenkins-slave/workspace/Lucene-Solr-trunk-MacOSX/solr/build/solr-core/test/J0/./org.apache.solr.cloud.BasicDistributedZkTest-1359905507479/jetty1
[junit4:junit4]   2> 19281 T2284 C173 P49882 oasc.CachingDirectoryFactory.close Releasing directory:/Users/jenkins/jenkins-slave/workspace/Lucene-Solr-trunk-MacOSX/solr/build/solr-core/test/J0/./org.apache.solr.cloud.BasicDistributedZkTest-1359905507479/jetty2
[junit4:junit4]   2>  C170_STATE=coll:collection1 core:collection1 props:{shard=shard1, roles=null, state=active, core=collection1, collection=collection1, node_name=127.0.0.1:49885_, base_url=http://127.0.0.1:49885}
[junit4:junit4]   2> 19289 T2302 C170 P49885 oasc.CachingDirectoryFactory.close Releasing directory:/Users/jenkins/jenkins-slave/workspace/Lucene-Solr-trunk-MacOSX/solr/build/solr-core/test/J0/./org.apache.solr.cloud.BasicDistributedZkTest-1359905507479/jetty3
[junit4:junit4]   2> 19291 T2302 C170 P49885 /update {update.distrib=FROMLEADER&_version_=-1425964297612165120&update.from=http://127.0.0.1:49879/collection1/&wt=javabin&version=2} {deleteByQuery=*:* (-1425964297612165120)} 0 4
[junit4:junit4]   2>  C172_STATE=coll:collection1 core:collection1 props:{shard=shard2, roles=null, state=active, core=collection1, collection=collection1, node_name=127.0.0.1:49889_, base_url=http://127.0.0.1:49889}
[junit4:junit4]   2> 19291 T2320 C172 P49889 oasc.CachingDirectoryFactory.close Releasing directory:/Users/jenkins/jenkins-slave/workspace/Lucene-Solr-trunk-MacOSX/solr/build/solr-core/test/J0/./org.apache.solr.cloud.BasicDistributedZkTest-1359905507479/jetty4
[junit4:junit4]   2> 19292 T2320 C172 P49889 /update {update.distrib=FROMLEADER&_version_=-1425964297618456576&update.from=http://127.0.0.1:49882/collection1/&wt=javabin&version=2} {deleteByQuery=*:* (-1425964297618456576)} 0 2
[junit4:junit4]   2> 19293 T2284 C173 P49882 /update {update.distrib=TOLEADER&wt=javabin&version=2} {deleteByQuery=*:* (-1425964297618456576)} 0 13
[junit4:junit4]   2> 19294 T2273 C171 P49879 /update {wt=javabin&version=2} {deleteByQuery=*:* (-1425964297612165120)} 0 21
[junit4:junit4]   2> 19303 T2252 C174 P49875 /update {wt=javabin&version=2} {add=[1 (1425964297637330944)]} 0 5
[junit4:junit4]   2> 19316 T2303 C170 P49885 /update {distrib.from=http://127.0.0.1:49879/collection1/&update.distrib=FROMLEADER&wt=javabin&version=2} {add=[1 (1425964297646768128)]} 0 3
[junit4:junit4]   2> 19317 T2269 C171 P49879 /update {distrib.from=http://127.0.0.1:49882/collection1/&update.distrib=TOLEADER&wt=javabin&version=2} {add=[1 (1425964297646768128)]} 0 10
[junit4:junit4]   2> 19318 T2285 C173 P49882 /update {wt=javabin&version=2} {add=[1]} 0 13
[junit4:junit4]   2> 19328 T2254 C174 P49875 /update {wt=javabin&version=2} {add=[2 (1425964297667739648)]} 0 1
[junit4:junit4]   2> 19350 T2315 C172 P49889 /update {distrib.from=http://127.0.0.1:49882/collection1/&update.distrib=FROMLEADER&wt=javabin&version=2} {add=[2 (1425964297681371136)]} 0 4
[junit4:junit4]   2> 19351 T2286 C173 P49882 /update {distrib.from=http://127.0.0.1:49879/collection1/&update.distrib=TOLEADER&wt=javabin&version=2} {add=[2 (1425964297681371136)]} 0 11
[junit4:junit4]   2> 19351 T2271 C171 P49879 /update {wt=javabin&version=2} {add=[2]} 0 15
[junit4:junit4]   2> 19357 T2255 C174 P49875 /update {wt=javabin&version=2} {add=[3 (1425964297697099776)]} 0 3
[junit4:junit4]   2> 19365 T2316 C172 P49889 /update {distrib.from=http://127.0.0.1:49882/collection1/&update.distrib=FROMLEADER&wt=javabin&version=2} {add=[3 (1425964297702342656)]} 0 2
[junit4:junit4]   2> 19366 T2289 C173 P49882 /update {wt=javabin&version=2} {add=[3 (1425964297702342656)]} 0 7
[junit4:junit4]   2> 19371 T2250 C174 P49875 /update {wt=javabin&version=2} {add=[4 (1425964297711779840)]} 0 2
[junit4:junit4]   2> 19379 T2304 C170 P49885 /update {distrib.from=http://127.0.0.1:49879/collection1/&update.distrib=FROMLEADER&wt=javabin&version=2} {add=[4 (1425964297717022720)]} 0 2
[junit4:junit4]   2> 19380 T2268 C171 P49879 /update {wt=javabin&version=2} {add=[4 (1425964297717022720)]} 0 7
[junit4:junit4]   2> 19385 T2251 C174 P49875 /update {wt=javabin&version=2} {add=[5 (1425964297726459904)]} 0 2
[junit4:junit4]   2> 19399 T2317 C172 P49889 /update {distrib.from=http://127.0.0.1:49882/collection1/&update.distrib=FROMLEADER&wt=javabin&version=2} {add=[5 (1425964297734848512)]} 0 2
[junit4:junit4]   2> 19400 T2288 C173 P49882 /update {distrib.from=http://127.0.0.1:49879/collection1/&update.distrib=TOLEADER&wt=javabin&version=2} {add=[5 (1425964297734848512)]} 0 9
[junit4:junit4]   2> 19401 T2270 C171 P49879 /update {wt=javabin&version=2} {add=[5]} 0 12
[junit4:junit4]   2> 19406 T2253 C174 P49875 /update {wt=javabin&version=2} {add=[6 (1425964297748480000)]} 0 2
[junit4:junit4]   2> 19416 T2319 C172 P49889 /update {distrib.from=http://127.0.0.1:49882/collection1/&update.distrib=FROMLEADER&wt=javabin&version=2}

[...truncated too long message...]

it4:junit4]    > 	at com.carrotsearch.randomizedtesting.RandomizedRunner$8.evaluate(RandomizedRunner.java:787)
[junit4:junit4]    > 	at com.carrotsearch.randomizedtesting.rules.SystemPropertiesRestoreRule$1.evaluate(SystemPropertiesRestoreRule.java:53)
[junit4:junit4]    > 	at org.apache.lucene.util.TestRuleSetupTeardownChained$1.evaluate(TestRuleSetupTeardownChained.java:50)
[junit4:junit4]    > 	at org.apache.lucene.util.TestRuleFieldCacheSanity$1.evaluate(TestRuleFieldCacheSanity.java:51)
[junit4:junit4]    > 	at org.apache.lucene.util.AbstractBeforeAfterRule$1.evaluate(AbstractBeforeAfterRule.java:46)
[junit4:junit4]    > 	at com.carrotsearch.randomizedtesting.rules.SystemPropertiesInvariantRule$1.evaluate(SystemPropertiesInvariantRule.java:55)
[junit4:junit4]    > 	at org.apache.lucene.util.TestRuleThreadAndTestName$1.evaluate(TestRuleThreadAndTestName.java:49)
[junit4:junit4]    > 	at org.apache.lucene.util.TestRuleIgnoreAfterMaxFailures$1.evaluate(TestRuleIgnoreAfterMaxFailures.java:70)
[junit4:junit4]    > 	at org.apache.lucene.util.TestRuleMarkFailure$1.evaluate(TestRuleMarkFailure.java:48)
[junit4:junit4]    > 	at com.carrotsearch.randomizedtesting.rules.StatementAdapter.evaluate(StatementAdapter.java:36)
[junit4:junit4]    > 	at com.carrotsearch.randomizedtesting.ThreadLeakControl$StatementRunner.run(ThreadLeakControl.java:358)
[junit4:junit4]    > 	at com.carrotsearch.randomizedtesting.ThreadLeakControl.forkTimeoutingTask(ThreadLeakControl.java:782)
[junit4:junit4]    > 	at com.carrotsearch.randomizedtesting.ThreadLeakControl$3.evaluate(ThreadLeakControl.java:442)
[junit4:junit4]    > 	at com.carrotsearch.randomizedtesting.RandomizedRunner.runSingleTest(RandomizedRunner.java:746)
[junit4:junit4]    > 	at com.carrotsearch.randomizedtesting.RandomizedRunner$3.evaluate(RandomizedRunner.java:648)
[junit4:junit4]    > 	at com.carrotsearch.randomizedtesting.RandomizedRunner$4.evaluate(RandomizedRunner.java:682)
[junit4:junit4]    > 	at com.carrotsearch.randomizedtesting.RandomizedRunner$5.evaluate(RandomizedRunner.java:693)
[junit4:junit4]    > 	at com.carrotsearch.randomizedtesting.rules.StatementAdapter.evaluate(StatementAdapter.java:36)
[junit4:junit4]    > 	at com.carrotsearch.randomizedtesting.rules.SystemPropertiesRestoreRule$1.evaluate(SystemPropertiesRestoreRule.java:53)
[junit4:junit4]    > 	at org.apache.lucene.util.AbstractBeforeAfterRule$1.evaluate(AbstractBeforeAfterRule.java:46)
[junit4:junit4]    > 	at org.apache.lucene.util.TestRuleStoreClassName$1.evaluate(TestRuleStoreClassName.java:42)
[junit4:junit4]    > 	at com.carrotsearch.randomizedtesting.rules.SystemPropertiesInvariantRule$1.evaluate(SystemPropertiesInvariantRule.java:55)
[junit4:junit4]    > 	at com.carrotsearch.randomizedtesting.rules.NoShadowingOrOverridesOnMethodsRule$1.evaluate(NoShadowingOrOverridesOnMethodsRule.java:39)
[junit4:junit4]    > 	at com.carrotsearch.randomizedtesting.rules.NoShadowingOrOverridesOnMethodsRule$1.evaluate(NoShadowingOrOverridesOnMethodsRule.java:39)
[junit4:junit4]    > 	at com.carrotsearch.randomizedtesting.rules.StatementAdapter.evaluate(StatementAdapter.java:36)
[junit4:junit4]    > 	at org.apache.lucene.util.TestRuleAssertionsRequired$1.evaluate(TestRuleAssertionsRequired.java:43)
[junit4:junit4]    > 	at org.apache.lucene.util.TestRuleMarkFailure$1.evaluate(TestRuleMarkFailure.java:48)
[junit4:junit4]    > 	at org.apache.lucene.util.TestRuleIgnoreAfterMaxFailures$1.evaluate(TestRuleIgnoreAfterMaxFailures.java:70)
[junit4:junit4]    > 	at org.apache.lucene.util.TestRuleIgnoreTestSuites$1.evaluate(TestRuleIgnoreTestSuites.java:55)
[junit4:junit4]    > 	at com.carrotsearch.randomizedtesting.rules.StatementAdapter.evaluate(StatementAdapter.java:36)
[junit4:junit4]    > 	at com.carrotsearch.randomizedtesting.ThreadLeakControl$StatementRunner.run(ThreadLeakControl.java:358)
[junit4:junit4]    > 	at java.lang.Thread.run(Thread.java:722)
[junit4:junit4]   2> 351789 T2237 oas.SolrTestCaseJ4.deleteCore ###deleteCore
[junit4:junit4]   2> NOTE: test params are: codec=Lucene42: {n_f1=MockFixedIntBlock(blockSize=1923), foo_b=PostingsFormat(name=MockRandom), cat=PostingsFormat(name=NestedPulsing), foo_d=PostingsFormat(name=Asserting), foo_f=PostingsFormat(name=MockRandom), n_tl1=MockFixedIntBlock(blockSize=1923), n_d1=PostingsFormat(name=NestedPulsing), rnd_b=PostingsFormat(name=Asserting), intDefault=PostingsFormat(name=NestedPulsing), n_td1=MockFixedIntBlock(blockSize=1923), timestamp=PostingsFormat(name=NestedPulsing), id=PostingsFormat(name=Asserting), range_facet_sl=PostingsFormat(name=MockRandom), range_facet_si=MockFixedIntBlock(blockSize=1923), oddField_s=PostingsFormat(name=MockRandom), sequence_i=PostingsFormat(name=MockRandom), name=PostingsFormat(name=Asserting), foo_i=MockFixedIntBlock(blockSize=1923), regex_dup_B_s=PostingsFormat(name=NestedPulsing), multiDefault=MockFixedIntBlock(blockSize=1923), n_tf1=PostingsFormat(name=NestedPulsing), n_dt1=MockFixedIntBlock(blockSize=1923), genre_s=PostingsFormat(name=MockRandom), author_t=MockFixedIntBlock(blockSize=1923), n_ti1=PostingsFormat(name=Asserting), range_facet_l=PostingsFormat(name=NestedPulsing), text=PostingsFormat(name=MockRandom), _version_=PostingsFormat(name=NestedPulsing), val_i=PostingsFormat(name=Asserting), SubjectTerms_mfacet=PostingsFormat(name=NestedPulsing), series_t=MockFixedIntBlock(blockSize=1923), a_t=PostingsFormat(name=NestedPulsing), n_tdt1=PostingsFormat(name=NestedPulsing), regex_dup_A_s=PostingsFormat(name=MockRandom), price=PostingsFormat(name=MockRandom), other_tl1=PostingsFormat(name=NestedPulsing), n_l1=PostingsFormat(name=NestedPulsing), a_si=MockFixedIntBlock(blockSize=1923), inStock=PostingsFormat(name=MockRandom)}, sim=RandomSimilarityProvider(queryNorm=true,coord=no): {}, locale=hu_HU, timezone=America/Sao_Paulo
[junit4:junit4]   2> NOTE: Mac OS X 10.8.2 x86_64/Oracle Corporation 1.7.0_10 (64-bit)/cpus=2,threads=1,free=55337792,total=327942144
[junit4:junit4]   2> NOTE: All tests run in this JVM: [FullSolrCloudDistribCmdsTest, SortByFunctionTest, SolrRequestParserTest, CacheHeaderTest, AlternateDirectoryTest, SpellingQueryConverterTest, SynonymTokenizerTest, TestSort, LukeRequestHandlerTest, TestRangeQuery, FileBasedSpellCheckerTest, TestPhraseSuggestions, TestPluginEnable, TestComponentsName, TestJmxIntegration, SolrPluginUtilsTest, FileUtilsTest, TestOmitPositions, BasicDistributedZk2Test, UpdateRequestProcessorFactoryTest, BadIndexSchemaTest, SchemaVersionSpecificBehaviorTest, WordBreakSolrSpellCheckerTest, TestIndexingPerformance, JSONWriterTest, FieldAnalysisRequestHandlerTest, TestSearchPerf, TestLFUCache, PingRequestHandlerTest, PrimitiveFieldTypeTest, RequestHandlersTest, TestWriterPerf, DirectSolrSpellCheckerTest, OutputWriterTest, ZkSolrClientTest, TestSystemIdResolver, HighlighterConfigTest, CollectionsAPIDistributedZkTest, TestBinaryField, QueryParsingTest, TestStressRecovery, BadComponentTest, TestJoin, DocumentBuilderTest, TestStressLucene, DOMUtilTest, TestFunctionQuery, TestHashPartitioner, SoftAutoCommitTest, DocumentAnalysisRequestHandlerTest, HardAutoCommitTest, ChaosMonkeySafeLeaderTest, DistributedQueryElevationComponentTest, RegexBoostProcessorTest, TestReplicationHandler, UpdateParamsTest, DirectUpdateHandlerOptimizeTest, TestGroupingSearch, TestElisionMultitermQuery, SuggesterTest, TestCharFilters, ReturnFieldsTest, StandardRequestHandlerTest, SystemInfoHandlerTest, TestJmxMonitoredMap, CSVRequestHandlerTest, ZkNodePropsTest, DefaultValueUpdateProcessorTest, LeaderElectionTest, SpellCheckComponentTest, TestBinaryResponseWriter, TestPseudoReturnFields, TestStressVersions, StatelessScriptUpdateProcessorFactoryTest, DebugComponentTest, TestMergePolicyConfig, TestRTGBase, TestAnalyzedSuggestions, SolrCoreTest, TestFastLRUCache, TestDefaultSimilarityFactory, TestAtomicUpdateErrorCases, AutoCommitTest, MultiTermTest, TestPHPSerializedResponseWriter, TestUtils, TestRecovery, DistributedTermsComponentTest, UUIDFieldTest, ShowFileRequestHandlerTest, TestSolrDeletionPolicy1, IndexSchemaRuntimeFieldTest, IndexSchemaTest, TestRemoteStreaming, TestLMJelinekMercerSimilarityFactory, TestExtendedDismaxParser, PolyFieldTest, TestNumberUtils, TestQuerySenderListener, TestFoldingMultitermQuery, TestPartialUpdateDeduplication, DirectUpdateHandlerTest, ChaosMonkeyNothingIsSafeTest, ShardRoutingTest, RecoveryZkTest, ShardRoutingCustomTest, ClusterStateTest, TestSolrJ, TestFastWriter, SolrInfoMBeanTest, TestUpdate, TestTrie, OpenExchangeRatesOrgProviderTest, SampleTest, SimplePostToolTest, NumericFieldsTest, IndexBasedSpellCheckerTest, OverseerCollectionProcessorTest, TestConfig, TestSolrQueryParser, SignatureUpdateProcessorFactoryTest, ResourceLoaderTest, BasicDistributedZkTest]
[junit4:junit4] Completed in 352.06s, 1 test, 1 failure <<< FAILURES!

[...truncated 380 lines...]
BUILD FAILED
/Users/jenkins/jenkins-slave/workspace/Lucene-Solr-trunk-MacOSX/build.xml:346: The following error occurred while executing this line:
/Users/jenkins/jenkins-slave/workspace/Lucene-Solr-trunk-MacOSX/build.xml:39: The following error occurred while executing this line:
/Users/jenkins/jenkins-slave/workspace/Lucene-Solr-trunk-MacOSX/solr/build.xml:178: The following error occurred while executing this line:
/Users/jenkins/jenkins-slave/workspace/Lucene-Solr-trunk-MacOSX/solr/common-build.xml:428: The following error occurred while executing this line:
/Users/jenkins/jenkins-slave/workspace/Lucene-Solr-trunk-MacOSX/lucene/common-build.xml:1176: The following error occurred while executing this line:
/Users/jenkins/jenkins-slave/workspace/Lucene-Solr-trunk-MacOSX/lucene/common-build.xml:841: There were test failures: 249 suites, 1038 tests, 1 failure, 14 ignored (3 assumptions)

Total time: 58 minutes 11 seconds
Build step 'Invoke Ant' marked build as failure
Archiving artifacts
Recording test results
Description set: Java: 64bit/jdk1.7.0 -XX:+UseParallelGC
Email was triggered for: Failure
Sending email for trigger: Failure



Mime
View raw message