lucene-dev mailing list archives

Site index · List index
Message view « Date » · « Thread »
Top « Date » · « Thread »
From Policeman Jenkins Server <jenk...@thetaphi.de>
Subject [JENKINS] Lucene-Solr-trunk-MacOSX (64bit/jdk1.7.0) - Build # 179 - Still Failing!
Date Sun, 03 Feb 2013 20:45:05 GMT
Build: http://jenkins.thetaphi.de/job/Lucene-Solr-trunk-MacOSX/179/
Java: 64bit/jdk1.7.0 -XX:+UseG1GC

1 tests failed.
FAILED:  org.apache.solr.cloud.BasicDistributedZkTest.testDistribSearch

Error Message:
IOException occured when talking to server at: http://127.0.0.1:49905

Stack Trace:
org.apache.solr.client.solrj.SolrServerException: IOException occured when talking to server at: http://127.0.0.1:49905
	at __randomizedtesting.SeedInfo.seed([402FE91000B79E1A:C1C9670877E8FE26]:0)
	at org.apache.solr.client.solrj.impl.HttpSolrServer.request(HttpSolrServer.java:416)
	at org.apache.solr.client.solrj.impl.HttpSolrServer.request(HttpSolrServer.java:181)
	at org.apache.solr.cloud.BasicDistributedZkTest.testCoreUnloadAndLeaders(BasicDistributedZkTest.java:572)
	at org.apache.solr.cloud.BasicDistributedZkTest.doTest(BasicDistributedZkTest.java:337)
	at org.apache.solr.BaseDistributedSearchTestCase.testDistribSearch(BaseDistributedSearchTestCase.java:794)
	at sun.reflect.NativeMethodAccessorImpl.invoke0(Native Method)
	at sun.reflect.NativeMethodAccessorImpl.invoke(NativeMethodAccessorImpl.java:57)
	at sun.reflect.DelegatingMethodAccessorImpl.invoke(DelegatingMethodAccessorImpl.java:43)
	at java.lang.reflect.Method.invoke(Method.java:601)
	at com.carrotsearch.randomizedtesting.RandomizedRunner.invoke(RandomizedRunner.java:1559)
	at com.carrotsearch.randomizedtesting.RandomizedRunner.access$600(RandomizedRunner.java:79)
	at com.carrotsearch.randomizedtesting.RandomizedRunner$6.evaluate(RandomizedRunner.java:737)
	at com.carrotsearch.randomizedtesting.RandomizedRunner$7.evaluate(RandomizedRunner.java:773)
	at com.carrotsearch.randomizedtesting.RandomizedRunner$8.evaluate(RandomizedRunner.java:787)
	at com.carrotsearch.randomizedtesting.rules.SystemPropertiesRestoreRule$1.evaluate(SystemPropertiesRestoreRule.java:53)
	at org.apache.lucene.util.TestRuleSetupTeardownChained$1.evaluate(TestRuleSetupTeardownChained.java:50)
	at org.apache.lucene.util.TestRuleFieldCacheSanity$1.evaluate(TestRuleFieldCacheSanity.java:51)
	at org.apache.lucene.util.AbstractBeforeAfterRule$1.evaluate(AbstractBeforeAfterRule.java:46)
	at com.carrotsearch.randomizedtesting.rules.SystemPropertiesInvariantRule$1.evaluate(SystemPropertiesInvariantRule.java:55)
	at org.apache.lucene.util.TestRuleThreadAndTestName$1.evaluate(TestRuleThreadAndTestName.java:49)
	at org.apache.lucene.util.TestRuleIgnoreAfterMaxFailures$1.evaluate(TestRuleIgnoreAfterMaxFailures.java:70)
	at org.apache.lucene.util.TestRuleMarkFailure$1.evaluate(TestRuleMarkFailure.java:48)
	at com.carrotsearch.randomizedtesting.rules.StatementAdapter.evaluate(StatementAdapter.java:36)
	at com.carrotsearch.randomizedtesting.ThreadLeakControl$StatementRunner.run(ThreadLeakControl.java:358)
	at com.carrotsearch.randomizedtesting.ThreadLeakControl.forkTimeoutingTask(ThreadLeakControl.java:782)
	at com.carrotsearch.randomizedtesting.ThreadLeakControl$3.evaluate(ThreadLeakControl.java:442)
	at com.carrotsearch.randomizedtesting.RandomizedRunner.runSingleTest(RandomizedRunner.java:746)
	at com.carrotsearch.randomizedtesting.RandomizedRunner$3.evaluate(RandomizedRunner.java:648)
	at com.carrotsearch.randomizedtesting.RandomizedRunner$4.evaluate(RandomizedRunner.java:682)
	at com.carrotsearch.randomizedtesting.RandomizedRunner$5.evaluate(RandomizedRunner.java:693)
	at com.carrotsearch.randomizedtesting.rules.StatementAdapter.evaluate(StatementAdapter.java:36)
	at com.carrotsearch.randomizedtesting.rules.SystemPropertiesRestoreRule$1.evaluate(SystemPropertiesRestoreRule.java:53)
	at org.apache.lucene.util.AbstractBeforeAfterRule$1.evaluate(AbstractBeforeAfterRule.java:46)
	at org.apache.lucene.util.TestRuleStoreClassName$1.evaluate(TestRuleStoreClassName.java:42)
	at com.carrotsearch.randomizedtesting.rules.SystemPropertiesInvariantRule$1.evaluate(SystemPropertiesInvariantRule.java:55)
	at com.carrotsearch.randomizedtesting.rules.NoShadowingOrOverridesOnMethodsRule$1.evaluate(NoShadowingOrOverridesOnMethodsRule.java:39)
	at com.carrotsearch.randomizedtesting.rules.NoShadowingOrOverridesOnMethodsRule$1.evaluate(NoShadowingOrOverridesOnMethodsRule.java:39)
	at com.carrotsearch.randomizedtesting.rules.StatementAdapter.evaluate(StatementAdapter.java:36)
	at org.apache.lucene.util.TestRuleAssertionsRequired$1.evaluate(TestRuleAssertionsRequired.java:43)
	at org.apache.lucene.util.TestRuleMarkFailure$1.evaluate(TestRuleMarkFailure.java:48)
	at org.apache.lucene.util.TestRuleIgnoreAfterMaxFailures$1.evaluate(TestRuleIgnoreAfterMaxFailures.java:70)
	at org.apache.lucene.util.TestRuleIgnoreTestSuites$1.evaluate(TestRuleIgnoreTestSuites.java:55)
	at com.carrotsearch.randomizedtesting.rules.StatementAdapter.evaluate(StatementAdapter.java:36)
	at com.carrotsearch.randomizedtesting.ThreadLeakControl$StatementRunner.run(ThreadLeakControl.java:358)
	at java.lang.Thread.run(Thread.java:722)
Caused by: java.net.SocketException: Invalid argument
	at java.net.SocketInputStream.socketRead0(Native Method)
	at java.net.SocketInputStream.read(SocketInputStream.java:150)
	at java.net.SocketInputStream.read(SocketInputStream.java:121)
	at org.apache.http.impl.io.AbstractSessionInputBuffer.fillBuffer(AbstractSessionInputBuffer.java:149)
	at org.apache.http.impl.io.SocketInputBuffer.fillBuffer(SocketInputBuffer.java:111)
	at org.apache.http.impl.io.AbstractSessionInputBuffer.readLine(AbstractSessionInputBuffer.java:264)
	at org.apache.http.impl.conn.DefaultResponseParser.parseHead(DefaultResponseParser.java:98)
	at org.apache.http.impl.io.AbstractMessageParser.parse(AbstractMessageParser.java:252)
	at org.apache.http.impl.AbstractHttpClientConnection.receiveResponseHeader(AbstractHttpClientConnection.java:282)
	at org.apache.http.impl.conn.DefaultClientConnection.receiveResponseHeader(DefaultClientConnection.java:247)
	at org.apache.http.impl.conn.AbstractClientConnAdapter.receiveResponseHeader(AbstractClientConnAdapter.java:216)
	at org.apache.http.protocol.HttpRequestExecutor.doReceiveResponse(HttpRequestExecutor.java:298)
	at org.apache.http.protocol.HttpRequestExecutor.execute(HttpRequestExecutor.java:125)
	at org.apache.http.impl.client.DefaultRequestDirector.tryExecute(DefaultRequestDirector.java:647)
	at org.apache.http.impl.client.DefaultRequestDirector.execute(DefaultRequestDirector.java:464)
	at org.apache.http.impl.client.AbstractHttpClient.execute(AbstractHttpClient.java:820)
	at org.apache.http.impl.client.AbstractHttpClient.execute(AbstractHttpClient.java:754)
	at org.apache.http.impl.client.AbstractHttpClient.execute(AbstractHttpClient.java:732)
	at org.apache.solr.client.solrj.impl.HttpSolrServer.request(HttpSolrServer.java:353)
	... 44 more




Build Log:
[...truncated 8972 lines...]
[junit4:junit4] Suite: org.apache.solr.cloud.BasicDistributedZkTest
[junit4:junit4]   2> 0 T2106 oas.BaseDistributedSearchTestCase.initHostContext Setting hostContext system property: /
[junit4:junit4]   2> 7 T2106 oas.SolrTestCaseJ4.setUp ###Starting testDistribSearch
[junit4:junit4]   2> Creating dataDir: /Users/jenkins/jenkins-slave/workspace/Lucene-Solr-trunk-MacOSX/solr/build/solr-core/test/J0/./solrtest-BasicDistributedZkTest-1359923479489
[junit4:junit4]   2> 16 T2106 oasc.ZkTestServer.run STARTING ZK TEST SERVER
[junit4:junit4]   2> 17 T2107 oasc.ZkTestServer$ZKServerMain.runFromConfig Starting server
[junit4:junit4]   2> 19 T2107 oazs.ZooKeeperServer.setTickTime tickTime set to 1000
[junit4:junit4]   2> 19 T2107 oazs.ZooKeeperServer.setMinSessionTimeout minSessionTimeout set to -1
[junit4:junit4]   2> 19 T2107 oazs.ZooKeeperServer.setMaxSessionTimeout maxSessionTimeout set to -1
[junit4:junit4]   2> 20 T2107 oazs.NIOServerCnxnFactory.configure binding to port 0.0.0.0/0.0.0.0:0
[junit4:junit4]   2> 21 T2107 oazsp.FileTxnSnapLog.save Snapshotting: 0x0 to /Users/jenkins/jenkins-slave/workspace/Lucene-Solr-trunk-MacOSX/solr/build/solr-core/test/J0/./org.apache.solr.cloud.BasicDistributedZkTest-1359923479489/zookeeper/server1/data/version-2/snapshot.0
[junit4:junit4]   2> 117 T2106 oasc.ZkTestServer.run start zk server on port:49895
[junit4:junit4]   2> 118 T2106 oaz.ZooKeeper.<init> Initiating client connection, connectString=127.0.0.1:49895 sessionTimeout=10000 watcher=org.apache.solr.common.cloud.ConnectionManager@5aed38e1
[junit4:junit4]   2> 119 T2106 oascc.ConnectionManager.waitForConnected Waiting for client to connect to ZooKeeper
[junit4:junit4]   2> 120 T2112 oaz.ClientCnxn$SendThread.logStartConnect Opening socket connection to server localhost/127.0.0.1:49895. Will not attempt to authenticate using SASL (access denied ("javax.security.auth.AuthPermission" "getLoginConfiguration"))
[junit4:junit4]   2> 121 T2112 oaz.ClientCnxn$SendThread.primeConnection Socket connection established to localhost/127.0.0.1:49895, initiating session
[junit4:junit4]   2> 122 T2108 oazs.NIOServerCnxnFactory.run Accepted socket connection from /127.0.0.1:49896
[junit4:junit4]   2> 122 T2108 oazs.ZooKeeperServer.processConnectRequest Client attempting to establish new session at /127.0.0.1:49896
[junit4:junit4]   2> 123 T2110 oazsp.FileTxnLog.append Creating new log file: log.1
[junit4:junit4]   2> 126 T2110 oazs.ZooKeeperServer.finishSessionInit Established session 0x13ca1c183c80000 with negotiated timeout 10000 for client /127.0.0.1:49896
[junit4:junit4]   2> 128 T2112 oaz.ClientCnxn$SendThread.onConnected Session establishment complete on server localhost/127.0.0.1:49895, sessionid = 0x13ca1c183c80000, negotiated timeout = 10000
[junit4:junit4]   2> 128 T2113 oascc.ConnectionManager.process Watcher org.apache.solr.common.cloud.ConnectionManager@5aed38e1 name:ZooKeeperConnection Watcher:127.0.0.1:49895 got event WatchedEvent state:SyncConnected type:None path:null path:null type:None
[junit4:junit4]   2> 129 T2106 oascc.ConnectionManager.waitForConnected Client is connected to ZooKeeper
[junit4:junit4]   2> 129 T2106 oascc.SolrZkClient.makePath makePath: /solr
[junit4:junit4]   2> 134 T2111 oazs.PrepRequestProcessor.pRequest2Txn Processed session termination for sessionid: 0x13ca1c183c80000
[junit4:junit4]   2> 136 T2108 oazs.NIOServerCnxn.closeSock Closed socket connection for client /127.0.0.1:49896 which had sessionid 0x13ca1c183c80000
[junit4:junit4]   2> 135 T2106 oaz.ZooKeeper.close Session: 0x13ca1c183c80000 closed
[junit4:junit4]   2> 137 T2106 oaz.ZooKeeper.<init> Initiating client connection, connectString=127.0.0.1:49895/solr sessionTimeout=10000 watcher=org.apache.solr.common.cloud.ConnectionManager@43611931
[junit4:junit4]   2> 138 T2106 oascc.ConnectionManager.waitForConnected Waiting for client to connect to ZooKeeper
[junit4:junit4]   2> 136 T2113 oaz.ClientCnxn$EventThread.run EventThread shut down
[junit4:junit4]   2> 139 T2114 oaz.ClientCnxn$SendThread.logStartConnect Opening socket connection to server localhost/127.0.0.1:49895. Will not attempt to authenticate using SASL (access denied ("javax.security.auth.AuthPermission" "getLoginConfiguration"))
[junit4:junit4]   2> 140 T2114 oaz.ClientCnxn$SendThread.primeConnection Socket connection established to localhost/127.0.0.1:49895, initiating session
[junit4:junit4]   2> 141 T2108 oazs.NIOServerCnxnFactory.run Accepted socket connection from /127.0.0.1:49897
[junit4:junit4]   2> 141 T2108 oazs.ZooKeeperServer.processConnectRequest Client attempting to establish new session at /127.0.0.1:49897
[junit4:junit4]   2> 143 T2110 oazs.ZooKeeperServer.finishSessionInit Established session 0x13ca1c183c80001 with negotiated timeout 10000 for client /127.0.0.1:49897
[junit4:junit4]   2> 143 T2114 oaz.ClientCnxn$SendThread.onConnected Session establishment complete on server localhost/127.0.0.1:49895, sessionid = 0x13ca1c183c80001, negotiated timeout = 10000
[junit4:junit4]   2> 143 T2115 oascc.ConnectionManager.process Watcher org.apache.solr.common.cloud.ConnectionManager@43611931 name:ZooKeeperConnection Watcher:127.0.0.1:49895/solr got event WatchedEvent state:SyncConnected type:None path:null path:null type:None
[junit4:junit4]   2> 144 T2106 oascc.ConnectionManager.waitForConnected Client is connected to ZooKeeper
[junit4:junit4]   2> 144 T2106 oascc.SolrZkClient.makePath makePath: /collections/collection1
[junit4:junit4]   2> 151 T2106 oascc.SolrZkClient.makePath makePath: /collections/collection1/shards
[junit4:junit4]   2> 156 T2106 oascc.SolrZkClient.makePath makePath: /collections/control_collection
[junit4:junit4]   2> 161 T2106 oascc.SolrZkClient.makePath makePath: /collections/control_collection/shards
[junit4:junit4]   2> 171 T2106 oasc.AbstractZkTestCase.putConfig put /Users/jenkins/jenkins-slave/workspace/Lucene-Solr-trunk-MacOSX/solr/build/solr-core/test-files/solr/collection1/conf/solrconfig.xml to /configs/conf1/solrconfig.xml
[junit4:junit4]   2> 173 T2106 oascc.SolrZkClient.makePath makePath: /configs/conf1/solrconfig.xml
[junit4:junit4]   2> 184 T2106 oasc.AbstractZkTestCase.putConfig put /Users/jenkins/jenkins-slave/workspace/Lucene-Solr-trunk-MacOSX/solr/build/solr-core/test-files/solr/collection1/conf/schema.xml to /configs/conf1/schema.xml
[junit4:junit4]   2> 186 T2106 oascc.SolrZkClient.makePath makePath: /configs/conf1/schema.xml
[junit4:junit4]   2> 208 T2106 oasc.AbstractZkTestCase.putConfig put /Users/jenkins/jenkins-slave/workspace/Lucene-Solr-trunk-MacOSX/solr/build/solr-core/test-files/solr/collection1/conf/stopwords.txt to /configs/conf1/stopwords.txt
[junit4:junit4]   2> 209 T2106 oascc.SolrZkClient.makePath makePath: /configs/conf1/stopwords.txt
[junit4:junit4]   2> 213 T2106 oasc.AbstractZkTestCase.putConfig put /Users/jenkins/jenkins-slave/workspace/Lucene-Solr-trunk-MacOSX/solr/build/solr-core/test-files/solr/collection1/conf/protwords.txt to /configs/conf1/protwords.txt
[junit4:junit4]   2> 215 T2106 oascc.SolrZkClient.makePath makePath: /configs/conf1/protwords.txt
[junit4:junit4]   2> 230 T2106 oasc.AbstractZkTestCase.putConfig put /Users/jenkins/jenkins-slave/workspace/Lucene-Solr-trunk-MacOSX/solr/build/solr-core/test-files/solr/collection1/conf/currency.xml to /configs/conf1/currency.xml
[junit4:junit4]   2> 231 T2106 oascc.SolrZkClient.makePath makePath: /configs/conf1/currency.xml
[junit4:junit4]   2> 236 T2106 oasc.AbstractZkTestCase.putConfig put /Users/jenkins/jenkins-slave/workspace/Lucene-Solr-trunk-MacOSX/solr/build/solr-core/test-files/solr/collection1/conf/open-exchange-rates.json to /configs/conf1/open-exchange-rates.json
[junit4:junit4]   2> 237 T2106 oascc.SolrZkClient.makePath makePath: /configs/conf1/open-exchange-rates.json
[junit4:junit4]   2> 243 T2106 oasc.AbstractZkTestCase.putConfig put /Users/jenkins/jenkins-slave/workspace/Lucene-Solr-trunk-MacOSX/solr/build/solr-core/test-files/solr/collection1/conf/mapping-ISOLatin1Accent.txt to /configs/conf1/mapping-ISOLatin1Accent.txt
[junit4:junit4]   2> 244 T2106 oascc.SolrZkClient.makePath makePath: /configs/conf1/mapping-ISOLatin1Accent.txt
[junit4:junit4]   2> 249 T2106 oasc.AbstractZkTestCase.putConfig put /Users/jenkins/jenkins-slave/workspace/Lucene-Solr-trunk-MacOSX/solr/build/solr-core/test-files/solr/collection1/conf/old_synonyms.txt to /configs/conf1/old_synonyms.txt
[junit4:junit4]   2> 250 T2106 oascc.SolrZkClient.makePath makePath: /configs/conf1/old_synonyms.txt
[junit4:junit4]   2> 254 T2106 oasc.AbstractZkTestCase.putConfig put /Users/jenkins/jenkins-slave/workspace/Lucene-Solr-trunk-MacOSX/solr/build/solr-core/test-files/solr/collection1/conf/synonyms.txt to /configs/conf1/synonyms.txt
[junit4:junit4]   2> 255 T2106 oascc.SolrZkClient.makePath makePath: /configs/conf1/synonyms.txt
[junit4:junit4]   2> 260 T2111 oazs.PrepRequestProcessor.pRequest2Txn Processed session termination for sessionid: 0x13ca1c183c80001
[junit4:junit4]   2> 261 T2108 oazs.NIOServerCnxn.closeSock Closed socket connection for client /127.0.0.1:49897 which had sessionid 0x13ca1c183c80001
[junit4:junit4]   2> 262 T2115 oaz.ClientCnxn$EventThread.run EventThread shut down
[junit4:junit4]   2> 262 T2106 oaz.ZooKeeper.close Session: 0x13ca1c183c80001 closed
[junit4:junit4]   2> 463 T2106 oejs.Server.doStart jetty-8.1.8.v20121106
[junit4:junit4]   2> 470 T2106 oejs.AbstractConnector.doStart Started SelectChannelConnector@127.0.0.1:49898
[junit4:junit4]   2> 471 T2106 oass.SolrDispatchFilter.init SolrDispatchFilter.init()
[junit4:junit4]   2> 471 T2106 oasc.SolrResourceLoader.locateSolrHome JNDI not configured for solr (NoInitialContextEx)
[junit4:junit4]   2> 472 T2106 oasc.SolrResourceLoader.locateSolrHome using system property solr.solr.home: /Users/jenkins/jenkins-slave/workspace/Lucene-Solr-trunk-MacOSX/solr/build/solr-core/test/J0/./org.apache.solr.cloud.BasicDistributedZkTest-controljetty-1359923479737
[junit4:junit4]   2> 473 T2106 oasc.CoreContainer$Initializer.initialize looking for solr.xml: /Users/jenkins/jenkins-slave/workspace/Lucene-Solr-trunk-MacOSX/solr/build/solr-core/test/J0/./org.apache.solr.cloud.BasicDistributedZkTest-controljetty-1359923479737/solr.xml
[junit4:junit4]   2> 473 T2106 oasc.CoreContainer.<init> New CoreContainer 407627566
[junit4:junit4]   2> 474 T2106 oasc.CoreContainer.load Loading CoreContainer using Solr Home: '/Users/jenkins/jenkins-slave/workspace/Lucene-Solr-trunk-MacOSX/solr/build/solr-core/test/J0/./org.apache.solr.cloud.BasicDistributedZkTest-controljetty-1359923479737/'
[junit4:junit4]   2> 475 T2106 oasc.SolrResourceLoader.<init> new SolrResourceLoader for directory: '/Users/jenkins/jenkins-slave/workspace/Lucene-Solr-trunk-MacOSX/solr/build/solr-core/test/J0/./org.apache.solr.cloud.BasicDistributedZkTest-controljetty-1359923479737/'
[junit4:junit4]   2> 520 T2106 oashc.HttpShardHandlerFactory.getParameter Setting socketTimeout to: 60000
[junit4:junit4]   2> 521 T2106 oashc.HttpShardHandlerFactory.getParameter Setting urlScheme to: http://
[junit4:junit4]   2> 522 T2106 oashc.HttpShardHandlerFactory.getParameter Setting connTimeout to: 15000
[junit4:junit4]   2> 523 T2106 oashc.HttpShardHandlerFactory.getParameter Setting maxConnectionsPerHost to: 20
[junit4:junit4]   2> 523 T2106 oashc.HttpShardHandlerFactory.getParameter Setting corePoolSize to: 0
[junit4:junit4]   2> 524 T2106 oashc.HttpShardHandlerFactory.getParameter Setting maximumPoolSize to: 2147483647
[junit4:junit4]   2> 525 T2106 oashc.HttpShardHandlerFactory.getParameter Setting maxThreadIdleTime to: 5
[junit4:junit4]   2> 526 T2106 oashc.HttpShardHandlerFactory.getParameter Setting sizeOfQueue to: -1
[junit4:junit4]   2> 526 T2106 oashc.HttpShardHandlerFactory.getParameter Setting fairnessPolicy to: false
[junit4:junit4]   2> 527 T2106 oascsi.HttpClientUtil.createClient Creating new http client, config:maxConnectionsPerHost=20&maxConnections=10000&socketTimeout=60000&connTimeout=15000&retry=false
[junit4:junit4]   2> 541 T2106 oasc.CoreContainer.load Registering Log Listener
[junit4:junit4]   2> 577 T2106 oasc.CoreContainer.initZooKeeper Zookeeper client=127.0.0.1:49895/solr
[junit4:junit4]   2> 578 T2106 oasc.ZkController.checkChrootPath zkHost includes chroot
[junit4:junit4]   2> 578 T2106 oaz.ZooKeeper.<init> Initiating client connection, connectString=127.0.0.1:49895 sessionTimeout=60000 watcher=org.apache.solr.common.cloud.ConnectionManager@7434e9d6
[junit4:junit4]   2> 580 T2106 oascc.ConnectionManager.waitForConnected Waiting for client to connect to ZooKeeper
[junit4:junit4]   2> 581 T2125 oaz.ClientCnxn$SendThread.logStartConnect Opening socket connection to server localhost/127.0.0.1:49895. Will not attempt to authenticate using SASL (access denied ("javax.security.auth.AuthPermission" "getLoginConfiguration"))
[junit4:junit4]   2> 582 T2125 oaz.ClientCnxn$SendThread.primeConnection Socket connection established to localhost/127.0.0.1:49895, initiating session
[junit4:junit4]   2> 582 T2108 oazs.NIOServerCnxnFactory.run Accepted socket connection from /127.0.0.1:49899
[junit4:junit4]   2> 583 T2108 oazs.ZooKeeperServer.processConnectRequest Client attempting to establish new session at /127.0.0.1:49899
[junit4:junit4]   2> 585 T2110 oazs.ZooKeeperServer.finishSessionInit Established session 0x13ca1c183c80002 with negotiated timeout 20000 for client /127.0.0.1:49899
[junit4:junit4]   2> 585 T2125 oaz.ClientCnxn$SendThread.onConnected Session establishment complete on server localhost/127.0.0.1:49895, sessionid = 0x13ca1c183c80002, negotiated timeout = 20000
[junit4:junit4]   2> 585 T2126 oascc.ConnectionManager.process Watcher org.apache.solr.common.cloud.ConnectionManager@7434e9d6 name:ZooKeeperConnection Watcher:127.0.0.1:49895 got event WatchedEvent state:SyncConnected type:None path:null path:null type:None
[junit4:junit4]   2> 586 T2106 oascc.ConnectionManager.waitForConnected Client is connected to ZooKeeper
[junit4:junit4]   2> 590 T2111 oazs.PrepRequestProcessor.pRequest2Txn Processed session termination for sessionid: 0x13ca1c183c80002
[junit4:junit4]   2> 591 T2106 oaz.ZooKeeper.close Session: 0x13ca1c183c80002 closed
[junit4:junit4]   2> 592 T2106 oascsi.HttpClientUtil.createClient Creating new http client, config:maxConnections=500&maxConnectionsPerHost=16&socketTimeout=60000&connTimeout=15000
[junit4:junit4]   2> 594 T2108 oazs.NIOServerCnxn.closeSock Closed socket connection for client /127.0.0.1:49899 which had sessionid 0x13ca1c183c80002
[junit4:junit4]   2> 594 T2126 oaz.ClientCnxn$EventThread.run EventThread shut down
[junit4:junit4]   2> 600 T2106 oaz.ZooKeeper.<init> Initiating client connection, connectString=127.0.0.1:49895/solr sessionTimeout=30000 watcher=org.apache.solr.common.cloud.ConnectionManager@34af3df6
[junit4:junit4]   2> 602 T2127 oaz.ClientCnxn$SendThread.logStartConnect Opening socket connection to server localhost/127.0.0.1:49895. Will not attempt to authenticate using SASL (access denied ("javax.security.auth.AuthPermission" "getLoginConfiguration"))
[junit4:junit4]   2> 603 T2127 oaz.ClientCnxn$SendThread.primeConnection Socket connection established to localhost/127.0.0.1:49895, initiating session
[junit4:junit4]   2> 604 T2108 oazs.NIOServerCnxnFactory.run Accepted socket connection from /127.0.0.1:49900
[junit4:junit4]   2> 605 T2108 oazs.ZooKeeperServer.processConnectRequest Client attempting to establish new session at /127.0.0.1:49900
[junit4:junit4]   2> 603 T2106 oascc.ConnectionManager.waitForConnected Waiting for client to connect to ZooKeeper
[junit4:junit4]   2> 606 T2110 oazs.ZooKeeperServer.finishSessionInit Established session 0x13ca1c183c80003 with negotiated timeout 20000 for client /127.0.0.1:49900
[junit4:junit4]   2> 606 T2127 oaz.ClientCnxn$SendThread.onConnected Session establishment complete on server localhost/127.0.0.1:49895, sessionid = 0x13ca1c183c80003, negotiated timeout = 20000
[junit4:junit4]   2> 607 T2128 oascc.ConnectionManager.process Watcher org.apache.solr.common.cloud.ConnectionManager@34af3df6 name:ZooKeeperConnection Watcher:127.0.0.1:49895/solr got event WatchedEvent state:SyncConnected type:None path:null path:null type:None
[junit4:junit4]   2> 607 T2106 oascc.ConnectionManager.waitForConnected Client is connected to ZooKeeper
[junit4:junit4]   2> 609 T2111 oazs.PrepRequestProcessor.pRequest Got user-level KeeperException when processing sessionid:0x13ca1c183c80003 type:create cxid:0x2 zxid:0x1a txntype:-1 reqpath:n/a Error Path:/solr/overseer Error:KeeperErrorCode = NodeExists for /solr/overseer
[junit4:junit4]   2> 611 T2106 oascc.SolrZkClient.makePath makePath: /live_nodes
[junit4:junit4]   2> 615 T2106 oasc.ZkController.createEphemeralLiveNode Register node as live in ZooKeeper:/live_nodes/127.0.0.1:49898_
[junit4:junit4]   2> 616 T2111 oazs.PrepRequestProcessor.pRequest Got user-level KeeperException when processing sessionid:0x13ca1c183c80003 type:delete cxid:0x7 zxid:0x1c txntype:-1 reqpath:n/a Error Path:/solr/live_nodes/127.0.0.1:49898_ Error:KeeperErrorCode = NoNode for /solr/live_nodes/127.0.0.1:49898_
[junit4:junit4]   2> 617 T2106 oascc.SolrZkClient.makePath makePath: /live_nodes/127.0.0.1:49898_
[junit4:junit4]   2> 623 T2106 oascc.SolrZkClient.makePath makePath: /overseer_elect/election
[junit4:junit4]   2> 631 T2111 oazs.PrepRequestProcessor.pRequest Got user-level KeeperException when processing sessionid:0x13ca1c183c80003 type:delete cxid:0x15 zxid:0x21 txntype:-1 reqpath:n/a Error Path:/solr/overseer_elect/leader Error:KeeperErrorCode = NoNode for /solr/overseer_elect/leader
[junit4:junit4]   2> 632 T2106 oascc.SolrZkClient.makePath makePath: /overseer_elect/leader
[junit4:junit4]   2> 642 T2106 oasc.Overseer.start Overseer (id=89123945152249859-127.0.0.1:49898_-n_0000000000) starting
[junit4:junit4]   2> 643 T2111 oazs.PrepRequestProcessor.pRequest Got user-level KeeperException when processing sessionid:0x13ca1c183c80003 type:create cxid:0x1a zxid:0x23 txntype:-1 reqpath:n/a Error Path:/solr/overseer Error:KeeperErrorCode = NodeExists for /solr/overseer
[junit4:junit4]   2> 645 T2111 oazs.PrepRequestProcessor.pRequest Got user-level KeeperException when processing sessionid:0x13ca1c183c80003 type:create cxid:0x1b zxid:0x24 txntype:-1 reqpath:n/a Error Path:/solr/overseer Error:KeeperErrorCode = NodeExists for /solr/overseer
[junit4:junit4]   2> 651 T2111 oazs.PrepRequestProcessor.pRequest Got user-level KeeperException when processing sessionid:0x13ca1c183c80003 type:create cxid:0x1c zxid:0x25 txntype:-1 reqpath:n/a Error Path:/solr/overseer Error:KeeperErrorCode = NodeExists for /solr/overseer
[junit4:junit4]   2> 653 T2111 oazs.PrepRequestProcessor.pRequest Got user-level KeeperException when processing sessionid:0x13ca1c183c80003 type:create cxid:0x1d zxid:0x26 txntype:-1 reqpath:n/a Error Path:/solr/overseer Error:KeeperErrorCode = NodeExists for /solr/overseer
[junit4:junit4]   2> 655 T2130 oasc.OverseerCollectionProcessor.run Process current queue of collection creations
[junit4:junit4]   2> 656 T2106 oascc.SolrZkClient.makePath makePath: /clusterstate.json
[junit4:junit4]   2> 662 T2106 oascc.ZkStateReader.createClusterStateWatchersAndUpdate Updating cluster state from ZooKeeper... 
[junit4:junit4]   2> 672 T2131 oasc.CoreContainer.create Creating SolrCore 'collection1' using instanceDir: /Users/jenkins/jenkins-slave/workspace/Lucene-Solr-trunk-MacOSX/solr/build/solr-core/test/J0/./org.apache.solr.cloud.BasicDistributedZkTest-controljetty-1359923479737/collection1
[junit4:junit4]   2> 673 T2131 oasc.ZkController.createCollectionZkNode Check for collection zkNode:control_collection
[junit4:junit4]   2> 674 T2129 oasc.Overseer$ClusterStateUpdater.run Starting to work on the main queue
[junit4:junit4]   2> 675 T2131 oasc.ZkController.createCollectionZkNode Collection zkNode exists
[junit4:junit4]   2> 675 T2131 oasc.ZkController.readConfigName Load collection config from:/collections/control_collection
[junit4:junit4]   2> 678 T2131 oasc.SolrResourceLoader.<init> new SolrResourceLoader for directory: '/Users/jenkins/jenkins-slave/workspace/Lucene-Solr-trunk-MacOSX/solr/build/solr-core/test/J0/./org.apache.solr.cloud.BasicDistributedZkTest-controljetty-1359923479737/collection1/'
[junit4:junit4]   2> 679 T2131 oasc.SolrResourceLoader.replaceClassLoader Adding 'file:/Users/jenkins/jenkins-slave/workspace/Lucene-Solr-trunk-MacOSX/solr/build/solr-core/test/J0/org.apache.solr.cloud.BasicDistributedZkTest-controljetty-1359923479737/collection1/lib/classes/' to classloader
[junit4:junit4]   2> 679 T2131 oasc.SolrResourceLoader.replaceClassLoader Adding 'file:/Users/jenkins/jenkins-slave/workspace/Lucene-Solr-trunk-MacOSX/solr/build/solr-core/test/J0/org.apache.solr.cloud.BasicDistributedZkTest-controljetty-1359923479737/collection1/lib/README' to classloader
[junit4:junit4]   2> 741 T2131 oasc.SolrConfig.<init> Using Lucene MatchVersion: LUCENE_50
[junit4:junit4]   2> 832 T2131 oasc.SolrConfig.<init> Loaded SolrConfig: solrconfig.xml
[junit4:junit4]   2> 834 T2131 oass.IndexSchema.readSchema Reading Solr Schema
[junit4:junit4]   2> 840 T2131 oass.IndexSchema.readSchema Schema name=test
[junit4:junit4]   2> 1610 T2131 oass.OpenExchangeRatesOrgProvider.init Initialized with rates=open-exchange-rates.json, refreshInterval=1440.
[junit4:junit4]   2> 1626 T2131 oass.IndexSchema.readSchema default search field in schema is text
[junit4:junit4]   2> 1630 T2131 oass.IndexSchema.readSchema unique key field: id
[junit4:junit4]   2> 1653 T2131 oass.FileExchangeRateProvider.reload Reloading exchange rates from file currency.xml
[junit4:junit4]   2> 1659 T2131 oass.FileExchangeRateProvider.reload Reloading exchange rates from file currency.xml
[junit4:junit4]   2> 1664 T2131 oass.OpenExchangeRatesOrgProvider.reload Reloading exchange rates from open-exchange-rates.json
[junit4:junit4]   2> 1666 T2131 oass.OpenExchangeRatesOrgProvider.reload Reloading exchange rates from open-exchange-rates.json
[junit4:junit4]   2> 1669 T2131 oasc.SolrCore.<init> [collection1] Opening new SolrCore at /Users/jenkins/jenkins-slave/workspace/Lucene-Solr-trunk-MacOSX/solr/build/solr-core/test/J0/./org.apache.solr.cloud.BasicDistributedZkTest-controljetty-1359923479737/collection1/, dataDir=./org.apache.solr.cloud.BasicDistributedZkTest-1359923479489/control/data/
[junit4:junit4]   2> 1669 T2131 oasc.JmxMonitoredMap.<init> JMX monitoring is enabled. Adding Solr mbeans to JMX Server: com.sun.jmx.mbeanserver.JmxMBeanServer@4e0bea2c
[junit4:junit4]   2> 1670 T2131 oasc.SolrCore.initDirectoryFactory solr.NRTCachingDirectoryFactory
[junit4:junit4]   2> 1670 T2131 oasc.CachingDirectoryFactory.get return new directory for /Users/jenkins/jenkins-slave/workspace/Lucene-Solr-trunk-MacOSX/solr/build/solr-core/test/J0/./org.apache.solr.cloud.BasicDistributedZkTest-1359923479489/control/data forceNew:false
[junit4:junit4]   2> 1671 T2131 oasc.CachingDirectoryFactory.close Releasing directory:/Users/jenkins/jenkins-slave/workspace/Lucene-Solr-trunk-MacOSX/solr/build/solr-core/test/J0/./org.apache.solr.cloud.BasicDistributedZkTest-1359923479489/control/data
[junit4:junit4]   2> 1672 T2131 oasc.SolrCore.getNewIndexDir New index directory detected: old=null new=./org.apache.solr.cloud.BasicDistributedZkTest-1359923479489/control/data/index/
[junit4:junit4]   2> 1672 T2131 oasc.SolrCore.initIndex WARNING [collection1] Solr index directory './org.apache.solr.cloud.BasicDistributedZkTest-1359923479489/control/data/index' doesn't exist. Creating new index...
[junit4:junit4]   2> 1673 T2131 oasc.CachingDirectoryFactory.get return new directory for /Users/jenkins/jenkins-slave/workspace/Lucene-Solr-trunk-MacOSX/solr/build/solr-core/test/J0/./org.apache.solr.cloud.BasicDistributedZkTest-1359923479489/control/data/index forceNew:false
[junit4:junit4]   2> 1681 T2131 oasc.SolrDeletionPolicy.onCommit SolrDeletionPolicy.onCommit: commits:num=1
[junit4:junit4]   2> 		commit{dir=RateLimitedDirectoryWrapper(NRTCachingDirectory(org.apache.lucene.store.NIOFSDirectory@/Users/jenkins/jenkins-slave/workspace/Lucene-Solr-trunk-MacOSX/solr/build/solr-core/test/J0/org.apache.solr.cloud.BasicDistributedZkTest-1359923479489/control/data/index lockFactory=org.apache.lucene.store.NativeFSLockFactory@159c976b; maxCacheMB=48.0 maxMergeSizeMB=4.0)),segFN=segments_1,generation=1,filenames=[segments_1]
[junit4:junit4]   2> 1682 T2131 oasc.SolrDeletionPolicy.updateCommits newest commit = 1[segments_1]
[junit4:junit4]   2> 1683 T2131 oasc.CachingDirectoryFactory.close Releasing directory:/Users/jenkins/jenkins-slave/workspace/Lucene-Solr-trunk-MacOSX/solr/build/solr-core/test/J0/./org.apache.solr.cloud.BasicDistributedZkTest-1359923479489/control/data/index
[junit4:junit4]   2> 1683 T2131 oasc.SolrCore.initWriters created xml: solr.XMLResponseWriter
[junit4:junit4]   2> 1686 T2131 oasup.UpdateRequestProcessorChain.init inserting DistributedUpdateProcessorFactory into updateRequestProcessorChain "dedupe"
[junit4:junit4]   2> 1688 T2131 oasup.UpdateRequestProcessorChain.init inserting DistributedUpdateProcessorFactory into updateRequestProcessorChain "dedupe-allfields"
[junit4:junit4]   2> 1692 T2131 oasup.UpdateRequestProcessorChain.init inserting DistributedUpdateProcessorFactory into updateRequestProcessorChain "stored_sig"
[junit4:junit4]   2> 1693 T2131 oasup.UpdateRequestProcessorChain.init inserting DistributedUpdateProcessorFactory into updateRequestProcessorChain "uniq-fields"
[junit4:junit4]   2> 1694 T2131 oasup.UpdateRequestProcessorChain.init inserting DistributedUpdateProcessorFactory into updateRequestProcessorChain "distrib-dup-test-chain-implicit"
[junit4:junit4]   2> 1694 T2131 oasc.RequestHandlers.initHandlersFromConfig adding lazy requestHandler: solr.ReplicationHandler
[junit4:junit4]   2> 1695 T2131 oasc.RequestHandlers.initHandlersFromConfig created /replication: solr.ReplicationHandler
[junit4:junit4]   2> 1695 T2131 oasc.RequestHandlers.initHandlersFromConfig created standard: solr.StandardRequestHandler
[junit4:junit4]   2> 1696 T2131 oasc.RequestHandlers.initHandlersFromConfig created /get: solr.RealTimeGetHandler
[junit4:junit4]   2> 1696 T2131 oasc.RequestHandlers.initHandlersFromConfig created dismax: solr.SearchHandler
[junit4:junit4]   2> 1697 T2131 oasc.RequestHandlers.initHandlersFromConfig created mock: org.apache.solr.core.MockQuerySenderListenerReqHandler
[junit4:junit4]   2> 1697 T2131 oasc.RequestHandlers.initHandlersFromConfig created /admin/: org.apache.solr.handler.admin.AdminHandlers
[junit4:junit4]   2> 1698 T2131 oasc.RequestHandlers.initHandlersFromConfig created defaults: solr.StandardRequestHandler
[junit4:junit4]   2> 1698 T2131 oasc.RequestHandlers.initHandlersFromConfig adding lazy requestHandler: solr.StandardRequestHandler
[junit4:junit4]   2> 1699 T2131 oasc.RequestHandlers.initHandlersFromConfig created lazy: solr.StandardRequestHandler
[junit4:junit4]   2> 1699 T2131 oasc.RequestHandlers.initHandlersFromConfig created /update: solr.UpdateRequestHandler
[junit4:junit4]   2> 1700 T2131 oasc.RequestHandlers.initHandlersFromConfig created /terms: org.apache.solr.handler.component.SearchHandler
[junit4:junit4]   2> 1700 T2131 oasc.RequestHandlers.initHandlersFromConfig created spellCheckCompRH: org.apache.solr.handler.component.SearchHandler
[junit4:junit4]   2> 1701 T2131 oasc.RequestHandlers.initHandlersFromConfig created spellCheckCompRH_Direct: org.apache.solr.handler.component.SearchHandler
[junit4:junit4]   2> 1701 T2131 oasc.RequestHandlers.initHandlersFromConfig created spellCheckWithWordbreak: org.apache.solr.handler.component.SearchHandler
[junit4:junit4]   2> 1702 T2131 oasc.RequestHandlers.initHandlersFromConfig created spellCheckWithWordbreak_Direct: org.apache.solr.handler.component.SearchHandler
[junit4:junit4]   2> 1702 T2131 oasc.RequestHandlers.initHandlersFromConfig created spellCheckCompRH1: org.apache.solr.handler.component.SearchHandler
[junit4:junit4]   2> 1703 T2131 oasc.RequestHandlers.initHandlersFromConfig created mltrh: org.apache.solr.handler.component.SearchHandler
[junit4:junit4]   2> 1703 T2131 oasc.RequestHandlers.initHandlersFromConfig created tvrh: org.apache.solr.handler.component.SearchHandler
[junit4:junit4]   2> 1704 T2131 oasc.RequestHandlers.initHandlersFromConfig created /mlt: solr.MoreLikeThisHandler
[junit4:junit4]   2> 1704 T2131 oasc.RequestHandlers.initHandlersFromConfig created /debug/dump: solr.DumpRequestHandler
[junit4:junit4]   2> 1713 T2131 oashl.XMLLoader.init xsltCacheLifetimeSeconds=60
[junit4:junit4]   2> 1716 T2131 oasc.SolrCore.initDeprecatedSupport WARNING solrconfig.xml uses deprecated <admin/gettableFiles>, Please update your config to use the ShowFileRequestHandler.
[junit4:junit4]   2> 1718 T2131 oasc.SolrCore.initDeprecatedSupport WARNING adding ShowFileRequestHandler with hidden files: [SCHEMA.XML, OLD_SYNONYMS.TXT, STOPWORDS.TXT, PROTWORDS.TXT, OPEN-EXCHANGE-RATES.JSON, SYNONYMS.TXT, CURRENCY.XML, MAPPING-ISOLATIN1ACCENT.TXT]
[junit4:junit4]   2> 1720 T2131 oasc.CachingDirectoryFactory.close Releasing directory:/Users/jenkins/jenkins-slave/workspace/Lucene-Solr-trunk-MacOSX/solr/build/solr-core/test/J0/./org.apache.solr.cloud.BasicDistributedZkTest-1359923479489/control/data
[junit4:junit4]   2> 1721 T2131 oass.SolrIndexSearcher.<init> Opening Searcher@11140297 main
[junit4:junit4]   2> 1722 T2131 oasu.CommitTracker.<init> Hard AutoCommit: disabled
[junit4:junit4]   2> 1723 T2131 oasu.CommitTracker.<init> Soft AutoCommit: disabled
[junit4:junit4]   2> 1723 T2131 oashc.SpellCheckComponent.inform Initializing spell checkers
[junit4:junit4]   2> 1729 T2131 oass.DirectSolrSpellChecker.init init: {name=direct,classname=DirectSolrSpellChecker,field=lowerfilt,minQueryLength=3}
[junit4:junit4]   2> 1767 T2132 oasc.SolrCore.registerSearcher [collection1] Registered new searcher Searcher@11140297 main{StandardDirectoryReader(segments_1:1)}
[junit4:junit4]   2> 1774 T2131 oasc.ZkController.publish publishing core=collection1 state=down
[junit4:junit4]   2> 1775 T2131 oasc.ZkController.publish numShards not found on descriptor - reading it from system property
[junit4:junit4]   2> 1776 T2111 oazs.PrepRequestProcessor.pRequest Got user-level KeeperException when processing sessionid:0x13ca1c183c80003 type:create cxid:0x50 zxid:0x29 txntype:-1 reqpath:n/a Error Path:/solr/overseer/queue Error:KeeperErrorCode = NoNode for /solr/overseer/queue
[junit4:junit4]   2> 2183 T2129 oascc.ZkStateReader.updateClusterState Updating cloud state from ZooKeeper... 
[junit4:junit4]   2> 2184 T2129 oasc.Overseer$ClusterStateUpdater.updateState Update state numShards=1 message={
[junit4:junit4]   2> 	  "operation":"state",
[junit4:junit4]   2> 	  "numShards":"1",
[junit4:junit4]   2> 	  "shard":null,
[junit4:junit4]   2> 	  "roles":null,
[junit4:junit4]   2> 	  "state":"down",
[junit4:junit4]   2> 	  "core":"collection1",
[junit4:junit4]   2> 	  "collection":"control_collection",
[junit4:junit4]   2> 	  "node_name":"127.0.0.1:49898_",
[junit4:junit4]   2> 	  "base_url":"http://127.0.0.1:49898"}
[junit4:junit4]   2> 2185 T2129 oasc.Overseer$ClusterStateUpdater.createCollection Create collection control_collection with numShards 1
[junit4:junit4]   2> 2185 T2129 oasc.Overseer$ClusterStateUpdater.updateState Assigning new node to shard shard=shard1
[junit4:junit4]   2> 2186 T2111 oazs.PrepRequestProcessor.pRequest Got user-level KeeperException when processing sessionid:0x13ca1c183c80003 type:create cxid:0x58 zxid:0x2c txntype:-1 reqpath:n/a Error Path:/solr/overseer/queue-work Error:KeeperErrorCode = NoNode for /solr/overseer/queue-work
[junit4:junit4]   2> 2196 T2128 oascc.ZkStateReader$2.process A cluster state change: WatchedEvent state:SyncConnected type:NodeDataChanged path:/clusterstate.json, has occurred - updating... (live nodes size: 1)
[junit4:junit4]   2> 2781 T2131 oasc.CoreContainer.registerCore registering core: collection1
[junit4:junit4]   2> 2781 T2131 oasc.ZkController.register Register replica - core:collection1 address:http://127.0.0.1:49898 collection:control_collection shard:shard1
[junit4:junit4]   2> 2783 T2131 oascc.SolrZkClient.makePath makePath: /collections/control_collection/leader_elect/shard1/election
[junit4:junit4]   2> 2795 T2111 oazs.PrepRequestProcessor.pRequest Got user-level KeeperException when processing sessionid:0x13ca1c183c80003 type:delete cxid:0x72 zxid:0x36 txntype:-1 reqpath:n/a Error Path:/solr/collections/control_collection/leaders Error:KeeperErrorCode = NoNode for /solr/collections/control_collection/leaders
[junit4:junit4]   2> 2796 T2131 oasc.ShardLeaderElectionContext.runLeaderProcess Running the leader process.
[junit4:junit4]   2> 2797 T2111 oazs.PrepRequestProcessor.pRequest Got user-level KeeperException when processing sessionid:0x13ca1c183c80003 type:create cxid:0x73 zxid:0x37 txntype:-1 reqpath:n/a Error Path:/solr/overseer Error:KeeperErrorCode = NodeExists for /solr/overseer
[junit4:junit4]   2> 2800 T2131 oasc.ShardLeaderElectionContext.waitForReplicasToComeUp Enough replicas found to continue.
[junit4:junit4]   2> 2800 T2131 oasc.ShardLeaderElectionContext.runLeaderProcess I may be the new leader - try and sync
[junit4:junit4]   2> 2800 T2131 oasc.SyncStrategy.sync Sync replicas to http://127.0.0.1:49898/collection1/
[junit4:junit4]   2> 2800 T2131 oasc.SyncStrategy.syncReplicas Sync Success - now sync replicas to me
[junit4:junit4]   2> 2801 T2131 oasc.SyncStrategy.syncToMe http://127.0.0.1:49898/collection1/ has no replicas
[junit4:junit4]   2> 2801 T2131 oasc.ShardLeaderElectionContext.runLeaderProcess I am the new leader: http://127.0.0.1:49898/collection1/
[junit4:junit4]   2> 2801 T2131 oascc.SolrZkClient.makePath makePath: /collections/control_collection/leaders/shard1
[junit4:junit4]   2> 2806 T2111 oazs.PrepRequestProcessor.pRequest Got user-level KeeperException when processing sessionid:0x13ca1c183c80003 type:create cxid:0x7d zxid:0x3b txntype:-1 reqpath:n/a Error Path:/solr/overseer Error:KeeperErrorCode = NodeExists for /solr/overseer
[junit4:junit4]   2> 3708 T2129 oascc.ZkStateReader.updateClusterState Updating cloud state from ZooKeeper... 
[junit4:junit4]   2> 3720 T2128 oascc.ZkStateReader$2.process A cluster state change: WatchedEvent state:SyncConnected type:NodeDataChanged path:/clusterstate.json, has occurred - updating... (live nodes size: 1)
[junit4:junit4]   2> 3737 T2131 oasc.ZkController.register We are http://127.0.0.1:49898/collection1/ and leader is http://127.0.0.1:49898/collection1/
[junit4:junit4]   2> 3737 T2131 oasc.ZkController.register No LogReplay needed for core=collection1 baseURL=http://127.0.0.1:49898
[junit4:junit4]   2> 3737 T2131 oasc.ZkController.checkRecovery I am the leader, no recovery necessary
[junit4:junit4]   2> 3737 T2131 oasc.ZkController.publish publishing core=collection1 state=active
[junit4:junit4]   2> 3738 T2131 oasc.ZkController.publish numShards not found on descriptor - reading it from system property
[junit4:junit4]   2> 3740 T2131 oascc.ZkStateReader.updateClusterState Updating cloud state from ZooKeeper... 
[junit4:junit4]   2> 3741 T2106 oass.SolrDispatchFilter.init user.dir=/Users/jenkins/jenkins-slave/workspace/Lucene-Solr-trunk-MacOSX/solr/build/solr-core/test/J0
[junit4:junit4]   2> 3742 T2106 oass.SolrDispatchFilter.init SolrDispatchFilter.init() done
[junit4:junit4]   2> 3743 T2106 oascsi.HttpClientUtil.createClient Creating new http client, config:maxConnections=128&maxConnectionsPerHost=32&followRedirects=false
[junit4:junit4]   2> 3754 T2106 oascsi.HttpClientUtil.createClient Creating new http client, config:
[junit4:junit4]   2> 3760 T2106 oaz.ZooKeeper.<init> Initiating client connection, connectString=127.0.0.1:49895/solr sessionTimeout=10000 watcher=org.apache.solr.common.cloud.ConnectionManager@7bc1180e
[junit4:junit4]   2> 3762 T2106 oascc.ConnectionManager.waitForConnected Waiting for client to connect to ZooKeeper
[junit4:junit4]   2> 3762 T2133 oaz.ClientCnxn$SendThread.logStartConnect Opening socket connection to server localhost/127.0.0.1:49895. Will not attempt to authenticate using SASL (access denied ("javax.security.auth.AuthPermission" "getLoginConfiguration"))
[junit4:junit4]   2> 3765 T2133 oaz.ClientCnxn$SendThread.primeConnection Socket connection established to localhost/127.0.0.1:49895, initiating session
[junit4:junit4]   2> 3765 T2108 oazs.NIOServerCnxnFactory.run Accepted socket connection from /127.0.0.1:49901
[junit4:junit4]   2> 3766 T2108 oazs.ZooKeeperServer.processConnectRequest Client attempting to establish new session at /127.0.0.1:49901
[junit4:junit4]   2> 3767 T2110 oazs.ZooKeeperServer.finishSessionInit Established session 0x13ca1c183c80004 with negotiated timeout 10000 for client /127.0.0.1:49901
[junit4:junit4]   2> 3767 T2133 oaz.ClientCnxn$SendThread.onConnected Session establishment complete on server localhost/127.0.0.1:49895, sessionid = 0x13ca1c183c80004, negotiated timeout = 10000
[junit4:junit4]   2> 3768 T2134 oascc.ConnectionManager.process Watcher org.apache.solr.common.cloud.ConnectionManager@7bc1180e name:ZooKeeperConnection Watcher:127.0.0.1:49895/solr got event WatchedEvent state:SyncConnected type:None path:null path:null type:None
[junit4:junit4]   2> 3768 T2106 oascc.ConnectionManager.waitForConnected Client is connected to ZooKeeper
[junit4:junit4]   2> 3770 T2106 oascc.ZkStateReader.createClusterStateWatchersAndUpdate Updating cluster state from ZooKeeper... 
[junit4:junit4]   2> 3773 T2106 oasc.ChaosMonkey.monkeyLog monkey: init - expire sessions:true cause connection loss:true
[junit4:junit4]   2> 3978 T2106 oejs.Server.doStart jetty-8.1.8.v20121106
[junit4:junit4]   2> 3981 T2106 oejs.AbstractConnector.doStart Started SelectChannelConnector@127.0.0.1:49902
[junit4:junit4]   2> 3982 T2106 oass.SolrDispatchFilter.init SolrDispatchFilter.init()
[junit4:junit4]   2> 3983 T2106 oasc.SolrResourceLoader.locateSolrHome JNDI not configured for solr (NoInitialContextEx)
[junit4:junit4]   2> 3984 T2106 oasc.SolrResourceLoader.locateSolrHome using system property solr.solr.home: /Users/jenkins/jenkins-slave/workspace/Lucene-Solr-trunk-MacOSX/solr/build/solr-core/test/J0/./org.apache.solr.cloud.BasicDistributedZkTest-jetty1-1359923483248
[junit4:junit4]   2> 3984 T2106 oasc.CoreContainer$Initializer.initialize looking for solr.xml: /Users/jenkins/jenkins-slave/workspace/Lucene-Solr-trunk-MacOSX/solr/build/solr-core/test/J0/./org.apache.solr.cloud.BasicDistributedZkTest-jetty1-1359923483248/solr.xml
[junit4:junit4]   2> 3985 T2106 oasc.CoreContainer.<init> New CoreContainer 199331823
[junit4:junit4]   2> 3986 T2106 oasc.CoreContainer.load Loading CoreContainer using Solr Home: '/Users/jenkins/jenkins-slave/workspace/Lucene-Solr-trunk-MacOSX/solr/build/solr-core/test/J0/./org.apache.solr.cloud.BasicDistributedZkTest-jetty1-1359923483248/'
[junit4:junit4]   2> 3986 T2106 oasc.SolrResourceLoader.<init> new SolrResourceLoader for directory: '/Users/jenkins/jenkins-slave/workspace/Lucene-Solr-trunk-MacOSX/solr/build/solr-core/test/J0/./org.apache.solr.cloud.BasicDistributedZkTest-jetty1-1359923483248/'
[junit4:junit4]   2> 4027 T2106 oashc.HttpShardHandlerFactory.getParameter Setting socketTimeout to: 60000
[junit4:junit4]   2> 4027 T2106 oashc.HttpShardHandlerFactory.getParameter Setting urlScheme to: http://
[junit4:junit4]   2> 4028 T2106 oashc.HttpShardHandlerFactory.getParameter Setting connTimeout to: 15000
[junit4:junit4]   2> 4029 T2106 oashc.HttpShardHandlerFactory.getParameter Setting maxConnectionsPerHost to: 20
[junit4:junit4]   2> 4029 T2106 oashc.HttpShardHandlerFactory.getParameter Setting corePoolSize to: 0
[junit4:junit4]   2> 4030 T2106 oashc.HttpShardHandlerFactory.getParameter Setting maximumPoolSize to: 2147483647
[junit4:junit4]   2> 4030 T2106 oashc.HttpShardHandlerFactory.getParameter Setting maxThreadIdleTime to: 5
[junit4:junit4]   2> 4031 T2106 oashc.HttpShardHandlerFactory.getParameter Setting sizeOfQueue to: -1
[junit4:junit4]   2> 4031 T2106 oashc.HttpShardHandlerFactory.getParameter Setting fairnessPolicy to: false
[junit4:junit4]   2> 4032 T2106 oascsi.HttpClientUtil.createClient Creating new http client, config:maxConnectionsPerHost=20&maxConnections=10000&socketTimeout=60000&connTimeout=15000&retry=false
[junit4:junit4]   2> 4046 T2106 oasc.CoreContainer.load Registering Log Listener
[junit4:junit4]   2> 4067 T2106 oasc.CoreContainer.initZooKeeper Zookeeper client=127.0.0.1:49895/solr
[junit4:junit4]   2> 4067 T2106 oasc.ZkController.checkChrootPath zkHost includes chroot
[junit4:junit4]   2> 4068 T2106 oaz.ZooKeeper.<init> Initiating client connection, connectString=127.0.0.1:49895 sessionTimeout=60000 watcher=org.apache.solr.common.cloud.ConnectionManager@3ee1a7fc
[junit4:junit4]   2> 4070 T2144 oaz.ClientCnxn$SendThread.logStartConnect Opening socket connection to server localhost/127.0.0.1:49895. Will not attempt to authenticate using SASL (access denied ("javax.security.auth.AuthPermission" "getLoginConfiguration"))
[junit4:junit4]   2> 4072 T2144 oaz.ClientCnxn$SendThread.primeConnection Socket connection established to localhost/127.0.0.1:49895, initiating session
[junit4:junit4]   2> 4072 T2108 oazs.NIOServerCnxnFactory.run Accepted socket connection from /127.0.0.1:49903
[junit4:junit4]   2> 4074 T2108 oazs.ZooKeeperServer.processConnectRequest Client attempting to establish new session at /127.0.0.1:49903
[junit4:junit4]   2> 4070 T2106 oascc.ConnectionManager.waitForConnected Waiting for client to connect to ZooKeeper
[junit4:junit4]   2> 4075 T2110 oazs.ZooKeeperServer.finishSessionInit Established session 0x13ca1c183c80005 with negotiated timeout 20000 for client /127.0.0.1:49903
[junit4:junit4]   2> 4076 T2144 oaz.ClientCnxn$SendThread.onConnected Session establishment complete on server localhost/127.0.0.1:49895, sessionid = 0x13ca1c183c80005, negotiated timeout = 20000
[junit4:junit4]   2> 4076 T2145 oascc.ConnectionManager.process Watcher org.apache.solr.common.cloud.ConnectionManager@3ee1a7fc name:ZooKeeperConnection Watcher:127.0.0.1:49895 got event WatchedEvent state:SyncConnected type:None path:null path:null type:None
[junit4:junit4]   2> 4076 T2106 oascc.ConnectionManager.waitForConnected Client is connected to ZooKeeper
[junit4:junit4]   2> 4078 T2111 oazs.PrepRequestProcessor.pRequest2Txn Processed session termination for sessionid: 0x13ca1c183c80005
[junit4:junit4]   2> 4079 T2106 oaz.ZooKeeper.close Session: 0x13ca1c183c80005 closed
[junit4:junit4]   2> 4079 T2106 oascsi.HttpClientUtil.createClient Creating new http client, config:maxConnections=500&maxConnectionsPerHost=16&socketTimeout=60000&connTimeout=15000
[junit4:junit4]   2> 4085 T2108 oazs.NIOServerCnxn.closeSock Closed socket connection for client /127.0.0.1:49903 which had sessionid 0x13ca1c183c80005
[junit4:junit4]   2> 4085 T2145 oaz.ClientCnxn$EventThread.run EventThread shut down
[junit4:junit4]   2> 4086 T2106 oaz.ZooKeeper.<init> Initiating client connection, connectString=127.0.0.1:49895/solr sessionTimeout=30000 watcher=org.apache.solr.common.cloud.ConnectionManager@56e5c099
[junit4:junit4]   2> 4093 T2146 oaz.ClientCnxn$SendThread.logStartConnect Opening socket connection to server localhost/127.0.0.1:49895. Will not attempt to authenticate using SASL (access denied ("javax.security.auth.AuthPermission" "getLoginConfiguration"))
[junit4:junit4]   2> 4094 T2146 oaz.ClientCnxn$SendThread.primeConnection Socket connection established to localhost/127.0.0.1:49895, initiating session
[junit4:junit4]   2> 4094 T2106 oascc.ConnectionManager.waitForConnected Waiting for client to connect to ZooKeeper
[junit4:junit4]   2> 4095 T2108 oazs.NIOServerCnxnFactory.run Accepted socket connection from /127.0.0.1:49904
[junit4:junit4]   2> 4096 T2108 oazs.ZooKeeperServer.processConnectRequest Client attempting to establish new session at /127.0.0.1:49904
[junit4:junit4]   2> 4097 T2110 oazs.ZooKeeperServer.finishSessionInit Established session 0x13ca1c183c80006 with negotiated timeout 20000 for client /127.0.0.1:49904
[junit4:junit4]   2> 4098 T2146 oaz.ClientCnxn$SendThread.onConnected Session establishment complete on server localhost/127.0.0.1:49895, sessionid = 0x13ca1c183c80006, negotiated timeout = 20000
[junit4:junit4]   2> 4098 T2147 oascc.ConnectionManager.process Watcher org.apache.solr.common.cloud.ConnectionManager@56e5c099 name:ZooKeeperConnection Watcher:127.0.0.1:49895/solr got event WatchedEvent state:SyncConnected type:None path:null path:null type:None
[junit4:junit4]   2> 4098 T2106 oascc.ConnectionManager.waitForConnected Client is connected to ZooKeeper
[junit4:junit4]   2> 4102 T2111 oazs.PrepRequestProcessor.pRequest Got user-level KeeperException when processing sessionid:0x13ca1c183c80006 type:create cxid:0x1 zxid:0x49 txntype:-1 reqpath:n/a Error Path:/solr/overseer Error:KeeperErrorCode = NodeExists for /solr/overseer
[junit4:junit4]   2> 4103 T2111 oazs.PrepRequestProcessor.pRequest Got user-level KeeperException when processing sessionid:0x13ca1c183c80006 type:create cxid:0x2 zxid:0x4a txntype:-1 reqpath:n/a Error Path:/solr/overseer Error:KeeperErrorCode = NodeExists for /solr/overseer
[junit4:junit4]   2> 4105 T2106 oasc.ZkController.createEphemeralLiveNode Register node as live in ZooKeeper:/live_nodes/127.0.0.1:49902_
[junit4:junit4]   2> 4107 T2111 oazs.PrepRequestProcessor.pRequest Got user-level KeeperException when processing sessionid:0x13ca1c183c80006 type:delete cxid:0x4 zxid:0x4b txntype:-1 reqpath:n/a Error Path:/solr/live_nodes/127.0.0.1:49902_ Error:KeeperErrorCode = NoNode for /solr/live_nodes/127.0.0.1:49902_
[junit4:junit4]   2> 4108 T2106 oascc.SolrZkClient.makePath makePath: /live_nodes/127.0.0.1:49902_
[junit4:junit4]   2> 4112 T2128 oascc.ZkStateReader$3.process Updating live nodes... (2)
[junit4:junit4]   2> 4113 T2134 oascc.ZkStateReader$3.process Updating live nodes... (2)
[junit4:junit4]   2> 4113 T2128 oascc.ZkStateReader$2.process A cluster state change: WatchedEvent state:SyncConnected type:NodeChildrenChanged path:/live_nodes, has occurred - updating... (live nodes size: 2)
[junit4:junit4]   2> 4119 T2106 oascc.ZkStateReader.createClusterStateWatchersAndUpdate Updating cluster state from ZooKeeper... 
[junit4:junit4]   2> 4127 T2148 oasc.CoreContainer.create Creating SolrCore 'collection1' using instanceDir: /Users/jenkins/jenkins-slave/workspace/Lucene-Solr-trunk-MacOSX/solr/build/solr-core/test/J0/./org.apache.solr.cloud.BasicDistributedZkTest-jetty1-1359923483248/collection1
[junit4:junit4]   2> 4128 T2148 oasc.ZkController.createCollectionZkNode Check for collection zkNode:collection1
[junit4:junit4]   2> 4129 T2148 oasc.ZkController.createCollectionZkNode Collection zkNode exists
[junit4:junit4]   2> 4129 T2148 oasc.ZkController.readConfigName Load collection config from:/collections/collection1
[junit4:junit4]   2> 4131 T2148 oasc.SolrResourceLoader.<init> new SolrResourceLoader for directory: '/Users/jenkins/jenkins-slave/workspace/Lucene-Solr-trunk-MacOSX/solr/build/solr-core/test/J0/./org.apache.solr.cloud.BasicDistributedZkTest-jetty1-1359923483248/collection1/'
[junit4:junit4]   2> 4132 T2148 oasc.SolrResourceLoader.replaceClassLoader Adding 'file:/Users/jenkins/jenkins-slave/workspace/Lucene-Solr-trunk-MacOSX/solr/build/solr-core/test/J0/org.apache.solr.cloud.BasicDistributedZkTest-jetty1-1359923483248/collection1/lib/classes/' to classloader
[junit4:junit4]   2> 4133 T2148 oasc.SolrResourceLoader.replaceClassLoader Adding 'file:/Users/jenkins/jenkins-slave/workspace/Lucene-Solr-trunk-MacOSX/solr/build/solr-core/test/J0/org.apache.solr.cloud.BasicDistributedZkTest-jetty1-1359923483248/collection1/lib/README' to classloader
[junit4:junit4]   2> 4187 T2148 oasc.SolrConfig.<init> Using Lucene MatchVersion: LUCENE_50
[junit4:junit4]   2> 4261 T2148 oasc.SolrConfig.<init> Loaded SolrConfig: solrconfig.xml
[junit4:junit4]   2> 4263 T2148 oass.IndexSchema.readSchema Reading Solr Schema
[junit4:junit4]   2> 4268 T2148 oass.IndexSchema.readSchema Schema name=test
[junit4:junit4]   2> 5123 T2148 oass.OpenExchangeRatesOrgProvider.init Initialized with rates=open-exchange-rates.json, refreshInterval=1440.
[junit4:junit4]   2> 5133 T2148 oass.IndexSchema.readSchema default search field in schema is text
[junit4:junit4]   2> 5137 T2148 oass.IndexSchema.readSchema unique key field: id
[junit4:junit4]   2> 5175 T2148 oass.FileExchangeRateProvider.reload Reloading exchange rates from file currency.xml
[junit4:junit4]   2> 5181 T2148 oass.FileExchangeRateProvider.reload Reloading exchange rates from file currency.xml
[junit4:junit4]   2> 5207 T2148 oass.OpenExchangeRatesOrgProvider.reload Reloading exchange rates from open-exchange-rates.json
[junit4:junit4]   2> 5209 T2148 oass.OpenExchangeRatesOrgProvider.reload Reloading exchange rates from open-exchange-rates.json
[junit4:junit4]   2> 5211 T2148 oasc.SolrCore.<init> [collection1] Opening new SolrCore at /Users/jenkins/jenkins-slave/workspace/Lucene-Solr-trunk-MacOSX/solr/build/solr-core/test/J0/./org.apache.solr.cloud.BasicDistributedZkTest-jetty1-1359923483248/collection1/, dataDir=./org.apache.solr.cloud.BasicDistributedZkTest-1359923479489/jetty1/
[junit4:junit4]   2> 5212 T2148 oasc.JmxMonitoredMap.<init> JMX monitoring is enabled. Adding Solr mbeans to JMX Server: com.sun.jmx.mbeanserver.JmxMBeanServer@4e0bea2c
[junit4:junit4]   2> 5212 T2148 oasc.SolrCore.initDirectoryFactory solr.NRTCachingDirectoryFactory
[junit4:junit4]   2> 5213 T2148 oasc.CachingDirectoryFactory.get return new directory for /Users/jenkins/jenkins-slave/workspace/Lucene-Solr-trunk-MacOSX/solr/build/solr-core/test/J0/./org.apache.solr.cloud.BasicDistributedZkTest-1359923479489/jetty1 forceNew:false
[junit4:junit4]   2> 5214 T2148 oasc.CachingDirectoryFactory.close Releasing directory:/Users/jenkins/jenkins-slave/workspace/Lucene-Solr-trunk-MacOSX/solr/build/solr-core/test/J0/./org.apache.solr.cloud.BasicDistributedZkTest-1359923479489/jetty1
[junit4:junit4]   2> 5214 T2148 oasc.SolrCore.getNewIndexDir New index directory detected: old=null new=./org.apache.solr.cloud.BasicDistributedZkTest-1359923479489/jetty1/index/
[junit4:junit4]   2> 5215 T2148 oasc.SolrCore.initIndex WARNING [collection1] Solr index directory './org.apache.solr.cloud.BasicDistributedZkTest-1359923479489/jetty1/index' doesn't exist. Creating new index...
[junit4:junit4]   2> 5215 T2148 oasc.CachingDirectoryFactory.get return new directory for /Users/jenkins/jenkins-slave/workspace/Lucene-Solr-trunk-MacOSX/solr/build/solr-core/test/J0/./org.apache.solr.cloud.BasicDistributedZkTest-1359923479489/jetty1/index forceNew:false
[junit4:junit4]   2> 5220 T2148 oasc.SolrDeletionPolicy.onCommit SolrDeletionPolicy.onCommit: commits:num=1
[junit4:junit4]   2> 		commit{dir=RateLimitedDirectoryWrapper(NRTCachingDirectory(org.apache.lucene.store.NIOFSDirectory@/Users/jenkins/jenkins-slave/workspace/Lucene-Solr-trunk-MacOSX/solr/build/solr-core/test/J0/org.apache.solr.cloud.BasicDistributedZkTest-1359923479489/jetty1/index lockFactory=org.apache.lucene.store.NativeFSLockFactory@63673ffb; maxCacheMB=48.0 maxMergeSizeMB=4.0)),segFN=segments_1,generation=1,filenames=[segments_1]
[junit4:junit4]   2> 5221 T2148 oasc.SolrDeletionPolicy.updateCommits newest commit = 1[segments_1]
[junit4:junit4]   2> 5222 T2148 oasc.CachingDirectoryFactory.close Releasing directory:/Users/jenkins/jenkins-slave/workspace/Lucene-Solr-trunk-MacOSX/solr/build/solr-core/test/J0/./org.apache.solr.cloud.BasicDistributedZkTest-1359923479489/jetty1/index
[junit4:junit4]   2> 5222 T2148 oasc.SolrCore.initWriters created xml: solr.XMLResponseWriter
[junit4:junit4]   2> 5224 T2148 oasup.UpdateRequestProcessorChain.init inserting DistributedUpdateProcessorFactory into updateRequestProcessorChain "dedupe"
[junit4:junit4]   2> 5225 T2148 oasup.UpdateRequestProcessorChain.init inserting DistributedUpdateProcessorFactory into updateRequestProcessorChain "dedupe-allfields"
[junit4:junit4]   2> 5225 T2148 oasup.UpdateRequestProcessorChain.init inserting DistributedUpdateProcessorFactory into updateRequestProcessorChain "stored_sig"
[junit4:junit4]   2> 5226 T2148 oasup.UpdateRequestProcessorChain.init inserting DistributedUpdateProcessorFactory into updateRequestProcessorChain "uniq-fields"
[junit4:junit4]   2> 5233 T2148 oasup.UpdateRequestProcessorChain.init inserting DistributedUpdateProcessorFactory into updateRequestProcessorChain "distrib-dup-test-chain-implicit"
[junit4:junit4]   2> 5234 T2148 oasc.RequestHandlers.initHandlersFromConfig adding lazy requestHandler: solr.ReplicationHandler
[junit4:junit4]   2> 5235 T2148 oasc.RequestHandlers.initHandlersFromConfig created /replication: solr.ReplicationHandler
[junit4:junit4]   2> 5236 T2148 oasc.RequestHandlers.initHandlersFromConfig created standard: solr.StandardRequestHandler
[junit4:junit4]   2> 5236 T2129 oascc.ZkStateReader.updateClusterState Updating cloud state from ZooKeeper... 
[junit4:junit4]   2> 5237 T2148 oasc.RequestHandlers.initHandlersFromConfig created /get: solr.RealTimeGetHandler
[junit4:junit4]   2> 5239 T2129 oasc.Overseer$ClusterStateUpdater.updateState Update state numShards=1 message={
[junit4:junit4]   2> 	  "operation":"state",
[junit4:junit4]   2> 	  "numShards":"1",
[junit4:junit4]   2> 	  "shard":"shard1",
[junit4:junit4]   2> 	  "roles":null,
[junit4:junit4]   2> 	  "state":"active",
[junit4:junit4]   2> 	  "core":"collection1",
[junit4:junit4]   2> 	  "collection":"control_collection",
[junit4:junit4]   2> 	  "node_name":"127.0.0.1:49898_",
[junit4:junit4]   2> 	  "base_url":"http://127.0.0.1:49898"}
[junit4:junit4]   2> 5239 T2148 oasc.RequestHandlers.initHandlersFromConfig created dismax: solr.SearchHandler
[junit4:junit4]   2> 5240 T2148 oasc.RequestHandlers.initHandlersFromConfig created mock: org.apache.solr.core.MockQuerySenderListenerReqHandler
[junit4:junit4]   2> 5241 T2148 oasc.RequestHandlers.initHandlersFromConfig created /admin/: org.apache.solr.handler.admin.AdminHandlers
[junit4:junit4]   2> 5241 T2148 oasc.RequestHandlers.initHandlersFromConfig created defaults: solr.StandardRequestHandler
[junit4:junit4]   2> 5242 T2148 oasc.RequestHandlers.initHandlersFromConfig adding lazy requestHandler: solr.StandardRequestHandler
[junit4:junit4]   2> 5242 T2148 oasc.RequestHandlers.initHandlersFromConfig created lazy: solr.StandardRequestHandler
[junit4:junit4]   2> 5243 T2148 oasc.RequestHandlers.initHandlersFromConfig created /update: solr.UpdateRequestHandler
[junit4:junit4]   2> 5244 T2148 oasc.RequestHandlers.initHandlersFromConfig created /terms: org.apache.solr.handler.component.SearchHandler
[junit4:junit4]   2> 5244 T2148 oasc.RequestHandlers.initHandlersFromConfig created spellCheckCompRH: org.apache.solr.handler.component.SearchHandler
[junit4:junit4]   2> 5245 T2148 oasc.RequestHandlers.initHandlersFromConfig created spellCheckCompRH_Direct: org.apache.solr.handler.component.SearchHandler
[junit4:junit4]   2> 5246 T2128 oascc.ZkStateReader$2.process A cluster state change: WatchedEvent state:SyncConnected type:NodeDataChanged path:/clusterstate.json, has occurred - updating... (live nodes size: 2)
[junit4:junit4]   2> 5246 T2134 oascc.ZkStateReader$2.process A cluster state change: WatchedEvent state:SyncConnected type:NodeDataChanged path:/clusterstate.json, has occurred - updating... (live nodes size: 2)
[junit4:junit4]   2> 5246 T2147 oascc.ZkStateReader$2.process A cluster state change: WatchedEvent state:SyncConnected type:NodeDataChanged path:/clusterstate.json, has occurred - updating... (live nodes size: 2)
[junit4:junit4]   2> 5246 T2148 oasc.RequestHandlers.initHandlersFromConfig created spellCheckWithWordbreak: org.apache.solr.handler.component.SearchHandler
[junit4:junit4]   2> 5249 T2148 oasc.RequestHandlers.initHandlersFromConfig created spellCheckWithWordbreak_Direct: org.apache.solr.handler.component.SearchHandler
[junit4:junit4]   2> 5249 T2148 oasc.RequestHandlers.initHandlersFromConfig created spellCheckCompRH1: org.apache.solr.handler.component.SearchHandler
[junit4:junit4]   2> 5250 T2148 oasc.RequestHandlers.initHandlersFromConfig created mltrh: org.apache.solr.handler.component.SearchHandler
[junit4:junit4]   2> 5250 T2148 oasc.RequestHandlers.initHandlersFromConfig created tvrh: org.apache.solr.handler.component.SearchHandler
[junit4:junit4]   2> 5251 T2148 oasc.RequestHandlers.initHandlersFromConfig created /mlt: solr.MoreLikeThisHandler
[junit4:junit4]   2> 5252 T2148 oasc.RequestHandlers.initHandlersFromConfig created /debug/dump: solr.DumpRequestHandler
[junit4:junit4]   2> 5262 T2148 oashl.XMLLoader.init xsltCacheLifetimeSeconds=60
[junit4:junit4]   2> 5265 T2148 oasc.SolrCore.initDeprecatedSupport WARNING solrconfig.xml uses deprecated <admin/gettableFiles>, Please update your config to use the ShowFileRequestHandler.
[junit4:junit4]   2> 5270 T2148 oasc.SolrCore.initDeprecatedSupport WARNING adding ShowFileRequestHandler with hidden files: [SCHEMA.XML, OLD_SYNONYMS.TXT, STOPWORDS.TXT, PROTWORDS.TXT, OPEN-EXCHANGE-RATES.JSON, SYNONYMS.TXT, CURRENCY.XML, MAPPING-ISOLATIN1ACCENT.TXT]
[junit4:junit4]   2> 5272 T2148 oasc.CachingDirectoryFactory.close Releasing directory:/Users/jenkins/jenkins-slave/workspace/Lucene-Solr-trunk-MacOSX/solr/build/solr-core/test/J0/./org.apache.solr.cloud.BasicDistributedZkTest-1359923479489/jetty1
[junit4:junit4]   2> 5274 T2148 oass.SolrIndexSearcher.<init> Opening Searcher@f030e2c main
[junit4:junit4]   2> 5275 T2148 oasu.CommitTracker.<init> Hard AutoCommit: disabled
[junit4:junit4]   2> 5275 T2148 oasu.CommitTracker.<init> Soft AutoCommit: disabled
[junit4:junit4]   2> 5276 T2148 oashc.SpellCheckComponent.inform Initializing spell checkers
[junit4:junit4]   2> 5281 T2148 oass.DirectSolrSpellChecker.init init: {name=direct,classname=DirectSolrSpellChecker,field=lowerfilt,minQueryLength=3}
[junit4:junit4]   2> 5321 T2149 oasc.SolrCore.registerSearcher [collection1] Registered new searcher Searcher@f030e2c main{StandardDirectoryReader(segments_1:1)}
[junit4:junit4]   2> 5330 T2148 oasc.ZkController.publish publishing core=collection1 state=down
[junit4:junit4]   2> 5330 T2148 oasc.ZkController.publish numShards not found on descriptor - reading it from system property
[junit4:junit4]   2> 6770 T2129 oascc.ZkStateReader.updateClusterState Updating cloud state from ZooKeeper... 
[junit4:junit4]   2> 6771 T2129 oasc.Overseer$ClusterStateUpdater.updateState Update state numShards=2 message={
[junit4:junit4]   2> 	  "operation":"state",
[junit4:junit4]   2> 	  "numShards":"2",
[junit4:junit4]   2> 	  "shard":null,
[junit4:junit4]   2> 	  "roles":null,
[junit4:junit4]   2> 	  "state":"down",
[junit4:junit4]   2> 	  "core":"collection1",
[junit4:junit4]   2> 	  "collection":"collection1",
[junit4:junit4]   2> 	  "node_name":"127.0.0.1:49902_",
[junit4:junit4]   2> 	  "base_url":"http://127.0.0.1:49902"}
[junit4:junit4]   2> 6772 T2129 oasc.Overseer$ClusterStateUpdater.createCollection Create collection collection1 with numShards 2
[junit4:junit4]   2> 6772 T2129 oasc.Overseer$ClusterStateUpdater.updateState Assigning new node to shard shard=shard1
[junit4:junit4]   2> 6780 T2128 oascc.ZkStateReader$2.process A cluster state change: WatchedEvent state:SyncConnected type:NodeDataChanged path:/clusterstate.json, has occurred - updating... (live nodes size: 2)
[junit4:junit4]   2> 6786 T2134 oascc.ZkStateReader$2.process A cluster state change: WatchedEvent state:SyncConnected type:NodeDataChanged path:/clusterstate.json, has occurred - updating... (live nodes size: 2)
[junit4:junit4]   2> 6788 T2147 oascc.ZkStateReader$2.process A cluster state change: WatchedEvent state:SyncConnected type:NodeDataChanged path:/clusterstate.json, has occurred - updating... (live nodes size: 2)
[junit4:junit4]   2> 7336 T2148 oasc.CoreContainer.registerCore registering core: collection1
[junit4:junit4]   2> 7337 T2148 oasc.ZkController.register Register replica - core:collection1 address:http://127.0.0.1:49902 collection:collection1 shard:shard1
[junit4:junit4]   2> 7338 T2148 oascc.SolrZkClient.makePath makePath: /collections/collection1/leader_elect/shard1/election
[junit4:junit4]   2> 7348 T2111 oazs.PrepRequestProcessor.pRequest Got user-level KeeperException when processing sessionid:0x13ca1c183c80006 type:delete cxid:0x45 zxid:0x5b txntype:-1 reqpath:n/a Error Path:/solr/collections/collection1/leaders Error:KeeperErrorCode = NoNode for /solr/collections/collection1/leaders
[junit4:junit4]   2> 7349 T2148 oasc.ShardLeaderElectionContext.runLeaderProcess Running the leader process.
[junit4:junit4]   2> 7350 T2111 oazs.PrepRequestProcessor.pRequest Got user-level KeeperException when processing sessionid:0x13ca1c183c80006 type:create cxid:0x46 zxid:0x5c txntype:-1 reqpath:n/a Error Path:/solr/overseer Error:KeeperErrorCode = NodeExists for /solr/overseer
[junit4:junit4]   2> 7358 T2148 oasc.ShardLeaderElectionContext.waitForReplicasToComeUp Enough replicas found to continue.
[junit4:junit4]   2> 7358 T2148 oasc.ShardLeaderElectionContext.runLeaderProcess I may be the new leader - try and sync
[junit4:junit4]   2> 7359 T2148 oasc.SyncStrategy.sync Sync replicas to http://127.0.0.1:49902/collection1/
[junit4:junit4]   2> 7359 T2148 oasc.SyncStrategy.syncReplicas Sync Success - now sync replicas to me
[junit4:junit4]   2> 7359 T2148 oasc.SyncStrategy.syncToMe http://127.0.0.1:49902/collection1/ has no replicas
[junit4:junit4]   2> 7360 T2148 oasc.ShardLeaderElectionContext.runLeaderProcess I am the new leader: http://127.0.0.1:49902/collection1/
[junit4:junit4]   2> 7360 T2148 oascc.SolrZkClient.makePath makePath: /collections/collection1/leaders/shard1
[junit4:junit4]   2> 7368 T2111 oazs.PrepRequestProcessor.pRequest Got user-level KeeperException when processing sessionid:0x13ca1c183c80006 type:create cxid:0x50 zxid:0x60 txntype:-1 reqpath:n/a Error Path:/solr/overseer Error:KeeperErrorCode = NodeExists for /solr/overseer
[junit4:junit4]   2> 8288 T2129 oascc.ZkStateReader.updateClusterState Updating cloud state from ZooKeeper... 
[junit4:junit4]   2> 8305 T2128 oascc.ZkStateReader$2.process A cluster state change: WatchedEvent state:SyncConnected type:NodeDataChanged path:/clusterstate.json, has occurred - updating... (live nodes size: 2)
[junit4:junit4]   2> 8305 T2147 oascc.ZkStateReader$2.process A cluster state change: WatchedEvent state:SyncConnected type:NodeDataChanged path:/clusterstate.json, has occurred - updating... (live nodes size: 2)
[junit4:junit4]   2> 8305 T2134 oascc.ZkStateReader$2.process A cluster state change: WatchedEvent state:SyncConnected type:NodeDataChanged path:/clusterstate.json, has occurred - updating... (live nodes size: 2)
[junit4:junit4]   2> 8313 T2148 oasc.ZkController.register We are http://127.0.0.1:49902/collection1/ and leader is http://127.0.0.1:49902/collection1/
[junit4:junit4]   2> 8313 T2148 oasc.ZkController.register No LogReplay needed for core=collection1 baseURL=http://127.0.0.1:49902
[junit4:junit4]   2> 8313 T2148 oasc.ZkController.checkRecovery I am the leader, no recovery necessary
[junit4:junit4]   2> 8314 T2148 oasc.ZkController.publish publishing core=collection1 state=active
[junit4:junit4]   2> 8314 T2148 oasc.ZkController.publish numShards not found on descriptor - reading it from system property
[junit4:junit4]   2> 8318 T2148 oascc.ZkStateReader.updateClusterState Updating cloud state from ZooKeeper... 
[junit4:junit4]   2> 8319 T2106 oass.SolrDispatchFilter.init user.dir=/Users/jenkins/jenkins-slave/workspace/Lucene-Solr-trunk-MacOSX/solr/build/solr-core/test/J0
[junit4:junit4]   2> 8320 T2106 oass.SolrDispatchFilter.init SolrDispatchFilter.init() done
[junit4:junit4]   2> 8321 T2106 oascsi.HttpClientUtil.createClient Creating new http client, config:maxConnections=128&maxConnectionsPerHost=32&followRedirects=false
[junit4:junit4]   2> 8561 T2106 oejs.Server.doStart jetty-8.1.8.v20121106
[junit4:junit4]   2> 8564 T2106 oejs.AbstractConnector.doStart Started SelectChannelConnector@127.0.0.1:49905
[junit4:junit4]   2> 8566 T2106 oass.SolrDispatchFilter.init SolrDispatchFilter.init()
[junit4:junit4]   2> 8567 T2106 oasc.SolrResourceLoader.locateSolrHome JNDI not configured for solr (NoInitialContextEx)
[junit4:junit4]   2> 8567 T2106 oasc.SolrResourceLoader.locateSolrHome using system property solr.solr.home: /Users/jenkins/jenkins-slave/workspace/Lucene-Solr-trunk-MacOSX/solr/build/solr-core/test/J0/./org.apache.solr.cloud.BasicDistributedZkTest-jetty2-1359923487803
[junit4:junit4]   2> 8569 T2106 oasc.CoreContainer$Initializer.initialize looking for solr.xml: /Users/jenkins/jenkins-slave/workspace/Lucene-Solr-trunk-MacOSX/solr/build/solr-core/test/J0/./org.apache.solr.cloud.BasicDistributedZkTest-jetty2-1359923487803/solr.xml
[junit4:junit4]   2> 8570 T2106 oasc.CoreContainer.<init> New CoreContainer 1588429137
[junit4:junit4]   2> 8570 T2106 oasc.CoreContainer.load Loading CoreContainer using Solr Home: '/Users/jenkins/jenkins-slave/workspace/Lucene-Solr-trunk-MacOSX/solr/build/solr-core/test/J0/./org.apache.solr.cloud.BasicDistributedZkTest-jetty2-1359923487803/'
[junit4:junit4]   2> 8571 T2106 oasc.SolrResourceLoader.<init> new SolrResourceLoader for directory: '/Users/jenkins/jenkins-slave/workspace/Lucene-Solr-trunk-MacOSX/solr/build/solr-core/test/J0/./org.apache.solr.cloud.BasicDistributedZkTest-jetty2-1359923487803/'
[junit4:junit4]   2> 8617 T2106 oashc.HttpShardHandlerFactory.getParameter Setting socketTimeout to: 60000
[junit4:junit4]   2> 8618 T2106 oashc.HttpShardHandlerFactory.getParameter Setting urlScheme to: http://
[junit4:junit4]   2> 8619 T2106 oashc.HttpShardHandlerFactory.getParameter Setting connTimeout to: 15000
[junit4:junit4]   2> 8619 T2106 oashc.HttpShardHandlerFactory.getParameter Setting maxConnectionsPerHost to: 20
[junit4:junit4]   2> 8620 T2106 oashc.HttpShardHandlerFactory.getParameter Setting corePoolSize to: 0
[junit4:junit4]   2> 8620 T2106 oashc.HttpShardHandlerFactory.getParameter Setting maximumPoolSize to: 2147483647
[junit4:junit4]   2> 8621 T2106 oashc.HttpShardHandlerFactory.getParameter Setting maxThreadIdleTime to: 5
[junit4:junit4]   2> 8622 T2106 oashc.HttpShardHandlerFactory.getParameter Setting sizeOfQueue to: -1
[junit4:junit4]   2> 8622 T2106 oashc.HttpShardHandlerFactory.getParameter Setting fairnessPolicy to: false
[junit4:junit4]   2> 8623 T2106 oascsi.HttpClientUtil.createClient Creating new http client, config:maxConnectionsPerHost=20&maxConnections=10000&socketTimeout=60000&connTimeout=15000&retry=false
[junit4:junit4]   2> 8637 T2106 oasc.CoreContainer.load Registering Log Listener
[junit4:junit4]   2> 8663 T2106 oasc.CoreContainer.initZooKeeper Zookeeper client=127.0.0.1:49895/solr
[junit4:junit4]   2> 8665 T2106 oasc.ZkController.checkChrootPath zkHost includes chroot
[junit4:junit4]   2> 8666 T2106 oaz.ZooKeeper.<init> Initiating client connection, connectString=127.0.0.1:49895 sessionTimeout=60000 watcher=org.apache.solr.common.cloud.ConnectionManager@23d1bd18
[junit4:junit4]   2> 8669 T2106 oascc.ConnectionManager.waitForConnected Waiting for client to connect to ZooKeeper
[junit4:junit4]   2> 8671 T2159 oaz.ClientCnxn$SendThread.logStartConnect Opening socket connection to server localhost/127.0.0.1:49895. Will not attempt to authenticate using SASL (access denied ("javax.security.auth.AuthPermission" "getLoginConfiguration"))
[junit4:junit4]   2> 8673 T2159 oaz.ClientCnxn$SendThread.primeConnection Socket connection established to localhost/127.0.0.1:49895, initiating session
[junit4:junit4]   2> 8673 T2108 oazs.NIOServerCnxnFactory.run Accepted socket connection from /127.0.0.1:49906
[junit4:junit4]   2> 8674 T2108 oazs.ZooKeeperServer.processConnectRequest Client attempting to establish new session at /127.0.0.1:49906
[junit4:junit4]   2> 8675 T2110 oazs.ZooKeeperServer.finishSessionInit Established session 0x13ca1c183c80007 with negotiated timeout 20000 for client /127.0.0.1:49906
[junit4:junit4]   2> 8675 T2159 oaz.ClientCnxn$SendThread.onConnected Session establishment complete on server localhost/127.0.0.1:49895, sessionid = 0x13ca1c183c80007, negotiated timeout = 20000
[junit4:junit4]   2> 8676 T2160 oascc.ConnectionManager.process Watcher org.apache.solr.common.cloud.ConnectionManager@23d1bd18 name:ZooKeeperConnection Watcher:127.0.0.1:49895 got event WatchedEvent state:SyncConnected type:None path:null path:null type:None
[junit4:junit4]   2> 8677 T2106 oascc.ConnectionManager.waitForConnected Client is connected to ZooKeeper
[junit4:junit4]   2> 8680 T2111 oazs.PrepRequestProcessor.pRequest2Txn Processed session termination for sessionid: 0x13ca1c183c80007
[junit4:junit4]   2> 8681 T2108 oazs.NIOServerCnxn.closeSock Closed socket connection for client /127.0.0.1:49906 which had sessionid 0x13ca1c183c80007
[junit4:junit4]   2> 8682 T2160 oaz.ClientCnxn$EventThread.run EventThread shut down
[junit4:junit4]   2> 8681 T2106 oaz.ZooKeeper.close Session: 0x13ca1c183c80007 closed
[junit4:junit4]   2> 8683 T2106 oascsi.HttpClientUtil.createClient Creating new http client, config:maxConnections=500&maxConnectionsPerHost=16&socketTimeout=60000&connTimeout=15000
[junit4:junit4]   2> 8693 T2106 oaz.ZooKeeper.<init> Initiating client connection, connectString=127.0.0.1:49895/solr sessionTimeout=30000 watcher=org.apache.solr.common.cloud.ConnectionManager@157ad54c
[junit4:junit4]   2> 8695 T2161 oaz.ClientCnxn$SendThread.logStartConnect Opening socket connection to server localhost/127.0.0.1:49895. Will not attempt to authenticate using SASL (access denied ("javax.security.auth.AuthPermission" "getLoginConfiguration"))
[junit4:junit4]   2> 8697 T2106 oascc.ConnectionManager.waitForConnected Waiting for client to connect to ZooKeeper
[junit4:junit4]   2> 8698 T2161 oaz.ClientCnxn$SendThread.primeConnection Socket connection established to localhost/127.0.0.1:49895, initiating session
[junit4:junit4]   2> 8699 T2108 oazs.NIOServerCnxnFactory.run Accepted socket connection from /127.0.0.1:49907
[junit4:junit4]   2> 8700 T2108 oazs.ZooKeeperServer.processConnectRequest Client attempting to establish new session at /127.0.0.1:49907
[junit4:junit4]   2> 8701 T2110 oazs.ZooKeeperServer.finishSessionInit Established session 0x13ca1c183c80008 with negotiated timeout 20000 for client /127.0.0.1:49907
[junit4:junit4]   2> 8701 T2161 oaz.ClientCnxn$SendThread.onConnected Session establishment complete on server localhost/127.0.0.1:49895, sessionid = 0x13ca1c183c80008, negotiated timeout = 20000
[junit4:junit4]   2> 8702 T2162 oascc.ConnectionManager.process Watcher org.apache.solr.common.cloud.ConnectionManager@157ad54c name:ZooKeeperConnection Watcher:127.0.0.1:49895/solr got event WatchedEvent state:SyncConnected type:None path:null path:null type:None
[junit4:junit4]   2> 8702 T2106 oascc.ConnectionManager.waitForConnected Client is connected to ZooKeeper
[junit4:junit4]   2> 8705 T2111 oazs.PrepRequestProcessor.pRequest Got user-level KeeperException when processing sessionid:0x13ca1c183c80008 type:create cxid:0x1 zxid:0x6d txntype:-1 reqpath:n/a Error Path:/solr/overseer Error:KeeperErrorCode = NodeExists for /solr/overseer
[junit4:junit4]   2> 8706 T2111 oazs.PrepRequestProcessor.pRequest Got user-level KeeperException when processing sessionid:0x13ca1c183c80008 type:create cxid:0x2 zxid:0x6e txntype:-1 reqpath:n/a Error Path:/solr/overseer Error:KeeperErrorCode = NodeExists for /solr/overseer
[junit4:junit4]   2> 8708 T2106 oasc.ZkController.createEphemeralLiveNode Register node as live in ZooKeeper:/live_nodes/127.0.0.1:49905_
[junit4:junit4]   2> 8709 T2111 oazs.PrepRequestProcessor.pRequest Got user-level KeeperException when processing sessionid:0x13ca1c183c80008 type:delete cxid:0x4 zxid:0x6f txntype:-1 reqpath:n/a Error Path:/solr/live_nodes/127.0.0.1:49905_ Error:KeeperErrorCode = NoNode for /solr/live_nodes/127.0.0.1:49905_
[junit4:junit4]   2> 8711 T2106 oascc.SolrZkClient.makePath makePath: /live_nodes/127.0.0.1:49905_
[junit4:junit4]   2> 8716 T2134 oascc.ZkStateReader$2.process A cluster state change: WatchedEvent state:SyncConnected type:NodeChildrenChanged path:/live_nodes, has occurred - updating... (live nodes size: 2)
[junit4:junit4]   2> 8716 T2128 oascc.ZkStateReader$3.process Updating live nodes... (3)
[junit4:junit4]   2> 8716 T2128 oascc.ZkStateReader$2.process A cluster state change: WatchedEvent state:SyncConnected type:NodeChildrenChanged path:/live_nodes, has occurred - updating... (live nodes size: 3)
[junit4:junit4]   2> 8719 T2147 oascc.ZkStateReader$3.process Updating live nodes... (3)
[junit4:junit4]   2> 8720 T2147 oascc.ZkStateReader$2.process A cluster state change: WatchedEvent state:SyncConnected type:NodeChildrenChanged path:/live_nodes, has occurred - updating... (live nodes size: 3)
[junit4:junit4]   2> 8727 T2134 oascc.ZkStateReader$3.process Updating live nodes... (3)
[junit4:junit4]   2> 8731 T2106 oascc.ZkStateReader.createClusterStateWatchersAndUpdate Updating cluster state from ZooKeeper... 
[junit4:junit4]   2> 8747 T2163 oasc.CoreContainer.create Creating SolrCore 'collection1' using instanceDir: /Users/jenkins/jenkins-slave/workspace/Lucene-Solr-trunk-MacOSX/solr/build/solr-core/test/J0/./org.apache.solr.cloud.BasicDistributedZkTest-jetty2-1359923487803/collection1
[junit4:junit4]   2> 8748 T2163 oasc.ZkController.createCollectionZkNode Check for collection zkNode:collection1
[junit4:junit4]   2> 8749 T2163 oasc.ZkController.createCollectionZkNode Collection zkNode exists
[junit4:junit4]   2> 8750 T2163 oasc.ZkController.readConfigName Load collection config from:/collections/collection1
[junit4:junit4]   2> 8751 T2163 oasc.SolrResourceLoader.<init> new SolrResourceLoader for directory: '/Users/jenkins/jenkins-slave/workspace/Lucene-Solr-trunk-MacOSX/solr/build/solr-core/test/J0/./org.apache.solr.cloud.BasicDistributedZkTest-jetty2-1359923487803/collection1/'
[junit4:junit4]   2> 8752 T2163 oasc.SolrResourceLoader.replaceClassLoader Adding 'file:/Users/jenkins/jenkins-slave/workspace/Lucene-Solr-trunk-MacOSX/solr/build/solr-core/test/J0/org.apache.solr.cloud.BasicDistributedZkTest-jetty2-1359923487803/collection1/lib/classes/' to classloader
[junit4:junit4]   2> 8753 T2163 oasc.SolrResourceLoader.replaceClassLoader Adding 'file:/Users/jenkins/jenkins-slave/workspace/Lucene-Solr-trunk-MacOSX/solr/build/solr-core/test/J0/org.apache.solr.cloud.BasicDistributedZkTest-jetty2-1359923487803/collection1/lib/README' to classloader
[junit4:junit4]   2> 8834 T2163 oasc.SolrConfig.<init> Using Lucene MatchVersion: LUCENE_50
[junit4:junit4]   2> 8915 T2163 oasc.SolrConfig.<init> Loaded SolrConfig: solrconfig.xml
[junit4:junit4]   2> 8916 T2163 oass.IndexSchema.readSchema Reading Solr Schema
[junit4:junit4]   2> 8923 T2163 oass.IndexSchema.readSchema Schema name=test
[junit4:junit4]   2> 9678 T2163 oass.OpenExchangeRatesOrgProvider.init Initialized with rates=open-exchange-rates.json, refreshInterval=1440.
[junit4:junit4]   2> 9693 T2163 oass.IndexSchema.readSchema default search field in schema is text
[junit4:junit4]   2> 9697 T2163 oass.IndexSchema.readSchema unique key field: id
[junit4:junit4]   2> 9722 T2163 oass.FileExchangeRateProvider.reload Reloading exchange rates from file currency.xml
[junit4:junit4]   2> 9729 T2163 oass.FileExchangeRateProvider.reload Reloading exchange rates from file currency.xml
[junit4:junit4]   2> 9735 T2163 oass.OpenExchangeRatesOrgProvider.reload Reloading exchange rates from open-exchange-rates.json
[junit4:junit4]   2> 9737 T2163 oass.OpenExchangeRatesOrgProvider.reload Reloading exchange rates from open-exchange-rates.json
[junit4:junit4]   2> 9739 T2163 oasc.SolrCore.<init> [collection1] Opening new SolrCore at /Users/jenkins/jenkins-slave/workspace/Lucene-Solr-trunk-MacOSX/solr/build/solr-core/test/J0/./org.apache.solr.cloud.BasicDistributedZkTest-jetty2-1359923487803/collection1/, dataDir=./org.apache.solr.cloud.BasicDistributedZkTest-1359923479489/jetty2/
[junit4:junit4]   2> 9740 T2163 oasc.JmxMonitoredMap.<init> JMX monitoring is enabled. Adding Solr mbeans to JMX Server: com.sun.jmx.mbeanserver.JmxMBeanServer@4e0bea2c
[junit4:junit4]   2> 9740 T2163 oasc.SolrCore.initDirectoryFactory solr.NRTCachingDirectoryFactory
[junit4:junit4]   2> 9741 T2163 oasc.CachingDirectoryFactory.get return new directory for /Users/jenkins/jenkins-slave/workspace/Lucene-Solr-trunk-MacOSX/solr/build/solr-core/test/J0/./org.apache.solr.cloud.BasicDistributedZkTest-1359923479489/jetty2 forceNew:false
[junit4:junit4]   2> 9742 T2163 oasc.CachingDirectoryFactory.close Releasing directory:/Users/jenkins/jenkins-slave/workspace/Lucene-Solr-trunk-MacOSX/solr/build/solr-core/test/J0/./org.apache.solr.cloud.BasicDistributedZkTest-1359923479489/jetty2
[junit4:junit4]   2> 9742 T2163 oasc.SolrCore.getNewIndexDir New index directory detected: old=null new=./org.apache.solr.cloud.BasicDistributedZkTest-1359923479489/jetty2/index/
[junit4:junit4]   2> 9743 T2163 oasc.SolrCore.initIndex WARNING [collection1] Solr index directory './org.apache.solr.cloud.BasicDistributedZkTest-1359923479489/jetty2/index' doesn't exist. Creating new index...
[junit4:junit4]   2> 9744 T2163 oasc.CachingDirectoryFactory.get return new directory for /Users/jenkins/jenkins-slave/workspace/Lucene-Solr-trunk-MacOSX/solr/build/solr-core/test/J0/./org.apache.solr.cloud.BasicDistributedZkTest-1359923479489/jetty2/index forceNew:false
[junit4:junit4]   2> 9749 T2163 oasc.SolrDeletionPolicy.onCommit SolrDeletionPolicy.onCommit: commits:num=1
[junit4:junit4]   2> 		commit{dir=RateLimitedDirectoryWrapper(NRTCachingDirectory(org.apache.lucene.store.NIOFSDirectory@/Users/jenkins/jenkins-slave/workspace/Lucene-Solr-trunk-MacOSX/solr/build/solr-core/test/J0/org.apache.solr.cloud.BasicDistributedZkTest-1359923479489/jetty2/index lockFactory=org.apache.lucene.store.NativeFSLockFactory@7487cae6; maxCacheMB=48.0 maxMergeSizeMB=4.0)),segFN=segments_1,generation=1,filenames=[segments_1]
[junit4:junit4]   2> 9750 T2163 oasc.SolrDeletionPolicy.updateCommits newest commit = 1[segments_1]
[junit4:junit4]   2> 9751 T2163 oasc.CachingDirectoryFactory.close Releasing directory:/Users/jenkins/jenkins-slave/workspace/Lucene-Solr-trunk-MacOSX/solr/build/solr-core/test/J0/./org.apache.solr.cloud.BasicDistributedZkTest-1359923479489/jetty2/index
[junit4:junit4]   2> 9751 T2163 oasc.SolrCore.initWriters created xml: solr.XMLResponseWriter
[junit4:junit4]   2> 9754 T2163 oasup.UpdateRequestProcessorChain.init inserting DistributedUpdateProcessorFactory into updateRequestProcessorChain "dedupe"
[junit4:junit4]   2> 9754 T2163 oasup.UpdateRequestProcessorChain.init inserting DistributedUpdateProcessorFactory into updateRequestProcessorChain "dedupe-allfields"
[junit4:junit4]   2> 9755 T2163 oasup.UpdateRequestProcessorChain.init inserting DistributedUpdateProcessorFactory into updateRequestProcessorChain "stored_sig"
[junit4:junit4]   2> 9755 T2163 oasup.UpdateRequestProcessorChain.init inserting DistributedUpdateProcessorFactory into updateRequestProcessorChain "uniq-fields"
[junit4:junit4]   2> 9756 T2163 oasup.UpdateRequestProcessorChain.init inserting DistributedUpdateProcessorFactory into updateRequestProcessorChain "distrib-dup-test-chain-implicit"
[junit4:junit4]   2> 9756 T2163 oasc.RequestHandlers.initHandlersFromConfig adding lazy requestHandler: solr.ReplicationHandler
[junit4:junit4]   2> 9757 T2163 oasc.RequestHandlers.initHandlersFromConfig created /replication: solr.ReplicationHandler
[junit4:junit4]   2> 9758 T2163 oasc.RequestHandlers.initHandlersFromConfig created standard: solr.StandardRequestHandler
[junit4:junit4]   2> 9758 T2163 oasc.RequestHandlers.initHandlersFromConfig created /get: solr.RealTimeGetHandler
[junit4:junit4]   2> 9759 T2163 oasc.RequestHandlers.initHandlersFromConfig created dismax: solr.SearchHandler
[junit4:junit4]   2> 9760 T2163 oasc.RequestHandlers.initHandlersFromConfig created mock: org.apache.solr.core.MockQuerySenderListenerReqHandler
[junit4:junit4]   2> 9760 T2163 oasc.RequestHandlers.initHandlersFromConfig created /admin/: org.apache.solr.handler.admin.AdminHandlers
[junit4:junit4]   2> 9761 T2163 oasc.RequestHandlers.initHandlersFromConfig created defaults: solr.StandardRequestHandler
[junit4:junit4]   2> 9761 T2163 oasc.RequestHandlers.initHandlersFromConfig adding lazy requestHandler: solr.StandardRequestHandler
[junit4:junit4]   2> 9762 T2163 oasc.RequestHandlers.initHandlersFromConfig created lazy: solr.StandardRequestHandler
[junit4:junit4]   2> 9762 T2163 oasc.RequestHandlers.initHandlersFromConfig created /update: solr.UpdateRequestHandler
[junit4:junit4]   2> 9763 T2163 oasc.RequestHandlers.initHandlersFromConfig created /terms: org.apache.solr.handler.component.SearchHandler
[junit4:junit4]   2> 9764 T2163 oasc.RequestHandlers.initHandlersFromConfig created spellCheckCompRH: org.apache.solr.handler.component.SearchHandler
[junit4:junit4]   2> 9764 T2163 oasc.RequestHandlers.initHandlersFromConfig created spellCheckCompRH_Direct: org.apache.solr.handler.component.SearchHandler
[junit4:junit4]   2> 9765 T2163 oasc.RequestHandlers.initHandlersFromConfig created spellCheckWithWordbreak: org.apache.solr.handler.component.SearchHandler
[junit4:junit4]   2> 9766 T2163 oasc.RequestHandlers.initHandlersFromConfig created spellCheckWithWordbreak_Direct: org.apache.solr.handler.component.SearchHandler
[junit4:junit4]   2> 9766 T2163 oasc.RequestHandlers.initHandlersFromConfig created spellCheckCompRH1: org.apache.solr.handler.component.SearchHandler
[junit4:junit4]   2> 9768 T2163 oasc.RequestHandlers.initHandlersFromConfig created mltrh: org.apache.solr.handler.component.SearchHandler
[junit4:junit4]   2> 9768 T2163 oasc.RequestHandlers.initHandlersFromConfig created tvrh: org.apache.solr.handler.component.SearchHandler
[junit4:junit4]   2> 9769 T2163 oasc.RequestHandlers.initHandlersFromConfig created /mlt: solr.MoreLikeThisHandler
[junit4:junit4]   2> 9770 T2163 oasc.RequestHandlers.initHandlersFromConfig created /debug/dump: solr.DumpRequestHandler
[junit4:junit4]   2> 9782 T2163 oashl.XMLLoader.init xsltCacheLifetimeSeconds=60
[junit4:junit4]   2> 9787 T2163 oasc.SolrCore.initDeprecatedSupport WARNING solrconfig.xml uses deprecated <admin/gettableFiles>, Please update your config to use the ShowFileRequestHandler.
[junit4:junit4]   2> 9790 T2163 oasc.SolrCore.initDeprecatedSupport WARNING adding ShowFileRequestHandler with hidden files: [SCHEMA.XML, OLD_SYNONYMS.TXT, STOPWORDS.TXT, PROTWORDS.TXT, OPEN-EXCHANGE-RATES.JSON, SYNONYMS.TXT, CURRENCY.XML, MAPPING-ISOLATIN1ACCENT.TXT]
[junit4:junit4]   2> 9793 T2163 oasc.CachingDirectoryFactory.close Releasing directory:/Users/jenkins/jenkins-slave/workspace/Lucene-Solr-trunk-MacOSX/solr/build/solr-core/test/J0/./org.apache.solr.cloud.BasicDistributedZkTest-1359923479489/jetty2
[junit4:junit4]   2> 9794 T2163 oass.SolrIndexSearcher.<init> Opening Searcher@31b52e62 main
[junit4:junit4]   2> 9795 T2163 oasu.CommitTracker.<init> Hard AutoCommit: disabled
[junit4:junit4]   2> 9796 T2163 oasu.CommitTracker.<init> Soft AutoCommit: disabled
[junit4:junit4]   2> 9796 T2163 oashc.SpellCheckComponent.inform Initializing spell checkers
[junit4:junit4]   2> 9803 T2163 oass.DirectSolrSpellChecker.init init: {name=direct,classname=DirectSolrSpellChecker,field=lowerfilt,minQueryLength=3}
[junit4:junit4]   2> 9817 T2129 oascc.ZkStateReader.updateClusterState Updating cloud state from ZooKeeper... 
[junit4:junit4]   2> 9819 T2129 oasc.Overseer$ClusterStateUpdater.updateState Update state numShards=2 message={
[junit4:junit4]   2> 	  "operation":"state",
[junit4:junit4]   2> 	  "numShards":"2",
[junit4:junit4]   2> 	  "shard":"shard1",
[junit4:junit4]   2> 	  "roles":null,
[junit4:junit4]   2> 	  "state":"active",
[junit4:junit4]   2> 	  "core":"collection1",
[junit4:junit4]   2> 	  "collection":"collection1",
[junit4:junit4]   2> 	  "node_name":"127.0.0.1:49902_",
[junit4:junit4]   2> 	  "base_url":"http://127.0.0.1:49902"}
[junit4:junit4]   2> 9829 T2134 oascc.ZkStateReader$2.process A cluster state change: WatchedEvent state:SyncConnected type:NodeDataChanged path:/clusterstate.json, has occurred - updating... (live nodes size: 3)
[junit4:junit4]   2> 9830 T2128 oascc.ZkStateReader$2.process A cluster state change: WatchedEvent state:SyncConnected type:NodeDataChanged path:/clusterstate.json, has occurred - updating... (live nodes size: 3)
[junit4:junit4]   2> 9829 T2162 oascc.ZkStateReader$2.process A cluster state change: WatchedEvent state:SyncConnected type:NodeDataChanged path:/clusterstate.json, has occurred - updating... (live nodes size: 3)
[junit4:junit4]   2> 9830 T2147 oascc.ZkStateReader$2.process A cluster state change: WatchedEvent state:SyncConnected type:NodeDataChanged path:/clusterstate.json, has occurred - updating... (live nodes size: 3)
[junit4:junit4]   2> 9863 T2164 oasc.SolrCore.registerSearcher [collection1] Registered new searcher Searcher@31b52e62 main{StandardDirectoryReader(segments_1:1)}
[junit4:junit4]   2> 9877 T2163 oasc.ZkController.publish publishing core=collection1 state=down
[junit4:junit4]   2> 9878 T2163 oasc.ZkController.publish numShards not found on descriptor - reading it from system property
[junit4:junit4]   2> 11354 T2129 oascc.ZkStateReader.updateClusterState Updating cloud state from ZooKeeper... 
[junit4:junit4]   2> 11356 T2129 oasc.Overseer$ClusterStateUpdater.updateState Update state numShards=2 message={
[junit4:junit4]   2> 	  "operation":"state",
[junit4:junit4]   2> 	  "numShards":"2",
[junit4:junit4]   2> 	  "shard":null,
[junit4:junit4]   2> 	  "roles":null,
[junit4:junit4]   2> 	  "state":"down",
[junit4:junit4]   2> 	  "core":"collection1",
[junit4:junit4]   2> 	  "collection":"collection1",
[junit4:junit4]   2> 	  "node_name":"127.0.0.1:49905_",
[junit4:junit4]   2> 	  "base_url":"http://127.0.0.1:49905"}
[junit4:junit4]   2> 11356 T2129 oasc.Overseer$ClusterStateUpdater.updateState Collection already exists with numShards=2
[junit4:junit4]   2> 11357 T2129 oasc.Overseer$ClusterStateUpdater.updateState Assigning new node to shard shard=shard2
[junit4:junit4]   2> 11364 T2134 oascc.ZkStateReader$2.process A cluster state change: WatchedEvent state:SyncConnected type:NodeDataChanged path:/clusterstate.json, has occurred - updating... (live nodes size: 3)
[junit4:junit4]   2> 11364 T2128 oascc.ZkStateReader$2.process A cluster state change: WatchedEvent state:SyncConnected type:NodeDataChanged path:/clusterstate.json, has occurred - updating... (live nodes size: 3)
[junit4:junit4]   2> 11365 T2147 oascc.ZkStateReader$2.process A cluster state change: WatchedEvent state:SyncConnected type:NodeDataChanged path:/clusterstate.json, has occurred - updating... (live nodes size: 3)
[junit4:junit4]   2> 11367 T2162 oascc.ZkStateReader$2.process A cluster state change: WatchedEvent state:SyncConnected type:NodeDataChanged path:/clusterstate.json, has occurred - updating... (live nodes size: 3)
[junit4:junit4]   2> 11882 T2163 oasc.CoreContainer.registerCore registering core: collection1
[junit4:junit4]   2> 11882 T2163 oasc.ZkController.register Register replica - core:collection1 address:http://127.0.0.1:49905 collection:collection1 shard:shard2
[junit4:junit4]   2> 11884 T2163 oascc.SolrZkClient.makePath makePath: /collections/collection1/leader_elect/shard2/election
[junit4:junit4]   2> 11901 T2111 oazs.PrepRequestProcessor.pRequest Got user-level KeeperException when processing sessionid:0x13ca1c183c80008 type:delete cxid:0x44 zxid:0x7e txntype:-1 reqpath:n/a Error Path:/solr/collections/collection1/leaders/shard2 Error:KeeperErrorCode = NoNode for /solr/collections/collection1/leaders/shard2
[junit4:junit4]   2> 11904 T2163 oasc.ShardLeaderElectionContext.runLeaderProcess Running the leader process.
[junit4:junit4]   2> 11905 T2111 oazs.PrepRequestProcessor.pRequest Got user-level KeeperException when processing sessionid:0x13ca1c183c80008 type:create cxid:0x45 zxid:0x7f txntype:-1 reqpath:n/a Error Path:/solr/overseer Error:KeeperErrorCode = NodeExists for /solr/overseer
[junit4:junit4]   2> 11909 T2163 oasc.ShardLeaderElectionContext.waitForReplicasToComeUp Enough replicas found to continue.
[junit4:junit4]   2> 11910 T2163 oasc.ShardLeaderElectionContext.runLeaderProcess I may be the new leader - try and sync
[junit4:junit4]   2> 11910 T2163 oasc.SyncStrategy.sync Sync replicas to http://127.0.0.1:49905/collection1/
[junit4:junit4]   2> 11910 T2163 oasc.SyncStrategy.syncReplicas Sync Success - now sync replicas to me
[junit4:junit4]   2> 11911 T2163 oasc.SyncStrategy.syncToMe http://127.0.0.1:49905/collection1/ has no replicas
[junit4:junit4]   2> 11911 T2163 oasc.ShardLeaderElectionContext.runLeaderProcess I am the new leader: http://127.0.0.1:49905/collection1/
[junit4:junit4]   2> 11911 T2163 oascc.SolrZkClient.makePath makePath: /collections/collection1/leaders/shard2
[junit4:junit4]   2> 11919 T2111 oazs.PrepRequestProcessor.pRequest Got user-level KeeperException when processing sessionid:0x13ca1c183c80008 type:create cxid:0x4e zxid:0x82 txntype:-1 reqpath:n/a Error Path:/solr/overseer Error:KeeperErrorCode = NodeExists for /solr/overseer
[junit4:junit4]   2> 12875 T2129 oascc.ZkStateReader.updateClusterState Updating cloud state from ZooKeeper... 
[junit4:junit4]   2> 12892 T2128 oascc.ZkStateReader$2.process A cluster state change: WatchedEvent state:SyncConnected type:NodeDataChanged path:/clusterstate.json, has occurred - updating... (live nodes size: 3)
[junit4:junit4]   2> 12892 T2134 oascc.ZkStateReader$2.process A cluster state change: WatchedEvent state:SyncConnected type:NodeDataChanged path:/clusterstate.json, has occurred - updating... (live nodes size: 3)
[junit4:junit4]   2> 12892 T2147 oascc.ZkStateReader$2.process A cluster state change: WatchedEvent state:SyncConnected type:NodeDataChanged path:/clusterstate.json, has occurred - updating... (live nodes size: 3)
[junit4:junit4]   2> 12892 T2162 oascc.ZkStateReader$2.process A cluster state change: WatchedEvent state:SyncConnected type:NodeDataChanged path:/clusterstate.json, has occurred - updating... (live nodes size: 3)
[junit4:junit4]   2> 12902 T2163 oasc.ZkController.register We are http://127.0.0.1:49905/collection1/ and leader is http://127.0.0.1:49905/collection1/
[junit4:junit4]   2> 12903 T2163 oasc.ZkController.register No LogReplay needed for core=collection1 baseURL=http://127.0.0.1:49905
[junit4:junit4]   2> 12903 T2163 oasc.ZkController.checkRecovery I am the leader, no recovery necessary
[junit4:junit4]   2> 12904 T2163 oasc.ZkController.publish publishing core=collection1 state=active
[junit4:junit4]   2> 12904 T2163 oasc.ZkController.publish numShards not found on descriptor - reading it from system property
[junit4:junit4]   2> 12907 T2163 oascc.ZkStateReader.updateClusterState Updating cloud state from ZooKeeper... 
[junit4:junit4]   2> 12909 T2106 oass.SolrDispatchFilter.init user.dir=/Users/jenkins/jenkins-slave/workspace/Lucene-Solr-trunk-MacOSX/solr/build/solr-core/test/J0
[junit4:junit4]   2> 12909 T2106 oass.SolrDispatchFilter.init SolrDispatchFilter.init() done
[junit4:junit4]   2> 12910 T2106 oascsi.HttpClientUtil.createClient Creating new http client, config:maxConnections=128&maxConnectionsPerHost=32&followRedirects=false
[junit4:junit4]   2> 13133 T2106 oejs.Server.doStart jetty-8.1.8.v20121106
[junit4:junit4]   2> 13149 T2106 oejs.AbstractConnector.doStart Started SelectChannelConnector@127.0.0.1:49908
[junit4:junit4]   2> 13150 T2106 oass.SolrDispatchFilter.init SolrDispatchFilter.init()
[junit4:junit4]   2> 13150 T2106 oasc.SolrResourceLoader.locateSolrHome JNDI not configured for solr (NoInitialContextEx)
[junit4:junit4]   2> 13151 T2106 oasc.SolrResourceLoader.locateSolrHome using system property solr.solr.home: /Users/jenkins/jenkins-slave/workspace/Lucene-Solr-trunk-MacOSX/solr/build/solr-core/test/J0/./org.apache.solr.cloud.BasicDistributedZkTest-jetty3-1359923492390
[junit4:junit4]   2> 13151 T2106 oasc.CoreContainer$Initializer.initialize looking for solr.xml: /Users/jenkins/jenkins-slave/workspace/Lucene-Solr-trunk-MacOSX/solr/build/solr-core/test/J0/./org.apache.solr.cloud.BasicDistributedZkTest-jetty3-1359923492390/solr.xml
[junit4:junit4]   2> 13152 T2106 oasc.CoreContainer.<init> New CoreContainer 1323056791
[junit4:junit4]   2> 13153 T2106 oasc.CoreContainer.load Loading CoreContainer using Solr Home: '/Users/jenkins/jenkins-slave/workspace/Lucene-Solr-trunk-MacOSX/solr/build/solr-core/test/J0/./org.apache.solr.cloud.BasicDistributedZkTest-jetty3-1359923492390/'
[junit4:junit4]   2> 13153 T2106 oasc.SolrResourceLoader.<init> new SolrResourceLoader for directory: '/Users/jenkins/jenkins-slave/workspace/Lucene-Solr-trunk-MacOSX/solr/build/solr-core/test/J0/./org.apache.solr.cloud.BasicDistributedZkTest-jetty3-1359923492390/'
[junit4:junit4]   2> 13196 T2106 oashc.HttpShardHandlerFactory.getParameter Setting socketTimeout to: 60000
[junit4:junit4]   2> 13197 T2106 oashc.HttpShardHandlerFactory.getParameter Setting urlScheme to: http://
[junit4:junit4]   2> 13198 T2106 oashc.HttpShardHandlerFactory.getParameter Setting connTimeout to: 15000
[junit4:junit4]   2> 13198 T2106 oashc.HttpShardHandlerFactory.getParameter Setting maxConnectionsPerHost to: 20
[junit4:junit4]   2> 13199 T2106 oashc.HttpShardHandlerFactory.getParameter Setting corePoolSize to: 0
[junit4:junit4]   2> 13199 T2106 oashc.HttpShardHandlerFactory.getParameter Setting maximumPoolSize to: 2147483647
[junit4:junit4]   2> 13201 T2106 oashc.HttpShardHandlerFactory.getParameter Setting maxThreadIdleTime to: 5
[junit4:junit4]   2> 13201 T2106 oashc.HttpShardHandlerFactory.getParameter Setting sizeOfQueue to: -1
[junit4:junit4]   2> 13202 T2106 oashc.HttpShardHandlerFactory.getParameter Setting fairnessPolicy to: false
[junit4:junit4]   2> 13202 T2106 oascsi.HttpClientUtil.createClient Creating new http client, config:maxConnectionsPerHost=20&maxConnections=10000&socketTimeout=60000&connTimeout=15000&retry=false
[junit4:junit4]   2> 13215 T2106 oasc.CoreContainer.load Registering Log Listener
[junit4:junit4]   2> 13242 T2106 oasc.CoreContainer.initZooKeeper Zookeeper client=127.0.0.1:49895/solr
[junit4:junit4]   2> 13243 T2106 oasc.ZkController.checkChrootPath zkHost includes chroot
[junit4:junit4]   2> 13243 T2106 oaz.ZooKeeper.<init> Initiating client connection, connectString=127.0.0.1:49895 sessionTimeout=60000 watcher=org.apache.solr.common.cloud.ConnectionManager@45c3e8b8
[junit4:junit4]   2> 13245 T2106 oascc.ConnectionManager.waitForConnected Waiting for client to connect to ZooKeeper
[junit4:junit4]   2> 13246 T2174 oaz.ClientCnxn$SendThread.logStartConnect Opening socket connection to server localhost/127.0.0.1:49895. Will not attempt to authenticate using SASL (access denied ("javax.security.auth.AuthPermission" "getLoginConfiguration"))
[junit4:junit4]   2> 13247 T2174 oaz.ClientCnxn$SendThread.primeConnection Socket connection established to localhost/127.0.0.1:49895, initiating session
[junit4:junit4]   2> 13247 T2108 oazs.NIOServerCnxnFactory.run Accepted socket connection from /127.0.0.1:49909
[junit4:junit4]   2> 13248 T2108 oazs.ZooKeeperServer.processConnectRequest Client attempting to establish new session at /127.0.0.1:49909
[junit4:junit4]   2> 13249 T2110 oazs.ZooKeeperServer.finishSessionInit Established session 0x13ca1c183c80009 with negotiated timeout 20000 for client /127.0.0.1:49909
[junit4:junit4]   2> 13249 T2174 oaz.ClientCnxn$SendThread.onConnected Session establishment complete on server localhost/127.0.0.1:49895, sessionid = 0x13ca1c183c80009, negotiated timeout = 20000
[junit4:junit4]   2> 13250 T2175 oascc.ConnectionManager.process Watcher org.apache.solr.common.cloud.ConnectionManager@45c3e8b8 name:ZooKeeperConnection Watcher:127.0.0.1:49895 got event WatchedEvent state:SyncConnected type:None path:null path:null type:None
[junit4:junit4]   2> 13250 T2106 oascc.ConnectionManager.waitForConnected Client is connected to ZooKeeper
[junit4:junit4]   2> 13252 T2111 oazs.PrepRequestProcessor.pRequest2Txn Processed session termination for sessionid: 0x13ca1c183c80009
[junit4:junit4]   2> 13254 T2108 oazs.NIOServerCnxn.closeSock Closed socket connection for client /127.0.0.1:49909 which had sessionid 0x13ca1c183c80009
[junit4:junit4]   2> 13254 T2175 oaz.ClientCnxn$EventThread.run EventThread shut down
[junit4:junit4]   2> 13254 T2106 oaz.ZooKeeper.close Session: 0x13ca1c183c80009 closed
[junit4:junit4]   2> 13255 T2106 oascsi.HttpClientUtil.createClient Creating new http client, config:maxConnections=500&maxConnectionsPerHost=16&socketTimeout=60000&connTimeout=15000
[junit4:junit4]   2> 13261 T2106 oaz.ZooKeeper.<init> Initiating client connection, connectString=127.0.0.1:49895/solr sessionTimeout=30000 watcher=org.apache.solr.common.cloud.ConnectionManager@62512bcb
[junit4:junit4]   2> 13262 T2106 oascc.ConnectionManager.waitForConnected Waiting for client to connect to ZooKeeper
[junit4:junit4]   2> 13263 T2176 oaz.ClientCnxn$SendThread.logStartConnect Opening socket connection to server localhost/127.0.0.1:49895. Will not attempt to authenticate using SASL (access denied ("javax.security.auth.AuthPermission" "getLoginConfiguration"))
[junit4:junit4]   2> 13264 T2176 oaz.ClientCnxn$SendThread.primeConnection Socket connection established to localhost/127.0.0.1:49895, initiating session
[junit4:junit4]   2> 13265 T2108 oazs.NIOServerCnxnFactory.run Accepted socket connection from /127.0.0.1:49910
[junit4:junit4]   2> 13266 T2108 oazs.ZooKeeperServer.processConnectRequest Client attempting to establish new session at /127.0.0.1:49910
[junit4:junit4]   2> 13267 T2110 oazs.ZooKeeperServer.finishSessionInit Established session 0x13ca1c183c8000a with negotiated timeout 20000 for client /127.0.0.1:49910
[junit4:junit4]   2> 13267 T2176 oaz.ClientCnxn$SendThread.onConnected Session establishment complete on server localhost/127.0.0.1:49895, sessionid = 0x13ca1c183c8000a, negotiated timeout = 20000
[junit4:junit4]   2> 13267 T2177 oascc.ConnectionManager.process Watcher org.apache.solr.common.cloud.ConnectionManager@62512bcb name:ZooKeeperConnection Watcher:127.0.0.1:49895/solr got event WatchedEvent state:SyncConnected type:None path:null path:null type:None
[junit4:junit4]   2> 13268 T2106 oascc.ConnectionManager.waitForConnected Client is connected to ZooKeeper
[junit4:junit4]   2> 13269 T2111 oazs.PrepRequestProcessor.pRequest Got user-level KeeperException when processing sessionid:0x13ca1c183c8000a type:create cxid:0x1 zxid:0x8f txntype:-1 reqpath:n/a Error Path:/solr/overseer Error:KeeperErrorCode = NodeExists for /solr/overseer
[junit4:junit4]   2> 13271 T2111 oazs.PrepRequestProcessor.pRequest Got user-level KeeperException when processing sessionid:0x13ca1c183c8000a type:create cxid:0x2 zxid:0x90 txntype:-1 reqpath:n/a Error Path:/solr/overseer Error:KeeperErrorCode = NodeExists for /solr/overseer
[junit4:junit4]   2> 13273 T2106 oasc.ZkController.createEphemeralLiveNode Register node as live in ZooKeeper:/live_nodes/127.0.0.1:49908_
[junit4:junit4]   2> 13274 T2111 oazs.PrepRequestProcessor.pRequest Got user-level KeeperException when processing sessionid:0x13ca1c183c8000a type:delete cxid:0x4 zxid:0x91 txntype:-1 reqpath:n/a Error Path:/solr/live_nodes/127.0.0.1:49908_ Error:KeeperErrorCode = NoNode for /solr/live_nodes/127.0.0.1:49908_
[junit4:junit4]   2> 13275 T2106 oascc.SolrZkClient.makePath makePath: /live_nodes/127.0.0.1:49908_
[junit4:junit4]   2> 13279 T2134 oascc.ZkStateReader$2.process A cluster state change: WatchedEvent state:SyncConnected type:NodeChildrenChanged path:/live_nodes, has occurred - updating... (live nodes size: 3)
[junit4:junit4]   2> 13281 T2128 oascc.ZkStateReader$3.process Updating live nodes... (4)
[junit4:junit4]   2> 13281 T2147 oascc.ZkStateReader$3.process Updating live nodes... (4)
[junit4:junit4]   2> 13282 T2162 oascc.ZkStateReader$3.process Updating live nodes... (4)
[junit4:junit4]   2> 13282 T2162 oascc.ZkStateReader$2.process A cluster state change: WatchedEvent state:SyncConnected type:NodeChildrenChanged path:/live_nodes, has occurred - updating... (live nodes size: 4)
[junit4:junit4]   2> 13282 T2128 oascc.ZkStateReader$2.process A cluster state change: WatchedEvent state:SyncConnected type:NodeChildrenChanged path:/live_nodes, has occurred - updating... (live nodes size: 4)
[junit4:junit4]   2> 13282 T2147 oascc.ZkStateReader$2.process A cluster state change: WatchedEvent state:SyncConnected type:NodeChildrenChanged path:/live_nodes, has occurred - updating... (live nodes size: 4)
[junit4:junit4]   2> 13286 T2134 oascc.ZkStateReader$3.process Updating live nodes... (4)
[junit4:junit4]   2> 13293 T2106 oascc.ZkStateReader.createClusterStateWatchersAndUpdate Updating cluster state from ZooKeeper... 
[junit4:junit4]   2> 13308 T2178 oasc.CoreContainer.create Creating SolrCore 'collection1' using instanceDir: /Users/jenkins/jenkins-slave/workspace/Lucene-Solr-trunk-MacOSX/solr/build/solr-core/test/J0/./org.apache.solr.cloud.BasicDistributedZkTest-jetty3-1359923492390/collection1
[junit4:junit4]   2> 13309 T2178 oasc.ZkController.createCollectionZkNode Check for collection zkNode:collection1
[junit4:junit4]   2> 13310 T2178 oasc.ZkController.createCollectionZkNode Collection zkNode exists
[junit4:junit4]   2> 13310 T2178 oasc.ZkController.readConfigName Load collection config from:/collections/collection1
[junit4:junit4]   2> 13312 T2178 oasc.SolrResourceLoader.<init> new SolrResourceLoader for directory: '/Users/jenkins/jenkins-slave/workspace/Lucene-Solr-trunk-MacOSX/solr/build/solr-core/test/J0/./org.apache.solr.cloud.BasicDistributedZkTest-jetty3-1359923492390/collection1/'
[junit4:junit4]   2> 13313 T2178 oasc.SolrResourceLoader.replaceClassLoader Adding 'file:/Users/jenkins/jenkins-slave/workspace/Lucene-Solr-trunk-MacOSX/solr/build/solr-core/test/J0/org.apache.solr.cloud.BasicDistributedZkTest-jetty3-1359923492390/collection1/lib/classes/' to classloader
[junit4:junit4]   2> 13313 T2178 oasc.SolrResourceLoader.replaceClassLoader Adding 'file:/Users/jenkins/jenkins-slave/workspace/Lucene-Solr-trunk-MacOSX/solr/build/solr-core/test/J0/org.apache.solr.cloud.BasicDistributedZkTest-jetty3-1359923492390/collection1/lib/README' to classloader
[junit4:junit4]   2> 13372 T2178 oasc.SolrConfig.<init> Using Lucene MatchVersion: LUCENE_50
[junit4:junit4]   2> 13448 T2178 oasc.SolrConfig.<init> Loaded SolrConfig: solrconfig.xml
[junit4:junit4]   2> 13449 T2178 oass.IndexSchema.readSchema Reading Solr Schema
[junit4:junit4]   2> 13455 T2178 oass.IndexSchema.readSchema Schema name=test
[junit4:junit4]   2> 14334 T2178 oass.OpenExchangeRatesOrgProvider.init Initialized with rates=open-exchange-rates.json, refreshInterval=1440.
[junit4:junit4]   2> 14344 T2178 oass.IndexSchema.readSchema default search field in schema is text
[junit4:junit4]   2> 14348 T2178 oass.IndexSchema.readSchema unique key field: id
[junit4:junit4]   2> 14371 T2178 oass.FileExchangeRateProvider.reload Reloading exchange rates from file currency.xml
[junit4:junit4]   2> 14378 T2178 oass.FileExchangeRateProvider.reload Reloading exchange rates from file currency.xml
[junit4:junit4]   2> 14384 T2178 oass.OpenExchangeRatesOrgProvider.reload Reloading exchange rates from open-exchange-rates.json
[junit4:junit4]   2> 14388 T2178 oass.OpenExchangeRatesOrgProvider.reload Reloading exchange rates from open-exchange-rates.json
[junit4:junit4]   2> 14397 T2178 oasc.SolrCore.<init> [collection1] Opening new SolrCore at /Users/jenkins/jenkins-slave/workspace/Lucene-Solr-trunk-MacOSX/solr/build/solr-core/test/J0/./org.apache.solr.cloud.BasicDistributedZkTest-jetty3-1359923492390/collection1/, dataDir=./org.apache.solr.cloud.BasicDistributedZkTest-1359923479489/jetty3/
[junit4:junit4]   2> 14398 T2178 oasc.JmxMonitoredMap.<init> JMX monitoring is enabled. Adding Solr mbeans to JMX Server: com.sun.jmx.mbeanserver.JmxMBeanServer@4e0bea2c
[junit4:junit4]   2> 14399 T2178 oasc.SolrCore.initDirectoryFactory solr.NRTCachingDirectoryFactory
[junit4:junit4]   2> 14400 T2178 oasc.CachingDirectoryFactory.get return new directory for /Users/jenkins/jenkins-slave/workspace/Lucene-Solr-trunk-MacOSX/solr/build/solr-core/test/J0/./org.apache.solr.cloud.BasicDistributedZkTest-1359923479489/jetty3 forceNew:false
[junit4:junit4]   2> 14400 T2178 oasc.CachingDirectoryFactory.close Releasing directory:/Users/jenkins/jenkins-slave/workspace/Lucene-Solr-trunk-MacOSX/solr/build/solr-core/test/J0/./org.apache.solr.cloud.BasicDistributedZkTest-1359923479489/jetty3
[junit4:junit4]   2> 14401 T2178 oasc.SolrCore.getNewIndexDir New index directory detected: old=null new=./org.apache.solr.cloud.BasicDistributedZkTest-1359923479489/jetty3/index/
[junit4:junit4]   2> 14401 T2178 oasc.SolrCore.initIndex WARNING [collection1] Solr index directory './org.apache.solr.cloud.BasicDistributedZkTest-1359923479489/jetty3/index' doesn't exist. Creating new index...
[junit4:junit4]   2> 14402 T2178 oasc.CachingDirectoryFactory.get return new directory for /Users/jenkins/jenkins-slave/workspace/Lucene-Solr-trunk-MacOSX/solr/build/solr-core/test/J0/./org.apache.solr.cloud.BasicDistributedZkTest-1359923479489/jetty3/index forceNew:false
[junit4:junit4]   2> 14407 T2129 oascc.ZkStateReader.updateClusterState Updating cloud state from ZooKeeper... 
[junit4:junit4]   2> 14408 T2129 oasc.Overseer$ClusterStateUpdater.updateState Update state numShards=2 message={
[junit4:junit4]   2> 	  "operation":"state",
[junit4:junit4]   2> 	  "numShards":"2",
[junit4:junit4]   2> 	  "shard":"shard2",
[junit4:junit4]   2> 	  "roles":null,
[junit4:junit4]   2> 	  "state":"active",
[junit4:junit4]   2> 	  "core":"collection1",
[junit4:junit4]   2> 	  "collection":"collection1",
[junit4:junit4]   2> 	  "node_name":"127.0.0.1:49905_",
[junit4:junit4]   2> 	  "base_url":"http://127.0.0.1:49905"}
[junit4:junit4]   2> 14439 T2178 oasc.SolrDeletionPolicy.onCommit SolrDeletionPolicy.onCommit: commits:num=1
[junit4:junit4]   2> 		commit{dir=RateLimitedDirectoryWrapper(NRTCachingDirectory(org.apache.lucene.store.NIOFSDirectory@/Users/jenkins/jenkins-slave/workspace/Lucene-Solr-trunk-MacOSX/solr/build/solr-core/test/J0/org.apache.solr.cloud.BasicDistributedZkTest-1359923479489/jetty3/index lockFactory=org.apache.lucene.store.NativeFSLockFactory@2ca27a1f; maxCacheMB=48.0 maxMergeSizeMB=4.0)),segFN=segments_1,generation=1,filenames=[segments_1]
[junit4:junit4]   2> 14441 T2147 oascc.ZkStateReader$2.process A cluster state change: WatchedEvent state:SyncConnected type:NodeDataChanged path:/clusterstate.json, has occurred - updating... (live nodes size: 4)
[junit4:junit4]   2> 14441 T2162 oascc.ZkStateReader$2.process A cluster state change: WatchedEvent state:SyncConnected type:NodeDataChanged path:/clusterstate.json, has occurred - updating... (live nodes size: 4)
[junit4:junit4]   2> 14441 T2177 oascc.ZkStateReader$2.process A cluster state change: WatchedEvent state:SyncConnected type:NodeDataChanged path:/clusterstate.json, has occurred - updating... (live nodes size: 4)
[junit4:junit4]   2> 14441 T2128 oascc.ZkStateReader$2.process A cluster state change: WatchedEvent state:SyncConnected type:NodeDataChanged path:/clusterstate.json, has occurred - updating... (live nodes size: 4)
[junit4:junit4]   2> 14441 T2134 oascc.ZkStateReader$2.process A cluster state change: WatchedEvent state:SyncConnected type:NodeDataChanged path:/clusterstate.json, has occurred - updating... (live nodes size: 4)
[junit4:junit4]   2> 14443 T2178 oasc.SolrDeletionPolicy.updateCommits newest commit = 1[segments_1]
[junit4:junit4]   2> 14448 T2178 oasc.CachingDirectoryFactory.close Releasing directory:/Users/jenkins/jenkins-slave/workspace/Lucene-Solr-trunk-MacOSX/solr/build/solr-core/test/J0/./org.apache.solr.cloud.BasicDistributedZkTest-1359923479489/jetty3/index
[junit4:junit4]   2> 14448 T2178 oasc.SolrCore.initWriters created xml: solr.XMLResponseWriter
[junit4:junit4]   2> 14460 T2178 oasup.UpdateRequestProcessorChain.init inserting DistributedUpdateProcessorFactory into updateRequestProcessorChain "dedupe"
[junit4:junit4]   2> 14460 T2178 oasup.UpdateRequestProcessorChain.init inserting DistributedUpdateProcessorFactory into updateRequestProcessorChain "dedupe-allfields"
[junit4:junit4]   2> 14461 T2178 oasup.UpdateRequestProcessorChain.init inserting DistributedUpdateProcessorFactory into updateRequestProcessorChain "stored_sig"
[junit4:junit4]   2> 14461 T2178 oasup.UpdateRequestProcessorChain.init inserting DistributedUpdateProcessorFactory into updateRequestProcessorChain "uniq-fields"
[junit4:junit4]   2> 14462 T2178 oasup.UpdateRequestProcessorChain.init inserting DistributedUpdateProcessorFactory into updateRequestProcessorChain "distrib-dup-test-chain-implicit"
[junit4:junit4]   2> 14462 T2178 oasc.RequestHandlers.initHandlersFromConfig adding lazy requestHandler: solr.ReplicationHandler
[junit4:junit4]   2> 14463 T2178 oasc.RequestHandlers.initHandlersFromConfig created /replication: solr.ReplicationHandler
[junit4:junit4]   2> 14464 T2178 oasc.RequestHandlers.initHandlersFromConfig created standard: solr.StandardRequestHandler
[junit4:junit4]   2> 14465 T2178 oasc.RequestHandlers.initHandlersFromConfig created /get: solr.RealTimeGetHandler
[junit4:junit4]   2> 14465 T2178 oasc.RequestHandlers.initHandlersFromConfig created dismax: solr.SearchHandler
[junit4:junit4]   2> 14466 T2178 oasc.RequestHandlers.initHandlersFromConfig created mock: org.apache.solr.core.MockQuerySenderListenerReqHandler
[junit4:junit4]   2> 14467 T2178 oasc.RequestHandlers.initHandlersFromConfig created /admin/: org.apache.solr.handler.admin.AdminHandlers
[junit4:junit4]   2> 14467 T2178 oasc.RequestHandlers.initHandlersFromConfig created defaults: solr.StandardRequestHandler
[junit4:junit4]   2> 14468 T2178 oasc.RequestHandlers.initHandlersFromConfig adding lazy requestHandler: solr.StandardRequestHandler
[junit4:junit4]   2> 14468 T2178 oasc.RequestHandlers.initHandlersFromConfig created lazy: solr.StandardRequestHandler
[junit4:junit4]   2> 14469 T2178 oasc.RequestHandlers.initHandlersFromConfig created /update: solr.UpdateRequestHandler
[junit4:junit4]   2> 14469 T2178 oasc.RequestHandlers.initHandlersFromConfig created /terms: org.apache.solr.handler.component.SearchHandler
[junit4:junit4]   2> 14470 T2178 oasc.RequestHandlers.initHandlersFromConfig created spellCheckCompRH: org.apache.solr.handler.component.SearchHandler
[junit4:junit4]   2> 14471 T2178 oasc.RequestHandlers.initHandlersFromConfig created spellCheckCompRH_Direct: org.apache.solr.handler.component.SearchHandler
[junit4:junit4]   2> 14471 T2178 oasc.RequestHandlers.initHandlersFromConfig created spellCheckWithWordbreak: org.apache.solr.handler.component.SearchHandler
[junit4:junit4]   2> 14472 T2178 oasc.RequestHandlers.initHandlersFromConfig created spellCheckWithWordbreak_Direct: org.apache.solr.handler.component.SearchHandler
[junit4:junit4]   2> 14472 T2178 oasc.RequestHandlers.initHandlersFromConfig created spellCheckCompRH1: org.apache.solr.handler.component.SearchHandler
[junit4:junit4]   2> 14473 T2178 oasc.RequestHandlers.initHandlersFromConfig created mltrh: org.apache.solr.handler.component.SearchHandler
[junit4:junit4]   2> 14474 T2178 oasc.RequestHandlers.initHandlersFromConfig created tvrh: org.apache.solr.handler.component.SearchHandler
[junit4:junit4]   2> 14474 T2178 oasc.RequestHandlers.initHandlersFromConfig created /mlt: solr.MoreLikeThisHandler
[junit4:junit4]   2> 14475 T2178 oasc.RequestHandlers.initHandlersFromConfig created /debug/dump: solr.DumpRequestHandler
[junit4:junit4]   2> 14482 T2178 oashl.XMLLoader.init xsltCacheLifetimeSeconds=60
[junit4:junit4]   2> 14485 T2178 oasc.SolrCore.initDeprecatedSupport WARNING solrconfig.xml uses deprecated <admin/gettableFiles>, Please update your config to use the ShowFileRequestHandler.
[junit4:junit4]   2> 14487 T2178 oasc.SolrCore.initDeprecatedSupport WARNING adding ShowFileRequestHandler with hidden files: [SCHEMA.XML, OLD_SYNONYMS.TXT, STOPWORDS.TXT, PROTWORDS.TXT, OPEN-EXCHANGE-RATES.JSON, SYNONYMS.TXT, CURRENCY.XML, MAPPING-ISOLATIN1ACCENT.TXT]
[junit4:junit4]   2> 14490 T2178 oasc.CachingDirectoryFactory.close Releasing directory:/Users/jenkins/jenkins-slave/workspace/Lucene-Solr-trunk-MacOSX/solr/build/solr-core/test/J0/./org.apache.solr.cloud.BasicDistributedZkTest-1359923479489/jetty3
[junit4:junit4]   2> 14493 T2178 oass.SolrIndexSearcher.<init> Opening Searcher@5ae27d3b main
[junit4:junit4]   2> 14499 T2178 oasu.CommitTracker.<init> Hard AutoCommit: disabled
[junit4:junit4]   2> 14499 T2178 oasu.CommitTracker.<init> Soft AutoCommit: disabled
[junit4:junit4]   2> 14500 T2178 oashc.SpellCheckComponent.inform Initializing spell checkers
[junit4:junit4]   2> 14506 T2178 oass.DirectSolrSpellChecker.init init: {name=direct,classname=DirectSolrSpellChecker,field=lowerfilt,minQueryLength=3}
[junit4:junit4]   2> 14541 T2179 oasc.SolrCore.registerSearcher [collection1] Registered new searcher Searcher@5ae27d3b main{StandardDirectoryReader(segments_1:1)}
[junit4:junit4]   2> 14554 T2178 oasc.ZkController.publish publishing core=collection1 state=down
[junit4:junit4]   2> 14555 T2178 oasc.ZkController.publish numShards not found on descriptor - reading it from system property
[junit4:junit4]   2> 15960 T2129 oascc.ZkStateReader.updateClusterState Updating cloud state from ZooKeeper... 
[junit4:junit4]   2> 15962 T2129 oasc.Overseer$ClusterStateUpdater.updateState Update state numShards=2 message={
[junit4:junit4]   2> 	  "operation":"state",
[junit4:junit4]   2> 	  "numShards":"2",
[junit4:junit4]   2> 	  "shard":null,
[junit4:junit4]   2> 	  "roles":null,
[junit4:junit4]   2> 	  "state":"down",
[junit4:junit4]   2> 	  "core":"collection1",
[junit4:junit4]   2> 	  "collection":"collection1",
[junit4:junit4]   2> 	  "node_name":"127.0.0.1:49908_",
[junit4:junit4]   2> 	  "base_url":"http://127.0.0.1:49908"}
[junit4:junit4]   2> 15962 T2129 oasc.Overseer$ClusterStateUpdater.updateState Collection already exists with numShards=2
[junit4:junit4]   2> 15962 T2129 oasc.Overseer$ClusterStateUpdater.updateState Assigning new node to shard shard=shard1
[junit4:junit4]   2> 15975 T2128 oascc.ZkStateReader$2.process A cluster state change: WatchedEvent state:SyncConnected type:NodeDataChanged path:/clusterstate.json, has occurred - updating... (live nodes size: 4)
[junit4:junit4]   2> 15975 T2177 oascc.ZkStateReader$2.process A cluster state change: WatchedEvent state:SyncConnected type:NodeDataChanged path:/clusterstate.json, has occurred - updating... (live nodes size: 4)
[junit4:junit4]   2> 15975 T2134 oascc.ZkStateReader$2.process A cluster state change: WatchedEvent state:SyncConnected type:NodeDataChanged path:/clusterstate.json, has occurred - updating... (live nodes size: 4)
[junit4:junit4]   2> 15976 T2147 oascc.ZkStateReader$2.process A cluster state change: WatchedEvent state:SyncConnected type:NodeDataChanged path:/clusterstate.json, has occurred - updating... (live nodes size: 4)
[junit4:junit4]   2> 15976 T2162 oascc.ZkStateReader$2.process A cluster state change: WatchedEvent state:SyncConnected type:NodeDataChanged path:/clusterstate.json, has occurred - updating... (live nodes size: 4)
[junit4:junit4]   2> 16562 T2178 oasc.CoreContainer.registerCore registering core: collection1
[junit4:junit4]   2> 16564 T2178 oasc.ZkController.register Register replica - core:collection1 address:http://127.0.0.1:49908 collection:collection1 shard:shard1
[junit4:junit4]   2> 16571 T2178 oasc.ZkController.register We are http://127.0.0.1:49908/collection1/ and leader is http://127.0.0.1:49902/collection1/
[junit4:junit4]   2> 16572 T2178 oasc.ZkController.register No LogReplay needed for core=collection1 baseURL=http://127.0.0.1:49908
[junit4:junit4]   2> 16572 T2178 oasc.ZkController.checkRecovery Core needs to recover:collection1
[junit4:junit4]   2> 16572 T2178 oasu.DefaultSolrCoreState.doRecovery Running recovery - first canceling any ongoing recovery
[junit4:junit4]   2> ASYNC  NEW_CORE C196 name=collection1 org.apache.solr.core.SolrCore@54c50fda url=http://127.0.0.1:49908/collection1 node=127.0.0.1:49908_ C196_STATE=coll:collection1 core:collection1 props:{shard=null, roles=null, state=down, core=collection1, collection=collection1, node_name=127.0.0.1:49908_, base_url=http://127.0.0.1:49908}
[junit4:junit4]   2> 16574 T2180 C196 P49908 oasc.RecoveryStrategy.run Starting recovery process.  core=collection1 recoveringAfterStartup=true
[junit4:junit4]   2> 16574 T2178 oascc.ZkStateReader.updateClusterState Updating cloud state from ZooKeeper... 
[junit4:junit4]   2> 16574 T2180 C196 P49908 oasc.RecoveryStrategy.doRecovery ###### startupVersions=[]
[junit4:junit4]   2> 16575 T2180 C196 P49908 oasc.ZkController.publish publishing core=collection1 state=recovering
[junit4:junit4]   2> 16575 T2180 C196 P49908 oasc.ZkController.publish numShards not found on descriptor - reading it from system property
[junit4:junit4]   2> 16576 T2106 oass.SolrDispatchFilter.init user.dir=/Users/jenkins/jenkins-slave/workspace/Lucene-Solr-trunk-MacOSX/solr/build/solr-core/test/J0
[junit4:junit4]   2> 16577 T2106 oass.SolrDispatchFilter.init SolrDispatchFilter.init() done
[junit4:junit4]   2> 16577 T2106 oascsi.HttpClientUtil.createClient Creating new http client, config:maxConnections=128&maxConnectionsPerHost=32&followRedirects=false
[junit4:junit4]   2> 16578 T2180 C196 P49908 oascsi.HttpClientUtil.createClient Creating new http client, config:maxConnections=128&maxConnectionsPerHost=32&followRedirects=false
[junit4:junit4]   2> 16815 T2106 oejs.Server.doStart jetty-8.1.8.v20121106
[junit4:junit4]   2> 16819 T2106 oejs.AbstractConnector.doStart Started SelectChannelConnector@127.0.0.1:49912
[junit4:junit4]   2> 16823 T2106 oass.SolrDispatchFilter.init SolrDispatchFilter.init()
[junit4:junit4]   2> 16823 T2106 oasc.SolrResourceLoader.locateSolrHome JNDI not configured for solr (NoInitialContextEx)
[junit4:junit4]   2> 16824 T2106 oasc.SolrResourceLoader.locateSolrHome using system property solr.solr.home: /Users/jenkins/jenkins-slave/workspace/Lucene-Solr-trunk-MacOSX/solr/build/solr-core/test/J0/./org.apache.solr.cloud.BasicDistributedZkTest-jetty4-1359923496058
[junit4:junit4]   2> 16824 T2106 oasc.CoreContainer$Initializer.initialize looking for solr.xml: /Users/jenkins/jenkins-slave/workspace/Lucene-Solr-trunk-MacOSX/solr/build/solr-core/test/J0/./org.apache.solr.cloud.BasicDistributedZkTest-jetty4-1359923496058/solr.xml
[junit4:junit4]   2> 16826 T2106 oasc.CoreContainer.<init> New CoreContainer 1687388260
[junit4:junit4]   2> 16826 T2106 oasc.CoreContainer.load Loading CoreContainer using Solr Home: '/Users/jenkins/jenkins-slave/workspace/Lucene-Solr-trunk-MacOSX/solr/build/solr-core/test/J0/./org.apache.solr.cloud.BasicDistributedZkTest-jetty4-1359923496058/'
[junit4:junit4]   2> 16827 T2106 oasc.SolrResourceLoader.<init> new SolrResourceLoader for directory: '/Users/jenkins/jenkins-slave/workspace/Lucene-Solr-trunk-MacOSX/solr/build/solr-core/test/J0/./org.apache.solr.cloud.BasicDistributedZkTest-jetty4-1359923496058/'
[junit4:junit4]   2> 16875 T2106 oashc.HttpShardHandlerFactory.getParameter Setting socketTimeout to: 60000
[junit4:junit4]   2> 16876 T2106 oashc.HttpShardHandlerFactory.getParameter Setting urlScheme to: http://
[junit4:junit4]   2> 16876 T2106 oashc.HttpShardHandlerFactory.getParameter Setting connTimeout to: 15000
[junit4:junit4]   2> 16877 T2106 oashc.HttpShardHandlerFactory.getParameter Setting maxConnectionsPerHost to: 20
[junit4:junit4]   2> 16877 T2106 oashc.HttpShardHandlerFactory.getParameter Setting corePoolSize to: 0
[junit4:junit4]   2> 16878 T2106 oashc.HttpShardHandlerFactory.getParameter Setting maximumPoolSize to: 2147483647
[junit4:junit4]   2> 16879 T2106 oashc.HttpShardHandlerFactory.getParameter Setting maxThreadIdleTime to: 5
[junit4:junit4]   2> 16879 T2106 oashc.HttpShardHandlerFactory.getParameter Setting sizeOfQueue to: -1
[junit4:junit4]   2> 16880 T2106 oashc.HttpShardHandlerFactory.getParameter Setting fairnessPolicy to: false
[junit4:junit4]   2> 16880 T2106 oascsi.HttpClientUtil.createClient Creating new http client, config:maxConnectionsPerHost=20&maxConnections=10000&socketTimeout=60000&connTimeout=15000&retry=false
[junit4:junit4]   2> 16893 T2106 oasc.CoreContainer.load Registering Log Listener
[junit4:junit4]   2> 16913 T2106 oasc.CoreContainer.initZooKeeper Zookeeper client=127.0.0.1:49895/solr
[junit4:junit4]   2> 16914 T2106 oasc.ZkController.checkChrootPath zkHost includes chroot
[junit4:junit4]   2> 16914 T2106 oaz.ZooKeeper.<init> Initiating client connection, connectString=127.0.0.1:49895 sessionTimeout=60000 watcher=org.apache.solr.common.cloud.ConnectionManager@49b2029
[junit4:junit4]   2> 16916 T2190 oaz.ClientCnxn$SendThread.logStartConnect Opening socket connection to server localhost/127.0.0.1:49895. Will not attempt to authenticate using SASL (access denied ("javax.security.auth.AuthPermission" "getLoginConfiguration"))
[junit4:junit4]   2> 16916 T2106 oascc.ConnectionManager.waitForConnected Waiting for client to connect to ZooKeeper
[junit4:junit4]   2> 16917 T2190 oaz.ClientCnxn$SendThread.primeConnection Socket connection established to localhost/127.0.0.1:49895, initiating session
[junit4:junit4]   2> 16918 T2108 oazs.NIOServerCnxnFactory.run Accepted socket connection from /127.0.0.1:49913
[junit4:junit4]   2> 16919 T2108 oazs.ZooKeeperServer.processConnectRequest Client attempting to establish new session at /127.0.0.1:49913
[junit4:junit4]   2> 16920 T2110 oazs.ZooKeeperServer.finishSessionInit Established session 0x13ca1c183c8000b with negotiated timeout 20000 for client /127.0.0.1:49913
[junit4:junit4]   2> 16920 T2190 oaz.ClientCnxn$SendThread.onConnected Session establishment complete on server localhost/127.0.0.1:49895, sessionid = 0x13ca1c183c8000b, negotiated timeout = 20000
[junit4:junit4]   2> 16921 T2191 oascc.ConnectionManager.process Watcher org.apache.solr.common.cloud.ConnectionManager@49b2029 name:ZooKeeperConnection Watcher:127.0.0.1:49895 got event WatchedEvent state:SyncConnected type:None path:null path:null type:None
[junit4:junit4]   2> 16921 T2106 oascc.ConnectionManager.waitForConnected Client is connected to ZooKeeper
[junit4:junit4]   2> 16923 T2111 oazs.PrepRequestProcessor.pRequest2Txn Processed session termination for sessionid: 0x13ca1c183c8000b
[junit4:junit4]   2> 16924 T2106 oaz.ZooKeeper.close Session: 0x13ca1c183c8000b closed
[junit4:junit4]   2> 16925 T2106 oascsi.HttpClientUtil.createClient Creating new http client, config:maxConnections=500&maxConnectionsPerHost=16&socketTimeout=60000&connTimeout=15000
[junit4:junit4]   2> 16930 T2108 oazs.NIOServerCnxn.closeSock Closed socket connection for client /127.0.0.1:49913 which had sessionid 0x13ca1c183c8000b
[junit4:junit4]   2> 16930 T2191 oaz.ClientCnxn$EventThread.run EventThread shut down
[junit4:junit4]   2> 16930 T2106 oaz.ZooKeeper.<init> Initiating client connection, connectString=127.0.0.1:49895/solr sessionTimeout=30000 watcher=org.apache.solr.common.cloud.ConnectionManager@7aea3aff
[junit4:junit4]   2> 16932 T2106 oascc.ConnectionManager.waitForConnected Waiting for client to connect to ZooKeeper
[junit4:junit4]   2> 16933 T2192 oaz.ClientCnxn$SendThread.logStartConnect Opening socket connection to server localhost/127.0.0.1:49895. Will not attempt to authenticate using SASL (access denied ("javax.security.auth.AuthPermission" "getLoginConfiguration"))
[junit4:junit4]   2> 16933 T2192 oaz.ClientCnxn$SendThread.primeConnection Socket connection established to localhost/127.0.0.1:49895, initiating session
[junit4:junit4]   2> 16935 T2108 oazs.NIOServerCnxnFactory.run Accepted socket connection from /127.0.0.1:49914
[junit4:junit4]   2> 16937 T2108 oazs.ZooKeeperServer.processConnectRequest Client attempting to establish new session at /127.0.0.1:49914
[junit4:junit4]   2> 16940 T2110 oazs.ZooKeeperServer.finishSessionInit Established session 0x13ca1c183c8000c with negotiated timeout 20000 for client /127.0.0.1:49914
[junit4:junit4]   2> 16941 T2192 oaz.ClientCnxn$SendThread.onConnected Session establishment complete on server localhost/127.0.0.1:49895, sessionid = 0x13ca1c183c8000c, negotiated timeout = 20000
[junit4:junit4]   2> 16941 T2193 oascc.ConnectionManager.process Watcher org.apache.solr.common.cloud.ConnectionManager@7aea3aff name:ZooKeeperConnection Watcher:127.0.0.1:49895/solr got event WatchedEvent state:SyncConnected type:None path:null path:null type:None
[junit4:junit4]   2> 16941 T2106 oascc.ConnectionManager.waitForConnected Client is connected to ZooKeeper
[junit4:junit4]   2> 16943 T2111 oazs.PrepRequestProcessor.pRequest Got user-level KeeperException when processing sessionid:0x13ca1c183c8000c type:create cxid:0x1 zxid:0xa2 txntype:-1 reqpath:n/a Error Path:/solr/overseer Error:KeeperErrorCode = NodeExists for /solr/overseer
[junit4:junit4]   2> 16945 T2111 oazs.PrepRequestProcessor.pRequest Got user-level KeeperException when processing sessionid:0x13ca1c183c8000c type:create cxid:0x2 zxid:0xa3 txntype:-1 reqpath:n/a Error Path:/solr/overseer Error:KeeperErrorCode = NodeExists for /solr/overseer
[junit4:junit4]   2> 16947 T2106 oasc.ZkController.createEphemeralLiveNode Register node as live in ZooKeeper:/live_nodes/127.0.0.1:49912_
[junit4:junit4]   2> 16948 T2111 oazs.PrepRequestProcessor.pRequest Got user-level KeeperException when processing sessionid:0x13ca1c183c8000c type:delete cxid:0x4 zxid:0xa4 txntype:-1 reqpath:n/a Error Path:/solr/live_nodes/127.0.0.1:49912_ Error:KeeperErrorCode = NoNode for /solr/live_nodes/127.0.0.1:49912_
[junit4:junit4]   2> 16949 T2106 oascc.SolrZkClient.makePath makePath: /live_nodes/127.0.0.1:49912_
[junit4:junit4]   2> 16953 T2134 oascc.ZkStateReader$2.process A cluster state change: WatchedEvent state:SyncConnected type:NodeChildrenChanged path:/live_nodes, has occurred - updating... (live nodes size: 4)
[junit4:junit4]   2> 16954 T2128 oascc.ZkStateReader$3.process Updating live nodes... (5)
[junit4:junit4]   2> 16955 T2128 oascc.ZkStateReader$2.process A cluster state change: WatchedEvent state:SyncConnected type:NodeChildrenChanged path:/live_nodes, has occurred - updating... (live nodes size: 5)
[junit4:junit4]   2> 16955 T2177 oascc.ZkStateReader$3.process Updating live nodes... (5)
[junit4:junit4]   2> 16956 T2162 oascc.ZkStateReader$3.process Updating live nodes... (5)
[junit4:junit4]   2> 16956 T2147 oascc.ZkStateReader$3.process Updating live nodes... (5)
[junit4:junit4]   2> 16957 T2147 oascc.ZkStateReader$2.process A cluster state change: WatchedEvent state:SyncConnected type:NodeChildrenChanged path:/live_nodes, has occurred - updating... (live nodes size: 5)
[junit4:junit4]   2> 16956 T2177 oascc.ZkStateReader$2.process A cluster state change: WatchedEvent state:SyncConnected type:NodeChildrenChanged path:/live_nodes, has occurred - updating... (live nodes size: 5)
[junit4:junit4]   2> 16957 T2162 oascc.ZkStateReader$2.process A cluster state change: WatchedEvent state:SyncConnected type:NodeChildrenChanged path:/live_nodes, has occurred - updating... (live nodes size: 5)
[junit4:junit4]   2> 16961 T2134 oascc.ZkStateReader$3.process Updating live nodes... (5)
[junit4:junit4]   2> 16967 T2106 oascc.ZkStateReader.createClusterStateWatchersAndUpdate Updating cluster state from ZooKeeper... 
[junit4:junit4]   2> 16975 T2194 oasc.CoreContainer.create Creating SolrCore 'collection1' using instanceDir: /Users/jenkins/jenkins-slave/workspace/Lucene-Solr-trunk-MacOSX/solr/build/solr-core/test/J0/./org.apache.solr.cloud.BasicDistributedZkTest-jetty4-1359923496058/collection1
[junit4:junit4]   2> 16976 T2194 oasc.ZkController.createCollectionZkNode Check for collection zkNode:collection1
[junit4:junit4]   2> 16977 T2194 oasc.ZkController.createCollectionZkNode Collection zkNode exists
[junit4:junit4]   2> 16977 T2194 oasc.ZkController.readConfigName Load collection config from:/collections/collection1
[junit4:junit4]   2> 16979 T2194 oasc.SolrResourceLoader.<init> new SolrResourceLoader for directory: '/Users/jenkins/jenkins-slave/workspace/Lucene-Solr-trunk-MacOSX/solr/build/solr-core/test/J0/./org.apache.solr.cloud.BasicDistributedZkTest-jetty4-1359923496058/collection1/'
[junit4:junit4]   2> 16980 T2194 oasc.SolrResourceLoader.replaceClassLoader Adding 'file:/Users/jenkins/jenkins-slave/workspace/Lucene-Solr-trunk-MacOSX/solr/build/solr-core/test/J0/org.apache.solr.cloud.BasicDistributedZkTest-jetty4-1359923496058/collection1/lib/classes/' to classloader
[junit4:junit4]   2> 16981 T2194 oasc.SolrResourceLoader.replaceClassLoader Adding 'file:/Users/jenkins/jenkins-slave/workspace/Lucene-Solr-trunk-MacOSX/solr/build/solr-core/test/J0/org.apache.solr.cloud.BasicDistributedZkTest-jetty4-1359923496058/collection1/lib/README' to classloader
[junit4:junit4]   2> 17034 T2194 oasc.SolrConfig.<init> Using Lucene MatchVersion: LUCENE_50
[junit4:junit4]   2> 17110 T2194 oasc.SolrConfig.<init> Loaded SolrConfig: solrconfig.xml
[junit4:junit4]   2> 17120 T2194 oass.IndexSchema.readSchema Reading Solr Schema
[junit4:junit4]   2> 17126 T2194 oass.IndexSchema.readSchema Schema name=test
[junit4:junit4]   2> 17500 T2129 oascc.ZkStateReader.updateClusterState Updating cloud state from ZooKeeper... 
[junit4:junit4]   2> 17501 T2129 oasc.Overseer$ClusterStateUpdater.updateState Update state numShards=2 message={
[junit4:junit4]   2> 	  "operation":"state",
[junit4:junit4]   2> 	  "numShards":"2",
[junit4:junit4]   2> 	  "shard":"shard1",
[junit4:junit4]   2> 	  "roles":null,
[junit4:junit4]   2> 	  "state":"recovering",
[junit4:junit4]   2> 	  "core":"collection1",
[junit4:junit4]   2> 	  "collection":"collection1",
[junit4:junit4]   2> 	  "node_name":"127.0.0.1:49908_",
[junit4:junit4]   2> 	  "base_url":"http://127.0.0.1:49908"}
[junit4:junit4]   2> 17509 T2134 oascc.ZkStateReader$2.process A cluster state change: WatchedEvent state:SyncConnected type:NodeDataChanged path:/clusterstate.json, has occurred - updating... (live nodes size: 5)
[junit4:junit4]   2> 17509 T2177 oascc.ZkStateReader$2.process A cluster state change: WatchedEvent state:SyncConnected type:NodeDataChanged path:/clusterstate.json, has occurred - updating... (live nodes size: 5)
[junit4:junit4]   2> 17509 T2128 oascc.ZkStateReader$2.process A cluster state change: WatchedEvent state:SyncConnected type:NodeDataChanged path:/clusterstate.json, has occurred - updating... (live nodes size: 5)
[junit4:junit4]   2> 17510 T2162 oascc.ZkStateReader$2.process A cluster state change: WatchedEvent state:SyncConnected type:NodeDataChanged path:/clusterstate.json, has occurred - updating... (live nodes size: 5)
[junit4:junit4]   2> 17510 T2147 oascc.ZkStateReader$2.process A cluster state change: WatchedEvent state:SyncConnected type:NodeDataChanged path:/clusterstate.json, has occurred - updating... (live nodes size: 5)
[junit4:junit4]   2> 17510 T2193 oascc.ZkStateReader$2.process A cluster state change: WatchedEvent state:SyncConnected type:NodeDataChanged path:/clusterstate.json, has occurred - updating... (live nodes size: 5)
[junit4:junit4]   2> 17975 T2194 oass.OpenExchangeRatesOrgProvider.init Initialized with rates=open-exchange-rates.json, refreshInterval=1440.
[junit4:junit4]   2> 17985 T2194 oass.IndexSchema.readSchema default search field in schema is text
[junit4:junit4]   2> 17989 T2194 oass.IndexSchema.readSchema unique key field: id
[junit4:junit4]   2> 18010 T2194 oass.FileExchangeRateProvider.reload Reloading exchange rates from file currency.xml
[junit4:junit4]   2> 18015 T2194 oass.FileExchangeRateProvider.reload Reloading exchange rates from file currency.xml
[junit4:junit4]   2> 18026 T2194 oass.OpenExchangeRatesOrgProvider.reload Reloading exchange rates from open-exchange-rates.json
[junit4:junit4]   2> 18029 T2194 oass.OpenExchangeRatesOrgProvider.reload Reloading exchange rates from open-exchange-rates.json
[junit4:junit4]   2> 18031 T2194 oasc.SolrCore.<init> [collection1] Opening new SolrCore at /Users/jenkins/jenkins-slave/workspace/Lucene-Solr-trunk-MacOSX/solr/build/solr-core/test/J0/./org.apache.solr.cloud.BasicDistributedZkTest-jetty4-1359923496058/collection1/, dataDir=./org.apache.solr.cloud.BasicDistributedZkTest-1359923479489/jetty4/
[junit4:junit4]   2> 18032 T2194 oasc.JmxMonitoredMap.<init> JMX monitoring is enabled. Adding Solr mbeans to JMX Server: com.sun.jmx.mbeanserver.JmxMBeanServer@4e0bea2c
[junit4:junit4]   2> 18033 T2194 oasc.SolrCore.initDirectoryFactory solr.NRTCachingDirectoryFactory
[junit4:junit4]   2> 18034 T2194 oasc.CachingDirectoryFactory.get return new directory for /Users/jenkins/jenkins-slave/workspace/Lucene-Solr-trunk-MacOSX/solr/build/solr-core/test/J0/./org.apache.solr.cloud.BasicDistributedZkTest-1359923479489/jetty4 forceNew:false
[junit4:junit4]   2> 18035 T2194 oasc.CachingDirectoryFactory.close Releasing directory:/Users/jenkins/jenkins-slave/workspace/Lucene-Solr-trunk-MacOSX/solr/build/solr-core/test/J0/./org.apache.solr.cloud.BasicDistributedZkTest-1359923479489/jetty4
[junit4:junit4]   2> 18036 T2194 oasc.SolrCore.getNewIndexDir New index directory detected: old=null new=./org.apache.solr.cloud.BasicDistributedZkTest-1359923479489/jetty4/index/
[junit4:junit4]   2> 18036 T2194 oasc.SolrCore.initIndex WARNING [collection1] Solr index directory './org.apache.solr.cloud.BasicDistributedZkTest-1359923479489/jetty4/index' doesn't exist. Creating new index...
[junit4:junit4]   2> 18038 T2194 oasc.CachingDirectoryFactory.get return new directory for /Users/jenkins/jenkins-slave/workspace/Lucene-Solr-trunk-MacOSX/solr/build/solr-core/test/J0/./org.apache.solr.cloud.BasicDistributedZkTest-1359923479489/jetty4/index forceNew:false
[junit4:junit4]   2> 18045 T2194 oasc.SolrDeletionPolicy.onCommit SolrDeletionPolicy.onCommit: commits:num=1
[junit4:junit4]   2> 		commit{dir=RateLimitedDirectoryWrapper(NRTCachingDirectory(org.apache.lucene.store.NIOFSDirectory@/Users/jenkins/jenkins-slave/workspace/Lucene-Solr-trunk-MacOSX/solr/build/solr-core/test/J0/org.apache.solr.cloud.BasicDistributedZkTest-1359923479489/jetty4/index lockFactory=org.apache.lucene.store.NativeFSLockFactory@739ce4f4; maxCacheMB=48.0 maxMergeSizeMB=4.0)),segFN=segments_1,generation=1,filenames=[segments_1]
[junit4:junit4]   2> 18045 T2194 oasc.SolrDeletionPolicy.updateCommits newest commit = 1[segments_1]
[junit4:junit4]   2> 18046 T2194 oasc.CachingDirectoryFactory.close Releasing directory:/Users/jenkins/jenkins-slave/workspace/Lucene-Solr-trunk-MacOSX/solr/build/solr-core/test/J0/./org.apache.solr.cloud.BasicDistributedZkTest-1359923479489/jetty4/index
[junit4:junit4]   2> 18047 T2194 oasc.SolrCore.initWriters created xml: solr.XMLResponseWriter
[junit4:junit4]   2> 18051 T2194 oasup.UpdateRequestProcessorChain.init inserting DistributedUpdateProcessorFactory into updateRequestProcessorChain "dedupe"
[junit4:junit4]   2> 18051 T2194 oasup.UpdateRequestProcessorChain.init inserting DistributedUpdateProcessorFactory into updateRequestProcessorChain "dedupe-allfields"
[junit4:junit4]   2> 18051 T2194 oasup.UpdateRequestProcessorChain.init inserting DistributedUpdateProcessorFactory into updateRequestProcessorChain "stored_sig"
[junit4:junit4]   2> 18052 T2194 oasup.UpdateRequestProcessorChain.init inserting DistributedUpdateProcessorFactory into updateRequestProcessorChain "uniq-fields"
[junit4:junit4]   2> 18052 T2194 oasup.UpdateRequestProcessorChain.init inserting DistributedUpdateProcessorFactory into updateRequestProcessorChain "distrib-dup-test-chain-implicit"
[junit4:junit4]   2> 18053 T2194 oasc.RequestHandlers.initHandlersFromConfig adding lazy requestHandler: solr.ReplicationHandler
[junit4:junit4]   2> 18053 T2194 oasc.RequestHandlers.initHandlersFromConfig created /replication: solr.ReplicationHandler
[junit4:junit4]   2> 18054 T2194 oasc.RequestHandlers.initHandlersFromConfig created standard: solr.StandardRequestHandler
[junit4:junit4]   2> 18054 T2194 oasc.RequestHandlers.initHandlersFromConfig created /get: solr.RealTimeGetHandler
[junit4:junit4]   2> 18055 T2194 oasc.RequestHandlers.initHandlersFromConfig created dismax: solr.SearchHandler
[junit4:junit4]   2> 18056 T2194 oasc.RequestHandlers.initHandlersFromConfig created mock: org.apache.solr.core.MockQuerySenderListenerReqHandler
[junit4:junit4]   2> 18056 T2194 oasc.RequestHandlers.initHandlersFromConfig created /admin/: org.apache.solr.handler.admin.AdminHandlers
[junit4:junit4]   2> 18057 T2194 oasc.RequestHandlers.initHandlersFromConfig created defaults: solr.StandardRequestHandler
[junit4:junit4]   2> 18058 T2194 oasc.RequestHandlers.initHandlersFromConfig adding lazy requestHandler: solr.StandardRequestHandler
[junit4:junit4]   2> 18059 T2194 oasc.RequestHandlers.initHandlersFromConfig created lazy: solr.StandardRequestHandler
[junit4:junit4]   2> 18060 T2194 oasc.RequestHandlers.initHandlersFromConfig created /update: solr.UpdateRequestHandler
[junit4:junit4]   2> 18061 T2194 oasc.RequestHandlers.initHandlersFromConfig created /terms: org.apache.solr.handler.component.SearchHandler
[junit4:junit4]   2> 18062 T2194 oasc.RequestHandlers.initHandlersFromConfig created spellCheckCompRH: org.apache.solr.handler.component.SearchHandler
[junit4:junit4]   2> 18063 T2194 oasc.RequestHandlers.initHandlersFromConfig created spellCheckCompRH_Direct: org.apache.solr.handler.component.SearchHandler
[junit4:junit4]   2> 18064 T2194 oasc.RequestHandlers.initHandlersFromConfig created spellCheckWithWordbreak: org.apache.solr.handler.component.SearchHandler
[junit4:junit4]   2> 18065 T2194 oasc.RequestHandlers.initHandlersFromConfig created spellCheckWithWordbreak_Direct: org.apache.solr.handler.component.SearchHandler
[junit4:junit4]   2> 18066 T2194 oasc.RequestHandlers.initHandlersFromConfig created spellCheckCompRH1: org.apache.solr.handler.component.SearchHandler
[junit4:junit4]   2> 18067 T2194 oasc.RequestHandlers.initHandlersFromConfig created mltrh: org.apache.solr.handler.component.SearchHandler
[junit4:junit4]   2> 18067 T2194 oasc.RequestHandlers.initHandlersFromConfig created tvrh: org.apache.solr.handler.component.SearchHandler
[junit4:junit4]   2> 18069 T2194 oasc.RequestHandlers.initHandlersFromConfig created /mlt: solr.MoreLikeThisHandler
[junit4:junit4]   2> 18069 T2194 oasc.RequestHandlers.initHandlersFromConfig created /debug/dump: solr.DumpRequestHandler
[junit4:junit4]   2> 18081 T2194 oashl.XMLLoader.init xsltCacheLifetimeSeconds=60
[junit4:junit4]   2> 18091 T2194 oasc.SolrCore.initDeprecatedSupport WARNING solrconfig.xml uses deprecated <admin/gettableFiles>, Please update your config to use the ShowFileRequestHandler.
[junit4:junit4]   2> 18093 T2194 oasc.SolrCore.initDeprecatedSupport WARNING adding ShowFileRequestHandler with hidden files: [SCHEMA.XML, OLD_SYNONYMS.TXT, STOPWORDS.TXT, PROTWORDS.TXT, OPEN-EXCHANGE-RATES.JSON, SYNONYMS.TXT, CURRENCY.XML, MAPPING-ISOLATIN1ACCENT.TXT]
[junit4:junit4]   2> 18095 T2194 oasc.CachingDirectoryFactory.close Releasing directory:/Users/jenkins/jenkins-slave/workspace/Lucene-Solr-trunk-MacOSX/solr/build/solr-core/test/J0/./org.apache.solr.cloud.BasicDistributedZkTest-1359923479489/jetty4
[junit4:junit4]   2> 18097 T2194 oass.SolrIndexSearcher.<init> Opening Searcher@18588606 main
[junit4:junit4]   2> 18098 T2194 oasu.CommitTracker.<init> Hard AutoCommit: disabled
[junit4:junit4]   2> 18098 T2194 oasu.CommitTracker.<init> Soft AutoCommit: disabled
[junit4:junit4]   2> 18099 T2194 oashc.SpellCheckComponent.inform Initializing spell checkers
[junit4:junit4]   2> 18104 T2194 oass.DirectSolrSpellChecker.init init: {name=direct,classname=DirectSolrSpellChecker,field=lowerfilt,minQueryLength=3}
[junit4:junit4]   2> 18143 T2195 oasc.SolrCore.registerSearcher [collection1] Registered new searcher Searcher@18588606 main{StandardDirectoryReader(segments_1:1)}
[junit4:junit4]   2> 18156 T2194 oasc.ZkController.publish publishing core=collection1 state=down
[junit4:junit4]   2> 18156 T2194 oasc.ZkController.publish numShards not found on descriptor - reading it from system property
[junit4:junit4]   2> 19028 T2129 oascc.ZkStateReader.updateClusterState Updating cloud state from ZooKeeper... 
[junit4:junit4]   2> 19030 T2129 oasc.Overseer$ClusterStateUpdater.updateState Update state numShards=2 message={
[junit4:junit4]   2> 	  "operation":"state",
[junit4:junit4]   2> 	  "numShards":"2",
[junit4:junit4]   2> 	  "shard":null,
[junit4:junit4]   2> 	  "roles":null,
[junit4:junit4]   2> 	  "state":"down",
[junit4:junit4]   2> 	  "core":"collection1",
[junit4:junit4]   2> 	  "collection":"collection1",
[junit4:junit4]   2> 	  "node_name":"127.0.0.1:49912_",
[junit4:junit4]   2> 	  "base_url":"http://127.0.0.1:49912"}
[junit4:junit4]   2> 19030 T2129 oasc.Overseer$ClusterStateUpdater.updateState Collection already exists with numShards=2
[junit4:junit4]   2> 19030 T2129 oasc.Overseer$ClusterStateUpdater.updateState Assigning new node to shard shard=shard2
[junit4:junit4]   2> 19039 T2134 oascc.ZkStateReader$2.process A cluster state change: WatchedEvent state:SyncConnected type:NodeDataChanged path:/clusterstate.json, has occurred - updating... (live nodes size: 5)
[junit4:junit4]   2> 19039 T2177 oascc.ZkStateReader$2.process A cluster state change: WatchedEvent state:SyncConnected type:NodeDataChanged path:/clusterstate.json, has occurred - updating... (live nodes size: 5)
[junit4:junit4]   2> 19040 T2162 oascc.ZkStateReader$2.process A cluster state change: WatchedEvent state:SyncConnected type:NodeDataChanged path:/clusterstate.json, has occurred - updating... (live nodes size: 5)
[junit4:junit4]   2> 19040 T2193 oascc.ZkStateReader$2.process A cluster state change: WatchedEvent state:SyncConnected type:NodeDataChanged path:/clusterstate.json, has occurred - updating... (live nodes size: 5)
[junit4:junit4]   2> 19040 T2128 oascc.ZkStateReader$2.process A cluster state change: WatchedEvent state:SyncConnected type:NodeDataChanged path:/clusterstate.json, has occurred - updating... (live nodes size: 5)
[junit4:junit4]   2> 19040 T2147 oascc.ZkStateReader$2.process A cluster state change: WatchedEvent state:SyncConnected type:NodeDataChanged path:/clusterstate.json, has occurred - updating... (live nodes size: 5)
[junit4:junit4]   2> 19160 T2194 oasc.CoreContainer.registerCore registering core: collection1
[junit4:junit4]   2> 19161 T2194 oasc.ZkController.register Register replica - core:collection1 address:http://127.0.0.1:49912 collection:collection1 shard:shard2
[junit4:junit4]   2> 19168 T2194 oasc.ZkController.register We are http://127.0.0.1:49912/collection1/ and leader is http://127.0.0.1:49905/collection1/
[junit4:junit4]   2> 19168 T2194 oasc.ZkController.register No LogReplay needed for core=collection1 baseURL=http://127.0.0.1:49912
[junit4:junit4]   2> 19168 T2194 oasc.ZkController.checkRecovery Core needs to recover:collection1
[junit4:junit4]   2> 19169 T2194 oasu.DefaultSolrCoreState.doRecovery Running recovery - first canceling any ongoing recovery
[junit4:junit4]   2> ASYNC  NEW_CORE C197 name=collection1 org.apache.solr.core.SolrCore@7dff7e7a url=http://127.0.0.1:49912/collection1 node=127.0.0.1:49912_ C197_STATE=coll:collection1 core:collection1 props:{shard=null, roles=null, state=down, core=collection1, collection=collection1, node_name=127.0.0.1:49912_, base_url=http://127.0.0.1:49912}
[junit4:junit4]   2> 19170 T2196 C197 P49912 oasc.RecoveryStrategy.run Starting recovery process.  core=collection1 recoveringAfterStartup=true
[junit4:junit4]   2> 19170 T2196 C197 P49912 oasc.RecoveryStrategy.doRecovery ###### startupVersions=[]
[junit4:junit4]   2> 19171 T2196 C197 P49912 oasc.ZkController.publish publishing core=collection1 state=recovering
[junit4:junit4]   2> 19171 T2196 C197 P49912 oasc.ZkController.publish numShards not found on descriptor - reading it from system property
[junit4:junit4]   2> 19173 T2194 oascc.ZkStateReader.updateClusterState Updating cloud state from ZooKeeper... 
[junit4:junit4]   2> 19174 T2196 C197 P49912 oascsi.HttpClientUtil.createClient Creating new http client, config:maxConnections=128&maxConnectionsPerHost=32&followRedirects=false
[junit4:junit4]   2> 19190 T2106 oass.SolrDispatchFilter.init user.dir=/Users/jenkins/jenkins-slave/workspace/Lucene-Solr-trunk-MacOSX/solr/build/solr-core/test/J0
[junit4:junit4]   2> 19191 T2106 oass.SolrDispatchFilter.init SolrDispatchFilter.init() done
[junit4:junit4]   2> 19194 T2106 oascsi.HttpClientUtil.createClient Creating new http client, config:maxConnections=128&maxConnectionsPerHost=32&followRedirects=false
[junit4:junit4]   2> 19210 T2106 oascc.ZkStateReader.updateClusterState Updating cloud state from ZooKeeper... 
[junit4:junit4]   2> 19213 T2106 oasc.AbstractDistribZkTestBase.waitForRecoveriesToFinish Wait for recoveries to finish - collection: collection1 failOnTimeout:true timeout (sec):230
[junit4:junit4]   2> 19215 T2106 oascc.ZkStateReader.updateClusterState Updating cloud state from ZooKeeper... 
[junit4:junit4]   2>  C196_STATE=coll:collection1 core:collection1 props:{shard=shard1, roles=null, state=recovering, core=collection1, collection=collection1, node_name=127.0.0.1:49908_, base_url=http://127.0.0.1:49908}
[junit4:junit4]   2> 19605 T2180 C196 P49908 oasc.RecoveryStrategy.doRecovery Attempting to PeerSync from http://127.0.0.1:49902/collection1/ core=collection1 - recoveringAfterStartup=true
[junit4:junit4]   2> 19605 T2180 C196 P49908 oasu.PeerSync.sync PeerSync: core=collection1 url=http://127.0.0.1:49908 START replicas=[http://127.0.0.1:49902/collection1/] nUpdates=100
[junit4:junit4]   2> 19606 T2180 C196 P49908 oasu.PeerSync.sync WARNING no frame of reference to tell of we've missed updates
[junit4:junit4]   2> 19606 T2180 C196 P49908 oasc.RecoveryStrategy.doRecovery PeerSync Recovery was not successful - trying replication. core=collection1
[junit4:junit4]   2> 19607 T2180 C196 P49908 oasc.RecoveryStrategy.doRecovery Starting Replication Recovery. core=collection1
[junit4:junit4]   2> 19607 T2180 C196 P49908 oasc.RecoveryStrategy.doRecovery Begin buffering updates. core=collection1
[junit4:junit4]   2> 19607 T2180 C196 P49908 oasu.UpdateLog.bufferUpdates Starting to buffer updates. FSUpdateLog{state=ACTIVE, tlog=null}
[junit4:junit4]   2> 19608 T2180 C196 P49908 oasc.RecoveryStrategy.replicate Attempting to replicate from http://127.0.0.1:49902/collection1/. core=collection1
[junit4:junit4]   2> 19608 T2180 C196 P49908 oascsi.HttpClientUtil.createClient Creating new http client, config:maxConnections=128&maxConnectionsPerHost=32&followRedirects=false
[junit4:junit4]   2> ASYNC  NEW_CORE C198 name=collection1 org.apache.solr.core.SolrCore@7f30aa5f url=http://127.0.0.1:49902/collection1 node=127.0.0.1:49902_ C198_STATE=coll:collection1 core:collection1 props:{shard=shard1, roles=null, state=active, core=collection1, collection=collection1, node_name=127.0.0.1:49902_, base_url=http://127.0.0.1:49902, leader=true}
[junit4:junit4]   2> 19614 T2138 C198 P49902 REQ /get {getVersions=100&distrib=false&wt=javabin&qt=/get&version=2} status=0 QTime=0 
[junit4:junit4]   2> 19617 T2141 C198 P49902 oasu.DirectUpdateHandler2.commit start commit{,optimize=false,openSearcher=false,waitSearcher=true,expungeDeletes=false,softCommit=false}
[junit4:junit4]   2> 19619 T2141 C198 P49902 oasc.CachingDirectoryFactory.close Releasing directory:/Users/jenkins/jenkins-slave/workspace/Lucene-Solr-trunk-MacOSX/solr/build/solr-core/test/J0/./org.apache.solr.cloud.BasicDistributedZkTest-1359923479489/jetty1
[junit4:junit4]   2> 19621 T2141 C198 P49902 oasc.SolrDeletionPolicy.onInit SolrDeletionPolicy.onInit: commits:num=1
[junit4:junit4]   2> 		commit{dir=RateLimitedDirectoryWrapper(NRTCachingDirectory(org.apache.lucene.store.NIOFSDirectory@/Users/jenkins/jenkins-slave/workspace/Lucene-Solr-trunk-MacOSX/solr/build/solr-core/test/J0/org.apache.solr.cloud.BasicDistributedZkTest-1359923479489/jetty1/index lockFactory=org.apache.lucene.store.NativeFSLockFactory@63673ffb; maxCacheMB=48.0 maxMergeSizeMB=4.0)),segFN=segments_1,generation=1,filenames=[segments_1]
[junit4:junit4]   2> 19622 T2141 C198 P49902 oasc.SolrDeletionPolicy.updateCommits newest commit = 1[segments_1]
[junit4:junit4]   2> 19625 T2141 C198 P49902 oasc.SolrDeletionPolicy.onCommit SolrDeletionPolicy.onCommit: commits:num=2
[junit4:junit4]   2> 		commit{dir=RateLimitedDirectoryWrapper(NRTCachingDirectory(org.apache.lucene.store.NIOFSDirectory@/Users/jenkins/jenkins-slave/workspace/Lucene-Solr-trunk-MacOSX/solr/build/solr-core/test/J0/org.apache.solr.cloud.BasicDistributedZkTest-1359923479489/jetty1/index lockFactory=org.apache.lucene.store.NativeFSLockFactory@63673ffb; maxCacheMB=48.0 maxMergeSizeMB=4.0)),segFN=segments_1,generation=1,filenames=[segments_1]
[junit4:junit4]   2> 		commit{dir=RateLimitedDirectoryWrapper(NRTCachingDirectory(org.apache.lucene.store.NIOFSDirectory@/Users/jenkins/jenkins-slave/workspace/Lucene-Solr-trunk-MacOSX/solr/build/solr-core/test/J0/org.apache.solr.cloud.BasicDistributedZkTest-1359923479489/jetty1/index lockFactory=org.apache.lucene.store.NativeFSLockFactory@63673ffb; maxCacheMB=48.0 maxMergeSizeMB=4.0)),segFN=segments_2,generation=2,filenames=[segments_2]
[junit4:junit4]   2> 19626 T2141 C198 P49902 oasc.SolrDeletionPolicy.updateCommits newest commit = 2[segments_2]
[junit4:junit4]   2> 19627 T2141 C198 P49902 oasc.CachingDirectoryFactory.close Releasing directory:/Users/jenkins/jenkins-slave/workspace/Lucene-Solr-trunk-MacOSX/solr/build/solr-core/test/J0/./org.apache.solr.cloud.BasicDistributedZkTest-1359923479489/jetty1
[junit4:junit4]   2> 19629 T2141 C198 P49902 oass.SolrIndexSearcher.<init> Opening Searcher@5ed50a22 realtime
[junit4:junit4]   2> 19630 T2141 C198 P49902 oasu.DirectUpdateHandler2.commit end_commit_flush
[junit4:junit4]   2> 19631 T2141 C198 P49902 /update {waitSearcher=true&openSearcher=false&commit=true&wt=javabin&commit_end_point=true&version=2&softCommit=false} {commit=} 0 14
[junit4:junit4]   2> 19632 T2180 C196 P49908 oash.ReplicationHandler.inform Commits will be reserved for  10000
[junit4:junit4]   2> 19633 T2180 C196 P49908 oash.SnapPuller.<init>  No value set for 'pollInterval'. Timer Task not started.
[junit4:junit4]   2> 19638 T2142 C198 P49902 oash.ReplicationHandler.inform Commits will be reserved for  10000
[junit4:junit4]   2> 19639 T2142 C198 P49902 REQ /replication {command=indexversion&qt=/replication&wt=javabin&version=2} status=0 QTime=3 
[junit4:junit4]   2> 19640 T2180 C196 P49908 oash.SnapPuller.fetchLatestIndex Master's generation: 2
[junit4:junit4]   2> 19640 T2180 C196 P49908 oash.SnapPuller.fetchLatestIndex Slave's generation: 1
[junit4:junit4]   2> 19641 T2180 C196 P49908 oash.SnapPuller.fetchLatestIndex Starting replication process
[junit4:junit4]   2> 19644 T2140 C198 P49902 oasc.CachingDirectoryFactory.close Releasing directory:/Users/jenkins/jenkins-slave/workspace/Lucene-Solr-trunk-MacOSX/solr/build/solr-core/test/J0/./org.apache.solr.cloud.BasicDistributedZkTest-1359923479489/jetty1
[junit4:junit4]   2> 19645 T2140 C198 P49902 oasc.CachingDirectoryFactory.close Releasing directory:/Users/jenkins/jenkins-slave/workspace/Lucene-Solr-trunk-MacOSX/solr/build/solr-core/test/J0/./org.apache.solr.cloud.BasicDistributedZkTest-1359923479489/jetty1/index
[junit4:junit4]   2> 19646 T2140 C198 P49902 REQ /replication {command=filelist&qt=/replication&wt=javabin&generation=2&version=2} status=0 QTime=3 
[junit4:junit4]   2> 19647 T2180 C196 P49908 oash.SnapPuller.fetchLatestIndex Number of files in latest index in master: 1
[junit4:junit4]   2> 19649 T2180 C196 P49908 oasc.CachingDirectoryFactory.get return new directory for /Users/jenkins/jenkins-slave/workspace/Lucene-Solr-trunk-MacOSX/solr/build/solr-core/test/J0/./org.apache.solr.cloud.BasicDistributedZkTest-1359923479489/jetty3/index.20130203173139122 forceNew:false
[junit4:junit4]   2> 19651 T2180 C196 P49908 oasc.CachingDirectoryFactory.close Releasing directory:/Users/jenkins/jenkins-slave/workspace/Lucene-Solr-trunk-MacOSX/solr/build/solr-core/test/J0/./org.apache.solr.cloud.BasicDistributedZkTest-1359923479489/jetty3
[junit4:junit4]   2> 19656 T2180 C196 P49908 oash.SnapPuller.fetchLatestIndex Starting download to RateLimitedDirectoryWrapper(NRTCachingDirectory(org.apache.lucene.store.NIOFSDirectory@/Users/jenkins/jenkins-slave/workspace/Lucene-Solr-trunk-MacOSX/solr/build/solr-core/test/J0/org.apache.solr.cloud.BasicDistributedZkTest-1359923479489/jetty3/index.20130203173139122 lockFactory=org.apache.lucene.store.NativeFSLockFactory@efa21ac; maxCacheMB=48.0 maxMergeSizeMB=4.0)) fullCopy=true
[junit4:junit4]   2> 19661 T2138 C198 P49902 REQ /replication {file=segments_2&command=filecontent&checksum=true&wt=filestream&qt=/replication&generation=2} status=0 QTime=1 
[junit4:junit4]   2> 19663 T2180 C196 P49908 oasc.CachingDirectoryFactory.close Releasing directory:/Users/jenkins/jenkins-slave/workspace/Lucene-Solr-trunk-MacOSX/solr/build/solr-core/test/J0/./org.apache.solr.cloud.BasicDistributedZkTest-1359923479489/jetty3/index
[junit4:junit4]   2> 19663 T2180 C196 P49908 oash.SnapPuller.fetchLatestIndex Total time taken for download : 0 secs
[junit4:junit4]   2> 19664 T2180 C196 P49908 oash.SnapPuller.modifyIndexProps New index installed. Updating index properties... index=index.20130203173139122
[junit4:junit4]   2> 19666 T2180 C196 P49908 oasc.CachingDirectoryFactory.close Releasing directory:/Users/jenkins/jenkins-slave/workspace/Lucene-Solr-trunk-MacOSX/solr/build/solr-core/test/J0/./org.apache.solr.cloud.BasicDistributedZkTest-1359923479489/jetty3
[junit4:junit4]   2> 19667 T2180 C196 P49908 oasc.CachingDirectoryFactory.close Releasing directory:/Users/jenkins/jenkins-slave/workspace/Lucene-Solr-trunk-MacOSX/solr/build/solr-core/test/J0/./org.apache.solr.cloud.BasicDistributedZkTest-1359923479489/jetty3
[junit4:junit4]   2> 19667 T2180 C196 P49908 oasc.SolrCore.getNewIndexDir New index directory detected: old=./org.apache.solr.cloud.BasicDistributedZkTest-1359923479489/jetty3/index/ new=./org.apache.solr.cloud.BasicDistributedZkTest-1359923479489/jetty3/index.20130203173139122
[junit4:junit4]   2> 19671 T2180 C196 P49908 oasc.SolrDeletionPolicy.onInit SolrDeletionPolicy.onInit: commits:num=1
[junit4:junit4]   2> 		commit{dir=RateLimitedDirectoryWrapper(NRTCachingDirectory(org.apache.lucene.store.NIOFSDirectory@/Users/jenkins/jenkins-slave/workspace/Lucene-Solr-trunk-MacOSX/solr/build/solr-core/test/J0/org.apache.solr.cloud.BasicDistributedZkTest-1359923479489/jetty3/index.20130203173139122 lockFactory=org.apache.lucene.store.NativeFSLockFactory@efa21ac; maxCacheMB=48.0 maxMergeSizeMB=4.0)),segFN=segments_2,generation=2,filenames=[segments_2]
[junit4:junit4]   2> 19673 T2180 C196 P49908 oasc.SolrDeletionPolicy.updateCommits newest commit = 2[segments_2]
[junit4:junit4]   2> 19674 T2180 C196 P49908 oasc.CachingDirectoryFactory.close Releasing directory:/Users/jenkins/jenkins-slave/workspace/Lucene-Solr-trunk-MacOSX/solr/build/solr-core/test/J0/./org.apache.solr.cloud.BasicDistributedZkTest-1359923479489/jetty3
[junit4:junit4]   2> 19674 T2180 C196 P49908 oasu.DefaultSolrCoreState.newIndexWriter Creating new IndexWriter...
[junit4:junit4]   2> 19675 T2180 C196 P49908 oasu.DefaultSolrCoreState.newIndexWriter Waiting until IndexWriter is unused... core=collection1
[junit4:junit4]   2> 19675 T2180 C196 P49908 oasu.DefaultSolrCoreState.newIndexWriter Rollback old IndexWriter... core=collection1
[junit4:junit4]   2> 19675 T2180 C196 P49908 oasc.CachingDirectoryFactory.close Releasing directory:/Users/jenkins/jenkins-slave/workspace/Lucene-Solr-trunk-MacOSX/solr/build/solr-core/test/J0/./org.apache.solr.cloud.BasicDistributedZkTest-1359923479489/jetty3/index.20130203173139122
[junit4:junit4]   2> 19676 T2180 C196 P49908 oasc.CachingDirectoryFactory.close Releasing directory:/Users/jenkins/jenkins-slave/workspace/Lucene-Solr-trunk-MacOSX/solr/build/solr-core/test/J0/./org.apache.solr.cloud.BasicDistributedZkTest-1359923479489/jetty3
[junit4:junit4]   2> 19680 T2180 C196 P49908 oasc.SolrDeletionPolicy.onInit SolrDeletionPolicy.onInit: commits:num=1
[junit4:junit4]   2> 		commit{dir=RateLimitedDirectoryWrapper(NRTCachingDirectory(org.apache.lucene.store.NIOFSDirectory@/Users/jenkins/jenkins-slave/workspace/Lucene-Solr-trunk-MacOSX/solr/build/solr-core/test/J0/org.apache.solr.cloud.BasicDistributedZkTest-1359923479489/jetty3/index.20130203173139122 lockFactory=org.apache.lucene.store.NativeFSLockFactory@efa21ac; maxCacheMB=48.0 maxMergeSizeMB=4.0)),segFN=segments_2,generation=2,filenames=[segments_2]
[junit4:junit4]   2> 19680 T2180 C196 P49908 oasc.SolrDeletionPolicy.updateCommits newest commit = 2[segments_2]
[junit4:junit4]   2> 19681 T2180 C196 P49908 oasu.DefaultSolrCoreState.newIndexWriter New IndexWriter is ready to be used.
[junit4:junit4]   2> 19682 T2180 C196 P49908 oasc.CachingDirectoryFactory.close Releasing directory:/Users/jenkins/jenkins-slave/workspace/Lucene-Solr-trunk-MacOSX/solr/build/solr-core/test/J0/./org.apache.solr.cloud.BasicDistributedZkTest-1359923479489/jetty3
[junit4:junit4]   2> 19683 T2180 C196 P49908 oass.SolrIndexSearcher.<init> Opening Searcher@12fdc075 main
[junit4:junit4]   2> 19686 T2179 oasc.SolrCore.registerSearcher [collection1] Registered new searcher Searcher@12fdc075 main{StandardDirectoryReader(segments_2:1:nrt)}
[junit4:junit4]   2> 19686 T2179 oasc.CachingDirectoryFactory.close Releasing directory:/Users/jenkins/jenkins-slave/workspace/Lucene-Solr-trunk-MacOSX/solr/build/solr-core/test/J0/./org.apache.solr.cloud.BasicDistributedZkTest-1359923479489/jetty3/index
[junit4:junit4]   2> 19687 T2180 C196 P49908 oasu.DirectUpdateHandler2.commit start commit{,optimize=false,openSearcher=false,waitSearcher=false,expungeDeletes=false,softCommit=false}
[junit4:junit4]   2> 19690 T2180 C196 P49908 oasc.SolrDeletionPolicy.onCommit SolrDeletionPolicy.onCommit: commits:num=2
[junit4:junit4]   2> 		commit{dir=RateLimitedDirectoryWrapper(NRTCachingDirectory(org.apache.lucene.store.NIOFSDirectory@/Users/jenkins/jenkins-slave/workspace/Lucene-Solr-trunk-MacOSX/solr/build/solr-core/test/J0/org.apache.solr.cloud.BasicDistributedZkTest-1359923479489/jetty3/index.20130203173139122 lockFactory=org.apache.lucene.store.NativeFSLockFactory@efa21ac; maxCacheMB=48.0 maxMergeSizeMB=4.0)),segFN=segments_2,generation=2,filenames=[segments_2]
[junit4:junit4]   2> 		commit{dir=RateLimitedDirectoryWrapper(NRTCachingDirectory(org.apache.lucene.store.NIOFSDirectory@/Users/jenkins/jenkins-slave/workspace/Lucene-Solr-trunk-MacOSX/solr/build/solr-core/test/J0/org.apache.solr.cloud.BasicDistributedZkTest-1359923479489/jetty3/index.20130203173139122 lockFactory=org.apache.lucene.store.NativeFSLockFactory@efa21ac; maxCacheMB=48.0 maxMergeSizeMB=4.0)),segFN=segments_3,generation=3,filenames=[segments_3]
[junit4:junit4]   2> 19691 T2180 C196 P49908 oasc.SolrDeletionPolicy.updateCommits newest commit = 3[segments_3]
[junit4:junit4]   2> 19693 T2180 C196 P49908 oasc.CachingDirectoryFactory.close Releasing directory:/Users/jenkins/jenkins-slave/workspace/Lucene-Solr-trunk-MacOSX/solr/build/solr-core/test/J0/./org.apache.solr.cloud.BasicDistributedZkTest-1359923479489/jetty3
[junit4:junit4]   2> 19693 T2180 C196 P49908 oasu.DirectUpdateHandler2.commit end_commit_flush
[junit4:junit4]   2> 19694 T2180 C196 P49908 oasc.CachingDirectoryFactory.close Releasing directory:/Users/jenkins/jenkins-slave/workspace/Lucene-Solr-trunk-MacOSX/solr/build/solr-core/test/J0/./org.apache.solr.cloud.BasicDistributedZkTest-1359923479489/jetty3/index.20130203173139122
[junit4:junit4]   2> 19694 T2180 C196 P49908 oasc.CachingDirectoryFactory.close Releasing directory:/Users/jenkins/jenkins-slave/workspace/Lucene-Solr-trunk-MacOSX/solr/build/solr-core/test/J0/./org.apache.solr.cloud.BasicDistributedZkTest-1359923479489/jetty3/index
[junit4:junit4]   2> 19694 T2180 C196 P49908 oasc.RecoveryStrategy.replay No replay needed. core=collection1
[junit4:junit4]   2> 19695 T2180 C196 P49908 oasc.RecoveryStrategy.doRecovery Replication Recovery was successful - registering as Active. core=collection1
[junit4:junit4]   2> 19695 T2180 C196 P49908 oasc.ZkController.publish publishing core=collection1 state=active
[junit4:junit4]   2> 19695 T2180 C196 P49908 oasc.ZkController.publish numShards not found on descriptor - reading it from system property
[junit4:junit4]   2> 19698 T2180 C196 P49908 oasc.RecoveryStrategy.doRecovery Finished recovery process. core=collection1
[junit4:junit4]   2> 20223 T2106 oascc.ZkStateReader.updateClusterState Updating cloud state from ZooKeeper... 
[junit4:junit4]   2> 20554 T2129 oascc.ZkStateReader.updateClusterState Updating cloud state from ZooKeeper... 
[junit4:junit4]   2> 20558 T2129 oasc.Overseer$ClusterStateUpdater.updateState Update state numShards=2 message={
[junit4:junit4]   2> 	  "operation":"state",
[junit4:junit4]   2> 	  "numShards":"2",
[junit4:junit4]   2> 	  "shard":"shard2",
[junit4:junit4]   2> 	  "roles":null,
[junit4:junit4]   2> 	  "state":"recovering",
[junit4:junit4]   2> 	  "core":"collection1",
[junit4:junit4]   2> 	  "collection":"collection1",
[junit4:junit4]   2> 	  "node_name":"127.0.0.1:49912_",
[junit4:junit4]   2> 	  "base_url":"http://127.0.0.1:49912"}
[junit4:junit4]   2> 20565 T2129 oasc.Overseer$ClusterStateUpdater.updateState Update state numShards=2 message={
[junit4:junit4]   2> 	  "operation":"state",
[junit4:junit4]   2> 	  "numShards":"2",
[junit4:junit4]   2> 	  "shard":"shard1",
[junit4:junit4]   2> 	  "roles":null,
[junit4:junit4]   2> 	  "state":"active",
[junit4:junit4]   2> 	  "core":"collection1",
[junit4:junit4]   2> 	  "collection":"collection1",
[junit4:junit4]   2> 	  "node_name":"127.0.0.1:49908_",
[junit4:junit4]   2> 	  "base_url":"http://127.0.0.1:49908"}
[junit4:junit4]   2> 20575 T2177 oascc.ZkStateReader$2.process A cluster state change: WatchedEvent state:SyncConnected type:NodeDataChanged path:/clusterstate.json, has occurred - updating... (live nodes size: 5)
[junit4:junit4]   2> 20576 T2134 oascc.ZkStateReader$2.process A cluster state change: WatchedEvent state:SyncConnected type:NodeDataChanged path:/clusterstate.json, has occurred - updating... (live nodes size: 5)
[junit4:junit4]   2> 20577 T2128 oascc.ZkStateReader$2.process A cluster state change: WatchedEvent state:SyncConnected type:NodeDataChanged path:/clusterstate.json, has occurred - updating... (live nodes size: 5)
[junit4:junit4]   2> 20578 T2147 oascc.ZkStateReader$2.process A cluster state change: WatchedEvent state:SyncConnected type:NodeDataChanged path:/clusterstate.json, has occurred - updating... (live nodes size: 5)
[junit4:junit4]   2> 20578 T2193 oascc.ZkStateReader$2.process A cluster state change: WatchedEvent state:SyncConnected type:NodeDataChanged path:/clusterstate.json, has occurred - updating... (live nodes size: 5)
[junit4:junit4]   2> 20579 T2162 oascc.ZkStateReader$2.process A cluster state change: WatchedEvent state:SyncConnected type:NodeDataChanged path:/clusterstate.json, has occurred - updating... (live nodes size: 5)
[junit4:junit4]   2> 21227 T2106 oascc.ZkStateReader.updateClusterState Updating cloud state from ZooKeeper... 
[junit4:junit4]   2> 22231 T2106 oascc.ZkStateReader.updateClusterState Updating cloud state from ZooKeeper... 
[junit4:junit4]   2>  C197_STATE=coll:collection1 core:collection1 props:{shard=shard2, roles=null, state=recovering, core=collection1, collection=collection1, node_name=127.0.0.1:49912_, base_url=http://127.0.0.1:49912}
[junit4:junit4]   2> 23205 T2196 C197 P49912 oasc.RecoveryStrategy.doRecovery Attempting to PeerSync from http://127.0.0.1:49905/collection1/ core=collection1 - recoveringAfterStartup=true
[junit4:junit4]   2> 23206 T2196 C197 P49912 oasu.PeerSync.sync PeerSync: core=collection1 url=http://127.0.0.1:49912 START replicas=[http://127.0.0.1:49905/collection1/] nUpdates=100
[junit4:junit4]   2> 23207 T2196 C197 P49912 oasu.PeerSync.sync WARNING no frame of reference to tell of we've missed updates
[junit4:junit4]   2> 23207 T2196 C197 P49912 oasc.RecoveryStrategy.doRecovery PeerSync Recovery was not successful - trying replication. core=collection1
[junit4:junit4]   2> 23207 T2196 C197 P49912 oasc.RecoveryStrategy.doRecovery Starting Replication Recovery. core=collection1
[junit4:junit4]   2> 23209 T2196 C197 P49912 oasc.RecoveryStrategy.doRecovery Begin buffering updates. core=collection1
[junit4:junit4]   2> 23209 T2196 C197 P49912 oasu.UpdateLog.bufferUpdates Starting to buffer updates. FSUpdateLog{state=ACTIVE, tlog=null}
[junit4:junit4]   2> 23209 T2196 C197 P49912 oasc.RecoveryStrategy.replicate Attempting to replicate from http://127.0.0.1:49905/collection1/. core=collection1
[junit4:junit4]   2> 23210 T2196 C197 P49912 oascsi.HttpClientUtil.createClient Creating new http client, config:maxConnections=128&maxConnectionsPerHost=32&followRedirects=false
[junit4:junit4]   2> ASYNC  NEW_CORE C199 name=collection1 org.apache.solr.core.SolrCore@7671000a url=http://127.0.0.1:49905/collection1 node=127.0.0.1:49905_ C199_STATE=coll:collection1 core:collection1 props:{shard=shard2, roles=null, state=active, core=collection1, collection=collection1, node_name=127.0.0.1:49905_, base_url=http://127.0.0.1:49905, leader=true}
[junit4:junit4]   2> 23215 T2155 C199 P49905 REQ /get {getVersions=100&distrib=false&wt=javabin&qt=/get&version=2} status=0 QTime=0 
[junit4:junit4]   2> 23221 T2157 C199 P49905 oasu.DirectUpdateHandler2.commit start commit{,optimize=false,openSearcher=false,waitSearcher=true,expungeDeletes=false,softCommit=false}
[junit4:junit4]   2> 23222 T2157 C199 P49905 oasc.CachingDirectoryFactory.close Releasing directory:/Users/jenkins/jenkins-slave/workspace/Lucene-Solr-trunk-MacOSX/solr/build/solr-core/test/J0/./org.apache.solr.cloud.BasicDistributedZkTest-1359923479489/jetty2
[junit4:junit4]   2> 23227 T2157 C199 P49905 oasc.SolrDeletionPolicy.onInit SolrDeletionPolicy.onInit: commits:num=1
[junit4:junit4]   2> 		commit{dir=RateLimitedDirectoryWrapper(NRTCachingDirectory(org.apache.lucene.store.NIOFSDirectory@/Users/jenkins/jenkins-slave/workspace/Lucene-Solr-trunk-MacOSX/solr/build/solr-core/test/J0/org.apache.solr.cloud.BasicDistributedZkTest-1359923479489/jetty2/index lockFactory=org.apache.lucene.store.NativeFSLockFactory@7487cae6; maxCacheMB=48.0 maxMergeSizeMB=4.0)),segFN=segments_1,generation=1,filenames=[segments_1]
[junit4:junit4]   2> 23228 T2157 C199 P49905 oasc.SolrDeletionPolicy.updateCommits newest commit = 1[segments_1]
[junit4:junit4]   2> 23230 T2157 C199 P49905 oasc.SolrDeletionPolicy.onCommit SolrDeletionPolicy.onCommit: commits:num=2
[junit4:junit4]   2> 		commit{dir=RateLimitedDirectoryWrapper(NRTCachingDirectory(org.apache.lucene.store.NIOFSDirectory@/Users/jenkins/jenkins-slave/workspace/Lucene-Solr-trunk-MacOSX/solr/build/solr-core/test/J0/org.apache.solr.cloud.BasicDistributedZkTest-1359923479489/jetty2/index lockFactory=org.apache.lucene.store.NativeFSLockFactory@7487cae6; maxCacheMB=48.0 maxMergeSizeMB=4.0)),segFN=segments_1,generation=1,filenames=[segments_1]
[junit4:junit4]   2> 		commit{dir=RateLimitedDirectoryWrapper(NRTCachingDirectory(org.apache.lucene.store.NIOFSDirectory@/Users/jenkins/jenkins-slave/workspace/Lucene-Solr-trunk-MacOSX/solr/build/solr-core/test/J0/org.apache.solr.cloud.BasicDistributedZkTest-1359923479489/jetty2/index lockFactory=org.apache.lucene.store.NativeFSLockFactory@7487cae6; maxCacheMB=48.0 maxMergeSizeMB=4.0)),segFN=segments_2,generation=2,filenames=[segments_2]
[junit4:junit4]   2> 23231 T2157 C199 P49905 oasc.SolrDeletionPolicy.updateCommits newest commit = 2[segments_2]
[junit4:junit4]   2> 23232 T2157 C199 P49905 oasc.CachingDirectoryFactory.close Releasing directory:/Users/jenkins/jenkins-slave/workspace/Lucene-Solr-trunk-MacOSX/solr/build/solr-core/test/J0/./org.apache.solr.cloud.BasicDistributedZkTest-1359923479489/jetty2
[junit4:junit4]   2> 23233 T2157 C199 P49905 oass.SolrIndexSearcher.<init> Opening Searcher@1c4059e5 realtime
[junit4:junit4]   2> 23233 T2157 C199 P49905 oasu.DirectUpdateHandler2.commit end_commit_flush
[junit4:junit4]   2> 23234 T2157 C199 P49905 /update {waitSearcher=true&openSearcher=false&commit=true&wt=javabin&commit_end_point=true&version=2&softCommit=false} {commit=} 0 14
[junit4:junit4]   2> 23235 T2196 C197 P49912 oash.ReplicationHandler.inform Commits will be reserved for  10000
[junit4:junit4]   2> 23235 T2196 C197 P49912 oash.SnapPuller.<init>  No value set for 'pollInterval'. Timer Task not started.
[junit4:junit4]   2> 23239 T2106 oascc.ZkStateReader.updateClusterState Updating cloud state from ZooKeeper... 
[junit4:junit4]   2> 23241 T2153 C199 P49905 oash.ReplicationHandler.inform Commits will be reserved for  10000
[junit4:junit4]   2> 23242 T2153 C199 P49905 REQ /replication {command=indexversion&qt=/replication&wt=javabin&version=2} status=0 QTime=2 
[junit4:junit4]   2> 23243 T2196 C197 P49912 oash.SnapPuller.fetchLatestIndex Master's generation: 2
[junit4:junit4]   2> 23243 T2196 C197 P49912 oash.SnapPuller.fetchLatestIndex Slave's generation: 1
[junit4:junit4]   2> 23243 T2196 C197 P49912 oash.SnapPuller.fetchLatestIndex Starting replication process
[junit4:junit4]   2> 23245 T2154 C199 P49905 oasc.CachingDirectoryFactory.close Releasing directory:/Users/jenkins/jenkins-slave/workspace/Lucene-Solr-trunk-MacOSX/solr/build/solr-core/test/J0/./org.apache.solr.cloud.BasicDistributedZkTest-1359923479489/jetty2
[junit4:junit4]   2> 23246 T2154 C199 P49905 oasc.CachingDirectoryFactory.close Releasing directory:/Users/jenkins/jenkins-slave/workspace/Lucene-Solr-trunk-MacOSX/solr/build/solr-core/test/J0/./org.apache.solr.cloud.BasicDistributedZkTest-1359923479489/jetty2/index
[junit4:junit4]   2> 23246 T2154 C199 P49905 REQ /replication {command=filelist&qt=/replication&wt=javabin&generation=2&version=2} status=0 QTime=1 
[junit4:junit4]   2> 23247 T2196 C197 P49912 oash.SnapPuller.fetchLatestIndex Number of files in latest index in master: 1
[junit4:junit4]   2> 23253 T2196 C197 P49912 oasc.CachingDirectoryFactory.get return new directory for /Users/jenkins/jenkins-slave/workspace/Lucene-Solr-trunk-MacOSX/solr/build/solr-core/test/J0/./org.apache.solr.cloud.BasicDistributedZkTest-1359923479489/jetty4/index.20130203173142724 forceNew:false
[junit4:junit4]   2> 23255 T2196 C197 P49912 oasc.CachingDirectoryFactory.close Releasing directory:/Users/jenkins/jenkins-slave/workspace/Lucene-Solr-trunk-MacOSX/solr/build/solr-core/test/J0/./org.apache.solr.cloud.BasicDistributedZkTest-1359923479489/jetty4
[junit4:junit4]   2> 23257 T2196 C197 P49912 oash.SnapPuller.fetchLatestIndex Starting download to RateLimitedDirectoryWrapper(NRTCachingDirectory(org.apache.lucene.store.NIOFSDirectory@/Users/jenkins/jenkins-slave/workspace/Lucene-Solr-trunk-MacOSX/solr/build/solr-core/test/J0/org.apache.solr.cloud.BasicDistributedZkTest-1359923479489/jetty4/index.20130203173142724 lockFactory=org.apache.lucene.store.NativeFSLockFactory@1518f71f; maxCacheMB=48.0 maxMergeSizeMB=4.0)) fullCopy=true
[junit4:junit4]   2> 23261 T2155 C199 P49905 REQ /replication {file=segments_2&command=filecontent&checksum=true&wt=filestream&qt=/replication&generation=2} status=0 QTime=1 
[junit4:junit4]   2> 23263 T2196 C197 P49912 oasc.CachingDirectoryFactory.close Releasing directory:/Users/jenkins/jenkins-slave/workspace/Lucene-Solr-trunk-MacOSX/solr/build/solr-core/test/J0/./org.apache.solr.cloud.BasicDistributedZkTest-1359923479489/jetty4/index
[junit4:junit4]   2> 23263 T2196 C197 P49912 oash.SnapPuller.fetchLatestIndex Total time taken for download : 0 secs
[junit4:junit4]   2> 23264 T2196 C197 P49912 oash.SnapPuller.modifyIndexProps New index installed. Updating index properties... index=index.20130203173142724
[junit4:junit4]   2> 23265 T2196 C197 P49912 oasc.CachingDirectoryFactory.close Releasing directory:/Users/jenkins/jenkins-slave/workspace/Lucene-Solr-trunk-MacOSX/solr/build/solr-core/test/J0/./org.apache.solr.cloud.BasicDistributedZkTest-1359923479489/jetty4
[junit4:junit4]   2> 23266 T2196 C197 P49912 oasc.CachingDirectoryFactory.close Releasing directory:/Users/jenkins/jenkins-slave/workspace/Lucene-Solr-trunk-MacOSX/solr/build/solr-core/test/J0/./org.apache.solr.cloud.BasicDistributedZkTest-1359923479489/jetty4
[junit4:junit4]   2> 23266 T2196 C197 P49912 oasc.SolrCore.getNewIndexDir New index directory detected: old=./org.apache.solr.cloud.BasicDistributedZkTest-1359923479489/jetty4/index/ new=./org.apache.solr.cloud.BasicDistributedZkTest-1359923479489/jetty4/index.20130203173142724
[junit4:junit4]   2> 23270 T2196 C197 P49912 oasc.SolrDeletionPolicy.onInit SolrDeletionPolicy.onInit: commits:num=1
[junit4:junit4]   2> 		commit{dir=RateLimitedDirectoryWrapper(NRTCachingDirectory(org.apache.lucene.store.NIOFSDirectory@/Users/jenkins/jenkins-slave/workspace/Lucene-Solr-trunk-MacOSX/solr/build/solr-core/test/J0/org.apache.solr.cloud.BasicDistributedZkTest-1359923479489/jetty4/index.20130203173142724 lockFactory=org.apache.lucene.store.NativeFSLockFactory@1518f71f; maxCacheMB=48.0 maxMergeSizeMB=4.0)),segFN=segments_2,generation=2,filenames=[segments_2]
[junit4:junit4]   2> 23271 T2196 C197 P49912 oasc.SolrDeletionPolicy.updateCommits newest commit = 2[segments_2]
[junit4:junit4]   2> 23272 T2196 C197 P49912 oasc.CachingDirectoryFactory.close Releasing directory:/Users/jenkins/jenkins-slave/workspace/Lucene-Solr-trunk-MacOSX/solr/build/solr-core/test/J0/./org.apache.solr.cloud.BasicDistributedZkTest-1359923479489/jetty4
[junit4:junit4]   2> 23273 T2196 C197 P49912 oasu.DefaultSolrCoreState.newIndexWriter Creating new IndexWriter...
[junit4:junit4]   2> 23273 T2196 C197 P49912 oasu.DefaultSolrCoreState.newIndexWriter Waiting until IndexWriter is unused... core=collection1
[junit4:junit4]   2> 23273 T2196 C197 P49912 oasu.DefaultSolrCoreState.newIndexWriter Rollback old IndexWriter... core=collection1
[junit4:junit4]   2> 23274 T2196 C197 P49912 oasc.CachingDirectoryFactory.close Releasing directory:/Users/jenkins/jenkins-slave/workspace/Lucene-Solr-trunk-MacOSX/solr/build/solr-core/test/J0/./org.apache.solr.cloud.BasicDistributedZkTest-1359923479489/jetty4/index.20130203173142724
[junit4:junit4]   2> 23275 T2196 C197 P49912 oasc.CachingDirectoryFactory.close Releasing directory:/Users/jenkins/jenkins-slave/workspace/Lucene-Solr-trunk-MacOSX/solr/build/solr-core/test/J0/./org.apache.solr.cloud.BasicDistributedZkTest-1359923479489/jetty4
[junit4:junit4]   2> 23278 T2196 C197 P49912 oasc.SolrDeletionPolicy.onInit SolrDeletionPolicy.onInit: commits:num=1
[junit4:junit4]   2> 		commit{dir=RateLimitedDirectoryWrapper(NRTCachingDirectory(org.apache.lucene.store.NIOFSDirectory@/Users/jenkins/jenkins-slave/workspace/Lucene-Solr-trunk-MacOSX/solr/build/solr-core/test/J0/org.apache.solr.cloud.BasicDistributedZkTest-1359923479489/jetty4/index.20130203173142724 lockFactory=org.apache.lucene.store.NativeFSLockFactory@1518f71f; maxCacheMB=48.0 maxMergeSizeMB=4.0)),segFN=segments_2,generation=2,filenames=[segments_2]
[junit4:junit4]   2> 23279 T2196 C197 P49912 oasc.SolrDeletionPolicy.updateCommits newest commit = 2[segments_2]
[junit4:junit4]   2> 23279 T2196 C197 P49912 oasu.DefaultSolrCoreState.newIndexWriter New IndexWriter is ready to be used.
[junit4:junit4]   2> 23280 T2196 C197 P49912 oasc.CachingDirectoryFactory.close Releasing directory:/Users/jenkins/jenkins-slave/workspace/Lucene-Solr-trunk-MacOSX/solr/build/solr-core/test/J0/./org.apache.solr.cloud.BasicDistributedZkTest-1359923479489/jetty4
[junit4:junit4]   2> 23280 T2196 C197 P49912 oass.SolrIndexSearcher.<init> Opening Searcher@23811bd4 main
[junit4:junit4]   2> 23283 T2195 oasc.SolrCore.registerSearcher [collection1] Registered new searcher Searcher@23811bd4 main{StandardDirectoryReader(segments_2:1:nrt)}
[junit4:junit4]   2> 23284 T2195 oasc.CachingDirectoryFactory.close Releasing directory:/Users/jenkins/jenkins-slave/workspace/Lucene-Solr-trunk-MacOSX/solr/build/solr-core/test/J0/./org.apache.solr.cloud.BasicDistributedZkTest-1359923479489/jetty4/index
[junit4:junit4]   2> 23284 T2196 C197 P49912 oasu.DirectUpdateHandler2.commit start commit{,optimize=false,openSearcher=false,waitSearcher=false,expungeDeletes=false,softCommit=false}
[junit4:junit4]   2> 23287 T2196 C197 P49912 oasc.SolrDeletionPolicy.onCommit SolrDeletionPolicy.onCommit: commits:num=2
[junit4:junit4]   2> 		commit{dir=RateLimitedDirectoryWrapper(NRTCachingDirectory(org.apache.lucene.store.NIOFSDirectory@/Users/jenkins/jenkins-slave/workspace/Lucene-Solr-trunk-MacOSX/solr/build/solr-core/test/J0/org.apache.solr.cloud.BasicDistributedZkTest-1359923479489/jetty4/index.20130203173142724 lockFactory=org.apache.lucene.store.NativeFSLockFactory@1518f71f; maxCacheMB=48.0 maxMergeSizeMB=4.0)),segFN=segments_2,generation=2,filenames=[segments_2]
[junit4:junit4]   2> 		commit{dir=RateLimitedDirectoryWrapper(NRTCachingDirectory(org.apache.lucene.store.NIOFSDirectory@/Users/jenkins/jenkins-slave/workspace/Lucene-Solr-trunk-MacOSX/solr/build/solr-core/test/J0/org.apache.solr.cloud.BasicDistributedZkTest-1359923479489/jetty4/index.20130203173142724 lockFactory=org.apache.lucene.store.NativeFSLockFactory@1518f71f; maxCacheMB=48.0 maxMergeSizeMB=4.0)),segFN=segments_3,generation=3,filenames=[segments_3]
[junit4:junit4]   2> 23287 T2196 C197 P49912 oasc.SolrDeletionPolicy.updateCommits newest commit = 3[segments_3]
[junit4:junit4]   2> 23288 T2196 C197 P49912 oasc.CachingDirectoryFactory.close Releasing directory:/Users/jenkins/jenkins-slave/workspace/Lucene-Solr-trunk-MacOSX/solr/build/solr-core/test/J0/./org.apache.solr.cloud.BasicDistributedZkTest-1359923479489/jetty4
[junit4:junit4]   2> 23289 T2196 C197 P49912 oasu.DirectUpdateHandler2.commit end_commit_flush
[junit4:junit4]   2> 23289 T2196 C197 P49912 oasc.CachingDirectoryFactory.close Releasing directory:/Users/jenkins/jenkins-slave/workspace/Lucene-Solr-trunk-MacOSX/solr/build/solr-core/test/J0/./org.apache.solr.cloud.BasicDistributedZkTest-1359923479489/jetty4/index.20130203173142724
[junit4:junit4]   2> 23289 T2196 C197 P49912 oasc.CachingDirectoryFactory.close Releasing directory:/Users/jenkins/jenkins-slave/workspace/Lucene-Solr-trunk-MacOSX/solr/build/solr-core/test/J0/./org.apache.solr.cloud.BasicDistributedZkTest-1359923479489/jetty4/index
[junit4:junit4]   2> 23290 T2196 C197 P49912 oasc.RecoveryStrategy.replay No replay needed. core=collection1
[junit4:junit4]   2> 23290 T2196 C197 P49912 oasc.RecoveryStrategy.doRecovery Replication Recovery was successful - registering as Active. core=collection1
[junit4:junit4]   2> 23290 T2196 C197 P49912 oasc.ZkController.publish publishing core=collection1 state=active
[junit4:junit4]   2> 23290 T2196 C197 P49912 oasc.ZkController.publish numShards not found on descriptor - reading it from system property
[junit4:junit4]   2> 23292 T2196 C197 P49912 oasc.RecoveryStrategy.doRecovery Finished recovery process. core=collection1
[junit4:junit4]   2> 23615 T2129 oascc.ZkStateReader.updateClusterState Updating cloud state from ZooKeeper... 
[junit4:junit4]   2> 23616 T2129 oasc.Overseer$ClusterStateUpdater.updateState Update state numShards=2 message={
[junit4:junit4]   2> 	  "operation":"state",
[junit4:junit4]   2> 	  "numShards":"2",
[junit4:junit4]   2> 	  "shard":"shard2",
[junit4:junit4]   2> 	  "roles":null,
[junit4:junit4]   2> 	  "state":"active",
[junit4:junit4]   2> 	  "core":"collection1",
[junit4:junit4]   2> 	  "collection":"collection1",
[junit4:junit4]   2> 	  "node_name":"127.0.0.1:49912_",
[junit4:junit4]   2> 	  "base_url":"http://127.0.0.1:49912"}
[junit4:junit4]   2> 23626 T2128 oascc.ZkStateReader$2.process A cluster state change: WatchedEvent state:SyncConnected type:NodeDataChanged path:/clusterstate.json, has occurred - updating... (live nodes size: 5)
[junit4:junit4]   2> 23626 T2193 oascc.ZkStateReader$2.process A cluster state change: WatchedEvent state:SyncConnected type:NodeDataChanged path:/clusterstate.json, has occurred - updating... (live nodes size: 5)
[junit4:junit4]   2> 23627 T2147 oascc.ZkStateReader$2.process A cluster state change: WatchedEvent state:SyncConnected type:NodeDataChanged path:/clusterstate.json, has occurred - updating... (live nodes size: 5)
[junit4:junit4]   2> 23634 T2134 oascc.ZkStateReader$2.process A cluster state change: WatchedEvent state:SyncConnected type:NodeDataChanged path:/clusterstate.json, has occurred - updating... (live nodes size: 5)
[junit4:junit4]   2> 23636 T2177 oascc.ZkStateReader$2.process A cluster state change: WatchedEvent state:SyncConnected type:NodeDataChanged path:/clusterstate.json, has occurred - updating... (live nodes size: 5)
[junit4:junit4]   2> 23637 T2162 oascc.ZkStateReader$2.process A cluster state change: WatchedEvent state:SyncConnected type:NodeDataChanged path:/clusterstate.json, has occurred - updating... (live nodes size: 5)
[junit4:junit4]   2> 24246 T2106 oascc.ZkStateReader.updateClusterState Updating cloud state from ZooKeeper... 
[junit4:junit4]   2> 24248 T2106 oasc.AbstractDistribZkTestBase.waitForRecoveriesToFinish Recoveries finished - collection: collection1
[junit4:junit4]   2> ASYNC  NEW_CORE C200 name=collection1 org.apache.solr.core.SolrCore@2a0bb24a url=http://127.0.0.1:49898/collection1 node=127.0.0.1:49898_ C200_STATE=coll:control_collection core:collection1 props:{shard=shard1, roles=null, state=active, core=collection1, collection=control_collection, node_name=127.0.0.1:49898_, base_url=http://127.0.0.1:49898, leader=true}
[junit4:junit4]   2> 24270 T2122 C200 P49898 oasc.CachingDirectoryFactory.close Releasing directory:/Users/jenkins/jenkins-slave/workspace/Lucene-Solr-trunk-MacOSX/solr/build/solr-core/test/J0/./org.apache.solr.cloud.BasicDistributedZkTest-1359923479489/control/data
[junit4:junit4]   2> 24277 T2122 C200 P49898 oasc.SolrDeletionPolicy.onInit SolrDeletionPolicy.onInit: commits:num=1
[junit4:junit4]   2> 		commit{dir=RateLimitedDirectoryWrapper(NRTCachingDirectory(org.apache.lucene.store.NIOFSDirectory@/Users/jenkins/jenkins-slave/workspace/Lucene-Solr-trunk-MacOSX/solr/build/solr-core/test/J0/org.apache.solr.cloud.BasicDistributedZkTest-1359923479489/control/data/index lockFactory=org.apache.lucene.store.NativeFSLockFactory@159c976b; maxCacheMB=48.0 maxMergeSizeMB=4.0)),segFN=segments_1,generation=1,filenames=[segments_1]
[junit4:junit4]   2> 24278 T2122 C200 P49898 oasc.SolrDeletionPolicy.updateCommits newest commit = 1[segments_1]
[junit4:junit4]   2> 24280 T2122 C200 P49898 oasc.CachingDirectoryFactory.close Releasing directory:/Users/jenkins/jenkins-slave/workspace/Lucene-Solr-trunk-MacOSX/solr/build/solr-core/test/J0/./org.apache.solr.cloud.BasicDistributedZkTest-1359923479489/control/data
[junit4:junit4]   2> 24281 T2122 C200 P49898 oass.SolrIndexSearcher.<init> Opening Searcher@4304170b realtime
[junit4:junit4]   2> 24282 T2122 C200 P49898 /update {wt=javabin&version=2} {deleteByQuery=*:* (-1425983147859771392)} 0 14
[junit4:junit4]   2> 24290 T2152 C199 P49905 oasc.CachingDirectoryFactory.close Releasing directory:/Users/jenkins/jenkins-slave/workspace/Lucene-Solr-trunk-MacOSX/solr/build/solr-core/test/J0/./org.apache.solr.cloud.BasicDistributedZkTest-1359923479489/jetty2
[junit4:junit4]   2>  C197_STATE=coll:collection1 core:collection1 props:{shard=shard2, role

[...truncated too long message...]

le.java:46)
[junit4:junit4]    > 	at org.apache.lucene.util.TestRuleStoreClassName$1.evaluate(TestRuleStoreClassName.java:42)
[junit4:junit4]    > 	at com.carrotsearch.randomizedtesting.rules.SystemPropertiesInvariantRule$1.evaluate(SystemPropertiesInvariantRule.java:55)
[junit4:junit4]    > 	at com.carrotsearch.randomizedtesting.rules.NoShadowingOrOverridesOnMethodsRule$1.evaluate(NoShadowingOrOverridesOnMethodsRule.java:39)
[junit4:junit4]    > 	at com.carrotsearch.randomizedtesting.rules.NoShadowingOrOverridesOnMethodsRule$1.evaluate(NoShadowingOrOverridesOnMethodsRule.java:39)
[junit4:junit4]    > 	at com.carrotsearch.randomizedtesting.rules.StatementAdapter.evaluate(StatementAdapter.java:36)
[junit4:junit4]    > 	at org.apache.lucene.util.TestRuleAssertionsRequired$1.evaluate(TestRuleAssertionsRequired.java:43)
[junit4:junit4]    > 	at org.apache.lucene.util.TestRuleMarkFailure$1.evaluate(TestRuleMarkFailure.java:48)
[junit4:junit4]    > 	at org.apache.lucene.util.TestRuleIgnoreAfterMaxFailures$1.evaluate(TestRuleIgnoreAfterMaxFailures.java:70)
[junit4:junit4]    > 	at org.apache.lucene.util.TestRuleIgnoreTestSuites$1.evaluate(TestRuleIgnoreTestSuites.java:55)
[junit4:junit4]    > 	at com.carrotsearch.randomizedtesting.rules.StatementAdapter.evaluate(StatementAdapter.java:36)
[junit4:junit4]    > 	at com.carrotsearch.randomizedtesting.ThreadLeakControl$StatementRunner.run(ThreadLeakControl.java:358)
[junit4:junit4]    > 	at java.lang.Thread.run(Thread.java:722)
[junit4:junit4]    > Caused by: java.net.SocketException: Invalid argument
[junit4:junit4]    > 	at java.net.SocketInputStream.socketRead0(Native Method)
[junit4:junit4]    > 	at java.net.SocketInputStream.read(SocketInputStream.java:150)
[junit4:junit4]    > 	at java.net.SocketInputStream.read(SocketInputStream.java:121)
[junit4:junit4]    > 	at org.apache.http.impl.io.AbstractSessionInputBuffer.fillBuffer(AbstractSessionInputBuffer.java:149)
[junit4:junit4]    > 	at org.apache.http.impl.io.SocketInputBuffer.fillBuffer(SocketInputBuffer.java:111)
[junit4:junit4]    > 	at org.apache.http.impl.io.AbstractSessionInputBuffer.readLine(AbstractSessionInputBuffer.java:264)
[junit4:junit4]    > 	at org.apache.http.impl.conn.DefaultResponseParser.parseHead(DefaultResponseParser.java:98)
[junit4:junit4]    > 	at org.apache.http.impl.io.AbstractMessageParser.parse(AbstractMessageParser.java:252)
[junit4:junit4]    > 	at org.apache.http.impl.AbstractHttpClientConnection.receiveResponseHeader(AbstractHttpClientConnection.java:282)
[junit4:junit4]    > 	at org.apache.http.impl.conn.DefaultClientConnection.receiveResponseHeader(DefaultClientConnection.java:247)
[junit4:junit4]    > 	at org.apache.http.impl.conn.AbstractClientConnAdapter.receiveResponseHeader(AbstractClientConnAdapter.java:216)
[junit4:junit4]    > 	at org.apache.http.protocol.HttpRequestExecutor.doReceiveResponse(HttpRequestExecutor.java:298)
[junit4:junit4]    > 	at org.apache.http.protocol.HttpRequestExecutor.execute(HttpRequestExecutor.java:125)
[junit4:junit4]    > 	at org.apache.http.impl.client.DefaultRequestDirector.tryExecute(DefaultRequestDirector.java:647)
[junit4:junit4]    > 	at org.apache.http.impl.client.DefaultRequestDirector.execute(DefaultRequestDirector.java:464)
[junit4:junit4]    > 	at org.apache.http.impl.client.AbstractHttpClient.execute(AbstractHttpClient.java:820)
[junit4:junit4]    > 	at org.apache.http.impl.client.AbstractHttpClient.execute(AbstractHttpClient.java:754)
[junit4:junit4]    > 	at org.apache.http.impl.client.AbstractHttpClient.execute(AbstractHttpClient.java:732)
[junit4:junit4]    > 	at org.apache.solr.client.solrj.impl.HttpSolrServer.request(HttpSolrServer.java:353)
[junit4:junit4]    > 	... 44 more
[junit4:junit4]   2> 146342 T2106 oas.SolrTestCaseJ4.deleteCore ###deleteCore
[junit4:junit4]   2> NOTE: test params are: codec=Lucene42: {n_f1=PostingsFormat(name=SimpleText), foo_b=PostingsFormat(name=Memory doPackFST= true), cat=MockFixedIntBlock(blockSize=208), foo_d=PostingsFormat(name=TestBloomFilteredLucene41Postings), foo_f=PostingsFormat(name=Memory doPackFST= true), n_tl1=PostingsFormat(name=SimpleText), n_d1=MockFixedIntBlock(blockSize=208), rnd_b=PostingsFormat(name=TestBloomFilteredLucene41Postings), intDefault=MockFixedIntBlock(blockSize=208), n_td1=PostingsFormat(name=SimpleText), timestamp=MockFixedIntBlock(blockSize=208), id=PostingsFormat(name=TestBloomFilteredLucene41Postings), range_facet_sl=PostingsFormat(name=Memory doPackFST= true), range_facet_si=PostingsFormat(name=SimpleText), oddField_s=PostingsFormat(name=Memory doPackFST= true), sequence_i=PostingsFormat(name=Memory doPackFST= true), name=PostingsFormat(name=TestBloomFilteredLucene41Postings), foo_i=PostingsFormat(name=SimpleText), regex_dup_B_s=MockFixedIntBlock(blockSize=208), multiDefault=PostingsFormat(name=SimpleText), n_tf1=MockFixedIntBlock(blockSize=208), n_dt1=PostingsFormat(name=SimpleText), genre_s=PostingsFormat(name=Memory doPackFST= true), author_t=PostingsFormat(name=SimpleText), n_ti1=PostingsFormat(name=TestBloomFilteredLucene41Postings), range_facet_l=MockFixedIntBlock(blockSize=208), text=PostingsFormat(name=Memory doPackFST= true), _version_=MockFixedIntBlock(blockSize=208), val_i=PostingsFormat(name=TestBloomFilteredLucene41Postings), SubjectTerms_mfacet=MockFixedIntBlock(blockSize=208), series_t=PostingsFormat(name=SimpleText), a_t=MockFixedIntBlock(blockSize=208), n_tdt1=MockFixedIntBlock(blockSize=208), regex_dup_A_s=PostingsFormat(name=Memory doPackFST= true), price=PostingsFormat(name=Memory doPackFST= true), other_tl1=MockFixedIntBlock(blockSize=208), n_l1=MockFixedIntBlock(blockSize=208), a_si=PostingsFormat(name=SimpleText), inStock=PostingsFormat(name=Memory doPackFST= true)}, sim=RandomSimilarityProvider(queryNorm=false,coord=no): {}, locale=el_CY, timezone=America/Cordoba
[junit4:junit4]   2> NOTE: Mac OS X 10.8.2 x86_64/Oracle Corporation 1.7.0_10 (64-bit)/cpus=2,threads=1,free=238612784,total=452984832
[junit4:junit4]   2> NOTE: All tests run in this JVM: [TestQuerySenderNoQuery, TestOmitPositions, MinimalSchemaTest, TestLMDirichletSimilarityFactory, PrimUtilsTest, SolrRequestParserTest, JsonLoaderTest, JSONWriterTest, TestHashPartitioner, BasicDistributedZk2Test, LukeRequestHandlerTest, ScriptEngineTest, XmlUpdateRequestHandlerTest, IndexSchemaTest, ZkCLITest, ShardRoutingTest, FieldMutatingUpdateProcessorTest, TestSolrQueryParser, TestCharFilters, TestStressRecovery, TestIBSimilarityFactory, TestReload, TestQueryTypes, TestDocumentBuilder, BasicFunctionalityTest, UpdateRequestProcessorFactoryTest, XsltUpdateRequestHandlerTest, TestSolrDeletionPolicy2, TestRangeQuery, TestRemoteStreaming, TimeZoneUtilsTest, SimpleFacetsTest, StatsComponentTest, TestSolrIndexConfig, SampleTest, TestRTGBase, AlternateDirectoryTest, ClusterStateTest, CSVRequestHandlerTest, NoCacheHeaderTest, TestSolr4Spatial, TestSuggestSpellingConverter, TestAtomicUpdateErrorCases, PrimitiveFieldTypeTest, CollectionsAPIDistributedZkTest, QueryElevationComponentTest, TestPseudoReturnFields, OutputWriterTest, SuggesterWFSTTest, DOMUtilTest, PeerSyncTest, SpatialFilterTest, PluginInfoTest, TestBinaryField, StatelessScriptUpdateProcessorFactoryTest, TestSolrJ, TestSystemIdResolver, TestUpdate, SimplePostToolTest, FullSolrCloudDistribCmdsTest, BadComponentTest, LoggingHandlerTest, UniqFieldsUpdateProcessorFactoryTest, OverseerCollectionProcessorTest, TestCSVResponseWriter, NumericFieldsTest, IndexSchemaRuntimeFieldTest, EchoParamsTest, TestJmxIntegration, StandardRequestHandlerTest, TestDefaultSimilarityFactory, CoreContainerCoreInitFailuresTest, DocumentBuilderTest, TestGroupingSearch, CacheHeaderTest, TestCodecSupport, RegexBoostProcessorTest, NotRequiredUniqueKeyTest, TestArbitraryIndexDir, TestLuceneMatchVersion, TestFastLRUCache, SortByFunctionTest, TestLFUCache, TestTrie, TestExtendedDismaxParser, TestDocSet, SolrIndexConfigTest, DefaultValueUpdateProcessorTest, ShowFileRequestHandlerTest, TestCSVLoader, TestSolrCoreProperties, TestPartialUpdateDeduplication, PingRequestHandlerTest, TestMergePolicyConfig, TestSolrDeletionPolicy1, ExternalFileFieldSortTest, BadIndexSchemaTest, TestFaceting, RAMDirectoryFactoryTest, HighlighterTest, TestWordDelimiterFilterFactory, SpellingQueryConverterTest, RecoveryZkTest, TestWriterPerf, TestCoreContainer, SoftAutoCommitTest, DocumentAnalysisRequestHandlerTest, CurrencyFieldTest, RequestHandlersTest, TestRandomFaceting, DebugComponentTest, TermVectorComponentTest, DistributedSpellCheckComponentTest, TestDistributedGrouping, OpenExchangeRatesOrgProviderTest, AnalysisAfterCoreReloadTest, TestPHPSerializedResponseWriter, SpellCheckCollatorTest, ConvertedLegacyTest, TestStressLucene, TestElisionMultitermQuery, BasicDistributedZkTest]
[junit4:junit4] Completed in 146.70s, 1 test, 1 error <<< FAILURES!

[...truncated 382 lines...]
BUILD FAILED
/Users/jenkins/jenkins-slave/workspace/Lucene-Solr-trunk-MacOSX/build.xml:346: The following error occurred while executing this line:
/Users/jenkins/jenkins-slave/workspace/Lucene-Solr-trunk-MacOSX/build.xml:39: The following error occurred while executing this line:
/Users/jenkins/jenkins-slave/workspace/Lucene-Solr-trunk-MacOSX/solr/build.xml:178: The following error occurred while executing this line:
/Users/jenkins/jenkins-slave/workspace/Lucene-Solr-trunk-MacOSX/solr/common-build.xml:428: The following error occurred while executing this line:
/Users/jenkins/jenkins-slave/workspace/Lucene-Solr-trunk-MacOSX/lucene/common-build.xml:1176: The following error occurred while executing this line:
/Users/jenkins/jenkins-slave/workspace/Lucene-Solr-trunk-MacOSX/lucene/common-build.xml:841: There were test failures: 249 suites, 1038 tests, 1 error, 14 ignored (3 assumptions)

Total time: 69 minutes 55 seconds
Build step 'Invoke Ant' marked build as failure
Archiving artifacts
Recording test results
Description set: Java: 64bit/jdk1.7.0 -XX:+UseG1GC
Email was triggered for: Failure
Sending email for trigger: Failure



Mime
View raw message