lucene-dev mailing list archives

Site index · List index
Message view « Date » · « Thread »
Top « Date » · « Thread »
From Policeman Jenkins Server <jenk...@thetaphi.de>
Subject [JENKINS] Lucene-Solr-4.x-Linux (32bit/jdk1.8.0-ea-b65) - Build # 4486 - Failure!
Date Thu, 28 Feb 2013 06:48:42 GMT
Build: http://jenkins.thetaphi.de/job/Lucene-Solr-4.x-Linux/4486/
Java: 32bit/jdk1.8.0-ea-b65 -server -XX:+UseG1GC

16 tests failed.
FAILED:  junit.framework.TestSuite.org.apache.lucene.index.TestIndexWriterOnDiskFull

Error Message:
Suite timeout exceeded (>= 7200000 msec).

Stack Trace:
java.lang.Exception: Suite timeout exceeded (>= 7200000 msec).
	at __randomizedtesting.SeedInfo.seed([5DD61E228367FBB0]:0)


FAILED:  junit.framework.TestSuite.org.apache.lucene.index.TestNRTThreads

Error Message:
Captured an uncaught exception in thread: Thread[id=1561, name=Thread-1334, state=RUNNABLE, group=TGRP-TestNRTThreads]

Stack Trace:
com.carrotsearch.randomizedtesting.UncaughtExceptionError: Captured an uncaught exception in thread: Thread[id=1561, name=Thread-1334, state=RUNNABLE, group=TGRP-TestNRTThreads]
Caused by: java.lang.RuntimeException: org.apache.lucene.index.CorruptIndexException: docs out of order (73 <= 73 ) (docOut: MockIndexOutputWrapper(org.apache.lucene.store.FSDirectory$FSIndexOutput@1322c1))
	at __randomizedtesting.SeedInfo.seed([5DD61E228367FBB0]:0)
	at org.apache.lucene.index.ThreadedIndexingAndSearchingTestCase$1.run(ThreadedIndexingAndSearchingTestCase.java:300)
Caused by: org.apache.lucene.index.CorruptIndexException: docs out of order (73 <= 73 ) (docOut: MockIndexOutputWrapper(org.apache.lucene.store.FSDirectory$FSIndexOutput@1322c1))
	at org.apache.lucene.codecs.lucene41.Lucene41PostingsWriter.startDoc(Lucene41PostingsWriter.java:243)
	at org.apache.lucene.index.FreqProxTermsWriterPerField.flush(FreqProxTermsWriterPerField.java:475)
	at org.apache.lucene.index.FreqProxTermsWriter.flush(FreqProxTermsWriter.java:85)
	at org.apache.lucene.index.TermsHash.flush(TermsHash.java:116)
	at org.apache.lucene.index.DocInverter.flush(DocInverter.java:53)
	at org.apache.lucene.index.DocFieldProcessor.flush(DocFieldProcessor.java:81)
	at org.apache.lucene.index.DocumentsWriterPerThread.flush(DocumentsWriterPerThread.java:493)
	at org.apache.lucene.index.DocumentsWriter.doFlush(DocumentsWriter.java:422)
	at org.apache.lucene.index.DocumentsWriter.preUpdate(DocumentsWriter.java:292)
	at org.apache.lucene.index.DocumentsWriter.updateDocument(DocumentsWriter.java:361)
	at org.apache.lucene.index.IndexWriter.updateDocument(IndexWriter.java:1473)
	at org.apache.lucene.index.IndexWriter.updateDocument(IndexWriter.java:1445)
	at org.apache.lucene.index.ThreadedIndexingAndSearchingTestCase.updateDocument(ThreadedIndexingAndSearchingTestCase.java:105)
	at org.apache.lucene.index.ThreadedIndexingAndSearchingTestCase$1.run(ThreadedIndexingAndSearchingTestCase.java:252)


FAILED:  junit.framework.TestSuite.org.apache.lucene.search.TestPrefixInBooleanQuery

Error Message:
docs out of order (0 <= 0 ) (freqOut: org.apache.lucene.store.RAMOutputStream@af28dd)

Stack Trace:
org.apache.lucene.index.CorruptIndexException: docs out of order (0 <= 0 ) (freqOut: org.apache.lucene.store.RAMOutputStream@af28dd)
	at __randomizedtesting.SeedInfo.seed([5DD61E228367FBB0]:0)
	at org.apache.lucene.codecs.lucene40.Lucene40PostingsWriter.startDoc(Lucene40PostingsWriter.java:190)
	at org.apache.lucene.index.FreqProxTermsWriterPerField.flush(FreqProxTermsWriterPerField.java:475)
	at org.apache.lucene.index.FreqProxTermsWriter.flush(FreqProxTermsWriter.java:85)
	at org.apache.lucene.index.TermsHash.flush(TermsHash.java:116)
	at org.apache.lucene.index.DocInverter.flush(DocInverter.java:53)
	at org.apache.lucene.index.DocFieldProcessor.flush(DocFieldProcessor.java:81)
	at org.apache.lucene.index.DocumentsWriterPerThread.flush(DocumentsWriterPerThread.java:493)
	at org.apache.lucene.index.DocumentsWriter.doFlush(DocumentsWriter.java:422)
	at org.apache.lucene.index.DocumentsWriter.flushAllThreads(DocumentsWriter.java:559)
	at org.apache.lucene.index.IndexWriter.prepareCommitInternal(IndexWriter.java:2683)
	at org.apache.lucene.index.IndexWriter.commitInternal(IndexWriter.java:2827)
	at org.apache.lucene.index.IndexWriter.commit(IndexWriter.java:2807)
	at org.apache.lucene.index.RandomIndexWriter.maybeCommit(RandomIndexWriter.java:163)
	at org.apache.lucene.index.RandomIndexWriter.addDocument(RandomIndexWriter.java:155)
	at org.apache.lucene.index.RandomIndexWriter.addDocument(RandomIndexWriter.java:114)
	at org.apache.lucene.search.TestPrefixInBooleanQuery.beforeClass(TestPrefixInBooleanQuery.java:57)
	at sun.reflect.NativeMethodAccessorImpl.invoke0(Native Method)
	at sun.reflect.NativeMethodAccessorImpl.invoke(NativeMethodAccessorImpl.java:57)
	at sun.reflect.DelegatingMethodAccessorImpl.invoke(DelegatingMethodAccessorImpl.java:43)
	at java.lang.reflect.Method.invoke(Method.java:474)
	at com.carrotsearch.randomizedtesting.RandomizedRunner.invoke(RandomizedRunner.java:1559)
	at com.carrotsearch.randomizedtesting.RandomizedRunner.access$600(RandomizedRunner.java:79)
	at com.carrotsearch.randomizedtesting.RandomizedRunner$4.evaluate(RandomizedRunner.java:677)
	at com.carrotsearch.randomizedtesting.RandomizedRunner$5.evaluate(RandomizedRunner.java:693)
	at org.apache.lucene.util.AbstractBeforeAfterRule$1.evaluate(AbstractBeforeAfterRule.java:46)
	at org.apache.lucene.util.TestRuleStoreClassName$1.evaluate(TestRuleStoreClassName.java:42)
	at com.carrotsearch.randomizedtesting.rules.SystemPropertiesInvariantRule$1.evaluate(SystemPropertiesInvariantRule.java:55)
	at com.carrotsearch.randomizedtesting.rules.NoShadowingOrOverridesOnMethodsRule$1.evaluate(NoShadowingOrOverridesOnMethodsRule.java:39)
	at com.carrotsearch.randomizedtesting.rules.NoShadowingOrOverridesOnMethodsRule$1.evaluate(NoShadowingOrOverridesOnMethodsRule.java:39)
	at com.carrotsearch.randomizedtesting.rules.StatementAdapter.evaluate(StatementAdapter.java:36)
	at org.apache.lucene.util.TestRuleAssertionsRequired$1.evaluate(TestRuleAssertionsRequired.java:43)
	at org.apache.lucene.util.TestRuleMarkFailure$1.evaluate(TestRuleMarkFailure.java:48)
	at org.apache.lucene.util.TestRuleIgnoreAfterMaxFailures$1.evaluate(TestRuleIgnoreAfterMaxFailures.java:70)
	at org.apache.lucene.util.TestRuleIgnoreTestSuites$1.evaluate(TestRuleIgnoreTestSuites.java:55)
	at com.carrotsearch.randomizedtesting.rules.StatementAdapter.evaluate(StatementAdapter.java:36)
	at com.carrotsearch.randomizedtesting.ThreadLeakControl$StatementRunner.run(ThreadLeakControl.java:358)
	at java.lang.Thread.run(Thread.java:722)


FAILED:  junit.framework.TestSuite.org.apache.lucene.search.TestPrefixInBooleanQuery

Error Message:


Stack Trace:
java.lang.NullPointerException
	at __randomizedtesting.SeedInfo.seed([5DD61E228367FBB0]:0)
	at org.apache.lucene.search.TestPrefixInBooleanQuery.afterClass(TestPrefixInBooleanQuery.java:79)
	at sun.reflect.NativeMethodAccessorImpl.invoke0(Native Method)
	at sun.reflect.NativeMethodAccessorImpl.invoke(NativeMethodAccessorImpl.java:57)
	at sun.reflect.DelegatingMethodAccessorImpl.invoke(DelegatingMethodAccessorImpl.java:43)
	at java.lang.reflect.Method.invoke(Method.java:474)
	at com.carrotsearch.randomizedtesting.RandomizedRunner.invoke(RandomizedRunner.java:1559)
	at com.carrotsearch.randomizedtesting.RandomizedRunner.access$600(RandomizedRunner.java:79)
	at com.carrotsearch.randomizedtesting.RandomizedRunner$5.evaluate(RandomizedRunner.java:700)
	at org.apache.lucene.util.AbstractBeforeAfterRule$1.evaluate(AbstractBeforeAfterRule.java:46)
	at org.apache.lucene.util.TestRuleStoreClassName$1.evaluate(TestRuleStoreClassName.java:42)
	at com.carrotsearch.randomizedtesting.rules.SystemPropertiesInvariantRule$1.evaluate(SystemPropertiesInvariantRule.java:55)
	at com.carrotsearch.randomizedtesting.rules.NoShadowingOrOverridesOnMethodsRule$1.evaluate(NoShadowingOrOverridesOnMethodsRule.java:39)
	at com.carrotsearch.randomizedtesting.rules.NoShadowingOrOverridesOnMethodsRule$1.evaluate(NoShadowingOrOverridesOnMethodsRule.java:39)
	at com.carrotsearch.randomizedtesting.rules.StatementAdapter.evaluate(StatementAdapter.java:36)
	at org.apache.lucene.util.TestRuleAssertionsRequired$1.evaluate(TestRuleAssertionsRequired.java:43)
	at org.apache.lucene.util.TestRuleMarkFailure$1.evaluate(TestRuleMarkFailure.java:48)
	at org.apache.lucene.util.TestRuleIgnoreAfterMaxFailures$1.evaluate(TestRuleIgnoreAfterMaxFailures.java:70)
	at org.apache.lucene.util.TestRuleIgnoreTestSuites$1.evaluate(TestRuleIgnoreTestSuites.java:55)
	at com.carrotsearch.randomizedtesting.rules.StatementAdapter.evaluate(StatementAdapter.java:36)
	at com.carrotsearch.randomizedtesting.ThreadLeakControl$StatementRunner.run(ThreadLeakControl.java:358)
	at java.lang.Thread.run(Thread.java:722)


FAILED:  junit.framework.TestSuite.org.apache.lucene.search.spans.TestSpanExplanations

Error Message:
docs out of order (0 <= 0 ) (freqOut: MockIndexOutputWrapper(org.apache.lucene.store.MockDirectoryWrapper$BufferedIndexOutputWrapper@1c09d87))

Stack Trace:
org.apache.lucene.index.CorruptIndexException: docs out of order (0 <= 0 ) (freqOut: MockIndexOutputWrapper(org.apache.lucene.store.MockDirectoryWrapper$BufferedIndexOutputWrapper@1c09d87))
	at __randomizedtesting.SeedInfo.seed([5DD61E228367FBB0]:0)
	at org.apache.lucene.codecs.lucene40.Lucene40PostingsWriter.startDoc(Lucene40PostingsWriter.java:190)
	at org.apache.lucene.index.FreqProxTermsWriterPerField.flush(FreqProxTermsWriterPerField.java:475)
	at org.apache.lucene.index.FreqProxTermsWriter.flush(FreqProxTermsWriter.java:85)
	at org.apache.lucene.index.TermsHash.flush(TermsHash.java:116)
	at org.apache.lucene.index.DocInverter.flush(DocInverter.java:53)
	at org.apache.lucene.index.DocFieldProcessor.flush(DocFieldProcessor.java:81)
	at org.apache.lucene.index.DocumentsWriterPerThread.flush(DocumentsWriterPerThread.java:493)
	at org.apache.lucene.index.DocumentsWriter.doFlush(DocumentsWriter.java:422)
	at org.apache.lucene.index.DocumentsWriter.flushAllThreads(DocumentsWriter.java:559)
	at org.apache.lucene.index.IndexWriter.getReader(IndexWriter.java:357)
	at org.apache.lucene.index.RandomIndexWriter.getReader(RandomIndexWriter.java:313)
	at org.apache.lucene.index.RandomIndexWriter.getReader(RandomIndexWriter.java:255)
	at org.apache.lucene.search.TestExplanations.beforeClassTestExplanations(TestExplanations.java:82)
	at sun.reflect.NativeMethodAccessorImpl.invoke0(Native Method)
	at sun.reflect.NativeMethodAccessorImpl.invoke(NativeMethodAccessorImpl.java:57)
	at sun.reflect.DelegatingMethodAccessorImpl.invoke(DelegatingMethodAccessorImpl.java:43)
	at java.lang.reflect.Method.invoke(Method.java:474)
	at com.carrotsearch.randomizedtesting.RandomizedRunner.invoke(RandomizedRunner.java:1559)
	at com.carrotsearch.randomizedtesting.RandomizedRunner.access$600(RandomizedRunner.java:79)
	at com.carrotsearch.randomizedtesting.RandomizedRunner$4.evaluate(RandomizedRunner.java:677)
	at com.carrotsearch.randomizedtesting.RandomizedRunner$5.evaluate(RandomizedRunner.java:693)
	at org.apache.lucene.util.AbstractBeforeAfterRule$1.evaluate(AbstractBeforeAfterRule.java:46)
	at org.apache.lucene.util.TestRuleStoreClassName$1.evaluate(TestRuleStoreClassName.java:42)
	at com.carrotsearch.randomizedtesting.rules.SystemPropertiesInvariantRule$1.evaluate(SystemPropertiesInvariantRule.java:55)
	at com.carrotsearch.randomizedtesting.rules.NoShadowingOrOverridesOnMethodsRule$1.evaluate(NoShadowingOrOverridesOnMethodsRule.java:39)
	at com.carrotsearch.randomizedtesting.rules.NoShadowingOrOverridesOnMethodsRule$1.evaluate(NoShadowingOrOverridesOnMethodsRule.java:39)
	at com.carrotsearch.randomizedtesting.rules.StatementAdapter.evaluate(StatementAdapter.java:36)
	at org.apache.lucene.util.TestRuleAssertionsRequired$1.evaluate(TestRuleAssertionsRequired.java:43)
	at org.apache.lucene.util.TestRuleMarkFailure$1.evaluate(TestRuleMarkFailure.java:48)
	at org.apache.lucene.util.TestRuleIgnoreAfterMaxFailures$1.evaluate(TestRuleIgnoreAfterMaxFailures.java:70)
	at org.apache.lucene.util.TestRuleIgnoreTestSuites$1.evaluate(TestRuleIgnoreTestSuites.java:55)
	at com.carrotsearch.randomizedtesting.rules.StatementAdapter.evaluate(StatementAdapter.java:36)
	at com.carrotsearch.randomizedtesting.ThreadLeakControl$StatementRunner.run(ThreadLeakControl.java:358)
	at java.lang.Thread.run(Thread.java:722)


FAILED:  junit.framework.TestSuite.org.apache.lucene.search.spans.TestSpanExplanations

Error Message:


Stack Trace:
java.lang.NullPointerException
	at __randomizedtesting.SeedInfo.seed([5DD61E228367FBB0]:0)
	at org.apache.lucene.search.TestExplanations.afterClassTestExplanations(TestExplanations.java:63)
	at sun.reflect.NativeMethodAccessorImpl.invoke0(Native Method)
	at sun.reflect.NativeMethodAccessorImpl.invoke(NativeMethodAccessorImpl.java:57)
	at sun.reflect.DelegatingMethodAccessorImpl.invoke(DelegatingMethodAccessorImpl.java:43)
	at java.lang.reflect.Method.invoke(Method.java:474)
	at com.carrotsearch.randomizedtesting.RandomizedRunner.invoke(RandomizedRunner.java:1559)
	at com.carrotsearch.randomizedtesting.RandomizedRunner.access$600(RandomizedRunner.java:79)
	at com.carrotsearch.randomizedtesting.RandomizedRunner$5.evaluate(RandomizedRunner.java:700)
	at org.apache.lucene.util.AbstractBeforeAfterRule$1.evaluate(AbstractBeforeAfterRule.java:46)
	at org.apache.lucene.util.TestRuleStoreClassName$1.evaluate(TestRuleStoreClassName.java:42)
	at com.carrotsearch.randomizedtesting.rules.SystemPropertiesInvariantRule$1.evaluate(SystemPropertiesInvariantRule.java:55)
	at com.carrotsearch.randomizedtesting.rules.NoShadowingOrOverridesOnMethodsRule$1.evaluate(NoShadowingOrOverridesOnMethodsRule.java:39)
	at com.carrotsearch.randomizedtesting.rules.NoShadowingOrOverridesOnMethodsRule$1.evaluate(NoShadowingOrOverridesOnMethodsRule.java:39)
	at com.carrotsearch.randomizedtesting.rules.StatementAdapter.evaluate(StatementAdapter.java:36)
	at org.apache.lucene.util.TestRuleAssertionsRequired$1.evaluate(TestRuleAssertionsRequired.java:43)
	at org.apache.lucene.util.TestRuleMarkFailure$1.evaluate(TestRuleMarkFailure.java:48)
	at org.apache.lucene.util.TestRuleIgnoreAfterMaxFailures$1.evaluate(TestRuleIgnoreAfterMaxFailures.java:70)
	at org.apache.lucene.util.TestRuleIgnoreTestSuites$1.evaluate(TestRuleIgnoreTestSuites.java:55)
	at com.carrotsearch.randomizedtesting.rules.StatementAdapter.evaluate(StatementAdapter.java:36)
	at com.carrotsearch.randomizedtesting.ThreadLeakControl$StatementRunner.run(ThreadLeakControl.java:358)
	at java.lang.Thread.run(Thread.java:722)


REGRESSION:  org.apache.lucene.index.TestFlushByRamOrCountsPolicy.testFlushByRamLargeBuffer

Error Message:
Captured an uncaught exception in thread: Thread[id=983, name=Thread-861, state=RUNNABLE, group=TGRP-TestFlushByRamOrCountsPolicy]

Stack Trace:
com.carrotsearch.randomizedtesting.UncaughtExceptionError: Captured an uncaught exception in thread: Thread[id=983, name=Thread-861, state=RUNNABLE, group=TGRP-TestFlushByRamOrCountsPolicy]
Caused by: java.lang.RuntimeException: org.apache.lucene.index.CorruptIndexException: docs out of order (62 <= 62 ) (freqOut: MockIndexOutputWrapper(org.apache.lucene.store.RAMOutputStream@24f480))
	at __randomizedtesting.SeedInfo.seed([5DD61E228367FBB0]:0)
	at org.apache.lucene.index.TestFlushByRamOrCountsPolicy$IndexThread.run(TestFlushByRamOrCountsPolicy.java:326)
Caused by: org.apache.lucene.index.CorruptIndexException: docs out of order (62 <= 62 ) (freqOut: MockIndexOutputWrapper(org.apache.lucene.store.RAMOutputStream@24f480))
	at org.apache.lucene.codecs.lucene40.Lucene40PostingsWriter.startDoc(Lucene40PostingsWriter.java:190)
	at org.apache.lucene.index.FreqProxTermsWriterPerField.flush(FreqProxTermsWriterPerField.java:475)
	at org.apache.lucene.index.FreqProxTermsWriter.flush(FreqProxTermsWriter.java:85)
	at org.apache.lucene.index.TermsHash.flush(TermsHash.java:116)
	at org.apache.lucene.index.DocInverter.flush(DocInverter.java:53)
	at org.apache.lucene.index.DocFieldProcessor.flush(DocFieldProcessor.java:81)
	at org.apache.lucene.index.DocumentsWriterPerThread.flush(DocumentsWriterPerThread.java:493)
	at org.apache.lucene.index.DocumentsWriter.doFlush(DocumentsWriter.java:422)
	at org.apache.lucene.index.DocumentsWriter.flushAllThreads(DocumentsWriter.java:559)
	at org.apache.lucene.index.IndexWriter.prepareCommitInternal(IndexWriter.java:2683)
	at org.apache.lucene.index.IndexWriter.commitInternal(IndexWriter.java:2827)
	at org.apache.lucene.index.IndexWriter.commit(IndexWriter.java:2807)
	at org.apache.lucene.index.TestFlushByRamOrCountsPolicy$IndexThread.run(TestFlushByRamOrCountsPolicy.java:322)


REGRESSION:  org.apache.lucene.index.TestFlushByRamOrCountsPolicy.testFlushDocCount

Error Message:
Captured an uncaught exception in thread: Thread[id=985, name=Thread-863, state=RUNNABLE, group=TGRP-TestFlushByRamOrCountsPolicy]

Stack Trace:
com.carrotsearch.randomizedtesting.UncaughtExceptionError: Captured an uncaught exception in thread: Thread[id=985, name=Thread-863, state=RUNNABLE, group=TGRP-TestFlushByRamOrCountsPolicy]
Caused by: java.lang.RuntimeException: org.apache.lucene.index.CorruptIndexException: docs out of order (7 <= 8 ) (freqOut: MockIndexOutputWrapper(org.apache.lucene.store.RAMOutputStream@1ef8dd1))
	at __randomizedtesting.SeedInfo.seed([5DD61E228367FBB0]:0)
	at org.apache.lucene.index.TestFlushByRamOrCountsPolicy$IndexThread.run(TestFlushByRamOrCountsPolicy.java:326)
Caused by: org.apache.lucene.index.CorruptIndexException: docs out of order (7 <= 8 ) (freqOut: MockIndexOutputWrapper(org.apache.lucene.store.RAMOutputStream@1ef8dd1))
	at org.apache.lucene.codecs.lucene40.Lucene40PostingsWriter.startDoc(Lucene40PostingsWriter.java:190)
	at org.apache.lucene.index.FreqProxTermsWriterPerField.flush(FreqProxTermsWriterPerField.java:475)
	at org.apache.lucene.index.FreqProxTermsWriter.flush(FreqProxTermsWriter.java:85)
	at org.apache.lucene.index.TermsHash.flush(TermsHash.java:116)
	at org.apache.lucene.index.DocInverter.flush(DocInverter.java:53)
	at org.apache.lucene.index.DocFieldProcessor.flush(DocFieldProcessor.java:81)
	at org.apache.lucene.index.DocumentsWriterPerThread.flush(DocumentsWriterPerThread.java:493)
	at org.apache.lucene.index.DocumentsWriter.doFlush(DocumentsWriter.java:422)
	at org.apache.lucene.index.DocumentsWriter.flushAllThreads(DocumentsWriter.java:559)
	at org.apache.lucene.index.IndexWriter.prepareCommitInternal(IndexWriter.java:2683)
	at org.apache.lucene.index.IndexWriter.commitInternal(IndexWriter.java:2827)
	at org.apache.lucene.index.IndexWriter.commit(IndexWriter.java:2807)
	at org.apache.lucene.index.TestFlushByRamOrCountsPolicy$IndexThread.run(TestFlushByRamOrCountsPolicy.java:322)


REGRESSION:  org.apache.lucene.index.TestFlushByRamOrCountsPolicy.testRandom

Error Message:
Captured an uncaught exception in thread: Thread[id=999, name=Thread-877, state=RUNNABLE, group=TGRP-TestFlushByRamOrCountsPolicy]

Stack Trace:
com.carrotsearch.randomizedtesting.UncaughtExceptionError: Captured an uncaught exception in thread: Thread[id=999, name=Thread-877, state=RUNNABLE, group=TGRP-TestFlushByRamOrCountsPolicy]
Caused by: java.lang.RuntimeException: org.apache.lucene.index.CorruptIndexException: docs out of order (10 <= 10 ) (freqOut: MockIndexOutputWrapper(org.apache.lucene.store.RAMOutputStream@8ae0f))
	at __randomizedtesting.SeedInfo.seed([5DD61E228367FBB0]:0)
	at org.apache.lucene.index.TestFlushByRamOrCountsPolicy$IndexThread.run(TestFlushByRamOrCountsPolicy.java:326)
Caused by: org.apache.lucene.index.CorruptIndexException: docs out of order (10 <= 10 ) (freqOut: MockIndexOutputWrapper(org.apache.lucene.store.RAMOutputStream@8ae0f))
	at org.apache.lucene.codecs.lucene40.Lucene40PostingsWriter.startDoc(Lucene40PostingsWriter.java:190)
	at org.apache.lucene.index.FreqProxTermsWriterPerField.flush(FreqProxTermsWriterPerField.java:475)
	at org.apache.lucene.index.FreqProxTermsWriter.flush(FreqProxTermsWriter.java:85)
	at org.apache.lucene.index.TermsHash.flush(TermsHash.java:116)
	at org.apache.lucene.index.DocInverter.flush(DocInverter.java:53)
	at org.apache.lucene.index.DocFieldProcessor.flush(DocFieldProcessor.java:81)
	at org.apache.lucene.index.DocumentsWriterPerThread.flush(DocumentsWriterPerThread.java:493)
	at org.apache.lucene.index.DocumentsWriter.doFlush(DocumentsWriter.java:422)
	at org.apache.lucene.index.DocumentsWriter.flushAllThreads(DocumentsWriter.java:559)
	at org.apache.lucene.index.IndexWriter.prepareCommitInternal(IndexWriter.java:2683)
	at org.apache.lucene.index.IndexWriter.commitInternal(IndexWriter.java:2827)
	at org.apache.lucene.index.IndexWriter.commit(IndexWriter.java:2807)
	at org.apache.lucene.index.TestFlushByRamOrCountsPolicy$IndexThread.run(TestFlushByRamOrCountsPolicy.java:318)


REGRESSION:  org.apache.lucene.index.TestFlushByRamOrCountsPolicy.testFlushByRam

Error Message:
Captured an uncaught exception in thread: Thread[id=1000, name=Thread-878, state=RUNNABLE, group=TGRP-TestFlushByRamOrCountsPolicy]

Stack Trace:
com.carrotsearch.randomizedtesting.UncaughtExceptionError: Captured an uncaught exception in thread: Thread[id=1000, name=Thread-878, state=RUNNABLE, group=TGRP-TestFlushByRamOrCountsPolicy]
Caused by: java.lang.RuntimeException: org.apache.lucene.index.CorruptIndexException: docs out of order (82 <= 82 ) (freqOut: MockIndexOutputWrapper(org.apache.lucene.store.RAMOutputStream@10ec7b6))
	at __randomizedtesting.SeedInfo.seed([5DD61E228367FBB0]:0)
	at org.apache.lucene.index.TestFlushByRamOrCountsPolicy$IndexThread.run(TestFlushByRamOrCountsPolicy.java:326)
Caused by: org.apache.lucene.index.CorruptIndexException: docs out of order (82 <= 82 ) (freqOut: MockIndexOutputWrapper(org.apache.lucene.store.RAMOutputStream@10ec7b6))
	at org.apache.lucene.codecs.lucene40.Lucene40PostingsWriter.startDoc(Lucene40PostingsWriter.java:190)
	at org.apache.lucene.index.FreqProxTermsWriterPerField.flush(FreqProxTermsWriterPerField.java:475)
	at org.apache.lucene.index.FreqProxTermsWriter.flush(FreqProxTermsWriter.java:85)
	at org.apache.lucene.index.TermsHash.flush(TermsHash.java:116)
	at org.apache.lucene.index.DocInverter.flush(DocInverter.java:53)
	at org.apache.lucene.index.DocFieldProcessor.flush(DocFieldProcessor.java:81)
	at org.apache.lucene.index.DocumentsWriterPerThread.flush(DocumentsWriterPerThread.java:493)
	at org.apache.lucene.index.DocumentsWriter.doFlush(DocumentsWriter.java:422)
	at org.apache.lucene.index.DocumentsWriter.flushAllThreads(DocumentsWriter.java:559)
	at org.apache.lucene.index.IndexWriter.prepareCommitInternal(IndexWriter.java:2683)
	at org.apache.lucene.index.IndexWriter.commitInternal(IndexWriter.java:2827)
	at org.apache.lucene.index.IndexWriter.commit(IndexWriter.java:2807)
	at org.apache.lucene.index.TestFlushByRamOrCountsPolicy$IndexThread.run(TestFlushByRamOrCountsPolicy.java:322)


REGRESSION:  org.apache.lucene.index.TestIndexWriterOnDiskFull.testAddIndexOnDiskFull

Error Message:
docs out of order (0 <= 0 ) (docOut: MockIndexOutputWrapper(org.apache.lucene.store.FSDirectory$FSIndexOutput@1e0ffbf))

Stack Trace:
org.apache.lucene.index.CorruptIndexException: docs out of order (0 <= 0 ) (docOut: MockIndexOutputWrapper(org.apache.lucene.store.FSDirectory$FSIndexOutput@1e0ffbf))
	at __randomizedtesting.SeedInfo.seed([5DD61E228367FBB0:2109AF1DCED65307]:0)
	at org.apache.lucene.codecs.lucene41.Lucene41PostingsWriter.startDoc(Lucene41PostingsWriter.java:243)
	at org.apache.lucene.codecs.asserting.AssertingPostingsFormat$AssertingPostingsConsumer.startDoc(AssertingPostingsFormat.java:218)
	at org.apache.lucene.index.FreqProxTermsWriterPerField.flush(FreqProxTermsWriterPerField.java:475)
	at org.apache.lucene.index.FreqProxTermsWriter.flush(FreqProxTermsWriter.java:85)
	at org.apache.lucene.index.TermsHash.flush(TermsHash.java:116)
	at org.apache.lucene.index.DocInverter.flush(DocInverter.java:53)
	at org.apache.lucene.index.DocFieldProcessor.flush(DocFieldProcessor.java:81)
	at org.apache.lucene.index.DocumentsWriterPerThread.flush(DocumentsWriterPerThread.java:493)
	at org.apache.lucene.index.DocumentsWriter.doFlush(DocumentsWriter.java:422)
	at org.apache.lucene.index.DocumentsWriter.flushAllThreads(DocumentsWriter.java:559)
	at org.apache.lucene.index.IndexWriter.doFlush(IndexWriter.java:2918)
	at org.apache.lucene.index.IndexWriter.flush(IndexWriter.java:2894)
	at org.apache.lucene.index.IndexWriter.closeInternal(IndexWriter.java:928)
	at org.apache.lucene.index.IndexWriter.close(IndexWriter.java:883)
	at org.apache.lucene.index.IndexWriter.close(IndexWriter.java:845)
	at org.apache.lucene.index.TestIndexWriterOnDiskFull.testAddIndexOnDiskFull(TestIndexWriterOnDiskFull.java:177)
	at sun.reflect.NativeMethodAccessorImpl.invoke0(Native Method)
	at sun.reflect.NativeMethodAccessorImpl.invoke(NativeMethodAccessorImpl.java:57)
	at sun.reflect.DelegatingMethodAccessorImpl.invoke(DelegatingMethodAccessorImpl.java:43)
	at java.lang.reflect.Method.invoke(Method.java:474)
	at com.carrotsearch.randomizedtesting.RandomizedRunner.invoke(RandomizedRunner.java:1559)
	at com.carrotsearch.randomizedtesting.RandomizedRunner.access$600(RandomizedRunner.java:79)
	at com.carrotsearch.randomizedtesting.RandomizedRunner$6.evaluate(RandomizedRunner.java:737)
	at com.carrotsearch.randomizedtesting.RandomizedRunner$7.evaluate(RandomizedRunner.java:773)
	at com.carrotsearch.randomizedtesting.RandomizedRunner$8.evaluate(RandomizedRunner.java:787)
	at org.apache.lucene.util.TestRuleSetupTeardownChained$1.evaluate(TestRuleSetupTeardownChained.java:50)
	at org.apache.lucene.util.TestRuleFieldCacheSanity$1.evaluate(TestRuleFieldCacheSanity.java:51)
	at org.apache.lucene.util.AbstractBeforeAfterRule$1.evaluate(AbstractBeforeAfterRule.java:46)
	at com.carrotsearch.randomizedtesting.rules.SystemPropertiesInvariantRule$1.evaluate(SystemPropertiesInvariantRule.java:55)
	at org.apache.lucene.util.TestRuleThreadAndTestName$1.evaluate(TestRuleThreadAndTestName.java:49)
	at org.apache.lucene.util.TestRuleIgnoreAfterMaxFailures$1.evaluate(TestRuleIgnoreAfterMaxFailures.java:70)
	at org.apache.lucene.util.TestRuleMarkFailure$1.evaluate(TestRuleMarkFailure.java:48)
	at com.carrotsearch.randomizedtesting.rules.StatementAdapter.evaluate(StatementAdapter.java:36)
	at com.carrotsearch.randomizedtesting.ThreadLeakControl$StatementRunner.run(ThreadLeakControl.java:358)
	at com.carrotsearch.randomizedtesting.ThreadLeakControl.forkTimeoutingTask(ThreadLeakControl.java:782)
	at com.carrotsearch.randomizedtesting.ThreadLeakControl$3.evaluate(ThreadLeakControl.java:442)
	at com.carrotsearch.randomizedtesting.RandomizedRunner.runSingleTest(RandomizedRunner.java:746)
	at com.carrotsearch.randomizedtesting.RandomizedRunner$3.evaluate(RandomizedRunner.java:648)
	at com.carrotsearch.randomizedtesting.RandomizedRunner$4.evaluate(RandomizedRunner.java:682)
	at com.carrotsearch.randomizedtesting.RandomizedRunner$5.evaluate(RandomizedRunner.java:693)
	at org.apache.lucene.util.AbstractBeforeAfterRule$1.evaluate(AbstractBeforeAfterRule.java:46)
	at org.apache.lucene.util.TestRuleStoreClassName$1.evaluate(TestRuleStoreClassName.java:42)
	at com.carrotsearch.randomizedtesting.rules.SystemPropertiesInvariantRule$1.evaluate(SystemPropertiesInvariantRule.java:55)
	at com.carrotsearch.randomizedtesting.rules.NoShadowingOrOverridesOnMethodsRule$1.evaluate(NoShadowingOrOverridesOnMethodsRule.java:39)
	at com.carrotsearch.randomizedtesting.rules.NoShadowingOrOverridesOnMethodsRule$1.evaluate(NoShadowingOrOverridesOnMethodsRule.java:39)
	at com.carrotsearch.randomizedtesting.rules.StatementAdapter.evaluate(StatementAdapter.java:36)
	at org.apache.lucene.util.TestRuleAssertionsRequired$1.evaluate(TestRuleAssertionsRequired.java:43)
	at org.apache.lucene.util.TestRuleMarkFailure$1.evaluate(TestRuleMarkFailure.java:48)
	at org.apache.lucene.util.TestRuleIgnoreAfterMaxFailures$1.evaluate(TestRuleIgnoreAfterMaxFailures.java:70)
	at org.apache.lucene.util.TestRuleIgnoreTestSuites$1.evaluate(TestRuleIgnoreTestSuites.java:55)
	at com.carrotsearch.randomizedtesting.rules.StatementAdapter.evaluate(StatementAdapter.java:36)
	at com.carrotsearch.randomizedtesting.ThreadLeakControl$StatementRunner.run(ThreadLeakControl.java:358)
	at java.lang.Thread.run(Thread.java:722)


REGRESSION:  org.apache.lucene.index.TestIndexWriterOnDiskFull.testAddDocumentOnDiskFull

Error Message:
Test abandoned because suite timeout was reached.

Stack Trace:
java.lang.Exception: Test abandoned because suite timeout was reached.
	at __randomizedtesting.SeedInfo.seed([5DD61E228367FBB0]:0)


REGRESSION:  org.apache.lucene.index.TestNRTThreads.testNRTThreads

Error Message:
docs out of order (77 <= 77 ) (docOut: MockIndexOutputWrapper(org.apache.lucene.store.FSDirectory$FSIndexOutput@bb37a2))

Stack Trace:
org.apache.lucene.index.CorruptIndexException: docs out of order (77 <= 77 ) (docOut: MockIndexOutputWrapper(org.apache.lucene.store.FSDirectory$FSIndexOutput@bb37a2))
	at __randomizedtesting.SeedInfo.seed([5DD61E228367FBB0:C60F0A39C29CEDDB]:0)
	at org.apache.lucene.codecs.lucene41.Lucene41PostingsWriter.startDoc(Lucene41PostingsWriter.java:243)
	at org.apache.lucene.index.FreqProxTermsWriterPerField.flush(FreqProxTermsWriterPerField.java:475)
	at org.apache.lucene.index.FreqProxTermsWriter.flush(FreqProxTermsWriter.java:85)
	at org.apache.lucene.index.TermsHash.flush(TermsHash.java:116)
	at org.apache.lucene.index.DocInverter.flush(DocInverter.java:53)
	at org.apache.lucene.index.DocFieldProcessor.flush(DocFieldProcessor.java:81)
	at org.apache.lucene.index.DocumentsWriterPerThread.flush(DocumentsWriterPerThread.java:493)
	at org.apache.lucene.index.DocumentsWriter.doFlush(DocumentsWriter.java:422)
	at org.apache.lucene.index.DocumentsWriter.flushAllThreads(DocumentsWriter.java:559)
	at org.apache.lucene.index.IndexWriter.getReader(IndexWriter.java:357)
	at org.apache.lucene.index.DirectoryReader.open(DirectoryReader.java:110)
	at org.apache.lucene.index.TestNRTThreads.doSearching(TestNRTThreads.java:39)
	at org.apache.lucene.index.ThreadedIndexingAndSearchingTestCase.runTest(ThreadedIndexingAndSearchingTestCase.java:507)
	at org.apache.lucene.index.TestNRTThreads.testNRTThreads(TestNRTThreads.java:128)
	at sun.reflect.NativeMethodAccessorImpl.invoke0(Native Method)
	at sun.reflect.NativeMethodAccessorImpl.invoke(NativeMethodAccessorImpl.java:57)
	at sun.reflect.DelegatingMethodAccessorImpl.invoke(DelegatingMethodAccessorImpl.java:43)
	at java.lang.reflect.Method.invoke(Method.java:474)
	at com.carrotsearch.randomizedtesting.RandomizedRunner.invoke(RandomizedRunner.java:1559)
	at com.carrotsearch.randomizedtesting.RandomizedRunner.access$600(RandomizedRunner.java:79)
	at com.carrotsearch.randomizedtesting.RandomizedRunner$6.evaluate(RandomizedRunner.java:737)
	at com.carrotsearch.randomizedtesting.RandomizedRunner$7.evaluate(RandomizedRunner.java:773)
	at com.carrotsearch.randomizedtesting.RandomizedRunner$8.evaluate(RandomizedRunner.java:787)
	at org.apache.lucene.util.TestRuleSetupTeardownChained$1.evaluate(TestRuleSetupTeardownChained.java:50)
	at org.apache.lucene.util.TestRuleFieldCacheSanity$1.evaluate(TestRuleFieldCacheSanity.java:51)
	at org.apache.lucene.util.AbstractBeforeAfterRule$1.evaluate(AbstractBeforeAfterRule.java:46)
	at com.carrotsearch.randomizedtesting.rules.SystemPropertiesInvariantRule$1.evaluate(SystemPropertiesInvariantRule.java:55)
	at org.apache.lucene.util.TestRuleThreadAndTestName$1.evaluate(TestRuleThreadAndTestName.java:49)
	at org.apache.lucene.util.TestRuleIgnoreAfterMaxFailures$1.evaluate(TestRuleIgnoreAfterMaxFailures.java:70)
	at org.apache.lucene.util.TestRuleMarkFailure$1.evaluate(TestRuleMarkFailure.java:48)
	at com.carrotsearch.randomizedtesting.rules.StatementAdapter.evaluate(StatementAdapter.java:36)
	at com.carrotsearch.randomizedtesting.ThreadLeakControl$StatementRunner.run(ThreadLeakControl.java:358)
	at com.carrotsearch.randomizedtesting.ThreadLeakControl.forkTimeoutingTask(ThreadLeakControl.java:782)
	at com.carrotsearch.randomizedtesting.ThreadLeakControl$3.evaluate(ThreadLeakControl.java:442)
	at com.carrotsearch.randomizedtesting.RandomizedRunner.runSingleTest(RandomizedRunner.java:746)
	at com.carrotsearch.randomizedtesting.RandomizedRunner$3.evaluate(RandomizedRunner.java:648)
	at com.carrotsearch.randomizedtesting.RandomizedRunner$4.evaluate(RandomizedRunner.java:682)
	at com.carrotsearch.randomizedtesting.RandomizedRunner$5.evaluate(RandomizedRunner.java:693)
	at org.apache.lucene.util.AbstractBeforeAfterRule$1.evaluate(AbstractBeforeAfterRule.java:46)
	at org.apache.lucene.util.TestRuleStoreClassName$1.evaluate(TestRuleStoreClassName.java:42)
	at com.carrotsearch.randomizedtesting.rules.SystemPropertiesInvariantRule$1.evaluate(SystemPropertiesInvariantRule.java:55)
	at com.carrotsearch.randomizedtesting.rules.NoShadowingOrOverridesOnMethodsRule$1.evaluate(NoShadowingOrOverridesOnMethodsRule.java:39)
	at com.carrotsearch.randomizedtesting.rules.NoShadowingOrOverridesOnMethodsRule$1.evaluate(NoShadowingOrOverridesOnMethodsRule.java:39)
	at com.carrotsearch.randomizedtesting.rules.StatementAdapter.evaluate(StatementAdapter.java:36)
	at org.apache.lucene.util.TestRuleAssertionsRequired$1.evaluate(TestRuleAssertionsRequired.java:43)
	at org.apache.lucene.util.TestRuleMarkFailure$1.evaluate(TestRuleMarkFailure.java:48)
	at org.apache.lucene.util.TestRuleIgnoreAfterMaxFailures$1.evaluate(TestRuleIgnoreAfterMaxFailures.java:70)
	at org.apache.lucene.util.TestRuleIgnoreTestSuites$1.evaluate(TestRuleIgnoreTestSuites.java:55)
	at com.carrotsearch.randomizedtesting.rules.StatementAdapter.evaluate(StatementAdapter.java:36)
	at com.carrotsearch.randomizedtesting.ThreadLeakControl$StatementRunner.run(ThreadLeakControl.java:358)
	at java.lang.Thread.run(Thread.java:722)


REGRESSION:  org.apache.lucene.index.TestPostingsOffsets.testRandom

Error Message:
docs out of order (0 <= 0 ) (docOut: MockIndexOutputWrapper(org.apache.lucene.store.RAMOutputStream@501bda))

Stack Trace:
org.apache.lucene.index.CorruptIndexException: docs out of order (0 <= 0 ) (docOut: MockIndexOutputWrapper(org.apache.lucene.store.RAMOutputStream@501bda))
	at __randomizedtesting.SeedInfo.seed([5DD61E228367FBB0:2F9A3B2D32074DC3]:0)
	at org.apache.lucene.codecs.lucene41.Lucene41PostingsWriter.startDoc(Lucene41PostingsWriter.java:243)
	at org.apache.lucene.index.FreqProxTermsWriterPerField.flush(FreqProxTermsWriterPerField.java:475)
	at org.apache.lucene.index.FreqProxTermsWriter.flush(FreqProxTermsWriter.java:85)
	at org.apache.lucene.index.TermsHash.flush(TermsHash.java:116)
	at org.apache.lucene.index.DocInverter.flush(DocInverter.java:53)
	at org.apache.lucene.index.DocFieldProcessor.flush(DocFieldProcessor.java:81)
	at org.apache.lucene.index.DocumentsWriterPerThread.flush(DocumentsWriterPerThread.java:493)
	at org.apache.lucene.index.DocumentsWriter.doFlush(DocumentsWriter.java:422)
	at org.apache.lucene.index.DocumentsWriter.flushAllThreads(DocumentsWriter.java:559)
	at org.apache.lucene.index.IndexWriter.prepareCommitInternal(IndexWriter.java:2683)
	at org.apache.lucene.index.IndexWriter.commitInternal(IndexWriter.java:2827)
	at org.apache.lucene.index.IndexWriter.commit(IndexWriter.java:2807)
	at org.apache.lucene.index.RandomIndexWriter.getReader(RandomIndexWriter.java:318)
	at org.apache.lucene.index.RandomIndexWriter.getReader(RandomIndexWriter.java:255)
	at org.apache.lucene.index.TestPostingsOffsets.testRandom(TestPostingsOffsets.java:289)
	at sun.reflect.NativeMethodAccessorImpl.invoke0(Native Method)
	at sun.reflect.NativeMethodAccessorImpl.invoke(NativeMethodAccessorImpl.java:57)
	at sun.reflect.DelegatingMethodAccessorImpl.invoke(DelegatingMethodAccessorImpl.java:43)
	at java.lang.reflect.Method.invoke(Method.java:474)
	at com.carrotsearch.randomizedtesting.RandomizedRunner.invoke(RandomizedRunner.java:1559)
	at com.carrotsearch.randomizedtesting.RandomizedRunner.access$600(RandomizedRunner.java:79)
	at com.carrotsearch.randomizedtesting.RandomizedRunner$6.evaluate(RandomizedRunner.java:737)
	at com.carrotsearch.randomizedtesting.RandomizedRunner$7.evaluate(RandomizedRunner.java:773)
	at com.carrotsearch.randomizedtesting.RandomizedRunner$8.evaluate(RandomizedRunner.java:787)
	at org.apache.lucene.util.TestRuleSetupTeardownChained$1.evaluate(TestRuleSetupTeardownChained.java:50)
	at org.apache.lucene.util.TestRuleFieldCacheSanity$1.evaluate(TestRuleFieldCacheSanity.java:51)
	at org.apache.lucene.util.AbstractBeforeAfterRule$1.evaluate(AbstractBeforeAfterRule.java:46)
	at com.carrotsearch.randomizedtesting.rules.SystemPropertiesInvariantRule$1.evaluate(SystemPropertiesInvariantRule.java:55)
	at org.apache.lucene.util.TestRuleThreadAndTestName$1.evaluate(TestRuleThreadAndTestName.java:49)
	at org.apache.lucene.util.TestRuleIgnoreAfterMaxFailures$1.evaluate(TestRuleIgnoreAfterMaxFailures.java:70)
	at org.apache.lucene.util.TestRuleMarkFailure$1.evaluate(TestRuleMarkFailure.java:48)
	at com.carrotsearch.randomizedtesting.rules.StatementAdapter.evaluate(StatementAdapter.java:36)
	at com.carrotsearch.randomizedtesting.ThreadLeakControl$StatementRunner.run(ThreadLeakControl.java:358)
	at com.carrotsearch.randomizedtesting.ThreadLeakControl.forkTimeoutingTask(ThreadLeakControl.java:782)
	at com.carrotsearch.randomizedtesting.ThreadLeakControl$3.evaluate(ThreadLeakControl.java:442)
	at com.carrotsearch.randomizedtesting.RandomizedRunner.runSingleTest(RandomizedRunner.java:746)
	at com.carrotsearch.randomizedtesting.RandomizedRunner$3.evaluate(RandomizedRunner.java:648)
	at com.carrotsearch.randomizedtesting.RandomizedRunner$4.evaluate(RandomizedRunner.java:682)
	at com.carrotsearch.randomizedtesting.RandomizedRunner$5.evaluate(RandomizedRunner.java:693)
	at org.apache.lucene.util.AbstractBeforeAfterRule$1.evaluate(AbstractBeforeAfterRule.java:46)
	at org.apache.lucene.util.TestRuleStoreClassName$1.evaluate(TestRuleStoreClassName.java:42)
	at com.carrotsearch.randomizedtesting.rules.SystemPropertiesInvariantRule$1.evaluate(SystemPropertiesInvariantRule.java:55)
	at com.carrotsearch.randomizedtesting.rules.NoShadowingOrOverridesOnMethodsRule$1.evaluate(NoShadowingOrOverridesOnMethodsRule.java:39)
	at com.carrotsearch.randomizedtesting.rules.NoShadowingOrOverridesOnMethodsRule$1.evaluate(NoShadowingOrOverridesOnMethodsRule.java:39)
	at com.carrotsearch.randomizedtesting.rules.StatementAdapter.evaluate(StatementAdapter.java:36)
	at org.apache.lucene.util.TestRuleAssertionsRequired$1.evaluate(TestRuleAssertionsRequired.java:43)
	at org.apache.lucene.util.TestRuleMarkFailure$1.evaluate(TestRuleMarkFailure.java:48)
	at org.apache.lucene.util.TestRuleIgnoreAfterMaxFailures$1.evaluate(TestRuleIgnoreAfterMaxFailures.java:70)
	at org.apache.lucene.util.TestRuleIgnoreTestSuites$1.evaluate(TestRuleIgnoreTestSuites.java:55)
	at com.carrotsearch.randomizedtesting.rules.StatementAdapter.evaluate(StatementAdapter.java:36)
	at com.carrotsearch.randomizedtesting.ThreadLeakControl$StatementRunner.run(ThreadLeakControl.java:358)
	at java.lang.Thread.run(Thread.java:722)


REGRESSION:  org.apache.lucene.index.TestTransactions.testTransactions

Error Message:
docs out of order (0 <= 0 ) (docOut: MockIndexOutputWrapper(org.apache.lucene.store.RAMOutputStream@505f0c))

Stack Trace:
org.apache.lucene.index.CorruptIndexException: docs out of order (0 <= 0 ) (docOut: MockIndexOutputWrapper(org.apache.lucene.store.RAMOutputStream@505f0c))
	at __randomizedtesting.SeedInfo.seed([5DD61E228367FBB0:9E44A2EAD7F312B4]:0)
	at org.apache.lucene.codecs.lucene41.Lucene41PostingsWriter.startDoc(Lucene41PostingsWriter.java:243)
	at org.apache.lucene.index.FreqProxTermsWriterPerField.flush(FreqProxTermsWriterPerField.java:475)
	at org.apache.lucene.index.FreqProxTermsWriter.flush(FreqProxTermsWriter.java:85)
	at org.apache.lucene.index.TermsHash.flush(TermsHash.java:116)
	at org.apache.lucene.index.DocInverter.flush(DocInverter.java:53)
	at org.apache.lucene.index.DocFieldProcessor.flush(DocFieldProcessor.java:81)
	at org.apache.lucene.index.DocumentsWriterPerThread.flush(DocumentsWriterPerThread.java:493)
	at org.apache.lucene.index.DocumentsWriter.doFlush(DocumentsWriter.java:422)
	at org.apache.lucene.index.DocumentsWriter.flushAllThreads(DocumentsWriter.java:559)
	at org.apache.lucene.index.IndexWriter.doFlush(IndexWriter.java:2918)
	at org.apache.lucene.index.IndexWriter.flush(IndexWriter.java:2894)
	at org.apache.lucene.index.IndexWriter.closeInternal(IndexWriter.java:928)
	at org.apache.lucene.index.IndexWriter.close(IndexWriter.java:883)
	at org.apache.lucene.index.IndexWriter.close(IndexWriter.java:845)
	at org.apache.lucene.index.TestTransactions.initIndex(TestTransactions.java:204)
	at org.apache.lucene.index.TestTransactions.testTransactions(TestTransactions.java:223)
	at sun.reflect.NativeMethodAccessorImpl.invoke0(Native Method)
	at sun.reflect.NativeMethodAccessorImpl.invoke(NativeMethodAccessorImpl.java:57)
	at sun.reflect.DelegatingMethodAccessorImpl.invoke(DelegatingMethodAccessorImpl.java:43)
	at java.lang.reflect.Method.invoke(Method.java:474)
	at com.carrotsearch.randomizedtesting.RandomizedRunner.invoke(RandomizedRunner.java:1559)
	at com.carrotsearch.randomizedtesting.RandomizedRunner.access$600(RandomizedRunner.java:79)
	at com.carrotsearch.randomizedtesting.RandomizedRunner$6.evaluate(RandomizedRunner.java:737)
	at com.carrotsearch.randomizedtesting.RandomizedRunner$7.evaluate(RandomizedRunner.java:773)
	at com.carrotsearch.randomizedtesting.RandomizedRunner$8.evaluate(RandomizedRunner.java:787)
	at org.apache.lucene.util.TestRuleSetupTeardownChained$1.evaluate(TestRuleSetupTeardownChained.java:50)
	at org.apache.lucene.util.TestRuleFieldCacheSanity$1.evaluate(TestRuleFieldCacheSanity.java:51)
	at org.apache.lucene.util.AbstractBeforeAfterRule$1.evaluate(AbstractBeforeAfterRule.java:46)
	at com.carrotsearch.randomizedtesting.rules.SystemPropertiesInvariantRule$1.evaluate(SystemPropertiesInvariantRule.java:55)
	at org.apache.lucene.util.TestRuleThreadAndTestName$1.evaluate(TestRuleThreadAndTestName.java:49)
	at org.apache.lucene.util.TestRuleIgnoreAfterMaxFailures$1.evaluate(TestRuleIgnoreAfterMaxFailures.java:70)
	at org.apache.lucene.util.TestRuleMarkFailure$1.evaluate(TestRuleMarkFailure.java:48)
	at com.carrotsearch.randomizedtesting.rules.StatementAdapter.evaluate(StatementAdapter.java:36)
	at com.carrotsearch.randomizedtesting.ThreadLeakControl$StatementRunner.run(ThreadLeakControl.java:358)
	at com.carrotsearch.randomizedtesting.ThreadLeakControl.forkTimeoutingTask(ThreadLeakControl.java:782)
	at com.carrotsearch.randomizedtesting.ThreadLeakControl$3.evaluate(ThreadLeakControl.java:442)
	at com.carrotsearch.randomizedtesting.RandomizedRunner.runSingleTest(RandomizedRunner.java:746)
	at com.carrotsearch.randomizedtesting.RandomizedRunner$3.evaluate(RandomizedRunner.java:648)
	at com.carrotsearch.randomizedtesting.RandomizedRunner$4.evaluate(RandomizedRunner.java:682)
	at com.carrotsearch.randomizedtesting.RandomizedRunner$5.evaluate(RandomizedRunner.java:693)
	at org.apache.lucene.util.AbstractBeforeAfterRule$1.evaluate(AbstractBeforeAfterRule.java:46)
	at org.apache.lucene.util.TestRuleStoreClassName$1.evaluate(TestRuleStoreClassName.java:42)
	at com.carrotsearch.randomizedtesting.rules.SystemPropertiesInvariantRule$1.evaluate(SystemPropertiesInvariantRule.java:55)
	at com.carrotsearch.randomizedtesting.rules.NoShadowingOrOverridesOnMethodsRule$1.evaluate(NoShadowingOrOverridesOnMethodsRule.java:39)
	at com.carrotsearch.randomizedtesting.rules.NoShadowingOrOverridesOnMethodsRule$1.evaluate(NoShadowingOrOverridesOnMethodsRule.java:39)
	at com.carrotsearch.randomizedtesting.rules.StatementAdapter.evaluate(StatementAdapter.java:36)
	at org.apache.lucene.util.TestRuleAssertionsRequired$1.evaluate(TestRuleAssertionsRequired.java:43)
	at org.apache.lucene.util.TestRuleMarkFailure$1.evaluate(TestRuleMarkFailure.java:48)
	at org.apache.lucene.util.TestRuleIgnoreAfterMaxFailures$1.evaluate(TestRuleIgnoreAfterMaxFailures.java:70)
	at org.apache.lucene.util.TestRuleIgnoreTestSuites$1.evaluate(TestRuleIgnoreTestSuites.java:55)
	at com.carrotsearch.randomizedtesting.rules.StatementAdapter.evaluate(StatementAdapter.java:36)
	at com.carrotsearch.randomizedtesting.ThreadLeakControl$StatementRunner.run(ThreadLeakControl.java:358)
	at java.lang.Thread.run(Thread.java:722)


REGRESSION:  org.apache.lucene.store.TestNRTCachingDirectory.testNRTAndCommit

Error Message:


Stack Trace:
java.lang.AssertionError
	at __randomizedtesting.SeedInfo.seed([5DD61E228367FBB0:1C6DF3DFE757FA94]:0)
	at org.apache.lucene.index.ByteSliceReader.readByte(ByteSliceReader.java:73)
	at org.apache.lucene.store.DataInput.readVInt(DataInput.java:108)
	at org.apache.lucene.index.FreqProxTermsWriterPerField.flush(FreqProxTermsWriterPerField.java:505)
	at org.apache.lucene.index.FreqProxTermsWriter.flush(FreqProxTermsWriter.java:85)
	at org.apache.lucene.index.TermsHash.flush(TermsHash.java:116)
	at org.apache.lucene.index.DocInverter.flush(DocInverter.java:53)
	at org.apache.lucene.index.DocFieldProcessor.flush(DocFieldProcessor.java:81)
	at org.apache.lucene.index.DocumentsWriterPerThread.flush(DocumentsWriterPerThread.java:493)
	at org.apache.lucene.index.DocumentsWriter.doFlush(DocumentsWriter.java:422)
	at org.apache.lucene.index.DocumentsWriter.flushAllThreads(DocumentsWriter.java:559)
	at org.apache.lucene.index.IndexWriter.getReader(IndexWriter.java:357)
	at org.apache.lucene.index.StandardDirectoryReader.doOpenFromWriter(StandardDirectoryReader.java:270)
	at org.apache.lucene.index.StandardDirectoryReader.doOpenIfChanged(StandardDirectoryReader.java:245)
	at org.apache.lucene.index.StandardDirectoryReader.doOpenIfChanged(StandardDirectoryReader.java:235)
	at org.apache.lucene.index.DirectoryReader.openIfChanged(DirectoryReader.java:169)
	at org.apache.lucene.store.TestNRTCachingDirectory.testNRTAndCommit(TestNRTCachingDirectory.java:69)
	at sun.reflect.NativeMethodAccessorImpl.invoke0(Native Method)
	at sun.reflect.NativeMethodAccessorImpl.invoke(NativeMethodAccessorImpl.java:57)
	at sun.reflect.DelegatingMethodAccessorImpl.invoke(DelegatingMethodAccessorImpl.java:43)
	at java.lang.reflect.Method.invoke(Method.java:474)
	at com.carrotsearch.randomizedtesting.RandomizedRunner.invoke(RandomizedRunner.java:1559)
	at com.carrotsearch.randomizedtesting.RandomizedRunner.access$600(RandomizedRunner.java:79)
	at com.carrotsearch.randomizedtesting.RandomizedRunner$6.evaluate(RandomizedRunner.java:737)
	at com.carrotsearch.randomizedtesting.RandomizedRunner$7.evaluate(RandomizedRunner.java:773)
	at com.carrotsearch.randomizedtesting.RandomizedRunner$8.evaluate(RandomizedRunner.java:787)
	at org.apache.lucene.util.TestRuleSetupTeardownChained$1.evaluate(TestRuleSetupTeardownChained.java:50)
	at org.apache.lucene.util.TestRuleFieldCacheSanity$1.evaluate(TestRuleFieldCacheSanity.java:51)
	at org.apache.lucene.util.AbstractBeforeAfterRule$1.evaluate(AbstractBeforeAfterRule.java:46)
	at com.carrotsearch.randomizedtesting.rules.SystemPropertiesInvariantRule$1.evaluate(SystemPropertiesInvariantRule.java:55)
	at org.apache.lucene.util.TestRuleThreadAndTestName$1.evaluate(TestRuleThreadAndTestName.java:49)
	at org.apache.lucene.util.TestRuleIgnoreAfterMaxFailures$1.evaluate(TestRuleIgnoreAfterMaxFailures.java:70)
	at org.apache.lucene.util.TestRuleMarkFailure$1.evaluate(TestRuleMarkFailure.java:48)
	at com.carrotsearch.randomizedtesting.rules.StatementAdapter.evaluate(StatementAdapter.java:36)
	at com.carrotsearch.randomizedtesting.ThreadLeakControl$StatementRunner.run(ThreadLeakControl.java:358)
	at com.carrotsearch.randomizedtesting.ThreadLeakControl.forkTimeoutingTask(ThreadLeakControl.java:782)
	at com.carrotsearch.randomizedtesting.ThreadLeakControl$3.evaluate(ThreadLeakControl.java:442)
	at com.carrotsearch.randomizedtesting.RandomizedRunner.runSingleTest(RandomizedRunner.java:746)
	at com.carrotsearch.randomizedtesting.RandomizedRunner$3.evaluate(RandomizedRunner.java:648)
	at com.carrotsearch.randomizedtesting.RandomizedRunner$4.evaluate(RandomizedRunner.java:682)
	at com.carrotsearch.randomizedtesting.RandomizedRunner$5.evaluate(RandomizedRunner.java:693)
	at org.apache.lucene.util.AbstractBeforeAfterRule$1.evaluate(AbstractBeforeAfterRule.java:46)
	at org.apache.lucene.util.TestRuleStoreClassName$1.evaluate(TestRuleStoreClassName.java:42)
	at com.carrotsearch.randomizedtesting.rules.SystemPropertiesInvariantRule$1.evaluate(SystemPropertiesInvariantRule.java:55)
	at com.carrotsearch.randomizedtesting.rules.NoShadowingOrOverridesOnMethodsRule$1.evaluate(NoShadowingOrOverridesOnMethodsRule.java:39)
	at com.carrotsearch.randomizedtesting.rules.NoShadowingOrOverridesOnMethodsRule$1.evaluate(NoShadowingOrOverridesOnMethodsRule.java:39)
	at com.carrotsearch.randomizedtesting.rules.StatementAdapter.evaluate(StatementAdapter.java:36)
	at org.apache.lucene.util.TestRuleAssertionsRequired$1.evaluate(TestRuleAssertionsRequired.java:43)
	at org.apache.lucene.util.TestRuleMarkFailure$1.evaluate(TestRuleMarkFailure.java:48)
	at org.apache.lucene.util.TestRuleIgnoreAfterMaxFailures$1.evaluate(TestRuleIgnoreAfterMaxFailures.java:70)
	at org.apache.lucene.util.TestRuleIgnoreTestSuites$1.evaluate(TestRuleIgnoreTestSuites.java:55)
	at com.carrotsearch.randomizedtesting.rules.StatementAdapter.evaluate(StatementAdapter.java:36)
	at com.carrotsearch.randomizedtesting.ThreadLeakControl$StatementRunner.run(ThreadLeakControl.java:358)
	at java.lang.Thread.run(Thread.java:722)




Build Log:
[...truncated 576 lines...]
[junit4:junit4] Suite: org.apache.lucene.index.TestFlushByRamOrCountsPolicy
[junit4:junit4]   2> Feabh 27, 2013 10:42:58 P.M. com.carrotsearch.randomizedtesting.RandomizedRunner$QueueUncaughtExceptionsHandler uncaughtException
[junit4:junit4]   2> WARNING: Uncaught exception in thread: Thread[Thread-861,5,TGRP-TestFlushByRamOrCountsPolicy]
[junit4:junit4]   2> java.lang.RuntimeException: org.apache.lucene.index.CorruptIndexException: docs out of order (62 <= 62 ) (freqOut: MockIndexOutputWrapper(org.apache.lucene.store.RAMOutputStream@24f480))
[junit4:junit4]   2> 	at __randomizedtesting.SeedInfo.seed([5DD61E228367FBB0]:0)
[junit4:junit4]   2> 	at org.apache.lucene.index.TestFlushByRamOrCountsPolicy$IndexThread.run(TestFlushByRamOrCountsPolicy.java:326)
[junit4:junit4]   2> Caused by: org.apache.lucene.index.CorruptIndexException: docs out of order (62 <= 62 ) (freqOut: MockIndexOutputWrapper(org.apache.lucene.store.RAMOutputStream@24f480))
[junit4:junit4]   2> 	at org.apache.lucene.codecs.lucene40.Lucene40PostingsWriter.startDoc(Lucene40PostingsWriter.java:190)
[junit4:junit4]   2> 	at org.apache.lucene.index.FreqProxTermsWriterPerField.flush(FreqProxTermsWriterPerField.java:475)
[junit4:junit4]   2> 	at org.apache.lucene.index.FreqProxTermsWriter.flush(FreqProxTermsWriter.java:85)
[junit4:junit4]   2> 	at org.apache.lucene.index.TermsHash.flush(TermsHash.java:116)
[junit4:junit4]   2> 	at org.apache.lucene.index.DocInverter.flush(DocInverter.java:53)
[junit4:junit4]   2> 	at org.apache.lucene.index.DocFieldProcessor.flush(DocFieldProcessor.java:81)
[junit4:junit4]   2> 	at org.apache.lucene.index.DocumentsWriterPerThread.flush(DocumentsWriterPerThread.java:493)
[junit4:junit4]   2> 	at org.apache.lucene.index.DocumentsWriter.doFlush(DocumentsWriter.java:422)
[junit4:junit4]   2> 	at org.apache.lucene.index.DocumentsWriter.flushAllThreads(DocumentsWriter.java:559)
[junit4:junit4]   2> 	at org.apache.lucene.index.IndexWriter.prepareCommitInternal(IndexWriter.java:2683)
[junit4:junit4]   2> 	at org.apache.lucene.index.IndexWriter.commitInternal(IndexWriter.java:2827)
[junit4:junit4]   2> 	at org.apache.lucene.index.IndexWriter.commit(IndexWriter.java:2807)
[junit4:junit4]   2> 	at org.apache.lucene.index.TestFlushByRamOrCountsPolicy$IndexThread.run(TestFlushByRamOrCountsPolicy.java:322)
[junit4:junit4]   2> 
[junit4:junit4]   1> FAILED exc:
[junit4:junit4]   1> org.apache.lucene.index.CorruptIndexException: docs out of order (62 <= 62 ) (freqOut: MockIndexOutputWrapper(org.apache.lucene.store.RAMOutputStream@24f480))
[junit4:junit4]   1> 	at org.apache.lucene.codecs.lucene40.Lucene40PostingsWriter.startDoc(Lucene40PostingsWriter.java:190)
[junit4:junit4]   1> 	at org.apache.lucene.index.FreqProxTermsWriterPerField.flush(FreqProxTermsWriterPerField.java:475)
[junit4:junit4]   1> 	at org.apache.lucene.index.FreqProxTermsWriter.flush(FreqProxTermsWriter.java:85)
[junit4:junit4]   1> 	at org.apache.lucene.index.TermsHash.flush(TermsHash.java:116)
[junit4:junit4]   1> 	at org.apache.lucene.index.DocInverter.flush(DocInverter.java:53)
[junit4:junit4]   1> 	at org.apache.lucene.index.DocFieldProcessor.flush(DocFieldProcessor.java:81)
[junit4:junit4]   1> 	at org.apache.lucene.index.DocumentsWriterPerThread.flush(DocumentsWriterPerThread.java:493)
[junit4:junit4]   1> 	at org.apache.lucene.index.DocumentsWriter.doFlush(DocumentsWriter.java:422)
[junit4:junit4]   1> 	at org.apache.lucene.index.DocumentsWriter.flushAllThreads(DocumentsWriter.java:559)
[junit4:junit4]   1> 	at org.apache.lucene.index.IndexWriter.prepareCommitInternal(IndexWriter.java:2683)
[junit4:junit4]   1> 	at org.apache.lucene.index.IndexWriter.commitInternal(IndexWriter.java:2827)
[junit4:junit4]   1> 	at org.apache.lucene.index.IndexWriter.commit(IndexWriter.java:2807)
[junit4:junit4]   1> 	at org.apache.lucene.index.TestFlushByRamOrCountsPolicy$IndexThread.run(TestFlushByRamOrCountsPolicy.java:322)
[junit4:junit4]   2> NOTE: reproduce with: ant test  -Dtestcase=TestFlushByRamOrCountsPolicy -Dtests.method=testFlushByRamLargeBuffer -Dtests.seed=5DD61E228367FBB0 -Dtests.multiplier=3 -Dtests.slow=true -Dtests.locale=ga_IE -Dtests.timezone=Etc/GMT+6 -Dtests.file.encoding=ISO-8859-1
[junit4:junit4] ERROR   0.10s J0 | TestFlushByRamOrCountsPolicy.testFlushByRamLargeBuffer <<<
[junit4:junit4]    > Throwable #1: java.lang.AssertionError: expected:<101> but was:<0>
[junit4:junit4]    > 	at org.junit.Assert.fail(Assert.java:93)
[junit4:junit4]    > 	at org.junit.Assert.failNotEquals(Assert.java:647)
[junit4:junit4]    > 	at org.junit.Assert.assertEquals(Assert.java:128)
[junit4:junit4]    > 	at org.junit.Assert.assertEquals(Assert.java:472)
[junit4:junit4]    > 	at org.junit.Assert.assertEquals(Assert.java:456)
[junit4:junit4]    > 	at org.apache.lucene.index.TestFlushByRamOrCountsPolicy.runFlushByRam(TestFlushByRamOrCountsPolicy.java:99)
[junit4:junit4]    > 	at org.apache.lucene.index.TestFlushByRamOrCountsPolicy.testFlushByRamLargeBuffer(TestFlushByRamOrCountsPolicy.java:58)
[junit4:junit4]    > 	at sun.reflect.NativeMethodAccessorImpl.invoke0(Native Method)
[junit4:junit4]    > 	at sun.reflect.NativeMethodAccessorImpl.invoke(NativeMethodAccessorImpl.java:57)
[junit4:junit4]    > 	at sun.reflect.DelegatingMethodAccessorImpl.invoke(DelegatingMethodAccessorImpl.java:43)
[junit4:junit4]    > 	at java.lang.reflect.Method.invoke(Method.java:474)
[junit4:junit4]    > 	at com.carrotsearch.randomizedtesting.RandomizedRunner.invoke(RandomizedRunner.java:1559)
[junit4:junit4]    > 	at com.carrotsearch.randomizedtesting.RandomizedRunner.access$600(RandomizedRunner.java:79)
[junit4:junit4]    > 	at com.carrotsearch.randomizedtesting.RandomizedRunner$6.evaluate(RandomizedRunner.java:737)
[junit4:junit4]    > 	at com.carrotsearch.randomizedtesting.RandomizedRunner$7.evaluate(RandomizedRunner.java:773)
[junit4:junit4]    > 	at com.carrotsearch.randomizedtesting.RandomizedRunner$8.evaluate(RandomizedRunner.java:787)
[junit4:junit4]    > 	at org.apache.lucene.util.TestRuleSetupTeardownChained$1.evaluate(TestRuleSetupTeardownChained.java:50)
[junit4:junit4]    > 	at org.apache.lucene.util.TestRuleFieldCacheSanity$1.evaluate(TestRuleFieldCacheSanity.java:51)
[junit4:junit4]    > 	at org.apache.lucene.util.AbstractBeforeAfterRule$1.evaluate(AbstractBeforeAfterRule.java:46)
[junit4:junit4]    > 	at com.carrotsearch.randomizedtesting.rules.SystemPropertiesInvariantRule$1.evaluate(SystemPropertiesInvariantRule.java:55)
[junit4:junit4]    > 	at org.apache.lucene.util.TestRuleThreadAndTestName$1.evaluate(TestRuleThreadAndTestName.java:49)
[junit4:junit4]    > 	at org.apache.lucene.util.TestRuleIgnoreAfterMaxFailures$1.evaluate(TestRuleIgnoreAfterMaxFailures.java:70)
[junit4:junit4]    > 	at org.apache.lucene.util.TestRuleMarkFailure$1.evaluate(TestRuleMarkFailure.java:48)
[junit4:junit4]    > 	at com.carrotsearch.randomizedtesting.rules.StatementAdapter.evaluate(StatementAdapter.java:36)
[junit4:junit4]    > 	at com.carrotsearch.randomizedtesting.ThreadLeakControl$StatementRunner.run(ThreadLeakControl.java:358)
[junit4:junit4]    > 	at com.carrotsearch.randomizedtesting.ThreadLeakControl.forkTimeoutingTask(ThreadLeakControl.java:782)
[junit4:junit4]    > 	at com.carrotsearch.randomizedtesting.ThreadLeakControl$3.evaluate(ThreadLeakControl.java:442)
[junit4:junit4]    > 	at com.carrotsearch.randomizedtesting.RandomizedRunner.runSingleTest(RandomizedRunner.java:746)
[junit4:junit4]    > 	at com.carrotsearch.randomizedtesting.RandomizedRunner$3.evaluate(RandomizedRunner.java:648)
[junit4:junit4]    > 	at com.carrotsearch.randomizedtesting.RandomizedRunner$4.evaluate(RandomizedRunner.java:682)
[junit4:junit4]    > 	at com.carrotsearch.randomizedtesting.RandomizedRunner$5.evaluate(RandomizedRunner.java:693)
[junit4:junit4]    > 	at org.apache.lucene.util.AbstractBeforeAfterRule$1.evaluate(AbstractBeforeAfterRule.java:46)
[junit4:junit4]    > 	at org.apache.lucene.util.TestRuleStoreClassName$1.evaluate(TestRuleStoreClassName.java:42)
[junit4:junit4]    > 	at com.carrotsearch.randomizedtesting.rules.SystemPropertiesInvariantRule$1.evaluate(SystemPropertiesInvariantRule.java:55)
[junit4:junit4]    > 	at com.carrotsearch.randomizedtesting.rules.NoShadowingOrOverridesOnMethodsRule$1.evaluate(NoShadowingOrOverridesOnMethodsRule.java:39)
[junit4:junit4]    > 	at com.carrotsearch.randomizedtesting.rules.NoShadowingOrOverridesOnMethodsRule$1.evaluate(NoShadowingOrOverridesOnMethodsRule.java:39)
[junit4:junit4]    > 	at com.carrotsearch.randomizedtesting.rules.StatementAdapter.evaluate(StatementAdapter.java:36)
[junit4:junit4]    > 	at org.apache.lucene.util.TestRuleAssertionsRequired$1.evaluate(TestRuleAssertionsRequired.java:43)
[junit4:junit4]    > 	at org.apache.lucene.util.TestRuleMarkFailure$1.evaluate(TestRuleMarkFailure.java:48)
[junit4:junit4]    > 	at org.apache.lucene.util.TestRuleIgnoreAfterMaxFailures$1.evaluate(TestRuleIgnoreAfterMaxFailures.java:70)
[junit4:junit4]    > 	at org.apache.lucene.util.TestRuleIgnoreTestSuites$1.evaluate(TestRuleIgnoreTestSuites.java:55)
[junit4:junit4]    > 	at com.carrotsearch.randomizedtesting.rules.StatementAdapter.evaluate(StatementAdapter.java:36)
[junit4:junit4]    > 	at com.carrotsearch.randomizedtesting.ThreadLeakControl$StatementRunner.run(ThreadLeakControl.java:358)
[junit4:junit4]    > 	at java.lang.Thread.run(Thread.java:722)
[junit4:junit4]    > Throwable #2: com.carrotsearch.randomizedtesting.UncaughtExceptionError: Captured an uncaught exception in thread: Thread[id=983, name=Thread-861, state=RUNNABLE, group=TGRP-TestFlushByRamOrCountsPolicy]
[junit4:junit4]    > Caused by: java.lang.RuntimeException: org.apache.lucene.index.CorruptIndexException: docs out of order (62 <= 62 ) (freqOut: MockIndexOutputWrapper(org.apache.lucene.store.RAMOutputStream@24f480))
[junit4:junit4]    > 	at __randomizedtesting.SeedInfo.seed([5DD61E228367FBB0]:0)
[junit4:junit4]    > 	at org.apache.lucene.index.TestFlushByRamOrCountsPolicy$IndexThread.run(TestFlushByRamOrCountsPolicy.java:326)
[junit4:junit4]    > Caused by: org.apache.lucene.index.CorruptIndexException: docs out of order (62 <= 62 ) (freqOut: MockIndexOutputWrapper(org.apache.lucene.store.RAMOutputStream@24f480))
[junit4:junit4]    > 	at org.apache.lucene.codecs.lucene40.Lucene40PostingsWriter.startDoc(Lucene40PostingsWriter.java:190)
[junit4:junit4]    > 	at org.apache.lucene.index.FreqProxTermsWriterPerField.flush(FreqProxTermsWriterPerField.java:475)
[junit4:junit4]    > 	at org.apache.lucene.index.FreqProxTermsWriter.flush(FreqProxTermsWriter.java:85)
[junit4:junit4]    > 	at org.apache.lucene.index.TermsHash.flush(TermsHash.java:116)
[junit4:junit4]    > 	at org.apache.lucene.index.DocInverter.flush(DocInverter.java:53)
[junit4:junit4]    > 	at org.apache.lucene.index.DocFieldProcessor.flush(DocFieldProcessor.java:81)
[junit4:junit4]    > 	at org.apache.lucene.index.DocumentsWriterPerThread.flush(DocumentsWriterPerThread.java:493)
[junit4:junit4]    > 	at org.apache.lucene.index.DocumentsWriter.doFlush(DocumentsWriter.java:422)
[junit4:junit4]    > 	at org.apache.lucene.index.DocumentsWriter.flushAllThreads(DocumentsWriter.java:559)
[junit4:junit4]    > 	at org.apache.lucene.index.IndexWriter.prepareCommitInternal(IndexWriter.java:2683)
[junit4:junit4]    > 	at org.apache.lucene.index.IndexWriter.commitInternal(IndexWriter.java:2827)
[junit4:junit4]    > 	at org.apache.lucene.index.IndexWriter.commit(IndexWriter.java:2807)
[junit4:junit4]    > 	at org.apache.lucene.index.TestFlushByRamOrCountsPolicy$IndexThread.run(TestFlushByRamOrCountsPolicy.java:322)
[junit4:junit4]   2> Feabh 27, 2013 10:42:58 P.M. com.carrotsearch.randomizedtesting.RandomizedRunner$QueueUncaughtExceptionsHandler uncaughtException
[junit4:junit4]   2> WARNING: Uncaught exception in thread: Thread[Thread-863,5,TGRP-TestFlushByRamOrCountsPolicy]
[junit4:junit4]   2> java.lang.RuntimeException: org.apache.lucene.index.CorruptIndexException: docs out of order (7 <= 8 ) (freqOut: MockIndexOutputWrapper(org.apache.lucene.store.RAMOutputStream@1ef8dd1))
[junit4:junit4]   2> 	at __randomizedtesting.SeedInfo.seed([5DD61E228367FBB0]:0)
[junit4:junit4]   2> 	at org.apache.lucene.index.TestFlushByRamOrCountsPolicy$IndexThread.run(TestFlushByRamOrCountsPolicy.java:326)
[junit4:junit4]   2> Caused by: org.apache.lucene.index.CorruptIndexException: docs out of order (7 <= 8 ) (freqOut: MockIndexOutputWrapper(org.apache.lucene.store.RAMOutputStream@1ef8dd1))
[junit4:junit4]   2> 	at org.apache.lucene.codecs.lucene40.Lucene40PostingsWriter.startDoc(Lucene40PostingsWriter.java:190)
[junit4:junit4]   2> 	at org.apache.lucene.index.FreqProxTermsWriterPerField.flush(FreqProxTermsWriterPerField.java:475)
[junit4:junit4]   2> 	at org.apache.lucene.index.FreqProxTermsWriter.flush(FreqProxTermsWriter.java:85)
[junit4:junit4]   2> 	at org.apache.lucene.index.TermsHash.flush(TermsHash.java:116)
[junit4:junit4]   2> 	at org.apache.lucene.index.DocInverter.flush(DocInverter.java:53)
[junit4:junit4]   2> 	at org.apache.lucene.index.DocFieldProcessor.flush(DocFieldProcessor.java:81)
[junit4:junit4]   2> 	at org.apache.lucene.index.DocumentsWriterPerThread.flush(DocumentsWriterPerThread.java:493)
[junit4:junit4]   2> 	at org.apache.lucene.index.DocumentsWriter.doFlush(DocumentsWriter.java:422)
[junit4:junit4]   2> 	at org.apache.lucene.index.DocumentsWriter.flushAllThreads(DocumentsWriter.java:559)
[junit4:junit4]   2> 	at org.apache.lucene.index.IndexWriter.prepareCommitInternal(IndexWriter.java:2683)
[junit4:junit4]   2> 	at org.apache.lucene.index.IndexWriter.commitInternal(IndexWriter.java:2827)
[junit4:junit4]   2> 	at org.apache.lucene.index.IndexWriter.commit(IndexWriter.java:2807)
[junit4:junit4]   2> 	at org.apache.lucene.index.TestFlushByRamOrCountsPolicy$IndexThread.run(TestFlushByRamOrCountsPolicy.java:322)
[junit4:junit4]   2> 
[junit4:junit4]   1> FAILED exc:
[junit4:junit4]   1> org.apache.lucene.index.CorruptIndexException: docs out of order (7 <= 8 ) (freqOut: MockIndexOutputWrapper(org.apache.lucene.store.RAMOutputStream@1ef8dd1))
[junit4:junit4]   1> 	at org.apache.lucene.codecs.lucene40.Lucene40PostingsWriter.startDoc(Lucene40PostingsWriter.java:190)
[junit4:junit4]   1> 	at org.apache.lucene.index.FreqProxTermsWriterPerField.flush(FreqProxTermsWriterPerField.java:475)
[junit4:junit4]   1> 	at org.apache.lucene.index.FreqProxTermsWriter.flush(FreqProxTermsWriter.java:85)
[junit4:junit4]   1> 	at org.apache.lucene.index.TermsHash.flush(TermsHash.java:116)
[junit4:junit4]   1> 	at org.apache.lucene.index.DocInverter.flush(DocInverter.java:53)
[junit4:junit4]   1> 	at org.apache.lucene.index.DocFieldProcessor.flush(DocFieldProcessor.java:81)
[junit4:junit4]   1> 	at org.apache.lucene.index.DocumentsWriterPerThread.flush(DocumentsWriterPerThread.java:493)
[junit4:junit4]   1> 	at org.apache.lucene.index.DocumentsWriter.doFlush(DocumentsWriter.java:422)
[junit4:junit4]   1> 	at org.apache.lucene.index.DocumentsWriter.flushAllThreads(DocumentsWriter.java:559)
[junit4:junit4]   1> 	at org.apache.lucene.index.IndexWriter.prepareCommitInternal(IndexWriter.java:2683)
[junit4:junit4]   1> 	at org.apache.lucene.index.IndexWriter.commitInternal(IndexWriter.java:2827)
[junit4:junit4]   1> 	at org.apache.lucene.index.IndexWriter.commit(IndexWriter.java:2807)
[junit4:junit4]   1> 	at org.apache.lucene.index.TestFlushByRamOrCountsPolicy$IndexThread.run(TestFlushByRamOrCountsPolicy.java:322)
[junit4:junit4]   2> NOTE: reproduce with: ant test  -Dtestcase=TestFlushByRamOrCountsPolicy -Dtests.method=testFlushDocCount -Dtests.seed=5DD61E228367FBB0 -Dtests.multiplier=3 -Dtests.slow=true -Dtests.locale=ga_IE -Dtests.timezone=Etc/GMT+6 -Dtests.file.encoding=ISO-8859-1
[junit4:junit4] ERROR   0.09s J0 | TestFlushByRamOrCountsPolicy.testFlushDocCount <<<
[junit4:junit4]    > Throwable #1: java.lang.AssertionError: expected:<173> but was:<160>
[junit4:junit4]    > 	at org.junit.Assert.fail(Assert.java:93)
[junit4:junit4]    > 	at org.junit.Assert.failNotEquals(Assert.java:647)
[junit4:junit4]    > 	at org.junit.Assert.assertEquals(Assert.java:128)
[junit4:junit4]    > 	at org.junit.Assert.assertEquals(Assert.java:472)
[junit4:junit4]    > 	at org.junit.Assert.assertEquals(Assert.java:456)
[junit4:junit4]    > 	at org.apache.lucene.index.TestFlushByRamOrCountsPolicy.testFlushDocCount(TestFlushByRamOrCountsPolicy.java:156)
[junit4:junit4]    > 	at sun.reflect.NativeMethodAccessorImpl.invoke0(Native Method)
[junit4:junit4]    > 	at sun.reflect.NativeMethodAccessorImpl.invoke(NativeMethodAccessorImpl.java:57)
[junit4:junit4]    > 	at sun.reflect.DelegatingMethodAccessorImpl.invoke(DelegatingMethodAccessorImpl.java:43)
[junit4:junit4]    > 	at java.lang.reflect.Method.invoke(Method.java:474)
[junit4:junit4]    > 	at com.carrotsearch.randomizedtesting.RandomizedRunner.invoke(RandomizedRunner.java:1559)
[junit4:junit4]    > 	at com.carrotsearch.randomizedtesting.RandomizedRunner.access$600(RandomizedRunner.java:79)
[junit4:junit4]    > 	at com.carrotsearch.randomizedtesting.RandomizedRunner$6.evaluate(RandomizedRunner.java:737)
[junit4:junit4]    > 	at com.carrotsearch.randomizedtesting.RandomizedRunner$7.evaluate(RandomizedRunner.java:773)
[junit4:junit4]    > 	at com.carrotsearch.randomizedtesting.RandomizedRunner$8.evaluate(RandomizedRunner.java:787)
[junit4:junit4]    > 	at org.apache.lucene.util.TestRuleSetupTeardownChained$1.evaluate(TestRuleSetupTeardownChained.java:50)
[junit4:junit4]    > 	at org.apache.lucene.util.TestRuleFieldCacheSanity$1.evaluate(TestRuleFieldCacheSanity.java:51)
[junit4:junit4]    > 	at org.apache.lucene.util.AbstractBeforeAfterRule$1.evaluate(AbstractBeforeAfterRule.java:46)
[junit4:junit4]    > 	at com.carrotsearch.randomizedtesting.rules.SystemPropertiesInvariantRule$1.evaluate(SystemPropertiesInvariantRule.java:55)
[junit4:junit4]    > 	at org.apache.lucene.util.TestRuleThreadAndTestName$1.evaluate(TestRuleThreadAndTestName.java:49)
[junit4:junit4]    > 	at org.apache.lucene.util.TestRuleIgnoreAfterMaxFailures$1.evaluate(TestRuleIgnoreAfterMaxFailures.java:70)
[junit4:junit4]    > 	at org.apache.lucene.util.TestRuleMarkFailure$1.evaluate(TestRuleMarkFailure.java:48)
[junit4:junit4]    > 	at com.carrotsearch.randomizedtesting.rules.StatementAdapter.evaluate(StatementAdapter.java:36)
[junit4:junit4]    > 	at com.carrotsearch.randomizedtesting.ThreadLeakControl$StatementRunner.run(ThreadLeakControl.java:358)
[junit4:junit4]    > 	at com.carrotsearch.randomizedtesting.ThreadLeakControl.forkTimeoutingTask(ThreadLeakControl.java:782)
[junit4:junit4]    > 	at com.carrotsearch.randomizedtesting.ThreadLeakControl$3.evaluate(ThreadLeakControl.java:442)
[junit4:junit4]    > 	at com.carrotsearch.randomizedtesting.RandomizedRunner.runSingleTest(RandomizedRunner.java:746)
[junit4:junit4]    > 	at com.carrotsearch.randomizedtesting.RandomizedRunner$3.evaluate(RandomizedRunner.java:648)
[junit4:junit4]    > 	at com.carrotsearch.randomizedtesting.RandomizedRunner$4.evaluate(RandomizedRunner.java:682)
[junit4:junit4]    > 	at com.carrotsearch.randomizedtesting.RandomizedRunner$5.evaluate(RandomizedRunner.java:693)
[junit4:junit4]    > 	at org.apache.lucene.util.AbstractBeforeAfterRule$1.evaluate(AbstractBeforeAfterRule.java:46)
[junit4:junit4]    > 	at org.apache.lucene.util.TestRuleStoreClassName$1.evaluate(TestRuleStoreClassName.java:42)
[junit4:junit4]    > 	at com.carrotsearch.randomizedtesting.rules.SystemPropertiesInvariantRule$1.evaluate(SystemPropertiesInvariantRule.java:55)
[junit4:junit4]    > 	at com.carrotsearch.randomizedtesting.rules.NoShadowingOrOverridesOnMethodsRule$1.evaluate(NoShadowingOrOverridesOnMethodsRule.java:39)
[junit4:junit4]    > 	at com.carrotsearch.randomizedtesting.rules.NoShadowingOrOverridesOnMethodsRule$1.evaluate(NoShadowingOrOverridesOnMethodsRule.java:39)
[junit4:junit4]    > 	at com.carrotsearch.randomizedtesting.rules.StatementAdapter.evaluate(StatementAdapter.java:36)
[junit4:junit4]    > 	at org.apache.lucene.util.TestRuleAssertionsRequired$1.evaluate(TestRuleAssertionsRequired.java:43)
[junit4:junit4]    > 	at org.apache.lucene.util.TestRuleMarkFailure$1.evaluate(TestRuleMarkFailure.java:48)
[junit4:junit4]    > 	at org.apache.lucene.util.TestRuleIgnoreAfterMaxFailures$1.evaluate(TestRuleIgnoreAfterMaxFailures.java:70)
[junit4:junit4]    > 	at org.apache.lucene.util.TestRuleIgnoreTestSuites$1.evaluate(TestRuleIgnoreTestSuites.java:55)
[junit4:junit4]    > 	at com.carrotsearch.randomizedtesting.rules.StatementAdapter.evaluate(StatementAdapter.java:36)
[junit4:junit4]    > 	at com.carrotsearch.randomizedtesting.ThreadLeakControl$StatementRunner.run(ThreadLeakControl.java:358)
[junit4:junit4]    > 	at java.lang.Thread.run(Thread.java:722)
[junit4:junit4]    > Throwable #2: com.carrotsearch.randomizedtesting.UncaughtExceptionError: Captured an uncaught exception in thread: Thread[id=985, name=Thread-863, state=RUNNABLE, group=TGRP-TestFlushByRamOrCountsPolicy]
[junit4:junit4]    > Caused by: java.lang.RuntimeException: org.apache.lucene.index.CorruptIndexException: docs out of order (7 <= 8 ) (freqOut: MockIndexOutputWrapper(org.apache.lucene.store.RAMOutputStream@1ef8dd1))
[junit4:junit4]    > 	at __randomizedtesting.SeedInfo.seed([5DD61E228367FBB0]:0)
[junit4:junit4]    > 	at org.apache.lucene.index.TestFlushByRamOrCountsPolicy$IndexThread.run(TestFlushByRamOrCountsPolicy.java:326)
[junit4:junit4]    > Caused by: org.apache.lucene.index.CorruptIndexException: docs out of order (7 <= 8 ) (freqOut: MockIndexOutputWrapper(org.apache.lucene.store.RAMOutputStream@1ef8dd1))
[junit4:junit4]    > 	at org.apache.lucene.codecs.lucene40.Lucene40PostingsWriter.startDoc(Lucene40PostingsWriter.java:190)
[junit4:junit4]    > 	at org.apache.lucene.index.FreqProxTermsWriterPerField.flush(FreqProxTermsWriterPerField.java:475)
[junit4:junit4]    > 	at org.apache.lucene.index.FreqProxTermsWriter.flush(FreqProxTermsWriter.java:85)
[junit4:junit4]    > 	at org.apache.lucene.index.TermsHash.flush(TermsHash.java:116)
[junit4:junit4]    > 	at org.apache.lucene.index.DocInverter.flush(DocInverter.java:53)
[junit4:junit4]    > 	at org.apache.lucene.index.DocFieldProcessor.flush(DocFieldProcessor.java:81)
[junit4:junit4]    > 	at org.apache.lucene.index.DocumentsWriterPerThread.flush(DocumentsWriterPerThread.java:493)
[junit4:junit4]    > 	at org.apache.lucene.index.DocumentsWriter.doFlush(DocumentsWriter.java:422)
[junit4:junit4]    > 	at org.apache.lucene.index.DocumentsWriter.flushAllThreads(DocumentsWriter.java:559)
[junit4:junit4]    > 	at org.apache.lucene.index.IndexWriter.prepareCommitInternal(IndexWriter.java:2683)
[junit4:junit4]    > 	at org.apache.lucene.index.IndexWriter.commitInternal(IndexWriter.java:2827)
[junit4:junit4]    > 	at org.apache.lucene.index.IndexWriter.commit(IndexWriter.java:2807)
[junit4:junit4]    > 	at org.apache.lucene.index.TestFlushByRamOrCountsPolicy$IndexThread.run(TestFlushByRamOrCountsPolicy.java:322)
[junit4:junit4]   2> Feabh 27, 2013 10:42:58 P.M. com.carrotsearch.randomizedtesting.RandomizedRunner$QueueUncaughtExceptionsHandler uncaughtException
[junit4:junit4]   2> WARNING: Uncaught exception in thread: Thread[Thread-877,5,TGRP-TestFlushByRamOrCountsPolicy]
[junit4:junit4]   2> java.lang.RuntimeException: org.apache.lucene.index.CorruptIndexException: docs out of order (10 <= 10 ) (freqOut: MockIndexOutputWrapper(org.apache.lucene.store.RAMOutputStream@8ae0f))
[junit4:junit4]   2> 	at __randomizedtesting.SeedInfo.seed([5DD61E228367FBB0]:0)
[junit4:junit4]   2> 	at org.apache.lucene.index.TestFlushByRamOrCountsPolicy$IndexThread.run(TestFlushByRamOrCountsPolicy.java:326)
[junit4:junit4]   2> Caused by: org.apache.lucene.index.CorruptIndexException: docs out of order (10 <= 10 ) (freqOut: MockIndexOutputWrapper(org.apache.lucene.store.RAMOutputStream@8ae0f))
[junit4:junit4]   2> 	at org.apache.lucene.codecs.lucene40.Lucene40PostingsWriter.startDoc(Lucene40PostingsWriter.java:190)
[junit4:junit4]   2> 	at org.apache.lucene.index.FreqProxTermsWriterPerField.flush(FreqProxTermsWriterPerField.java:475)
[junit4:junit4]   2> 	at org.apache.lucene.index.FreqProxTermsWriter.flush(FreqProxTermsWriter.java:85)
[junit4:junit4]   2> 	at org.apache.lucene.index.TermsHash.flush(TermsHash.java:116)
[junit4:junit4]   2> 	at org.apache.lucene.index.DocInverter.flush(DocInverter.java:53)
[junit4:junit4]   2> 	at org.apache.lucene.index.DocFieldProcessor.flush(DocFieldProcessor.java:81)
[junit4:junit4]   2> 	at org.apache.lucene.index.DocumentsWriterPerThread.flush(DocumentsWriterPerThread.java:493)
[junit4:junit4]   2> 	at org.apache.lucene.index.DocumentsWriter.doFlush(DocumentsWriter.java:422)
[junit4:junit4]   2> 	at org.apache.lucene.index.DocumentsWriter.flushAllThreads(DocumentsWriter.java:559)
[junit4:junit4]   2> 	at org.apache.lucene.index.IndexWriter.prepareCommitInternal(IndexWriter.java:2683)
[junit4:junit4]   2> 	at org.apache.lucene.index.IndexWriter.commitInternal(IndexWriter.java:2827)
[junit4:junit4]   2> 	at org.apache.lucene.index.IndexWriter.commit(IndexWriter.java:2807)
[junit4:junit4]   2> 	at org.apache.lucene.index.TestFlushByRamOrCountsPolicy$IndexThread.run(TestFlushByRamOrCountsPolicy.java:318)
[junit4:junit4]   2> 
[junit4:junit4]   1> FAILED exc:
[junit4:junit4]   1> org.apache.lucene.index.CorruptIndexException: docs out of order (10 <= 10 ) (freqOut: MockIndexOutputWrapper(org.apache.lucene.store.RAMOutputStream@8ae0f))
[junit4:junit4]   1> 	at org.apache.lucene.codecs.lucene40.Lucene40PostingsWriter.startDoc(Lucene40PostingsWriter.java:190)
[junit4:junit4]   1> 	at org.apache.lucene.index.FreqProxTermsWriterPerField.flush(FreqProxTermsWriterPerField.java:475)
[junit4:junit4]   1> 	at org.apache.lucene.index.FreqProxTermsWriter.flush(FreqProxTermsWriter.java:85)
[junit4:junit4]   1> 	at org.apache.lucene.index.TermsHash.flush(TermsHash.java:116)
[junit4:junit4]   1> 	at org.apache.lucene.index.DocInverter.flush(DocInverter.java:53)
[junit4:junit4]   1> 	at org.apache.lucene.index.DocFieldProcessor.flush(DocFieldProcessor.java:81)
[junit4:junit4]   1> 	at org.apache.lucene.index.DocumentsWriterPerThread.flush(DocumentsWriterPerThread.java:493)
[junit4:junit4]   1> 	at org.apache.lucene.index.DocumentsWriter.doFlush(DocumentsWriter.java:422)
[junit4:junit4]   1> 	at org.apache.lucene.index.DocumentsWriter.flushAllThreads(DocumentsWriter.java:559)
[junit4:junit4]   1> 	at org.apache.lucene.index.IndexWriter.prepareCommitInternal(IndexWriter.java:2683)
[junit4:junit4]   1> 	at org.apache.lucene.index.IndexWriter.commitInternal(IndexWriter.java:2827)
[junit4:junit4]   1> 	at org.apache.lucene.index.IndexWriter.commit(IndexWriter.java:2807)
[junit4:junit4]   1> 	at org.apache.lucene.index.TestFlushByRamOrCountsPolicy$IndexThread.run(TestFlushByRamOrCountsPolicy.java:318)
[junit4:junit4]   2> NOTE: reproduce with: ant test  -Dtestcase=TestFlushByRamOrCountsPolicy -Dtests.method=testRandom -Dtests.seed=5DD61E228367FBB0 -Dtests.multiplier=3 -Dtests.slow=true -Dtests.locale=ga_IE -Dtests.timezone=Etc/GMT+6 -Dtests.file.encoding=ISO-8859-1
[junit4:junit4] ERROR   0.06s J0 | TestFlushByRamOrCountsPolicy.testRandom <<<
[junit4:junit4]    > Throwable #1: java.lang.AssertionError: expected:<288> but was:<50>
[junit4:junit4]    > 	at org.junit.Assert.fail(Assert.java:93)
[junit4:junit4]    > 	at org.junit.Assert.failNotEquals(Assert.java:647)
[junit4:junit4]    > 	at org.junit.Assert.assertEquals(Assert.java:128)
[junit4:junit4]    > 	at org.junit.Assert.assertEquals(Assert.java:472)
[junit4:junit4]    > 	at org.junit.Assert.assertEquals(Assert.java:456)
[junit4:junit4]    > 	at org.apache.lucene.index.TestFlushByRamOrCountsPolicy.testRandom(TestFlushByRamOrCountsPolicy.java:201)
[junit4:junit4]    > 	at sun.reflect.NativeMethodAccessorImpl.invoke0(Native Method)
[junit4:junit4]    > 	at sun.reflect.NativeMethodAccessorImpl.invoke(NativeMethodAccessorImpl.java:57)
[junit4:junit4]    > 	at sun.reflect.DelegatingMethodAccessorImpl.invoke(DelegatingMethodAccessorImpl.java:43)
[junit4:junit4]    > 	at java.lang.reflect.Method.invoke(Method.java:474)
[junit4:junit4]    > 	at com.carrotsearch.randomizedtesting.RandomizedRunner.invoke(RandomizedRunner.java:1559)
[junit4:junit4]    > 	at com.carrotsearch.randomizedtesting.RandomizedRunner.access$600(RandomizedRunner.java:79)
[junit4:junit4]    > 	at com.carrotsearch.randomizedtesting.RandomizedRunner$6.evaluate(RandomizedRunner.java:737)
[junit4:junit4]    > 	at com.carrotsearch.randomizedtesting.RandomizedRunner$7.evaluate(RandomizedRunner.java:773)
[junit4:junit4]    > 	at com.carrotsearch.randomizedtesting.RandomizedRunner$8.evaluate(RandomizedRunner.java:787)
[junit4:junit4]    > 	at org.apache.lucene.util.TestRuleSetupTeardownChained$1.evaluate(TestRuleSetupTeardownChained.java:50)
[junit4:junit4]    > 	at org.apache.lucene.util.TestRuleFieldCacheSanity$1.evaluate(TestRuleFieldCacheSanity.java:51)
[junit4:junit4]    > 	at org.apache.lucene.util.AbstractBeforeAfterRule$1.evaluate(AbstractBeforeAfterRule.java:46)
[junit4:junit4]    > 	at com.carrotsearch.randomizedtesting.rules.SystemPropertiesInvariantRule$1.evaluate(SystemPropertiesInvariantRule.java:55)
[junit4:junit4]    > 	at org.apache.lucene.util.TestRuleThreadAndTestName$1.evaluate(TestRuleThreadAndTestName.java:49)
[junit4:junit4]    > 	at org.apache.lucene.util.TestRuleIgnoreAfterMaxFailures$1.evaluate(TestRuleIgnoreAfterMaxFailures.java:70)
[junit4:junit4]    > 	at org.apache.lucene.util.TestRuleMarkFailure$1.evaluate(TestRuleMarkFailure.java:48)
[junit4:junit4]    > 	at com.carrotsearch.randomizedtesting.rules.StatementAdapter.evaluate(StatementAdapter.java:36)
[junit4:junit4]    > 	at com.carrotsearch.randomizedtesting.ThreadLeakControl$StatementRunner.run(ThreadLeakControl.java:358)
[junit4:junit4]    > 	at com.carrotsearch.randomizedtesting.ThreadLeakControl.forkTimeoutingTask(ThreadLeakControl.java:782)
[junit4:junit4]    > 	at com.carrotsearch.randomizedtesting.ThreadLeakControl$3.evaluate(ThreadLeakControl.java:442)
[junit4:junit4]    > 	at com.carrotsearch.randomizedtesting.RandomizedRunner.runSingleTest(RandomizedRunner.java:746)
[junit4:junit4]    > 	at com.carrotsearch.randomizedtesting.RandomizedRunner$3.evaluate(RandomizedRunner.java:648)
[junit4:junit4]    > 	at com.carrotsearch.randomizedtesting.RandomizedRunner$4.evaluate(RandomizedRunner.java:682)
[junit4:junit4]    > 	at com.carrotsearch.randomizedtesting.RandomizedRunner$5.evaluate(RandomizedRunner.java:693)
[junit4:junit4]    > 	at org.apache.lucene.util.AbstractBeforeAfterRule$1.evaluate(AbstractBeforeAfterRule.java:46)
[junit4:junit4]    > 	at org.apache.lucene.util.TestRuleStoreClassName$1.evaluate(TestRuleStoreClassName.java:42)
[junit4:junit4]    > 	at com.carrotsearch.randomizedtesting.rules.SystemPropertiesInvariantRule$1.evaluate(SystemPropertiesInvariantRule.java:55)
[junit4:junit4]    > 	at com.carrotsearch.randomizedtesting.rules.NoShadowingOrOverridesOnMethodsRule$1.evaluate(NoShadowingOrOverridesOnMethodsRule.java:39)
[junit4:junit4]    > 	at com.carrotsearch.randomizedtesting.rules.NoShadowingOrOverridesOnMethodsRule$1.evaluate(NoShadowingOrOverridesOnMethodsRule.java:39)
[junit4:junit4]    > 	at com.carrotsearch.randomizedtesting.rules.StatementAdapter.evaluate(StatementAdapter.java:36)
[junit4:junit4]    > 	at org.apache.lucene.util.TestRuleAssertionsRequired$1.evaluate(TestRuleAssertionsRequired.java:43)
[junit4:junit4]    > 	at org.apache.lucene.util.TestRuleMarkFailure$1.evaluate(TestRuleMarkFailure.java:48)
[junit4:junit4]    > 	at org.apache.lucene.util.TestRuleIgnoreAfterMaxFailures$1.evaluate(TestRuleIgnoreAfterMaxFailures.java:70)
[junit4:junit4]    > 	at org.apache.lucene.util.TestRuleIgnoreTestSuites$1.evaluate(TestRuleIgnoreTestSuites.java:55)
[junit4:junit4]    > 	at com.carrotsearch.randomizedtesting.rules.StatementAdapter.evaluate(StatementAdapter.java:36)
[junit4:junit4]    > 	at com.carrotsearch.randomizedtesting.ThreadLeakControl$StatementRunner.run(ThreadLeakControl.java:358)
[junit4:junit4]    > 	at java.lang.Thread.run(Thread.java:722)
[junit4:junit4]    > Throwable #2: com.carrotsearch.randomizedtesting.UncaughtExceptionError: Captured an uncaught exception in thread: Thread[id=999, name=Thread-877, state=RUNNABLE, group=TGRP-TestFlushByRamOrCountsPolicy]
[junit4:junit4]    > Caused by: java.lang.RuntimeException: org.apache.lucene.index.CorruptIndexException: docs out of order (10 <= 10 ) (freqOut: MockIndexOutputWrapper(org.apache.lucene.store.RAMOutputStream@8ae0f))
[junit4:junit4]    > 	at __randomizedtesting.SeedInfo.seed([5DD61E228367FBB0]:0)
[junit4:junit4]    > 	at org.apache.lucene.index.TestFlushByRamOrCountsPolicy$IndexThread.run(TestFlushByRamOrCountsPolicy.java:326)
[junit4:junit4]    > Caused by: org.apache.lucene.index.CorruptIndexException: docs out of order (10 <= 10 ) (freqOut: MockIndexOutputWrapper(org.apache.lucene.store.RAMOutputStream@8ae0f))
[junit4:junit4]    > 	at org.apache.lucene.codecs.lucene40.Lucene40PostingsWriter.startDoc(Lucene40PostingsWriter.java:190)
[junit4:junit4]    > 	at org.apache.lucene.index.FreqProxTermsWriterPerField.flush(FreqProxTermsWriterPerField.java:475)
[junit4:junit4]    > 	at org.apache.lucene.index.FreqProxTermsWriter.flush(FreqProxTermsWriter.java:85)
[junit4:junit4]    > 	at org.apache.lucene.index.TermsHash.flush(TermsHash.java:116)
[junit4:junit4]    > 	at org.apache.lucene.index.DocInverter.flush(DocInverter.java:53)
[junit4:junit4]    > 	at org.apache.lucene.index.DocFieldProcessor.flush(DocFieldProcessor.java:81)
[junit4:junit4]    > 	at org.apache.lucene.index.DocumentsWriterPerThread.flush(DocumentsWriterPerThread.java:493)
[junit4:junit4]    > 	at org.apache.lucene.index.DocumentsWriter.doFlush(DocumentsWriter.java:422)
[junit4:junit4]    > 	at org.apache.lucene.index.DocumentsWriter.flushAllThreads(DocumentsWriter.java:559)
[junit4:junit4]    > 	at org.apache.lucene.index.IndexWriter.prepareCommitInternal(IndexWriter.java:2683)
[junit4:junit4]    > 	at org.apache.lucene.index.IndexWriter.commitInternal(IndexWriter.java:2827)
[junit4:junit4]    > 	at org.apache.lucene.index.IndexWriter.commit(IndexWriter.java:2807)
[junit4:junit4]    > 	at org.apache.lucene.index.TestFlushByRamOrCountsPolicy$IndexThread.run(TestFlushByRamOrCountsPolicy.java:318)
[junit4:junit4]   2> Feabh 27, 2013 10:42:59 P.M. com.carrotsearch.randomizedtesting.RandomizedRunner$QueueUncaughtExceptionsHandler uncaughtException
[junit4:junit4]   2> WARNING: Uncaught exception in thread: Thread[Thread-878,5,TGRP-TestFlushByRamOrCountsPolicy]
[junit4:junit4]   2> java.lang.RuntimeException: org.apache.lucene.index.CorruptIndexException: docs out of order (82 <= 82 ) (freqOut: MockIndexOutputWrapper(org.apache.lucene.store.RAMOutputStream@10ec7b6))
[junit4:junit4]   2> 	at __randomizedtesting.SeedInfo.seed([5DD61E228367FBB0]:0)
[junit4:junit4]   2> 	at org.apache.lucene.index.TestFlushByRamOrCountsPolicy$IndexThread.run(TestFlushByRamOrCountsPolicy.java:326)
[junit4:junit4]   2> Caused by: org.apache.lucene.index.CorruptIndexException: docs out of order (82 <= 82 ) (freqOut: MockIndexOutputWrapper(org.apache.lucene.store.RAMOutputStream@10ec7b6))
[junit4:junit4]   2> 	at org.apache.lucene.codecs.lucene40.Lucene40PostingsWriter.startDoc(Lucene40PostingsWriter.java:190)
[junit4:junit4]   2> 	at org.apache.lucene.index.FreqProxTermsWriterPerField.flush(FreqProxTermsWriterPerField.java:475)
[junit4:junit4]   2> 	at org.apache.lucene.index.FreqProxTermsWriter.flush(FreqProxTermsWriter.java:85)
[junit4:junit4]   2> 	at org.apache.lucene.index.TermsHash.flush(TermsHash.java:116)
[junit4:junit4]   2> 	at org.apache.lucene.index.DocInverter.flush(DocInverter.java:53)
[junit4:junit4]   2> 	at org.apache.lucene.index.DocFieldProcessor.flush(DocFieldProcessor.java:81)
[junit4:junit4]   2> 	at org.apache.lucene.index.DocumentsWriterPerThread.flush(DocumentsWriterPerThread.java:493)
[junit4:junit4]   2> 	at org.apache.lucene.index.DocumentsWriter.doFlush(DocumentsWriter.java:422)
[junit4:junit4]   2> 	at org.apache.lucene.index.DocumentsWriter.flushAllThreads(DocumentsWriter.java:559)
[junit4:junit4]   2> 	at org.apache.lucene.index.IndexWriter.prepareCommitInternal(IndexWriter.java:2683)
[junit4:junit4]   2> 	at org.apache.lucene.index.IndexWriter.commitInternal(IndexWriter.java:2827)
[junit4:junit4]   2> 	at org.apache.lucene.index.IndexWriter.commit(IndexWriter.java:2807)
[junit4:junit4]   2> 	at org.apache.lucene.index.TestFlushByRamOrCountsPolicy$IndexThread.run(TestFlushByRamOrCountsPolicy.java:322)
[junit4:junit4]   2> 
[junit4:junit4]   1> FAILED exc:
[junit4:junit4]   1> org.apache.lucene.index.CorruptIndexException: docs out of order (82 <= 82 ) (freqOut: MockIndexOutputWrapper(org.apache.lucene.store.RAMOutputStream@10ec7b6))
[junit4:junit4]   1> 	at org.apache.lucene.codecs.lucene40.Lucene40PostingsWriter.startDoc(Lucene40PostingsWriter.java:190)
[junit4:junit4]   1> 	at org.apache.lucene.index.FreqProxTermsWriterPerField.flush(FreqProxTermsWriterPerField.java:475)
[junit4:junit4]   1> 	at org.apache.lucene.index.FreqProxTermsWriter.flush(FreqProxTermsWriter.java:85)
[junit4:junit4]   1> 	at org.apache.lucene.index.TermsHash.flush(TermsHash.java:116)
[junit4:junit4]   1> 	at org.apache.lucene.index.DocInverter.flush(DocInverter.java:53)
[junit4:junit4]   1> 	at org.apache.lucene.index.DocFieldProcessor.flush(DocFieldProcessor.java:81)
[junit4:junit4]   1> 	at org.apache.lucene.index.DocumentsWriterPerThread.flush(DocumentsWriterPerThread.java:493)
[junit4:junit4]   1> 	at org.apache.lucene.index.DocumentsWriter.doFlush(DocumentsWriter.java:422)
[junit4:junit4]   1> 	at org.apache.lucene.index.DocumentsWriter.flushAllThreads(DocumentsWriter.java:559)
[junit4:junit4]   1> 	at org.apache.lucene.index.IndexWriter.prepareCommitInternal(IndexWriter.java:2683)
[junit4:junit4]   1> 	at org.apache.lucene.index.IndexWriter.commitInternal(IndexWriter.java:2827)
[junit4:junit4]   1> 	at org.apache.lucene.index.IndexWriter.commit(IndexWriter.java:2807)
[junit4:junit4]   1> 	at org.apache.lucene.index.TestFlushByRamOrCountsPolicy$IndexThread.run(TestFlushByRamOrCountsPolicy.java:322)
[junit4:junit4]   2> NOTE: reproduce with: ant test  -Dtestcase=TestFlushByRamOrCountsPolicy -Dtests.method=testFlushByRam -Dtests.seed=5DD61E228367FBB0 -Dtests.multiplier=3 -Dtests.slow=true -Dtests.locale=ga_IE -Dtests.timezone=Etc/GMT+6 -Dtests.file.encoding=ISO-8859-1
[junit4:junit4] ERROR   0.09s J0 | TestFlushByRamOrCountsPolicy.testFlushByRam <<<
[junit4:junit4]    > Throwable #1: java.lang.AssertionError: expected:<132> but was:<0>
[junit4:junit4]    > 	at org.junit.Assert.fail(Assert.java:93)
[junit4:junit4]    > 	at org.junit.Assert.failNotEquals(Assert.java:647)
[junit4:junit4]    > 	at org.junit.Assert.assertEquals(Assert.java:128)
[junit4:junit4]    > 	at org.junit.Assert.assertEquals(Assert.java:472)
[junit4:junit4]    > 	at org.junit.Assert.assertEquals(Assert.java:456)
[junit4:junit4]    > 	at org.apache.lucene.index.TestFlushByRamOrCountsPolicy.runFlushByRam(TestFlushByRamOrCountsPolicy.java:99)
[junit4:junit4]    > 	at org.apache.lucene.index.TestFlushByRamOrCountsPolicy.testFlushByRam(TestFlushByRamOrCountsPolicy.java:53)
[junit4:junit4]    > 	at sun.reflect.NativeMethodAccessorImpl.invoke0(Native Method)
[junit4:junit4]    > 	at sun.reflect.NativeMethodAccessorImpl.invoke(NativeMethodAccessorImpl.java:57)
[junit4:junit4]    > 	at sun.reflect.DelegatingMethodAccessorImpl.invoke(DelegatingMethodAccessorImpl.java:43)
[junit4:junit4]    > 	at java.lang.reflect.Method.invoke(Method.java:474)
[junit4:junit4]    > 	at com.carrotsearch.randomizedtesting.RandomizedRunner.invoke(RandomizedRunner.java:1559)
[junit4:junit4]    > 	at com.carrotsearch.randomizedtesting.RandomizedRunner.access$600(RandomizedRunner.java:79)
[junit4:junit4]    > 	at com.carrotsearch.randomizedtesting.RandomizedRunner$6.evaluate(RandomizedRunner.java:737)
[junit4:junit4]    > 	at com.carrotsearch.randomizedtesting.RandomizedRunner$7.evaluate(RandomizedRunner.java:773)
[junit4:junit4]    > 	at com.carrotsearch.randomizedtesting.RandomizedRunner$8.evaluate(RandomizedRunner.java:787)
[junit4:junit4]    > 	at org.apache.lucene.util.TestRuleSetupTeardownChained$1.evaluate(TestRuleSetupTeardownChained.java:50)
[junit4:junit4]    > 	at org.apache.lucene.util.TestRuleFieldCacheSanity$1.evaluate(TestRuleFieldCacheSanity.java:51)
[junit4:junit4]    > 	at org.apache.lucene.util.AbstractBeforeAfterRule$1.evaluate(AbstractBeforeAfterRule.java:46)
[junit4:junit4]    > 	at com.carrotsearch.randomizedtesting.rules.SystemPropertiesInvariantRule$1.evaluate(SystemPropertiesInvariantRule.java:55)
[junit4:junit4]    > 	at org.apache.lucene.util.TestRuleThreadAndTestName$1.evaluate(TestRuleThreadAndTestName.java:49)
[junit4:junit4]    > 	at org.apache.lucene.util.TestRuleIgnoreAfterMaxFailures$1.evaluate(TestRuleIgnoreAfterMaxFailures.java:70)
[junit4:junit4]    > 	at org.apache.lucene.util.TestRuleMarkFailure$1.evaluate(TestRuleMarkFailure.java:48)
[junit4:junit4]    > 	at com.carrotsearch.randomizedtesting.rules.StatementAdapter.evaluate(StatementAdapter.java:36)
[junit4:junit4]    > 	at com.carrotsearch.randomizedtesting.ThreadLeakControl$StatementRunner.run(ThreadLeakControl.java:358)
[junit4:junit4]    > 	at com.carrotsearch.randomizedtesting.ThreadLeakControl.forkTimeoutingTask(ThreadLeakControl.java:782)
[junit4:junit4]    > 	at com.carrotsearch.randomizedtesting.ThreadLeakControl$3.evaluate(ThreadLeakControl.java:442)
[junit4:junit4]    > 	at com.carrotsearch.randomizedtesting.RandomizedRunner.runSingleTest(RandomizedRunner.java:746)
[junit4:junit4]    > 	at com.carrotsearch.randomizedtesting.RandomizedRunner$3.evaluate(RandomizedRunner.java:648)
[junit4:junit4]    > 	at com.carrotsearch.randomizedtesting.RandomizedRunner$4.evaluate(RandomizedRunner.java:682)
[junit4:junit4]    > 	at com.carrotsearch.randomizedtesting.RandomizedRunner$5.evaluate(RandomizedRunner.java:693)
[junit4:junit4]    > 	at org.apache.lucene.util.AbstractBeforeAfterRule$1.evaluate(AbstractBeforeAfterRule.java:46)
[junit4:junit4]    > 	at org.apache.lucene.util.TestRuleStoreClassName$1.evaluate(TestRuleStoreClassName.java:42)
[junit4:junit4]    > 	at com.carrotsearch.randomizedtesting.rules.SystemPropertiesInvariantRule$1.evaluate(SystemPropertiesInvariantRule.java:55)
[junit4:junit4]    > 	at com.carrotsearch.randomizedtesting.rules.NoShadowingOrOverridesOnMethodsRule$1.evaluate(NoShadowingOrOverridesOnMethodsRule.java:39)
[junit4:junit4]    > 	at com.carrotsearch.randomizedtesting.rules.NoShadowingOrOverridesOnMethodsRule$1.evaluate(NoShadowingOrOverridesOnMethodsRule.java:39)
[junit4:junit4]    > 	at com.carrotsearch.randomizedtesting.rules.StatementAdapter.evaluate(StatementAdapter.java:36)
[junit4:junit4]    > 	at org.apache.lucene.util.TestRuleAssertionsRequired$1.evaluate(TestRuleAssertionsRequired.java:43)
[junit4:junit4]    > 	at org.apache.lucene.util.TestRuleMarkFailure$1.evaluate(TestRuleMarkFailure.java:48)
[junit4:junit4]    > 	at org.apache.lucene.util.TestRuleIgnoreAfterMaxFailures$1.evaluate(TestRuleIgnoreAfterMaxFailures.java:70)
[junit4:junit4]    > 	at org.apache.lucene.util.TestRuleIgnoreTestSuites$1.evaluate(TestRuleIgnoreTestSuites.java:55)
[junit4:junit4]    > 	at com.carrotsearch.randomizedtesting.rules.StatementAdapter.evaluate(StatementAdapter.java:36)
[junit4:junit4]    > 	at com.carrotsearch.randomizedtesting.ThreadLeakControl$StatementRunner.run(ThreadLeakControl.java:358)
[junit4:junit4]    > 	at java.lang.Thread.run(Thread.java:722)
[junit4:junit4]    > Throwable #2: com.carrotsearch.randomizedtesting.UncaughtExceptionError: Captured an uncaught exception in thread: Thread[id=1000, name=Thread-878, state=RUNNABLE, group=TGRP-TestFlushByRamOrCountsPolicy]
[junit4:junit4]    > Caused by: java.lang.RuntimeException: org.apache.lucene.index.CorruptIndexException: docs out of order (82 <= 82 ) (freqOut: MockIndexOutputWrapper(org.apache.lucene.store.RAMOutputStream@10ec7b6))
[junit4:junit4]    > 	at __randomizedtesting.SeedInfo.seed([5DD61E228367FBB0]:0)
[junit4:junit4]    > 	at org.apache.lucene.index.TestFlushByRamOrCountsPolicy$IndexThread.run(TestFlushByRamOrCountsPolicy.java:326)
[junit4:junit4]    > Caused by: org.apache.lucene.index.CorruptIndexException: docs out of order (82 <= 82 ) (freqOut: MockIndexOutputWrapper(org.apache.lucene.store.RAMOutputStream@10ec7b6))
[junit4:junit4]    > 	at org.apache.lucene.codecs.lucene40.Lucene40PostingsWriter.startDoc(Lucene40PostingsWriter.java:190)
[junit4:junit4]    > 	at org.apache.lucene.index.FreqProxTermsWriterPerField.flush(FreqProxTermsWriterPerField.java:475)
[junit4:junit4]    > 	at org.apache.lucene.index.FreqProxTermsWriter.flush(FreqProxTermsWriter.java:85)
[junit4:junit4]    > 	at org.apache.lucene.index.TermsHash.flush(TermsHash.java:116)
[junit4:junit4]    > 	at org.apache.lucene.index.DocInverter.flush(DocInverter.java:53)
[junit4:junit4]    > 	at org.apache.lucene.index.DocFieldProcessor.flush(DocFieldProcessor.java:81)
[junit4:junit4]    > 	at org.apache.lucene.index.DocumentsWriterPerThread.flush(DocumentsWriterPerThread.java:493)
[junit4:junit4]    > 	at org.apache.lucene.index.DocumentsWriter.doFlush(DocumentsWriter.java:422)
[junit4:junit4]    > 	at org.apache.lucene.index.DocumentsWriter.flushAllThreads(DocumentsWriter.java:559)
[junit4:junit4]    > 	at org.apache.lucene.index.IndexWriter.prepareCommitInternal(IndexWriter.java:2683)
[junit4:junit4]    > 	at org.apache.lucene.index.IndexWriter.commitInternal(IndexWriter.java:2827)
[junit4:junit4]    > 	at org.apache.lucene.index.IndexWriter.commit(IndexWriter.java:2807)
[junit4:junit4]    > 	at org.apache.lucene.index.TestFlushByRamOrCountsPolicy$IndexThread.run(TestFlushByRamOrCountsPolicy.java:322)
[junit4:junit4]   2> NOTE: test params are: codec=Appending, sim=DefaultSimilarity, locale=ga_IE, timezone=Etc/GMT+6
[junit4:junit4]   2> NOTE: Linux 3.2.0-38-generic i386/Oracle Corporation 1.8.0-ea (32-bit)/cpus=8,threads=1,free=64875840,total=325058560
[junit4:junit4]   2> NOTE: All tests run in this JVM: [TestDirectory, TestDoubleBarrelLRUCache, TestStressIndexing, TestVersion, TestOpenBitSet, TestMergeSchedulerExternal, TestCharTermAttributeImpl, TestSimilarityProvider, TestFieldCacheRangeFilter, TestPayloadSpans, TestFieldCacheTermsFilter, TestLucene40TermVectorsFormat, TestMultiFields, TestDocumentsWriterStallControl, TestCachingCollector, TestNot, Nested1, TestLock, TestThreadedForceMerge, TestNoDeletionPolicy, TestDocumentWriter, TestNumericUtils, TestBackwardsCompatibility, TestReaderClosed, TestGraphTokenizers, TestIndexableField, TestIndexWriter, TestStressIndexing2, TestFilterAtomicReader, TestRegexpQuery, TestAttributeSource, TestRamUsageEstimatorOnWildAnimals, TestSegmentMerger, TestSimilarityBase, TestLucene40DocValuesFormat, TestParallelAtomicReader, TestIndexFileDeleter, TestIndexWriterCommit, TestPayloadExplanations, TestBagOfPostings, TestSetOnce, TestIndexWriterWithThreads, TestArrayUtil, TestPhrasePrefixQuery, TestTermScorer, TestElevationComparator, TestUnicodeUtil, TestConcurrentMergeScheduler, TestFlushByRamOrCountsPolicy]
[junit4:junit4] Completed on J0 in 0.65s, 5 tests, 4 errors <<< FAILURES!

[...truncated 10 lines...]
[junit4:junit4] Suite: org.apache.lucene.index.TestPostingsOffsets
[junit4:junit4]   2> NOTE: reproduce with: ant test  -Dtestcase=TestPostingsOffsets -Dtests.method=testRandom -Dtests.seed=5DD61E228367FBB0 -Dtests.multiplier=3 -Dtests.slow=true -Dtests.locale=en_US -Dtests.timezone=Poland -Dtests.file.encoding=ISO-8859-1
[junit4:junit4] ERROR   0.12s J0 | TestPostingsOffsets.testRandom <<<
[junit4:junit4]    > Throwable #1: org.apache.lucene.index.CorruptIndexException: docs out of order (0 <= 0 ) (docOut: MockIndexOutputWrapper(org.apache.lucene.store.RAMOutputStream@501bda))
[junit4:junit4]    > 	at __randomizedtesting.SeedInfo.seed([5DD61E228367FBB0:2F9A3B2D32074DC3]:0)
[junit4:junit4]    > 	at org.apache.lucene.codecs.lucene41.Lucene41PostingsWriter.startDoc(Lucene41PostingsWriter.java:243)
[junit4:junit4]    > 	at org.apache.lucene.index.FreqProxTermsWriterPerField.flush(FreqProxTermsWriterPerField.java:475)
[junit4:junit4]    > 	at org.apache.lucene.index.FreqProxTermsWriter.flush(FreqProxTermsWriter.java:85)
[junit4:junit4]    > 	at org.apache.lucene.index.TermsHash.flush(TermsHash.java:116)
[junit4:junit4]    > 	at org.apache.lucene.index.DocInverter.flush(DocInverter.java:53)
[junit4:junit4]    > 	at org.apache.lucene.index.DocFieldProcessor.flush(DocFieldProcessor.java:81)
[junit4:junit4]    > 	at org.apache.lucene.index.DocumentsWriterPerThread.flush(DocumentsWriterPerThread.java:493)
[junit4:junit4]    > 	at org.apache.lucene.index.DocumentsWriter.doFlush(DocumentsWriter.java:422)
[junit4:junit4]    > 	at org.apache.lucene.index.DocumentsWriter.flushAllThreads(DocumentsWriter.java:559)
[junit4:junit4]    > 	at org.apache.lucene.index.IndexWriter.prepareCommitInternal(IndexWriter.java:2683)
[junit4:junit4]    > 	at org.apache.lucene.index.IndexWriter.commitInternal(IndexWriter.java:2827)
[junit4:junit4]    > 	at org.apache.lucene.index.IndexWriter.commit(IndexWriter.java:2807)
[junit4:junit4]    > 	at org.apache.lucene.index.RandomIndexWriter.getReader(RandomIndexWriter.java:318)
[junit4:junit4]    > 	at org.apache.lucene.index.RandomIndexWriter.getReader(RandomIndexWriter.java:255)
[junit4:junit4]    > 	at org.apache.lucene.index.TestPostingsOffsets.testRandom(TestPostingsOffsets.java:289)
[junit4:junit4]    > 	at sun.reflect.NativeMethodAccessorImpl.invoke0(Native Method)
[junit4:junit4]    > 	at sun.reflect.NativeMethodAccessorImpl.invoke(NativeMethodAccessorImpl.java:57)
[junit4:junit4]    > 	at sun.reflect.DelegatingMethodAccessorImpl.invoke(DelegatingMethodAccessorImpl.java:43)
[junit4:junit4]    > 	at java.lang.reflect.Method.invoke(Method.java:474)
[junit4:junit4]    > 	at com.carrotsearch.randomizedtesting.RandomizedRunner.invoke(RandomizedRunner.java:1559)
[junit4:junit4]    > 	at com.carrotsearch.randomizedtesting.RandomizedRunner.access$600(RandomizedRunner.java:79)
[junit4:junit4]    > 	at com.carrotsearch.randomizedtesting.RandomizedRunner$6.evaluate(RandomizedRunner.java:737)
[junit4:junit4]    > 	at com.carrotsearch.randomizedtesting.RandomizedRunner$7.evaluate(RandomizedRunner.java:773)
[junit4:junit4]    > 	at com.carrotsearch.randomizedtesting.RandomizedRunner$8.evaluate(RandomizedRunner.java:787)
[junit4:junit4]    > 	at org.apache.lucene.util.TestRuleSetupTeardownChained$1.evaluate(TestRuleSetupTeardownChained.java:50)
[junit4:junit4]    > 	at org.apache.lucene.util.TestRuleFieldCacheSanity$1.evaluate(TestRuleFieldCacheSanity.java:51)
[junit4:junit4]    > 	at org.apache.lucene.util.AbstractBeforeAfterRule$1.evaluate(AbstractBeforeAfterRule.java:46)
[junit4:junit4]    > 	at com.carrotsearch.randomizedtesting.rules.SystemPropertiesInvariantRule$1.evaluate(SystemPropertiesInvariantRule.java:55)
[junit4:junit4]    > 	at org.apache.lucene.util.TestRuleThreadAndTestName$1.evaluate(TestRuleThreadAndTestName.java:49)
[junit4:junit4]    > 	at org.apache.lucene.util.TestRuleIgnoreAfterMaxFailures$1.evaluate(TestRuleIgnoreAfterMaxFailures.java:70)
[junit4:junit4]    > 	at org.apache.lucene.util.TestRuleMarkFailure$1.evaluate(TestRuleMarkFailure.java:48)
[junit4:junit4]    > 	at com.carrotsearch.randomizedtesting.rules.StatementAdapter.evaluate(StatementAdapter.java:36)
[junit4:junit4]    > 	at com.carrotsearch.randomizedtesting.ThreadLeakControl$StatementRunner.run(ThreadLeakControl.java:358)
[junit4:junit4]    > 	at com.carrotsearch.randomizedtesting.ThreadLeakControl.forkTimeoutingTask(ThreadLeakControl.java:782)
[junit4:junit4]    > 	at com.carrotsearch.randomizedtesting.ThreadLeakControl$3.evaluate(ThreadLeakControl.java:442)
[junit4:junit4]    > 	at com.carrotsearch.randomizedtesting.RandomizedRunner.runSingleTest(RandomizedRunner.java:746)
[junit4:junit4]    > 	at com.carrotsearch.randomizedtesting.RandomizedRunner$3.evaluate(RandomizedRunner.java:648)
[junit4:junit4]    > 	at com.carrotsearch.randomizedtesting.RandomizedRunner$4.evaluate(RandomizedRunner.java:682)
[junit4:junit4]    > 	at com.carrotsearch.randomizedtesting.RandomizedRunner$5.evaluate(RandomizedRunner.java:693)
[junit4:junit4]    > 	at org.apache.lucene.util.AbstractBeforeAfterRule$1.evaluate(AbstractBeforeAfterRule.java:46)
[junit4:junit4]    > 	at org.apache.lucene.util.TestRuleStoreClassName$1.evaluate(TestRuleStoreClassName.java:42)
[junit4:junit4]    > 	at com.carrotsearch.randomizedtesting.rules.SystemPropertiesInvariantRule$1.evaluate(SystemPropertiesInvariantRule.java:55)
[junit4:junit4]    > 	at com.carrotsearch.randomizedtesting.rules.NoShadowingOrOverridesOnMethodsRule$1.evaluate(NoShadowingOrOverridesOnMethodsRule.java:39)
[junit4:junit4]    > 	at com.carrotsearch.randomizedtesting.rules.NoShadowingOrOverridesOnMethodsRule$1.evaluate(NoShadowingOrOverridesOnMethodsRule.java:39)
[junit4:junit4]    > 	at com.carrotsearch.randomizedtesting.rules.StatementAdapter.evaluate(StatementAdapter.java:36)
[junit4:junit4]    > 	at org.apache.lucene.util.TestRuleAssertionsRequired$1.evaluate(TestRuleAssertionsRequired.java:43)
[junit4:junit4]    > 	at org.apache.lucene.util.TestRuleMarkFailure$1.evaluate(TestRuleMarkFailure.java:48)
[junit4:junit4]    > 	at org.apache.lucene.util.TestRuleIgnoreAfterMaxFailures$1.evaluate(TestRuleIgnoreAfterMaxFailures.java:70)
[junit4:junit4]    > 	at org.apache.lucene.util.TestRuleIgnoreTestSuites$1.evaluate(TestRuleIgnoreTestSuites.java:55)
[junit4:junit4]    > 	at com.carrotsearch.randomizedtesting.rules.StatementAdapter.evaluate(StatementAdapter.java:36)
[junit4:junit4]    > 	at com.carrotsearch.randomizedtesting.ThreadLeakControl$StatementRunner.run(ThreadLeakControl.java:358)
[junit4:junit4]    > 	at java.lang.Thread.run(Thread.java:722)
[junit4:junit4]   2> NOTE: test params are: codec=Lucene41, sim=RandomSimilarityProvider(queryNorm=true,coord=no): {oddeven=BM25(k1=1.2,b=0.75), foo=IB LL-D3(800.0), numbers=DFR I(F)L3(800.0), body=DFR GB3(800.0), content3=DFR GBZ(0.3), content=DFR I(n)L1}, locale=en_US, timezone=Poland
[junit4:junit4]   2> NOTE: Linux 3.2.0-38-generic i386/Oracle Corporation 1.8.0-ea (32-bit)/cpus=8,threads=1,free=191994136,total=325058560
[junit4:junit4]   2> NOTE: All tests run in this JVM: [TestDirectory, TestDoubleBarrelLRUCache, TestStressIndexing, TestVersion, TestOpenBitSet, TestMergeSchedulerExternal, TestCharTermAttributeImpl, TestSimilarityProvider, TestFieldCacheRangeFilter, TestPayloadSpans, TestFieldCacheTermsFilter, TestLucene40TermVectorsFormat, TestMultiFields, TestDocumentsWriterStallControl, TestCachingCollector, TestNot, Nested1, TestLock, TestThreadedForceMerge, TestNoDeletionPolicy, TestDocumentWriter, TestNumericUtils, TestBackwardsCompatibility, TestReaderClosed, TestGraphTokenizers, TestIndexableField, TestIndexWriter, TestStressIndexing2, TestFilterAtomicReader, TestRegexpQuery, TestAttributeSource, TestRamUsageEstimatorOnWildAnimals, TestSegmentMerger, TestSimilarityBase, TestLucene40DocValuesFormat, TestParallelAtomicReader, TestIndexFileDeleter, TestIndexWriterCommit, TestPayloadExplanations, TestBagOfPostings, TestSetOnce, TestIndexWriterWithThreads, TestArrayUtil, TestPhrasePrefixQuery, TestTermScorer, TestElevationComparator, TestUnicodeUtil, TestConcurrentMergeScheduler, TestFlushByRamOrCountsPolicy, TestCheckIndex, TestNGramPhraseQuery, TestCrash, TestPostingsOffsets]
[junit4:junit4] Completed on J0 in 1.36s, 11 tests, 1 error <<< FAILURES!

[...truncated 244 lines...]
[junit4:junit4] Suite: org.apache.lucene.index.TestNRTThreads
[junit4:junit4]   2> NOTE: reproduce with: ant test  -Dtestcase=TestNRTThreads -Dtests.method=testNRTThreads -Dtests.seed=5DD61E228367FBB0 -Dtests.multiplier=3 -Dtests.slow=true -Dtests.locale=sk -Dtests.timezone=Africa/Asmara -Dtests.file.encoding=ISO-8859-1
[junit4:junit4] ERROR   0.22s J0 | TestNRTThreads.testNRTThreads <<<
[junit4:junit4]    > Throwable #1: org.apache.lucene.index.CorruptIndexException: docs out of order (77 <= 77 ) (docOut: MockIndexOutputWrapper(org.apache.lucene.store.FSDirectory$FSIndexOutput@bb37a2))
[junit4:junit4]    > 	at __randomizedtesting.SeedInfo.seed([5DD61E228367FBB0:C60F0A39C29CEDDB]:0)
[junit4:junit4]    > 	at org.apache.lucene.codecs.lucene41.Lucene41PostingsWriter.startDoc(Lucene41PostingsWriter.java:243)
[junit4:junit4]    > 	at org.apache.lucene.index.FreqProxTermsWriterPerField.flush(FreqProxTermsWriterPerField.java:475)
[junit4:junit4]    > 	at org.apache.lucene.index.FreqProxTermsWriter.flush(FreqProxTermsWriter.java:85)
[junit4:junit4]    > 	at org.apache.lucene.index.TermsHash.flush(TermsHash.java:116)
[junit4:junit4]    > 	at org.apache.lucene.index.DocInverter.flush(DocInverter.java:53)
[junit4:junit4]    > 	at org.apache.lucene.index.DocFieldProcessor.flush(DocFieldProcessor.java:81)
[junit4:junit4]    > 	at org.apache.lucene.index.DocumentsWriterPerThread.flush(DocumentsWriterPerThread.java:493)
[junit4:junit4]    > 	at org.apache.lucene.index.DocumentsWriter.doFlush(DocumentsWriter.java:422)
[junit4:junit4]    > 	at org.apache.lucene.index.DocumentsWriter.flushAllThreads(DocumentsWriter.java:559)
[junit4:junit4]    > 	at org.apache.lucene.index.IndexWriter.getReader(IndexWriter.java:357)
[junit4:junit4]    > 	at org.apache.lucene.index.DirectoryReader.open(DirectoryReader.java:110)
[junit4:junit4]    > 	at org.apache.lucene.index.TestNRTThreads.doSearching(TestNRTThreads.java:39)
[junit4:junit4]    > 	at org.apache.lucene.index.ThreadedIndexingAndSearchingTestCase.runTest(ThreadedIndexingAndSearchingTestCase.java:507)
[junit4:junit4]    > 	at org.apache.lucene.index.TestNRTThreads.testNRTThreads(TestNRTThreads.java:128)
[junit4:junit4]    > 	at sun.reflect.NativeMethodAccessorImpl.invoke0(Native Method)
[junit4:junit4]    > 	at sun.reflect.NativeMethodAccessorImpl.invoke(NativeMethodAccessorImpl.java:57)
[junit4:junit4]    > 	at sun.reflect.DelegatingMethodAccessorImpl.invoke(DelegatingMethodAccessorImpl.java:43)
[junit4:junit4]    > 	at java.lang.reflect.Method.invoke(Method.java:474)
[junit4:junit4]    > 	at com.carrotsearch.randomizedtesting.RandomizedRunner.invoke(RandomizedRunner.java:1559)
[junit4:junit4]    > 	at com.carrotsearch.randomizedtesting.RandomizedRunner.access$600(RandomizedRunner.java:79)
[junit4:junit4]    > 	at com.carrotsearch.randomizedtesting.RandomizedRunner$6.evaluate(RandomizedRunner.java:737)
[junit4:junit4]    > 	at com.carrotsearch.randomizedtesting.RandomizedRunner$7.evaluate(RandomizedRunner.java:773)
[junit4:junit4]    > 	at com.carrotsearch.randomizedtesting.RandomizedRunner$8.evaluate(RandomizedRunner.java:787)
[junit4:junit4]    > 	at org.apache.lucene.util.TestRuleSetupTeardownChained$1.evaluate(TestRuleSetupTeardownChained.java:50)
[junit4:junit4]    > 	at org.apache.lucene.util.TestRuleFieldCacheSanity$1.evaluate(TestRuleFieldCacheSanity.java:51)
[junit4:junit4]    > 	at org.apache.lucene.util.AbstractBeforeAfterRule$1.evaluate(AbstractBeforeAfterRule.java:46)
[junit4:junit4]    > 	at com.carrotsearch.randomizedtesting.rules.SystemPropertiesInvariantRule$1.evaluate(SystemPropertiesInvariantRule.java:55)
[junit4:junit4]    > 	at org.apache.lucene.util.TestRuleThreadAndTestName$1.evaluate(TestRuleThreadAndTestName.java:49)
[junit4:junit4]    > 	at org.apache.lucene.util.TestRuleIgnoreAfterMaxFailures$1.evaluate(TestRuleIgnoreAfterMaxFailures.java:70)
[junit4:junit4]    > 	at org.apache.lucene.util.TestRuleMarkFailure$1.evaluate(TestRuleMarkFailure.java:48)
[junit4:junit4]    > 	at com.carrotsearch.randomizedtesting.rules.StatementAdapter.evaluate(StatementAdapter.java:36)
[junit4:junit4]    > 	at com.carrotsearch.randomizedtesting.ThreadLeakControl$StatementRunner.run(ThreadLeakControl.java:358)
[junit4:junit4]    > 	at com.carrotsearch.randomizedtesting.ThreadLeakControl.forkTimeoutingTask(ThreadLeakControl.java:782)
[junit4:junit4]    > 	at com.carrotsearch.randomizedtesting.ThreadLeakControl$3.evaluate(ThreadLeakControl.java:442)
[junit4:junit4]    > 	at com.carrotsearch.randomizedtesting.RandomizedRunner.runSingleTest(RandomizedRunner.java:746)
[junit4:junit4]    > 	at com.carrotsearch.randomizedtesting.RandomizedRunner$3.evaluate(RandomizedRunner.java:648)
[junit4:junit4]    > 	at com.carrotsearch.randomizedtesting.RandomizedRunner$4.evaluate(RandomizedRunner.java:682)
[junit4:junit4]    > 	at com.carrotsearch.randomizedtesting.RandomizedRunner$5.evaluate(RandomizedRunner.java:693)
[junit4:junit4]    > 	at org.apache.lucene.util.AbstractBeforeAfterRule$1.evaluate(AbstractBeforeAfterRule.java:46)
[junit4:junit4]    > 	at org.apache.lucene.util.TestRuleStoreClassName$1.evaluate(TestRuleStoreClassName.java:42)
[junit4:junit4]    > 	at com.carrotsearch.randomizedtesting.rules.SystemPropertiesInvariantRule$1.evaluate(SystemPropertiesInvariantRule.java:55)
[junit4:junit4]    > 	at com.carrotsearch.randomizedtesting.rules.NoShadowingOrOverridesOnMethodsRule$1.evaluate(NoShadowingOrOverridesOnMethodsRule.java:39)
[junit4:junit4]    > 	at com.carrotsearch.randomizedtesting.rules.NoShadowingOrOverridesOnMethodsRule$1.evaluate(NoShadowingOrOverridesOnMethodsRule.java:39)
[junit4:junit4]    > 	at com.carrotsearch.randomizedtesting.rules.StatementAdapter.evaluate(StatementAdapter.java:36)
[junit4:junit4]    > 	at org.apache.lucene.util.TestRuleAssertionsRequired$1.evaluate(TestRuleAssertionsRequired.java:43)
[junit4:junit4]    > 	at org.apache.lucene.util.TestRuleMarkFailure$1.evaluate(TestRuleMarkFailure.java:48)
[junit4:junit4]    > 	at org.apache.lucene.util.TestRuleIgnoreAfterMaxFailures$1.evaluate(TestRuleIgnoreAfterMaxFailures.java:70)
[junit4:junit4]    > 	at org.apache.lucene.util.TestRuleIgnoreTestSuites$1.evaluate(TestRuleIgnoreTestSuites.java:55)
[junit4:junit4]    > 	at com.carrotsearch.randomizedtesting.rules.StatementAdapter.evaluate(StatementAdapter.java:36)
[junit4:junit4]    > 	at com.carrotsearch.randomizedtesting.ThreadLeakControl$StatementRunner.run(ThreadLeakControl.java:358)
[junit4:junit4]    > 	at java.lang.Thread.run(Thread.java:722)
[junit4:junit4]   2> Feb 28, 2013 4:45:50 AM com.carrotsearch.randomizedtesting.ThreadLeakControl checkThreadLeaks
[junit4:junit4]   2> WARNING: Will linger awaiting termination of 4 leaked thread(s).
[junit4:junit4]   2> org.apache.lucene.index.CorruptIndexException: docs out of order (73 <= 73 ) (docOut: MockIndexOutputWrapper(org.apache.lucene.store.FSDirectory$FSIndexOutput@1322c1))
[junit4:junit4]   2> 	at org.apache.lucene.codecs.lucene41.Lucene41PostingsWriter.startDoc(Lucene41PostingsWriter.java:243)
[junit4:junit4]   2> 	at org.apache.lucene.index.FreqProxTermsWriterPerField.flush(FreqProxTermsWriterPerField.java:475)
[junit4:junit4]   2> 	at org.apache.lucene.index.FreqProxTermsWriter.flush(FreqProxTermsWriter.java:85)
[junit4:junit4]   2> 	at org.apache.lucene.index.TermsHash.flush(TermsHash.java:116)
[junit4:junit4]   2> 	at org.apache.lucene.index.DocInverter.flush(DocInverter.java:53)
[junit4:junit4]   2> 	at org.apache.lucene.index.DocFieldProcessor.flush(DocFieldProcessor.java:81)
[junit4:junit4]   2> 	at org.apache.lucene.index.DocumentsWriterPerThread.flush(DocumentsWriterPerThread.java:493)
[junit4:junit4]   2> 	at org.apache.lucene.index.DocumentsWriter.doFlush(DocumentsWriter.java:422)
[junit4:junit4]   2> 	at org.apache.lucene.index.DocumentsWriter.preUpdate(DocumentsWriter.java:292)
[junit4:junit4]   2> 	at org.apache.lucene.index.DocumentsWriter.updateDocument(DocumentsWriter.java:361)
[junit4:junit4]   2> 	at org.apache.lucene.index.IndexWriter.updateDocument(IndexWriter.java:1473)
[junit4:junit4]   2> 	at org.apache.lucene.index.IndexWriter.updateDocument(IndexWriter.java:1445)
[junit4:junit4]   2> 	at org.apache.lucene.index.ThreadedIndexingAndSearchingTestCase.updateDocument(ThreadedIndexingAndSearchingTestCase.java:105)
[junit4:junit4]   2> 	at org.apache.lucene.index.ThreadedIndexingAndSearchingTestCase$1.run(ThreadedIndexingAndSearchingTestCase.java:252)
[junit4:junit4]   2> Feb 28, 2013 4:45:50 AM com.carrotsearch.randomizedtesting.RandomizedRunner$QueueUncaughtExceptionsHandler uncaughtException
[junit4:junit4]   2> WARNING: Uncaught exception in thread: Thread[Thread-1334,5,TGRP-TestNRTThreads]
[junit4:junit4]   2> java.lang.RuntimeException: org.apache.lucene.index.CorruptIndexException: docs out of order (73 <= 73 ) (docOut: MockIndexOutputWrapper(org.apache.lucene.store.FSDirectory$FSIndexOutput@1322c1))
[junit4:junit4]   2> 	at __randomizedtesting.SeedInfo.seed([5DD61E228367FBB0]:0)
[junit4:junit4]   2> 	at org.apache.lucene.index.ThreadedIndexingAndSearchingTestCase$1.run(ThreadedIndexingAndSearchingTestCase.java:300)
[junit4:junit4]   2> Caused by: org.apache.lucene.index.CorruptIndexException: docs out of order (73 <= 73 ) (docOut: MockIndexOutputWrapper(org.apache.lucene.store.FSDirectory$FSIndexOutput@1322c1))
[junit4:junit4]   2> 	at org.apache.lucene.codecs.lucene41.Lucene41PostingsWriter.startDoc(Lucene41PostingsWriter.java:243)
[junit4:junit4]   2> 	at org.apache.lucene.index.FreqProxTermsWriterPerField.flush(FreqProxTermsWriterPerField.java:475)
[junit4:junit4]   2> 	at org.apache.lucene.index.FreqProxTermsWriter.flush(FreqProxTermsWriter.java:85)
[junit4:junit4]   2> 	at org.apache.lucene.index.TermsHash.flush(TermsHash.java:116)
[junit4:junit4]   2> 	at org.apache.lucene.index.DocInverter.flush(DocInverter.java:53)
[junit4:junit4]   2> 	at org.apache.lucene.index.DocFieldProcessor.flush(DocFieldProcessor.java:81)
[junit4:junit4]   2> 	at org.apache.lucene.index.DocumentsWriterPerThread.flush(DocumentsWriterPerThread.java:493)
[junit4:junit4]   2> 	at org.apache.lucene.index.DocumentsWriter.doFlush(DocumentsWriter.java:422)
[junit4:junit4]   2> 	at org.apache.lucene.index.DocumentsWriter.preUpdate(DocumentsWriter.java:292)
[junit4:junit4]   2> 	at org.apache.lucene.index.DocumentsWriter.updateDocument(DocumentsWriter.java:361)
[junit4:junit4]   2> 	at org.apache.lucene.index.IndexWriter.updateDocument(IndexWriter.java:1473)
[junit4:junit4]   2> 	at org.apache.lucene.index.IndexWriter.updateDocument(IndexWriter.java:1445)
[junit4:junit4]   2> 	at org.apache.lucene.index.ThreadedIndexingAndSearchingTestCase.updateDocument(ThreadedIndexingAndSearchingTestCase.java:105)
[junit4:junit4]   2> 	at org.apache.lucene.index.ThreadedIndexingAndSearchingTestCase$1.run(ThreadedIndexingAndSearchingTestCase.java:252)
[junit4:junit4]   2> 
[junit4:junit4]   1> Thread-1334: hit exc
[junit4:junit4]   2> NOTE: test params are: codec=Lucene42: {extra27=PostingsFormat(name=NestedPulsing), extra1=PostingsFormat(name=NestedPulsing), title=PostingsFormat(name=MockRandom), extra17=Lucene41(blocksize=128), body=Lucene41(blocksize=128), extra11=PostingsFormat(name=MockRandom), extra20=Lucene41(blocksize=128), extra24=Lucene41(blocksize=128), extra38=PostingsFormat(name=NestedPulsing), titleTokenized=PostingsFormat(name=MockSep), docid=PostingsFormat(name=NestedPulsing), date=Lucene41(blocksize=128), packID=PostingsFormat(name=MockRandom), extra8=PostingsFormat(name=MockRandom), extra2=Lucene41(blocksize=128), extra30=PostingsFormat(name=NestedPulsing), extra15=PostingsFormat(name=MockRandom), extra5=PostingsFormat(name=NestedPulsing), extra7=PostingsFormat(name=MockSep)}, docValues:{titleDV=DocValuesFormat(name=Disk)}, sim=DefaultSimilarity, locale=sk, timezone=Africa/Asmara
[junit4:junit4]   2> NOTE: Linux 3.2.0-38-generic i386/Oracle Corporation 1.8.0-ea (32-bit)/cpus=8,threads=1,free=147370968,total=451936256
[junit4:junit4]   2> NOTE: All tests run in this JVM: [TestDirectory, TestDoubleBarrelLRUCache, TestStressIndexing, TestVersion, TestOpenBitSet, TestMergeSchedulerExternal, TestCharTermAttributeImpl, TestSimilarityProvider, TestFieldCacheRangeFilter, TestPayloadSpans, TestFieldCacheTermsFilter, TestLucene40TermVectorsFormat, TestMultiFields, TestDocumentsWriterStallControl, TestCachingCollector, TestNot, Nested1, TestLock, TestThreadedForceMerge, TestNoDeletionPolicy, TestDocumentWriter, TestNumericUtils, TestBackwardsCompatibility, TestReaderClosed, TestGraphTokenizers, TestIndexableField, TestIndexWriter, TestStressIndexing2, TestFilterAtomicReader, TestRegexpQuery, TestAttributeSource, TestRamUsageEstimatorOnWildAnimals, TestSegmentMerger, TestSimilarityBase, TestLucene40DocValuesFormat, TestParallelAtomicReader, TestIndexFileDeleter, TestIndexWriterCommit, TestPayloadExplanations, TestBagOfPostings, TestSetOnce, TestIndexWriterWithThreads, TestArrayUtil, TestPhrasePrefixQuery, TestTermScorer, TestElevationComparator, TestUnicodeUtil, TestConcurrentMergeScheduler, TestFlushByRamOrCountsPolicy, TestCheckIndex, TestNGramPhraseQuery, TestCrash, TestPostingsOffsets, TestSimpleExplanations, TestIndexWriterReader, TestDocTermOrdsRangeFilter, TestCrashCausesCorruptIndex, TestExternalCodecs, TestFlex, TestIndexWriterOnJRECrash, Test2BPostingsBytes, Nested1, TestPhraseQuery, TestPrefixRandom, TestSearchForDuplicates, TestPositiveScoresOnlyCollector, TestIndexableBinaryStringTools, TestConjunctions, TestSearcherManager, TestRecyclingByteBlockAllocator, TestOmitTf, TestSumDocFreq, TestPerFieldDocValuesFormat, InAfterClass, InTestMethod, NonStringProperties, InBeforeClass, TestIOUtils, TestBinaryDocument, TestSort, TestRecyclingIntBlockAllocator, TestSurrogates, TestMultiValuedNumericRangeQuery, TestSloppyPhraseQuery, ThrowInUncaught, TestWildcardRandom, TestTopScoreDocCollector, Nested, TestIndexWriterExceptions, TestNRTThreads]
[junit4:junit4]   2> NOTE: reproduce with: ant test  -Dtestcase=TestNRTThreads -Dtests.seed=5DD61E228367FBB0 -Dtests.multiplier=3 -Dtests.slow=true -Dtests.locale=sk -Dtests.timezone=Africa/Asmara -Dtests.file.encoding=ISO-8859-1
[junit4:junit4] ERROR   0.00s J0 | TestNRTThreads (suite) <<<
[junit4:junit4]    > Throwable #1: com.carrotsearch.randomizedtesting.UncaughtExceptionError: Captured an uncaught exception in thread: Thread[id=1561, name=Thread-1334, state=RUNNABLE, group=TGRP-TestNRTThreads]
[junit4:junit4]    > Caused by: java.lang.RuntimeException: org.apache.lucene.index.CorruptIndexException: docs out of order (73 <= 73 ) (docOut: MockIndexOutputWrapper(org.apache.lucene.store.FSDirectory$FSIndexOutput@1322c1))
[junit4:junit4]    > 	at __randomizedtesting.SeedInfo.seed([5DD61E228367FBB0]:0)
[junit4:junit4]    > 	at org.apache.lucene.index.ThreadedIndexingAndSearchingTestCase$1.run(ThreadedIndexingAndSearchingTestCase.java:300)
[junit4:junit4]    > Caused by: org.apache.lucene.index.CorruptIndexException: docs out of order (73 <= 73 ) (docOut: MockIndexOutputWrapper(org.apache.lucene.store.FSDirectory$FSIndexOutput@1322c1))
[junit4:junit4]    > 	at org.apache.lucene.codecs.lucene41.Lucene41PostingsWriter.startDoc(Lucene41PostingsWriter.java:243)
[junit4:junit4]    > 	at org.apache.lucene.index.FreqProxTermsWriterPerField.flush(FreqProxTermsWriterPerField.java:475)
[junit4:junit4]    > 	at org.apache.lucene.index.FreqProxTermsWriter.flush(FreqProxTermsWriter.java:85)
[junit4:junit4]    > 	at org.apache.lucene.index.TermsHash.flush(TermsHash.java:116)
[junit4:junit4]    > 	at org.apache.lucene.index.DocInverter.flush(DocInverter.java:53)
[junit4:junit4]    > 	at org.apache.lucene.index.DocFieldProcessor.flush(DocFieldProcessor.java:81)
[junit4:junit4]    > 	at org.apache.lucene.index.DocumentsWriterPerThread.flush(DocumentsWriterPerThread.java:493)
[junit4:junit4]    > 	at org.apache.lucene.index.DocumentsWriter.doFlush(DocumentsWriter.java:422)
[junit4:junit4]    > 	at org.apache.lucene.index.DocumentsWriter.preUpdate(DocumentsWriter.java:292)
[junit4:junit4]    > 	at org.apache.lucene.index.DocumentsWriter.updateDocument(DocumentsWriter.java:361)
[junit4:junit4]    > 	at org.apache.lucene.index.IndexWriter.updateDocument(IndexWriter.java:1473)
[junit4:junit4]    > 	at org.apache.lucene.index.IndexWriter.updateDocument(IndexWriter.java:1445)
[junit4:junit4]    > 	at org.apache.lucene.index.ThreadedIndexingAndSearchingTestCase.updateDocument(ThreadedIndexingAndSearchingTestCase.java:105)
[junit4:junit4]    > 	at org.apache.lucene.index.ThreadedIndexingAndSearchingTestCase$1.run(ThreadedIndexingAndSearchingTestCase.java:252)
[junit4:junit4] Completed on J0 in 0.50s, 1 test, 2 errors <<< FAILURES!

[...truncated 55 lines...]
[junit4:junit4] Suite: org.apache.lucene.store.TestNRTCachingDirectory
[junit4:junit4]   2> NOTE: reproduce with: ant test  -Dtestcase=TestNRTCachingDirectory -Dtests.method=testNRTAndCommit -Dtests.seed=5DD61E228367FBB0 -Dtests.multiplier=3 -Dtests.slow=true -Dtests.locale=uk -Dtests.timezone=AST -Dtests.file.encoding=ISO-8859-1
[junit4:junit4] FAILURE 0.31s J0 | TestNRTCachingDirectory.testNRTAndCommit <<<
[junit4:junit4]    > Throwable #1: java.lang.AssertionError
[junit4:junit4]    > 	at __randomizedtesting.SeedInfo.seed([5DD61E228367FBB0:1C6DF3DFE757FA94]:0)
[junit4:junit4]    > 	at org.apache.lucene.index.ByteSliceReader.readByte(ByteSliceReader.java:73)
[junit4:junit4]    > 	at org.apache.lucene.store.DataInput.readVInt(DataInput.java:108)
[junit4:junit4]    > 	at org.apache.lucene.index.FreqProxTermsWriterPerField.flush(FreqProxTermsWriterPerField.java:505)
[junit4:junit4]    > 	at org.apache.lucene.index.FreqProxTermsWriter.flush(FreqProxTermsWriter.java:85)
[junit4:junit4]    > 	at org.apache.lucene.index.TermsHash.flush(TermsHash.java:116)
[junit4:junit4]    > 	at org.apache.lucene.index.DocInverter.flush(DocInverter.java:53)
[junit4:junit4]    > 	at org.apache.lucene.index.DocFieldProcessor.flush(DocFieldProcessor.java:81)
[junit4:junit4]    > 	at org.apache.lucene.index.DocumentsWriterPerThread.flush(DocumentsWriterPerThread.java:493)
[junit4:junit4]    > 	at org.apache.lucene.index.DocumentsWriter.doFlush(DocumentsWriter.java:422)
[junit4:junit4]    > 	at org.apache.lucene.index.DocumentsWriter.flushAllThreads(DocumentsWriter.java:559)
[junit4:junit4]    > 	at org.apache.lucene.index.IndexWriter.getReader(IndexWriter.java:357)
[junit4:junit4]    > 	at org.apache.lucene.index.StandardDirectoryReader.doOpenFromWriter(StandardDirectoryReader.java:270)
[junit4:junit4]    > 	at org.apache.lucene.index.StandardDirectoryReader.doOpenIfChanged(StandardDirectoryReader.java:245)
[junit4:junit4]    > 	at org.apache.lucene.index.StandardDirectoryReader.doOpenIfChanged(StandardDirectoryReader.java:235)
[junit4:junit4]    > 	at org.apache.lucene.index.DirectoryReader.openIfChanged(DirectoryReader.java:169)
[junit4:junit4]    > 	at org.apache.lucene.store.TestNRTCachingDirectory.testNRTAndCommit(TestNRTCachingDirectory.java:69)
[junit4:junit4]    > 	at sun.reflect.NativeMethodAccessorImpl.invoke0(Native Method)
[junit4:junit4]    > 	at sun.reflect.NativeMethodAccessorImpl.invoke(NativeMethodAccessorImpl.java:57)
[junit4:junit4]    > 	at sun.reflect.DelegatingMethodAccessorImpl.invoke(DelegatingMethodAccessorImpl.java:43)
[junit4:junit4]    > 	at java.lang.reflect.Method.invoke(Method.java:474)
[junit4:junit4]    > 	at com.carrotsearch.randomizedtesting.RandomizedRunner.invoke(RandomizedRunner.java:1559)
[junit4:junit4]    > 	at com.carrotsearch.randomizedtesting.RandomizedRunner.access$600(RandomizedRunner.java:79)
[junit4:junit4]    > 	at com.carrotsearch.randomizedtesting.RandomizedRunner$6.evaluate(RandomizedRunner.java:737)
[junit4:junit4]    > 	at com.carrotsearch.randomizedtesting.RandomizedRunner$7.evaluate(RandomizedRunner.java:773)
[junit4:junit4]    > 	at com.carrotsearch.randomizedtesting.RandomizedRunner$8.evaluate(RandomizedRunner.java:787)
[junit4:junit4]    > 	at org.apache.lucene.util.TestRuleSetupTeardownChained$1.evaluate(TestRuleSetupTeardownChained.java:50)
[junit4:junit4]    > 	at org.apache.lucene.util.TestRuleFieldCacheSanity$1.evaluate(TestRuleFieldCacheSanity.java:51)
[junit4:junit4]    > 	at org.apache.lucene.util.AbstractBeforeAfterRule$1.evaluate(AbstractBeforeAfterRule.java:46)
[junit4:junit4]    > 	at com.carrotsearch.randomizedtesting.rules.SystemPropertiesInvariantRule$1.evaluate(SystemPropertiesInvariantRule.java:55)
[junit4:junit4]    > 	at org.apache.lucene.util.TestRuleThreadAndTestName$1.evaluate(TestRuleThreadAndTestName.java:49)
[junit4:junit4]    > 	at org.apache.lucene.util.TestRuleIgnoreAfterMaxFailures$1.evaluate(TestRuleIgnoreAfterMaxFailures.java:70)
[junit4:junit4]    > 	at org.apache.lucene.util.TestRuleMarkFailure$1.evaluate(TestRuleMarkFailure.java:48)
[junit4:junit4]    > 	at com.carrotsearch.randomizedtesting.rules.StatementAdapter.evaluate(StatementAdapter.java:36)
[junit4:junit4]    > 	at com.carrotsearch.randomizedtesting.ThreadLeakControl$StatementRunner.run(ThreadLeakControl.java:358)
[junit4:junit4]    > 	at com.carrotsearch.randomizedtesting.ThreadLeakControl.forkTimeoutingTask(ThreadLeakControl.java:782)
[junit4:junit4]    > 	at com.carrotsearch.randomizedtesting.ThreadLeakControl$3.evaluate(ThreadLeakControl.java:442)
[junit4:junit4]    > 	at com.carrotsearch.randomizedtesting.RandomizedRunner.runSingleTest(RandomizedRunner.java:746)
[junit4:junit4]    > 	at com.carrotsearch.randomizedtesting.RandomizedRunner$3.evaluate(RandomizedRunner.java:648)
[junit4:junit4]    > 	at com.carrotsearch.randomizedtesting.RandomizedRunner$4.evaluate(RandomizedRunner.java:682)
[junit4:junit4]    > 	at com.carrotsearch.randomizedtesting.RandomizedRunner$5.evaluate(RandomizedRunner.java:693)
[junit4:junit4]    > 	at org.apache.lucene.util.AbstractBeforeAfterRule$1.evaluate(AbstractBeforeAfterRule.java:46)
[junit4:junit4]    > 	at org.apache.lucene.util.TestRuleStoreClassName$1.evaluate(TestRuleStoreClassName.java:42)
[junit4:junit4]    > 	at com.carrotsearch.randomizedtesting.rules.SystemPropertiesInvariantRule$1.evaluate(SystemPropertiesInvariantRule.java:55)
[junit4:junit4]    > 	at com.carrotsearch.randomizedtesting.rules.NoShadowingOrOverridesOnMethodsRule$1.evaluate(NoShadowingOrOverridesOnMethodsRule.java:39)
[junit4:junit4]    > 	at com.carrotsearch.randomizedtesting.rules.NoShadowingOrOverridesOnMethodsRule$1.evaluate(NoShadowingOrOverridesOnMethodsRule.java:39)
[junit4:junit4]    > 	at com.carrotsearch.randomizedtesting.rules.StatementAdapter.evaluate(StatementAdapter.java:36)
[junit4:junit4]    > 	at org.apache.lucene.util.TestRuleAssertionsRequired$1.evaluate(TestRuleAssertionsRequired.java:43)
[junit4:junit4]    > 	at org.apache.lucene.util.TestRuleMarkFailure$1.evaluate(TestRuleMarkFailure.java:48)
[junit4:junit4]    > 	at org.apache.lucene.util.TestRuleIgnoreAfterMaxFailures$1.evaluate(TestRuleIgnoreAfterMaxFailures.java:70)
[junit4:junit4]    > 	at org.apache.lucene.util.TestRuleIgnoreTestSuites$1.evaluate(TestRuleIgnoreTestSuites.java:55)
[junit4:junit4]    > 	at com.carrotsearch.randomizedtesting.rules.StatementAdapter.evaluate(StatementAdapter.java:36)
[junit4:junit4]    > 	at com.carrotsearch.randomizedtesting.ThreadLeakControl$StatementRunner.run(ThreadLeakControl.java:358)
[junit4:junit4]    > 	at java.lang.Thread.run(Thread.java:722)
[junit4:junit4]   2> NOTE: test params are: codec=FastCompressingStoredFields(storedFieldsFormat=CompressingStoredFieldsFormat(compressionMode=FAST, chunkSize=374), termVectorsFormat=CompressingTermVectorsFormat(compressionMode=FAST, chunkSize=374)), sim=RandomSimilarityProvider(queryNorm=true,coord=crazy): {titleTokenized=DFR I(n)B1, body=IB LL-DZ(0.3)}, locale=uk, timezone=AST
[junit4:junit4]   2> NOTE: Linux 3.2.0-38-generic i386/Oracle Corporation 1.8.0-ea (32-bit)/cpus=8,threads=1,free=85021904,total=228589568
[junit4:junit4]   2> NOTE: All tests run in this JVM: [TestDirectory, TestDoubleBarrelLRUCache, TestStressIndexing, TestVersion, TestOpenBitSet, TestMergeSchedulerExternal, TestCharTermAttributeImpl, TestSimilarityProvider, TestFieldCacheRangeFilter, TestPayloadSpans, TestFieldCacheTermsFilter, TestLucene40TermVectorsFormat, TestMultiFields, TestDocumentsWriterStallControl, TestCachingCollector, TestNot, Nested1, TestLock, TestThreadedForceMerge, TestNoDeletionPolicy, TestDocumentWriter, TestNumericUtils, TestBackwardsCompatibility, TestReaderClosed, TestGraphTokenizers, TestIndexableField, TestIndexWriter, TestStressIndexing2, TestFilterAtomicReader, TestRegexpQuery, TestAttributeSource, TestRamUsageEstimatorOnWildAnimals, TestSegmentMerger, TestSimilarityBase, TestLucene40DocValuesFormat, TestParallelAtomicReader, TestIndexFileDeleter, TestIndexWriterCommit, TestPayloadExplanations, TestBagOfPostings, TestSetOnce, TestIndexWriterWithThreads, TestArrayUtil, TestPhrasePrefixQuery, TestTermScorer, TestElevationComparator, TestUnicodeUtil, TestConcurrentMergeScheduler, TestFlushByRamOrCountsPolicy, TestCheckIndex, TestNGramPhraseQuery, TestCrash, TestPostingsOffsets, TestSimpleExplanations, TestIndexWriterReader, TestDocTermOrdsRangeFilter, TestCrashCausesCorruptIndex, TestExternalCodecs, TestFlex, TestIndexWriterOnJRECrash, Test2BPostingsBytes, Nested1, TestPhraseQuery, TestPrefixRandom, TestSearchForDuplicates, TestPositiveScoresOnlyCollector, TestIndexableBinaryStringTools, TestConjunctions, TestSearcherManager, TestRecyclingByteBlockAllocator, TestOmitTf, TestSumDocFreq, TestPerFieldDocValuesFormat, InAfterClass, InTestMethod, NonStringProperties, InBeforeClass, TestIOUtils, TestBinaryDocument, TestSort, TestRecyclingIntBlockAllocator, TestSurrogates, TestMultiValuedNumericRangeQuery, TestSloppyPhraseQuery, ThrowInUncaught, TestWildcardRandom, TestTopScoreDocCollector, Nested, TestIndexWriterExceptions, TestNRTThreads, TestByteSlices, TestDuelingCodecs, TestAddIndexes, TestTermsEnum, TestMultiMMap, TestIndexWriterMergePolicy, TestTimeLimitingCollector, TestTopDocsMerge, TestSearchWithThreads, TestNRTCachingDirectory]
[junit4:junit4] Completed on J0 in 0.35s, 5 tests, 1 failure <<< FAILURES!

[...truncated 74 lines...]
[junit4:junit4] Suite: org.apache.lucene.index.TestTransactions
[junit4:junit4]   2> NOTE: reproduce with: ant test  -Dtestcase=TestTransactions -Dtests.method=testTransactions -Dtests.seed=5DD61E228367FBB0 -Dtests.multiplier=3 -Dtests.slow=true -Dtests.locale=nl -Dtests.timezone=Asia/Kamchatka -Dtests.file.encoding=ISO-8859-1
[junit4:junit4] ERROR   0.02s J0 | TestTransactions.testTransactions <<<
[junit4:junit4]    > Throwable #1: org.apache.lucene.index.CorruptIndexException: docs out of order (0 <= 0 ) (docOut: MockIndexOutputWrapper(org.apache.lucene.store.RAMOutputStream@505f0c))
[junit4:junit4]    > 	at __randomizedtesting.SeedInfo.seed([5DD61E228367FBB0:9E44A2EAD7F312B4]:0)
[junit4:junit4]    > 	at org.apache.lucene.codecs.lucene41.Lucene41PostingsWriter.startDoc(Lucene41PostingsWriter.java:243)
[junit4:junit4]    > 	at org.apache.lucene.index.FreqProxTermsWriterPerField.flush(FreqProxTermsWriterPerField.java:475)
[junit4:junit4]    > 	at org.apache.lucene.index.FreqProxTermsWriter.flush(FreqProxTermsWriter.java:85)
[junit4:junit4]    > 	at org.apache.lucene.index.TermsHash.flush(TermsHash.java:116)
[junit4:junit4]    > 	at org.apache.lucene.index.DocInverter.flush(DocInverter.java:53)
[junit4:junit4]    > 	at org.apache.lucene.index.DocFieldProcessor.flush(DocFieldProcessor.java:81)
[junit4:junit4]    > 	at org.apache.lucene.index.DocumentsWriterPerThread.flush(DocumentsWriterPerThread.java:493)
[junit4:junit4]    > 	at org.apache.lucene.index.DocumentsWriter.doFlush(DocumentsWriter.java:422)
[junit4:junit4]    > 	at org.apache.lucene.index.DocumentsWriter.flushAllThreads(DocumentsWriter.java:559)
[junit4:junit4]    > 	at org.apache.lucene.index.IndexWriter.doFlush(IndexWriter.java:2918)
[junit4:junit4]    > 	at org.apache.lucene.index.IndexWriter.flush(IndexWriter.java:2894)
[junit4:junit4]    > 	at org.apache.lucene.index.IndexWriter.closeInternal(IndexWriter.java:928)
[junit4:junit4]    > 	at org.apache.lucene.index.IndexWriter.close(IndexWriter.java:883)
[junit4:junit4]    > 	at org.apache.lucene.index.IndexWriter.close(IndexWriter.java:845)
[junit4:junit4]    > 	at org.apache.lucene.index.TestTransactions.initIndex(TestTransactions.java:204)
[junit4:junit4]    > 	at org.apache.lucene.index.TestTransactions.testTransactions(TestTransactions.java:223)
[junit4:junit4]    > 	at sun.reflect.NativeMethodAccessorImpl.invoke0(Native Method)
[junit4:junit4]    > 	at sun.reflect.NativeMethodAccessorImpl.invoke(NativeMethodAccessorImpl.java:57)
[junit4:junit4]    > 	at sun.reflect.DelegatingMethodAccessorImpl.invoke(DelegatingMethodAccessorImpl.java:43)
[junit4:junit4]    > 	at java.lang.reflect.Method.invoke(Method.java:474)
[junit4:junit4]    > 	at com.carrotsearch.randomizedtesting.RandomizedRunner.invoke(RandomizedRunner.java:1559)
[junit4:junit4]    > 	at com.carrotsearch.randomizedtesting.RandomizedRunner.access$600(RandomizedRunner.java:79)
[junit4:junit4]    > 	at com.carrotsearch.randomizedtesting.RandomizedRunner$6.evaluate(RandomizedRunner.java:737)
[junit4:junit4]    > 	at com.carrotsearch.randomizedtesting.RandomizedRunner$7.evaluate(RandomizedRunner.java:773)
[junit4:junit4]    > 	at com.carrotsearch.randomizedtesting.RandomizedRunner$8.evaluate(RandomizedRunner.java:787)
[junit4:junit4]    > 	at org.apache.lucene.util.TestRuleSetupTeardownChained$1.evaluate(TestRuleSetupTeardownChained.java:50)
[junit4:junit4]    > 	at org.apache.lucene.util.TestRuleFieldCacheSanity$1.evaluate(TestRuleFieldCacheSanity.java:51)
[junit4:junit4]    > 	at org.apache.lucene.util.AbstractBeforeAfterRule$1.evaluate(AbstractBeforeAfterRule.java:46)
[junit4:junit4]    > 	at com.carrotsearch.randomizedtesting.rules.SystemPropertiesInvariantRule$1.evaluate(SystemPropertiesInvariantRule.java:55)
[junit4:junit4]    > 	at org.apache.lucene.util.TestRuleThreadAndTestName$1.evaluate(TestRuleThreadAndTestName.java:49)
[junit4:junit4]    > 	at org.apache.lucene.util.TestRuleIgnoreAfterMaxFailures$1.evaluate(TestRuleIgnoreAfterMaxFailures.java:70)
[junit4:junit4]    > 	at org.apache.lucene.util.TestRuleMarkFailure$1.evaluate(TestRuleMarkFailure.java:48)
[junit4:junit4]    > 	at com.carrotsearch.randomizedtesting.rules.StatementAdapter.evaluate(StatementAdapter.java:36)
[junit4:junit4]    > 	at com.carrotsearch.randomizedtesting.ThreadLeakControl$StatementRunner.run(ThreadLeakControl.java:358)
[junit4:junit4]    > 	at com.carrotsearch.randomizedtesting.ThreadLeakControl.forkTimeoutingTask(ThreadLeakControl.java:782)
[junit4:junit4]    > 	at com.carrotsearch.randomizedtesting.ThreadLeakControl$3.evaluate(ThreadLeakControl.java:442)
[junit4:junit4]    > 	at com.carrotsearch.randomizedtesting.RandomizedRunner.runSingleTest(RandomizedRunner.java:746)
[junit4:junit4]    > 	at com.carrotsearch.randomizedtesting.RandomizedRunner$3.evaluate(RandomizedRunner.java:648)
[junit4:junit4]    > 	at com.carrotsearch.randomizedtesting.RandomizedRunner$4.evaluate(RandomizedRunner.java:682)
[junit4:junit4]    > 	at com.carrotsearch.randomizedtesting.RandomizedRunner$5.evaluate(RandomizedRunner.java:693)
[junit4:junit4]    > 	at org.apache.lucene.util.AbstractBeforeAfterRule$1.evaluate(AbstractBeforeAfterRule.java:46)
[junit4:junit4]    > 	at org.apache.lucene.util.TestRuleStoreClassName$1.evaluate(TestRuleStoreClassName.java:42)
[junit4:junit4]    > 	at com.carrotsearch.randomizedtesting.rules.SystemPropertiesInvariantRule$1.evaluate(SystemPropertiesInvariantRule.java:55)
[junit4:junit4]    > 	at com.carrotsearch.randomizedtesting.rules.NoShadowingOrOverridesOnMethodsRule$1.evaluate(NoShadowingOrOverridesOnMethodsRule.java:39)
[junit4:junit4]    > 	at com.carrotsearch.randomizedtesting.rules.NoShadowingOrOverridesOnMethodsRule$1.evaluate(NoShadowingOrOverridesOnMethodsRule.java:39)
[junit4:junit4]    > 	at com.carrotsearch.randomizedtesting.rules.StatementAdapter.evaluate(StatementAdapter.java:36)
[junit4:junit4]    > 	at org.apache.lucene.util.TestRuleAssertionsRequired$1.evaluate(TestRuleAssertionsRequired.java:43)
[junit4:junit4]    > 	at org.apache.lucene.util.TestRuleMarkFailure$1.evaluate(TestRuleMarkFailure.java:48)
[junit4:junit4]    > 	at org.apache.lucene.util.TestRuleIgnoreAfterMaxFailures$1.evaluate(TestRuleIgnoreAfterMaxFailures.java:70)
[junit4:junit4]    > 	at org.apache.lucene.util.TestRuleIgnoreTestSuites$1.evaluate(TestRuleIgnoreTestSuites.java:55)
[junit4:junit4]    > 	at com.carrotsearch.randomizedtesting.rules.StatementAdapter.evaluate(StatementAdapter.java:36)
[junit4:junit4]    > 	at com.carrotsearch.randomizedtesting.ThreadLeakControl$StatementRunner.run(ThreadLeakControl.java:358)
[junit4:junit4]    > 	at java.lang.Thread.run(Thread.java:722)
[junit4:junit4]   2> NOTE: test params are: codec=CheapBastard, sim=DefaultSimilarity, locale=nl, timezone=Asia/Kamchatka
[junit4:junit4]   2> NOTE: Linux 3.2.0-38-generic i386/Oracle Corporation 1.8.0-ea (32-bit)/cpus=8,threads=1,free=284423496,total=365953024
[junit4:junit4]   2> NOTE: All tests run in this JVM: [TestDirectory, TestDoubleBarrelLRUCache, TestStressIndexing, TestVersion, TestOpenBitSet, TestMergeSchedulerExternal, TestCharTermAttributeImpl, TestSimilarityProvider, TestFieldCacheRangeFilter, TestPayloadSpans, TestFieldCacheTermsFilter, TestLucene40TermVectorsFormat, TestMultiFields, TestDocumentsWriterStallControl, TestCachingCollector, TestNot, Nested1, TestLock, TestThreadedForceMerge, TestNoDeletionPolicy, TestDocumentWriter, TestNumericUtils, TestBackwardsCompatibility, TestReaderClosed, TestGraphTokenizers, TestIndexableField, TestIndexWriter, TestStressIndexing2, TestFilterAtomicReader, TestRegexpQuery, TestAttributeSource, TestRamUsageEstimatorOnWildAnimals, TestSegmentMerger, TestSimilarityBase, TestLucene40DocValuesFormat, TestParallelAtomicReader, TestIndexFileDeleter, TestIndexWriterCommit, TestPayloadExplanations, TestBagOfPostings, TestSetOnce, TestIndexWriterWithThreads, TestArrayUtil, TestPhrasePrefixQuery, TestTermScorer, TestElevationComparator, TestUnicodeUtil, TestConcurrentMergeScheduler, TestFlushByRamOrCountsPolicy, TestCheckIndex, TestNGramPhraseQuery, TestCrash, TestPostingsOffsets, TestSimpleExplanations, TestIndexWriterReader, TestDocTermOrdsRangeFilter, TestCrashCausesCorruptIndex, TestExternalCodecs, TestFlex, TestIndexWriterOnJRECrash, Test2BPostingsBytes, Nested1, TestPhraseQuery, TestPrefixRandom, TestSearchForDuplicates, TestPositiveScoresOnlyCollector, TestIndexableBinaryStringTools, TestConjunctions, TestSearcherManager, TestRecyclingByteBlockAllocator, TestOmitTf, TestSumDocFreq, TestPerFieldDocValuesFormat, InAfterClass, InTestMethod, NonStringProperties, InBeforeClass, TestIOUtils, TestBinaryDocument, TestSort, TestRecyclingIntBlockAllocator, TestSurrogates, TestMultiValuedNumericRangeQuery, TestSloppyPhraseQuery, ThrowInUncaught, TestWildcardRandom, TestTopScoreDocCollector, Nested, TestIndexWriterExceptions, TestNRTThreads, TestByteSlices, TestDuelingCodecs, TestAddIndexes, TestTermsEnum, TestMultiMMap, TestIndexWriterMergePolicy, TestTimeLimitingCollector, TestTopDocsMerge, TestSearchWithThreads, TestNRTCachingDirectory, TestPagedBytes, TestDirectoryReader, TestFixedBitSet, TestRegexpRandom2, TestHugeRamFile, Test2BDocs, TestStressAdvance, TestLevenshteinAutomata, TestDeterminism, TestOmitNorms, TestBitVector, TestTransactions]
[junit4:junit4] Completed on J0 in 0.02s, 1 test, 1 error <<< FAILURES!

[...truncated 1 lines...]
[junit4:junit4] Suite: org.apache.lucene.search.TestPrefixInBooleanQuery
[junit4:junit4]   2> NOTE: test params are: codec=Appending, sim=RandomSimilarityProvider(queryNorm=true,coord=yes): {}, locale=en_NZ, timezone=Egypt
[junit4:junit4]   2> NOTE: Linux 3.2.0-38-generic i386/Oracle Corporation 1.8.0-ea (32-bit)/cpus=8,threads=1,free=275824864,total=365953024
[junit4:junit4]   2> NOTE: All tests run in this JVM: [TestDirectory, TestDoubleBarrelLRUCache, TestStressIndexing, TestVersion, TestOpenBitSet, TestMergeSchedulerExternal, TestCharTermAttributeImpl, TestSimilarityProvider, TestFieldCacheRangeFilter, TestPayloadSpans, TestFieldCacheTermsFilter, TestLucene40TermVectorsFormat, TestMultiFields, TestDocumentsWriterStallControl, TestCachingCollector, TestNot, Nested1, TestLock, TestThreadedForceMerge, TestNoDeletionPolicy, TestDocumentWriter, TestNumericUtils, TestBackwardsCompatibility, TestReaderClosed, TestGraphTokenizers, TestIndexableField, TestIndexWriter, TestStressIndexing2, TestFilterAtomicReader, TestRegexpQuery, TestAttributeSource, TestRamUsageEstimatorOnWildAnimals, TestSegmentMerger, TestSimilarityBase, TestLucene40DocValuesFormat, TestParallelAtomicReader, TestIndexFileDeleter, TestIndexWriterCommit, TestPayloadExplanations, TestBagOfPostings, TestSetOnce, TestIndexWriterWithThreads, TestArrayUtil, TestPhrasePrefixQuery, TestTermScorer, TestElevationComparator, TestUnicodeUtil, TestConcurrentMergeScheduler, TestFlushByRamOrCountsPolicy, TestCheckIndex, TestNGramPhraseQuery, TestCrash, TestPostingsOffsets, TestSimpleExplanations, TestIndexWriterReader, TestDocTermOrdsRangeFilter, TestCrashCausesCorruptIndex, TestExternalCodecs, TestFlex, TestIndexWriterOnJRECrash, Test2BPostingsBytes, Nested1, TestPhraseQuery, TestPrefixRandom, TestSearchForDuplicates, TestPositiveScoresOnlyCollector, TestIndexableBinaryStringTools, TestConjunctions, TestSearcherManager, TestRecyclingByteBlockAllocator, TestOmitTf, TestSumDocFreq, TestPerFieldDocValuesFormat, InAfterClass, InTestMethod, NonStringProperties, InBeforeClass, TestIOUtils, TestBinaryDocument, TestSort, TestRecyclingIntBlockAllocator, TestSurrogates, TestMultiValuedNumericRangeQuery, TestSloppyPhraseQuery, ThrowInUncaught, TestWildcardRandom, TestTopScoreDocCollector, Nested, TestIndexWriterExceptions, TestNRTThreads, TestByteSlices, TestDuelingCodecs, TestAddIndexes, TestTermsEnum, TestMultiMMap, TestIndexWriterMergePolicy, TestTimeLimitingCollector, TestTopDocsMerge, TestSearchWithThreads, TestNRTCachingDirectory, TestPagedBytes, TestDirectoryReader, TestFixedBitSet, TestRegexpRandom2, TestHugeRamFile, Test2BDocs, TestStressAdvance, TestLevenshteinAutomata, TestDeterminism, TestOmitNorms, TestBitVector, TestTransactions, TestPrefixInBooleanQuery]
[junit4:junit4]   2> NOTE: reproduce with: ant test  -Dtestcase=TestPrefixInBooleanQuery -Dtests.seed=5DD61E228367FBB0 -Dtests.multiplier=3 -Dtests.slow=true -Dtests.locale=en_NZ -Dtests.timezone=Egypt -Dtests.file.encoding=ISO-8859-1
[junit4:junit4] ERROR   0.00s J0 | TestPrefixInBooleanQuery (suite) <<<
[junit4:junit4]    > Throwable #1: org.apache.lucene.index.CorruptIndexException: docs out of order (0 <= 0 ) (freqOut: org.apache.lucene.store.RAMOutputStream@af28dd)
[junit4:junit4]    > 	at __randomizedtesting.SeedInfo.seed([5DD61E228367FBB0]:0)
[junit4:junit4]    > 	at org.apache.lucene.codecs.lucene40.Lucene40PostingsWriter.startDoc(Lucene40PostingsWriter.java:190)
[junit4:junit4]    > 	at org.apache.lucene.index.FreqProxTermsWriterPerField.flush(FreqProxTermsWriterPerField.java:475)
[junit4:junit4]    > 	at org.apache.lucene.index.FreqProxTermsWriter.flush(FreqProxTermsWriter.java:85)
[junit4:junit4]    > 	at org.apache.lucene.index.TermsHash.flush(TermsHash.java:116)
[junit4:junit4]    > 	at org.apache.lucene.index.DocInverter.flush(DocInverter.java:53)
[junit4:junit4]    > 	at org.apache.lucene.index.DocFieldProcessor.flush(DocFieldProcessor.java:81)
[junit4:junit4]    > 	at org.apache.lucene.index.DocumentsWriterPerThread.flush(DocumentsWriterPerThread.java:493)
[junit4:junit4]    > 	at org.apache.lucene.index.DocumentsWriter.doFlush(DocumentsWriter.java:422)
[junit4:junit4]    > 	at org.apache.lucene.index.DocumentsWriter.flushAllThreads(DocumentsWriter.java:559)
[junit4:junit4]    > 	at org.apache.lucene.index.IndexWriter.prepareCommitInternal(IndexWriter.java:2683)
[junit4:junit4]    > 	at org.apache.lucene.index.IndexWriter.commitInternal(IndexWriter.java:2827)
[junit4:junit4]    > 	at org.apache.lucene.index.IndexWriter.commit(IndexWriter.java:2807)
[junit4:junit4]    > 	at org.apache.lucene.index.RandomIndexWriter.maybeCommit(RandomIndexWriter.java:163)
[junit4:junit4]    > 	at org.apache.lucene.index.RandomIndexWriter.addDocument(RandomIndexWriter.java:155)
[junit4:junit4]    > 	at org.apache.lucene.index.RandomIndexWriter.addDocument(RandomIndexWriter.java:114)
[junit4:junit4]    > 	at org.apache.lucene.search.TestPrefixInBooleanQuery.beforeClass(TestPrefixInBooleanQuery.java:57)
[junit4:junit4]    > 	at sun.reflect.NativeMethodAccessorImpl.invoke0(Native Method)
[junit4:junit4]    > 	at sun.reflect.NativeMethodAccessorImpl.invoke(NativeMethodAccessorImpl.java:57)
[junit4:junit4]    > 	at sun.reflect.DelegatingMethodAccessorImpl.invoke(DelegatingMethodAccessorImpl.java:43)
[junit4:junit4]    > 	at java.lang.reflect.Method.invoke(Method.java:474)
[junit4:junit4]    > 	at com.carrotsearch.randomizedtesting.RandomizedRunner.invoke(RandomizedRunner.java:1559)
[junit4:junit4]    > 	at com.carrotsearch.randomizedtesting.RandomizedRunner.access$600(RandomizedRunner.java:79)
[junit4:junit4]    > 	at com.carrotsearch.randomizedtesting.RandomizedRunner$4.evaluate(RandomizedRunner.java:677)
[junit4:junit4]    > 	at com.carrotsearch.randomizedtesting.RandomizedRunner$5.evaluate(RandomizedRunner.java:693)
[junit4:junit4]    > 	at org.apache.lucene.util.AbstractBeforeAfterRule$1.evaluate(AbstractBeforeAfterRule.java:46)
[junit4:junit4]    > 	at org.apache.lucene.util.TestRuleStoreClassName$1.evaluate(TestRuleStoreClassName.java:42)
[junit4:junit4]    > 	at com.carrotsearch.randomizedtesting.rules.SystemPropertiesInvariantRule$1.evaluate(SystemPropertiesInvariantRule.java:55)
[junit4:junit4]    > 	at com.carrotsearch.randomizedtesting.rules.NoShadowingOrOverridesOnMethodsRule$1.evaluate(NoShadowingOrOverridesOnMethodsRule.java:39)
[junit4:junit4]    > 	at com.carrotsearch.randomizedtesting.rules.NoShadowingOrOverridesOnMethodsRule$1.evaluate(NoShadowingOrOverridesOnMethodsRule.java:39)
[junit4:junit4]    > 	at com.carrotsearch.randomizedtesting.rules.StatementAdapter.evaluate(StatementAdapter.java:36)
[junit4:junit4]    > 	at org.apache.lucene.util.TestRuleAssertionsRequired$1.evaluate(TestRuleAssertionsRequired.java:43)
[junit4:junit4]    > 	at org.apache.lucene.util.TestRuleMarkFailure$1.evaluate(TestRuleMarkFailure.java:48)
[junit4:junit4]    > 	at org.apache.lucene.util.TestRuleIgnoreAfterMaxFailures$1.evaluate(TestRuleIgnoreAfterMaxFailures.java:70)
[junit4:junit4]    > 	at org.apache.lucene.util.TestRuleIgnoreTestSuites$1.evaluate(TestRuleIgnoreTestSuites.java:55)
[junit4:junit4]    > 	at com.carrotsearch.randomizedtesting.rules.StatementAdapter.evaluate(StatementAdapter.java:36)
[junit4:junit4]    > 	at com.carrotsearch.randomizedtesting.ThreadLeakControl$StatementRunner.run(ThreadLeakControl.java:358)
[junit4:junit4]    > 	at java.lang.Thread.run(Thread.java:722)
[junit4:junit4]    > Throwable #2: java.lang.NullPointerException
[junit4:junit4]    > 	at __randomizedtesting.SeedInfo.seed([5DD61E228367FBB0]:0)
[junit4:junit4]    > 	at org.apache.lucene.search.TestPrefixInBooleanQuery.afterClass(TestPrefixInBooleanQuery.java:79)
[junit4:junit4]    > 	at sun.reflect.NativeMethodAccessorImpl.invoke0(Native Method)
[junit4:junit4]    > 	at sun.reflect.NativeMethodAccessorImpl.invoke(NativeMethodAccessorImpl.java:57)
[junit4:junit4]    > 	at sun.reflect.DelegatingMethodAccessorImpl.invoke(DelegatingMethodAccessorImpl.java:43)
[junit4:junit4]    > 	at java.lang.reflect.Method.invoke(Method.java:474)
[junit4:junit4]    > 	at com.carrotsearch.randomizedtesting.RandomizedRunner.invoke(RandomizedRunner.java:1559)
[junit4:junit4]    > 	at com.carrotsearch.randomizedtesting.RandomizedRunner.access$600(RandomizedRunner.java:79)
[junit4:junit4]    > 	at com.carrotsearch.randomizedtesting.RandomizedRunner$5.evaluate(RandomizedRunner.java:700)
[junit4:junit4]    > 	at org.apache.lucene.util.AbstractBeforeAfterRule$1.evaluate(AbstractBeforeAfterRule.java:46)
[junit4:junit4]    > 	at org.apache.lucene.util.TestRuleStoreClassName$1.evaluate(TestRuleStoreClassName.java:42)
[junit4:junit4]    > 	at com.carrotsearch.randomizedtesting.rules.SystemPropertiesInvariantRule$1.evaluate(SystemPropertiesInvariantRule.java:55)
[junit4:junit4]    > 	at com.carrotsearch.randomizedtesting.rules.NoShadowingOrOverridesOnMethodsRule$1.evaluate(NoShadowingOrOverridesOnMethodsRule.java:39)
[junit4:junit4]    > 	at com.carrotsearch.randomizedtesting.rules.NoShadowingOrOverridesOnMethodsRule$1.evaluate(NoShadowingOrOverridesOnMethodsRule.java:39)
[junit4:junit4]    > 	at com.carrotsearch.randomizedtesting.rules.StatementAdapter.evaluate(StatementAdapter.java:36)
[junit4:junit4]    > 	at org.apache.lucene.util.TestRuleAssertionsRequired$1.evaluate(TestRuleAssertionsRequired.java:43)
[junit4:junit4]    > 	at org.apache.lucene.util.TestRuleMarkFailure$1.evaluate(TestRuleMarkFailure.java:48)
[junit4:junit4]    > 	at org.apache.lucene.util.TestRuleIgnoreAfterMaxFailures$1.evaluate(TestRuleIgnoreAfterMaxFailures.java:70)
[junit4:junit4]    > 	at org.apache.lucene.util.TestRuleIgnoreTestSuites$1.evaluate(TestRuleIgnoreTestSuites.java:55)
[junit4:junit4]    > 	at com.carrotsearch.randomizedtesting.rules.StatementAdapter.evaluate(StatementAdapter.java:36)
[junit4:junit4]    > 	at com.carrotsearch.randomizedtesting.ThreadLeakControl$StatementRunner.run(ThreadLeakControl.java:358)
[junit4:junit4]    > 	at java.lang.Thread.run(Thread.java:722)
[junit4:junit4] Completed on J0 in 0.05s, 0 tests, 2 errors <<< FAILURES!

[...truncated 16 lines...]
[junit4:junit4] Suite: org.apache.lucene.search.spans.TestSpanExplanations
[junit4:junit4]   2> NOTE: test params are: codec=Lucene40, sim=RandomSimilarityProvider(queryNorm=false,coord=crazy): {alt=DFR GB3(800.0), field=DFR I(F)L3(800.0)}, locale=et, timezone=America/North_Dakota/New_Salem
[junit4:junit4]   2> NOTE: Linux 3.2.0-38-generic i386/Oracle Corporation 1.8.0-ea (32-bit)/cpus=8,threads=1,free=212919568,total=400556032
[junit4:junit4]   2> NOTE: All tests run in this JVM: [TestDirectory, TestDoubleBarrelLRUCache, TestStressIndexing, TestVersion, TestOpenBitSet, TestMergeSchedulerExternal, TestCharTermAttributeImpl, TestSimilarityProvider, TestFieldCacheRangeFilter, TestPayloadSpans, TestFieldCacheTermsFilter, TestLucene40TermVectorsFormat, TestMultiFields, TestDocumentsWriterStallControl, TestCachingCollector, TestNot, Nested1, TestLock, TestThreadedForceMerge, TestNoDeletionPolicy, TestDocumentWriter, TestNumericUtils, TestBackwardsCompatibility, TestReaderClosed, TestGraphTokenizers, TestIndexableField, TestIndexWriter, TestStressIndexing2, TestFilterAtomicReader, TestRegexpQuery, TestAttributeSource, TestRamUsageEstimatorOnWildAnimals, TestSegmentMerger, TestSimilarityBase, TestLucene40DocValuesFormat, TestParallelAtomicReader, TestIndexFileDeleter, TestIndexWriterCommit, TestPayloadExplanations, TestBagOfPostings, TestSetOnce, TestIndexWriterWithThreads, TestArrayUtil, TestPhrasePrefixQuery, TestTermScorer, TestElevationComparator, TestUnicodeUtil, TestConcurrentMergeScheduler, TestFlushByRamOrCountsPolicy, TestCheckIndex, TestNGramPhraseQuery, TestCrash, TestPostingsOffsets, TestSimpleExplanations, TestIndexWriterReader, TestDocTermOrdsRangeFilter, TestCrashCausesCorruptIndex, TestExternalCodecs, TestFlex, TestIndexWriterOnJRECrash, Test2BPostingsBytes, Nested1, TestPhraseQuery, TestPrefixRandom, TestSearchForDuplicates, TestPositiveScoresOnlyCollector, TestIndexableBinaryStringTools, TestConjunctions, TestSearcherManager, TestRecyclingByteBlockAllocator, TestOmitTf, TestSumDocFreq, TestPerFieldDocValuesFormat, InAfterClass, InTestMethod, NonStringProperties, InBeforeClass, TestIOUtils, TestBinaryDocument, TestSort, TestRecyclingIntBlockAllocator, TestSurrogates, TestMultiValuedNumericRangeQuery, TestSloppyPhraseQuery, ThrowInUncaught, TestWildcardRandom, TestTopScoreDocCollector, Nested, TestIndexWriterExceptions, TestNRTThreads, TestByteSlices, TestDuelingCodecs, TestAddIndexes, TestTermsEnum, TestMultiMMap, TestIndexWriterMergePolicy, TestTimeLimitingCollector, TestTopDocsMerge, TestSearchWithThreads, TestNRTCachingDirectory, TestPagedBytes, TestDirectoryReader, TestFixedBitSet, TestRegexpRandom2, TestHugeRamFile, Test2BDocs, TestStressAdvance, TestLevenshteinAutomata, TestDeterminism, TestOmitNorms, TestBitVector, TestTransactions, TestPrefixInBooleanQuery, TestSegmentReader, TestPerFieldPostingsFormat, TestSpanExplanations]
[junit4:junit4]   2> NOTE: reproduce with: ant test  -Dtestcase=TestSpanExplanations -Dtests.seed=5DD61E228367FBB0 -Dtests.multiplier=3 -Dtests.slow=true -Dtests.locale=et -Dtests.timezone=America/North_Dakota/New_Salem -Dtests.file.encoding=ISO-8859-1
[junit4:junit4] ERROR   0.00s J0 | TestSpanExplanations (suite) <<<
[junit4:junit4]    > Throwable #1: org.apache.lucene.index.CorruptIndexException: docs out of order (0 <= 0 ) (freqOut: MockIndexOutputWrapper(org.apache.lucene.store.MockDirectoryWrapper$BufferedIndexOutputWrapper@1c09d87))
[junit4:junit4]    > 	at __randomizedtesting.SeedInfo.seed([5DD61E228367FBB0]:0)
[junit4:junit4]    > 	at org.apache.lucene.codecs.lucene40.Lucene40PostingsWriter.startDoc(Lucene40PostingsWriter.java:190)
[junit4:junit4]    > 	at org.apache.lucene.index.FreqProxTermsWriterPerField.flush(FreqProxTermsWriterPerField.java:475)
[junit4:junit4]    > 	at org.apache.lucene.index.FreqProxTermsWriter.flush(FreqProxTermsWriter.java:85)
[junit4:junit4]    > 	at org.apache.lucene.index.TermsHash.flush(TermsHash.java:116)
[junit4:junit4]    > 	at org.apache.lucene.index.DocInverter.flush(DocInverter.java:53)
[junit4:junit4]    > 	at org.apache.lucene.index.DocFieldProcessor.flush(DocFieldProcessor.java:81)
[junit4:junit4]    > 	at org.apache.lucene.index.DocumentsWriterPerThread.flush(DocumentsWriterPerThread.java:493)
[junit4:junit4]    > 	at org.apache.lucene.index.DocumentsWriter.doFlush(DocumentsWriter.java:422)
[junit4:junit4]    > 	at org.apache.lucene.index.DocumentsWriter.flushAllThreads(DocumentsWriter.java:559)
[junit4:junit4]    > 	at org.apache.lucene.index.IndexWriter.getReader(IndexWriter.java:357)
[junit4:junit4]    > 	at org.apache.lucene.index.RandomIndexWriter.getReader(RandomIndexWriter.java:313)
[junit4:junit4]    > 	at org.apache.lucene.index.RandomIndexWriter.getReader(RandomIndexWriter.java:255)
[junit4:junit4]    > 	at org.apache.lucene.search.TestExplanations.beforeClassTestExplanations(TestExplanations.java:82)
[junit4:junit4]    > 	at sun.reflect.NativeMethodAccessorImpl.invoke0(Native Method)
[junit4:junit4]    > 	at sun.reflect.NativeMethodAccessorImpl.invoke(NativeMethodAccessorImpl.java:57)
[junit4:junit4]    > 	at sun.reflect.DelegatingMethodAccessorImpl.invoke(DelegatingMethodAccessorImpl.java:43)
[junit4:junit4]    > 	at java.lang.reflect.Method.invoke(Method.java:474)
[junit4:junit4]    > 	at com.carrotsearch.randomizedtesting.RandomizedRunner.invoke(RandomizedRunner.java:1559)
[junit4:junit4]    > 	at com.carrotsearch.randomizedtesting.RandomizedRunner.access$600(RandomizedRunner.java:79)
[junit4:junit4]    > 	at com.carrotsearch.randomizedtesting.RandomizedRunner$4.evaluate(RandomizedRunner.java:677)
[junit4:junit4]    > 	at com.carrotsearch.randomizedtesting.RandomizedRunner$5.evaluate(RandomizedRunner.java:693)
[junit4:junit4]    > 	at org.apache.lucene.util.AbstractBeforeAfterRule$1.evaluate(AbstractBeforeAfterRule.java:46)
[junit4:junit4]    > 	at org.apache.lucene.util.TestRuleStoreClassName$1.evaluate(TestRuleStoreClassName.java:42)
[junit4:junit4]    > 	at com.carrotsearch.randomizedtesting.rules.SystemPropertiesInvariantRule$1.evaluate(SystemPropertiesInvariantRule.java:55)
[junit4:junit4]    > 	at com.carrotsearch.randomizedtesting.rules.NoShadowingOrOverridesOnMethodsRule$1.evaluate(NoShadowingOrOverridesOnMethodsRule.java:39)
[junit4:junit4]    > 	at com.carrotsearch.randomizedtesting.rules.NoShadowingOrOverridesOnMethodsRule$1.evaluate(NoShadowingOrOverridesOnMethodsRule.java:39)
[junit4:junit4]    > 	at com.carrotsearch.randomizedtesting.rules.StatementAdapter.evaluate(StatementAdapter.java:36)
[junit4:junit4]    > 	at org.apache.lucene.util.TestRuleAssertionsRequired$1.evaluate(TestRuleAssertionsRequired.java:43)
[junit4:junit4]    > 	at org.apache.lucene.util.TestRuleMarkFailure$1.evaluate(TestRuleMarkFailure.java:48)
[junit4:junit4]    > 	at org.apache.lucene.util.TestRuleIgnoreAfterMaxFailures$1.evaluate(TestRuleIgnoreAfterMaxFailures.java:70)
[junit4:junit4]    > 	at org.apache.lucene.util.TestRuleIgnoreTestSuites$1.evaluate(TestRuleIgnoreTestSuites.java:55)
[junit4:junit4]    > 	at com.carrotsearch.randomizedtesting.rules.StatementAdapter.evaluate(StatementAdapter.java:36)
[junit4:junit4]    > 	at com.carrotsearch.randomizedtesting.ThreadLeakControl$StatementRunner.run(ThreadLeakControl.java:358)
[junit4:junit4]    > 	at java.lang.Thread.run(Thread.java:722)
[junit4:junit4]    > Throwable #2: java.lang.NullPointerException
[junit4:junit4]    > 	at __randomizedtesting.SeedInfo.seed([5DD61E228367FBB0]:0)
[junit4:junit4]    > 	at org.apache.lucene.search.TestExplanations.afterClassTestExplanations(TestExplanations.java:63)
[junit4:junit4]    > 	at sun.reflect.NativeMethodAccessorImpl.invoke0(Native Method)
[junit4:junit4]    > 	at sun.reflect.NativeMethodAccessorImpl.invoke(NativeMethodAccessorImpl.java:57)
[junit4:junit4]    > 	at sun.reflect.DelegatingMethodAccessorImpl.invoke(DelegatingMethodAccessorImpl.java:43)
[junit4:junit4]    > 	at java.lang.reflect.Method.invoke(Method.java:474)
[junit4:junit4]    > 	at com.carrotsearch.randomizedtesting.RandomizedRunner.invoke(RandomizedRunner.java:1559)
[junit4:junit4]    > 	at com.carrotsearch.randomizedtesting.RandomizedRunner.access$600(RandomizedRunner.java:79)
[junit4:junit4]    > 	at com.carrotsearch.randomizedtesting.RandomizedRunner$5.evaluate(RandomizedRunner.java:700)
[junit4:junit4]    > 	at org.apache.lucene.util.AbstractBeforeAfterRule$1.evaluate(AbstractBeforeAfterRule.java:46)
[junit4:junit4]    > 	at org.apache.lucene.util.TestRuleStoreClassName$1.evaluate(TestRuleStoreClassName.java:42)
[junit4:junit4]    > 	at com.carrotsearch.randomizedtesting.rules.SystemPropertiesInvariantRule$1.evaluate(SystemPropertiesInvariantRule.java:55)
[junit4:junit4]    > 	at com.carrotsearch.randomizedtesting.rules.NoShadowingOrOverridesOnMethodsRule$1.evaluate(NoShadowingOrOverridesOnMethodsRule.java:39)
[junit4:junit4]    > 	at com.carrotsearch.randomizedtesting.rules.NoShadowingOrOverridesOnMethodsRule$1.evaluate(NoShadowingOrOverridesOnMethodsRule.java:39)
[junit4:junit4]    > 	at com.carrotsearch.randomizedtesting.rules.StatementAdapter.evaluate(StatementAdapter.java:36)
[junit4:junit4]    > 	at org.apache.lucene.util.TestRuleAssertionsRequired$1.evaluate(TestRuleAssertionsRequired.java:43)
[junit4:junit4]    > 	at org.apache.lucene.util.TestRuleMarkFailure$1.evaluate(TestRuleMarkFailure.java:48)
[junit4:junit4]    > 	at org.apache.lucene.util.TestRuleIgnoreAfterMaxFailures$1.evaluate(TestRuleIgnoreAfterMaxFailures.java:70)
[junit4:junit4]    > 	at org.apache.lucene.util.TestRuleIgnoreTestSuites$1.evaluate(TestRuleIgnoreTestSuites.java:55)
[junit4:junit4]    > 	at com.carrotsearch.randomizedtesting.rules.StatementAdapter.evaluate(StatementAdapter.java:36)
[junit4:junit4]    > 	at com.carrotsearch.randomizedtesting.ThreadLeakControl$StatementRunner.run(ThreadLeakControl.java:358)
[junit4:junit4]    > 	at java.lang.Thread.run(Thread.java:722)
[junit4:junit4] Completed on J0 in 0.02s, 0 tests, 2 errors <<< FAILURES!

[...truncated 482 lines...]
[junit4:junit4] Suite: org.apache.lucene.index.TestIndexWriterOnDiskFull
[junit4:junit4]   2> NOTE: reproduce with: ant test  -Dtestcase=TestIndexWriterOnDiskFull -Dtests.method=testAddIndexOnDiskFull -Dtests.seed=5DD61E228367FBB0 -Dtests.multiplier=3 -Dtests.slow=true -Dtests.locale=ja_JP_JP_#u-ca-japanese -Dtests.timezone=Asia/Tashkent -Dtests.file.encoding=ISO-8859-1
[junit4:junit4] ERROR   0.01s J0 | TestIndexWriterOnDiskFull.testAddIndexOnDiskFull <<<
[junit4:junit4]    > Throwable #1: org.apache.lucene.index.CorruptIndexException: docs out of order (0 <= 0 ) (docOut: MockIndexOutputWrapper(org.apache.lucene.store.FSDirectory$FSIndexOutput@1e0ffbf))
[junit4:junit4]    > 	at __randomizedtesting.SeedInfo.seed([5DD61E228367FBB0:2109AF1DCED65307]:0)
[junit4:junit4]    > 	at org.apache.lucene.codecs.lucene41.Lucene41PostingsWriter.startDoc(Lucene41PostingsWriter.java:243)
[junit4:junit4]    > 	at org.apache.lucene.codecs.asserting.AssertingPostingsFormat$AssertingPostingsConsumer.startDoc(AssertingPostingsFormat.java:218)
[junit4:junit4]    > 	at org.apache.lucene.index.FreqProxTermsWriterPerField.flush(FreqProxTermsWriterPerField.java:475)
[junit4:junit4]    > 	at org.apache.lucene.index.FreqProxTermsWriter.flush(FreqProxTermsWriter.java:85)
[junit4:junit4]    > 	at org.apache.lucene.index.TermsHash.flush(TermsHash.java:116)
[junit4:junit4]    > 	at org.apache.lucene.index.DocInverter.flush(DocInverter.java:53)
[junit4:junit4]    > 	at org.apache.lucene.index.DocFieldProcessor.flush(DocFieldProcessor.java:81)
[junit4:junit4]    > 	at org.apache.lucene.index.DocumentsWriterPerThread.flush(DocumentsWriterPerThread.java:493)
[junit4:junit4]    > 	at org.apache.lucene.index.DocumentsWriter.doFlush(DocumentsWriter.java:422)
[junit4:junit4]    > 	at org.apache.lucene.index.DocumentsWriter.flushAllThreads(DocumentsWriter.java:559)
[junit4:junit4]    > 	at org.apache.lucene.index.IndexWriter.doFlush(IndexWriter.java:2918)
[junit4:junit4]    > 	at org.apache.lucene.index.IndexWriter.flush(IndexWriter.java:2894)
[junit4:junit4]    > 	at org.apache.lucene.index.IndexWriter.closeInternal(IndexWriter.java:928)
[junit4:junit4]    > 	at org.apache.lucene.index.IndexWriter.close(IndexWriter.java:883)
[junit4:junit4]    > 	at org.apache.lucene.index.IndexWriter.close(IndexWriter.java:845)
[junit4:junit4]    > 	at org.apache.lucene.index.TestIndexWriterOnDiskFull.testAddIndexOnDiskFull(TestIndexWriterOnDiskFull.java:177)
[junit4:junit4]    > 	at sun.reflect.NativeMethodAccessorImpl.invoke0(Native Method)
[junit4:junit4]    > 	at sun.reflect.NativeMethodAccessorImpl.invoke(NativeMethodAccessorImpl.java:57)
[junit4:junit4]    > 	at sun.reflect.DelegatingMethodAccessorImpl.invoke(DelegatingMethodAccessorImpl.java:43)
[junit4:junit4]    > 	at java.lang.reflect.Method.invoke(Method.java:474)
[junit4:junit4]    > 	at com.carrotsearch.randomizedtesting.RandomizedRunner.invoke(RandomizedRunner.java:1559)
[junit4:junit4]    > 	at com.carrotsearch.randomizedtesting.RandomizedRunner.access$600(RandomizedRunner.java:79)
[junit4:junit4]    > 	at com.carrotsearch.randomizedtesting.RandomizedRunner$6.evaluate(RandomizedRunner.java:737)
[junit4:junit4]    > 	at com.carrotsearch.randomizedtesting.RandomizedRunner$7.evaluate(RandomizedRunner.java:773)
[junit4:junit4]    > 	at com.carrotsearch.randomizedtesting.RandomizedRunner$8.evaluate(RandomizedRunner.java:787)
[junit4:junit4]    > 	at org.apache.lucene.util.TestRuleSetupTeardownChained$1.evaluate(TestRuleSetupTeardownChained.java:50)
[junit4:junit4]    > 	at org.apache.lucene.util.TestRuleFieldCacheSanity$1.evaluate(TestRuleFieldCacheSanity.java:51)
[junit4:junit4]    > 	at org.apache.lucene.util.AbstractBeforeAfterRule$1.evaluate(AbstractBeforeAfterRule.java:46)
[junit4:junit4]    > 	at com.carrotsearch.randomizedtesting.rules.SystemPropertiesInvariantRule$1.evaluate(SystemPropertiesInvariantRule.java:55)
[junit4:junit4]    > 	at org.apache.lucene.util.TestRuleThreadAndTestName$1.evaluate(TestRuleThreadAndTestName.java:49)
[junit4:junit4]    > 	at org.apache.lucene.util.TestRuleIgnoreAfterMaxFailures$1.evaluate(TestRuleIgnoreAfterMaxFailures.java:70)
[junit4:junit4]    > 	at org.apache.lucene.util.TestRuleMarkFailure$1.evaluate(TestRuleMarkFailure.java:48)
[junit4:junit4]    > 	at com.carrotsearch.randomizedtesting.rules.StatementAdapter.evaluate(StatementAdapter.java:36)
[junit4:junit4]    > 	at com.carrotsearch.randomizedtesting.ThreadLeakControl$StatementRunner.run(ThreadLeakControl.java:358)
[junit4:junit4]    > 	at com.carrotsearch.randomizedtesting.ThreadLeakControl.forkTimeoutingTask(ThreadLeakControl.java:782)
[junit4:junit4]    > 	at com.carrotsearch.randomizedtesting.ThreadLeakControl$3.evaluate(ThreadLeakControl.java:442)
[junit4:junit4]    > 	at com.carrotsearch.randomizedtesting.RandomizedRunner.runSingleTest(RandomizedRunner.java:746)
[junit4:junit4]    > 	at com.carrotsearch.randomizedtesting.RandomizedRunner$3.evaluate(RandomizedRunner.java:648)
[junit4:junit4]    > 	at com.carrotsearch.randomizedtesting.RandomizedRunner$4.evaluate(RandomizedRunner.java:682)
[junit4:junit4]    > 	at com.carrotsearch.randomizedtesting.RandomizedRunner$5.evaluate(RandomizedRunner.java:693)
[junit4:junit4]    > 	at org.apache.lucene.util.AbstractBeforeAfterRule$1.evaluate(AbstractBeforeAfterRule.java:46)
[junit4:junit4]    > 	at org.apache.lucene.util.TestRuleStoreClassName$1.evaluate(TestRuleStoreClassName.java:42)
[junit4:junit4]    > 	at com.carrotsearch.randomizedtesting.rules.SystemPropertiesInvariantRule$1.evaluate(SystemPropertiesInvariantRule.java:55)
[junit4:junit4]    > 	at com.carrotsearch.randomizedtesting.rules.NoShadowingOrOverridesOnMethodsRule$1.evaluate(NoShadowingOrOverridesOnMethodsRule.java:39)
[junit4:junit4]    > 	at com.carrotsearch.randomizedtesting.rules.NoShadowingOrOverridesOnMethodsRule$1.evaluate(NoShadowingOrOverridesOnMethodsRule.java:39)
[junit4:junit4]    > 	at com.carrotsearch.randomizedtesting.rules.StatementAdapter.evaluate(StatementAdapter.java:36)
[junit4:junit4]    > 	at org.apache.lucene.util.TestRuleAssertionsRequired$1.evaluate(TestRuleAssertionsRequired.java:43)
[junit4:junit4]    > 	at org.apache.lucene.util.TestRuleMarkFailure$1.evaluate(TestRuleMarkFailure.java:48)
[junit4:junit4]    > 	at org.apache.lucene.util.TestRuleIgnoreAfterMaxFailures$1.evaluate(TestRuleIgnoreAfterMaxFailures.java:70)
[junit4:junit4]    > 	at org.apache.lucene.util.TestRuleIgnoreTestSuites$1.evaluate(TestRuleIgnoreTestSuites.java:55)
[junit4:junit4]    > 	at com.carrotsearch.randomizedtesting.rules.StatementAdapter.evaluate(StatementAdapter.java:36)
[junit4:junit4]    > 	at com.carrotsearch.randomizedtesting.ThreadLeakControl$StatementRunner.run(ThreadLeakControl.java:358)
[junit4:junit4]    > 	at java.lang.Thread.run(Thread.java:722)
[junit4:junit4]   2> 2 28, 0025 11:47:48 ?? com.carrotsearch.randomizedtesting.ThreadLeakControl$2 evaluate
[junit4:junit4]   2> ??: Suite execution timed out: org.apache.lucene.index.TestIndexWriterOnDiskFull
[junit4:junit4]   2> ==== jstack at approximately timeout time ====
[junit4:junit4]   2> "TEST-TestIndexWriterOnDiskFull.testAddDocumentOnDiskFull-seed#[5DD61E228367FBB0]" ID=1901 TIMED_WAITING
[junit4:junit4]   2> 	at java.lang.Thread.sleep(Native Method)
[junit4:junit4]   2> 	at org.apache.lucene.store.SlowClosingMockIndexInputWrapper.close(SlowClosingMockIndexInputWrapper.java:40)
[junit4:junit4]   2> 	at org.apache.lucene.index.SegmentInfos$FindSegmentsFile.run(SegmentInfos.java:728)
[junit4:junit4]   2> 	at org.apache.lucene.index.StandardDirectoryReader.open(StandardDirectoryReader.java:73)
[junit4:junit4]   2> 	at org.apache.lucene.index.DirectoryReader.open(DirectoryReader.java:65)
[junit4:junit4]   2> 	at org.apache.lucene.index.TestIndexWriterOnDiskFull.testAddDocumentOnDiskFull(TestIndexWriterOnDiskFull.java:119)
[junit4:junit4]   2> 	at sun.reflect.NativeMethodAccessorImpl.invoke0(Native Method)
[junit4:junit4]   2> 	at sun.reflect.NativeMethodAccessorImpl.invoke(NativeMethodAccessorImpl.java:57)
[junit4:junit4]   2> 	at sun.reflect.DelegatingMethodAccessorImpl.invoke(DelegatingMethodAccessorImpl.java:43)
[junit4:junit4]   2> 	at java.lang.reflect.Method.invoke(Method.java:474)
[junit4:junit4]   2> 	at com.carrotsearch.randomizedtesting.RandomizedRunner.invoke(RandomizedRunner.java:1559)
[junit4:junit4]   2> 	at com.carrotsearch.randomizedtesting.RandomizedRunner.access$600(RandomizedRunner.java:79)
[junit4:junit4]   2> 	at com.carrotsearch.randomizedtesting.RandomizedRunner$6.evaluate(RandomizedRunner.java:737)
[junit4:junit4]   2> 	at com.carrotsearch.randomizedtesting.RandomizedRunner$7.evaluate(RandomizedRunner.java:773)
[junit4:junit4]   2> 	at com.carrotsearch.randomizedtesting.RandomizedRunner$8.evaluate(RandomizedRunner.java:787)
[junit4:junit4]   2> 	at org.apache.lucene.util.TestRuleSetupTeardownChained$1.evaluate(TestRuleSetupTeardownChained.java:50)
[junit4:junit4]   2> 	at org.apache.lucene.util.TestRuleFieldCacheSanity$1.evaluate(TestRuleFieldCacheSanity.java:51)
[junit4:junit4]   2> 	at org.apache.lucene.util.AbstractBeforeAfterRule$1.evaluate(AbstractBeforeAfterRule.java:46)
[junit4:junit4]   2> 	at com.carrotsearch.randomizedtesting.rules.SystemPropertiesInvariantRule$1.evaluate(SystemPropertiesInvariantRule.java:55)
[junit4:junit4]   2> 	at org.apache.lucene.util.TestRuleThreadAndTestName$1.evaluate(TestRuleThreadAndTestName.java:49)
[junit4:junit4]   2> 	at org.apache.lucene.util.TestRuleIgnoreAfterMaxFailures$1.evaluate(TestRuleIgnoreAfterMaxFailures.java:70)
[junit4:junit4]   2> 	at org.apache.lucene.util.TestRuleMarkFailure$1.evaluate(TestRuleMarkFailure.java:48)
[junit4:junit4]   2> 	at com.carrotsearch.randomizedtesting.rules.StatementAdapter.evaluate(StatementAdapter.java:36)
[junit4:junit4]   2> 	at com.carrotsearch.randomizedtesting.ThreadLeakControl$StatementRunner.run(ThreadLeakControl.java:358)
[junit4:junit4]   2> 	at com.carrotsearch.randomizedtesting.ThreadLeakControl.forkTimeoutingTask(ThreadLeakControl.java:782)
[junit4:junit4]   2> 	at com.carrotsearch.randomizedtesting.ThreadLeakControl$3.evaluate(ThreadLeakControl.java:442)
[junit4:junit4]   2> 	at com.carrotsearch.randomizedtesting.RandomizedRunner.runSingleTest(RandomizedRunner.java:746)
[junit4:junit4]   2> 	at com.carrotsearch.randomizedtesting.RandomizedRunner$3.evaluate(RandomizedRunner.java:648)
[junit4:junit4]   2> 	at com.carrotsearch.randomizedtesting.RandomizedRunner$4.evaluate(RandomizedRunner.java:682)
[junit4:junit4]   2> 	at com.carrotsearch.randomizedtesting.RandomizedRunner$5.evaluate(RandomizedRunner.java:693)
[junit4:junit4]   2> 	at org.apache.lucene.util.AbstractBeforeAfterRule$1.evaluate(AbstractBeforeAfterRule.java:46)
[junit4:junit4]   2> 	at org.apache.lucene.util.TestRuleStoreClassName$1.evaluate(TestRuleStoreClassName.java:42)
[junit4:junit4]   2> 	at com.carrotsearch.randomizedtesting.rules.SystemPropertiesInvariantRule$1.evaluate(SystemPropertiesInvariantRule.java:55)
[junit4:junit4]   2> 	at com.carrotsearch.randomizedtesting.rules.NoShadowingOrOverridesOnMethodsRule$1.evaluate(NoShadowingOrOverridesOnMethodsRule.java:39)
[junit4:junit4]   2> 	at com.carrotsearch.randomizedtesting.rules.NoShadowingOrOverridesOnMethodsRule$1.evaluate(NoShadowingOrOverridesOnMethodsRule.java:39)
[junit4:junit4]   2> 	at com.carrotsearch.randomizedtesting.rules.StatementAdapter.evaluate(StatementAdapter.java:36)
[junit4:junit4]   2> 	at org.apache.lucene.util.TestRuleAssertionsRequired$1.evaluate(TestRuleAssertionsRequired.java:43)
[junit4:junit4]   2> 	at org.apache.lucene.util.TestRuleMarkFailure$1.evaluate(TestRuleMarkFailure.java:48)
[junit4:junit4]   2> 	at org.apache.lucene.util.TestRuleIgnoreAfterMaxFailures$1.evaluate(TestRuleIgnoreAfterMaxFailures.java:70)
[junit4:junit4]   2> 	at org.apache.lucene.util.TestRuleIgnoreTestSuites$1.evaluate(TestRuleIgnoreTestSuites.java:55)
[junit4:junit4]   2> 	at com.carrotsearch.randomizedtesting.rules.StatementAdapter.evaluate(StatementAdapter.java:36)
[junit4:junit4]   2> 	at com.carrotsearch.randomizedtesting.ThreadLeakControl$StatementRunner.run(ThreadLeakControl.java:358)
[junit4:junit4]   2> 	at java.lang.Thread.run(Thread.java:722)
[junit4:junit4]   2> 
[junit4:junit4]   2> "SUITE-TestIndexWriterOnDiskFull-seed#[5DD61E228367FBB0]" ID=1900 RUNNABLE
[junit4:junit4]   2> 	at sun.management.ThreadImpl.dumpThreads0(Native Method)
[junit4:junit4]   2> 	at sun.management.ThreadImpl.dumpAllThreads(ThreadImpl.java:446)
[junit4:junit4]   2> 	at com.carrotsearch.randomizedtesting.ThreadLeakControl.formatThreadStacksFull(ThreadLeakControl.java:655)
[junit4:junit4]   2> 	at com.carrotsearch.randomizedtesting.ThreadLeakControl.access$800(ThreadLeakControl.java:60)
[junit4:junit4]   2> 	at com.carrotsearch.randomizedtesting.ThreadLeakControl$2.evaluate(ThreadLeakControl.java:396)
[junit4:junit4]   2> 	- locked java.lang.Object@b973ae
[junit4:junit4]   2> 	at com.carrotsearch.randomizedtesting.RandomizedRunner.runSuite(RandomizedRunner.java:556)
[junit4:junit4]   2> 	at com.carrotsearch.randomizedtesting.RandomizedRunner.access$200(RandomizedRunner.java:79)
[junit4:junit4]   2> 	at com.carrotsearch.randomizedtesting.RandomizedRunner$1.run(RandomizedRunner.java:492)
[junit4:junit4]   2> 
[junit4:junit4]   2> "Signal Dispatcher" ID=5 RUNNABLE
[junit4:junit4]   2> 
[junit4:junit4]   2> "Finalizer" ID=3 WAITING on java.lang.ref.ReferenceQueue$Lock@159da38
[junit4:junit4]   2> 	at java.lang.Object.wait(Native Method)
[junit4:junit4]   2> 	- waiting on java.lang.ref.ReferenceQueue$Lock@159da38
[junit4:junit4]   2> 	at java.lang.ref.ReferenceQueue.remove(ReferenceQueue.java:135)
[junit4:junit4]   2> 	at java.lang.ref.ReferenceQueue.remove(ReferenceQueue.java:151)
[junit4:junit4]   2> 	at java.lang.ref.Finalizer$FinalizerThread.run(Finalizer.java:177)
[junit4:junit4]   2> 
[junit4:junit4]   2> "Reference Handler" ID=2 WAITING on java.lang.ref.Reference$Lock@5c78a
[junit4:junit4]   2> 	at java.lang.Object.wait(Native Method)
[junit4:junit4]   2> 	- waiting on java.lang.ref.Reference$Lock@5c78a
[junit4:junit4]   2> 	at java.lang.Object.wait(Object.java:502)
[junit4:junit4]   2> 	at java.lang.ref.Reference$ReferenceHandler.run(Reference.java:142)
[junit4:junit4]   2> 
[junit4:junit4]   2> "main" ID=1 WAITING on com.carrotsearch.randomizedtesting.RandomizedRunner$1@f256c7
[junit4:junit4]   2> 	at java.lang.Object.wait(Native Method)
[junit4:junit4]   2> 	- waiting on com.carrotsearch.randomizedtesting.RandomizedRunner$1@f256c7
[junit4:junit4]   2> 	at java.lang.Thread.join(Thread.java:1261)
[junit4:junit4]   2> 	at java.lang.Thread.join(Thread.java:1335)
[junit4:junit4]   2> 	at com.carrotsearch.randomizedtesting.RandomizedRunner.runSuite(RandomizedRunner.java:502)
[junit4:junit4]   2> 	at com.carrotsearch.randomizedtesting.RandomizedRunner.run(RandomizedRunner.java:399)
[junit4:junit4]   2> 	at com.carrotsearch.ant.tasks.junit4.slave.SlaveMain.execute(SlaveMain.java:180)
[junit4:junit4]   2> 	at com.carrotsearch.ant.tasks.junit4.slave.SlaveMain.main(SlaveMain.java:275)
[junit4:junit4]   2> 	at com.carrotsearch.ant.tasks.junit4.slave.SlaveMainSafe.main(SlaveMainSafe.java:12)
[junit4:junit4]   2> 
[junit4:junit4]   2> ^^==============================================
[junit4:junit4]   2> 
[junit4:junit4]   2> NOTE: reproduce with: ant test  -Dtestcase=TestIndexWriterOnDiskFull -Dtests.method=testAddDocumentOnDiskFull -Dtests.seed=5DD61E228367FBB0 -Dtests.multiplier=3 -Dtests.slow=true -Dtests.locale=ja_JP_JP_#u-ca-japanese -Dtests.timezone=Asia/Tashkent -Dtests.file.encoding=ISO-8859-1
[junit4:junit4] ERROR   7200s J0 | TestIndexWriterOnDiskFull.testAddDocumentOnDiskFull <<<
[junit4:junit4]    > Throwable #1: java.lang.Exception: Test abandoned because suite timeout was reached.
[junit4:junit4]    > 	at __randomizedtesting.SeedInfo.seed([5DD61E228367FBB0]:0)
[junit4:junit4]   2> 2 28, 0025 11:47:48 ?? com.carrotsearch.randomizedtesting.ThreadLeakControl checkThreadLeaks
[junit4:junit4]   2> ??: Will linger awaiting termination of 1 leaked thread(s).
[junit4:junit4]   2> 2 28, 0025 11:48:08 ?? com.carrotsearch.randomizedtesting.ThreadLeakControl checkThreadLeaks
[junit4:junit4]   2> ??: 1 thread leaked from SUITE scope at org.apache.lucene.index.TestIndexWriterOnDiskFull: 
[junit4:junit4]   2>    1) Thread[id=1901, name=TEST-TestIndexWriterOnDiskFull.testAddDocumentOnDiskFull-seed#[5DD61E228367FBB0], state=RUNNABLE, group=TGRP-TestIndexWriterOnDiskFull]
[junit4:junit4]   2>         at java.lang.Throwable.fillInStackTrace(Native Method)
[junit4:junit4]   2>         at java.lang.Throwable.fillInStackTrace(Throwable.java:782)
[junit4:junit4]   2>         at java.lang.Throwable.<init>(Throwable.java:250)
[junit4:junit4]   2>         at java.lang.Exception.<init>(Exception.java:54)
[junit4:junit4]   2>         at java.lang.RuntimeException.<init>(RuntimeException.java:51)
[junit4:junit4]   2>         at java.lang.UnsupportedOperationException.<init>(UnsupportedOperationException.java:42)
[junit4:junit4]   2>         at org.apache.lucene.index.NumericDocValuesWriter$NumericIterator.remove(NumericDocValuesWriter.java:124)
[junit4:junit4]   2>         at org.apache.lucene.codecs.asserting.AssertingDocValuesFormat$AssertingDocValuesConsumer.checkIterator(AssertingDocValuesFormat.java:185)
[junit4:junit4]   2>         at org.apache.lucene.codecs.asserting.AssertingDocValuesFormat$AssertingDocValuesConsumer.addNumericField(AssertingDocValuesFormat.java:82)
[junit4:junit4]   2>         at org.apache.lucene.index.NumericDocValuesWriter.flush(NumericDocValuesWriter.java:77)
[junit4:junit4]   2>         at org.apache.lucene.index.DocValuesProcessor.flush(DocValuesProcessor.java:82)
[junit4:junit4]   2>         at org.apache.lucene.index.TwoStoredFieldsConsumers.flush(TwoStoredFieldsConsumers.java:42)
[junit4:junit4]   2>         at org.apache.lucene.index.DocFieldProcessor.flush(DocFieldProcessor.java:80)
[junit4:junit4]   2>         at org.apache.lucene.index.DocumentsWriterPerThread.flush(DocumentsWriterPerThread.java:493)
[junit4:junit4]   2>         at org.apache.lucene.index.DocumentsWriter.doFlush(DocumentsWriter.java:422)
[junit4:junit4]   2>         at org.apache.lucene.index.DocumentsWriter.flushAllThreads(DocumentsWriter.java:559)
[junit4:junit4]   2>         at org.apache.lucene.index.IndexWriter.prepareCommitInternal(IndexWriter.java:2683)
[junit4:junit4]   2>         at org.apache.lucene.index.IndexWriter.commitInternal(IndexWriter.java:2827)
[junit4:junit4]   2>         at org.apache.lucene.index.IndexWriter.commit(IndexWriter.java:2807)
[junit4:junit4]   2>         at org.apache.lucene.index.TestIndexWriterOnDiskFull.testAddDocumentOnDiskFull(TestIndexWriterOnDiskFull.java:82)
[junit4:junit4]   2>         at sun.reflect.NativeMethodAccessorImpl.invoke0(Native Method)
[junit4:junit4]   2>         at sun.reflect.NativeMethodAccessorImpl.invoke(NativeMethodAccessorImpl.java:57)
[junit4:junit4]   2>         at sun.reflect.DelegatingMethodAccessorImpl.invoke(DelegatingMethodAccessorImpl.java:43)
[junit4:junit4]   2>         at java.lang.reflect.Method.invoke(Method.java:474)
[junit4:junit4]   2>         at com.carrotsearch.randomizedtesting.RandomizedRunner.invoke(RandomizedRunner.java:1559)
[junit4:junit4]   2>         at com.carrotsearch.randomizedtesting.RandomizedRunner.access$600(RandomizedRunner.java:79)
[junit4:junit4]   2>         at com.carrotsearch.randomizedtesting.RandomizedRunner$6.evaluate(RandomizedRunner.java:737)
[junit4:junit4]   2>         at com.carrotsearch.randomizedtesting.RandomizedRunner$7.evaluate(RandomizedRunner.java:773)
[junit4:junit4]   2>         at com.carrotsearch.randomizedtesting.RandomizedRunner$8.evaluate(RandomizedRunner.java:787)
[junit4:junit4]   2>         at org.apache.lucene.util.TestRuleSetupTeardownChained$1.evaluate(TestRuleSetupTeardownChained.java:50)
[junit4:junit4]   2>         at org.apache.lucene.util.TestRuleFieldCacheSanity$1.evaluate(TestRuleFieldCacheSanity.java:51)
[junit4:junit4]   2>         at org.apache.lucene.util.AbstractBeforeAfterRule$1.evaluate(AbstractBeforeAfterRule.java:46)
[junit4:junit4]   2>         at com.carrotsearch.randomizedtesting.rules.SystemPropertiesInvariantRule$1.evaluate(SystemPropertiesInvariantRule.java:55)
[junit4:junit4]   2>         at org.apache.lucene.util.TestRuleThreadAndTestName$1.evaluate(TestRuleThreadAndTestName.java:49)
[junit4:junit4]   2>         at org.apache.lucene.util.TestRuleIgnoreAfterMaxFailures$1.evaluate(TestRuleIgnoreAfterMaxFailures.java:70)
[junit4:junit4]   2>         at org.apache.lucene.util.TestRuleMarkFailure$1.evaluate(TestRuleMarkFailure.java:48)
[junit4:junit4]   2>         at com.carrotsearch.randomizedtesting.rules.StatementAdapter.evaluate(StatementAdapter.java:36)
[junit4:junit4]   2>         at com.carrotsearch.randomizedtesting.ThreadLeakControl$StatementRunner.run(ThreadLeakControl.java:358)
[junit4:junit4]   2>         at com.carrotsearch.randomizedtesting.ThreadLeakControl.forkTimeoutingTask(ThreadLeakControl.java:782)
[junit4:junit4]   2>         at com.carrotsearch.randomizedtesting.ThreadLeakControl$3.evaluate(ThreadLeakControl.java:442)
[junit4:junit4]   2>         at com.carrotsearch.randomizedtesting.RandomizedRunner.runSingleTest(RandomizedRunner.java:746)
[junit4:junit4]   2>         at com.carrotsearch.randomizedtesting.RandomizedRunner$3.evaluate(RandomizedRunner.java:648)
[junit4:junit4]   2>         at com.carrotsearch.randomizedtesting.RandomizedRunner$4.evaluate(RandomizedRunner.java:682)
[junit4:junit4]   2>         at com.carrotsearch.randomizedtesting.RandomizedRunner$5.evaluate(RandomizedRunner.java:693)
[junit4:junit4]   2>         at org.apache.lucene.util.AbstractBeforeAfterRule$1.evaluate(AbstractBeforeAfterRule.java:46)
[junit4:junit4]   2>         at org.apache.lucene.util.TestRuleStoreClassName$1.evaluate(TestRuleStoreClassName.java:42)
[junit4:junit4]   2>         at com.carrotsearch.randomizedtesting.rules.SystemPropertiesInvariantRule$1.evaluate(SystemPropertiesInvariantRule.java:55)
[junit4:junit4]   2>         at com.carrotsearch.randomizedtesting.rules.NoShadowingOrOverridesOnMethodsRule$1.evaluate(NoShadowingOrOverridesOnMethodsRule.java:39)
[junit4:junit4]   2>         at com.carrotsearch.randomizedtesting.rules.NoShadowingOrOverridesOnMethodsRule$1.evaluate(NoShadowingOrOverridesOnMethodsRule.java:39)
[junit4:junit4]   2>         at com.carrotsearch.randomizedtesting.rules.StatementAdapter.evaluate(StatementAdapter.java:36)
[junit4:junit4]   2>         at org.apache.lucene.util.TestRuleAssertionsRequired$1.evaluate(TestRuleAssertionsRequired.java:43)
[junit4:junit4]   2>         at org.apache.lucene.util.TestRuleMarkFailure$1.evaluate(TestRuleMarkFailure.java:48)
[junit4:junit4]   2>         at org.apache.lucene.util.TestRuleIgnoreAfterMaxFailures$1.evaluate(TestRuleIgnoreAfterMaxFailures.java:70)
[junit4:junit4]   2>         at org.apache.lucene.util.TestRuleIgnoreTestSuites$1.evaluate(TestRuleIgnoreTestSuites.java:55)
[junit4:junit4]   2>         at com.carrotsearch.randomizedtesting.rules.StatementAdapter.evaluate(StatementAdapter.java:36)
[junit4:junit4]   2>         at com.carrotsearch.randomizedtesting.ThreadLeakControl$StatementRunner.run(ThreadLeakControl.java:358)
[junit4:junit4]   2>         at java.lang.Thread.run(Thread.java:722)
[junit4:junit4]   2> 2 28, 0025 11:48:08 ?? com.carrotsearch.randomizedtesting.ThreadLeakControl tryToInterruptAll
[junit4:junit4]   2> ??: Starting to interrupt leaked threads:
[junit4:junit4]   2>    1) Thread[id=1901, name=TEST-TestIndexWriterOnDiskFull.testAddDocumentOnDiskFull-seed#[5DD61E228367FBB0], state=RUNNABLE, group=TGRP-TestIndexWriterOnDiskFull]
[junit4:junit4]   2> Feb 28, 2013 6:48:08 AM com.carrotsearch.randomizedtesting.ThreadLeakControl tryToInterruptAll
[junit4:junit4]   2> INFO: All leaked threads terminated.
[junit4:junit4]   2> NOTE: test params are: codec=Asserting, sim=DefaultSimilarity, locale=ja_JP_JP_#u-ca-japanese, timezone=Asia/Tashkent
[junit4:junit4]   2> NOTE: Linux 3.2.0-38-generic i386/Oracle Corporation 1.8.0-ea (32-bit)/cpus=8,threads=1,free=133444072,total=467664896
[junit4:junit4]   2> NOTE: All tests run in this JVM: [TestDirectory, TestDoubleBarrelLRUCache, TestStressIndexing, TestVersion, TestOpenBitSet, TestMergeSchedulerExternal, TestCharTermAttributeImpl, TestSimilarityProvider, TestFieldCacheRangeFilter, TestPayloadSpans, TestFieldCacheTermsFilter, TestLucene40TermVectorsFormat, TestMultiFields, TestDocumentsWriterStallControl, TestCachingCollector, TestNot, Nested1, TestLock, TestThreadedForceMerge, TestNoDeletionPolicy, TestDocumentWriter, TestNumericUtils, TestBackwardsCompatibility, TestReaderClosed, TestGraphTokenizers, TestIndexableField, TestIndexWriter, TestStressIndexing2, TestFilterAtomicReader, TestRegexpQuery, TestAttributeSource, TestRamUsageEstimatorOnWildAnimals, TestSegmentMerger, TestSimilarityBase, TestLucene40DocValuesFormat, TestParallelAtomicReader, TestIndexFileDeleter, TestIndexWriterCommit, TestPayloadExplanations, TestBagOfPostings, TestSetOnce, TestIndexWriterWithThreads, TestArrayUtil, TestPhrasePrefixQuery, TestTermScorer, TestElevationComparator, TestUnicodeUtil, TestConcurrentMergeScheduler, TestFlushByRamOrCountsPolicy, TestCheckIndex, TestNGramPhraseQuery, TestCrash, TestPostingsOffsets, TestSimpleExplanations, TestIndexWriterReader, TestDocTermOrdsRangeFilter, TestCrashCausesCorruptIndex, TestExternalCodecs, TestFlex, TestIndexWriterOnJRECrash, Test2BPostingsBytes, Nested1, TestPhraseQuery, TestPrefixRandom, TestSearchForDuplicates, TestPositiveScoresOnlyCollector, TestIndexableBinaryStringTools, TestConjunctions, TestSearcherManager, TestRecyclingByteBlockAllocator, TestOmitTf, TestSumDocFreq, TestPerFieldDocValuesFormat, InAfterClass, InTestMethod, NonStringProperties, InBeforeClass, TestIOUtils, TestBinaryDocument, TestSort, TestRecyclingIntBlockAllocator, TestSurrogates, TestMultiValuedNumericRangeQuery, TestSloppyPhraseQuery, ThrowInUncaught, TestWildcardRandom, TestTopScoreDocCollector, Nested, TestIndexWriterExceptions, TestNRTThreads, TestByteSlices, TestDuelingCodecs, TestAddIndexes, TestTermsEnum, TestMultiMMap, TestIndexWriterMergePolicy, TestTimeLimitingCollector, TestTopDocsMerge, TestSearchWithThreads, TestNRTCachingDirectory, TestPagedBytes, TestDirectoryReader, TestFixedBitSet, TestRegexpRandom2, TestHugeRamFile, Test2BDocs, TestStressAdvance, TestLevenshteinAutomata, TestDeterminism, TestOmitNorms, TestBitVector, TestTransactions, TestPrefixInBooleanQuery, TestSegmentReader, TestPerFieldPostingsFormat, TestSpanExplanations, TestIndexWriterOnDiskFull]
[junit4:junit4]   2> NOTE: reproduce with: ant test  -Dtestcase=TestIndexWriterOnDiskFull -Dtests.seed=5DD61E228367FBB0 -Dtests.multiplier=3 -Dtests.slow=true -Dtests.locale=ja_JP_JP_#u-ca-japanese -Dtests.timezone=Asia/Tashkent -Dtests.file.encoding=ISO-8859-1
[junit4:junit4] ERROR   0.00s J0 | TestIndexWriterOnDiskFull (suite) <<<
[junit4:junit4]    > Throwable #1: java.lang.Exception: Suite timeout exceeded (>= 7200000 msec).
[junit4:junit4]    > 	at __randomizedtesting.SeedInfo.seed([5DD61E228367FBB0]:0)
[junit4:junit4] Completed on J0 in 7220.29s, 3 tests, 3 errors <<< FAILURES!

[...truncated 19 lines...]
BUILD FAILED
/mnt/ssd/jenkins/workspace/Lucene-Solr-4.x-Linux/build.xml:381: The following error occurred while executing this line:
/mnt/ssd/jenkins/workspace/Lucene-Solr-4.x-Linux/build.xml:361: The following error occurred while executing this line:
/mnt/ssd/jenkins/workspace/Lucene-Solr-4.x-Linux/build.xml:39: The following error occurred while executing this line:
/mnt/ssd/jenkins/workspace/Lucene-Solr-4.x-Linux/lucene/build.xml:50: The following error occurred while executing this line:
/mnt/ssd/jenkins/workspace/Lucene-Solr-4.x-Linux/lucene/common-build.xml:1202: The following error occurred while executing this line:
/mnt/ssd/jenkins/workspace/Lucene-Solr-4.x-Linux/lucene/common-build.xml:865: There were test failures: 351 suites, 2144 tests, 6 suite-level errors, 9 errors, 1 failure, 42 ignored (30 assumptions)

Total time: 129 minutes 56 seconds
Build step 'Invoke Ant' marked build as failure
Archiving artifacts
Recording test results
Description set: Java: 32bit/jdk1.8.0-ea-b65 -server -XX:+UseG1GC
Email was triggered for: Failure
Sending email for trigger: Failure



Mime
View raw message