lucene-dev mailing list archives

Site index · List index
Message view « Date » · « Thread »
Top « Date » · « Thread »
From Policeman Jenkins Server <jenk...@thetaphi.de>
Subject [JENKINS] Lucene-Solr-trunk-Linux (32bit/jdk1.6.0_38) - Build # 4163 - Failure!
Date Tue, 05 Feb 2013 14:19:20 GMT
Build: http://jenkins.thetaphi.de/job/Lucene-Solr-trunk-Linux/4163/
Java: 32bit/jdk1.6.0_38 -client -XX:+UseParallelGC

2 tests failed.
REGRESSION:  org.apache.lucene.benchmark.byTask.TestPerfTasksLogic.testHighlightingTV

Error Message:
org/apache/lucene/queries/CommonTermsQuery

Stack Trace:
java.lang.NoClassDefFoundError: org/apache/lucene/queries/CommonTermsQuery
	at __randomizedtesting.SeedInfo.seed([459AF679CD1959C0:25B8D00F5206B159]:0)
	at org.apache.lucene.search.highlight.WeightedSpanTermExtractor.extract(WeightedSpanTermExtractor.java:147)
	at org.apache.lucene.search.highlight.WeightedSpanTermExtractor.getWeightedSpanTerms(WeightedSpanTermExtractor.java:457)
	at org.apache.lucene.search.highlight.QueryScorer.initExtractor(QueryScorer.java:217)
	at org.apache.lucene.search.highlight.QueryScorer.init(QueryScorer.java:186)
	at org.apache.lucene.search.highlight.Highlighter.getBestTextFragments(Highlighter.java:199)
	at org.apache.lucene.benchmark.byTask.tasks.CountingHighlighterTestTask$1.doHighlight(CountingHighlighterTestTask.java:63)
	at org.apache.lucene.benchmark.byTask.tasks.ReadTask.doLogic(ReadTask.java:174)
	at org.apache.lucene.benchmark.byTask.tasks.PerfTask.runAndMaybeStats(PerfTask.java:146)
	at org.apache.lucene.benchmark.byTask.tasks.TaskSequence.doSerialTasks(TaskSequence.java:197)
	at org.apache.lucene.benchmark.byTask.tasks.TaskSequence.doLogic(TaskSequence.java:138)
	at org.apache.lucene.benchmark.byTask.tasks.PerfTask.runAndMaybeStats(PerfTask.java:146)
	at org.apache.lucene.benchmark.byTask.tasks.TaskSequence.doSerialTasks(TaskSequence.java:197)
	at org.apache.lucene.benchmark.byTask.tasks.TaskSequence.doLogic(TaskSequence.java:138)
	at org.apache.lucene.benchmark.byTask.tasks.PerfTask.runAndMaybeStats(PerfTask.java:146)
	at org.apache.lucene.benchmark.byTask.utils.Algorithm.execute(Algorithm.java:331)
	at org.apache.lucene.benchmark.byTask.Benchmark.execute(Benchmark.java:77)
	at org.apache.lucene.benchmark.BenchmarkTestCase.execBenchmark(BenchmarkTestCase.java:83)
	at org.apache.lucene.benchmark.byTask.TestPerfTasksLogic.testHighlightingTV(TestPerfTasksLogic.java:228)
	at sun.reflect.NativeMethodAccessorImpl.invoke0(Native Method)
	at sun.reflect.NativeMethodAccessorImpl.invoke(NativeMethodAccessorImpl.java:39)
	at sun.reflect.DelegatingMethodAccessorImpl.invoke(DelegatingMethodAccessorImpl.java:25)
	at java.lang.reflect.Method.invoke(Method.java:597)
	at com.carrotsearch.randomizedtesting.RandomizedRunner.invoke(RandomizedRunner.java:1559)
	at com.carrotsearch.randomizedtesting.RandomizedRunner.access$600(RandomizedRunner.java:79)
	at com.carrotsearch.randomizedtesting.RandomizedRunner$6.evaluate(RandomizedRunner.java:737)
	at com.carrotsearch.randomizedtesting.RandomizedRunner$7.evaluate(RandomizedRunner.java:773)
	at com.carrotsearch.randomizedtesting.RandomizedRunner$8.evaluate(RandomizedRunner.java:787)
	at org.apache.lucene.util.TestRuleSetupTeardownChained$1.evaluate(TestRuleSetupTeardownChained.java:50)
	at org.apache.lucene.util.TestRuleFieldCacheSanity$1.evaluate(TestRuleFieldCacheSanity.java:51)
	at org.apache.lucene.util.AbstractBeforeAfterRule$1.evaluate(AbstractBeforeAfterRule.java:46)
	at com.carrotsearch.randomizedtesting.rules.SystemPropertiesInvariantRule$1.evaluate(SystemPropertiesInvariantRule.java:55)
	at org.apache.lucene.util.TestRuleThreadAndTestName$1.evaluate(TestRuleThreadAndTestName.java:49)
	at org.apache.lucene.util.TestRuleIgnoreAfterMaxFailures$1.evaluate(TestRuleIgnoreAfterMaxFailures.java:70)
	at org.apache.lucene.util.TestRuleMarkFailure$1.evaluate(TestRuleMarkFailure.java:48)
	at com.carrotsearch.randomizedtesting.rules.StatementAdapter.evaluate(StatementAdapter.java:36)
	at com.carrotsearch.randomizedtesting.ThreadLeakControl$StatementRunner.run(ThreadLeakControl.java:358)
	at com.carrotsearch.randomizedtesting.ThreadLeakControl.forkTimeoutingTask(ThreadLeakControl.java:782)
	at com.carrotsearch.randomizedtesting.ThreadLeakControl$3.evaluate(ThreadLeakControl.java:442)
	at com.carrotsearch.randomizedtesting.RandomizedRunner.runSingleTest(RandomizedRunner.java:746)
	at com.carrotsearch.randomizedtesting.RandomizedRunner$3.evaluate(RandomizedRunner.java:648)
	at com.carrotsearch.randomizedtesting.RandomizedRunner$4.evaluate(RandomizedRunner.java:682)
	at com.carrotsearch.randomizedtesting.RandomizedRunner$5.evaluate(RandomizedRunner.java:693)
	at org.apache.lucene.util.AbstractBeforeAfterRule$1.evaluate(AbstractBeforeAfterRule.java:46)
	at org.apache.lucene.util.TestRuleStoreClassName$1.evaluate(TestRuleStoreClassName.java:42)
	at com.carrotsearch.randomizedtesting.rules.SystemPropertiesInvariantRule$1.evaluate(SystemPropertiesInvariantRule.java:55)
	at com.carrotsearch.randomizedtesting.rules.NoShadowingOrOverridesOnMethodsRule$1.evaluate(NoShadowingOrOverridesOnMethodsRule.java:39)
	at com.carrotsearch.randomizedtesting.rules.NoShadowingOrOverridesOnMethodsRule$1.evaluate(NoShadowingOrOverridesOnMethodsRule.java:39)
	at com.carrotsearch.randomizedtesting.rules.StatementAdapter.evaluate(StatementAdapter.java:36)
	at org.apache.lucene.util.TestRuleAssertionsRequired$1.evaluate(TestRuleAssertionsRequired.java:43)
	at org.apache.lucene.util.TestRuleMarkFailure$1.evaluate(TestRuleMarkFailure.java:48)
	at org.apache.lucene.util.TestRuleIgnoreAfterMaxFailures$1.evaluate(TestRuleIgnoreAfterMaxFailures.java:70)
	at org.apache.lucene.util.TestRuleIgnoreTestSuites$1.evaluate(TestRuleIgnoreTestSuites.java:55)
	at com.carrotsearch.randomizedtesting.rules.StatementAdapter.evaluate(StatementAdapter.java:36)
	at com.carrotsearch.randomizedtesting.ThreadLeakControl$StatementRunner.run(ThreadLeakControl.java:358)
	at java.lang.Thread.run(Thread.java:662)
Caused by: java.lang.ClassNotFoundException: org.apache.lucene.queries.CommonTermsQuery
	at java.net.URLClassLoader$1.run(URLClassLoader.java:202)
	at java.security.AccessController.doPrivileged(Native Method)
	at java.net.URLClassLoader.findClass(URLClassLoader.java:190)
	at java.lang.ClassLoader.loadClass(ClassLoader.java:306)
	at sun.misc.Launcher$AppClassLoader.loadClass(Launcher.java:301)
	at java.lang.ClassLoader.loadClass(ClassLoader.java:247)
	... 55 more


REGRESSION:  org.apache.lucene.benchmark.byTask.TestPerfTasksLogic.testHighlighting

Error Message:
org/apache/lucene/queries/CommonTermsQuery

Stack Trace:
java.lang.NoClassDefFoundError: org/apache/lucene/queries/CommonTermsQuery
	at __randomizedtesting.SeedInfo.seed([459AF679CD1959C0:C91BB09DBA23B895]:0)
	at org.apache.lucene.search.highlight.WeightedSpanTermExtractor.extract(WeightedSpanTermExtractor.java:147)
	at org.apache.lucene.search.highlight.WeightedSpanTermExtractor.getWeightedSpanTerms(WeightedSpanTermExtractor.java:457)
	at org.apache.lucene.search.highlight.QueryScorer.initExtractor(QueryScorer.java:217)
	at org.apache.lucene.search.highlight.QueryScorer.init(QueryScorer.java:186)
	at org.apache.lucene.search.highlight.Highlighter.getBestTextFragments(Highlighter.java:199)
	at org.apache.lucene.benchmark.byTask.tasks.CountingHighlighterTestTask$1.doHighlight(CountingHighlighterTestTask.java:63)
	at org.apache.lucene.benchmark.byTask.tasks.ReadTask.doLogic(ReadTask.java:174)
	at org.apache.lucene.benchmark.byTask.tasks.PerfTask.runAndMaybeStats(PerfTask.java:146)
	at org.apache.lucene.benchmark.byTask.tasks.TaskSequence.doSerialTasks(TaskSequence.java:197)
	at org.apache.lucene.benchmark.byTask.tasks.TaskSequence.doLogic(TaskSequence.java:138)
	at org.apache.lucene.benchmark.byTask.tasks.PerfTask.runAndMaybeStats(PerfTask.java:146)
	at org.apache.lucene.benchmark.byTask.tasks.TaskSequence.doSerialTasks(TaskSequence.java:197)
	at org.apache.lucene.benchmark.byTask.tasks.TaskSequence.doLogic(TaskSequence.java:138)
	at org.apache.lucene.benchmark.byTask.tasks.PerfTask.runAndMaybeStats(PerfTask.java:146)
	at org.apache.lucene.benchmark.byTask.utils.Algorithm.execute(Algorithm.java:331)
	at org.apache.lucene.benchmark.byTask.Benchmark.execute(Benchmark.java:77)
	at org.apache.lucene.benchmark.BenchmarkTestCase.execBenchmark(BenchmarkTestCase.java:83)
	at org.apache.lucene.benchmark.byTask.TestPerfTasksLogic.testHighlighting(TestPerfTasksLogic.java:188)
	at sun.reflect.NativeMethodAccessorImpl.invoke0(Native Method)
	at sun.reflect.NativeMethodAccessorImpl.invoke(NativeMethodAccessorImpl.java:39)
	at sun.reflect.DelegatingMethodAccessorImpl.invoke(DelegatingMethodAccessorImpl.java:25)
	at java.lang.reflect.Method.invoke(Method.java:597)
	at com.carrotsearch.randomizedtesting.RandomizedRunner.invoke(RandomizedRunner.java:1559)
	at com.carrotsearch.randomizedtesting.RandomizedRunner.access$600(RandomizedRunner.java:79)
	at com.carrotsearch.randomizedtesting.RandomizedRunner$6.evaluate(RandomizedRunner.java:737)
	at com.carrotsearch.randomizedtesting.RandomizedRunner$7.evaluate(RandomizedRunner.java:773)
	at com.carrotsearch.randomizedtesting.RandomizedRunner$8.evaluate(RandomizedRunner.java:787)
	at org.apache.lucene.util.TestRuleSetupTeardownChained$1.evaluate(TestRuleSetupTeardownChained.java:50)
	at org.apache.lucene.util.TestRuleFieldCacheSanity$1.evaluate(TestRuleFieldCacheSanity.java:51)
	at org.apache.lucene.util.AbstractBeforeAfterRule$1.evaluate(AbstractBeforeAfterRule.java:46)
	at com.carrotsearch.randomizedtesting.rules.SystemPropertiesInvariantRule$1.evaluate(SystemPropertiesInvariantRule.java:55)
	at org.apache.lucene.util.TestRuleThreadAndTestName$1.evaluate(TestRuleThreadAndTestName.java:49)
	at org.apache.lucene.util.TestRuleIgnoreAfterMaxFailures$1.evaluate(TestRuleIgnoreAfterMaxFailures.java:70)
	at org.apache.lucene.util.TestRuleMarkFailure$1.evaluate(TestRuleMarkFailure.java:48)
	at com.carrotsearch.randomizedtesting.rules.StatementAdapter.evaluate(StatementAdapter.java:36)
	at com.carrotsearch.randomizedtesting.ThreadLeakControl$StatementRunner.run(ThreadLeakControl.java:358)
	at com.carrotsearch.randomizedtesting.ThreadLeakControl.forkTimeoutingTask(ThreadLeakControl.java:782)
	at com.carrotsearch.randomizedtesting.ThreadLeakControl$3.evaluate(ThreadLeakControl.java:442)
	at com.carrotsearch.randomizedtesting.RandomizedRunner.runSingleTest(RandomizedRunner.java:746)
	at com.carrotsearch.randomizedtesting.RandomizedRunner$3.evaluate(RandomizedRunner.java:648)
	at com.carrotsearch.randomizedtesting.RandomizedRunner$4.evaluate(RandomizedRunner.java:682)
	at com.carrotsearch.randomizedtesting.RandomizedRunner$5.evaluate(RandomizedRunner.java:693)
	at org.apache.lucene.util.AbstractBeforeAfterRule$1.evaluate(AbstractBeforeAfterRule.java:46)
	at org.apache.lucene.util.TestRuleStoreClassName$1.evaluate(TestRuleStoreClassName.java:42)
	at com.carrotsearch.randomizedtesting.rules.SystemPropertiesInvariantRule$1.evaluate(SystemPropertiesInvariantRule.java:55)
	at com.carrotsearch.randomizedtesting.rules.NoShadowingOrOverridesOnMethodsRule$1.evaluate(NoShadowingOrOverridesOnMethodsRule.java:39)
	at com.carrotsearch.randomizedtesting.rules.NoShadowingOrOverridesOnMethodsRule$1.evaluate(NoShadowingOrOverridesOnMethodsRule.java:39)
	at com.carrotsearch.randomizedtesting.rules.StatementAdapter.evaluate(StatementAdapter.java:36)
	at org.apache.lucene.util.TestRuleAssertionsRequired$1.evaluate(TestRuleAssertionsRequired.java:43)
	at org.apache.lucene.util.TestRuleMarkFailure$1.evaluate(TestRuleMarkFailure.java:48)
	at org.apache.lucene.util.TestRuleIgnoreAfterMaxFailures$1.evaluate(TestRuleIgnoreAfterMaxFailures.java:70)
	at org.apache.lucene.util.TestRuleIgnoreTestSuites$1.evaluate(TestRuleIgnoreTestSuites.java:55)
	at com.carrotsearch.randomizedtesting.rules.StatementAdapter.evaluate(StatementAdapter.java:36)
	at com.carrotsearch.randomizedtesting.ThreadLeakControl$StatementRunner.run(ThreadLeakControl.java:358)
	at java.lang.Thread.run(Thread.java:662)




Build Log:
[...truncated 5379 lines...]
[junit4:junit4] Suite: org.apache.lucene.benchmark.byTask.TestPerfTasksLogic
[junit4:junit4]   1> ------------> starting task: Seq
[junit4:junit4]   1> ------------> starting task: CreateIndex
[junit4:junit4]   1> ------------> starting task: Seq_Exhaust
[junit4:junit4]   1> ------------> starting task: Seq_Exhaust
[junit4:junit4]   1> ------------> starting task: WaitForMerges
[junit4:junit4]   1> ------------> starting task: CloseIndex
[junit4:junit4]   1> ------------> starting task: Seq
[junit4:junit4]   1> ------------> starting task: Rounds
[junit4:junit4]   1> 
[junit4:junit4]   1> ------------> Report Sum By (any) Name (4 about 4 out of 5)
[junit4:junit4]   1> Operation       round   runCnt   recsPerRun        rec/s  elapsedSec
   avgUsedMem    avgTotalMem
[junit4:junit4]   1> Rounds              0        1           20       555.56        0.04
    7,560,792     46,923,776
[junit4:junit4]   1> CreateIndex -  -  - 0 -  -   1 -  -  -  - 0 -  -  - 0.00 -  -   0.00
-   7,560,792 -   46,923,776
[junit4:junit4]   1> AddDocs_Exhaust     0        1           20     2,857.14        0.01
    7,560,792     46,923,776
[junit4:junit4]   1> CloseIndex -  -  -  0 -  -   1 -  -  -  - 0 -  -  - 0.00 -  -   0.00
-   7,560,792 -   46,923,776
[junit4:junit4]   1> 
[junit4:junit4]   1> ------------> starting task: Seq
[junit4:junit4]   1> ------------> starting task: Rounds
[junit4:junit4]   1> 
[junit4:junit4]   1> ------------> Report Sum By (any) Name (4 about 4 out of 5)
[junit4:junit4]   1> Operation       round   runCnt   recsPerRun        rec/s  elapsedSec
   avgUsedMem    avgTotalMem
[junit4:junit4]   1> Rounds              0        1           22       594.59        0.04
    7,250,368     47,054,848
[junit4:junit4]   1> CreateIndex -  -  - 0 -  -   1 -  -  -  - 1 -   1,000.00 -  -   0.00
-   7,250,368 -   47,054,848
[junit4:junit4]   1> AddDocs_Exhaust     0        1           20     3,333.33        0.01
    7,250,368     47,054,848
[junit4:junit4]   1> CloseIndex -  -  -  0 -  -   1 -  -  -  - 1 -  -  500.00 -  -   0.00
-   7,250,368 -   47,054,848
[junit4:junit4]   1> 
[junit4:junit4]   1> Changed Locale to: root locale
[junit4:junit4]   1> Changed Analyzer to: org.apache.lucene.collation.CollationKeyAnalyzer()
[junit4:junit4]   1> 
[junit4:junit4]   1> --> Round 0-->1
[junit4:junit4]   1> 
[junit4:junit4]   1> Changed Locale to: de
[junit4:junit4]   1> Changed Analyzer to: org.apache.lucene.collation.CollationKeyAnalyzer(de)
[junit4:junit4]   1> 
[junit4:junit4]   1> --> Round 0-->1
[junit4:junit4]   1> 
[junit4:junit4]   1> Changed Locale to: en_US
[junit4:junit4]   1> Changed Analyzer to: org.apache.lucene.collation.CollationKeyAnalyzer(en_US)
[junit4:junit4]   1> 
[junit4:junit4]   1> --> Round 0-->1
[junit4:junit4]   1> 
[junit4:junit4]   1> Changed Locale to: no_NO_NY
[junit4:junit4]   1> Changed Analyzer to: org.apache.lucene.collation.CollationKeyAnalyzer(no_NO_NY)
[junit4:junit4]   1> 
[junit4:junit4]   1> --> Round 0-->1
[junit4:junit4]   1> 
[junit4:junit4]   1> ------------> starting task: Seq
[junit4:junit4]   1> ------------> starting task: Rounds_2
[junit4:junit4]   1> ------------> starting task: Seq
[junit4:junit4]   1> ------------> starting task: Seq
[junit4:junit4]   1> ------------> starting task: Seq
[junit4:junit4]   1> ------------> starting task: Seq
[junit4:junit4]   1> ------------> starting task: Seq
[junit4:junit4]   1> ------------> starting task: Seq
[junit4:junit4]   1>    0.58 sec --> TEST-TestPerfTasksLogic.testHighlightingTV-seed#[459AF679CD1959C0]
added      1000 docs
[junit4:junit4]   2> NOTE: reproduce with: ant test  -Dtestcase=TestPerfTasksLogic -Dtests.method=testHighlightingTV
-Dtests.seed=459AF679CD1959C0 -Dtests.multiplier=3 -Dtests.slow=true -Dtests.locale=uk -Dtests.timezone=Asia/Bishkek
-Dtests.file.encoding=UTF-8
[junit4:junit4] ERROR   1.17s J0 | TestPerfTasksLogic.testHighlightingTV <<<
[junit4:junit4]    > Throwable #1: java.lang.NoClassDefFoundError: org/apache/lucene/queries/CommonTermsQuery
[junit4:junit4]    > 	at __randomizedtesting.SeedInfo.seed([459AF679CD1959C0:25B8D00F5206B159]:0)
[junit4:junit4]    > 	at org.apache.lucene.search.highlight.WeightedSpanTermExtractor.extract(WeightedSpanTermExtractor.java:147)
[junit4:junit4]    > 	at org.apache.lucene.search.highlight.WeightedSpanTermExtractor.getWeightedSpanTerms(WeightedSpanTermExtractor.java:457)
[junit4:junit4]    > 	at org.apache.lucene.search.highlight.QueryScorer.initExtractor(QueryScorer.java:217)
[junit4:junit4]    > 	at org.apache.lucene.search.highlight.QueryScorer.init(QueryScorer.java:186)
[junit4:junit4]    > 	at org.apache.lucene.search.highlight.Highlighter.getBestTextFragments(Highlighter.java:199)
[junit4:junit4]    > 	at org.apache.lucene.benchmark.byTask.tasks.CountingHighlighterTestTask$1.doHighlight(CountingHighlighterTestTask.java:63)
[junit4:junit4]    > 	at org.apache.lucene.benchmark.byTask.tasks.ReadTask.doLogic(ReadTask.java:174)
[junit4:junit4]    > 	at org.apache.lucene.benchmark.byTask.tasks.PerfTask.runAndMaybeStats(PerfTask.java:146)
[junit4:junit4]    > 	at org.apache.lucene.benchmark.byTask.tasks.TaskSequence.doSerialTasks(TaskSequence.java:197)
[junit4:junit4]    > 	at org.apache.lucene.benchmark.byTask.tasks.TaskSequence.doLogic(TaskSequence.java:138)
[junit4:junit4]    > 	at org.apache.lucene.benchmark.byTask.tasks.PerfTask.runAndMaybeStats(PerfTask.java:146)
[junit4:junit4]    > 	at org.apache.lucene.benchmark.byTask.tasks.TaskSequence.doSerialTasks(TaskSequence.java:197)
[junit4:junit4]    > 	at org.apache.lucene.benchmark.byTask.tasks.TaskSequence.doLogic(TaskSequence.java:138)
[junit4:junit4]    > 	at org.apache.lucene.benchmark.byTask.tasks.PerfTask.runAndMaybeStats(PerfTask.java:146)
[junit4:junit4]    > 	at org.apache.lucene.benchmark.byTask.utils.Algorithm.execute(Algorithm.java:331)
[junit4:junit4]    > 	at org.apache.lucene.benchmark.byTask.Benchmark.execute(Benchmark.java:77)
[junit4:junit4]    > 	at org.apache.lucene.benchmark.BenchmarkTestCase.execBenchmark(BenchmarkTestCase.java:83)
[junit4:junit4]    > 	at org.apache.lucene.benchmark.byTask.TestPerfTasksLogic.testHighlightingTV(TestPerfTasksLogic.java:228)
[junit4:junit4]    > 	at sun.reflect.NativeMethodAccessorImpl.invoke0(Native Method)
[junit4:junit4]    > 	at sun.reflect.NativeMethodAccessorImpl.invoke(NativeMethodAccessorImpl.java:39)
[junit4:junit4]    > 	at sun.reflect.DelegatingMethodAccessorImpl.invoke(DelegatingMethodAccessorImpl.java:25)
[junit4:junit4]    > 	at java.lang.reflect.Method.invoke(Method.java:597)
[junit4:junit4]    > 	at com.carrotsearch.randomizedtesting.RandomizedRunner.invoke(RandomizedRunner.java:1559)
[junit4:junit4]    > 	at com.carrotsearch.randomizedtesting.RandomizedRunner.access$600(RandomizedRunner.java:79)
[junit4:junit4]    > 	at com.carrotsearch.randomizedtesting.RandomizedRunner$6.evaluate(RandomizedRunner.java:737)
[junit4:junit4]    > 	at com.carrotsearch.randomizedtesting.RandomizedRunner$7.evaluate(RandomizedRunner.java:773)
[junit4:junit4]    > 	at com.carrotsearch.randomizedtesting.RandomizedRunner$8.evaluate(RandomizedRunner.java:787)
[junit4:junit4]    > 	at org.apache.lucene.util.TestRuleSetupTeardownChained$1.evaluate(TestRuleSetupTeardownChained.java:50)
[junit4:junit4]    > 	at org.apache.lucene.util.TestRuleFieldCacheSanity$1.evaluate(TestRuleFieldCacheSanity.java:51)
[junit4:junit4]    > 	at org.apache.lucene.util.AbstractBeforeAfterRule$1.evaluate(AbstractBeforeAfterRule.java:46)
[junit4:junit4]    > 	at com.carrotsearch.randomizedtesting.rules.SystemPropertiesInvariantRule$1.evaluate(SystemPropertiesInvariantRule.java:55)
[junit4:junit4]    > 	at org.apache.lucene.util.TestRuleThreadAndTestName$1.evaluate(TestRuleThreadAndTestName.java:49)
[junit4:junit4]    > 	at org.apache.lucene.util.TestRuleIgnoreAfterMaxFailures$1.evaluate(TestRuleIgnoreAfterMaxFailures.java:70)
[junit4:junit4]    > 	at org.apache.lucene.util.TestRuleMarkFailure$1.evaluate(TestRuleMarkFailure.java:48)
[junit4:junit4]    > 	at com.carrotsearch.randomizedtesting.rules.StatementAdapter.evaluate(StatementAdapter.java:36)
[junit4:junit4]    > 	at com.carrotsearch.randomizedtesting.ThreadLeakControl$StatementRunner.run(ThreadLeakControl.java:358)
[junit4:junit4]    > 	at com.carrotsearch.randomizedtesting.ThreadLeakControl.forkTimeoutingTask(ThreadLeakControl.java:782)
[junit4:junit4]    > 	at com.carrotsearch.randomizedtesting.ThreadLeakControl$3.evaluate(ThreadLeakControl.java:442)
[junit4:junit4]    > 	at com.carrotsearch.randomizedtesting.RandomizedRunner.runSingleTest(RandomizedRunner.java:746)
[junit4:junit4]    > 	at com.carrotsearch.randomizedtesting.RandomizedRunner$3.evaluate(RandomizedRunner.java:648)
[junit4:junit4]    > 	at com.carrotsearch.randomizedtesting.RandomizedRunner$4.evaluate(RandomizedRunner.java:682)
[junit4:junit4]    > 	at com.carrotsearch.randomizedtesting.RandomizedRunner$5.evaluate(RandomizedRunner.java:693)
[junit4:junit4]    > 	at org.apache.lucene.util.AbstractBeforeAfterRule$1.evaluate(AbstractBeforeAfterRule.java:46)
[junit4:junit4]    > 	at org.apache.lucene.util.TestRuleStoreClassName$1.evaluate(TestRuleStoreClassName.java:42)
[junit4:junit4]    > 	at com.carrotsearch.randomizedtesting.rules.SystemPropertiesInvariantRule$1.evaluate(SystemPropertiesInvariantRule.java:55)
[junit4:junit4]    > 	at com.carrotsearch.randomizedtesting.rules.NoShadowingOrOverridesOnMethodsRule$1.evaluate(NoShadowingOrOverridesOnMethodsRule.java:39)
[junit4:junit4]    > 	at com.carrotsearch.randomizedtesting.rules.NoShadowingOrOverridesOnMethodsRule$1.evaluate(NoShadowingOrOverridesOnMethodsRule.java:39)
[junit4:junit4]    > 	at com.carrotsearch.randomizedtesting.rules.StatementAdapter.evaluate(StatementAdapter.java:36)
[junit4:junit4]    > 	at org.apache.lucene.util.TestRuleAssertionsRequired$1.evaluate(TestRuleAssertionsRequired.java:43)
[junit4:junit4]    > 	at org.apache.lucene.util.TestRuleMarkFailure$1.evaluate(TestRuleMarkFailure.java:48)
[junit4:junit4]    > 	at org.apache.lucene.util.TestRuleIgnoreAfterMaxFailures$1.evaluate(TestRuleIgnoreAfterMaxFailures.java:70)
[junit4:junit4]    > 	at org.apache.lucene.util.TestRuleIgnoreTestSuites$1.evaluate(TestRuleIgnoreTestSuites.java:55)
[junit4:junit4]    > 	at com.carrotsearch.randomizedtesting.rules.StatementAdapter.evaluate(StatementAdapter.java:36)
[junit4:junit4]    > 	at com.carrotsearch.randomizedtesting.ThreadLeakControl$StatementRunner.run(ThreadLeakControl.java:358)
[junit4:junit4]    > 	at java.lang.Thread.run(Thread.java:662)
[junit4:junit4]    > Caused by: java.lang.ClassNotFoundException: org.apache.lucene.queries.CommonTermsQuery
[junit4:junit4]    > 	at java.net.URLClassLoader$1.run(URLClassLoader.java:202)
[junit4:junit4]    > 	at java.security.AccessController.doPrivileged(Native Method)
[junit4:junit4]    > 	at java.net.URLClassLoader.findClass(URLClassLoader.java:190)
[junit4:junit4]    > 	at java.lang.ClassLoader.loadClass(ClassLoader.java:306)
[junit4:junit4]    > 	at sun.misc.Launcher$AppClassLoader.loadClass(Launcher.java:301)
[junit4:junit4]    > 	at java.lang.ClassLoader.loadClass(ClassLoader.java:247)
[junit4:junit4]    > 	... 55 more
[junit4:junit4]   1> ------------> starting task: Seq
[junit4:junit4]   1> ------------> starting task: Seq
[junit4:junit4]   1> ------------> starting task: Seq
[junit4:junit4]   1>    0.17 sec --> TEST-TestPerfTasksLogic.testHighlightingNoTvNoStore-seed#[459AF679CD1959C0]
added      1000 docs
[junit4:junit4]   1> ------------> starting task: Seq
[junit4:junit4]   1> 
[junit4:junit4]   1> --> Round 0-->1:   compound:true-->false  doc.term.vector:false-->true
[junit4:junit4]   1> 
[junit4:junit4]   1> 
[junit4:junit4]   1> --> Round 1-->2:   compound:false-->true  doc.term.vector:true-->false
[junit4:junit4]   1> 
[junit4:junit4]   1> Changed Locale to: null
[junit4:junit4]   1> 
[junit4:junit4]   1> --> Round 0-->1
[junit4:junit4]   1> 
[junit4:junit4]   1> Changed Locale to: root locale
[junit4:junit4]   1> 
[junit4:junit4]   1> --> Round 0-->1
[junit4:junit4]   1> 
[junit4:junit4]   1> Changed Locale to: de
[junit4:junit4]   1> 
[junit4:junit4]   1> --> Round 0-->1
[junit4:junit4]   1> 
[junit4:junit4]   1> Changed Locale to: en_US
[junit4:junit4]   1> 
[junit4:junit4]   1> --> Round 0-->1
[junit4:junit4]   1> 
[junit4:junit4]   1> Changed Locale to: no_NO_NY
[junit4:junit4]   1> 
[junit4:junit4]   1> --> Round 0-->1
[junit4:junit4]   1> 
[junit4:junit4]   1> ------------> starting task: Seq
[junit4:junit4]   1> ------------> starting task: Seq
[junit4:junit4]   1> ------------> starting task: Seq
[junit4:junit4]   2> NOTE: reproduce with: ant test  -Dtestcase=TestPerfTasksLogic -Dtests.method=testHighlighting
-Dtests.seed=459AF679CD1959C0 -Dtests.multiplier=3 -Dtests.slow=true -Dtests.locale=uk -Dtests.timezone=Asia/Bishkek
-Dtests.file.encoding=UTF-8
[junit4:junit4] ERROR   0.18s J0 | TestPerfTasksLogic.testHighlighting <<<
[junit4:junit4]    > Throwable #1: java.lang.NoClassDefFoundError: org/apache/lucene/queries/CommonTermsQuery
[junit4:junit4]    > 	at __randomizedtesting.SeedInfo.seed([459AF679CD1959C0:C91BB09DBA23B895]:0)
[junit4:junit4]    > 	at org.apache.lucene.search.highlight.WeightedSpanTermExtractor.extract(WeightedSpanTermExtractor.java:147)
[junit4:junit4]    > 	at org.apache.lucene.search.highlight.WeightedSpanTermExtractor.getWeightedSpanTerms(WeightedSpanTermExtractor.java:457)
[junit4:junit4]    > 	at org.apache.lucene.search.highlight.QueryScorer.initExtractor(QueryScorer.java:217)
[junit4:junit4]    > 	at org.apache.lucene.search.highlight.QueryScorer.init(QueryScorer.java:186)
[junit4:junit4]    > 	at org.apache.lucene.search.highlight.Highlighter.getBestTextFragments(Highlighter.java:199)
[junit4:junit4]    > 	at org.apache.lucene.benchmark.byTask.tasks.CountingHighlighterTestTask$1.doHighlight(CountingHighlighterTestTask.java:63)
[junit4:junit4]    > 	at org.apache.lucene.benchmark.byTask.tasks.ReadTask.doLogic(ReadTask.java:174)
[junit4:junit4]    > 	at org.apache.lucene.benchmark.byTask.tasks.PerfTask.runAndMaybeStats(PerfTask.java:146)
[junit4:junit4]    > 	at org.apache.lucene.benchmark.byTask.tasks.TaskSequence.doSerialTasks(TaskSequence.java:197)
[junit4:junit4]    > 	at org.apache.lucene.benchmark.byTask.tasks.TaskSequence.doLogic(TaskSequence.java:138)
[junit4:junit4]    > 	at org.apache.lucene.benchmark.byTask.tasks.PerfTask.runAndMaybeStats(PerfTask.java:146)
[junit4:junit4]    > 	at org.apache.lucene.benchmark.byTask.tasks.TaskSequence.doSerialTasks(TaskSequence.java:197)
[junit4:junit4]    > 	at org.apache.lucene.benchmark.byTask.tasks.TaskSequence.doLogic(TaskSequence.java:138)
[junit4:junit4]    > 	at org.apache.lucene.benchmark.byTask.tasks.PerfTask.runAndMaybeStats(PerfTask.java:146)
[junit4:junit4]    > 	at org.apache.lucene.benchmark.byTask.utils.Algorithm.execute(Algorithm.java:331)
[junit4:junit4]    > 	at org.apache.lucene.benchmark.byTask.Benchmark.execute(Benchmark.java:77)
[junit4:junit4]    > 	at org.apache.lucene.benchmark.BenchmarkTestCase.execBenchmark(BenchmarkTestCase.java:83)
[junit4:junit4]    > 	at org.apache.lucene.benchmark.byTask.TestPerfTasksLogic.testHighlighting(TestPerfTasksLogic.java:188)
[junit4:junit4]    > 	at sun.reflect.NativeMethodAccessorImpl.invoke0(Native Method)
[junit4:junit4]    > 	at sun.reflect.NativeMethodAccessorImpl.invoke(NativeMethodAccessorImpl.java:39)
[junit4:junit4]    > 	at sun.reflect.DelegatingMethodAccessorImpl.invoke(DelegatingMethodAccessorImpl.java:25)
[junit4:junit4]    > 	at java.lang.reflect.Method.invoke(Method.java:597)
[junit4:junit4]    > 	at com.carrotsearch.randomizedtesting.RandomizedRunner.invoke(RandomizedRunner.java:1559)
[junit4:junit4]    > 	at com.carrotsearch.randomizedtesting.RandomizedRunner.access$600(RandomizedRunner.java:79)
[junit4:junit4]    > 	at com.carrotsearch.randomizedtesting.RandomizedRunner$6.evaluate(RandomizedRunner.java:737)
[junit4:junit4]    > 	at com.carrotsearch.randomizedtesting.RandomizedRunner$7.evaluate(RandomizedRunner.java:773)
[junit4:junit4]    > 	at com.carrotsearch.randomizedtesting.RandomizedRunner$8.evaluate(RandomizedRunner.java:787)
[junit4:junit4]    > 	at org.apache.lucene.util.TestRuleSetupTeardownChained$1.evaluate(TestRuleSetupTeardownChained.java:50)
[junit4:junit4]    > 	at org.apache.lucene.util.TestRuleFieldCacheSanity$1.evaluate(TestRuleFieldCacheSanity.java:51)
[junit4:junit4]    > 	at org.apache.lucene.util.AbstractBeforeAfterRule$1.evaluate(AbstractBeforeAfterRule.java:46)
[junit4:junit4]    > 	at com.carrotsearch.randomizedtesting.rules.SystemPropertiesInvariantRule$1.evaluate(SystemPropertiesInvariantRule.java:55)
[junit4:junit4]    > 	at org.apache.lucene.util.TestRuleThreadAndTestName$1.evaluate(TestRuleThreadAndTestName.java:49)
[junit4:junit4]    > 	at org.apache.lucene.util.TestRuleIgnoreAfterMaxFailures$1.evaluate(TestRuleIgnoreAfterMaxFailures.java:70)
[junit4:junit4]    > 	at org.apache.lucene.util.TestRuleMarkFailure$1.evaluate(TestRuleMarkFailure.java:48)
[junit4:junit4]    > 	at com.carrotsearch.randomizedtesting.rules.StatementAdapter.evaluate(StatementAdapter.java:36)
[junit4:junit4]    > 	at com.carrotsearch.randomizedtesting.ThreadLeakControl$StatementRunner.run(ThreadLeakControl.java:358)
[junit4:junit4]    > 	at com.carrotsearch.randomizedtesting.ThreadLeakControl.forkTimeoutingTask(ThreadLeakControl.java:782)
[junit4:junit4]    > 	at com.carrotsearch.randomizedtesting.ThreadLeakControl$3.evaluate(ThreadLeakControl.java:442)
[junit4:junit4]    > 	at com.carrotsearch.randomizedtesting.RandomizedRunner.runSingleTest(RandomizedRunner.java:746)
[junit4:junit4]    > 	at com.carrotsearch.randomizedtesting.RandomizedRunner$3.evaluate(RandomizedRunner.java:648)
[junit4:junit4]    > 	at com.carrotsearch.randomizedtesting.RandomizedRunner$4.evaluate(RandomizedRunner.java:682)
[junit4:junit4]    > 	at com.carrotsearch.randomizedtesting.RandomizedRunner$5.evaluate(RandomizedRunner.java:693)
[junit4:junit4]    > 	at org.apache.lucene.util.AbstractBeforeAfterRule$1.evaluate(AbstractBeforeAfterRule.java:46)
[junit4:junit4]    > 	at org.apache.lucene.util.TestRuleStoreClassName$1.evaluate(TestRuleStoreClassName.java:42)
[junit4:junit4]    > 	at com.carrotsearch.randomizedtesting.rules.SystemPropertiesInvariantRule$1.evaluate(SystemPropertiesInvariantRule.java:55)
[junit4:junit4]    > 	at com.carrotsearch.randomizedtesting.rules.NoShadowingOrOverridesOnMethodsRule$1.evaluate(NoShadowingOrOverridesOnMethodsRule.java:39)
[junit4:junit4]    > 	at com.carrotsearch.randomizedtesting.rules.NoShadowingOrOverridesOnMethodsRule$1.evaluate(NoShadowingOrOverridesOnMethodsRule.java:39)
[junit4:junit4]    > 	at com.carrotsearch.randomizedtesting.rules.StatementAdapter.evaluate(StatementAdapter.java:36)
[junit4:junit4]    > 	at org.apache.lucene.util.TestRuleAssertionsRequired$1.evaluate(TestRuleAssertionsRequired.java:43)
[junit4:junit4]    > 	at org.apache.lucene.util.TestRuleMarkFailure$1.evaluate(TestRuleMarkFailure.java:48)
[junit4:junit4]    > 	at org.apache.lucene.util.TestRuleIgnoreAfterMaxFailures$1.evaluate(TestRuleIgnoreAfterMaxFailures.java:70)
[junit4:junit4]    > 	at org.apache.lucene.util.TestRuleIgnoreTestSuites$1.evaluate(TestRuleIgnoreTestSuites.java:55)
[junit4:junit4]    > 	at com.carrotsearch.randomizedtesting.rules.StatementAdapter.evaluate(StatementAdapter.java:36)
[junit4:junit4]    > 	at com.carrotsearch.randomizedtesting.ThreadLeakControl$StatementRunner.run(ThreadLeakControl.java:358)
[junit4:junit4]    > 	at java.lang.Thread.run(Thread.java:662)
[junit4:junit4]   1> ------------> starting task: Seq
[junit4:junit4]   1> ------------> starting task: Seq
[junit4:junit4]   1>    0.14 sec --> TEST-TestPerfTasksLogic.testIndexAndSearchTasks-seed#[459AF679CD1959C0]
added      1000 docs
[junit4:junit4]   1> ------------> starting task: Seq
[junit4:junit4]   1> 
[junit4:junit4]   1> ------------> Report Sum By Prefix (X) (1 about 1 out of 1012)
[junit4:junit4]   1> Operation     round   runCnt   recsPerRun        rec/s  elapsedSec
   avgUsedMem    avgTotalMem
[junit4:junit4]   1> XSearch_2_Par     0        1         2206     4,385.69        0.50
   26,138,264    114,688,000
[junit4:junit4]   1> 
[junit4:junit4]   2> NOTE: test params are: codec=SimpleText, sim=DefaultSimilarity, locale=uk,
timezone=Asia/Bishkek
[junit4:junit4]   2> NOTE: Linux 3.2.0-37-generic i386/Sun Microsystems Inc. 1.6.0_38 (32-bit)/cpus=8,threads=1,free=104178592,total=117309440
[junit4:junit4]   2> NOTE: All tests run in this JVM: [TestPerfTasksLogic]
[junit4:junit4] Completed on J0 in 10.50s, 24 tests, 2 errors <<< FAILURES!

[...truncated 17 lines...]
BUILD FAILED
/mnt/ssd/jenkins/workspace/Lucene-Solr-trunk-Linux/build.xml:346: The following error occurred
while executing this line:
/mnt/ssd/jenkins/workspace/Lucene-Solr-trunk-Linux/build.xml:39: The following error occurred
while executing this line:
/mnt/ssd/jenkins/workspace/Lucene-Solr-trunk-Linux/lucene/build.xml:539: The following error
occurred while executing this line:
/mnt/ssd/jenkins/workspace/Lucene-Solr-trunk-Linux/lucene/common-build.xml:1720: The following
error occurred while executing this line:
/mnt/ssd/jenkins/workspace/Lucene-Solr-trunk-Linux/lucene/module-build.xml:61: The following
error occurred while executing this line:
/mnt/ssd/jenkins/workspace/Lucene-Solr-trunk-Linux/lucene/common-build.xml:1176: The following
error occurred while executing this line:
/mnt/ssd/jenkins/workspace/Lucene-Solr-trunk-Linux/lucene/common-build.xml:841: There were
test failures: 17 suites, 91 tests, 2 errors

Total time: 12 minutes 20 seconds
Build step 'Invoke Ant' marked build as failure
Archiving artifacts
Recording test results
Description set: Java: 32bit/jdk1.6.0_38 -client -XX:+UseParallelGC
Email was triggered for: Failure
Sending email for trigger: Failure



Mime
View raw message