lucene-dev mailing list archives

Site index · List index
Message view « Date » · « Thread »
Top « Date » · « Thread »
From Apache Jenkins Server <jenk...@builds.apache.org>
Subject [JENKINS] Lucene-Solr-Tests-trunk-java7 - Build # 3697 - Still Failing
Date Fri, 01 Feb 2013 06:16:47 GMT
Build: https://builds.apache.org/job/Lucene-Solr-Tests-trunk-java7/3697/

1 tests failed.
FAILED:  org.apache.solr.cloud.BasicDistributedZkTest.testDistribSearch

Error Message:
There are still nodes recoverying - waited for 230 seconds

Stack Trace:
java.lang.AssertionError: There are still nodes recoverying - waited for 230 seconds
	at __randomizedtesting.SeedInfo.seed([2BB5D8C3FA8C2A9E:AA5356DB8DD34AA2]:0)
	at org.junit.Assert.fail(Assert.java:93)
	at org.apache.solr.cloud.AbstractDistribZkTestBase.waitForRecoveriesToFinish(AbstractDistribZkTestBase.java:168)
	at org.apache.solr.cloud.AbstractDistribZkTestBase.waitForRecoveriesToFinish(AbstractDistribZkTestBase.java:126)
	at org.apache.solr.cloud.AbstractDistribZkTestBase.waitForRecoveriesToFinish(AbstractDistribZkTestBase.java:121)
	at org.apache.solr.cloud.BasicDistributedZkTest.testCoreUnloadAndLeaders(BasicDistributedZkTest.java:586)
	at org.apache.solr.cloud.BasicDistributedZkTest.doTest(BasicDistributedZkTest.java:337)
	at org.apache.solr.BaseDistributedSearchTestCase.testDistribSearch(BaseDistributedSearchTestCase.java:794)
	at sun.reflect.NativeMethodAccessorImpl.invoke0(Native Method)
	at sun.reflect.NativeMethodAccessorImpl.invoke(NativeMethodAccessorImpl.java:57)
	at sun.reflect.DelegatingMethodAccessorImpl.invoke(DelegatingMethodAccessorImpl.java:43)
	at java.lang.reflect.Method.invoke(Method.java:601)
	at com.carrotsearch.randomizedtesting.RandomizedRunner.invoke(RandomizedRunner.java:1559)
	at com.carrotsearch.randomizedtesting.RandomizedRunner.access$600(RandomizedRunner.java:79)
	at com.carrotsearch.randomizedtesting.RandomizedRunner$6.evaluate(RandomizedRunner.java:737)
	at com.carrotsearch.randomizedtesting.RandomizedRunner$7.evaluate(RandomizedRunner.java:773)
	at com.carrotsearch.randomizedtesting.RandomizedRunner$8.evaluate(RandomizedRunner.java:787)
	at com.carrotsearch.randomizedtesting.rules.SystemPropertiesRestoreRule$1.evaluate(SystemPropertiesRestoreRule.java:53)
	at org.apache.lucene.util.TestRuleSetupTeardownChained$1.evaluate(TestRuleSetupTeardownChained.java:50)
	at org.apache.lucene.util.TestRuleFieldCacheSanity$1.evaluate(TestRuleFieldCacheSanity.java:51)
	at org.apache.lucene.util.AbstractBeforeAfterRule$1.evaluate(AbstractBeforeAfterRule.java:46)
	at com.carrotsearch.randomizedtesting.rules.SystemPropertiesInvariantRule$1.evaluate(SystemPropertiesInvariantRule.java:55)
	at org.apache.lucene.util.TestRuleThreadAndTestName$1.evaluate(TestRuleThreadAndTestName.java:49)
	at org.apache.lucene.util.TestRuleIgnoreAfterMaxFailures$1.evaluate(TestRuleIgnoreAfterMaxFailures.java:70)
	at org.apache.lucene.util.TestRuleMarkFailure$1.evaluate(TestRuleMarkFailure.java:48)
	at com.carrotsearch.randomizedtesting.rules.StatementAdapter.evaluate(StatementAdapter.java:36)
	at com.carrotsearch.randomizedtesting.ThreadLeakControl$StatementRunner.run(ThreadLeakControl.java:358)
	at com.carrotsearch.randomizedtesting.ThreadLeakControl.forkTimeoutingTask(ThreadLeakControl.java:782)
	at com.carrotsearch.randomizedtesting.ThreadLeakControl$3.evaluate(ThreadLeakControl.java:442)
	at com.carrotsearch.randomizedtesting.RandomizedRunner.runSingleTest(RandomizedRunner.java:746)
	at com.carrotsearch.randomizedtesting.RandomizedRunner$3.evaluate(RandomizedRunner.java:648)
	at com.carrotsearch.randomizedtesting.RandomizedRunner$4.evaluate(RandomizedRunner.java:682)
	at com.carrotsearch.randomizedtesting.RandomizedRunner$5.evaluate(RandomizedRunner.java:693)
	at com.carrotsearch.randomizedtesting.rules.StatementAdapter.evaluate(StatementAdapter.java:36)
	at com.carrotsearch.randomizedtesting.rules.SystemPropertiesRestoreRule$1.evaluate(SystemPropertiesRestoreRule.java:53)
	at org.apache.lucene.util.AbstractBeforeAfterRule$1.evaluate(AbstractBeforeAfterRule.java:46)
	at org.apache.lucene.util.TestRuleStoreClassName$1.evaluate(TestRuleStoreClassName.java:42)
	at com.carrotsearch.randomizedtesting.rules.SystemPropertiesInvariantRule$1.evaluate(SystemPropertiesInvariantRule.java:55)
	at com.carrotsearch.randomizedtesting.rules.NoShadowingOrOverridesOnMethodsRule$1.evaluate(NoShadowingOrOverridesOnMethodsRule.java:39)
	at com.carrotsearch.randomizedtesting.rules.NoShadowingOrOverridesOnMethodsRule$1.evaluate(NoShadowingOrOverridesOnMethodsRule.java:39)
	at com.carrotsearch.randomizedtesting.rules.StatementAdapter.evaluate(StatementAdapter.java:36)
	at org.apache.lucene.util.TestRuleAssertionsRequired$1.evaluate(TestRuleAssertionsRequired.java:43)
	at org.apache.lucene.util.TestRuleMarkFailure$1.evaluate(TestRuleMarkFailure.java:48)
	at org.apache.lucene.util.TestRuleIgnoreAfterMaxFailures$1.evaluate(TestRuleIgnoreAfterMaxFailures.java:70)
	at org.apache.lucene.util.TestRuleIgnoreTestSuites$1.evaluate(TestRuleIgnoreTestSuites.java:55)
	at com.carrotsearch.randomizedtesting.rules.StatementAdapter.evaluate(StatementAdapter.java:36)
	at com.carrotsearch.randomizedtesting.ThreadLeakControl$StatementRunner.run(ThreadLeakControl.java:358)
	at java.lang.Thread.run(Thread.java:722)




Build Log:
[...truncated 9330 lines...]
[junit4:junit4] Suite: org.apache.solr.cloud.BasicDistributedZkTest
[junit4:junit4]   2> 0 T1077 oas.BaseDistributedSearchTestCase.initHostContext Setting hostContext system property: /hh/ba
[junit4:junit4]   2> 6 T1077 oas.SolrTestCaseJ4.setUp ###Starting testDistribSearch
[junit4:junit4]   2> Creating dataDir: /usr/home/hudson/hudson-slave/workspace/Lucene-Solr-Tests-trunk-java7/solr/build/solr-core/test/J0/./solrtest-BasicDistributedZkTest-1359698759686
[junit4:junit4]   2> 7 T1077 oasc.ZkTestServer.run STARTING ZK TEST SERVER
[junit4:junit4]   2> 8 T1078 oasc.ZkTestServer$ZKServerMain.runFromConfig Starting server
[junit4:junit4]   2> 10 T1078 oazs.ZooKeeperServer.setTickTime tickTime set to 1000
[junit4:junit4]   2> 10 T1078 oazs.ZooKeeperServer.setMinSessionTimeout minSessionTimeout set to -1
[junit4:junit4]   2> 10 T1078 oazs.ZooKeeperServer.setMaxSessionTimeout maxSessionTimeout set to -1
[junit4:junit4]   2> 10 T1078 oazs.NIOServerCnxnFactory.configure binding to port 0.0.0.0/0.0.0.0:0
[junit4:junit4]   2> 11 T1078 oazsp.FileTxnSnapLog.save Snapshotting: 0x0 to /usr/home/hudson/hudson-slave/workspace/Lucene-Solr-Tests-trunk-java7/solr/build/solr-core/test/J0/./org.apache.solr.cloud.BasicDistributedZkTest-1359698759685/zookeeper/server1/data/version-2/snapshot.0
[junit4:junit4]   2> 109 T1077 oasc.ZkTestServer.run start zk server on port:22847
[junit4:junit4]   2> 109 T1077 oaz.ZooKeeper.<init> Initiating client connection, connectString=127.0.0.1:22847 sessionTimeout=10000 watcher=org.apache.solr.common.cloud.ConnectionManager@660a8051
[junit4:junit4]   2> 110 T1077 oascc.ConnectionManager.waitForConnected Waiting for client to connect to ZooKeeper
[junit4:junit4]   2> 110 T1083 oaz.ClientCnxn$SendThread.logStartConnect Opening socket connection to server localhost/127.0.0.1:22847. Will not attempt to authenticate using SASL (access denied ("javax.security.auth.AuthPermission" "getLoginConfiguration"))
[junit4:junit4]   2> 111 T1083 oaz.ClientCnxn$SendThread.primeConnection Socket connection established to localhost/127.0.0.1:22847, initiating session
[junit4:junit4]   2> 111 T1079 oazs.NIOServerCnxnFactory.run Accepted socket connection from /140.211.11.196:22848
[junit4:junit4]   2> 112 T1079 oazs.ZooKeeperServer.processConnectRequest Client attempting to establish new session at /140.211.11.196:22848
[junit4:junit4]   2> 112 T1081 oazsp.FileTxnLog.append Creating new log file: log.1
[junit4:junit4]   2> 116 T1081 oazs.ZooKeeperServer.finishSessionInit Established session 0x13c945c900b0000 with negotiated timeout 10000 for client /140.211.11.196:22848
[junit4:junit4]   2> 116 T1083 oaz.ClientCnxn$SendThread.onConnected Session establishment complete on server localhost/127.0.0.1:22847, sessionid = 0x13c945c900b0000, negotiated timeout = 10000
[junit4:junit4]   2> 116 T1084 oascc.ConnectionManager.process Watcher org.apache.solr.common.cloud.ConnectionManager@660a8051 name:ZooKeeperConnection Watcher:127.0.0.1:22847 got event WatchedEvent state:SyncConnected type:None path:null path:null type:None
[junit4:junit4]   2> 116 T1077 oascc.ConnectionManager.waitForConnected Client is connected to ZooKeeper
[junit4:junit4]   2> 117 T1077 oascc.SolrZkClient.makePath makePath: /solr
[junit4:junit4]   2> 120 T1082 oazs.PrepRequestProcessor.pRequest2Txn Processed session termination for sessionid: 0x13c945c900b0000
[junit4:junit4]   2> 121 T1084 oaz.ClientCnxn$EventThread.run EventThread shut down
[junit4:junit4]   2> 121 T1077 oaz.ZooKeeper.close Session: 0x13c945c900b0000 closed
[junit4:junit4]   2> 121 T1079 oazs.NIOServerCnxn.closeSock Closed socket connection for client /140.211.11.196:22848 which had sessionid 0x13c945c900b0000
[junit4:junit4]   2> 122 T1077 oaz.ZooKeeper.<init> Initiating client connection, connectString=127.0.0.1:22847/solr sessionTimeout=10000 watcher=org.apache.solr.common.cloud.ConnectionManager@403ba71e
[junit4:junit4]   2> 122 T1077 oascc.ConnectionManager.waitForConnected Waiting for client to connect to ZooKeeper
[junit4:junit4]   2> 123 T1085 oaz.ClientCnxn$SendThread.logStartConnect Opening socket connection to server localhost/127.0.0.1:22847. Will not attempt to authenticate using SASL (access denied ("javax.security.auth.AuthPermission" "getLoginConfiguration"))
[junit4:junit4]   2> 123 T1085 oaz.ClientCnxn$SendThread.primeConnection Socket connection established to localhost/127.0.0.1:22847, initiating session
[junit4:junit4]   2> 123 T1079 oazs.NIOServerCnxnFactory.run Accepted socket connection from /140.211.11.196:22849
[junit4:junit4]   2> 124 T1079 oazs.ZooKeeperServer.processConnectRequest Client attempting to establish new session at /140.211.11.196:22849
[junit4:junit4]   2> 130 T1081 oazs.ZooKeeperServer.finishSessionInit Established session 0x13c945c900b0001 with negotiated timeout 10000 for client /140.211.11.196:22849
[junit4:junit4]   2> 130 T1085 oaz.ClientCnxn$SendThread.onConnected Session establishment complete on server localhost/127.0.0.1:22847, sessionid = 0x13c945c900b0001, negotiated timeout = 10000
[junit4:junit4]   2> 130 T1086 oascc.ConnectionManager.process Watcher org.apache.solr.common.cloud.ConnectionManager@403ba71e name:ZooKeeperConnection Watcher:127.0.0.1:22847/solr got event WatchedEvent state:SyncConnected type:None path:null path:null type:None
[junit4:junit4]   2> 130 T1077 oascc.ConnectionManager.waitForConnected Client is connected to ZooKeeper
[junit4:junit4]   2> 131 T1077 oascc.SolrZkClient.makePath makePath: /collections/collection1
[junit4:junit4]   2> 135 T1077 oascc.SolrZkClient.makePath makePath: /collections/collection1/shards
[junit4:junit4]   2> 144 T1077 oascc.SolrZkClient.makePath makePath: /collections/control_collection
[junit4:junit4]   2> 161 T1077 oascc.SolrZkClient.makePath makePath: /collections/control_collection/shards
[junit4:junit4]   2> 165 T1077 oasc.AbstractZkTestCase.putConfig put /usr/home/hudson/hudson-slave/workspace/Lucene-Solr-Tests-trunk-java7/solr/build/solr-core/test-files/solr/collection1/conf/solrconfig.xml to /configs/conf1/solrconfig.xml
[junit4:junit4]   2> 166 T1077 oascc.SolrZkClient.makePath makePath: /configs/conf1/solrconfig.xml
[junit4:junit4]   2> 178 T1077 oasc.AbstractZkTestCase.putConfig put /usr/home/hudson/hudson-slave/workspace/Lucene-Solr-Tests-trunk-java7/solr/build/solr-core/test-files/solr/collection1/conf/schema.xml to /configs/conf1/schema.xml
[junit4:junit4]   2> 179 T1077 oascc.SolrZkClient.makePath makePath: /configs/conf1/schema.xml
[junit4:junit4]   2> 183 T1077 oasc.AbstractZkTestCase.putConfig put /usr/home/hudson/hudson-slave/workspace/Lucene-Solr-Tests-trunk-java7/solr/build/solr-core/test-files/solr/collection1/conf/stopwords.txt to /configs/conf1/stopwords.txt
[junit4:junit4]   2> 184 T1077 oascc.SolrZkClient.makePath makePath: /configs/conf1/stopwords.txt
[junit4:junit4]   2> 187 T1077 oasc.AbstractZkTestCase.putConfig put /usr/home/hudson/hudson-slave/workspace/Lucene-Solr-Tests-trunk-java7/solr/build/solr-core/test-files/solr/collection1/conf/protwords.txt to /configs/conf1/protwords.txt
[junit4:junit4]   2> 188 T1077 oascc.SolrZkClient.makePath makePath: /configs/conf1/protwords.txt
[junit4:junit4]   2> 195 T1077 oasc.AbstractZkTestCase.putConfig put /usr/home/hudson/hudson-slave/workspace/Lucene-Solr-Tests-trunk-java7/solr/build/solr-core/test-files/solr/collection1/conf/currency.xml to /configs/conf1/currency.xml
[junit4:junit4]   2> 196 T1077 oascc.SolrZkClient.makePath makePath: /configs/conf1/currency.xml
[junit4:junit4]   2> 199 T1077 oasc.AbstractZkTestCase.putConfig put /usr/home/hudson/hudson-slave/workspace/Lucene-Solr-Tests-trunk-java7/solr/build/solr-core/test-files/solr/collection1/conf/open-exchange-rates.json to /configs/conf1/open-exchange-rates.json
[junit4:junit4]   2> 200 T1077 oascc.SolrZkClient.makePath makePath: /configs/conf1/open-exchange-rates.json
[junit4:junit4]   2> 203 T1077 oasc.AbstractZkTestCase.putConfig put /usr/home/hudson/hudson-slave/workspace/Lucene-Solr-Tests-trunk-java7/solr/build/solr-core/test-files/solr/collection1/conf/mapping-ISOLatin1Accent.txt to /configs/conf1/mapping-ISOLatin1Accent.txt
[junit4:junit4]   2> 204 T1077 oascc.SolrZkClient.makePath makePath: /configs/conf1/mapping-ISOLatin1Accent.txt
[junit4:junit4]   2> 207 T1077 oasc.AbstractZkTestCase.putConfig put /usr/home/hudson/hudson-slave/workspace/Lucene-Solr-Tests-trunk-java7/solr/build/solr-core/test-files/solr/collection1/conf/old_synonyms.txt to /configs/conf1/old_synonyms.txt
[junit4:junit4]   2> 207 T1077 oascc.SolrZkClient.makePath makePath: /configs/conf1/old_synonyms.txt
[junit4:junit4]   2> 211 T1077 oasc.AbstractZkTestCase.putConfig put /usr/home/hudson/hudson-slave/workspace/Lucene-Solr-Tests-trunk-java7/solr/build/solr-core/test-files/solr/collection1/conf/synonyms.txt to /configs/conf1/synonyms.txt
[junit4:junit4]   2> 211 T1077 oascc.SolrZkClient.makePath makePath: /configs/conf1/synonyms.txt
[junit4:junit4]   2> 214 T1082 oazs.PrepRequestProcessor.pRequest2Txn Processed session termination for sessionid: 0x13c945c900b0001
[junit4:junit4]   2> 221 T1086 oaz.ClientCnxn$EventThread.run EventThread shut down
[junit4:junit4]   2> 221 T1079 oazs.NIOServerCnxn.closeSock Closed socket connection for client /140.211.11.196:22849 which had sessionid 0x13c945c900b0001
[junit4:junit4]   2> 221 T1077 oaz.ZooKeeper.close Session: 0x13c945c900b0001 closed
[junit4:junit4]   2> 390 T1077 oejs.Server.doStart jetty-8.1.8.v20121106
[junit4:junit4]   2> 396 T1077 oejs.AbstractConnector.doStart Started SocketConnector@127.0.0.1:22850
[junit4:junit4]   2> 396 T1077 oass.SolrDispatchFilter.init SolrDispatchFilter.init()
[junit4:junit4]   2> 397 T1077 oasc.SolrResourceLoader.locateSolrHome JNDI not configured for solr (NoInitialContextEx)
[junit4:junit4]   2> 397 T1077 oasc.SolrResourceLoader.locateSolrHome using system property solr.solr.home: /usr/home/hudson/hudson-slave/workspace/Lucene-Solr-Tests-trunk-java7/solr/build/solr-core/test/J0/./org.apache.solr.cloud.BasicDistributedZkTest-controljetty-1359698759901
[junit4:junit4]   2> 398 T1077 oasc.CoreContainer$Initializer.initialize looking for solr.xml: /usr/home/hudson/hudson-slave/workspace/Lucene-Solr-Tests-trunk-java7/solr/build/solr-core/test/J0/./org.apache.solr.cloud.BasicDistributedZkTest-controljetty-1359698759901/solr.xml
[junit4:junit4]   2> 398 T1077 oasc.CoreContainer.<init> New CoreContainer 1629484333
[junit4:junit4]   2> 399 T1077 oasc.CoreContainer.load Loading CoreContainer using Solr Home: '/usr/home/hudson/hudson-slave/workspace/Lucene-Solr-Tests-trunk-java7/solr/build/solr-core/test/J0/./org.apache.solr.cloud.BasicDistributedZkTest-controljetty-1359698759901/'
[junit4:junit4]   2> 399 T1077 oasc.SolrResourceLoader.<init> new SolrResourceLoader for directory: '/usr/home/hudson/hudson-slave/workspace/Lucene-Solr-Tests-trunk-java7/solr/build/solr-core/test/J0/./org.apache.solr.cloud.BasicDistributedZkTest-controljetty-1359698759901/'
[junit4:junit4]   2> 454 T1077 oashc.HttpShardHandlerFactory.getParameter Setting socketTimeout to: 60000
[junit4:junit4]   2> 455 T1077 oashc.HttpShardHandlerFactory.getParameter Setting urlScheme to: http://
[junit4:junit4]   2> 455 T1077 oashc.HttpShardHandlerFactory.getParameter Setting connTimeout to: 15000
[junit4:junit4]   2> 456 T1077 oashc.HttpShardHandlerFactory.getParameter Setting maxConnectionsPerHost to: 20
[junit4:junit4]   2> 456 T1077 oashc.HttpShardHandlerFactory.getParameter Setting corePoolSize to: 0
[junit4:junit4]   2> 457 T1077 oashc.HttpShardHandlerFactory.getParameter Setting maximumPoolSize to: 2147483647
[junit4:junit4]   2> 457 T1077 oashc.HttpShardHandlerFactory.getParameter Setting maxThreadIdleTime to: 5
[junit4:junit4]   2> 457 T1077 oashc.HttpShardHandlerFactory.getParameter Setting sizeOfQueue to: -1
[junit4:junit4]   2> 458 T1077 oashc.HttpShardHandlerFactory.getParameter Setting fairnessPolicy to: false
[junit4:junit4]   2> 458 T1077 oascsi.HttpClientUtil.createClient Creating new http client, config:maxConnectionsPerHost=20&maxConnections=10000&socketTimeout=60000&connTimeout=15000&retry=false
[junit4:junit4]   2> 482 T1077 oasc.CoreContainer.load Registering Log Listener
[junit4:junit4]   2> 501 T1077 oasc.CoreContainer.initZooKeeper Zookeeper client=127.0.0.1:22847/solr
[junit4:junit4]   2> 501 T1077 oasc.ZkController.checkChrootPath zkHost includes chroot
[junit4:junit4]   2> 502 T1077 oaz.ZooKeeper.<init> Initiating client connection, connectString=127.0.0.1:22847 sessionTimeout=60000 watcher=org.apache.solr.common.cloud.ConnectionManager@696b1d46
[junit4:junit4]   2> 503 T1077 oascc.ConnectionManager.waitForConnected Waiting for client to connect to ZooKeeper
[junit4:junit4]   2> 503 T1096 oaz.ClientCnxn$SendThread.logStartConnect Opening socket connection to server localhost/127.0.0.1:22847. Will not attempt to authenticate using SASL (access denied ("javax.security.auth.AuthPermission" "getLoginConfiguration"))
[junit4:junit4]   2> 504 T1096 oaz.ClientCnxn$SendThread.primeConnection Socket connection established to localhost/127.0.0.1:22847, initiating session
[junit4:junit4]   2> 505 T1079 oazs.NIOServerCnxnFactory.run Accepted socket connection from /140.211.11.196:22851
[junit4:junit4]   2> 505 T1079 oazs.ZooKeeperServer.processConnectRequest Client attempting to establish new session at /140.211.11.196:22851
[junit4:junit4]   2> 511 T1081 oazs.ZooKeeperServer.finishSessionInit Established session 0x13c945c900b0002 with negotiated timeout 20000 for client /140.211.11.196:22851
[junit4:junit4]   2> 511 T1096 oaz.ClientCnxn$SendThread.onConnected Session establishment complete on server localhost/127.0.0.1:22847, sessionid = 0x13c945c900b0002, negotiated timeout = 20000
[junit4:junit4]   2> 511 T1097 oascc.ConnectionManager.process Watcher org.apache.solr.common.cloud.ConnectionManager@696b1d46 name:ZooKeeperConnection Watcher:127.0.0.1:22847 got event WatchedEvent state:SyncConnected type:None path:null path:null type:None
[junit4:junit4]   2> 511 T1077 oascc.ConnectionManager.waitForConnected Client is connected to ZooKeeper
[junit4:junit4]   2> 513 T1082 oazs.PrepRequestProcessor.pRequest2Txn Processed session termination for sessionid: 0x13c945c900b0002
[junit4:junit4]   2> 514 T1097 oaz.ClientCnxn$EventThread.run EventThread shut down
[junit4:junit4]   2> 514 T1079 oazs.NIOServerCnxn.closeSock Closed socket connection for client /140.211.11.196:22851 which had sessionid 0x13c945c900b0002
[junit4:junit4]   2> 514 T1077 oaz.ZooKeeper.close Session: 0x13c945c900b0002 closed
[junit4:junit4]   2> 515 T1077 oascsi.HttpClientUtil.createClient Creating new http client, config:maxConnections=500&maxConnectionsPerHost=16&socketTimeout=60000&connTimeout=15000
[junit4:junit4]   2> 528 T1077 oaz.ZooKeeper.<init> Initiating client connection, connectString=127.0.0.1:22847/solr sessionTimeout=30000 watcher=org.apache.solr.common.cloud.ConnectionManager@5e5499e4
[junit4:junit4]   2> 529 T1077 oascc.ConnectionManager.waitForConnected Waiting for client to connect to ZooKeeper
[junit4:junit4]   2> 529 T1098 oaz.ClientCnxn$SendThread.logStartConnect Opening socket connection to server localhost/127.0.0.1:22847. Will not attempt to authenticate using SASL (access denied ("javax.security.auth.AuthPermission" "getLoginConfiguration"))
[junit4:junit4]   2> 530 T1098 oaz.ClientCnxn$SendThread.primeConnection Socket connection established to localhost/127.0.0.1:22847, initiating session
[junit4:junit4]   2> 530 T1079 oazs.NIOServerCnxnFactory.run Accepted socket connection from /140.211.11.196:22852
[junit4:junit4]   2> 530 T1079 oazs.ZooKeeperServer.processConnectRequest Client attempting to establish new session at /140.211.11.196:22852
[junit4:junit4]   2> 531 T1081 oazs.ZooKeeperServer.finishSessionInit Established session 0x13c945c900b0003 with negotiated timeout 20000 for client /140.211.11.196:22852
[junit4:junit4]   2> 532 T1098 oaz.ClientCnxn$SendThread.onConnected Session establishment complete on server localhost/127.0.0.1:22847, sessionid = 0x13c945c900b0003, negotiated timeout = 20000
[junit4:junit4]   2> 532 T1099 oascc.ConnectionManager.process Watcher org.apache.solr.common.cloud.ConnectionManager@5e5499e4 name:ZooKeeperConnection Watcher:127.0.0.1:22847/solr got event WatchedEvent state:SyncConnected type:None path:null path:null type:None
[junit4:junit4]   2> 532 T1077 oascc.ConnectionManager.waitForConnected Client is connected to ZooKeeper
[junit4:junit4]   2> 534 T1082 oazs.PrepRequestProcessor.pRequest Got user-level KeeperException when processing sessionid:0x13c945c900b0003 type:create cxid:0x2 zxid:0x1a txntype:-1 reqpath:n/a Error Path:/solr/overseer Error:KeeperErrorCode = NodeExists for /solr/overseer
[junit4:junit4]   2> 543 T1077 oascc.SolrZkClient.makePath makePath: /live_nodes
[junit4:junit4]   2> 546 T1077 oasc.ZkController.createEphemeralLiveNode Register node as live in ZooKeeper:/live_nodes/127.0.0.1:22850_hh%2Fba
[junit4:junit4]   2> 546 T1082 oazs.PrepRequestProcessor.pRequest Got user-level KeeperException when processing sessionid:0x13c945c900b0003 type:delete cxid:0x7 zxid:0x1c txntype:-1 reqpath:n/a Error Path:/solr/live_nodes/127.0.0.1:22850_hh%2Fba Error:KeeperErrorCode = NoNode for /solr/live_nodes/127.0.0.1:22850_hh%2Fba
[junit4:junit4]   2> 548 T1077 oascc.SolrZkClient.makePath makePath: /live_nodes/127.0.0.1:22850_hh%2Fba
[junit4:junit4]   2> 557 T1077 oascc.SolrZkClient.makePath makePath: /overseer_elect/election
[junit4:junit4]   2> 571 T1082 oazs.PrepRequestProcessor.pRequest Got user-level KeeperException when processing sessionid:0x13c945c900b0003 type:delete cxid:0x15 zxid:0x21 txntype:-1 reqpath:n/a Error Path:/solr/overseer_elect/leader Error:KeeperErrorCode = NoNode for /solr/overseer_elect/leader
[junit4:junit4]   2> 572 T1077 oascc.SolrZkClient.makePath makePath: /overseer_elect/leader
[junit4:junit4]   2> 575 T1077 oasc.Overseer.start Overseer (id=89109217915109379-127.0.0.1:22850_hh%2Fba-n_0000000000) starting
[junit4:junit4]   2> 576 T1082 oazs.PrepRequestProcessor.pRequest Got user-level KeeperException when processing sessionid:0x13c945c900b0003 type:create cxid:0x1a zxid:0x23 txntype:-1 reqpath:n/a Error Path:/solr/overseer Error:KeeperErrorCode = NodeExists for /solr/overseer
[junit4:junit4]   2> 583 T1082 oazs.PrepRequestProcessor.pRequest Got user-level KeeperException when processing sessionid:0x13c945c900b0003 type:create cxid:0x1b zxid:0x24 txntype:-1 reqpath:n/a Error Path:/solr/overseer Error:KeeperErrorCode = NodeExists for /solr/overseer
[junit4:junit4]   2> 584 T1082 oazs.PrepRequestProcessor.pRequest Got user-level KeeperException when processing sessionid:0x13c945c900b0003 type:create cxid:0x1c zxid:0x25 txntype:-1 reqpath:n/a Error Path:/solr/overseer Error:KeeperErrorCode = NodeExists for /solr/overseer
[junit4:junit4]   2> 591 T1082 oazs.PrepRequestProcessor.pRequest Got user-level KeeperException when processing sessionid:0x13c945c900b0003 type:create cxid:0x1d zxid:0x26 txntype:-1 reqpath:n/a Error Path:/solr/overseer Error:KeeperErrorCode = NodeExists for /solr/overseer
[junit4:junit4]   2> 592 T1101 oasc.OverseerCollectionProcessor.run Process current queue of collection creations
[junit4:junit4]   2> 593 T1077 oascc.SolrZkClient.makePath makePath: /clusterstate.json
[junit4:junit4]   2> 604 T1077 oascc.ZkStateReader.createClusterStateWatchersAndUpdate Updating cluster state from ZooKeeper... 
[junit4:junit4]   2> 606 T1100 oasc.Overseer$ClusterStateUpdater.run Starting to work on the main queue
[junit4:junit4]   2> 611 T1102 oasc.CoreContainer.create Creating SolrCore 'collection1' using instanceDir: /usr/home/hudson/hudson-slave/workspace/Lucene-Solr-Tests-trunk-java7/solr/build/solr-core/test/J0/./org.apache.solr.cloud.BasicDistributedZkTest-controljetty-1359698759901/collection1
[junit4:junit4]   2> 612 T1102 oasc.ZkController.createCollectionZkNode Check for collection zkNode:control_collection
[junit4:junit4]   2> 612 T1102 oasc.ZkController.createCollectionZkNode Collection zkNode exists
[junit4:junit4]   2> 612 T1102 oasc.ZkController.readConfigName Load collection config from:/collections/control_collection
[junit4:junit4]   2> 614 T1102 oasc.SolrResourceLoader.<init> new SolrResourceLoader for directory: '/usr/home/hudson/hudson-slave/workspace/Lucene-Solr-Tests-trunk-java7/solr/build/solr-core/test/J0/./org.apache.solr.cloud.BasicDistributedZkTest-controljetty-1359698759901/collection1/'
[junit4:junit4]   2> 616 T1102 oasc.SolrResourceLoader.replaceClassLoader Adding 'file:/usr/home/hudson/hudson-slave/workspace/Lucene-Solr-Tests-trunk-java7/solr/build/solr-core/test/J0/org.apache.solr.cloud.BasicDistributedZkTest-controljetty-1359698759901/collection1/lib/classes/' to classloader
[junit4:junit4]   2> 616 T1102 oasc.SolrResourceLoader.replaceClassLoader Adding 'file:/usr/home/hudson/hudson-slave/workspace/Lucene-Solr-Tests-trunk-java7/solr/build/solr-core/test/J0/org.apache.solr.cloud.BasicDistributedZkTest-controljetty-1359698759901/collection1/lib/README' to classloader
[junit4:junit4]   2> 669 T1102 oasc.SolrConfig.<init> Using Lucene MatchVersion: LUCENE_50
[junit4:junit4]   2> 745 T1102 oasc.SolrConfig.<init> Loaded SolrConfig: solrconfig.xml
[junit4:junit4]   2> 747 T1102 oass.IndexSchema.readSchema Reading Solr Schema
[junit4:junit4]   2> 754 T1102 oass.IndexSchema.readSchema Schema name=test
[junit4:junit4]   2> 1383 T1102 oass.OpenExchangeRatesOrgProvider.init Initialized with rates=open-exchange-rates.json, refreshInterval=1440.
[junit4:junit4]   2> 1395 T1102 oass.IndexSchema.readSchema default search field in schema is text
[junit4:junit4]   2> 1399 T1102 oass.IndexSchema.readSchema unique key field: id
[junit4:junit4]   2> 1417 T1102 oass.FileExchangeRateProvider.reload Reloading exchange rates from file currency.xml
[junit4:junit4]   2> 1422 T1102 oass.FileExchangeRateProvider.reload Reloading exchange rates from file currency.xml
[junit4:junit4]   2> 1427 T1102 oass.OpenExchangeRatesOrgProvider.reload Reloading exchange rates from open-exchange-rates.json
[junit4:junit4]   2> 1428 T1102 oass.OpenExchangeRatesOrgProvider.reload Reloading exchange rates from open-exchange-rates.json
[junit4:junit4]   2> 1429 T1102 oasc.SolrCore.<init> [collection1] Opening new SolrCore at /usr/home/hudson/hudson-slave/workspace/Lucene-Solr-Tests-trunk-java7/solr/build/solr-core/test/J0/./org.apache.solr.cloud.BasicDistributedZkTest-controljetty-1359698759901/collection1/, dataDir=./org.apache.solr.cloud.BasicDistributedZkTest-1359698759685/control/data/
[junit4:junit4]   2> 1430 T1102 oasc.JmxMonitoredMap.<init> JMX monitoring is enabled. Adding Solr mbeans to JMX Server: com.sun.jmx.mbeanserver.JmxMBeanServer@34c3c29
[junit4:junit4]   2> 1430 T1102 oasc.SolrCore.initDirectoryFactory solr.StandardDirectoryFactory
[junit4:junit4]   2> 1431 T1102 oasc.CachingDirectoryFactory.get return new directory for /usr/home/hudson/hudson-slave/workspace/Lucene-Solr-Tests-trunk-java7/solr/build/solr-core/test/J0/./org.apache.solr.cloud.BasicDistributedZkTest-1359698759685/control/data forceNew:false
[junit4:junit4]   2> 1432 T1102 oasc.CachingDirectoryFactory.close Releasing directory:/usr/home/hudson/hudson-slave/workspace/Lucene-Solr-Tests-trunk-java7/solr/build/solr-core/test/J0/./org.apache.solr.cloud.BasicDistributedZkTest-1359698759685/control/data
[junit4:junit4]   2> 1432 T1102 oasc.SolrCore.getNewIndexDir New index directory detected: old=null new=./org.apache.solr.cloud.BasicDistributedZkTest-1359698759685/control/data/index/
[junit4:junit4]   2> 1433 T1102 oasc.SolrCore.initIndex WARNING [collection1] Solr index directory './org.apache.solr.cloud.BasicDistributedZkTest-1359698759685/control/data/index' doesn't exist. Creating new index...
[junit4:junit4]   2> 1434 T1102 oasc.CachingDirectoryFactory.get return new directory for /usr/home/hudson/hudson-slave/workspace/Lucene-Solr-Tests-trunk-java7/solr/build/solr-core/test/J0/./org.apache.solr.cloud.BasicDistributedZkTest-1359698759685/control/data/index forceNew:false
[junit4:junit4]   2> 1439 T1102 oasc.SolrDeletionPolicy.onCommit SolrDeletionPolicy.onCommit: commits:num=1
[junit4:junit4]   2> 		commit{dir=RateLimitedDirectoryWrapper(org.apache.lucene.store.NIOFSDirectory@/usr/home/hudson/hudson-slave/workspace/Lucene-Solr-Tests-trunk-java7/solr/build/solr-core/test/J0/org.apache.solr.cloud.BasicDistributedZkTest-1359698759685/control/data/index lockFactory=org.apache.lucene.store.NativeFSLockFactory@6e604bcd),segFN=segments_1,generation=1,filenames=[segments_1]
[junit4:junit4]   2> 1440 T1102 oasc.SolrDeletionPolicy.updateCommits newest commit = 1[segments_1]
[junit4:junit4]   2> 1441 T1102 oasc.CachingDirectoryFactory.close Releasing directory:/usr/home/hudson/hudson-slave/workspace/Lucene-Solr-Tests-trunk-java7/solr/build/solr-core/test/J0/./org.apache.solr.cloud.BasicDistributedZkTest-1359698759685/control/data/index
[junit4:junit4]   2> 1441 T1102 oasc.SolrCore.initWriters created xml: solr.XMLResponseWriter
[junit4:junit4]   2> 1443 T1102 oasup.UpdateRequestProcessorChain.init inserting DistributedUpdateProcessorFactory into updateRequestProcessorChain "dedupe"
[junit4:junit4]   2> 1443 T1102 oasup.UpdateRequestProcessorChain.init inserting DistributedUpdateProcessorFactory into updateRequestProcessorChain "dedupe-allfields"
[junit4:junit4]   2> 1443 T1102 oasup.UpdateRequestProcessorChain.init inserting DistributedUpdateProcessorFactory into updateRequestProcessorChain "stored_sig"
[junit4:junit4]   2> 1444 T1102 oasup.UpdateRequestProcessorChain.init inserting DistributedUpdateProcessorFactory into updateRequestProcessorChain "uniq-fields"
[junit4:junit4]   2> 1444 T1102 oasup.UpdateRequestProcessorChain.init inserting DistributedUpdateProcessorFactory into updateRequestProcessorChain "distrib-dup-test-chain-implicit"
[junit4:junit4]   2> 1445 T1102 oasc.RequestHandlers.initHandlersFromConfig adding lazy requestHandler: solr.ReplicationHandler
[junit4:junit4]   2> 1445 T1102 oasc.RequestHandlers.initHandlersFromConfig created /replication: solr.ReplicationHandler
[junit4:junit4]   2> 1445 T1102 oasc.RequestHandlers.initHandlersFromConfig created standard: solr.StandardRequestHandler
[junit4:junit4]   2> 1446 T1102 oasc.RequestHandlers.initHandlersFromConfig created /get: solr.RealTimeGetHandler
[junit4:junit4]   2> 1446 T1102 oasc.RequestHandlers.initHandlersFromConfig created dismax: solr.SearchHandler
[junit4:junit4]   2> 1447 T1102 oasc.RequestHandlers.initHandlersFromConfig created mock: org.apache.solr.core.MockQuerySenderListenerReqHandler
[junit4:junit4]   2> 1447 T1102 oasc.RequestHandlers.initHandlersFromConfig created /admin/: org.apache.solr.handler.admin.AdminHandlers
[junit4:junit4]   2> 1447 T1102 oasc.RequestHandlers.initHandlersFromConfig created defaults: solr.StandardRequestHandler
[junit4:junit4]   2> 1448 T1102 oasc.RequestHandlers.initHandlersFromConfig adding lazy requestHandler: solr.StandardRequestHandler
[junit4:junit4]   2> 1448 T1102 oasc.RequestHandlers.initHandlersFromConfig created lazy: solr.StandardRequestHandler
[junit4:junit4]   2> 1448 T1102 oasc.RequestHandlers.initHandlersFromConfig created /update: solr.UpdateRequestHandler
[junit4:junit4]   2> 1449 T1102 oasc.RequestHandlers.initHandlersFromConfig created /terms: org.apache.solr.handler.component.SearchHandler
[junit4:junit4]   2> 1449 T1102 oasc.RequestHandlers.initHandlersFromConfig created spellCheckCompRH: org.apache.solr.handler.component.SearchHandler
[junit4:junit4]   2> 1450 T1102 oasc.RequestHandlers.initHandlersFromConfig created spellCheckCompRH_Direct: org.apache.solr.handler.component.SearchHandler
[junit4:junit4]   2> 1450 T1102 oasc.RequestHandlers.initHandlersFromConfig created spellCheckWithWordbreak: org.apache.solr.handler.component.SearchHandler
[junit4:junit4]   2> 1451 T1102 oasc.RequestHandlers.initHandlersFromConfig created spellCheckWithWordbreak_Direct: org.apache.solr.handler.component.SearchHandler
[junit4:junit4]   2> 1451 T1102 oasc.RequestHandlers.initHandlersFromConfig created spellCheckCompRH1: org.apache.solr.handler.component.SearchHandler
[junit4:junit4]   2> 1451 T1102 oasc.RequestHandlers.initHandlersFromConfig created mltrh: org.apache.solr.handler.component.SearchHandler
[junit4:junit4]   2> 1452 T1102 oasc.RequestHandlers.initHandlersFromConfig created tvrh: org.apache.solr.handler.component.SearchHandler
[junit4:junit4]   2> 1452 T1102 oasc.RequestHandlers.initHandlersFromConfig created /mlt: solr.MoreLikeThisHandler
[junit4:junit4]   2> 1453 T1102 oasc.RequestHandlers.initHandlersFromConfig created /debug/dump: solr.DumpRequestHandler
[junit4:junit4]   2> 1464 T1102 oashl.XMLLoader.init xsltCacheLifetimeSeconds=60
[junit4:junit4]   2> 1469 T1102 oasc.SolrCore.initDeprecatedSupport WARNING solrconfig.xml uses deprecated <admin/gettableFiles>, Please update your config to use the ShowFileRequestHandler.
[junit4:junit4]   2> 1470 T1102 oasc.SolrCore.initDeprecatedSupport WARNING adding ShowFileRequestHandler with hidden files: [SCHEMA.XML, OLD_SYNONYMS.TXT, STOPWORDS.TXT, PROTWORDS.TXT, OPEN-EXCHANGE-RATES.JSON, SYNONYMS.TXT, CURRENCY.XML, MAPPING-ISOLATIN1ACCENT.TXT]
[junit4:junit4]   2> 1472 T1102 oasc.CachingDirectoryFactory.close Releasing directory:/usr/home/hudson/hudson-slave/workspace/Lucene-Solr-Tests-trunk-java7/solr/build/solr-core/test/J0/./org.apache.solr.cloud.BasicDistributedZkTest-1359698759685/control/data
[junit4:junit4]   2> 1474 T1102 oass.SolrIndexSearcher.<init> Opening Searcher@56599200 main
[junit4:junit4]   2> 1475 T1102 oasu.CommitTracker.<init> Hard AutoCommit: disabled
[junit4:junit4]   2> 1475 T1102 oasu.CommitTracker.<init> Soft AutoCommit: disabled
[junit4:junit4]   2> 1476 T1102 oashc.SpellCheckComponent.inform Initializing spell checkers
[junit4:junit4]   2> 1494 T1102 oass.DirectSolrSpellChecker.init init: {name=direct,classname=DirectSolrSpellChecker,field=lowerfilt,minQueryLength=3}
[junit4:junit4]   2> 1549 T1103 oasc.SolrCore.registerSearcher [collection1] Registered new searcher Searcher@56599200 main{StandardDirectoryReader(segments_1:1)}
[junit4:junit4]   2> 1553 T1102 oasc.ZkController.publish publishing core=collection1 state=down
[junit4:junit4]   2> 1554 T1102 oasc.ZkController.publish numShards not found on descriptor - reading it from system property
[junit4:junit4]   2> 1554 T1082 oazs.PrepRequestProcessor.pRequest Got user-level KeeperException when processing sessionid:0x13c945c900b0003 type:create cxid:0x50 zxid:0x29 txntype:-1 reqpath:n/a Error Path:/solr/overseer/queue Error:KeeperErrorCode = NoNode for /solr/overseer/queue
[junit4:junit4]   2> 2111 T1100 oascc.ZkStateReader.updateClusterState Updating cloud state from ZooKeeper... 
[junit4:junit4]   2> 2112 T1100 oasc.Overseer$ClusterStateUpdater.updateState Update state numShards=1 message={
[junit4:junit4]   2> 	  "operation":"state",
[junit4:junit4]   2> 	  "numShards":"1",
[junit4:junit4]   2> 	  "shard":null,
[junit4:junit4]   2> 	  "roles":null,
[junit4:junit4]   2> 	  "state":"down",
[junit4:junit4]   2> 	  "core":"collection1",
[junit4:junit4]   2> 	  "collection":"control_collection",
[junit4:junit4]   2> 	  "node_name":"127.0.0.1:22850_hh%2Fba",
[junit4:junit4]   2> 	  "base_url":"http://127.0.0.1:22850/hh/ba"}
[junit4:junit4]   2> 2112 T1100 oasc.Overseer$ClusterStateUpdater.createCollection Create collection control_collection with numShards 1
[junit4:junit4]   2> 2112 T1100 oasc.Overseer$ClusterStateUpdater.updateState Assigning new node to shard shard=shard1
[junit4:junit4]   2> 2113 T1082 oazs.PrepRequestProcessor.pRequest Got user-level KeeperException when processing sessionid:0x13c945c900b0003 type:create cxid:0x58 zxid:0x2c txntype:-1 reqpath:n/a Error Path:/solr/overseer/queue-work Error:KeeperErrorCode = NoNode for /solr/overseer/queue-work
[junit4:junit4]   2> 2135 T1099 oascc.ZkStateReader$2.process A cluster state change: WatchedEvent state:SyncConnected type:NodeDataChanged path:/clusterstate.json, has occurred - updating... (live nodes size: 1)
[junit4:junit4]   2> 2565 T1102 oasc.CoreContainer.registerCore registering core: collection1
[junit4:junit4]   2> 2565 T1102 oasc.ZkController.register Register replica - core:collection1 address:http://127.0.0.1:22850/hh/ba collection:control_collection shard:shard1
[junit4:junit4]   2> 2566 T1102 oascc.SolrZkClient.makePath makePath: /collections/control_collection/leader_elect/shard1/election
[junit4:junit4]   2> 2582 T1082 oazs.PrepRequestProcessor.pRequest Got user-level KeeperException when processing sessionid:0x13c945c900b0003 type:delete cxid:0x72 zxid:0x36 txntype:-1 reqpath:n/a Error Path:/solr/collections/control_collection/leaders Error:KeeperErrorCode = NoNode for /solr/collections/control_collection/leaders
[junit4:junit4]   2> 2583 T1102 oasc.ShardLeaderElectionContext.runLeaderProcess Running the leader process.
[junit4:junit4]   2> 2584 T1082 oazs.PrepRequestProcessor.pRequest Got user-level KeeperException when processing sessionid:0x13c945c900b0003 type:create cxid:0x73 zxid:0x37 txntype:-1 reqpath:n/a Error Path:/solr/overseer Error:KeeperErrorCode = NodeExists for /solr/overseer
[junit4:junit4]   2> 2594 T1102 oasc.ShardLeaderElectionContext.waitForReplicasToComeUp Enough replicas found to continue.
[junit4:junit4]   2> 2595 T1102 oasc.ShardLeaderElectionContext.runLeaderProcess I may be the new leader - try and sync
[junit4:junit4]   2> 2595 T1102 oasc.SyncStrategy.sync Sync replicas to http://127.0.0.1:22850/hh/ba/collection1/
[junit4:junit4]   2> 2595 T1102 oasc.SyncStrategy.syncReplicas Sync Success - now sync replicas to me
[junit4:junit4]   2> 2595 T1102 oasc.SyncStrategy.syncToMe http://127.0.0.1:22850/hh/ba/collection1/ has no replicas
[junit4:junit4]   2> 2596 T1102 oasc.ShardLeaderElectionContext.runLeaderProcess I am the new leader: http://127.0.0.1:22850/hh/ba/collection1/
[junit4:junit4]   2> 2596 T1102 oascc.SolrZkClient.makePath makePath: /collections/control_collection/leaders/shard1
[junit4:junit4]   2> 2601 T1082 oazs.PrepRequestProcessor.pRequest Got user-level KeeperException when processing sessionid:0x13c945c900b0003 type:create cxid:0x7d zxid:0x3b txntype:-1 reqpath:n/a Error Path:/solr/overseer Error:KeeperErrorCode = NodeExists for /solr/overseer
[junit4:junit4]   2> 3640 T1100 oascc.ZkStateReader.updateClusterState Updating cloud state from ZooKeeper... 
[junit4:junit4]   2> 3664 T1099 oascc.ZkStateReader$2.process A cluster state change: WatchedEvent state:SyncConnected type:NodeDataChanged path:/clusterstate.json, has occurred - updating... (live nodes size: 1)
[junit4:junit4]   2> 3726 T1102 oasc.ZkController.register We are http://127.0.0.1:22850/hh/ba/collection1/ and leader is http://127.0.0.1:22850/hh/ba/collection1/
[junit4:junit4]   2> 3726 T1102 oasc.ZkController.register No LogReplay needed for core=collection1 baseURL=http://127.0.0.1:22850/hh/ba
[junit4:junit4]   2> 3726 T1102 oasc.ZkController.checkRecovery I am the leader, no recovery necessary
[junit4:junit4]   2> 3726 T1102 oasc.ZkController.publish publishing core=collection1 state=active
[junit4:junit4]   2> 3727 T1102 oasc.ZkController.publish numShards not found on descriptor - reading it from system property
[junit4:junit4]   2> 3730 T1102 oascc.ZkStateReader.updateClusterState Updating cloud state from ZooKeeper... 
[junit4:junit4]   2> 3731 T1077 oass.SolrDispatchFilter.init user.dir=/usr/home/hudson/hudson-slave/workspace/Lucene-Solr-Tests-trunk-java7/solr/build/solr-core/test/J0
[junit4:junit4]   2> 3731 T1077 oass.SolrDispatchFilter.init SolrDispatchFilter.init() done
[junit4:junit4]   2> 3732 T1077 oascsi.HttpClientUtil.createClient Creating new http client, config:maxConnections=128&maxConnectionsPerHost=32&followRedirects=false
[junit4:junit4]   2> 3747 T1077 oascsi.HttpClientUtil.createClient Creating new http client, config:
[junit4:junit4]   2> 3758 T1077 oaz.ZooKeeper.<init> Initiating client connection, connectString=127.0.0.1:22847/solr sessionTimeout=10000 watcher=org.apache.solr.common.cloud.ConnectionManager@1bf2f5b5
[junit4:junit4]   2> 3759 T1077 oascc.ConnectionManager.waitForConnected Waiting for client to connect to ZooKeeper
[junit4:junit4]   2> 3759 T1104 oaz.ClientCnxn$SendThread.logStartConnect Opening socket connection to server localhost/127.0.0.1:22847. Will not attempt to authenticate using SASL (access denied ("javax.security.auth.AuthPermission" "getLoginConfiguration"))
[junit4:junit4]   2> 3760 T1104 oaz.ClientCnxn$SendThread.primeConnection Socket connection established to localhost/127.0.0.1:22847, initiating session
[junit4:junit4]   2> 3760 T1079 oazs.NIOServerCnxnFactory.run Accepted socket connection from /140.211.11.196:22853
[junit4:junit4]   2> 3760 T1079 oazs.ZooKeeperServer.processConnectRequest Client attempting to establish new session at /140.211.11.196:22853
[junit4:junit4]   2> 3762 T1081 oazs.ZooKeeperServer.finishSessionInit Established session 0x13c945c900b0004 with negotiated timeout 10000 for client /140.211.11.196:22853
[junit4:junit4]   2> 3762 T1104 oaz.ClientCnxn$SendThread.onConnected Session establishment complete on server localhost/127.0.0.1:22847, sessionid = 0x13c945c900b0004, negotiated timeout = 10000
[junit4:junit4]   2> 3762 T1105 oascc.ConnectionManager.process Watcher org.apache.solr.common.cloud.ConnectionManager@1bf2f5b5 name:ZooKeeperConnection Watcher:127.0.0.1:22847/solr got event WatchedEvent state:SyncConnected type:None path:null path:null type:None
[junit4:junit4]   2> 3762 T1077 oascc.ConnectionManager.waitForConnected Client is connected to ZooKeeper
[junit4:junit4]   2> 3764 T1077 oascc.ZkStateReader.createClusterStateWatchersAndUpdate Updating cluster state from ZooKeeper... 
[junit4:junit4]   2> 3766 T1077 oasc.ChaosMonkey.monkeyLog monkey: init - expire sessions:true cause connection loss:true
[junit4:junit4]   2> 3935 T1077 oejs.Server.doStart jetty-8.1.8.v20121106
[junit4:junit4]   2> 3938 T1077 oejs.AbstractConnector.doStart Started SocketConnector@127.0.0.1:22854
[junit4:junit4]   2> 3938 T1077 oass.SolrDispatchFilter.init SolrDispatchFilter.init()
[junit4:junit4]   2> 3939 T1077 oasc.SolrResourceLoader.locateSolrHome JNDI not configured for solr (NoInitialContextEx)
[junit4:junit4]   2> 3939 T1077 oasc.SolrResourceLoader.locateSolrHome using system property solr.solr.home: /usr/home/hudson/hudson-slave/workspace/Lucene-Solr-Tests-trunk-java7/solr/build/solr-core/test/J0/./org.apache.solr.cloud.BasicDistributedZkTest-jetty1-1359698763446
[junit4:junit4]   2> 3940 T1077 oasc.CoreContainer$Initializer.initialize looking for solr.xml: /usr/home/hudson/hudson-slave/workspace/Lucene-Solr-Tests-trunk-java7/solr/build/solr-core/test/J0/./org.apache.solr.cloud.BasicDistributedZkTest-jetty1-1359698763446/solr.xml
[junit4:junit4]   2> 3940 T1077 oasc.CoreContainer.<init> New CoreContainer 212711045
[junit4:junit4]   2> 3941 T1077 oasc.CoreContainer.load Loading CoreContainer using Solr Home: '/usr/home/hudson/hudson-slave/workspace/Lucene-Solr-Tests-trunk-java7/solr/build/solr-core/test/J0/./org.apache.solr.cloud.BasicDistributedZkTest-jetty1-1359698763446/'
[junit4:junit4]   2> 3941 T1077 oasc.SolrResourceLoader.<init> new SolrResourceLoader for directory: '/usr/home/hudson/hudson-slave/workspace/Lucene-Solr-Tests-trunk-java7/solr/build/solr-core/test/J0/./org.apache.solr.cloud.BasicDistributedZkTest-jetty1-1359698763446/'
[junit4:junit4]   2> 3996 T1077 oashc.HttpShardHandlerFactory.getParameter Setting socketTimeout to: 60000
[junit4:junit4]   2> 3997 T1077 oashc.HttpShardHandlerFactory.getParameter Setting urlScheme to: http://
[junit4:junit4]   2> 3997 T1077 oashc.HttpShardHandlerFactory.getParameter Setting connTimeout to: 15000
[junit4:junit4]   2> 3998 T1077 oashc.HttpShardHandlerFactory.getParameter Setting maxConnectionsPerHost to: 20
[junit4:junit4]   2> 3998 T1077 oashc.HttpShardHandlerFactory.getParameter Setting corePoolSize to: 0
[junit4:junit4]   2> 3999 T1077 oashc.HttpShardHandlerFactory.getParameter Setting maximumPoolSize to: 2147483647
[junit4:junit4]   2> 3999 T1077 oashc.HttpShardHandlerFactory.getParameter Setting maxThreadIdleTime to: 5
[junit4:junit4]   2> 4000 T1077 oashc.HttpShardHandlerFactory.getParameter Setting sizeOfQueue to: -1
[junit4:junit4]   2> 4000 T1077 oashc.HttpShardHandlerFactory.getParameter Setting fairnessPolicy to: false
[junit4:junit4]   2> 4000 T1077 oascsi.HttpClientUtil.createClient Creating new http client, config:maxConnectionsPerHost=20&maxConnections=10000&socketTimeout=60000&connTimeout=15000&retry=false
[junit4:junit4]   2> 4021 T1077 oasc.CoreContainer.load Registering Log Listener
[junit4:junit4]   2> 4041 T1077 oasc.CoreContainer.initZooKeeper Zookeeper client=127.0.0.1:22847/solr
[junit4:junit4]   2> 4041 T1077 oasc.ZkController.checkChrootPath zkHost includes chroot
[junit4:junit4]   2> 4042 T1077 oaz.ZooKeeper.<init> Initiating client connection, connectString=127.0.0.1:22847 sessionTimeout=60000 watcher=org.apache.solr.common.cloud.ConnectionManager@1de5e046
[junit4:junit4]   2> 4043 T1077 oascc.ConnectionManager.waitForConnected Waiting for client to connect to ZooKeeper
[junit4:junit4]   2> 4043 T1115 oaz.ClientCnxn$SendThread.logStartConnect Opening socket connection to server localhost/127.0.0.1:22847. Will not attempt to authenticate using SASL (access denied ("javax.security.auth.AuthPermission" "getLoginConfiguration"))
[junit4:junit4]   2> 4044 T1115 oaz.ClientCnxn$SendThread.primeConnection Socket connection established to localhost/127.0.0.1:22847, initiating session
[junit4:junit4]   2> 4044 T1079 oazs.NIOServerCnxnFactory.run Accepted socket connection from /140.211.11.196:22855
[junit4:junit4]   2> 4045 T1079 oazs.ZooKeeperServer.processConnectRequest Client attempting to establish new session at /140.211.11.196:22855
[junit4:junit4]   2> 4047 T1081 oazs.ZooKeeperServer.finishSessionInit Established session 0x13c945c900b0005 with negotiated timeout 20000 for client /140.211.11.196:22855
[junit4:junit4]   2> 4047 T1115 oaz.ClientCnxn$SendThread.onConnected Session establishment complete on server localhost/127.0.0.1:22847, sessionid = 0x13c945c900b0005, negotiated timeout = 20000
[junit4:junit4]   2> 4047 T1116 oascc.ConnectionManager.process Watcher org.apache.solr.common.cloud.ConnectionManager@1de5e046 name:ZooKeeperConnection Watcher:127.0.0.1:22847 got event WatchedEvent state:SyncConnected type:None path:null path:null type:None
[junit4:junit4]   2> 4047 T1077 oascc.ConnectionManager.waitForConnected Client is connected to ZooKeeper
[junit4:junit4]   2> 4049 T1082 oazs.PrepRequestProcessor.pRequest2Txn Processed session termination for sessionid: 0x13c945c900b0005
[junit4:junit4]   2> 4058 T1116 oaz.ClientCnxn$EventThread.run EventThread shut down
[junit4:junit4]   2> 4058 T1079 oazs.NIOServerCnxn.closeSock Closed socket connection for client /140.211.11.196:22855 which had sessionid 0x13c945c900b0005
[junit4:junit4]   2> 4058 T1077 oaz.ZooKeeper.close Session: 0x13c945c900b0005 closed
[junit4:junit4]   2> 4059 T1077 oascsi.HttpClientUtil.createClient Creating new http client, config:maxConnections=500&maxConnectionsPerHost=16&socketTimeout=60000&connTimeout=15000
[junit4:junit4]   2> 4070 T1077 oaz.ZooKeeper.<init> Initiating client connection, connectString=127.0.0.1:22847/solr sessionTimeout=30000 watcher=org.apache.solr.common.cloud.ConnectionManager@7017a134
[junit4:junit4]   2> 4071 T1077 oascc.ConnectionManager.waitForConnected Waiting for client to connect to ZooKeeper
[junit4:junit4]   2> 4072 T1117 oaz.ClientCnxn$SendThread.logStartConnect Opening socket connection to server localhost/127.0.0.1:22847. Will not attempt to authenticate using SASL (access denied ("javax.security.auth.AuthPermission" "getLoginConfiguration"))
[junit4:junit4]   2> 4072 T1117 oaz.ClientCnxn$SendThread.primeConnection Socket connection established to localhost/127.0.0.1:22847, initiating session
[junit4:junit4]   2> 4073 T1079 oazs.NIOServerCnxnFactory.run Accepted socket connection from /140.211.11.196:22856
[junit4:junit4]   2> 4073 T1079 oazs.ZooKeeperServer.processConnectRequest Client attempting to establish new session at /140.211.11.196:22856
[junit4:junit4]   2> 4074 T1081 oazs.ZooKeeperServer.finishSessionInit Established session 0x13c945c900b0006 with negotiated timeout 20000 for client /140.211.11.196:22856
[junit4:junit4]   2> 4074 T1117 oaz.ClientCnxn$SendThread.onConnected Session establishment complete on server localhost/127.0.0.1:22847, sessionid = 0x13c945c900b0006, negotiated timeout = 20000
[junit4:junit4]   2> 4075 T1118 oascc.ConnectionManager.process Watcher org.apache.solr.common.cloud.ConnectionManager@7017a134 name:ZooKeeperConnection Watcher:127.0.0.1:22847/solr got event WatchedEvent state:SyncConnected type:None path:null path:null type:None
[junit4:junit4]   2> 4075 T1077 oascc.ConnectionManager.waitForConnected Client is connected to ZooKeeper
[junit4:junit4]   2> 4076 T1082 oazs.PrepRequestProcessor.pRequest Got user-level KeeperException when processing sessionid:0x13c945c900b0006 type:create cxid:0x1 zxid:0x49 txntype:-1 reqpath:n/a Error Path:/solr/overseer Error:KeeperErrorCode = NodeExists for /solr/overseer
[junit4:junit4]   2> 4078 T1082 oazs.PrepRequestProcessor.pRequest Got user-level KeeperException when processing sessionid:0x13c945c900b0006 type:create cxid:0x2 zxid:0x4a txntype:-1 reqpath:n/a Error Path:/solr/overseer Error:KeeperErrorCode = NodeExists for /solr/overseer
[junit4:junit4]   2> 4086 T1077 oasc.ZkController.createEphemeralLiveNode Register node as live in ZooKeeper:/live_nodes/127.0.0.1:22854_hh%2Fba
[junit4:junit4]   2> 4086 T1082 oazs.PrepRequestProcessor.pRequest Got user-level KeeperException when processing sessionid:0x13c945c900b0006 type:delete cxid:0x4 zxid:0x4b txntype:-1 reqpath:n/a Error Path:/solr/live_nodes/127.0.0.1:22854_hh%2Fba Error:KeeperErrorCode = NoNode for /solr/live_nodes/127.0.0.1:22854_hh%2Fba
[junit4:junit4]   2> 4087 T1077 oascc.SolrZkClient.makePath makePath: /live_nodes/127.0.0.1:22854_hh%2Fba
[junit4:junit4]   2> 4090 T1099 oascc.ZkStateReader$2.process A cluster state change: WatchedEvent state:SyncConnected type:NodeChildrenChanged path:/live_nodes, has occurred - updating... (live nodes size: 1)
[junit4:junit4]   2> 4091 T1105 oascc.ZkStateReader$3.process Updating live nodes... (2)
[junit4:junit4]   2> 4092 T1099 oascc.ZkStateReader$3.process Updating live nodes... (2)
[junit4:junit4]   2> 4100 T1077 oascc.ZkStateReader.createClusterStateWatchersAndUpdate Updating cluster state from ZooKeeper... 
[junit4:junit4]   2> 4107 T1119 oasc.CoreContainer.create Creating SolrCore 'collection1' using instanceDir: /usr/home/hudson/hudson-slave/workspace/Lucene-Solr-Tests-trunk-java7/solr/build/solr-core/test/J0/./org.apache.solr.cloud.BasicDistributedZkTest-jetty1-1359698763446/collection1
[junit4:junit4]   2> 4107 T1119 oasc.ZkController.createCollectionZkNode Check for collection zkNode:collection1
[junit4:junit4]   2> 4108 T1119 oasc.ZkController.createCollectionZkNode Collection zkNode exists
[junit4:junit4]   2> 4108 T1119 oasc.ZkController.readConfigName Load collection config from:/collections/collection1
[junit4:junit4]   2> 4110 T1119 oasc.SolrResourceLoader.<init> new SolrResourceLoader for directory: '/usr/home/hudson/hudson-slave/workspace/Lucene-Solr-Tests-trunk-java7/solr/build/solr-core/test/J0/./org.apache.solr.cloud.BasicDistributedZkTest-jetty1-1359698763446/collection1/'
[junit4:junit4]   2> 4111 T1119 oasc.SolrResourceLoader.replaceClassLoader Adding 'file:/usr/home/hudson/hudson-slave/workspace/Lucene-Solr-Tests-trunk-java7/solr/build/solr-core/test/J0/org.apache.solr.cloud.BasicDistributedZkTest-jetty1-1359698763446/collection1/lib/README' to classloader
[junit4:junit4]   2> 4111 T1119 oasc.SolrResourceLoader.replaceClassLoader Adding 'file:/usr/home/hudson/hudson-slave/workspace/Lucene-Solr-Tests-trunk-java7/solr/build/solr-core/test/J0/org.apache.solr.cloud.BasicDistributedZkTest-jetty1-1359698763446/collection1/lib/classes/' to classloader
[junit4:junit4]   2> 4163 T1119 oasc.SolrConfig.<init> Using Lucene MatchVersion: LUCENE_50
[junit4:junit4]   2> 4232 T1119 oasc.SolrConfig.<init> Loaded SolrConfig: solrconfig.xml
[junit4:junit4]   2> 4234 T1119 oass.IndexSchema.readSchema Reading Solr Schema
[junit4:junit4]   2> 4241 T1119 oass.IndexSchema.readSchema Schema name=test
[junit4:junit4]   2> 4856 T1119 oass.OpenExchangeRatesOrgProvider.init Initialized with rates=open-exchange-rates.json, refreshInterval=1440.
[junit4:junit4]   2> 4868 T1119 oass.IndexSchema.readSchema default search field in schema is text
[junit4:junit4]   2> 4872 T1119 oass.IndexSchema.readSchema unique key field: id
[junit4:junit4]   2> 4891 T1119 oass.FileExchangeRateProvider.reload Reloading exchange rates from file currency.xml
[junit4:junit4]   2> 4896 T1119 oass.FileExchangeRateProvider.reload Reloading exchange rates from file currency.xml
[junit4:junit4]   2> 4901 T1119 oass.OpenExchangeRatesOrgProvider.reload Reloading exchange rates from open-exchange-rates.json
[junit4:junit4]   2> 4902 T1119 oass.OpenExchangeRatesOrgProvider.reload Reloading exchange rates from open-exchange-rates.json
[junit4:junit4]   2> 4904 T1119 oasc.SolrCore.<init> [collection1] Opening new SolrCore at /usr/home/hudson/hudson-slave/workspace/Lucene-Solr-Tests-trunk-java7/solr/build/solr-core/test/J0/./org.apache.solr.cloud.BasicDistributedZkTest-jetty1-1359698763446/collection1/, dataDir=./org.apache.solr.cloud.BasicDistributedZkTest-1359698759685/jetty1/
[junit4:junit4]   2> 4904 T1119 oasc.JmxMonitoredMap.<init> JMX monitoring is enabled. Adding Solr mbeans to JMX Server: com.sun.jmx.mbeanserver.JmxMBeanServer@34c3c29
[junit4:junit4]   2> 4905 T1119 oasc.SolrCore.initDirectoryFactory solr.StandardDirectoryFactory
[junit4:junit4]   2> 4906 T1119 oasc.CachingDirectoryFactory.get return new directory for /usr/home/hudson/hudson-slave/workspace/Lucene-Solr-Tests-trunk-java7/solr/build/solr-core/test/J0/./org.apache.solr.cloud.BasicDistributedZkTest-1359698759685/jetty1 forceNew:false
[junit4:junit4]   2> 4906 T1119 oasc.CachingDirectoryFactory.close Releasing directory:/usr/home/hudson/hudson-slave/workspace/Lucene-Solr-Tests-trunk-java7/solr/build/solr-core/test/J0/./org.apache.solr.cloud.BasicDistributedZkTest-1359698759685/jetty1
[junit4:junit4]   2> 4907 T1119 oasc.SolrCore.getNewIndexDir New index directory detected: old=null new=./org.apache.solr.cloud.BasicDistributedZkTest-1359698759685/jetty1/index/
[junit4:junit4]   2> 4907 T1119 oasc.SolrCore.initIndex WARNING [collection1] Solr index directory './org.apache.solr.cloud.BasicDistributedZkTest-1359698759685/jetty1/index' doesn't exist. Creating new index...
[junit4:junit4]   2> 4908 T1119 oasc.CachingDirectoryFactory.get return new directory for /usr/home/hudson/hudson-slave/workspace/Lucene-Solr-Tests-trunk-java7/solr/build/solr-core/test/J0/./org.apache.solr.cloud.BasicDistributedZkTest-1359698759685/jetty1/index forceNew:false
[junit4:junit4]   2> 4913 T1119 oasc.SolrDeletionPolicy.onCommit SolrDeletionPolicy.onCommit: commits:num=1
[junit4:junit4]   2> 		commit{dir=RateLimitedDirectoryWrapper(org.apache.lucene.store.NIOFSDirectory@/usr/home/hudson/hudson-slave/workspace/Lucene-Solr-Tests-trunk-java7/solr/build/solr-core/test/J0/org.apache.solr.cloud.BasicDistributedZkTest-1359698759685/jetty1/index lockFactory=org.apache.lucene.store.NativeFSLockFactory@20bb94f4),segFN=segments_1,generation=1,filenames=[segments_1]
[junit4:junit4]   2> 4914 T1119 oasc.SolrDeletionPolicy.updateCommits newest commit = 1[segments_1]
[junit4:junit4]   2> 4914 T1119 oasc.CachingDirectoryFactory.close Releasing directory:/usr/home/hudson/hudson-slave/workspace/Lucene-Solr-Tests-trunk-java7/solr/build/solr-core/test/J0/./org.apache.solr.cloud.BasicDistributedZkTest-1359698759685/jetty1/index
[junit4:junit4]   2> 4915 T1119 oasc.SolrCore.initWriters created xml: solr.XMLResponseWriter
[junit4:junit4]   2> 4917 T1119 oasup.UpdateRequestProcessorChain.init inserting DistributedUpdateProcessorFactory into updateRequestProcessorChain "dedupe"
[junit4:junit4]   2> 4917 T1119 oasup.UpdateRequestProcessorChain.init inserting DistributedUpdateProcessorFactory into updateRequestProcessorChain "dedupe-allfields"
[junit4:junit4]   2> 4917 T1119 oasup.UpdateRequestProcessorChain.init inserting DistributedUpdateProcessorFactory into updateRequestProcessorChain "stored_sig"
[junit4:junit4]   2> 4918 T1119 oasup.UpdateRequestProcessorChain.init inserting DistributedUpdateProcessorFactory into updateRequestProcessorChain "uniq-fields"
[junit4:junit4]   2> 4918 T1119 oasup.UpdateRequestProcessorChain.init inserting DistributedUpdateProcessorFactory into updateRequestProcessorChain "distrib-dup-test-chain-implicit"
[junit4:junit4]   2> 4919 T1119 oasc.RequestHandlers.initHandlersFromConfig adding lazy requestHandler: solr.ReplicationHandler
[junit4:junit4]   2> 4919 T1119 oasc.RequestHandlers.initHandlersFromConfig created /replication: solr.ReplicationHandler
[junit4:junit4]   2> 4920 T1119 oasc.RequestHandlers.initHandlersFromConfig created standard: solr.StandardRequestHandler
[junit4:junit4]   2> 4920 T1119 oasc.RequestHandlers.initHandlersFromConfig created /get: solr.RealTimeGetHandler
[junit4:junit4]   2> 4921 T1119 oasc.RequestHandlers.initHandlersFromConfig created dismax: solr.SearchHandler
[junit4:junit4]   2> 4921 T1119 oasc.RequestHandlers.initHandlersFromConfig created mock: org.apache.solr.core.MockQuerySenderListenerReqHandler
[junit4:junit4]   2> 4922 T1119 oasc.RequestHandlers.initHandlersFromConfig created /admin/: org.apache.solr.handler.admin.AdminHandlers
[junit4:junit4]   2> 4922 T1119 oasc.RequestHandlers.initHandlersFromConfig created defaults: solr.StandardRequestHandler
[junit4:junit4]   2> 4922 T1119 oasc.RequestHandlers.initHandlersFromConfig adding lazy requestHandler: solr.StandardRequestHandler
[junit4:junit4]   2> 4923 T1119 oasc.RequestHandlers.initHandlersFromConfig created lazy: solr.StandardRequestHandler
[junit4:junit4]   2> 4923 T1119 oasc.RequestHandlers.initHandlersFromConfig created /update: solr.UpdateRequestHandler
[junit4:junit4]   2> 4924 T1119 oasc.RequestHandlers.initHandlersFromConfig created /terms: org.apache.solr.handler.component.SearchHandler
[junit4:junit4]   2> 4924 T1119 oasc.RequestHandlers.initHandlersFromConfig created spellCheckCompRH: org.apache.solr.handler.component.SearchHandler
[junit4:junit4]   2> 4925 T1119 oasc.RequestHandlers.initHandlersFromConfig created spellCheckCompRH_Direct: org.apache.solr.handler.component.SearchHandler
[junit4:junit4]   2> 4925 T1119 oasc.RequestHandlers.initHandlersFromConfig created spellCheckWithWordbreak: org.apache.solr.handler.component.SearchHandler
[junit4:junit4]   2> 4926 T1119 oasc.RequestHandlers.initHandlersFromConfig created spellCheckWithWordbreak_Direct: org.apache.solr.handler.component.SearchHandler
[junit4:junit4]   2> 4926 T1119 oasc.RequestHandlers.initHandlersFromConfig created spellCheckCompRH1: org.apache.solr.handler.component.SearchHandler
[junit4:junit4]   2> 4927 T1119 oasc.RequestHandlers.initHandlersFromConfig created mltrh: org.apache.solr.handler.component.SearchHandler
[junit4:junit4]   2> 4927 T1119 oasc.RequestHandlers.initHandlersFromConfig created tvrh: org.apache.solr.handler.component.SearchHandler
[junit4:junit4]   2> 4928 T1119 oasc.RequestHandlers.initHandlersFromConfig created /mlt: solr.MoreLikeThisHandler
[junit4:junit4]   2> 4928 T1119 oasc.RequestHandlers.initHandlersFromConfig created /debug/dump: solr.DumpRequestHandler
[junit4:junit4]   2> 4940 T1119 oashl.XMLLoader.init xsltCacheLifetimeSeconds=60
[junit4:junit4]   2> 4944 T1119 oasc.SolrCore.initDeprecatedSupport WARNING solrconfig.xml uses deprecated <admin/gettableFiles>, Please update your config to use the ShowFileRequestHandler.
[junit4:junit4]   2> 4946 T1119 oasc.SolrCore.initDeprecatedSupport WARNING adding ShowFileRequestHandler with hidden files: [SCHEMA.XML, OLD_SYNONYMS.TXT, STOPWORDS.TXT, PROTWORDS.TXT, OPEN-EXCHANGE-RATES.JSON, SYNONYMS.TXT, CURRENCY.XML, MAPPING-ISOLATIN1ACCENT.TXT]
[junit4:junit4]   2> 4948 T1119 oasc.CachingDirectoryFactory.close Releasing directory:/usr/home/hudson/hudson-slave/workspace/Lucene-Solr-Tests-trunk-java7/solr/build/solr-core/test/J0/./org.apache.solr.cloud.BasicDistributedZkTest-1359698759685/jetty1
[junit4:junit4]   2> 4950 T1119 oass.SolrIndexSearcher.<init> Opening Searcher@533cd694 main
[junit4:junit4]   2> 4951 T1119 oasu.CommitTracker.<init> Hard AutoCommit: disabled
[junit4:junit4]   2> 4951 T1119 oasu.CommitTracker.<init> Soft AutoCommit: disabled
[junit4:junit4]   2> 4951 T1119 oashc.SpellCheckComponent.inform Initializing spell checkers
[junit4:junit4]   2> 4958 T1119 oass.DirectSolrSpellChecker.init init: {name=direct,classname=DirectSolrSpellChecker,field=lowerfilt,minQueryLength=3}
[junit4:junit4]   2> 5008 T1120 oasc.SolrCore.registerSearcher [collection1] Registered new searcher Searcher@533cd694 main{StandardDirectoryReader(segments_1:1)}
[junit4:junit4]   2> 5013 T1119 oasc.ZkController.publish publishing core=collection1 state=down
[junit4:junit4]   2> 5013 T1119 oasc.ZkController.publish numShards not found on descriptor - reading it from system property
[junit4:junit4]   2> 5178 T1100 oascc.ZkStateReader.updateClusterState Updating cloud state from ZooKeeper... 
[junit4:junit4]   2> 5179 T1100 oasc.Overseer$ClusterStateUpdater.updateState Update state numShards=1 message={
[junit4:junit4]   2> 	  "operation":"state",
[junit4:junit4]   2> 	  "numShards":"1",
[junit4:junit4]   2> 	  "shard":"shard1",
[junit4:junit4]   2> 	  "roles":null,
[junit4:junit4]   2> 	  "state":"active",
[junit4:junit4]   2> 	  "core":"collection1",
[junit4:junit4]   2> 	  "collection":"control_collection",
[junit4:junit4]   2> 	  "node_name":"127.0.0.1:22850_hh%2Fba",
[junit4:junit4]   2> 	  "base_url":"http://127.0.0.1:22850/hh/ba"}
[junit4:junit4]   2> 5185 T1100 oasc.Overseer$ClusterStateUpdater.updateState Update state numShards=2 message={
[junit4:junit4]   2> 	  "operation":"state",
[junit4:junit4]   2> 	  "numShards":"2",
[junit4:junit4]   2> 	  "shard":null,
[junit4:junit4]   2> 	  "roles":null,
[junit4:junit4]   2> 	  "state":"down",
[junit4:junit4]   2> 	  "core":"collection1",
[junit4:junit4]   2> 	  "collection":"collection1",
[junit4:junit4]   2> 	  "node_name":"127.0.0.1:22854_hh%2Fba",
[junit4:junit4]   2> 	  "base_url":"http://127.0.0.1:22854/hh/ba"}
[junit4:junit4]   2> 5185 T1100 oasc.Overseer$ClusterStateUpdater.createCollection Create collection collection1 with numShards 2
[junit4:junit4]   2> 5186 T1100 oasc.Overseer$ClusterStateUpdater.updateState Assigning new node to shard shard=shard1
[junit4:junit4]   2> 5201 T1099 oascc.ZkStateReader$2.process A cluster state change: WatchedEvent state:SyncConnected type:NodeDataChanged path:/clusterstate.json, has occurred - updating... (live nodes size: 2)
[junit4:junit4]   2> 5201 T1105 oascc.ZkStateReader$2.process A cluster state change: WatchedEvent state:SyncConnected type:NodeDataChanged path:/clusterstate.json, has occurred - updating... (live nodes size: 2)
[junit4:junit4]   2> 5201 T1118 oascc.ZkStateReader$2.process A cluster state change: WatchedEvent state:SyncConnected type:NodeDataChanged path:/clusterstate.json, has occurred - updating... (live nodes size: 2)
[junit4:junit4]   2> 6016 T1119 oasc.CoreContainer.registerCore registering core: collection1
[junit4:junit4]   2> 6016 T1119 oasc.ZkController.register Register replica - core:collection1 address:http://127.0.0.1:22854/hh/ba collection:collection1 shard:shard1
[junit4:junit4]   2> 6017 T1119 oascc.SolrZkClient.makePath makePath: /collections/collection1/leader_elect/shard1/election
[junit4:junit4]   2> 6035 T1082 oazs.PrepRequestProcessor.pRequest Got user-level KeeperException when processing sessionid:0x13c945c900b0006 type:delete cxid:0x43 zxid:0x5a txntype:-1 reqpath:n/a Error Path:/solr/collections/collection1/leaders Error:KeeperErrorCode = NoNode for /solr/collections/collection1/leaders
[junit4:junit4]   2> 6043 T1119 oasc.ShardLeaderElectionContext.runLeaderProcess Running the leader process.
[junit4:junit4]   2> 6044 T1082 oazs.PrepRequestProcessor.pRequest Got user-level KeeperException when processing sessionid:0x13c945c900b0006 type:create cxid:0x44 zxid:0x5b txntype:-1 reqpath:n/a Error Path:/solr/overseer Error:KeeperErrorCode = NodeExists for /solr/overseer
[junit4:junit4]   2> 6058 T1119 oasc.ShardLeaderElectionContext.waitForReplicasToComeUp Enough replicas found to continue.
[junit4:junit4]   2> 6058 T1119 oasc.ShardLeaderElectionContext.runLeaderProcess I may be the new leader - try and sync
[junit4:junit4]   2> 6058 T1119 oasc.SyncStrategy.sync Sync replicas to http://127.0.0.1:22854/hh/ba/collection1/
[junit4:junit4]   2> 6059 T1119 oasc.SyncStrategy.syncReplicas Sync Success - now sync replicas to me
[junit4:junit4]   2> 6059 T1119 oasc.SyncStrategy.syncToMe http://127.0.0.1:22854/hh/ba/collection1/ has no replicas
[junit4:junit4]   2> 6059 T1119 oasc.ShardLeaderElectionContext.runLeaderProcess I am the new leader: http://127.0.0.1:22854/hh/ba/collection1/
[junit4:junit4]   2> 6059 T1119 oascc.SolrZkClient.makePath makePath: /collections/collection1/leaders/shard1
[junit4:junit4]   2> 6078 T1082 oazs.PrepRequestProcessor.pRequest Got user-level KeeperException when processing sessionid:0x13c945c900b0006 type:create cxid:0x4e zxid:0x5f txntype:-1 reqpath:n/a Error Path:/solr/overseer Error:KeeperErrorCode = NodeExists for /solr/overseer
[junit4:junit4]   2> 6719 T1100 oascc.ZkStateReader.updateClusterState Updating cloud state from ZooKeeper... 
[junit4:junit4]   2> 6742 T1099 oascc.ZkStateReader$2.process A cluster state change: WatchedEvent state:SyncConnected type:NodeDataChanged path:/clusterstate.json, has occurred - updating... (live nodes size: 2)
[junit4:junit4]   2> 6742 T1105 oascc.ZkStateReader$2.process A cluster state change: WatchedEvent state:SyncConnected type:NodeDataChanged path:/clusterstate.json, has occurred - updating... (live nodes size: 2)
[junit4:junit4]   2> 6742 T1118 oascc.ZkStateReader$2.process A cluster state change: WatchedEvent state:SyncConnected type:NodeDataChanged path:/clusterstate.json, has occurred - updating... (live nodes size: 2)
[junit4:junit4]   2> 6795 T1119 oasc.ZkController.register We are http://127.0.0.1:22854/hh/ba/collection1/ and leader is http://127.0.0.1:22854/hh/ba/collection1/
[junit4:junit4]   2> 6795 T1119 oasc.ZkController.register No LogReplay needed for core=collection1 baseURL=http://127.0.0.1:22854/hh/ba
[junit4:junit4]   2> 6795 T1119 oasc.ZkController.checkRecovery I am the leader, no recovery necessary
[junit4:junit4]   2> 6795 T1119 oasc.ZkController.publish publishing core=collection1 state=active
[junit4:junit4]   2> 6796 T1119 oasc.ZkController.publish numShards not found on descriptor - reading it from system property
[junit4:junit4]   2> 6799 T1119 oascc.ZkStateReader.updateClusterState Updating cloud state from ZooKeeper... 
[junit4:junit4]   2> 6800 T1077 oass.SolrDispatchFilter.init user.dir=/usr/home/hudson/hudson-slave/workspace/Lucene-Solr-Tests-trunk-java7/solr/build/solr-core/test/J0
[junit4:junit4]   2> 6801 T1077 oass.SolrDispatchFilter.init SolrDispatchFilter.init() done
[junit4:junit4]   2> 6801 T1077 oascsi.HttpClientUtil.createClient Creating new http client, config:maxConnections=128&maxConnectionsPerHost=32&followRedirects=false
[junit4:junit4]   2> 6963 T1077 oejs.Server.doStart jetty-8.1.8.v20121106
[junit4:junit4]   2> 6966 T1077 oejs.AbstractConnector.doStart Started SocketConnector@127.0.0.1:22862
[junit4:junit4]   2> 6966 T1077 oass.SolrDispatchFilter.init SolrDispatchFilter.init()
[junit4:junit4]   2> 6967 T1077 oasc.SolrResourceLoader.locateSolrHome JNDI not configured for solr (NoInitialContextEx)
[junit4:junit4]   2> 6967 T1077 oasc.SolrResourceLoader.locateSolrHome using system property solr.solr.home: /usr/home/hudson/hudson-slave/workspace/Lucene-Solr-Tests-trunk-java7/solr/build/solr-core/test/J0/./org.apache.solr.cloud.BasicDistributedZkTest-jetty2-1359698766496
[junit4:junit4]   2> 6967 T1077 oasc.CoreContainer$Initializer.initialize looking for solr.xml: /usr/home/hudson/hudson-slave/workspace/Lucene-Solr-Tests-trunk-java7/solr/build/solr-core/test/J0/./org.apache.solr.cloud.BasicDistributedZkTest-jetty2-1359698766496/solr.xml
[junit4:junit4]   2> 6968 T1077 oasc.CoreContainer.<init> New CoreContainer 532548638
[junit4:junit4]   2> 6968 T1077 oasc.CoreContainer.load Loading CoreContainer using Solr Home: '/usr/home/hudson/hudson-slave/workspace/Lucene-Solr-Tests-trunk-java7/solr/build/solr-core/test/J0/./org.apache.solr.cloud.BasicDistributedZkTest-jetty2-1359698766496/'
[junit4:junit4]   2> 6969 T1077 oasc.SolrResourceLoader.<init> new SolrResourceLoader for directory: '/usr/home/hudson/hudson-slave/workspace/Lucene-Solr-Tests-trunk-java7/solr/build/solr-core/test/J0/./org.apache.solr.cloud.BasicDistributedZkTest-jetty2-1359698766496/'
[junit4:junit4]   2> 7006 T1077 oashc.HttpShardHandlerFactory.getParameter Setting socketTimeout to: 60000
[junit4:junit4]   2> 7007 T1077 oashc.HttpShardHandlerFactory.getParameter Setting urlScheme to: http://
[junit4:junit4]   2> 7007 T1077 oashc.HttpShardHandlerFactory.getParameter Setting connTimeout to: 15000
[junit4:junit4]   2> 7008 T1077 oashc.HttpShardHandlerFactory.getParameter Setting maxConnectionsPerHost to: 20
[junit4:junit4]   2> 7008 T1077 oashc.HttpShardHandlerFactory.getParameter Setting corePoolSize to: 0
[junit4:junit4]   2> 7008 T1077 oashc.HttpShardHandlerFactory.getParameter Setting maximumPoolSize to: 2147483647
[junit4:junit4]   2> 7009 T1077 oashc.HttpShardHandlerFactory.getParameter Setting maxThreadIdleTime to: 5
[junit4:junit4]   2> 7009 T1077 oashc.HttpShardHandlerFactory.getParameter Setting sizeOfQueue to: -1
[junit4:junit4]   2> 7009 T1077 oashc.HttpShardHandlerFactory.getParameter Setting fairnessPolicy to: false
[junit4:junit4]   2> 7009 T1077 oascsi.HttpClientUtil.createClient Creating new http client, config:maxConnectionsPerHost=20&maxConnections=10000&socketTimeout=60000&connTimeout=15000&retry=false
[junit4:junit4]   2> 7024 T1077 oasc.CoreContainer.load Registering Log Listener
[junit4:junit4]   2> 7038 T1077 oasc.CoreContainer.initZooKeeper Zookeeper client=127.0.0.1:22847/solr
[junit4:junit4]   2> 7039 T1077 oasc.ZkController.checkChrootPath zkHost includes chroot
[junit4:junit4]   2> 7039 T1077 oaz.ZooKeeper.<init> Initiating client connection, connectString=127.0.0.1:22847 sessionTimeout=60000 watcher=org.apache.solr.common.cloud.ConnectionManager@4a78fa48
[junit4:junit4]   2> 7040 T1077 oascc.ConnectionManager.waitForConnected Waiting for client to connect to ZooKeeper
[junit4:junit4]   2> 7040 T1130 oaz.ClientCnxn$SendThread.logStartConnect Opening socket connection to server localhost/127.0.0.1:22847. Will not attempt to authenticate using SASL (access denied ("javax.security.auth.AuthPermission" "getLoginConfiguration"))
[junit4:junit4]   2> 7041 T1130 oaz.ClientCnxn$SendThread.primeConnection Socket connection established to localhost/127.0.0.1:22847, initiating session
[junit4:junit4]   2> 7041 T1079 oazs.NIOServerCnxnFactory.run Accepted socket connection from /140.211.11.196:22863
[junit4:junit4]   2> 7042 T1079 oazs.ZooKeeperServer.processConnectRequest Client attempting to establish new session at /140.211.11.196:22863
[junit4:junit4]   2> 7044 T1081 oazs.ZooKeeperServer.finishSessionInit Established session 0x13c945c900b0007 with negotiated timeout 20000 for client /140.211.11.196:22863
[junit4:junit4]   2> 7044 T1130 oaz.ClientCnxn$SendThread.onConnected Session establishment complete on server localhost/127.0.0.1:22847, sessionid = 0x13c945c900b0007, negotiated timeout = 20000
[junit4:junit4]   2> 7044 T1131 oascc.ConnectionManager.process Watcher org.apache.solr.common.cloud.ConnectionManager@4a78fa48 name:ZooKeeperConnection Watcher:127.0.0.1:22847 got event WatchedEvent state:SyncConnected type:None path:null path:null type:None
[junit4:junit4]   2> 7044 T1077 oascc.ConnectionManager.waitForConnected Client is connected to ZooKeeper
[junit4:junit4]   2> 7046 T1082 oazs.PrepRequestProcessor.pRequest2Txn Processed session termination for sessionid: 0x13c945c900b0007
[junit4:junit4]   2> 7055 T1131 oaz.ClientCnxn$EventThread.run EventThread shut down
[junit4:junit4]   2> 7055 T1079 oazs.NIOServerCnxn.closeSock Closed socket connection for client /140.211.11.196:22863 which had sessionid 0x13c945c900b0007
[junit4:junit4]   2> 7055 T1077 oaz.ZooKeeper.close Session: 0x13c945c900b0007 closed
[junit4:junit4]   2> 7056 T1077 oascsi.HttpClientUtil.createClient Creating new http client, config:maxConnections=500&maxConnectionsPerHost=16&socketTimeout=60000&connTimeout=15000
[junit4:junit4]   2> 7064 T1077 oaz.ZooKeeper.<init> Initiating client connection, connectString=127.0.0.1:22847/solr sessionTimeout=30000 watcher=org.apache.solr.common.cloud.ConnectionManager@907aad0
[junit4:junit4]   2> 7065 T1077 oascc.ConnectionManager.waitForConnected Waiting for client to connect to ZooKeeper
[junit4:junit4]   2> 7065 T1132 oaz.ClientCnxn$SendThread.logStartConnect Opening socket connection to server localhost/127.0.0.1:22847. Will not attempt to authenticate using SASL (access denied ("javax.security.auth.AuthPermission" "getLoginConfiguration"))
[junit4:junit4]   2> 7066 T1132 oaz.ClientCnxn$SendThread.primeConnection Socket connection established to localhost/127.0.0.1:22847, initiating session
[junit4:junit4]   2> 7066 T1079 oazs.NIOServerCnxnFactory.run Accepted socket connection from /140.211.11.196:22864
[junit4:junit4]   2> 7066 T1079 oazs.ZooKeeperServer.processConnectRequest Client attempting to establish new session at /140.211.11.196:22864
[junit4:junit4]   2> 7072 T1081 oazs.ZooKeeperServer.finishSessionInit Established session 0x13c945c900b0008 with negotiated timeout 20000 for client /140.211.11.196:22864
[junit4:junit4]   2> 7072 T1132 oaz.ClientCnxn$SendThread.onConnected Session establishment complete on server localhost/127.0.0.1:22847, sessionid = 0x13c945c900b0008, negotiated timeout = 20000
[junit4:junit4]   2> 7072 T1133 oascc.ConnectionManager.process Watcher org.apache.solr.common.cloud.ConnectionManager@907aad0 name:ZooKeeperConnection Watcher:127.0.0.1:22847/solr got event WatchedEvent state:SyncConnected type:None path:null path:null type:None
[junit4:junit4]   2> 7072 T1077 oascc.ConnectionManager.waitForConnected Client is connected to ZooKeeper
[junit4:junit4]   2> 7073 T1082 oazs.PrepRequestProcessor.pRequest Got user-level KeeperException when processing sessionid:0x13c945c900b0008 type:create cxid:0x1 zxid:0x6c txntype:-1 reqpath:n/a Error Path:/solr/overseer Error:KeeperErrorCode = NodeExists for /solr/overseer
[junit4:junit4]   2> 7075 T1082 oazs.PrepRequestProcessor.pRequest Got user-level KeeperException when processing sessionid:0x13c945c900b0008 type:create cxid:0x2 zxid:0x6d txntype:-1 reqpath:n/a Error Path:/solr/overseer Error:KeeperErrorCode = NodeExists for /solr/overseer
[junit4:junit4]   2> 7084 T1077 oasc.ZkController.createEphemeralLiveNode Register node as live in ZooKeeper:/live_nodes/127.0.0.1:22862_hh%2Fba
[junit4:junit4]   2> 7085 T1082 oazs.PrepRequestProcessor.pRequest Got user-level KeeperException when processing sessionid:0x13c945c900b0008 type:delete cxid:0x4 zxid:0x6e txntype:-1 reqpath:n/a Error Path:/solr/live_nodes/127.0.0.1:22862_hh%2Fba Error:KeeperErrorCode = NoNode for /solr/live_nodes/127.0.0.1:22862_hh%2Fba
[junit4:junit4]   2> 7091 T1077 oascc.SolrZkClient.makePath makePath: /live_nodes/127.0.0.1:22862_hh%2Fba
[junit4:junit4]   2> 7094 T1105 oascc.ZkStateReader$2.process A cluster state change: WatchedEvent state:SyncConnected type:NodeChildrenChanged path:/live_nodes, has occurred - updating... (live nodes size: 2)
[junit4:junit4]   2> 7095 T1099 oascc.ZkStateReader$2.process A cluster state change: WatchedEvent state:SyncConnected type:NodeChildrenChanged path:/live_nodes, has occurred - updating... (live nodes size: 2)
[junit4:junit4]   2> 7095 T1118 oascc.ZkStateReader$3.process Updating live nodes... (3)
[junit4:junit4]   2> 7095 T1118 oascc.ZkStateReader$2.process A cluster state change: WatchedEvent state:SyncConnected type:NodeChildrenChanged path:/live_nodes, has occurred - updating... (live nodes size: 3)
[junit4:junit4]   2> 7097 T1105 oascc.ZkStateReader$3.process Updating live nodes... (3)
[junit4:junit4]   2> 7105 T1099 oascc.ZkStateReader$3.process Updating live nodes... (3)
[junit4:junit4]   2> 7106 T1077 oascc.ZkStateReader.createClusterStateWatchersAndUpdate Updating cluster state from ZooKeeper... 
[junit4:junit4]   2> 7112 T1134 oasc.CoreContainer.create Creating SolrCore 'collection1' using instanceDir: /usr/home/hudson/hudson-slave/workspace/Lucene-Solr-Tests-trunk-java7/solr/build/solr-core/test/J0/./org.apache.solr.cloud.BasicDistributedZkTest-jetty2-1359698766496/collection1
[junit4:junit4]   2> 7112 T1134 oasc.ZkController.createCollectionZkNode Check for collection zkNode:collection1
[junit4:junit4]   2> 7113 T1134 oasc.ZkController.createCollectionZkNode Collection zkNode exists
[junit4:junit4]   2> 7113 T1134 oasc.ZkController.readConfigName Load collection config from:/collections/collection1
[junit4:junit4]   2> 7115 T1134 oasc.SolrResourceLoader.<init> new SolrResourceLoader for directory: '/usr/home/hudson/hudson-slave/workspace/Lucene-Solr-Tests-trunk-java7/solr/build/solr-core/test/J0/./org.apache.solr.cloud.BasicDistributedZkTest-jetty2-1359698766496/collection1/'
[junit4:junit4]   2> 7116 T1134 oasc.SolrResourceLoader.replaceClassLoader Adding 'file:/usr/home/hudson/hudson-slave/workspace/Lucene-Solr-Tests-trunk-java7/solr/build/solr-core/test/J0/org.apache.solr.cloud.BasicDistributedZkTest-jetty2-1359698766496/collection1/lib/README' to classloader
[junit4:junit4]   2> 7117 T1134 oasc.SolrResourceLoader.replaceClassLoader Adding 'file:/usr/home/hudson/hudson-slave/workspace/Lucene-Solr-Tests-trunk-java7/solr/build/solr-core/test/J0/org.apache.solr.cloud.BasicDistributedZkTest-jetty2-1359698766496/collection1/lib/classes/' to classloader
[junit4:junit4]   2> 7173 T1134 oasc.SolrConfig.<init> Using Lucene MatchVersion: LUCENE_50
[junit4:junit4]   2> 7242 T1134 oasc.SolrConfig.<init> Loaded SolrConfig: solrconfig.xml
[junit4:junit4]   2> 7243 T1134 oass.IndexSchema.readSchema Reading Solr Schema
[junit4:junit4]   2> 7251 T1134 oass.IndexSchema.readSchema Schema name=test
[junit4:junit4]   2> 7868 T1134 oass.OpenExchangeRatesOrgProvider.init Initialized with rates=open-exchange-rates.json, refreshInterval=1440.
[junit4:junit4]   2> 7880 T1134 oass.IndexSchema.readSchema default search field in schema is text
[junit4:junit4]   2> 7884 T1134 oass.IndexSchema.readSchema unique key field: id
[junit4:junit4]   2> 7902 T1134 oass.FileExchangeRateProvider.reload Reloading exchange rates from file currency.xml
[junit4:junit4]   2> 7907 T1134 oass.FileExchangeRateProvider.reload Reloading exchange rates from file currency.xml
[junit4:junit4]   2> 7912 T1134 oass.OpenExchangeRatesOrgProvider.reload Reloading exchange rates from open-exchange-rates.json
[junit4:junit4]   2> 7913 T1134 oass.OpenExchangeRatesOrgProvider.reload Reloading exchange rates from open-exchange-rates.json
[junit4:junit4]   2> 7915 T1134 oasc.SolrCore.<init> [collection1] Opening new SolrCore at /usr/home/hudson/hudson-slave/workspace/Lucene-Solr-Tests-trunk-java7/solr/build/solr-core/test/J0/./org.apache.solr.cloud.BasicDistributedZkTest-jetty2-1359698766496/collection1/, dataDir=./org.apache.solr.cloud.BasicDistributedZkTest-1359698759685/jetty2/
[junit4:junit4]   2> 7915 T1134 oasc.JmxMonitoredMap.<init> JMX monitoring is enabled. Adding Solr mbeans to JMX Server: com.sun.jmx.mbeanserver.JmxMBeanServer@34c3c29
[junit4:junit4]   2> 7915 T1134 oasc.SolrCore.initDirectoryFactory solr.StandardDirectoryFactory
[junit4:junit4]   2> 7916 T1134 oasc.CachingDirectoryFactory.get return new directory for /usr/home/hudson/hudson-slave/workspace/Lucene-Solr-Tests-trunk-java7/solr/build/solr-core/test/J0/./org.apache.solr.cloud.BasicDistributedZkTest-1359698759685/jetty2 forceNew:false
[junit4:junit4]   2> 7917 T1134 oasc.CachingDirectoryFactory.close Releasing directory:/usr/home/hudson/hudson-slave/workspace/Lucene-Solr-Tests-trunk-java7/solr/build/solr-core/test/J0/./org.apache.solr.cloud.BasicDistributedZkTest-1359698759685/jetty2
[junit4:junit4]   2> 7917 T1134 oasc.SolrCore.getNewIndexDir New index directory detected: old=null new=./org.apache.solr.cloud.BasicDistributedZkTest-1359698759685/jetty2/index/
[junit4:junit4]   2> 7917 T1134 oasc.SolrCore.initIndex WARNING [collection1] Solr index directory './org.apache.solr.cloud.BasicDistributedZkTest-1359698759685/jetty2/index' doesn't exist. Creating new index...
[junit4:junit4]   2> 7918 T1134 oasc.CachingDirectoryFactory.get return new directory for /usr/home/hudson/hudson-slave/workspace/Lucene-Solr-Tests-trunk-java7/solr/build/solr-core/test/J0/./org.apache.solr.cloud.BasicDistributedZkTest-1359698759685/jetty2/index forceNew:false
[junit4:junit4]   2> 7923 T1134 oasc.SolrDeletionPolicy.onCommit SolrDeletionPolicy.onCommit: commits:num=1
[junit4:junit4]   2> 		commit{dir=RateLimitedDirectoryWrapper(org.apache.lucene.store.NIOFSDirectory@/usr/home/hudson/hudson-slave/workspace/Lucene-Solr-Tests-trunk-java7/solr/build/solr-core/test/J0/org.apache.solr.cloud.BasicDistributedZkTest-1359698759685/jetty2/index lockFactory=org.apache.lucene.store.NativeFSLockFactory@66e0f67),segFN=segments_1,generation=1,filenames=[segments_1]
[junit4:junit4]   2> 7923 T1134 oasc.SolrDeletionPolicy.updateCommits newest commit = 1[segments_1]
[junit4:junit4]   2> 7924 T1134 oasc.CachingDirectoryFactory.close Releasing directory:/usr/home/hudson/hudson-slave/workspace/Lucene-Solr-Tests-trunk-java7/solr/build/solr-core/test/J0/./org.apache.solr.cloud.BasicDistributedZkTest-1359698759685/jetty2/index
[junit4:junit4]   2> 7924 T1134 oasc.SolrCore.initWriters created xml: solr.XMLResponseWriter
[junit4:junit4]   2> 7926 T1134 oasup.UpdateRequestProcessorChain.init inserting DistributedUpdateProcessorFactory into updateRequestProcessorChain "dedupe"
[junit4:junit4]   2> 7927 T1134 oasup.UpdateRequestProcessorChain.init inserting DistributedUpdateProcessorFactory into updateRequestProcessorChain "dedupe-allfields"
[junit4:junit4]   2> 7927 T1134 oasup.UpdateRequestProcessorChain.init inserting DistributedUpdateProcessorFactory into updateRequestProcessorChain "stored_sig"
[junit4:junit4]   2> 7927 T1134 oasup.UpdateRequestProcessorChain.init inserting DistributedUpdateProcessorFactory into updateRequestProcessorChain "uniq-fields"
[junit4:junit4]   2> 7928 T1134 oasup.UpdateRequestProcessorChain.init inserting DistributedUpdateProcessorFactory into updateRequestProcessorChain "distrib-dup-test-chain-implicit"
[junit4:junit4]   2> 7928 T1134 oasc.RequestHandlers.initHandlersFromConfig adding lazy requestHandler: solr.ReplicationHandler
[junit4:junit4]   2> 7929 T1134 oasc.RequestHandlers.initHandlersFromConfig created /replication: solr.ReplicationHandler
[junit4:junit4]   2> 7929 T1134 oasc.RequestHandlers.initHandlersFromConfig created standard: solr.StandardRequestHandler
[junit4:junit4]   2> 7930 T1134 oasc.RequestHandlers.initHandlersFromConfig created /get: solr.RealTimeGetHandler
[junit4:junit4]   2> 7930 T1134 oasc.RequestHandlers.initHandlersFromConfig created dismax: solr.SearchHandler
[junit4:junit4]   2> 7931 T1134 oasc.RequestHandlers.initHandlersFromConfig created mock: org.apache.solr.core.MockQuerySenderListenerReqHandler
[junit4:junit4]   2> 7931 T1134 oasc.RequestHandlers.initHandlersFromConfig created /admin/: org.apache.solr.handler.admin.AdminHandlers
[junit4:junit4]   2> 7932 T1134 oasc.RequestHandlers.initHandlersFromConfig created defaults: solr.StandardRequestHandler
[junit4:junit4]   2> 7932 T1134 oasc.RequestHandlers.initHandlersFromConfig adding lazy requestHandler: solr.StandardRequestHandler
[junit4:junit4]   2> 7932 T1134 oasc.RequestHandlers.initHandlersFromConfig created lazy: solr.StandardRequestHandler
[junit4:junit4]   2> 7933 T1134 oasc.RequestHandlers.initHandlersFromConfig created /update: solr.UpdateRequestHandler
[junit4:junit4]   2> 7933 T1134 oasc.RequestHandlers.initHandlersFromConfig created /terms: org.apache.solr.handler.component.SearchHandler
[junit4:junit4]   2> 7934 T1134 oasc.RequestHandlers.initHandlersFromConfig created spellCheckCompRH: org.apache.solr.handler.component.SearchHandler
[junit4:junit4]   2> 7934 T1134 oasc.RequestHandlers.initHandlersFromConfig created spellCheckCompRH_Direct: org.apache.solr.handler.component.SearchHandler
[junit4:junit4]   2> 7935 T1134 oasc.RequestHandlers.initHandlersFromConfig created spellCheckWithWordbreak: org.apache.solr.handler.component.SearchHandler
[junit4:junit4]   2> 7935 T1134 oasc.RequestHandlers.initHandlersFromConfig created spellCheckWithWordbreak_Direct: org.apache.solr.handler.component.SearchHandler
[junit4:junit4]   2> 7936 T1134 oasc.RequestHandlers.initHandlersFromConfig created spellCheckCompRH1: org.apache.solr.handler.component.SearchHandler
[junit4:junit4]   2> 7936 T1134 oasc.RequestHandlers.initHandlersFromConfig created mltrh: org.apache.solr.handler.component.SearchHandler
[junit4:junit4]   2> 7937 T1134 oasc.RequestHandlers.initHandlersFromConfig created tvrh: org.apache.solr.handler.component.SearchHandler
[junit4:junit4]   2> 7937 T1134 oasc.RequestHandlers.initHandlersFromConfig created /mlt: solr.MoreLikeThisHandler
[junit4:junit4]   2> 7938 T1134 oasc.RequestHandlers.initHandlersFromConfig created /debug/dump: solr.DumpRequestHandler
[junit4:junit4]   2> 7949 T1134 oashl.XMLLoader.init xsltCacheLifetimeSeconds=60
[junit4:junit4]   2> 7954 T1134 oasc.SolrCore.initDeprecatedSupport WARNING solrconfig.xml uses deprecated <admin/gettableFiles>, Please update your config to use the ShowFileRequestHandler.
[junit4:junit4]   2> 7955 T1134 oasc.SolrCore.initDeprecatedSupport WARNING adding ShowFileRequestHandler with hidden files: [SCHEMA.XML, OLD_SYNONYMS.TXT, STOPWORDS.TXT, PROTWORDS.TXT, OPEN-EXCHANGE-RATES.JSON, SYNONYMS.TXT, CURRENCY.XML, MAPPING-ISOLATIN1ACCENT.TXT]
[junit4:junit4]   2> 7957 T1134 oasc.CachingDirectoryFactory.close Releasing directory:/usr/home/hudson/hudson-slave/workspace/Lucene-Solr-Tests-trunk-java7/solr/build/solr-core/test/J0/./org.apache.solr.cloud.BasicDistributedZkTest-1359698759685/jetty2
[junit4:junit4]   2> 7959 T1134 oass.SolrIndexSearcher.<init> Opening Searcher@6d9db843 main
[junit4:junit4]   2> 7960 T1134 oasu.CommitTracker.<init> Hard AutoCommit: disabled
[junit4:junit4]   2> 7960 T1134 oasu.CommitTracker.<init> Soft AutoCommit: disabled
[junit4:junit4]   2> 7960 T1134 oashc.SpellCheckComponent.inform Initializing spell checkers
[junit4:junit4]   2> 7967 T1134 oass.DirectSolrSpellChecker.init init: {name=direct,classname=DirectSolrSpellChecker,field=lowerfilt,minQueryLength=3}
[junit4:junit4]   2> 8023 T1135 oasc.SolrCore.registerSearcher [collection1] Registered new searcher Searcher@6d9db843 main{StandardDirectoryReader(segments_1:1)}
[junit4:junit4]   2> 8029 T1134 oasc.ZkController.publish publishing core=collection1 state=down
[junit4:junit4]   2> 8029 T1134 oasc.ZkController.publish numShards not found on descriptor - reading it from system property
[junit4:junit4]   2> 8255 T1100 oascc.ZkStateReader.updateClusterState Updating cloud state from ZooKeeper... 
[junit4:junit4]   2> 8256 T1100 oasc.Overseer$ClusterStateUpdater.updateState Update state numShards=2 message={
[junit4:junit4]   2> 	  "operation":"state",
[junit4:junit4]   2> 	  "numShards":"2",
[junit4:junit4]   2> 	  "shard":"shard1",
[junit4:junit4]   2> 	  "roles":null,
[junit4:junit4]   2> 	  "state":"active",
[junit4:junit4]   2> 	  "core":"collection1",
[junit4:junit4]   2> 	  "collection":"collection1",
[junit4:junit4]   2> 	  "node_name":"127.0.0.1:22854_hh%2Fba",
[junit4:junit4]   2> 	  "base_url":"http://127.0.0.1:22854/hh/ba"}
[junit4:junit4]   2> 8261 T1100 oasc.Overseer$ClusterStateUpdater.updateState Update state numShards=2 message={
[junit4:junit4]   2> 	  "operation":"state",
[junit4:junit4]   2> 	  "numShards":"2",
[junit4:junit4]   2> 	  "shard":null,
[junit4:junit4]   2> 	  "roles":null,
[junit4:junit4]   2> 	  "state":"down",
[junit4:junit4]   2> 	  "core":"collection1",
[junit4:junit4]   2> 	  "collection":"collection1",
[junit4:junit4]   2> 	  "node_name":"127.0.0.1:22862_hh%2Fba",
[junit4:junit4]   2> 	  "base_url":"http://127.0.0.1:22862/hh/ba"}
[junit4:junit4]   2> 8261 T1100 oasc.Overseer$ClusterStateUpdater.updateState Collection already exists with numShards=2
[junit4:junit4]   2> 8261 T1100 oasc.Overseer$ClusterStateUpdater.updateState Assigning new node to shard shard=shard2
[junit4:junit4]   2> 8272 T1099 oascc.ZkStateReader$2.process A cluster state change: WatchedEvent state:SyncConnected type:NodeDataChanged path:/clusterstate.json, has occurred - updating... (live nodes size: 3)
[junit4:junit4]   2> 8272 T1105 oascc.ZkStateReader$2.process A cluster state change: WatchedEvent state:SyncConnected type:NodeDataChanged path:/clusterstate.json, has occurred - updating... (live nodes size: 3)
[junit4:junit4]   2> 8272 T1118 oascc.ZkStateReader$2.process A cluster state change: WatchedEvent state:SyncConnected type:NodeDataChanged path:/clusterstate.json, has occurred - updating... (live nodes size: 3)
[junit4:junit4]   2> 8272 T1133 oascc.ZkStateReader$2.process A cluster state change: WatchedEvent state:SyncConnected type:NodeDataChanged path:/clusterstate.json, has occurred - updating... (live nodes size: 3)
[junit4:junit4]   2> 9031 T1134 oasc.CoreContainer.registerCore registering core: collection1
[junit4:junit4]   2> 9031 T1134 oasc.ZkController.register Register replica - core:collection1 address:http://127.0.0.1:22862/hh/ba collection:collection1 shard:shard2
[junit4:junit4]   2> 9032 T1134 oascc.SolrZkClient.makePath makePath: /collections/collection1/leader_elect/shard2/election
[junit4:junit4]   2> 9050 T1082 oazs.PrepRequestProcessor.pRequest Got user-level KeeperException when processing sessionid:0x13c945c900b0008 type:delete cxid:0x42 zxid:0x7c txntype:-1 reqpath:n/a Error Path:/solr/collections/collection1/leaders/shard2 Error:KeeperErrorCode = NoNode for /solr/collections/collection1/leaders/shard2
[junit4:junit4]   2> 9051 T1134 oasc.ShardLeaderElectionContext.runLeaderProcess Running the leader process.
[junit4:junit4]   2> 9052 T1082 oazs.PrepRequestProcessor.pRequest Got user-level KeeperException when processing sessionid:0x13c945c900b0008 type:create cxid:0x43 zxid:0x7d txntype:-1 reqpath:n/a Error Path:/solr/overseer Error:KeeperErrorCode = NodeExists for /solr/overseer
[junit4:junit4]   2> 9054 T1134 oasc.ShardLeaderElectionContext.waitForReplicasToComeUp Enough replicas found to continue.
[junit4:junit4]   2> 9054 T1134 oasc.ShardLeaderElectionContext.runLeaderProcess I may be the new leader - try and sync
[junit4:junit4]   2> 9054 T1134 oasc.SyncStrategy.sync Sync replicas to http://127.0.0.1:22862/hh/ba/collection1/
[junit4:junit4]   2> 9055 T1134 oasc.SyncStrategy.syncReplicas Sync Success - now sync replicas to me
[junit4:junit4]   2> 9055 T1134 oasc.SyncStrategy.syncToMe http://127.0.0.1:22862/hh/ba/collection1/ has no replicas
[junit4:junit4]   2> 9055 T1134 oasc.ShardLeaderElectionContext.runLeaderProcess I am the new leader: http://127.0.0.1:22862/hh/ba/collection1/
[junit4:junit4]   2> 9055 T1134 oascc.SolrZkClient.makePath makePath: /collections/collection1/leaders/shard2
[junit4:junit4]   2> 9059 T1082 oazs.PrepRequestProcessor.pRequest Got user-level KeeperException when processing sessionid:0x13c945c900b0008 type:create cxid:0x4c zxid:0x80 txntype:-1 reqpath:n/a Error Path:/solr/overseer Error:KeeperErrorCode = NodeExists for /solr/overseer
[junit4:junit4]   2> 9787 T1100 oascc.ZkStateReader.updateClusterState Updating cloud state from ZooKeeper... 
[junit4:junit4]   2> 9805 T1099 oascc.ZkStateReader$2.process A cluster state change: WatchedEvent state:SyncConnected type:NodeDataChanged path:/clusterstate.json, has occurred - updating... (live nodes size: 3)
[junit4:junit4]   2> 9805 T1133 oascc.ZkStateReader$2.process A cluster state change: WatchedEvent state:SyncConnected type:NodeDataChanged path:/clusterstate.json, has occurred - updating... (live nodes size: 3)
[junit4:junit4]   2> 9805 T1118 oascc.ZkStateReader$2.process A cluster state change: WatchedEvent state:SyncConnected type:NodeDataChanged path:/clusterstate.json, has occurred - updating... (live nodes size: 3)
[junit4:junit4]   2> 9805 T1105 oascc.ZkStateReader$2.process A cluster state change: WatchedEvent state:SyncConnected type:NodeDataChanged path:/clusterstate.json, has occurred - updating... (live nodes size: 3)
[junit4:junit4]   2> 9827 T1134 oasc.ZkController.register We are http://127.0.0.1:22862/hh/ba/collection1/ and leader is http://127.0.0.1:22862/hh/ba/collection1/
[junit4:junit4]   2> 9827 T1134 oasc.ZkController.register No LogReplay needed for core=collection1 baseURL=http://127.0.0.1:22862/hh/ba
[junit4:junit4]   2> 9827 T1134 oasc.ZkController.checkRecovery I am the leader, no recovery necessary
[junit4:junit4]   2> 9827 T1134 oasc.ZkController.publish publishing core=collection1 state=active
[junit4:junit4]   2> 9828 T1134 oasc.ZkController.publish numShards not found on descriptor - reading it from system property
[junit4:junit4]   2> 9830 T1134 oascc.ZkStateReader.updateClusterState Updating cloud state from ZooKeeper... 
[junit4:junit4]   2> 9831 T1077 oass.SolrDispatchFilter.init user.dir=/usr/home/hudson/hudson-slave/workspace/Lucene-Solr-Tests-trunk-java7/solr/build/solr-core/test/J0
[junit4:junit4]   2> 9831 T1077 oass.SolrDispatchFilter.init SolrDispatchFilter.init() done
[junit4:junit4]   2> 9832 T1077 oascsi.HttpClientUtil.createClient Creating new http client, config:maxConnections=128&maxConnectionsPerHost=32&followRedirects=false
[junit4:junit4]   2> 10021 T1077 oejs.Server.doStart jetty-8.1.8.v20121106
[junit4:junit4]   2> 10025 T1077 oejs.AbstractConnector.doStart Started SocketConnector@127.0.0.1:22867
[junit4:junit4]   2> 10025 T1077 oass.SolrDispatchFilter.init SolrDispatchFilter.init()
[junit4:junit4]   2> 10026 T1077 oasc.SolrResourceLoader.locateSolrHome JNDI not configured for solr (NoInitialContextEx)
[junit4:junit4]   2> 10026 T1077 oasc.SolrResourceLoader.locateSolrHome using system property solr.solr.home: /usr/home/hudson/hudson-slave/workspace/Lucene-Solr-Tests-trunk-java7/solr/build/solr-core/test/J0/./org.apache.solr.cloud.BasicDistributedZkTest-jetty3-1359698769526
[junit4:junit4]   2> 10027 T1077 oasc.CoreContainer$Initializer.initialize looking for solr.xml: /usr/home/hudson/hudson-slave/workspace/Lucene-Solr-Tests-trunk-java7/solr/build/solr-core/test/J0/./org.apache.solr.cloud.BasicDistributedZkTest-jetty3-1359698769526/solr.xml
[junit4:junit4]   2> 10027 T1077 oasc.CoreContainer.<init> New CoreContainer 474455243
[junit4:junit4]   2> 10028 T1077 oasc.CoreContainer.load Loading CoreContainer using Solr Home: '/usr/home/hudson/hudson-slave/workspace/Lucene-Solr-Tests-trunk-java7/solr/build/solr-core/test/J0/./org.apache.solr.cloud.BasicDistributedZkTest-jetty3-1359698769526/'
[junit4:junit4]   2> 10029 T1077 oasc.SolrResourceLoader.<init> new SolrResourceLoader for directory: '/usr/home/hudson/hudson-slave/workspace/Lucene-Solr-Tests-trunk-java7/solr/build/solr-core/test/J0/./org.apache.solr.cloud.BasicDistributedZkTest-jetty3-1359698769526/'
[junit4:junit4]   2> 10086 T1077 oashc.HttpShardHandlerFactory.getParameter Setting socketTimeout to: 60000
[junit4:junit4]   2> 10087 T1077 oashc.HttpShardHandlerFactory.getParameter Setting urlScheme to: http://
[junit4:junit4]   2> 10087 T1077 oashc.HttpShardHandlerFactory.getParameter Setting connTimeout to: 15000
[junit4:junit4]   2> 10087 T1077 oashc.HttpShardHandlerFactory.getParameter Setting maxConnectionsPerHost to: 20
[junit4:junit4]   2> 10088 T1077 oashc.HttpShardHandlerFactory.getParameter Setting corePoolSize to: 0
[junit4:junit4]   2> 10088 T1077 oashc.HttpShardHandlerFactory.getParameter Setting maximumPoolSize to: 2147483647
[junit4:junit4]   2> 10089 T1077 oashc.HttpShardHandlerFactory.getParameter Setting maxThreadIdleTime to: 5
[junit4:junit4]   2> 10089 T1077 oashc.HttpShardHandlerFactory.getParameter Setting sizeOfQueue to: -1
[junit4:junit4]   2> 10090 T1077 oashc.HttpShardHandlerFactory.getParameter Setting fairnessPolicy to: false
[junit4:junit4]   2> 10090 T1077 oascsi.HttpClientUtil.createClient Creating new http client, config:maxConnectionsPerHost=20&maxConnections=10000&socketTimeout=60000&connTimeout=15000&retry=false
[junit4:junit4]   2> 10112 T1077 oasc.CoreContainer.load Registering Log Listener
[junit4:junit4]   2> 10131 T1077 oasc.CoreContainer.initZooKeeper Zookeeper client=127.0.0.1:22847/solr
[junit4:junit4]   2> 10132 T1077 oasc.ZkController.checkChrootPath zkHost includes chroot
[junit4:junit4]   2> 10133 T1077 oaz.ZooKeeper.<init> Initiating client connection, connectString=127.0.0.1:22847 sessionTimeout=60000 watcher=org.apache.solr.common.cloud.ConnectionManager@679cafd7
[junit4:junit4]   2> 10134 T1077 oascc.ConnectionManager.waitForConnected Waiting for client to connect to ZooKeeper
[junit4:junit4]   2> 10134 T1145 oaz.ClientCnxn$SendThread.logStartConnect Opening socket connection to server localhost/127.0.0.1:22847. Will not attempt to authenticate using SASL (access denied ("javax.security.auth.AuthPermission" "getLoginConfiguration"))
[junit4:junit4]   2> 10135 T1145 oaz.ClientCnxn$SendThread.primeConnection Socket connection established to localhost/127.0.0.1:22847, initiating session
[junit4:junit4]   2> 10135 T1079 oazs.NIOServerCnxnFactory.run Accepted socket connection from /140.211.11.196:22868
[junit4:junit4]   2> 10136 T1079 oazs.ZooKeeperServer.processConnectRequest Client attempting to establish new session at /140.211.11.196:22868
[junit4:junit4]   2> 10138 T1081 oazs.ZooKeeperServer.finishSessionInit Established session 0x13c945c900b0009 with negotiated timeout 20000 for client /140.211.11.196:22868
[junit4:junit4]   2> 10138 T1145 oaz.ClientCnxn$SendThread.onConnected Session establishment complete on server localhost/127.0.0.1:22847, sessionid = 0x13c945c900b0009, negotiated timeout = 20000
[junit4:junit4]   2> 10138 T1146 oascc.ConnectionManager.process Watcher org.apache.solr.common.cloud.ConnectionManager@679cafd7 name:ZooKeeperConnection Watcher:127.0.0.1:22847 got event WatchedEvent state:SyncConnected type:None path:null path:null type:None
[junit4:junit4]   2> 10138 T1077 oascc.ConnectionManager.waitForConnected Client is connected to ZooKeeper
[junit4:junit4]   2> 10140 T1082 oazs.PrepRequestProcessor.pRequest2Txn Processed session termination for sessionid: 0x13c945c900b0009
[junit4:junit4]   2> 10153 T1079 oazs.NIOServerCnxn.closeSock Closed socket connection for client /140.211.11.196:22868 which had sessionid 0x13c945c900b0009
[junit4:junit4]   2> 10153 T1146 oaz.ClientCnxn$EventThread.run EventThread shut down
[junit4:junit4]   2> 10153 T1077 oaz.ZooKeeper.close Session: 0x13c945c900b0009 closed
[junit4:junit4]   2> 10154 T1077 oascsi.HttpClientUtil.createClient Creating new http client, config:maxConnections=500&maxConnectionsPerHost=16&socketTimeout=60000&connTimeout=15000
[junit4:junit4]   2> 10165 T1077 oaz.ZooKeeper.<init> Initiating client connection, connectString=127.0.0.1:22847/solr sessionTimeout=30000 watcher=org.apache.solr.common.cloud.ConnectionManager@71480cee
[junit4:junit4]   2> 10167 T1077 oascc.ConnectionManager.waitForConnected Waiting for client to connect to ZooKeeper
[junit4:junit4]   2> 10167 T1147 oaz.ClientCnxn$SendThread.logStartConnect Opening socket connection to server localhost/127.0.0.1:22847. Will not attempt to authenticate using SASL (access denied ("javax.security.auth.AuthPermission" "getLoginConfiguration"))
[junit4:junit4]   2> 10167 T1147 oaz.ClientCnxn$SendThread.primeConnection Socket connection established to localhost/127.0.0.1:22847, initiating session
[junit4:junit4]   2> 10168 T1079 oazs.NIOServerCnxnFactory.run Accepted socket connection from /140.211.11.196:22869
[junit4:junit4]   2> 10168 T1079 oazs.ZooKeeperServer.processConnectRequest Client attempting to establish new session at /140.211.11.196:22869
[junit4:junit4]   2> 10169 T1081 oazs.ZooKeeperServer.finishSessionInit Established session 0x13c945c900b000a with negotiated timeout 20000 for client /140.211.11.196:22869
[junit4:junit4]   2> 10169 T1147 oaz.ClientCnxn$SendThread.onConnected Session establishment complete on server localhost/127.0.0.1:22847, sessionid = 0x13c945c900b000a, negotiated timeout = 20000
[junit4:junit4]   2> 10170 T1148 oascc.ConnectionManager.process Watcher org.apache.solr.common.cloud.ConnectionManager@71480cee name:ZooKeeperConnection Watcher:127.0.0.1:22847/solr got event WatchedEvent state:SyncConnected type:None path:null path:null type:None
[junit4:junit4]   2> 10170 T1077 oascc.ConnectionManager.waitForConnected Client is connected to ZooKeeper
[junit4:junit4]   2> 10171 T1082 oazs.PrepRequestProcessor.pRequest Got user-level KeeperException when processing sessionid:0x13c945c900b000a type:create cxid:0x1 zxid:0x8d txntype:-1 reqpath:n/a Error Path:/solr/overseer Error:KeeperErrorCode = NodeExists for /solr/overseer
[junit4:junit4]   2> 10173 T1082 oazs.PrepRequestProcessor.pRequest Got user-level KeeperException when processing sessionid:0x13c945c900b000a type:create cxid:0x2 zxid:0x8e txntype:-1 reqpath:n/a Error Path:/solr/overseer Error:KeeperErrorCode = NodeExists for /solr/overseer
[junit4:junit4]   2> 10180 T1077 oasc.ZkController.createEphemeralLiveNode Register node as live in ZooKeeper:/live_nodes/127.0.0.1:22867_hh%2Fba
[junit4:junit4]   2> 10181 T1082 oazs.PrepRequestProcessor.pRequest Got user-level KeeperException when processing sessionid:0x13c945c900b000a type:delete cxid:0x4 zxid:0x8f txntype:-1 reqpath:n/a Error Path:/solr/live_nodes/127.0.0.1:22867_hh%2Fba Error:KeeperErrorCode = NoNode for /solr/live_nodes/127.0.0.1:22867_hh%2Fba
[junit4:junit4]   2> 10182 T1077 oascc.SolrZkClient.makePath makePath: /live_nodes/127.0.0.1:22867_hh%2Fba
[junit4:junit4]   2> 10185 T1099 oascc.ZkStateReader$2.process A cluster state change: WatchedEvent state:SyncConnected type:NodeChildrenChanged path:/live_nodes, has occurred - updating... (live nodes size: 3)
[junit4:junit4]   2> 10185 T1133 oascc.ZkStateReader$2.process A cluster state change: WatchedEvent state:SyncConnected type:NodeChildrenChanged path:/live_nodes, has occurred - updating... (live nodes size: 3)
[junit4:junit4]   2> 10185 T1105 oascc.ZkStateReader$2.process A cluster state change: WatchedEvent state:SyncConnected type:NodeChildrenChanged path:/live_nodes, has occurred - updating... (live nodes size: 3)
[junit4:junit4]   2> 10185 T1118 oascc.ZkStateReader$3.process Updating live nodes... (4)
[junit4:junit4]   2> 10186 T1118 oascc.ZkStateReader$2.process A cluster state change: WatchedEvent state:SyncConnected type:NodeChildrenChanged path:/live_nodes, has occurred - updating... (live nodes size: 4)
[junit4:junit4]   2> 10187 T1133 oascc.ZkStateReader$3.process Updating live nodes... (4)
[junit4:junit4]   2> 10188 T1099 oascc.ZkStateReader$3.process Updating live nodes... (4)
[junit4:junit4]   2> 10188 T1105 oascc.ZkStateReader$3.process Updating live nodes... (4)
[junit4:junit4]   2> 10190 T1077 oascc.ZkStateReader.createClusterStateWatchersAndUpdate Updating cluster state from ZooKeeper... 
[junit4:junit4]   2> 10197 T1149 oasc.CoreContainer.create Creating SolrCore 'collection1' using instanceDir: /usr/home/hudson/hudson-slave/workspace/Lucene-Solr-Tests-trunk-java7/solr/build/solr-core/test/J0/./org.apache.solr.cloud.BasicDistributedZkTest-jetty3-1359698769526/collection1
[junit4:junit4]   2> 10198 T1149 oasc.ZkController.createCollectionZkNode Check for collection zkNode:collection1
[junit4:junit4]   2> 10198 T1149 oasc.ZkController.createCollectionZkNode Collection zkNode exists
[junit4:junit4]   2> 10198 T1149 oasc.ZkController.readConfigName Load collection config from:/collections/collection1
[junit4:junit4]   2> 10200 T1149 oasc.SolrResourceLoader.<init> new SolrResourceLoader for directory: '/usr/home/hudson/hudson-slave/workspace/Lucene-Solr-Tests-trunk-java7/solr/build/solr-core/test/J0/./org.apache.solr.cloud.BasicDistributedZkTest-jetty3-1359698769526/collection1/'
[junit4:junit4]   2> 10201 T1149 oasc.SolrResourceLoader.replaceClassLoader Adding 'file:/usr/home/hudson/hudson-slave/workspace/Lucene-Solr-Tests-trunk-java7/solr/build/solr-core/test/J0/org.apache.solr.cloud.BasicDistributedZkTest-jetty3-1359698769526/collection1/lib/README' to classloader
[junit4:junit4]   2> 10202 T1149 oasc.SolrResourceLoader.replaceClassLoader Adding 'file:/usr/home/hudson/hudson-slave/workspace/Lucene-Solr-Tests-trunk-java7/solr/build/solr-core/test/J0/org.apache.solr.cloud.BasicDistributedZkTest-jetty3-1359698769526/collection1/lib/classes/' to classloader
[junit4:junit4]   2> 10257 T1149 oasc.SolrConfig.<init> Using Lucene MatchVersion: LUCENE_50
[junit4:junit4]   2> 10330 T1149 oasc.SolrConfig.<init> Loaded SolrConfig: solrconfig.xml
[junit4:junit4]   2> 10331 T1149 oass.IndexSchema.readSchema Reading Solr Schema
[junit4:junit4]   2> 10338 T1149 oass.IndexSchema.readSchema Schema name=test
[junit4:junit4]   2> 11069 T1149 oass.OpenExchangeRatesOrgProvider.init Initialized with rates=open-exchange-rates.json, refreshInterval=1440.
[junit4:junit4]   2> 11082 T1149 oass.IndexSchema.readSchema default search field in schema is text
[junit4:junit4]   2> 11086 T1149 oass.IndexSchema.readSchema unique key field: id
[junit4:junit4]   2> 11102 T1149 oass.FileExchangeRateProvider.reload Reloading exchange rates from file currency.xml
[junit4:junit4]   2> 11106 T1149 oass.FileExchangeRateProvider.reload Reloading exchange rates from file currency.xml
[junit4:junit4]   2> 11110 T1149 oass.OpenExchangeRatesOrgProvider.reload Reloading exchange rates from open-exchange-rates.json
[junit4:junit4]   2> 11111 T1149 oass.OpenExchangeRatesOrgProvider.reload Reloading exchange rates from open-exchange-rates.json
[junit4:junit4]   2> 11112 T1149 oasc.SolrCore.<init> [collection1] Opening new SolrCore at /usr/home/hudson/hudson-slave/workspace/Lucene-Solr-Tests-trunk-java7/solr/build/solr-core/test/J0/./org.apache.solr.cloud.BasicDistributedZkTest-jetty3-1359698769526/collection1/, dataDir=./org.apache.solr.cloud.BasicDistributedZkTest-1359698759685/jetty3/
[junit4:junit4]   2> 11112 T1149 oasc.JmxMonitoredMap.<init> JMX monitoring is enabled. Adding Solr mbeans to JMX Server: com.sun.jmx.mbeanserver.JmxMBeanServer@34c3c29
[junit4:junit4]   2> 11113 T1149 oasc.SolrCore.initDirectoryFactory solr.StandardDirectoryFactory
[junit4:junit4]   2> 11113 T1149 oasc.CachingDirectoryFactory.get return new directory for /usr/home/hudson/hudson-slave/workspace/Lucene-Solr-Tests-trunk-java7/solr/build/solr-core/test/J0/./org.apache.solr.cloud.BasicDistributedZkTest-1359698759685/jetty3 forceNew:false
[junit4:junit4]   2> 11114 T1149 oasc.CachingDirectoryFactory.close Releasing directory:/usr/home/hudson/hudson-slave/workspace/Lucene-Solr-Tests-trunk-java7/solr/build/solr-core/test/J0/./org.apache.solr.cloud.BasicDistributedZkTest-1359698759685/jetty3
[junit4:junit4]   2> 11114 T1149 oasc.SolrCore.getNewIndexDir New index directory detected: old=null new=./org.apache.solr.cloud.BasicDistributedZkTest-1359698759685/jetty3/index/
[junit4:junit4]   2> 11114 T1149 oasc.SolrCore.initIndex WARNING [collection1] Solr index directory './org.apache.solr.cloud.BasicDistributedZkTest-1359698759685/jetty3/index' doesn't exist. Creating new index...
[junit4:junit4]   2> 11115 T1149 oasc.CachingDirectoryFactory.get return new directory for /usr/home/hudson/hudson-slave/workspace/Lucene-Solr-Tests-trunk-java7/solr/build/solr-core/test/J0/./org.apache.solr.cloud.BasicDistributedZkTest-1359698759685/jetty3/index forceNew:false
[junit4:junit4]   2> 11122 T1149 oasc.SolrDeletionPolicy.onCommit SolrDeletionPolicy.onCommit: commits:num=1
[junit4:junit4]   2> 		commit{dir=RateLimitedDirectoryWrapper(org.apache.lucene.store.NIOFSDirectory@/usr/home/hudson/hudson-slave/workspace/Lucene-Solr-Tests-trunk-java7/solr/build/solr-core/test/J0/org.apache.solr.cloud.BasicDistributedZkTest-1359698759685/jetty3/index lockFactory=org.apache.lucene.store.NativeFSLockFactory@76d44e69),segFN=segments_1,generation=1,filenames=[segments_1]
[junit4:junit4]   2> 11123 T1149 oasc.SolrDeletionPolicy.updateCommits newest commit = 1[segments_1]
[junit4:junit4]   2> 11123 T1149 oasc.CachingDirectoryFactory.close Releasing directory:/usr/home/hudson/hudson-slave/workspace/Lucene-Solr-Tests-trunk-java7/solr/build/solr-core/test/J0/./org.apache.solr.cloud.BasicDistributedZkTest-1359698759685/jetty3/index
[junit4:junit4]   2> 11123 T1149 oasc.SolrCore.initWriters created xml: solr.XMLResponseWriter
[junit4:junit4]   2> 11125 T1149 oasup.UpdateRequestProcessorChain.init inserting DistributedUpdateProcessorFactory into updateRequestProcessorChain "dedupe"
[junit4:junit4]   2> 11125 T1149 oasup.UpdateRequestProcessorChain.init inserting DistributedUpdateProcessorFactory into updateRequestProcessorChain "dedupe-allfields"
[junit4:junit4]   2> 11125 T1149 oasup.UpdateRequestProcessorChain.init inserting DistributedUpdateProcessorFactory into updateRequestProcessorChain "stored_sig"
[junit4:junit4]   2> 11126 T1149 oasup.UpdateRequestProcessorChain.init inserting DistributedUpdateProcessorFactory into updateRequestProcessorChain "uniq-fields"
[junit4:junit4]   2> 11126 T1149 oasup.UpdateRequestProcessorChain.init inserting DistributedUpdateProcessorFactory into updateRequestProcessorChain "distrib-dup-test-chain-implicit"
[junit4:junit4]   2> 11126 T1149 oasc.RequestHandlers.initHandlersFromConfig adding lazy requestHandler: solr.ReplicationHandler
[junit4:junit4]   2> 11127 T1149 oasc.RequestHandlers.initHandlersFromConfig created /replication: solr.ReplicationHandler
[junit4:junit4]   2> 11127 T1149 oasc.RequestHandlers.initHandlersFromConfig created standard: solr.StandardRequestHandler
[junit4:junit4]   2> 11127 T1149 oasc.RequestHandlers.initHandlersFromConfig created /get: solr.RealTimeGetHandler
[junit4:junit4]   2> 11128 T1149 oasc.RequestHandlers.initHandlersFromConfig created dismax: solr.SearchHandler
[junit4:junit4]   2> 11128 T1149 oasc.RequestHandlers.initHandlersFromConfig created mock: org.apache.solr.core.MockQuerySenderListenerReqHandler
[junit4:junit4]   2> 11129 T1149 oasc.RequestHandlers.initHandlersFromConfig created /admin/: org.apache.solr.handler.admin.AdminHandlers
[junit4:junit4]   2> 11129 T1149 oasc.RequestHandlers.initHandlersFromConfig created defaults: solr.StandardRequestHandler
[junit4:junit4]   2> 11129 T1149 oasc.RequestHandlers.initHandlersFromConfig adding lazy requestHandler: solr.StandardRequestHandler
[junit4:junit4]   2> 11129 T1149 oasc.RequestHandlers.initHandlersFromConfig created lazy: solr.StandardRequestHandler
[junit4:junit4]   2> 11130 T1149 oasc.RequestHandlers.initHandlersFromConfig created /update: solr.UpdateRequestHandler
[junit4:junit4]   2> 11130 T1149 oasc.RequestHandlers.initHandlersFromConfig created /terms: org.apache.solr.handler.component.SearchHandler
[junit4:junit4]   2> 11130 T1149 oasc.RequestHandlers.initHandlersFromConfig created spellCheckCompRH: org.apache.solr.handler.component.SearchHandler
[junit4:junit4]   2> 11131 T1149 oasc.RequestHandlers.initHandlersFromConfig created spellCheckCompRH_Direct: org.apache.solr.handler.component.SearchHandler
[junit4:junit4]   2> 11131 T1149 oasc.RequestHandlers.initHandlersFromConfig created spellCheckWithWordbreak: org.apache.solr.handler.component.SearchHandler
[junit4:junit4]   2> 11132 T1149 oasc.RequestHandlers.initHandlersFromConfig created spellCheckWithWordbreak_Direct: org.apache.solr.handler.component.SearchHandler
[junit4:junit4]   2> 11132 T1149 oasc.RequestHandlers.initHandlersFromConfig created spellCheckCompRH1: org.apache.solr.handler.component.SearchHandler
[junit4:junit4]   2> 11132 T1149 oasc.RequestHandlers.initHandlersFromConfig created mltrh: org.apache.solr.handler.component.SearchHandler
[junit4:junit4]   2> 11133 T1149 oasc.RequestHandlers.initHandlersFromConfig created tvrh: org.apache.solr.handler.component.SearchHandler
[junit4:junit4]   2> 11133 T1149 oasc.RequestHandlers.initHandlersFromConfig created /mlt: solr.MoreLikeThisHandler
[junit4:junit4]   2> 11133 T1149 oasc.RequestHandlers.initHandlersFromConfig created /debug/dump: solr.DumpRequestHandler
[junit4:junit4]   2> 11142 T1149 oashl.XMLLoader.init xsltCacheLifetimeSeconds=60
[junit4:junit4]   2> 11146 T1149 oasc.SolrCore.initDeprecatedSupport WARNING solrconfig.xml uses deprecated <admin/gettableFiles>, Please update your config to use the ShowFileRequestHandler.
[junit4:junit4]   2> 11147 T1149 oasc.SolrCore.initDeprecatedSupport WARNING adding ShowFileRequestHandler with hidden files: [SCHEMA.XML, OLD_SYNONYMS.TXT, STOPWORDS.TXT, PROTWORDS.TXT, OPEN-EXCHANGE-RATES.JSON, SYNONYMS.TXT, CURRENCY.XML, MAPPING-ISOLATIN1ACCENT.TXT]
[junit4:junit4]   2> 11149 T1149 oasc.CachingDirectoryFactory.close Releasing directory:/usr/home/hudson/hudson-slave/workspace/Lucene-Solr-Tests-trunk-java7/solr/build/solr-core/test/J0/./org.apache.solr.cloud.BasicDistributedZkTest-1359698759685/jetty3
[junit4:junit4]   2> 11150 T1149 oass.SolrIndexSearcher.<init> Opening Searcher@afa4886 main
[junit4:junit4]   2> 11151 T1149 oasu.CommitTracker.<init> Hard AutoCommit: disabled
[junit4:junit4]   2> 11151 T1149 oasu.CommitTracker.<init> Soft AutoCommit: disabled
[junit4:junit4]   2> 11152 T1149 oashc.SpellCheckComponent.inform Initializing spell checkers
[junit4:junit4]   2> 11167 T1149 oass.DirectSolrSpellChecker.init init: {name=direct,classname=DirectSolrSpellChecker,field=lowerfilt,minQueryLength=3}
[junit4:junit4]   2> 11219 T1150 oasc.SolrCore.registerSearcher [collection1] Registered new searcher Searcher@afa4886 main{StandardDirectoryReader(segments_1:1)}
[junit4:junit4]   2> 11225 T1149 oasc.ZkController.publish publishing core=collection1 state=down
[junit4:junit4]   2> 11225 T1149 oasc.ZkController.publish numShards not found on descriptor - reading it from system property
[junit4:junit4]   2> 11319 T1100 oascc.ZkStateReader.updateClusterState Updating cloud state from ZooKeeper... 
[junit4:junit4]   2> 11320 T1100 oasc.Overseer$ClusterStateUpdater.updateState Update state numShards=2 message={
[junit4:junit4]   2> 	  "operation":"state",
[junit4:junit4]   2> 	  "numShards":"2",
[junit4:junit4]   2> 	  "shard":"shard2",
[junit4:junit4]   2> 	  "roles":null,
[junit4:junit4]   2> 	  "state":"active",
[junit4:junit4]   2> 	  "core":"collection1",
[junit4:junit4]   2> 	  "collection":"collection1",
[junit4:junit4]   2> 	  "node_name":"127.0.0.1:22862_hh%2Fba",
[junit4:junit4]   2> 	  "base_url":"http://127.0.0.1:22862/hh/ba"}
[junit4:junit4]   2> 11325 T1100 oasc.Overseer$ClusterStateUpdater.updateState Update state numShards=2 message={
[junit4:junit4]   2> 	  "operation":"state",
[junit4:junit4]   2> 	  "numShards":"2",
[junit4:junit4]   2> 	  "shard":null,
[junit4:junit4]   2> 	  "roles":null,
[junit4:junit4]   2> 	  "state":"down",
[junit4:junit4]   2> 	  "core":"collection1",
[junit4:junit4]   2> 	  "collection":"collection1",
[junit4:junit4]   2> 	  "node_name":"127.0.0.1:22867_hh%2Fba",
[junit4:junit4]   2> 	  "base_url":"http://127.0.0.1:22867/hh/ba"}
[junit4:junit4]   2> 11325 T1100 oasc.Overseer$ClusterStateUpdater.updateState Collection already exists with numShards=2
[junit4:junit4]   2> 11325 T1100 oasc.Overseer$ClusterStateUpdater.updateState Assigning new node to shard shard=shard1
[junit4:junit4]   2> 11337 T1099 oascc.ZkStateReader$2.process A cluster state change: WatchedEvent state:SyncConnected type:NodeDataChanged path:/clusterstate.json, has occurred - updating... (live nodes size: 4)
[junit4:junit4]   2> 11337 T1105 oascc.ZkStateReader$2.process A cluster state change: WatchedEvent state:SyncConnected type:NodeDataChanged path:/clusterstate.json, has occurred - updating... (live nodes size: 4)
[junit4:junit4]   2> 11337 T1118 oascc.ZkStateReader$2.process A cluster state change: WatchedEvent state:SyncConnected type:NodeDataChanged path:/clusterstate.json, has occurred - updating... (live nodes size: 4)
[junit4:junit4]   2> 11337 T1148 oascc.ZkStateReader$2.process A cluster state change: WatchedEvent state:SyncConnected type:NodeDataChanged path:/clusterstate.json, has occurred - updating... (live nodes size: 4)
[junit4:junit4]   2> 11337 T1133 oascc.ZkStateReader$2.process A cluster state change: WatchedEvent state:SyncConnected type:NodeDataChanged path:/clusterstate.json, has occurred - updating... (live nodes size: 4)
[junit4:junit4]   2> 12228 T1149 oasc.CoreContainer.registerCore registering core: collection1
[junit4:junit4]   2> 12228 T1149 oasc.ZkController.register Register replica - core:collection1 address:http://127.0.0.1:22867/hh/ba collection:collection1 shard:shard1
[junit4:junit4]   2> 12257 T1149 oasc.ZkController.register We are http://127.0.0.1:22867/hh/ba/collection1/ and leader is http://127.0.0.1:22854/hh/ba/collection1/
[junit4:junit4]   2> 12258 T1149 oasc.ZkController.register No LogReplay needed for core=collection1 baseURL=http://127.0.0.1:22867/hh/ba
[junit4:junit4]   2> 12258 T1149 oasc.ZkController.checkRecovery Core needs to recover:collection1
[junit4:junit4]   2> 12258 T1149 oasu.DefaultSolrCoreState.doRecovery Running recovery - first canceling any ongoing recovery
[junit4:junit4]   2> ASYNC  NEW_CORE C49 name=collection1 org.apache.solr.core.SolrCore@fb7034d url=http://127.0.0.1:22867/hh/ba/collection1 node=127.0.0.1:22867_hh%2Fba C49_STATE=coll:collection1 core:collection1 props:{shard=null, roles=null, state=down, core=collection1, collection=collection1, node_name=127.0.0.1:22867_hh%2Fba, base_url=http://127.0.0.1:22867/hh/ba}
[junit4:junit4]   2> 12258 T1151 C49 P22867 oasc.RecoveryStrategy.run Starting recovery process.  core=collection1 recoveringAfterStartup=true
[junit4:junit4]   2> 12259 T1149 oascc.ZkStateReader.updateClusterState Updating cloud state from ZooKeeper... 
[junit4:junit4]   2> 12259 T1151 C49 P22867 oasc.RecoveryStrategy.doRecovery ###### startupVersions=[]
[junit4:junit4]   2> 12260 T1151 C49 P22867 oasc.ZkController.publish publishing core=collection1 state=recovering
[junit4:junit4]   2> 12260 T1151 C49 P22867 oasc.ZkController.publish numShards not found on descriptor - reading it from system property
[junit4:junit4]   2> 12260 T1077 oass.SolrDispatchFilter.init user.dir=/usr/home/hudson/hudson-slave/workspace/Lucene-Solr-Tests-trunk-java7/solr/build/solr-core/test/J0
[junit4:junit4]   2> 12261 T1077 oass.SolrDispatchFilter.init SolrDispatchFilter.init() done
[junit4:junit4]   2> 12261 T1151 C49 P22867 oascsi.HttpClientUtil.createClient Creating new http client, config:maxConnections=128&maxConnectionsPerHost=32&followRedirects=false
[junit4:junit4]   2> 12261 T1077 oascsi.HttpClientUtil.createClient Creating new http client, config:maxConnections=128&maxConnectionsPerHost=32&followRedirects=false
[junit4:junit4]   2> 12451 T1077 oejs.Server.doStart jetty-8.1.8.v20121106
[junit4:junit4]   2> 12454 T1077 oejs.AbstractConnector.doStart Started SocketConnector@127.0.0.1:22875
[junit4:junit4]   2> 12455 T1077 oass.SolrDispatchFilter.init SolrDispatchFilter.init()
[junit4:junit4]   2> 12455 T1077 oasc.SolrResourceLoader.locateSolrHome JNDI not configured for solr (NoInitialContextEx)
[junit4:junit4]   2> 12456 T1077 oasc.SolrResourceLoader.locateSolrHome using system property solr.solr.home: /usr/home/hudson/hudson-slave/workspace/Lucene-Solr-Tests-trunk-java7/solr/build/solr-core/test/J0/./org.apache.solr.cloud.BasicDistributedZkTest-jetty4-1359698771958
[junit4:junit4]   2> 12456 T1077 oasc.CoreContainer$Initializer.initialize looking for solr.xml: /usr/home/hudson/hudson-slave/workspace/Lucene-Solr-Tests-trunk-java7/solr/build/solr-core/test/J0/./org.apache.solr.cloud.BasicDistributedZkTest-jetty4-1359698771958/solr.xml
[junit4:junit4]   2> 12456 T1077 oasc.CoreContainer.<init> New CoreContainer 1327435096
[junit4:junit4]   2> 12457 T1077 oasc.CoreContainer.load Loading CoreContainer using Solr Home: '/usr/home/hudson/hudson-slave/workspace/Lucene-Solr-Tests-trunk-java7/solr/build/solr-core/test/J0/./org.apache.solr.cloud.BasicDistributedZkTest-jetty4-1359698771958/'
[junit4:junit4]   2> 12458 T1077 oasc.SolrResourceLoader.<init> new SolrResourceLoader for directory: '/usr/home/hudson/hudson-slave/workspace/Lucene-Solr-Tests-trunk-java7/solr/build/solr-core/test/J0/./org.apache.solr.cloud.BasicDistributedZkTest-jetty4-1359698771958/'
[junit4:junit4]   2> 12510 T1077 oashc.HttpShardHandlerFactory.getParameter Setting socketTimeout to: 60000
[junit4:junit4]   2> 12511 T1077 oashc.HttpShardHandlerFactory.getParameter Setting urlScheme to: http://
[junit4:junit4]   2> 12512 T1077 oashc.HttpShardHandlerFactory.getParameter Setting connTimeout to: 15000
[junit4:junit4]   2> 12512 T1077 oashc.HttpShardHandlerFactory.getParameter Setting maxConnectionsPerHost to: 20
[junit4:junit4]   2> 12512 T1077 oashc.HttpShardHandlerFactory.getParameter Setting corePoolSize to: 0
[junit4:junit4]   2> 12513 T1077 oashc.HttpShardHandlerFactory.getParameter Setting maximumPoolSize to: 2147483647
[junit4:junit4]   2> 12513 T1077 oashc.HttpShardHandlerFactory.getParameter Setting maxThreadIdleTime to: 5
[junit4:junit4]   2> 12514 T1077 oashc.HttpShardHandlerFactory.getParameter Setting sizeOfQueue to: -1
[junit4:junit4]   2> 12514 T1077 oashc.HttpShardHandlerFactory.getParameter Setting fairnessPolicy to: false
[junit4:junit4]   2> 12515 T1077 oascsi.HttpClientUtil.createClient Creating new http client, config:maxConnectionsPerHost=20&maxConnections=10000&socketTimeout=60000&connTimeout=15000&retry=false
[junit4:junit4]   2> 12537 T1077 oasc.CoreContainer.load Registering Log Listener
[junit4:junit4]   2> 12557 T1077 oasc.CoreContainer.initZooKeeper Zookeeper client=127.0.0.1:22847/solr
[junit4:junit4]   2> 12558 T1077 oasc.ZkController.checkChrootPath zkHost includes chroot
[junit4:junit4]   2> 12558 T1077 oaz.ZooKeeper.<init> Initiating client connection, connectString=127.0.0.1:22847 sessionTimeout=60000 watcher=org.apache.solr.common.cloud.ConnectionManager@46af2832
[junit4:junit4]   2> 12559 T1077 oascc.ConnectionManager.waitForConnected Waiting for client to connect to ZooKeeper
[junit4:junit4]   2> 12560 T1161 oaz.ClientCnxn$SendThread.logStartConnect Opening socket connection to server localhost/127.0.0.1:22847. Will not attempt to authenticate using SASL (access denied ("javax.security.auth.AuthPermission" "getLoginConfiguration"))
[junit4:junit4]   2> 12561 T1161 oaz.ClientCnxn$SendThread.primeConnection Socket connection established to localhost/127.0.0.1:22847, initiating session
[junit4:junit4]   2> 12561 T1079 oazs.NIOServerCnxnFactory.run Accepted socket connection from /140.211.11.196:22876
[junit4:junit4]   2> 12562 T1079 oazs.ZooKeeperServer.processConnectRequest Client attempting to establish new session at /140.211.11.196:22876
[junit4:junit4]   2> 12563 T1081 oazs.ZooKeeperServer.finishSessionInit Established session 0x13c945c900b000b with negotiated timeout 20000 for client /140.211.11.196:22876
[junit4:junit4]   2> 12563 T1161 oaz.ClientCnxn$SendThread.onConnected Session establishment complete on server localhost/127.0.0.1:22847, sessionid = 0x13c945c900b000b, negotiated timeout = 20000
[junit4:junit4]   2> 12563 T1162 oascc.ConnectionManager.process Watcher org.apache.solr.common.cloud.ConnectionManager@46af2832 name:ZooKeeperConnection Watcher:127.0.0.1:22847 got event WatchedEvent state:SyncConnected type:None path:null path:null type:None
[junit4:junit4]   2> 12564 T1077 oascc.ConnectionManager.waitForConnected Client is connected to ZooKeeper
[junit4:junit4]   2> 12565 T1082 oazs.PrepRequestProcessor.pRequest2Txn Processed session termination for sessionid: 0x13c945c900b000b
[junit4:junit4]   2> 12566 T1162 oaz.ClientCnxn$EventThread.run EventThread shut down
[junit4:junit4]   2> 12566 T1079 oazs.NIOServerCnxn.closeSock Closed socket connection for client /140.211.11.196:22876 which had sessionid 0x13c945c900b000b
[junit4:junit4]   2> 12566 T1077 oaz.ZooKeeper.close Session: 0x13c945c900b000b closed
[junit4:junit4]   2> 12567 T1077 oascsi.HttpClientUtil.createClient Creating new http client, config:maxConnections=500&maxConnectionsPerHost=16&socketTimeout=60000&connTimeout=15000
[junit4:junit4]   2> 12578 T1077 oaz.ZooKeeper.<init> Initiating client connection, connectString=127.0.0.1:22847/solr sessionTimeout=30000 watcher=org.apache.solr.common.cloud.ConnectionManager@27b1e5f5
[junit4:junit4]   2> 12579 T1077 oascc.ConnectionManager.waitForConnected Waiting for client to connect to ZooKeeper
[junit4:junit4]   2> 12579 T1163 oaz.ClientCnxn$SendThread.logStartConnect Opening socket connection to server localhost/127.0.0.1:22847. Will not attempt to authenticate using SASL (access denied ("javax.security.auth.AuthPermission" "getLoginConfiguration"))
[junit4:junit4]   2> 12580 T1163 oaz.ClientCnxn$SendThread.primeConnection Socket connection established to localhost/127.0.0.1:22847, initiating session
[junit4:junit4]   2> 12580 T1079 oazs.NIOServerCnxnFactory.run Accepted socket connection from /140.211.11.196:22877
[junit4:junit4]   2> 12581 T1079 oazs.ZooKeeperServer.processConnectRequest Client attempting to establish new session at /140.211.11.196:22877
[junit4:junit4]   2> 12582 T1081 oazs.ZooKeeperServer.finishSessionInit Established session 0x13c945c900b000c with negotiated timeout 20000 for client /140.211.11.196:22877
[junit4:junit4]   2> 12582 T1163 oaz.ClientCnxn$SendThread.onConnected Session establishment complete on server localhost/127.0.0.1:22847, sessionid = 0x13c945c900b000c, negotiated timeout = 20000
[junit4:junit4]   2> 12582 T1164 oascc.ConnectionManager.process Watcher org.apache.solr.common.cloud.ConnectionManager@27b1e5f5 name:ZooKeeperConnection Watcher:127.0.0.1:22847/solr got event WatchedEvent state:SyncConnected type:None path:null path:null type:None
[junit4:junit4]   2> 12582 T1077 oascc.ConnectionManager.waitForConnected Client is connected to ZooKeeper
[junit4:junit4]   2> 12584 T1082 oazs.PrepRequestProcessor.pRequest Got user-level KeeperException when processing sessionid:0x13c945c900b000c type:create cxid:0x1 zxid:0x9f txntype:-1 reqpath:n/a Error Path:/solr/overseer Error:KeeperErrorCode = NodeExists for /solr/overseer
[junit4:junit4]   2> 12585 T1082 oazs.PrepRequestProcessor.pRequest Got user-level KeeperException when processing sessionid:0x13c945c900b000c type:create cxid:0x2 zxid:0xa0 txntype:-1 reqpath:n/a Error Path:/solr/overseer Error:KeeperErrorCode = NodeExists for /solr/overseer
[junit4:junit4]   2> 12593 T1077 oasc.ZkController.createEphemeralLiveNode Register node as live in ZooKeeper:/live_nodes/127.0.0.1:22875_hh%2Fba
[junit4:junit4]   2> 12594 T1082 oazs.PrepRequestProcessor.pRequest Got user-level KeeperException when processing sessionid:0x13c945c900b000c type:delete cxid:0x4 zxid:0xa1 txntype:-1 reqpath:n/a Error Path:/solr/live_nodes/127.0.0.1:22875_hh%2Fba Error:KeeperErrorCode = NoNode for /solr/live_nodes/127.0.0.1:22875_hh%2Fba
[junit4:junit4]   2> 12595 T1077 oascc.SolrZkClient.makePath makePath: /live_nodes/127.0.0.1:22875_hh%2Fba
[junit4:junit4]   2> 12597 T1099 oascc.ZkStateReader$2.process A cluster state change: WatchedEvent state:SyncConnected type:NodeChildrenChanged path:/live_nodes, has occurred - updating... (live nodes size: 4)
[junit4:junit4]   2> 12597 T1105 oascc.ZkStateReader$2.process A cluster state change: WatchedEvent state:SyncConnected type:NodeChildrenChanged path:/live_nodes, has occurred - updating... (live nodes size: 4)
[junit4:junit4]   2> 12597 T1133 oascc.ZkStateReader$2.process A cluster state change: WatchedEvent state:SyncConnected type:NodeChildrenChanged path:/live_nodes, has occurred - updating... (live nodes size: 4)
[junit4:junit4]   2> 12598 T1118 oascc.ZkStateReader$3.process Updating live nodes... (5)
[junit4:junit4]   2> 12598 T1118 oascc.ZkStateReader$2.process A cluster state change: WatchedEvent state:SyncConnected type:NodeChildrenChanged path:/live_nodes, has occurred - updating... (live nodes size: 5)
[junit4:junit4]   2> 12598 T1148 oascc.ZkStateReader$3.process Updating live nodes... (5)
[junit4:junit4]   2> 12599 T1148 oascc.ZkStateReader$2.process A cluster state change: WatchedEvent state:SyncConnected type:NodeChildrenChanged path:/live_nodes, has occurred - updating... (live nodes size: 5)
[junit4:junit4]   2> 12600 T1105 oascc.ZkStateReader$3.process Updating live nodes... (5)
[junit4:junit4]   2> 12600 T1099 oascc.ZkStateReader$3.process Updating live nodes... (5)
[junit4:junit4]   2> 12601 T1133 oascc.ZkStateReader$3.process Updating live nodes... (5)
[junit4:junit4]   2> 12603 T1077 oascc.ZkStateReader.createClusterStateWatchersAndUpdate Updating cluster state from ZooKeeper... 
[junit4:junit4]   2> 12611 T1165 oasc.CoreContainer.create Creating SolrCore 'collection1' using instanceDir: /usr/home/hudson/hudson-slave/workspace/Lucene-Solr-Tests-trunk-java7/solr/build/solr-core/test/J0/./org.apache.solr.cloud.BasicDistributedZkTest-jetty4-1359698771958/collection1
[junit4:junit4]   2> 12611 T1165 oasc.ZkController.createCollectionZkNode Check for collection zkNode:collection1
[junit4:junit4]   2> 12612 T1165 oasc.ZkController.createCollectionZkNode Collection zkNode exists
[junit4:junit4]   2> 12612 T1165 oasc.ZkController.readConfigName Load collection config from:/collections/collection1
[junit4:junit4]   2> 12614 T1165 oasc.SolrResourceLoader.<init> new SolrResourceLoader for directory: '/usr/home/hudson/hudson-slave/workspace/Lucene-Solr-Tests-trunk-java7/solr/build/solr-core/test/J0/./org.apache.solr.cloud.BasicDistributedZkTest-jetty4-1359698771958/collection1/'
[junit4:junit4]   2> 12615 T1165 oasc.SolrResourceLoader.replaceClassLoader Adding 'file:/usr/home/hudson/hudson-slave/workspace/Lucene-Solr-Tests-trunk-java7/solr/build/solr-core/test/J0/org.apache.solr.cloud.BasicDistributedZkTest-jetty4-1359698771958/collection1/lib/classes/' to classloader
[junit4:junit4]   2> 12616 T1165 oasc.SolrResourceLoader.replaceClassLoader Adding 'file:/usr/home/hudson/hudson-slave/workspace/Lucene-Solr-Tests-trunk-java7/solr/build/solr-core/test/J0/org.apache.solr.cloud.BasicDistributedZkTest-jetty4-1359698771958/collection1/lib/README' to classloader
[junit4:junit4]   2> 12669 T1165 oasc.SolrConfig.<init> Using Lucene MatchVersion: LUCENE_50
[junit4:junit4]   2> 12743 T1165 oasc.SolrConfig.<init> Loaded SolrConfig: solrconfig.xml
[junit4:junit4]   2> 12744 T1165 oass.IndexSchema.readSchema Reading Solr Schema
[junit4:junit4]   2> 12751 T1165 oass.IndexSchema.readSchema Schema name=test
[junit4:junit4]   2> 12852 T1100 oascc.ZkStateReader.updateClusterState Updating cloud state from ZooKeeper... 
[junit4:junit4]   2> 12853 T1100 oasc.Overseer$ClusterStateUpdater.updateState Update state numShards=2 message={
[junit4:junit4]   2> 	  "operation":"state",
[junit4:junit4]   2> 	  "numShards":"2",
[junit4:junit4]   2> 	  "shard":"shard1",
[junit4:junit4]   2> 	  "roles":null,
[junit4:junit4]   2> 	  "state":"recovering",
[junit4:junit4]   2> 	  "core":"collection1",
[junit4:junit4]   2> 	  "collection":"collection1",
[junit4:junit4]   2> 	  "node_name":"127.0.0.1:22867_hh%2Fba",
[junit4:junit4]   2> 	  "base_url":"http://127.0.0.1:22867/hh/ba"}
[junit4:junit4]   2> 12867 T1164 oascc.ZkStateReader$2.process A cluster state change: WatchedEvent state:SyncConnected type:NodeDataChanged path:/clusterstate.json, has occurred - updating... (live nodes size: 5)
[junit4:junit4]   2> 12867 T1148 oascc.ZkStateReader$2.process A cluster state change: WatchedEvent state:SyncConnected type:NodeDataChanged path:/clusterstate.json, has occurred - updating... (live nodes size: 5)
[junit4:junit4]   2> 12867 T1118 oascc.ZkStateReader$2.process A cluster state change: WatchedEvent state:SyncConnected type:NodeDataChanged path:/clusterstate.json, has occurred - updating... (live nodes size: 5)
[junit4:junit4]   2> 12867 T1099 oascc.ZkStateReader$2.process A cluster state change: WatchedEvent state:SyncConnected type:NodeDataChanged path:/clusterstate.json, has occurred - updating... (live nodes size: 5)
[junit4:junit4]   2> 12867 T1105 oascc.ZkStateReader$2.process A cluster state change: WatchedEvent state:SyncConnected type:NodeDataChanged path:/clusterstate.json, has occurred - updating... (live nodes size: 5)
[junit4:junit4]   2> 12867 T1133 oascc.ZkStateReader$2.process A cluster state change: WatchedEvent state:SyncConnected type:NodeDataChanged path:/clusterstate.json, has occurred - updating... (live nodes size: 5)
[junit4:junit4]   2> 13422 T1165 oass.OpenExchangeRatesOrgProvider.init Initialized with rates=open-exchange-rates.json, refreshInterval=1440.
[junit4:junit4]   2> 13431 T1165 oass.IndexSchema.readSchema default search field in schema is text
[junit4:junit4]   2> 13434 T1165 oass.IndexSchema.readSchema unique key field: id
[junit4:junit4]   2> 13448 T1165 oass.FileExchangeRateProvider.reload Reloading exchange rates from file currency.xml
[junit4:junit4]   2> 13452 T1165 oass.FileExchangeRateProvider.reload Reloading exchange rates from file currency.xml
[junit4:junit4]   2> 13456 T1165 oass.OpenExchangeRatesOrgProvider.reload Reloading exchange rates from open-exchange-rates.json
[junit4:junit4]   2> 13457 T1165 oass.OpenExchangeRatesOrgProvider.reload Reloading exchange rates from open-exchange-rates.json
[junit4:junit4]   2> 13458 T1165 oasc.SolrCore.<init> [collection1] Opening new SolrCore at /usr/home/hudson/hudson-slave/workspace/Lucene-Solr-Tests-trunk-java7/solr/build/solr-core/test/J0/./org.apache.solr.cloud.BasicDistributedZkTest-jetty4-1359698771958/collection1/, dataDir=./org.apache.solr.cloud.BasicDistributedZkTest-1359698759685/jetty4/
[junit4:junit4]   2> 13458 T1165 oasc.JmxMonitoredMap.<init> JMX monitoring is enabled. Adding Solr mbeans to JMX Server: com.sun.jmx.mbeanserver.JmxMBeanServer@34c3c29
[junit4:junit4]   2> 13459 T1165 oasc.SolrCore.initDirectoryFactory solr.StandardDirectoryFactory
[junit4:junit4]   2> 13459 T1165 oasc.CachingDirectoryFactory.get return new directory for /usr/home/hudson/hudson-slave/workspace/Lucene-Solr-Tests-trunk-java7/solr/build/solr-core/test/J0/./org.apache.solr.cloud.BasicDistributedZkTest-1359698759685/jetty4 forceNew:false
[junit4:junit4]   2> 13460 T1165 oasc.CachingDirectoryFactory.close Releasing directory:/usr/home/hudson/hudson-slave/workspace/Lucene-Solr-Tests-trunk-java7/solr/build/solr-core/test/J0/./org.apache.solr.cloud.BasicDistributedZkTest-1359698759685/jetty4
[junit4:junit4]   2> 13460 T1165 oasc.SolrCore.getNewIndexDir New index directory detected: old=null new=./org.apache.solr.cloud.BasicDistributedZkTest-1359698759685/jetty4/index/
[junit4:junit4]   2> 13460 T1165 oasc.SolrCore.initIndex WARNING [collection1] Solr index directory './org.apache.solr.cloud.BasicDistributedZkTest-1359698759685/jetty4/index' doesn't exist. Creating new index...
[junit4:junit4]   2> 13461 T1165 oasc.CachingDirectoryFactory.get return new directory for /usr/home/hudson/hudson-slave/workspace/Lucene-Solr-Tests-trunk-java7/solr/build/solr-core/test/J0/./org.apache.solr.cloud.BasicDistributedZkTest-1359698759685/jetty4/index forceNew:false
[junit4:junit4]   2> 13494 T1165 oasc.SolrDeletionPolicy.onCommit SolrDeletionPolicy.onCommit: commits:num=1
[junit4:junit4]   2> 		commit{dir=RateLimitedDirectoryWrapper(org.apache.lucene.store.NIOFSDirectory@/usr/home/hudson/hudson-slave/workspace/Lucene-Solr-Tests-trunk-java7/solr/build/solr-core/test/J0/org.apache.solr.cloud.BasicDistributedZkTest-1359698759685/jetty4/index lockFactory=org.apache.lucene.store.NativeFSLockFactory@20d05aab),segFN=segments_1,generation=1,filenames=[segments_1]
[junit4:junit4]   2> 13495 T1165 oasc.SolrDeletionPolicy.updateCommits newest commit = 1[segments_1]
[junit4:junit4]   2> 13495 T1165 oasc.CachingDirectoryFactory.close Releasing directory:/usr/home/hudson/hudson-slave/workspace/Lucene-Solr-Tests-trunk-java7/solr/build/solr-core/test/J0/./org.apache.solr.cloud.BasicDistributedZkTest-1359698759685/jetty4/index
[junit4:junit4]   2> 13495 T1165 oasc.SolrCore.initWriters created xml: solr.XMLResponseWriter
[junit4:junit4]   2> 13497 T1165 oasup.UpdateRequestProcessorChain.init inserting DistributedUpdateProcessorFactory into updateRequestProcessorChain "dedupe"
[junit4:junit4]   2> 13497 T1165 oasup.UpdateRequestProcessorChain.init inserting DistributedUpdateProcessorFactory into updateRequestProcessorChain "dedupe-allfields"
[junit4:junit4]   2> 13497 T1165 oasup.UpdateRequestProcessorChain.init inserting DistributedUpdateProcessorFactory into updateRequestProcessorChain "stored_sig"
[junit4:junit4]   2> 13498 T1165 oasup.UpdateRequestProcessorChain.init inserting DistributedUpdateProcessorFactory into updateRequestProcessorChain "uniq-fields"
[junit4:junit4]   2> 13498 T1165 oasup.UpdateRequestProcessorChain.init inserting DistributedUpdateProcessorFactory into updateRequestProcessorChain "distrib-dup-test-chain-implicit"
[junit4:junit4]   2> 13498 T1165 oasc.RequestHandlers.initHandlersFromConfig adding lazy requestHandler: solr.ReplicationHandler
[junit4:junit4]   2> 13499 T1165 oasc.RequestHandlers.initHandlersFromConfig created /replication: solr.ReplicationHandler
[junit4:junit4]   2> 13499 T1165 oasc.RequestHandlers.initHandlersFromConfig created standard: solr.StandardRequestHandler
[junit4:junit4]   2> 13499 T1165 oasc.RequestHandlers.initHandlersFromConfig created /get: solr.RealTimeGetHandler
[junit4:junit4]   2> 13500 T1165 oasc.RequestHandlers.initHandlersFromConfig created dismax: solr.SearchHandler
[junit4:junit4]   2> 13500 T1165 oasc.RequestHandlers.initHandlersFromConfig created mock: org.apache.solr.core.MockQuerySenderListenerReqHandler
[junit4:junit4]   2> 13500 T1165 oasc.RequestHandlers.initHandlersFromConfig created /admin/: org.apache.solr.handler.admin.AdminHandlers
[junit4:junit4]   2> 13501 T1165 oasc.RequestHandlers.initHandlersFromConfig created defaults: solr.StandardRequestHandler
[junit4:junit4]   2> 13501 T1165 oasc.RequestHandlers.initHandlersFromConfig adding lazy requestHandler: solr.StandardRequestHandler
[junit4:junit4]   2> 13501 T1165 oasc.RequestHandlers.initHandlersFromConfig created lazy: solr.StandardRequestHandler
[junit4:junit4]   2> 13502 T1165 oasc.RequestHandlers.initHandlersFromConfig created /update: solr.UpdateRequestHandler
[junit4:junit4]   2> 13502 T1165 oasc.RequestHandlers.initHandlersFromConfig created /terms: org.apache.solr.handler.component.SearchHandler
[junit4:junit4]   2> 13502 T1165 oasc.RequestHandlers.initHandlersFromConfig created spellCheckCompRH: org.apache.solr.handler.component.SearchHandler
[junit4:junit4]   2> 13503 T1165 oasc.RequestHandlers.initHandlersFromConfig created spellCheckCompRH_Direct: org.apache.solr.handler.component.SearchHandler
[junit4:junit4]   2> 13503 T1165 oasc.RequestHandlers.initHandlersFromConfig created spellCheckWithWordbreak: org.apache.solr.handler.component.SearchHandler
[junit4:junit4]   2> 13503 T1165 oasc.RequestHandlers.initHandlersFromConfig created spellCheckWithWordbreak_Direct: org.apache.solr.handler.component.SearchHandler
[junit4:junit4]   2> 13504 T1165 oasc.RequestHandlers.initHandlersFromConfig created spellCheckCompRH1: org.apache.solr.handler.component.SearchHandler
[junit4:junit4]   2> 13504 T1165 oasc.RequestHandlers.initHandlersFromConfig created mltrh: org.apache.solr.handler.component.SearchHandler
[junit4:junit4]   2> 13505 T1165 oasc.RequestHandlers.initHandlersFromConfig created tvrh: org.apache.solr.handler.component.SearchHandler
[junit4:junit4]   2> 13505 T1165 oasc.RequestHandlers.initHandlersFromConfig created /mlt: solr.MoreLikeThisHandler
[junit4:junit4]   2> 13505 T1165 oasc.RequestHandlers.initHandlersFromConfig created /debug/dump: solr.DumpRequestHandler
[junit4:junit4]   2> 13513 T1165 oashl.XMLLoader.init xsltCacheLifetimeSeconds=60
[junit4:junit4]   2> 13516 T1165 oasc.SolrCore.initDeprecatedSupport WARNING solrconfig.xml uses deprecated <admin/gettableFiles>, Please update your config to use the ShowFileRequestHandler.
[junit4:junit4]   2> 13518 T1165 oasc.SolrCore.initDeprecatedSupport WARNING adding ShowFileRequestHandler with hidden files: [SCHEMA.XML, OLD_SYNONYMS.TXT, STOPWORDS.TXT, PROTWORDS.TXT, OPEN-EXCHANGE-RATES.JSON, SYNONYMS.TXT, CURRENCY.XML, MAPPING-ISOLATIN1ACCENT.TXT]
[junit4:junit4]   2> 13519 T1165 oasc.CachingDirectoryFactory.close Releasing directory:/usr/home/hudson/hudson-slave/workspace/Lucene-Solr-Tests-trunk-java7/solr/build/solr-core/test/J0/./org.apache.solr.cloud.BasicDistributedZkTest-1359698759685/jetty4
[junit4:junit4]   2> 13521 T1165 oass.SolrIndexSearcher.<init> Opening Searcher@56619a1c main
[junit4:junit4]   2> 13522 T1165 oasu.CommitTracker.<init> Hard AutoCommit: disabled
[junit4:junit4]   2> 13522 T1165 oasu.CommitTracker.<init> Soft AutoCommit: disabled
[junit4:junit4]   2> 13522 T1165 oashc.SpellCheckComponent.inform Initializing spell checkers
[junit4:junit4]   2> 13531 T1165 oass.DirectSolrSpellChecker.init init: {name=direct,classname=DirectSolrSpellChecker,field=lowerfilt,minQueryLength=3}
[junit4:junit4]   2> 13610 T1166 oasc.SolrCore.registerSearcher [collection1] Registered new searcher Searcher@56619a1c main{StandardDirectoryReader(segments_1:1)}
[junit4:junit4]   2> 13614 T1165 oasc.ZkController.publish publishing core=collection1 state=down
[junit4:junit4]   2> 13614 T1165 oasc.ZkController.publish numShards not found on descriptor - reading it from system property
[junit4:junit4]   2> 14374 T1100 oascc.ZkStateReader.updateClusterState Updating cloud state from ZooKeeper... 
[junit4:junit4]   2> 14375 T1100 oasc.Overseer$ClusterStateUpdater.updateState Update state numShards=2 message={
[junit4:junit4]   2> 	  "operation":"state",
[junit4:junit4]   2> 	  "numShards":"2",
[junit4:junit4]   2> 	  "shard":null,
[junit4:junit4]   2> 	  "roles":null,
[junit4:junit4]   2> 	  "state":"down",
[junit4:junit4]   2> 	  "core":"collection1",
[junit4:junit4]   2> 	  "collection":"collection1",
[junit4:junit4]   2> 	  "node_name":"127.0.0.1:22875_hh%2Fba",
[junit4:junit4]   2> 	  "base_url":"http://127.0.0.1:22875/hh/ba"}
[junit4:junit4]   2> 14375 T1100 oasc.Overseer$ClusterStateUpdater.updateState Collection already exists with numShards=2
[junit4:junit4]   2> 14375 T1100 oasc.Overseer$ClusterStateUpdater.updateState Assigning new node to shard shard=shard2
[junit4:junit4]   2> 14379 T1099 oascc.ZkStateReader$2.process A cluster state change: WatchedEvent state:SyncConnected type:NodeDataChanged path:/clusterstate.json, has occurred - updating... (live nodes size: 5)
[junit4:junit4]   2> 14379 T1164 oascc.ZkStateReader$2.process A cluster state change: WatchedEvent state:SyncConnected type:NodeDataChanged path:/clusterstate.json, has occurred - updating... (live nodes size: 5)
[junit4:junit4]   2> 14379 T1133 oascc.ZkStateReader$2.process A cluster state change: WatchedEvent state:SyncConnected type:NodeDataChanged path:/clusterstate.json, has occurred - updating... (live nodes size: 5)
[junit4:junit4]   2> 14379 T1105 oascc.ZkStateReader$2.process A cluster state change: WatchedEvent state:SyncConnected type:NodeDataChanged path:/clusterstate.json, has occurred - updating... (live nodes size: 5)
[junit4:junit4]   2> 14379 T1118 oascc.ZkStateReader$2.process A cluster state change: WatchedEvent state:SyncConnected type:NodeDataChanged path:/clusterstate.json, has occurred - updating... (live nodes size: 5)
[junit4:junit4]   2> 14379 T1148 oascc.ZkStateReader$2.process A cluster state change: WatchedEvent state:SyncConnected type:NodeDataChanged path:/clusterstate.json, has occurred - updating... (live nodes size: 5)
[junit4:junit4]   2> 14616 T1165 oasc.CoreContainer.registerCore registering core: collection1
[junit4:junit4]   2> 14616 T1165 oasc.ZkController.register Register replica - core:collection1 address:http://127.0.0.1:22875/hh/ba collection:collection1 shard:shard2
[junit4:junit4]   2> 14620 T1165 oasc.ZkController.register We are http://127.0.0.1:22875/hh/ba/collection1/ and leader is http://127.0.0.1:22862/hh/ba/collection1/
[junit4:junit4]   2> 14621 T1165 oasc.ZkController.register No LogReplay needed for core=collection1 baseURL=http://127.0.0.1:22875/hh/ba
[junit4:junit4]   2> 14621 T1165 oasc.ZkController.checkRecovery Core needs to recover:collection1
[junit4:junit4]   2> 14621 T1165 oasu.DefaultSolrCoreState.doRecovery Running recovery - first canceling any ongoing recovery
[junit4:junit4]   2> ASYNC  NEW_CORE C50 name=collection1 org.apache.solr.core.SolrCore@76a3730d url=http://127.0.0.1:22875/hh/ba/collection1 node=127.0.0.1:22875_hh%2Fba C50_STATE=coll:collection1 core:collection1 props:{shard=null, roles=null, state=down, core=collection1, collection=collection1, node_name=127.0.0.1:22875_hh%2Fba, base_url=http://127.0.0.1:22875/hh/ba}
[junit4:junit4]   2> 14622 T1167 C50 P22875 oasc.RecoveryStrategy.run Starting recovery process.  core=collection1 recoveringAfterStartup=true
[junit4:junit4]   2> 14622 T1167 C50 P22875 oasc.RecoveryStrategy.doRecovery ###### startupVersions=[]
[junit4:junit4]   2> 14623 T1165 oascc.ZkStateReader.updateClusterState Updating cloud state from ZooKeeper... 
[junit4:junit4]   2> 14623 T1167 C50 P22875 oasc.ZkController.publish publishing core=collection1 state=recovering
[junit4:junit4]   2> 14623 T1167 C50 P22875 oasc.ZkController.publish numShards not found on descriptor - reading it from system property
[junit4:junit4]   2> 14624 T1077 oass.SolrDispatchFilter.init user.dir=/usr/home/hudson/hudson-slave/workspace/Lucene-Solr-Tests-trunk-java7/solr/build/solr-core/test/J0
[junit4:junit4]   2> 14625 T1167 C50 P22875 oascsi.HttpClientUtil.createClient Creating new http client, config:maxConnections=128&maxConnectionsPerHost=32&followRedirects=false
[junit4:junit4]   2> 14625 T1077 oass.SolrDispatchFilter.init SolrDispatchFilter.init() done
[junit4:junit4]   2> 14626 T1077 oascsi.HttpClientUtil.createClient Creating new http client, config:maxConnections=128&maxConnectionsPerHost=32&followRedirects=false
[junit4:junit4]   2> 14649 T1077 oascc.ZkStateReader.updateClusterState Updating cloud state from ZooKeeper... 
[junit4:junit4]   2> 14651 T1077 oasc.AbstractDistribZkTestBase.waitForRecoveriesToFinish Wait for recoveries to finish - collection: collection1 failOnTimeout:true timeout (sec):230
[junit4:junit4]   2> 14652 T1077 oascc.ZkStateReader.updateClusterState Updating cloud state from ZooKeeper... 
[junit4:junit4]   2>  C49_STATE=coll:collection1 core:collection1 props:{shard=shard1, roles=null, state=recovering, core=collection1, collection=collection1, node_name=127.0.0.1:22867_hh%2Fba, base_url=http://127.0.0.1:22867/hh/ba}
[junit4:junit4]   2> 15283 T1151 C49 P22867 oasc.RecoveryStrategy.doRecovery Attempting to PeerSync from http://127.0.0.1:22854/hh/ba/collection1/ core=collection1 - recoveringAfterStartup=true
[junit4:junit4]   2> 15283 T1151 C49 P22867 oasu.PeerSync.sync PeerSync: core=collection1 url=http://127.0.0.1:22867/hh/ba START replicas=[http://127.0.0.1:22854/hh/ba/collection1/] nUpdates=100
[junit4:junit4]   2> 15283 T1151 C49 P22867 oasu.PeerSync.sync WARNING no frame of reference to tell of we've missed updates
[junit4:junit4]   2> 15284 T1151 C49 P22867 oasc.RecoveryStrategy.doRecovery PeerSync Recovery was not successful - trying replication. core=collection1
[junit4:junit4]   2> 15284 T1151 C49 P22867 oasc.RecoveryStrategy.doRecovery Starting Replication Recovery. core=collection1
[junit4:junit4]   2> 15284 T1151 C49 P22867 oasc.RecoveryStrategy.doRecovery Begin buffering updates. core=collection1
[junit4:junit4]   2> 15285 T1151 C49 P22867 oasu.UpdateLog.bufferUpdates Starting to buffer updates. FSUpdateLog{state=ACTIVE, tlog=null}
[junit4:junit4]   2> 15285 T1151 C49 P22867 oasc.RecoveryStrategy.replicate Attempting to replicate from http://127.0.0.1:22854/hh/ba/collection1/. core=collection1
[junit4:junit4]   2> 15285 T1151 C49 P22867 oascsi.HttpClientUtil.createClient Creating new http client, config:maxConnections=128&maxConnectionsPerHost=32&followRedirects=false
[junit4:junit4]   2> ASYNC  NEW_CORE C51 name=collection1 org.apache.solr.core.SolrCore@3535d884 url=http://127.0.0.1:22854/hh/ba/collection1 node=127.0.0.1:22854_hh%2Fba C51_STATE=coll:collection1 core:collection1 props:{shard=shard1, roles=null, state=active, core=collection1, collection=collection1, node_name=127.0.0.1:22854_hh%2Fba, base_url=http://127.0.0.1:22854/hh/ba, leader=true}
[junit4:junit4]   2> 15295 T1109 C51 P22854 REQ /get {getVersions=100&distrib=false&wt=javabin&qt=/get&version=2} status=0 QTime=0 
[junit4:junit4]   2> 15299 T1110 C51 P22854 oasu.DirectUpdateHandler2.commit start commit{,optimize=false,openSearcher=false,waitSearcher=true,expungeDeletes=false,softCommit=false}
[junit4:junit4]   2> 15300 T1110 C51 P22854 oasc.CachingDirectoryFactory.close Releasing directory:/usr/home/hudson/hudson-slave/workspace/Lucene-Solr-Tests-trunk-java7/solr/build/solr-core/test/J0/./org.apache.solr.cloud.BasicDistributedZkTest-1359698759685/jetty1
[junit4:junit4]   2> 15304 T1110 C51 P22854 oasc.SolrDeletionPolicy.onInit SolrDeletionPolicy.onInit: commits:num=1
[junit4:junit4]   2> 		commit{dir=RateLimitedDirectoryWrapper(org.apache.lucene.store.NIOFSDirectory@/usr/home/hudson/hudson-slave/workspace/Lucene-Solr-Tests-trunk-java7/solr/build/solr-core/test/J0/org.apache.solr.cloud.BasicDistributedZkTest-1359698759685/jetty1/index lockFactory=org.apache.lucene.store.NativeFSLockFactory@20bb94f4),segFN=segments_1,generation=1,filenames=[segments_1]
[junit4:junit4]   2> 15305 T1110 C51 P22854 oasc.SolrDeletionPolicy.updateCommits newest commit = 1[segments_1]
[junit4:junit4]   2> 15335 T1110 C51 P22854 oasc.SolrDeletionPolicy.onCommit SolrDeletionPolicy.onCommit: commits:num=2
[junit4:junit4]   2> 		commit{dir=RateLimitedDirectoryWrapper(org.apache.lucene.store.NIOFSDirectory@/usr/home/hudson/hudson-slave/workspace/Lucene-Solr-Tests-trunk-java7/solr/build/solr-core/test/J0/org.apache.solr.cloud.BasicDistributedZkTest-1359698759685/jetty1/index lockFactory=org.apache.lucene.store.NativeFSLockFactory@20bb94f4),segFN=segments_1,generation=1,filenames=[segments_1]
[junit4:junit4]   2> 		commit{dir=RateLimitedDirectoryWrapper(org.apache.lucene.store.NIOFSDirectory@/usr/home/hudson/hudson-slave/workspace/Lucene-Solr-Tests-trunk-java7/solr/build/solr-core/test/J0/org.apache.solr.cloud.BasicDistributedZkTest-1359698759685/jetty1/index lockFactory=org.apache.lucene.store.NativeFSLockFactory@20bb94f4),segFN=segments_2,generation=2,filenames=[segments_2]
[junit4:junit4]   2> 15336 T1110 C51 P22854 oasc.SolrDeletionPolicy.updateCommits newest commit = 2[segments_2]
[junit4:junit4]   2> 15337 T1110 C51 P22854 oasc.CachingDirectoryFactory.close Releasing directory:/usr/home/hudson/hudson-slave/workspace/Lucene-Solr-Tests-trunk-java7/solr/build/solr-core/test/J0/./org.apache.solr.cloud.BasicDistributedZkTest-1359698759685/jetty1
[junit4:junit4]   2> 15337 T1110 C51 P22854 oass.SolrIndexSearcher.<init> Opening Searcher@59347307 realtime
[junit4:junit4]   2> 15338 T1110 C51 P22854 oasu.DirectUpdateHandler2.commit end_commit_flush
[junit4:junit4]   2> 15338 T1110 C51 P22854 /update {waitSearcher=true&openSearcher=false&commit=true&wt=javabin&commit_end_point=true&version=2&softCommit=false} {commit=} 0 39
[junit4:junit4]   2> 15339 T1151 C49 P22867 oash.ReplicationHandler.inform Commits will be reserved for  10000
[junit4:junit4]   2> 15339 T1151 C49 P22867 oash.SnapPuller.<init>  No value set for 'pollInterval'. Timer Task not started.
[junit4:junit4]   2> 15342 T1111 C51 P22854 oash.ReplicationHandler.inform Commits will be reserved for  10000
[junit4:junit4]   2> 15342 T1111 C51 P22854 REQ /replication {command=indexversion&qt=/replication&wt=javabin&version=2} status=0 QTime=2 
[junit4:junit4]   2> 15343 T1151 C49 P22867 oash.SnapPuller.fetchLatestIndex Master's generation: 2
[junit4:junit4]   2> 15343 T1151 C49 P22867 oash.SnapPuller.fetchLatestIndex Slave's generation: 1
[junit4:junit4]   2> 15343 T1151 C49 P22867 oash.SnapPuller.fetchLatestIndex Starting replication process
[junit4:junit4]   2> 15345 T1111 C51 P22854 oasc.CachingDirectoryFactory.close Releasing directory:/usr/home/hudson/hudson-slave/workspace/Lucene-Solr-Tests-trunk-java7/solr/build/solr-core/test/J0/./org.apache.solr.cloud.BasicDistributedZkTest-1359698759685/jetty1
[junit4:junit4]   2> 15346 T1111 C51 P22854 oasc.CachingDirectoryFactory.close Releasing directory:/usr/home/hudson/hudson-slave/workspace/Lucene-Solr-Tests-trunk-java7/solr/build/solr-core/test/J0/./org.apache.solr.cloud.BasicDistributedZkTest-1359698759685/jetty1/index
[junit4:junit4]   2> 15346 T1111 C51 P22854 REQ /replication {command=filelist&qt=/replication&wt=javabin&generation=2&version=2} status=0 QTime=1 
[junit4:junit4]   2> 15347 T1151 C49 P22867 oash.SnapPuller.fetchLatestIndex Number of files in latest index in master: 1
[junit4:junit4]   2> 15348 T1151 C49 P22867 oasc.CachingDirectoryFactory.get return new directory for /usr/home/hudson/hudson-slave/workspace/Lucene-Solr-Tests-trunk-java7/solr/build/solr-core/test/J0/./org.apache.solr.cloud.BasicDistributedZkTest-1359698759685/jetty3/index.20130201120615026 forceNew:false
[junit4:junit4]   2> 15349 T1151 C49 P22867 oasc.CachingDirectoryFactory.close Releasing directory:/usr/home/hudson/hudson-slave/workspace/Lucene-Solr-Tests-trunk-java7/solr/build/solr-core/test/J0/./org.apache.solr.cloud.BasicDistributedZkTest-1359698759685/jetty3
[junit4:junit4]   2> 15349 T1151 C49 P22867 oash.SnapPuller.fetchLatestIndex Starting download to RateLimitedDirectoryWrapper(org.apache.lucene.store.NIOFSDirectory@/usr/home/hudson/hudson-slave/workspace/Lucene-Solr-Tests-trunk-java7/solr/build/solr-core/test/J0/org.apache.solr.cloud.BasicDistributedZkTest-1359698759685/jetty3/index.20130201120615026 lockFactory=org.apache.lucene.store.NativeFSLockFactory@6b6fc63e) fullCopy=true
[junit4:junit4]   2> 15353 T1111 C51 P22854 REQ /replication {file=segments_2&command=filecontent&checksum=true&wt=filestream&qt=/replication&generation=2} status=0 QTime=0 
[junit4:junit4]   2> 15355 T1151 C49 P22867 oasc.CachingDirectoryFactory.close Releasing directory:/usr/home/hudson/hudson-slave/workspace/Lucene-Solr-Tests-trunk-java7/solr/build/solr-core/test/J0/./org.apache.solr.cloud.BasicDistributedZkTest-1359698759685/jetty3/index
[junit4:junit4]   2> 15355 T1151 C49 P22867 oash.SnapPuller.fetchLatestIndex Total time taken for download : 0 secs
[junit4:junit4]   2> 15355 T1151 C49 P22867 oash.SnapPuller.modifyIndexProps New index installed. Updating index properties... index=index.20130201120615026
[junit4:junit4]   2> 15357 T1151 C49 P22867 oasc.CachingDirectoryFactory.close Releasing directory:/usr/home/hudson/hudson-slave/workspace/Lucene-Solr-Tests-trunk-java7/solr/build/solr-core/test/J0/./org.apache.solr.cloud.BasicDistributedZkTest-1359698759685/jetty3
[junit4:junit4]   2> 15357 T1151 C49 P22867 oasc.CachingDirectoryFactory.close Releasing directory:/usr/home/hudson/hudson-slave/workspace/Lucene-Solr-Tests-trunk-java7/solr/build/solr-core/test/J0/./org.apache.solr.cloud.BasicDistributedZkTest-1359698759685/jetty3
[junit4:junit4]   2> 15357 T1151 C49 P22867 oasc.SolrCore.getNewIndexDir New index directory detected: old=./org.apache.solr.cloud.BasicDistributedZkTest-1359698759685/jetty3/index/ new=./org.apache.solr.cloud.BasicDistributedZkTest-1359698759685/jetty3/index.20130201120615026
[junit4:junit4]   2> 15361 T1151 C49 P22867 oasc.SolrDeletionPolicy.onInit SolrDeletionPolicy.onInit: commits:num=1
[junit4:junit4]   2> 		commit{dir=RateLimitedDirectoryWrapper(org.apache.lucene.store.NIOFSDirectory@/usr/home/hudson/hudson-slave/workspace/Lucene-Solr-Tests-trunk-java7/solr/build/solr-core/test/J0/org.apache.solr.cloud.BasicDistributedZkTest-1359698759685/jetty3/index.20130201120615026 lockFactory=org.apache.lucene.store.NativeFSLockFactory@6b6fc63e),segFN=segments_2,generation=2,filenames=[segments_2]
[junit4:junit4]   2> 15361 T1151 C49 P22867 oasc.SolrDeletionPolicy.updateCommits newest commit = 2[segments_2]
[junit4:junit4]   2> 15363 T1151 C49 P22867 oasc.CachingDirectoryFactory.close Releasing directory:/usr/home/hudson/hudson-slave/workspace/Lucene-Solr-Tests-trunk-java7/solr/build/solr-core/test/J0/./org.apache.solr.cloud.BasicDistributedZkTest-1359698759685/jetty3
[junit4:junit4]   2> 15363 T1151 C49 P22867 oasu.DefaultSolrCoreState.newIndexWriter Creating new IndexWriter...
[junit4:junit4]   2> 15363 T1151 C49 P22867 oasu.DefaultSolrCoreState.newIndexWriter Waiting until IndexWriter is unused... core=collection1
[junit4:junit4]   2> 15363 T1151 C49 P22867 oasu.DefaultSolrCoreState.newIndexWriter Rollback old IndexWriter... core=collection1
[junit4:junit4]   2> 15364 T1151 C49 P22867 oasc.CachingDirectoryFactory.close Releasing directory:/usr/home/hudson/hudson-slave/workspace/Lucene-Solr-Tests-trunk-java7/solr/build/solr-core/test/J0/./org.apache.solr.cloud.BasicDistributedZkTest-1359698759685/jetty3/index.20130201120615026
[junit4:junit4]   2> 15365 T1151 C49 P22867 oasc.CachingDirectoryFactory.close Releasing directory:/usr/home/hudson/hudson-slave/workspace/Lucene-Solr-Tests-trunk-java7/solr/build/solr-core/test/J0/./org.apache.solr.cloud.BasicDistributedZkTest-1359698759685/jetty3
[junit4:junit4]   2> 15368 T1151 C49 P22867 oasc.SolrDeletionPolicy.onInit SolrDeletionPolicy.onInit: commits:num=1
[junit4:junit4]   2> 		commit{dir=RateLimitedDirectoryWrapper(org.apache.lucene.store.NIOFSDirectory@/usr/home/hudson/hudson-slave/workspace/Lucene-Solr-Tests-trunk-java7/solr/build/solr-core/test/J0/org.apache.solr.cloud.BasicDistributedZkTest-1359698759685/jetty3/index.20130201120615026 lockFactory=org.apache.lucene.store.NativeFSLockFactory@6b6fc63e),segFN=segments_2,generation=2,filenames=[segments_2]
[junit4:junit4]   2> 15368 T1151 C49 P22867 oasc.SolrDeletionPolicy.updateCommits newest commit = 2[segments_2]
[junit4:junit4]   2> 15368 T1151 C49 P22867 oasu.DefaultSolrCoreState.newIndexWriter New IndexWriter is ready to be used.
[junit4:junit4]   2> 15369 T1151 C49 P22867 oasc.CachingDirectoryFactory.close Releasing directory:/usr/home/hudson/hudson-slave/workspace/Lucene-Solr-Tests-trunk-java7/solr/build/solr-core/test/J0/./org.apache.solr.cloud.BasicDistributedZkTest-1359698759685/jetty3
[junit4:junit4]   2> 15369 T1151 C49 P22867 oass.SolrIndexSearcher.<init> Opening Searcher@1894199e main
[junit4:junit4]   2> 15371 T1150 oasc.SolrCore.registerSearcher [collection1] Registered new searcher Searcher@1894199e main{StandardDirectoryReader(segments_2:1:nrt)}
[junit4:junit4]   2> 15371 T1150 oasc.CachingDirectoryFactory.close Releasing directory:/usr/home/hudson/hudson-slave/workspace/Lucene-Solr-Tests-trunk-java7/solr/build/solr-core/test/J0/./org.apache.solr.cloud.BasicDistributedZkTest-1359698759685/jetty3/index
[junit4:junit4]   2> 15372 T1151 C49 P22867 oasu.DirectUpdateHandler2.commit start commit{,optimize=false,openSearcher=false,waitSearcher=false,expungeDeletes=false,softCommit=false}
[junit4:junit4]   2> 15374 T1151 C49 P22867 oasc.SolrDeletionPolicy.onCommit SolrDeletionPolicy.onCommit: commits:num=2
[junit4:junit4]   2> 		commit{dir=RateLimitedDirectoryWrapper(org.apache.lucene.store.NIOFSDirectory@/usr/home/hudson/hudson-slave/workspace/Lucene-Solr-Tests-trunk-java7/solr/build/solr-core/test/J0/org.apache.solr.cloud.BasicDistributedZkTest-1359698759685/jetty3/index.20130201120615026 lockFactory=org.apache.lucene.store.NativeFSLockFactory@6b6fc63e),segFN=segments_2,generation=2,filenames=[segments_2]
[junit4:junit4]   2> 		commit{dir=RateLimitedDirectoryWrapper(org.apache.lucene.store.NIOFSDirectory@/usr/home/hudson/hudson-slave/workspace/Lucene-Solr-Tests-trunk-java7/solr/build/solr-core/test/J0/org.apache.solr.cloud.BasicDistributedZkTest-1359698759685/jetty3/index.20130201120615026 lockFactory=org.apache.lucene.store.NativeFSLockFactory@6b6fc63e),segFN=segments_3,generation=3,filenames=[segments_3]
[junit4:junit4]   2> 15374 T1151 C49 P22867 oasc.SolrDeletionPolicy.updateCommits newest commit = 3[segments_3]
[junit4:junit4]   2> 15375 T1151 C49 P22867 oasc.CachingDirectoryFactory.close Releasing directory:/usr/home/hudson/hudson-slave/workspace/Lucene-Solr-Tests-trunk-java7/solr/build/solr-core/test/J0/./org.apache.solr.cloud.BasicDistributedZkTest-1359698759685/jetty3
[junit4:junit4]   2> 15375 T1151 C49 P22867 oasu.DirectUpdateHandler2.commit end_commit_flush
[junit4:junit4]   2> 15376 T1151 C49 P22867 oasc.CachingDirectoryFactory.close Releasing directory:/usr/home/hudson/hudson-slave/workspace/Lucene-Solr-Tests-trunk-java7/solr/build/solr-core/test/J0/./org.apache.solr.cloud.BasicDistributedZkTest-1359698759685/jetty3/index.20130201120615026
[junit4:junit4]   2> 15376 T1151 C49 P22867 oasc.CachingDirectoryFactory.close Releasing directory:/usr/home/hudson/hudson-slave/workspace/Lucene-Solr-Tests-trunk-java7/solr/build/solr-core/test/J0/./org.apache.solr.cloud.BasicDistributedZkTest-1359698759685/jetty3/index
[junit4:junit4]   2> 15376 T1151 C49 P22867 oasc.RecoveryStrategy.replay No replay needed. core=collection1
[junit4:junit4]   2> 15376 T1151 C49 P22867 oasc.RecoveryStrategy.doRecovery Replication Recovery was successful - registering as Active. core=collection1
[junit4:junit4]   2> 15376 T1151 C49 P22867 oasc.ZkController.publish publishing core=collection1 state=active
[junit4:junit4]   2> 15377 T1151 C49 P22867 oasc.ZkController.publish numShards not found on descriptor - reading it from system property
[junit4:junit4]   2> 15384 T1151 C49 P22867 oasc.RecoveryStrategy.doRecovery Finished recovery process. core=collection1
[junit4:junit4]   2> 15654 T1077 oascc.ZkStateReader.updateClusterState Updating cloud state from ZooKeeper... 
[junit4:junit4]   2> 15885 T1100 oascc.ZkStateReader.updateClusterState Updating cloud state from ZooKeeper... 
[junit4:junit4]   2> 15886 T1100 oasc.Overseer$ClusterStateUpdater.updateState Update state numShards=2 message={
[junit4:junit4]   2> 	  "operation":"state",
[junit4:junit4]   2> 	  "numShards":"2",
[junit4:junit4]   2> 	  "shard":"shard2",
[junit4:junit4]   2> 	  "roles":null,
[junit4:junit4]   2> 	  "state":"recovering",
[junit4:junit4]   2> 	  "core":"collection1",
[junit4:junit4]   2> 	  "collection":"collection1",
[junit4:junit4]   2> 	  "node_name":"127.0.0.1:22875_hh%2Fba",
[junit4:junit4]   2> 	  "base_url":"http://127.0.0.1:22875/hh/ba"}
[junit4:junit4]   2> 15944 T1100 oasc.Overseer$ClusterStateUpdater.updateState Update state numShards=2 message={
[junit4:junit4]   2> 	  "operation":"state",
[junit4:junit4]   2> 	  "numShards":"2",
[junit4:junit4]   2> 	  "shard":"shard1",
[junit4:junit4]   2> 	  "roles":null,
[junit4:junit4]   2> 	  "state":"active",
[junit4:junit4]   2> 	  "core":"collection1",
[junit4:junit4]   2> 	  "collection":"collection1",
[junit4:junit4]   2> 	  "node_name":"127.0.0.1:22867_hh%2Fba",
[junit4:junit4]   2> 	  "base_url":"http://127.0.0.1:22867/hh/ba"}
[junit4:junit4]   2> 15979 T1099 oascc.ZkStateReader$2.process A cluster state change: WatchedEvent state:SyncConnected type:NodeDataChanged path:/clusterstate.json, has occurred - updating... (live nodes size: 5)
[junit4:junit4]   2> 15979 T1164 oascc.ZkStateReader$2.process A cluster state change: WatchedEvent state:SyncConnected type:NodeDataChanged path:/clusterstate.json, has occurred - updating... (live nodes size: 5)
[junit4:junit4]   2> 15979 T1133 oascc.ZkStateReader$2.process A cluster state change: WatchedEvent state:SyncConnected type:NodeDataChanged path:/clusterstate.json, has occurred - updating... (live nodes size: 5)
[junit4:junit4]   2> 15979 T1105 oascc.ZkStateReader$2.process A cluster state change: WatchedEvent state:SyncConnected type:NodeDataChanged path:/clusterstate.json, has occurred - updating... (live nodes size: 5)
[junit4:junit4]   2> 15979 T1148 oascc.ZkStateReader$2.process A cluster state change: WatchedEvent state:SyncConnected type:NodeDataChanged path:/clusterstate.json, has occurred - updating... (live nodes size: 5)
[junit4:junit4]   2> 15979 T1118 oascc.ZkStateReader$2.process A cluster state change: WatchedEvent state:SyncConnected type:NodeDataChanged path:/clusterstate.json, has occurred - updating... (live nodes size: 5)
[junit4:junit4]   2> 16657 T1077 oascc.ZkStateReader.updateClusterState Updating cloud state from ZooKeeper... 
[junit4:junit4]   2> 17660 T1077 oascc.ZkStateReader.updateClusterState Updating cloud state from ZooKeeper... 
[junit4:junit4]   2>  C50_STATE=coll:collection1 core:collection1 props:{shard=shard2, roles=null, state=recovering, core=collection1, collection=collection1, node_name=127.0.0.1:22875_hh%2Fba, base_url=http://127.0.0.1:22875/hh/ba}
[junit4:junit4]   2> 18650 T1167 C50 P22875 oasc.RecoveryStrategy.doRecovery Attempting to PeerSync from http://127.0.0.1:22862/hh/ba/collection1/ core=collection1 - recoveringAfterStartup=true
[junit4:junit4]   2> 18650 T1167 C50 P22875 oasu.PeerSync.sync PeerSync: core=collection1 url=http://127.0.0.1:22875/hh/ba START replicas=[http://127.0.0.1:22862/hh/ba/collection1/] nUpdates=100
[junit4:junit4]   2> 18651 T1167 C50 P22875 oasu.PeerSync.sync WARNING no frame of reference to tell of we've missed updates
[junit4:junit4]   2> 18651 T1167 C50 P22875 oasc.RecoveryStrategy.doRecovery PeerSync Recovery was not successful - trying replication. core=collection1
[junit4:junit4]   2> 18651 T1167 C50 P22875 oasc.RecoveryStrategy.doRecovery Starting Replication Recovery. core=collection1
[junit4:junit4]   2> 18651 T1167 C50 P22875 oasc.RecoveryStrategy.doRecovery Begin buffering updates. core=collection1
[junit4:junit4]   2> 18651 T1167 C50 P22875 oasu.UpdateLog.bufferUpdates Starting to buffer updates. FSUpdateLog{state=ACTIVE, tlog=null}
[junit4:junit4]   2> 18651 T1167 C50 P22875 oasc.RecoveryStrategy.replicate Attempting to replicate from http://127.0.0.1:22862/hh/ba/collection1/. core=collection1
[junit4:junit4]   2> 18652 T1167 C50 P22875 oascsi.HttpClientUtil.createClient Creating new http client, config:maxConnections=128&maxConnectionsPerHost=32&followRedirects=false
[junit4:junit4]   2> ASYNC  NEW_CORE C52 name=collection1 org.apache.solr.core.SolrCore@12ae53be url=http://127.0.0.1:22862/hh/ba/collection1 node=127.0.0.1:22862_hh%2Fba C52_STATE=coll:collection1 core:collection1 props:{shard=shard2, roles=null, state=active, core=collection1, collection=collection1, node_name=127.0.0.1:22862_hh%2Fba, base_url=http://127.0.0.1:22862/hh/ba, leader=true}
[junit4:junit4]   2> 18662 T1124 C52 P22862 REQ /get {getVersions=100&distrib=false&wt=javabin&qt=/get&version=2} status=0 QTime=0 
[junit4:junit4]   2> 18663 T1077 oascc.ZkStateReader.updateClusterState Updating cloud state from ZooKeeper... 
[junit4:junit4]   2> 18669 T1125 C52 P22862 oasu.DirectUpdateHandler2.commit start commit{,optimize=false,openSearcher=false,waitSearcher=true,expungeDeletes=false,softCommit=false}
[junit4:junit4]   2> 18670 T1125 C52 P22862 oasc.CachingDirectoryFactory.close Releasing directory:/usr/home/hudson/hudson-slave/workspace/Lucene-Solr-Tests-trunk-java7/solr/build/solr-core/test/J0/./org.apache.solr.cloud.BasicDistributedZkTest-1359698759685/jetty2
[junit4:junit4]   2> 18674 T1125 C52 P22862 oasc.SolrDeletionPolicy.onInit SolrDeletionPolicy.onInit: commits:num=1
[junit4:junit4]   2> 		commit{dir=RateLimitedDirectoryWrapper(org.apache.lucene.store.NIOFSDirectory@/usr/home/hudson/hudson-slave/workspace/Lucene-Solr-Tests-trunk-java7/solr/build/solr-core/test/J0/org.apache.solr.cloud.BasicDistributedZkTest-1359698759685/jetty2/index lockFactory=org.apache.lucene.store.NativeFSLockFactory@66e0f67),segFN=segments_1,generation=1,filenames=[segments_1]
[junit4:junit4]   2> 18675 T1125 C52 P22862 oasc.SolrDeletionPolicy.updateCommits newest commit = 1[segments_1]
[junit4:junit4]   2> 18678 T1125 C52 P22862 oasc.SolrDeletionPolicy.onCommit SolrDeletionPolicy.onCommit: commits:num=2
[junit4:junit4]   2> 		commit{dir=RateLimitedDirectoryWrapper(org.apache.lucene.store.NIOFSDirectory@/usr/home/hudson/hudson-slave/workspace/Lucene-Solr-Tests-trunk-java7/solr/build/solr-core/test/J0/org.apache.solr.cloud.BasicDistributedZkTest-1359698759685/jetty2/index lockFactory=org.apache.lucene.store.NativeFSLockFactory@66e0f67),segFN=segments_1,generation=1,filenames=[segments_1]
[junit4:junit4]   2> 		commit{dir=RateLimitedDirectoryWrapper(org.apache.lucene.store.NIOFSDirectory@/usr/home/hudson/hudson-slave/workspace/Lucene-Solr-Tests-trunk-java7/solr/build/solr-core/test/J0/org.apache.solr.cloud.BasicDistributedZkTest-1359698759685/jetty2/index lockFactory=org.apache.lucene.store.NativeFSLockFactory@66e0f67),segFN=segments_2,generation=2,filenames=[segments_2]
[junit4:junit4]   2> 18678 T1125 C52 P22862 oasc.SolrDeletionPolicy.updateCommits newest commit = 2[segments_2]
[junit4:junit4]   2> 18680 T1125 C52 P22862 oasc.CachingDirectoryFactory.close Releasing directory:/usr/home/hudson/hudson-slave/workspace/Lucene-Solr-Tests-trunk-java7/solr/build/solr-core/test/J0/./org.apache.solr.cloud.BasicDistributedZkTest-1359698759685/jetty2
[junit4:junit4]   2> 18680 T1125 C52 P22862 oass.SolrIndexSearcher.<init> Opening Searcher@152df512 realtime
[junit4:junit4]   2> 18680 T1125 C52 P22862 oasu.DirectUpdateHandler2.commit end_commit_flush
[junit4:junit4]   2> 18681 T1125 C52 P22862 /update {waitSearcher=true&openSearcher=false&commit=true&wt=javabin&commit_end_point=true&version=2&softCommit=false} {commit=} 0 12
[junit4:junit4]   2> 18682 T1167 C50 P22875 oash.ReplicationHandler.inform Commits will be reserved for  10000
[junit4:junit4]   2> 18682 T1167 C50 P22875 oash.SnapPuller.<init>  No value set for 'pollInterval'. Timer Task not started.
[junit4:junit4]   2> 18684 T1126 C52 P22862 oash.ReplicationHandler.inform Commits will be reserved for  10000
[junit4:junit4]   2> 18684 T1126 C52 P22862 REQ /replication {command=indexversion&qt=/replication&wt=javabin&version=2} status=0 QTime=1 
[junit4:junit4]   2> 18685 T1167 C50 P22875 oash.SnapPuller.fetchLatestIndex Master's generation: 2
[junit4:junit4]   2> 18685 T1167 C50 P22875 oash.SnapPuller.fetchLatestIndex Slave's generation: 1
[junit4:junit4]   2> 18685 T1167 C50 P22875 oash.SnapPuller.fetchLatestIndex Starting replication process
[junit4:junit4]   2> 18687 T1126 C52 P22862 oasc.CachingDirectoryFactory.close Releasing directory:/usr/home/hudson/hudson-slave/workspace/Lucene-Solr-Tests-trunk-java7/solr/build/solr-core/test/J0/./org.apache.solr.cloud.BasicDistributedZkTest-1359698759685/jetty2
[junit4:junit4]   2> 18688 T1126 C52 P22862 oasc.CachingDirectoryFactory.close Releasing directory:/usr/home/hudson/hudson-slave/workspace/Lucene-Solr-Tests-trunk-java7/solr/build/solr-core/test/J0/./org.apache.solr.cloud.BasicDistributedZkTest-1359698759685/jetty2/index
[junit4:junit4]   2> 18688 T1126 C52 P22862 REQ /replication {command=filelist&qt=/replication&wt=javabin&generation=2&version=2} status=0 QTime=1 
[junit4:junit4]   2> 18689 T1167 C50 P22875 oash.SnapPuller.fetchLatestIndex Number of files in latest index in master: 1
[junit4:junit4]   2> 18690 T1167 C50 P22875 oasc.CachingDirectoryFactory.get return new directory for /usr/home/hudson/hudson-slave/workspace/Lucene-Solr-Tests-trunk-java7/solr/build/solr-core/test/J0/./org.apache.solr.cloud.BasicDistributedZkTest-1359698759685/jetty4/index.20130201120618368 forceNew:false
[junit4:junit4]   2> 18691 T1167 C50 P22875 oasc.CachingDirectoryFactory.close Releasing directory:/usr/home/hudson/hudson-slave/workspace/Lucene-Solr-Tests-trunk-java7/solr/build/solr-core/test/J0/./org.apache.solr.cloud.BasicDistributedZkTest-1359698759685/jetty4
[junit4:junit4]   2> 18691 T1167 C50 P22875 oash.SnapPuller.fetchLatestIndex Starting download to RateLimitedDirectoryWrapper(org.apache.lucene.store.NIOFSDirectory@/usr/home/hudson/hudson-slave/workspace/Lucene-Solr-Tests-trunk-java7/solr/build/solr-core/test/J0/org.apache.solr.cloud.BasicDistributedZkTest-1359698759685/jetty4/index.20130201120618368 lockFactory=org.apache.lucene.store.NativeFSLockFactory@69a7fa06) fullCopy=true
[junit4:junit4]   2> 18694 T1126 C52 P22862 REQ /replication {file=segments_2&command=filecontent&checksum=true&wt=filestream&qt=/replication&generation=2} status=0 QTime=0 
[junit4:junit4]   2> 18696 T1167 C50 P22875 oasc.CachingDirectoryFactory.close Releasing directory:/usr/home/hudson/hudson-slave/workspace/Lucene-Solr-Tests-trunk-java7/solr/build/solr-core/test/J0/./org.apache.solr.cloud.BasicDistributedZkTest-1359698759685/jetty4/index
[junit4:junit4]   2> 18696 T1167 C50 P22875 oash.SnapPuller.fetchLatestIndex Total time taken for download : 0 secs
[junit4:junit4]   2> 18696 T1167 C50 P22875 oash.SnapPuller.modifyIndexProps New index installed. Updating index properties... index=index.20130201120618368
[junit4:junit4]   2> 18698 T1167 C50 P22875 oasc.CachingDirectoryFactory.close Releasing directory:/usr/home/hudson/hudson-slave/workspace/Lucene-Solr-Tests-trunk-java7/solr/build/solr-core/test/J0/./org.apache.solr.cloud.BasicDistributedZkTest-1359698759685/jetty4
[junit4:junit4]   2> 18698 T1167 C50 P22875 oasc.CachingDirectoryFactory.close Releasing directory:/usr/home/hudson/hudson-slave/workspace/Lucene-Solr-Tests-trunk-java7/solr/build/solr-core/test/J0/./org.apache.solr.cloud.BasicDistributedZkTest-1359698759685/jetty4
[junit4:junit4]   2> 18698 T1167 C50 P22875 oasc.SolrCore.getNewIndexDir New index directory detected: old=./org.apache.solr.cloud.BasicDistributedZkTest-1359698759685/jetty4/index/ new=./org.apache.solr.cloud.BasicDistributedZkTest-1359698759685/jetty4/index.20130201120618368
[junit4:junit4]   2> 18702 T1167 C50 P22875 oasc.SolrDeletionPolicy.onInit SolrDeletionPolicy.onInit: commits:num=1
[junit4:junit4]   2> 		commit{dir=RateLimitedDirectoryWrapper(org.apache.lucene.store.NIOFSDirectory@/usr/home/hudson/hudson-slave/workspace/Lucene-Solr-Tests-trunk-java7/solr/build/solr-core/test/J0/org.apache.solr.cloud.BasicDistributedZkTest-1359698759685/jetty4/index.20130201120618368 lockFactory=org.apache.lucene.store.NativeFSLockFactory@69a7fa06),segFN=segments_2,generation=2,filenames=[segments_2]
[junit4:junit4]   2> 18702 T1167 C50 P22875 oasc.SolrDeletionPolicy.updateCommits newest commit = 2[segments_2]
[junit4:junit4]   2> 18703 T1167 C50 P22875 oasc.CachingDirectoryFactory.close Releasing directory:/usr/home/hudson/hudson-slave/workspace/Lucene-Solr-Tests-trunk-java7/solr/build/solr-core/test/J0/./org.apache.solr.cloud.BasicDistributedZkTest-1359698759685/jetty4
[junit4:junit4]   2> 18704 T1167 C50 P22875 oasu.DefaultSolrCoreState.newIndexWriter Creating new IndexWriter...
[junit4:junit4]   2> 18704 T1167 C50 P22875 oasu.DefaultSolrCoreState.newIndexWriter Waiting until IndexWriter is unused... core=collection1
[junit4:junit4]   2> 18704 T1167 C50 P22875 oasu.DefaultSolrCoreState.newIndexWriter Rollback old IndexWriter... core=collection1
[junit4:junit4]   2> 18705 T1167 C50 P22875 oasc.CachingDirectoryFactory.close Releasing directory:/usr/home/hudson/hudson-slave/workspace/Lucene-Solr-Tests-trunk-java7/solr/build/solr-core/test/J0/./org.apache.solr.cloud.BasicDistributedZkTest-1359698759685/jetty4/index.20130201120618368
[junit4:junit4]   2> 18706 T1167 C50 P22875 oasc.CachingDirectoryFactory.close Releasing directory:/usr/home/hudson/hudson-slave/workspace/Lucene-Solr-Tests-trunk-java7/solr/build/solr-core/test/J0/./org.apache.solr.cloud.BasicDistributedZkTest-1359698759685/jetty4
[junit4:junit4]   2> 18709 T1167 C50 P22875 oasc.SolrDeletionPolicy.onInit SolrDeletionPolicy.onInit: commits:num=1
[junit4:junit4]   2> 		commit{dir=RateLimitedDirectoryWrapper(org.apache.lucene.store.NIOFSDirectory@/usr/home/hudson/hudson-slave/workspace/Lucene-Solr-Tests-trunk-java7/solr/build/solr-core/test/J0/org.apache.solr.cloud.BasicDistributedZkTest-1359698759685/jetty4/index.20130201120618368 lockFactory=org.apache.lucene.store.NativeFSLockFactory@69a7fa06),segFN=segments_2,generation=2,filenames=[segments_2]
[junit4:junit4]   2> 18709 T1167 C50 P22875 oasc.SolrDeletionPolicy.updateCommits newest commit = 2[segments_2]
[junit4:junit4]   2> 18709 T1167 C50 P22875 oasu.DefaultSolrCoreState.newIndexWriter New IndexWriter is ready to be used.
[junit4:junit4]   2> 18710 T1167 C50 P22875 oasc.CachingDirectoryFactory.close Releasing directory:/usr/home/hudson/hudson-slave/workspace/Lucene-Solr-Tests-trunk-java7/solr/build/solr-core/test/J0/./org.apache.solr.cloud.BasicDistributedZkTest-1359698759685/jetty4
[junit4:junit4]   2> 18710 T1167 C50 P22875 oass.SolrIndexSearcher.<init> Opening Searcher@667787a6 main
[junit4:junit4]   2> 18712 T1166 oasc.SolrCore.registerSearcher [collection1] Registered new searcher Searcher@667787a6 main{StandardDirectoryReader(segments_2:1:nrt)}
[junit4:junit4]   2> 18712 T1166 oasc.CachingDirectoryFactory.close Releasing directory:/usr/home/hudson/hudson-slave/workspace/Lucene-Solr-Tests-trunk-java7/solr/build/solr-core/test/J0/./org.apache.solr.cloud.BasicDistributedZkTest-1359698759685/jetty4/index
[junit4:junit4]   2> 18712 T1167 C50 P22875 oasu.DirectUpdateHandler2.commit start commit{,optimize=false,openSearcher=false,waitSearcher=false,expungeDeletes=false,softCommit=false}
[junit4:junit4]   2> 18715 T1167 C50 P22875 oasc.SolrDeletionPolicy.onCommit SolrDeletionPolicy.onCommit: commits:num=2
[junit4:junit4]   2> 		commit{dir=RateLimitedDirectoryWrapper(org.apache.lucene.store.NIOFSDirectory@/usr/home/hudson/hudson-slave/workspace/Lucene-Solr-Tests-trunk-java7/solr/build/solr-core/test/J0/org.apache.solr.cloud.BasicDistributedZkTest-1359698759685/jetty4/index.20130201120618368 lockFactory=org.apache.lucene.store.NativeFSLockFactory@69a7fa06),segFN=segments_2,generation=2,filenames=[segments_2]
[junit4:junit4]   2> 		commit{dir=RateLimitedDirectoryWrapper(org.apache.lucene.store.NIOFSDirectory@/usr/home/hudson/hudson-slave/workspace/Lucene-Solr-Tests-trunk-java7/solr/build/solr-core/test/J0/org.apache.solr.cloud.BasicDistributedZkTest-1359698759685/jetty4/index.20130201120618368 lockFactory=org.apache.lucene.store.NativeFSLockFactory@69a7fa06),segFN=segments_3,generation=3,filenames=[segments_3]
[junit4:junit4]   2> 18715 T1167 C50 P22875 oasc.SolrDeletionPolicy.updateCommits newest commit = 3[segments_3]
[junit4:junit4]   2> 18716 T1167 C50 P22875 oasc.CachingDirectoryFactory.close Releasing directory:/usr/home/hudson/hudson-slave/workspace/Lucene-Solr-Tests-trunk-java7/solr/build/solr-core/test/J0/./org.apache.solr.cloud.BasicDistributedZkTest-1359698759685/jetty4
[junit4:junit4]   2> 18716 T1167 C50 P22875 oasu.DirectUpdateHandler2.commit end_commit_flush
[junit4:junit4]   2> 18716 T1167 C50 P22875 oasc.CachingDirectoryFactory.close Releasing directory:/usr/home/hudson/hudson-slave/workspace/Lucene-Solr-Tests-trunk-java7/solr/build/solr-core/test/J0/./org.apache.solr.cloud.BasicDistributedZkTest-1359698759685/jetty4/index.20130201120618368
[junit4:junit4]   2> 18717 T1167 C50 P22875 oasc.CachingDirectoryFactory.close Releasing directory:/usr/home/hudson/hudson-slave/workspace/Lucene-Solr-Tests-trunk-java7/solr/build/solr-core/test/J0/./org.apache.solr.cloud.BasicDistributedZkTest-1359698759685/jetty4/index
[junit4:junit4]   2> 18717 T1167 C50 P22875 oasc.RecoveryStrategy.replay No replay needed. core=collection1
[junit4:junit4]   2> 18717 T1167 C50 P22875 oasc.RecoveryStrategy.doRecovery Replication Recovery was successful - registering as Active. core=collection1
[junit4:junit4]   2> 18717 T1167 C50 P22875 oasc.ZkController.publish publishing core=collection1 state=active
[junit4:junit4]   2> 18717 T1167 C50 P22875 oasc.ZkController.publish numShards not found on descriptor - reading it from system property
[junit4:junit4]   2> 18725 T1167 C50 P22875 oasc.RecoveryStrategy.doRecovery Finished recovery process. core=collection1
[junit4:junit4]   2> 18990 T1100 oascc.ZkStateReader.updateClusterState Updating cloud state from ZooKeeper... 
[junit4:junit4]   2> 18991 T1100 oasc.Overseer$ClusterStateUpdater.updateState Update state numShards=2 message={
[junit4:junit4]   2> 	  "operation":"state",
[junit4:junit4]   2> 	  "numShards":"2",
[junit4:junit4]   2> 	  "shard":"shard2",
[junit4:junit4]   2> 	  "roles":null,
[junit4:junit4]   2> 	  "state":"active",
[junit4:junit4]   2> 	  "core":"collection1",
[junit4:junit4]   2> 	  "collection":"collection1",
[junit4:junit4]   2> 	  "node_name":"127.0.0.1:22875_hh%2Fba",
[junit4:junit4]   2> 	  "base_url":"http://127.0.0.1:22875/hh/ba"}
[junit4:junit4]   2> 19007 T1099 oascc.ZkStateReader$2.process A cluster state change: WatchedEvent state:SyncConnected type:NodeDataChanged path:/clusterstate.json, has occurred - updating... (live nodes size: 5)
[junit4:junit4]   2> 19007 T1118 oascc.ZkStateReader$2.process A cluster state change: WatchedEvent state:SyncConnected type:NodeDataChanged path:/clusterstate.json, has occurred - updating... (live nodes size: 5)
[junit4:junit4]   2> 19007 T1148 oascc.ZkStateReader$2.process A cluster state change: WatchedEvent state:SyncConnected type:NodeDataChanged path:/clusterstate.json, has occurred - updating... (live nodes size: 5)
[junit4:junit4]   2> 19007 T1105 oascc.ZkStateReader$2.process A cluster state change: WatchedEvent state:SyncConnected type:NodeDataChanged path:/clusterstate.json, has occurred - updating... (live nodes size: 5)
[junit4:junit4]   2> 19007 T1133 oascc.ZkStateReader$2.process A cluster state change: WatchedEvent state:SyncConnected type:NodeDataChanged path:/clusterstate.json, has occurred - updating... (live nodes size: 5)
[junit4:junit4]   2> 19007 T1164 oascc.ZkStateReader$2.process A cluster state change: WatchedEvent state:SyncConnected type:NodeDataChanged path:/clusterstate.json, has occurred - updating... (live nodes size: 5)
[junit4:junit4]   2> 19666 T1077 oascc.ZkStateReader.updateClusterState Updating cloud state from ZooKeeper... 
[junit4:junit4]   2> 19668 T1077 oasc.AbstractDistribZkTestBase.waitForRecoveriesToFinish Recoveries finished - collection: collection1
[junit4:junit4]   2> ASYNC  NEW_CORE C53 name=collection1 org.apache.solr.core.SolrCore@4bfd274e url=http://127.0.0.1:22850/hh/ba/collection1 node=127.0.0.1:22850_hh%2Fba C53_STATE=coll:control_collection core:collection1 props:{shard=shard1, roles=null, state=active, core=collection1, collection=control_collection, node_name=127.0.0.1:22850_hh%2Fba, base_url=http://127.0.0.1:22850/hh/ba, leader=true}
[junit4:junit4]   2> 19680 T1089 C53 P22850 oasc.CachingDirectoryFactory.close Releasing directory:/usr/home/hudson/hudson-slave/workspace/Lucene-Solr-Tests-trunk-java7/solr/build/solr-core/test/J0/./org.apache.solr.cloud.BasicDistributedZkTest-1359698759685/control/data
[junit4:junit4]   2> 19685 T1089 C53 P22850 oasc.SolrDeletionPolicy.onInit SolrDeletionPolicy.onInit: commits:num=1
[junit4:junit4]   2> 		commit{dir=RateLimitedDirectoryWrapper(org.apache.lucene.store.NIOFSDirectory@/usr/home/hudson/hudson-slave/workspace/Lucene-Solr-Tests-trunk-java7/solr/build/solr-core/test/J0/org.apache.solr.cloud.BasicDistributedZkTest-1359698759685/control/data/index lockFactory=org.apache.lucene.store.NativeFSLockFactory@6e604bcd),segFN=segments_1,generation=1,filenames=[segments_1]
[junit4:junit4]   2> 19685 T1089 C53 P22850 oasc.SolrDeletionPolicy.updateCommits newest commit = 1[segments_1]
[junit4:junit4]   2> 19687 T1089 C53 P22850 oasc.CachingDirectoryFactory.close Releasing directory:/usr/home/hudson/hudson-slave/workspace/Lucene-Solr-Tests-trunk-java7/solr/build/solr-core/test/J0/./org.apache.solr.cloud.BasicDistributedZkTest-1359698759685/control/data
[junit4:junit4]   2> 19687 T1089 C53 P22850 oass.SolrIndexSearcher.<init> Opening Searcher@f5cf657 realtime
[junit4:junit4]   2> 19688 T1089 C53 P22850 /update {wt=javabin&version=2} {deleteByQuery=*:* (-1425747507264094208)} 0 9
[junit4:junit4]   2> 19692 T1127 C52 P22862 oasc.CachingDirectoryFactory.close Releasing directory:/usr/home/hudson/hudson-slave/workspace/Lucene-Solr-Tests-trunk-java7/solr/build/solr-core/test/J0/./org.apache.solr.cloud.BasicDistributedZkTest-1359698759685/jetty2
[junit4:junit4]   2> 19697 T1112 C51 P22854 oasc.CachingDirectoryFactory.close Releasing directory:/usr/home/hudson/hudson-slave/workspace/Lucene-Solr-Tests-trunk-java7/solr/build/solr-core/test/J0/./org.apache.solr.cloud.BasicDistributedZkTest-1359698759685/jetty1
[junit4:junit4]   2>  C50_STATE=coll:collection1 core:collection1 props:{shard=shard2, roles=null, state=active, core=collection1, collection=collection1, node_name=127.0.0.1:22875_hh%2Fba, base_url=http://127.0.0.1:22875/hh/ba}
[junit4:junit4]   2> 19705 T1154 C50 P22875 oasc.CachingDirectoryFactory.close Releasing directory:/usr/home/hudson/hudson-slave/workspace/Lucene-Solr-Tests-trunk-java7/solr/build/solr-core/test/J0/./org.apache.solr.cloud.BasicDistributedZkTest-1359698759685/jetty4
[junit4:junit4]   2> 19705 T1154 C50 P22875 /update {update.distrib=FROMLEADER&_version_=-1425747507275628544&update.from=http://127.0.0.1:22862/hh/ba/collection1/&wt=javabin&version=2} {deleteByQuery=*:* (-1425747507275628544)} 0 2
[junit4:junit4]   2>  C49_STATE=coll:collection1 core:collection1 props:{shard=shard1, roles=null, state=active, core=collection1, collection=collection1, node_name=127.0.0.1:22867_hh%2Fba, base_url=http://127.0.0.1:22867/hh/ba}
[junit4:junit4]   2> 19709 T1138 C49 P22867 oasc.CachingDirectoryFactory.close Releasing directory:/usr/home/hudson/hudson-slave/workspace/Lucene-Solr-Tests-trunk-java7/solr/build/solr-core/test/J0/./org.apache.solr.cloud.BasicDistributedZkTest-1359698759685/jetty3
[junit4:junit4]   2> 19710 T1138 C49 P22867 /update {update.distrib=FROMLEADER&_version_=-1425747507280871424&update.from=http://127.0.0.1:22854/hh/ba/collection1/&wt=javabin&version=2} {deleteByQuery=*:* (-1425747507280871424)} 0 3
[junit4:junit4]   2> 19711 T1112 C51 P22854 /update {update.distrib=TOLEADER&wt=javabin&version=2} {deleteByQuery=*:* (-1425747507280871424)} 0 16
[junit4:junit4]   2> 19712 T1127 C52 P22862 /update {wt=javabin&version=2} {deleteByQuery=*:* (-1425747507275628544)} 0 21
[junit4:junit4]   2> 19722 T1089 C53 P22850 /update {wt=javabin&version=2} {add=[1 (1425747507306037248)]} 0 4
[junit4:junit4]   2> 19734 T1138 C49 P22867 /update {distrib.from=http://127.0.0.1:22854/hh/ba/collection1/&update.distrib=FROMLEADER&wt=javabin&version=2} {add=[1 (1425747507312328704)]} 0 4
[junit4:junit4]   2> 19734 T1113 C51 P22854 /update {wt=javabin&version=2} {add=[1 (1425747507312328704)]} 0 10
[junit4:junit4]   2> 19739 T1089 C53 P22850 /update {wt=javabin&version=2} {add=[2 (1425747507325960192)]} 0 2
[junit4:junit4]   2> 19758 T1154 C50 P22875 /update {distrib.from=http://127.0.0.1:22862/hh/ba/collection1/&update.distrib=FROMLEADER&wt=javabin&version=2} {add=[2 (1425747507337494528)]} 0 4
[junit4:junit4]   2> 19758 T1128 C52 P22862 /update {distrib.from=http://127.0.0.1:22854/hh/ba/collection1/&update.distrib=TOLEADER&wt=javabin&version=2} {add=[2 (1425747507337494528)]} 0 9
[junit4:junit4]   2> 19759 T1113 C51 P22854 /update {wt=javabin&version=2} {add=[2]} 0 17
[junit4:junit4]   2> 19764 T1089 C53 P22850 /update {wt=javabin&version=2} {add=[3 (1425747507351126016)]} 0 2
[junit4:junit4]   2> 19775 T1154 C50 P22875 /update {distrib.from=http://127.0.0.1:22862/hh/ba/collection1/&update.distrib=FROMLEADER&wt=javabin&version=2} {add=[3 (1425747507359514624)]} 0 2
[junit4:junit4]   2> 19775 T1128 C52 P22862 /update {distrib.from=http://127.0.0.1:22854/hh/ba/collection1/&update.distrib=TOLEADER&wt=javabin&version=2} {add=[3 (1425747507359514624)]} 0 6
[junit4:junit4]   2> 19776 T1113 C51 P22854 /update {wt=javabin&version=2} {add=[3]} 0 10
[junit4:junit4]   2> 19781 T1089 C53 P22850 /update {wt=javabin&version=2} {add=[4 (1425747507368951808)]} 0 2
[junit4:junit4]   2> 19789 T1138 C49 P22867 /update {distrib.from=http://127.0.0.1:22854/hh/ba/collection1/&update.distrib=FROMLEADER&wt=javabin&version=2} {add=[4 (1425747507373146112)]} 0 2
[junit4:junit4]   2> 19790 T1113 C51 P22854 /update {wt=javabin&version=2} {add=[4 (1425747507373146112)]} 0 7
[junit4:junit4]   2> 19795 T1089 C53 P22850 /update {wt=javabin&version=2} {add=[5 (1425747507383631872)]} 0 2
[junit4:junit4]   2> 19807 T1154 C50 P22875 /update {distrib.from=http://127.0.0.1:22862/hh/ba/collection1/&update.distrib=FROMLEADER&wt=javabin&version=2} {add=[5 (1425747507392020480)]} 0 2
[junit4:junit4]   2> 19807 T1128 C52 P22862 /update {distrib.from=http://127.

[...truncated too long message...]

> 	at org.apache.solr.cloud.AbstractDistribZkTestBase.waitForRecoveriesToFinish(AbstractDistribZkTestBase.java:126)
[junit4:junit4]    > 	at org.apache.solr.cloud.AbstractDistribZkTestBase.waitForRecoveriesToFinish(AbstractDistribZkTestBase.java:121)
[junit4:junit4]    > 	at org.apache.solr.cloud.BasicDistributedZkTest.testCoreUnloadAndLeaders(BasicDistributedZkTest.java:586)
[junit4:junit4]    > 	at org.apache.solr.cloud.BasicDistributedZkTest.doTest(BasicDistributedZkTest.java:337)
[junit4:junit4]    > 	at org.apache.solr.BaseDistributedSearchTestCase.testDistribSearch(BaseDistributedSearchTestCase.java:794)
[junit4:junit4]    > 	at sun.reflect.NativeMethodAccessorImpl.invoke0(Native Method)
[junit4:junit4]    > 	at sun.reflect.NativeMethodAccessorImpl.invoke(NativeMethodAccessorImpl.java:57)
[junit4:junit4]    > 	at sun.reflect.DelegatingMethodAccessorImpl.invoke(DelegatingMethodAccessorImpl.java:43)
[junit4:junit4]    > 	at java.lang.reflect.Method.invoke(Method.java:601)
[junit4:junit4]    > 	at com.carrotsearch.randomizedtesting.RandomizedRunner.invoke(RandomizedRunner.java:1559)
[junit4:junit4]    > 	at com.carrotsearch.randomizedtesting.RandomizedRunner.access$600(RandomizedRunner.java:79)
[junit4:junit4]    > 	at com.carrotsearch.randomizedtesting.RandomizedRunner$6.evaluate(RandomizedRunner.java:737)
[junit4:junit4]    > 	at com.carrotsearch.randomizedtesting.RandomizedRunner$7.evaluate(RandomizedRunner.java:773)
[junit4:junit4]    > 	at com.carrotsearch.randomizedtesting.RandomizedRunner$8.evaluate(RandomizedRunner.java:787)
[junit4:junit4]    > 	at com.carrotsearch.randomizedtesting.rules.SystemPropertiesRestoreRule$1.evaluate(SystemPropertiesRestoreRule.java:53)
[junit4:junit4]    > 	at org.apache.lucene.util.TestRuleSetupTeardownChained$1.evaluate(TestRuleSetupTeardownChained.java:50)
[junit4:junit4]    > 	at org.apache.lucene.util.TestRuleFieldCacheSanity$1.evaluate(TestRuleFieldCacheSanity.java:51)
[junit4:junit4]    > 	at org.apache.lucene.util.AbstractBeforeAfterRule$1.evaluate(AbstractBeforeAfterRule.java:46)
[junit4:junit4]    > 	at com.carrotsearch.randomizedtesting.rules.SystemPropertiesInvariantRule$1.evaluate(SystemPropertiesInvariantRule.java:55)
[junit4:junit4]    > 	at org.apache.lucene.util.TestRuleThreadAndTestName$1.evaluate(TestRuleThreadAndTestName.java:49)
[junit4:junit4]    > 	at org.apache.lucene.util.TestRuleIgnoreAfterMaxFailures$1.evaluate(TestRuleIgnoreAfterMaxFailures.java:70)
[junit4:junit4]    > 	at org.apache.lucene.util.TestRuleMarkFailure$1.evaluate(TestRuleMarkFailure.java:48)
[junit4:junit4]    > 	at com.carrotsearch.randomizedtesting.rules.StatementAdapter.evaluate(StatementAdapter.java:36)
[junit4:junit4]    > 	at com.carrotsearch.randomizedtesting.ThreadLeakControl$StatementRunner.run(ThreadLeakControl.java:358)
[junit4:junit4]    > 	at com.carrotsearch.randomizedtesting.ThreadLeakControl.forkTimeoutingTask(ThreadLeakControl.java:782)
[junit4:junit4]    > 	at com.carrotsearch.randomizedtesting.ThreadLeakControl$3.evaluate(ThreadLeakControl.java:442)
[junit4:junit4]    > 	at com.carrotsearch.randomizedtesting.RandomizedRunner.runSingleTest(RandomizedRunner.java:746)
[junit4:junit4]    > 	at com.carrotsearch.randomizedtesting.RandomizedRunner$3.evaluate(RandomizedRunner.java:648)
[junit4:junit4]    > 	at com.carrotsearch.randomizedtesting.RandomizedRunner$4.evaluate(RandomizedRunner.java:682)
[junit4:junit4]    > 	at com.carrotsearch.randomizedtesting.RandomizedRunner$5.evaluate(RandomizedRunner.java:693)
[junit4:junit4]    > 	at com.carrotsearch.randomizedtesting.rules.StatementAdapter.evaluate(StatementAdapter.java:36)
[junit4:junit4]    > 	at com.carrotsearch.randomizedtesting.rules.SystemPropertiesRestoreRule$1.evaluate(SystemPropertiesRestoreRule.java:53)
[junit4:junit4]    > 	at org.apache.lucene.util.AbstractBeforeAfterRule$1.evaluate(AbstractBeforeAfterRule.java:46)
[junit4:junit4]    > 	at org.apache.lucene.util.TestRuleStoreClassName$1.evaluate(TestRuleStoreClassName.java:42)
[junit4:junit4]    > 	at com.carrotsearch.randomizedtesting.rules.SystemPropertiesInvariantRule$1.evaluate(SystemPropertiesInvariantRule.java:55)
[junit4:junit4]    > 	at com.carrotsearch.randomizedtesting.rules.NoShadowingOrOverridesOnMethodsRule$1.evaluate(NoShadowingOrOverridesOnMethodsRule.java:39)
[junit4:junit4]    > 	at com.carrotsearch.randomizedtesting.rules.NoShadowingOrOverridesOnMethodsRule$1.evaluate(NoShadowingOrOverridesOnMethodsRule.java:39)
[junit4:junit4]    > 	at com.carrotsearch.randomizedtesting.rules.StatementAdapter.evaluate(StatementAdapter.java:36)
[junit4:junit4]    > 	at org.apache.lucene.util.TestRuleAssertionsRequired$1.evaluate(TestRuleAssertionsRequired.java:43)
[junit4:junit4]    > 	at org.apache.lucene.util.TestRuleMarkFailure$1.evaluate(TestRuleMarkFailure.java:48)
[junit4:junit4]    > 	at org.apache.lucene.util.TestRuleIgnoreAfterMaxFailures$1.evaluate(TestRuleIgnoreAfterMaxFailures.java:70)
[junit4:junit4]    > 	at org.apache.lucene.util.TestRuleIgnoreTestSuites$1.evaluate(TestRuleIgnoreTestSuites.java:55)
[junit4:junit4]    > 	at com.carrotsearch.randomizedtesting.rules.StatementAdapter.evaluate(StatementAdapter.java:36)
[junit4:junit4]    > 	at com.carrotsearch.randomizedtesting.ThreadLeakControl$StatementRunner.run(ThreadLeakControl.java:358)
[junit4:junit4]    > 	at java.lang.Thread.run(Thread.java:722)
[junit4:junit4]   2> 532016 T1077 oas.SolrTestCaseJ4.deleteCore ###deleteCore
[junit4:junit4]   2> NOTE: test params are: codec=Lucene41: {n_f1=Pulsing41(freqCutoff=6 minBlockSize=38 maxBlockSize=88), foo_b=MockFixedIntBlock(blockSize=1731), cat=PostingsFormat(name=NestedPulsing), foo_d=MockVariableIntBlock(baseBlockSize=104), foo_f=MockFixedIntBlock(blockSize=1731), n_tl1=Pulsing41(freqCutoff=6 minBlockSize=38 maxBlockSize=88), n_d1=PostingsFormat(name=NestedPulsing), rnd_b=MockVariableIntBlock(baseBlockSize=104), intDefault=Pulsing41(freqCutoff=6 minBlockSize=38 maxBlockSize=88), n_td1=Pulsing41(freqCutoff=6 minBlockSize=38 maxBlockSize=88), timestamp=PostingsFormat(name=NestedPulsing), id=MockVariableIntBlock(baseBlockSize=104), range_facet_sl=MockVariableIntBlock(baseBlockSize=104), range_facet_si=PostingsFormat(name=NestedPulsing), oddField_s=MockVariableIntBlock(baseBlockSize=104), sequence_i=MockVariableIntBlock(baseBlockSize=104), name=MockVariableIntBlock(baseBlockSize=104), foo_i=Pulsing41(freqCutoff=6 minBlockSize=38 maxBlockSize=88), regex_dup_B_s=PostingsFormat(name=NestedPulsing), multiDefault=PostingsFormat(name=NestedPulsing), n_tf1=PostingsFormat(name=NestedPulsing), n_dt1=Pulsing41(freqCutoff=6 minBlockSize=38 maxBlockSize=88), genre_s=MockVariableIntBlock(baseBlockSize=104), author_t=Pulsing41(freqCutoff=6 minBlockSize=38 maxBlockSize=88), n_ti1=MockVariableIntBlock(baseBlockSize=104), range_facet_l=PostingsFormat(name=NestedPulsing), text=MockFixedIntBlock(blockSize=1731), _version_=Pulsing41(freqCutoff=6 minBlockSize=38 maxBlockSize=88), val_i=MockVariableIntBlock(baseBlockSize=104), SubjectTerms_mfacet=Pulsing41(freqCutoff=6 minBlockSize=38 maxBlockSize=88), series_t=Pulsing41(freqCutoff=6 minBlockSize=38 maxBlockSize=88), a_t=PostingsFormat(name=NestedPulsing), n_tdt1=Pulsing41(freqCutoff=6 minBlockSize=38 maxBlockSize=88), regex_dup_A_s=MockFixedIntBlock(blockSize=1731), price=MockFixedIntBlock(blockSize=1731), other_tl1=Pulsing41(freqCutoff=6 minBlockSize=38 maxBlockSize=88), n_l1=PostingsFormat(name=NestedPulsing), a_si=Pulsing41(freqCutoff=6 minBlockSize=38 maxBlockSize=88), inStock=MockFixedIntBlock(blockSize=1731)}, sim=DefaultSimilarity, locale=sr_ME_#Latn, timezone=BST
[junit4:junit4]   2> NOTE: FreeBSD 9.0-RELEASE amd64/Oracle Corporation 1.7.0_09 (64-bit)/cpus=16,threads=1,free=300486144,total=523239424
[junit4:junit4]   2> NOTE: All tests run in this JVM: [ResponseLogComponentTest, TestXIncludeConfig, TestDefaultSimilarityFactory, FileBasedSpellCheckerTest, SolrCoreCheckLockOnStartupTest, TestFastOutputStream, DistanceFunctionTest, CacheHeaderTest, TestFiltering, MBeansHandlerTest, TermVectorComponentDistributedTest, SpellCheckCollatorTest, DistributedTermsComponentTest, TestRandomFaceting, TestQuerySenderNoQuery, TestConfig, RequestHandlersTest, TestWordDelimiterFilterFactory, DefaultValueUpdateProcessorTest, ChaosMonkeySafeLeaderTest, TestStressVersions, ChaosMonkeyNothingIsSafeTest, SyncSliceTest, TestCoreContainer, SolrPluginUtilsTest, TestAnalyzedSuggestions, TestIndexingPerformance, TestAtomicUpdateErrorCases, TestLuceneMatchVersion, FieldAnalysisRequestHandlerTest, TestExtendedDismaxParser, CSVRequestHandlerTest, CopyFieldTest, TestLFUCache, CoreAdminHandlerTest, SystemInfoHandlerTest, TestQueryTypes, NoCacheHeaderTest, TestJoin, SpatialFilterTest, SuggesterWFSTTest, BasicDistributedZkTest]
[junit4:junit4] Completed on J0 in 532.72s, 1 test, 1 failure <<< FAILURES!

[...truncated 80 lines...]
BUILD FAILED
/usr/home/hudson/hudson-slave/workspace/Lucene-Solr-Tests-trunk-java7/build.xml:346: The following error occurred while executing this line:
/usr/home/hudson/hudson-slave/workspace/Lucene-Solr-Tests-trunk-java7/build.xml:39: The following error occurred while executing this line:
/usr/home/hudson/hudson-slave/workspace/Lucene-Solr-Tests-trunk-java7/solr/build.xml:178: The following error occurred while executing this line:
/usr/home/hudson/hudson-slave/workspace/Lucene-Solr-Tests-trunk-java7/solr/common-build.xml:428: The following error occurred while executing this line:
/usr/home/hudson/hudson-slave/workspace/Lucene-Solr-Tests-trunk-java7/lucene/common-build.xml:1176: The following error occurred while executing this line:
/usr/home/hudson/hudson-slave/workspace/Lucene-Solr-Tests-trunk-java7/lucene/common-build.xml:841: There were test failures: 248 suites, 1037 tests, 1 failure, 23 ignored (5 assumptions)

Total time: 41 minutes 20 seconds
Build step 'Invoke Ant' marked build as failure
Archiving artifacts
Recording test results
Email was triggered for: Failure
Sending email for trigger: Failure



Mime
View raw message