lucene-dev mailing list archives

Site index · List index
Message view « Date » · « Thread »
Top « Date » · « Thread »
From Policeman Jenkins Server <jenk...@thetaphi.de>
Subject [JENKINS] Lucene-Solr-trunk-MacOSX (64bit/jdk1.6.0) - Build # 177 - Failure!
Date Sun, 03 Feb 2013 10:47:23 GMT
Build: http://jenkins.thetaphi.de/job/Lucene-Solr-trunk-MacOSX/177/
Java: 64bit/jdk1.6.0 -XX:+UseParallelGC

1 tests failed.
FAILED:  junit.framework.TestSuite.org.apache.solr.update.SoftAutoCommitTest

Error Message:
ERROR: SolrIndexSearcher opens=13 closes=12

Stack Trace:
java.lang.AssertionError: ERROR: SolrIndexSearcher opens=13 closes=12
	at __randomizedtesting.SeedInfo.seed([46F19C58A2CE7D28]:0)
	at org.junit.Assert.fail(Assert.java:93)
	at org.apache.solr.SolrTestCaseJ4.endTrackingSearchers(SolrTestCaseJ4.java:246)
	at org.apache.solr.SolrTestCaseJ4.afterClass(SolrTestCaseJ4.java:97)
	at sun.reflect.GeneratedMethodAccessor19.invoke(Unknown Source)
	at sun.reflect.DelegatingMethodAccessorImpl.invoke(DelegatingMethodAccessorImpl.java:25)
	at java.lang.reflect.Method.invoke(Method.java:597)
	at com.carrotsearch.randomizedtesting.RandomizedRunner.invoke(RandomizedRunner.java:1559)
	at com.carrotsearch.randomizedtesting.RandomizedRunner.access$600(RandomizedRunner.java:79)
	at com.carrotsearch.randomizedtesting.RandomizedRunner$5.evaluate(RandomizedRunner.java:700)
	at com.carrotsearch.randomizedtesting.rules.StatementAdapter.evaluate(StatementAdapter.java:36)
	at com.carrotsearch.randomizedtesting.rules.SystemPropertiesRestoreRule$1.evaluate(SystemPropertiesRestoreRule.java:53)
	at org.apache.lucene.util.AbstractBeforeAfterRule$1.evaluate(AbstractBeforeAfterRule.java:46)
	at org.apache.lucene.util.TestRuleStoreClassName$1.evaluate(TestRuleStoreClassName.java:42)
	at com.carrotsearch.randomizedtesting.rules.SystemPropertiesInvariantRule$1.evaluate(SystemPropertiesInvariantRule.java:55)
	at com.carrotsearch.randomizedtesting.rules.NoShadowingOrOverridesOnMethodsRule$1.evaluate(NoShadowingOrOverridesOnMethodsRule.java:39)
	at com.carrotsearch.randomizedtesting.rules.NoShadowingOrOverridesOnMethodsRule$1.evaluate(NoShadowingOrOverridesOnMethodsRule.java:39)
	at com.carrotsearch.randomizedtesting.rules.StatementAdapter.evaluate(StatementAdapter.java:36)
	at org.apache.lucene.util.TestRuleAssertionsRequired$1.evaluate(TestRuleAssertionsRequired.java:43)
	at org.apache.lucene.util.TestRuleMarkFailure$1.evaluate(TestRuleMarkFailure.java:48)
	at org.apache.lucene.util.TestRuleIgnoreAfterMaxFailures$1.evaluate(TestRuleIgnoreAfterMaxFailures.java:70)
	at org.apache.lucene.util.TestRuleIgnoreTestSuites$1.evaluate(TestRuleIgnoreTestSuites.java:55)
	at com.carrotsearch.randomizedtesting.rules.StatementAdapter.evaluate(StatementAdapter.java:36)
	at com.carrotsearch.randomizedtesting.ThreadLeakControl$StatementRunner.run(ThreadLeakControl.java:358)
	at java.lang.Thread.run(Thread.java:680)




Build Log:
[...truncated 8415 lines...]
[junit4:junit4] Suite: org.apache.solr.update.SoftAutoCommitTest
[junit4:junit4]   2> 1 T3629 oas.SolrTestCaseJ4.initCore ####initCore
[junit4:junit4]   2> Creating dataDir: /Users/jenkins/jenkins-slave/workspace/Lucene-Solr-trunk-MacOSX/solr/build/solr-core/test/J0/./solrtest-SoftAutoCommitTest-1359887594828
[junit4:junit4]   2> 2 T3629 oasc.SolrResourceLoader.<init> new SolrResourceLoader for directory: '/Users/jenkins/jenkins-slave/workspace/Lucene-Solr-trunk-MacOSX/solr/build/solr-core/test-files/solr/collection1/'
[junit4:junit4]   2> 3 T3629 oasc.SolrResourceLoader.replaceClassLoader Adding 'file:/Users/jenkins/jenkins-slave/workspace/Lucene-Solr-trunk-MacOSX/solr/build/solr-core/test-files/solr/collection1/lib/classes/' to classloader
[junit4:junit4]   2> 4 T3629 oasc.SolrResourceLoader.replaceClassLoader Adding 'file:/Users/jenkins/jenkins-slave/workspace/Lucene-Solr-trunk-MacOSX/solr/build/solr-core/test-files/solr/collection1/lib/README' to classloader
[junit4:junit4]   2> 132 T3629 oasc.SolrConfig.<init> Using Lucene MatchVersion: LUCENE_50
[junit4:junit4]   2> 261 T3629 oasc.SolrConfig.<init> Loaded SolrConfig: solrconfig.xml
[junit4:junit4]   2> 262 T3629 oass.IndexSchema.readSchema Reading Solr Schema
[junit4:junit4]   2> 268 T3629 oass.IndexSchema.readSchema Schema name=test
[junit4:junit4]   2> 1606 T3629 oass.OpenExchangeRatesOrgProvider.init Initialized with rates=open-exchange-rates.json, refreshInterval=1440.
[junit4:junit4]   2> 1618 T3629 oass.IndexSchema.readSchema default search field in schema is text
[junit4:junit4]   2> 1622 T3629 oass.IndexSchema.readSchema unique key field: id
[junit4:junit4]   2> 1631 T3629 oass.FileExchangeRateProvider.reload Reloading exchange rates from file currency.xml
[junit4:junit4]   2> 1636 T3629 oass.FileExchangeRateProvider.reload Reloading exchange rates from file currency.xml
[junit4:junit4]   2> 1640 T3629 oass.OpenExchangeRatesOrgProvider.reload Reloading exchange rates from open-exchange-rates.json
[junit4:junit4]   2> 1641 T3629 oass.OpenExchangeRatesOrgProvider.reload Reloading exchange rates from open-exchange-rates.json
[junit4:junit4]   2> 1642 T3629 oasc.SolrResourceLoader.locateSolrHome JNDI not configured for solr (NoInitialContextEx)
[junit4:junit4]   2> 1643 T3629 oasc.SolrResourceLoader.locateSolrHome using system property solr.solr.home: /Users/jenkins/jenkins-slave/workspace/Lucene-Solr-trunk-MacOSX/solr/build/solr-core/test-files/solr
[junit4:junit4]   2> 1643 T3629 oasc.SolrResourceLoader.<init> new SolrResourceLoader for directory: '/Users/jenkins/jenkins-slave/workspace/Lucene-Solr-trunk-MacOSX/solr/build/solr-core/test-files/solr/'
[junit4:junit4]   2> 1656 T3629 oasc.CoreContainer.<init> New CoreContainer 655319179
[junit4:junit4]   2> 1657 T3629 oasc.SolrCore.<init> [collection1] Opening new SolrCore at /Users/jenkins/jenkins-slave/workspace/Lucene-Solr-trunk-MacOSX/solr/build/solr-core/test-files/solr/collection1/, dataDir=/Users/jenkins/jenkins-slave/workspace/Lucene-Solr-trunk-MacOSX/solr/build/solr-core/test/J0/./solrtest-SoftAutoCommitTest-1359887594828/
[junit4:junit4]   2> 1657 T3629 oasc.JmxMonitoredMap.<init> JMX monitoring is enabled. Adding Solr mbeans to JMX Server: com.sun.jmx.mbeanserver.JmxMBeanServer@38a1aa85
[junit4:junit4]   2> 1657 T3629 oasc.SolrCore.initDirectoryFactory org.apache.solr.core.MockDirectoryFactory
[junit4:junit4]   2> 1658 T3629 oasc.CachingDirectoryFactory.get return new directory for /Users/jenkins/jenkins-slave/workspace/Lucene-Solr-trunk-MacOSX/solr/build/solr-core/test/J0/./solrtest-SoftAutoCommitTest-1359887594828 forceNew:false
[junit4:junit4]   2> 1659 T3629 oasc.CachingDirectoryFactory.close Releasing directory:/Users/jenkins/jenkins-slave/workspace/Lucene-Solr-trunk-MacOSX/solr/build/solr-core/test/J0/./solrtest-SoftAutoCommitTest-1359887594828
[junit4:junit4]   2> 1659 T3629 oasc.SolrCore.getNewIndexDir New index directory detected: old=null new=/Users/jenkins/jenkins-slave/workspace/Lucene-Solr-trunk-MacOSX/solr/build/solr-core/test/J0/./solrtest-SoftAutoCommitTest-1359887594828/index/
[junit4:junit4]   2> 1659 T3629 oasc.SolrCore.initIndex WARNING [collection1] Solr index directory '/Users/jenkins/jenkins-slave/workspace/Lucene-Solr-trunk-MacOSX/solr/build/solr-core/test/J0/./solrtest-SoftAutoCommitTest-1359887594828/index' doesn't exist. Creating new index...
[junit4:junit4]   2> 1660 T3629 oasc.CachingDirectoryFactory.get return new directory for /Users/jenkins/jenkins-slave/workspace/Lucene-Solr-trunk-MacOSX/solr/build/solr-core/test/J0/./solrtest-SoftAutoCommitTest-1359887594828/index forceNew:false
[junit4:junit4]   2> 1663 T3629 oasc.SolrDeletionPolicy.onCommit SolrDeletionPolicy.onCommit: commits:num=1
[junit4:junit4]   2> 		commit{dir=RateLimitedDirectoryWrapper(MockDirWrapper(org.apache.lucene.store.RAMDirectory@1c093f32 lockFactory=org.apache.lucene.store.NativeFSLockFactory@7481e656)),segFN=segments_1,generation=1,filenames=[segments_1]
[junit4:junit4]   2> 1664 T3629 oasc.SolrDeletionPolicy.updateCommits newest commit = 1[segments_1]
[junit4:junit4]   2> 1668 T3629 oasc.CachingDirectoryFactory.close Releasing directory:/Users/jenkins/jenkins-slave/workspace/Lucene-Solr-trunk-MacOSX/solr/build/solr-core/test/J0/./solrtest-SoftAutoCommitTest-1359887594828/index
[junit4:junit4]   2> 1670 T3629 oasc.SolrCore.initWriters created xml: solr.XMLResponseWriter
[junit4:junit4]   2> 1681 T3629 oasup.UpdateRequestProcessorChain.init inserting DistributedUpdateProcessorFactory into updateRequestProcessorChain "dedupe"
[junit4:junit4]   2> 1682 T3629 oasup.UpdateRequestProcessorChain.init inserting DistributedUpdateProcessorFactory into updateRequestProcessorChain "dedupe-allfields"
[junit4:junit4]   2> 1682 T3629 oasup.UpdateRequestProcessorChain.init inserting DistributedUpdateProcessorFactory into updateRequestProcessorChain "stored_sig"
[junit4:junit4]   2> 1683 T3629 oasup.UpdateRequestProcessorChain.init inserting DistributedUpdateProcessorFactory into updateRequestProcessorChain "uniq-fields"
[junit4:junit4]   2> 1683 T3629 oasup.UpdateRequestProcessorChain.init inserting DistributedUpdateProcessorFactory into updateRequestProcessorChain "distrib-dup-test-chain-implicit"
[junit4:junit4]   2> 1684 T3629 oasc.RequestHandlers.initHandlersFromConfig adding lazy requestHandler: solr.ReplicationHandler
[junit4:junit4]   2> 1684 T3629 oasc.RequestHandlers.initHandlersFromConfig created /replication: solr.ReplicationHandler
[junit4:junit4]   2> 1685 T3629 oasc.RequestHandlers.initHandlersFromConfig created standard: solr.StandardRequestHandler
[junit4:junit4]   2> 1686 T3629 oasc.RequestHandlers.initHandlersFromConfig created /get: solr.RealTimeGetHandler
[junit4:junit4]   2> 1686 T3629 oasc.RequestHandlers.initHandlersFromConfig created dismax: solr.SearchHandler
[junit4:junit4]   2> 1687 T3629 oasc.RequestHandlers.initHandlersFromConfig created mock: org.apache.solr.core.MockQuerySenderListenerReqHandler
[junit4:junit4]   2> 1688 T3629 oasc.RequestHandlers.initHandlersFromConfig created /admin/: org.apache.solr.handler.admin.AdminHandlers
[junit4:junit4]   2> 1688 T3629 oasc.RequestHandlers.initHandlersFromConfig created defaults: solr.StandardRequestHandler
[junit4:junit4]   2> 1688 T3629 oasc.RequestHandlers.initHandlersFromConfig adding lazy requestHandler: solr.StandardRequestHandler
[junit4:junit4]   2> 1689 T3629 oasc.RequestHandlers.initHandlersFromConfig created lazy: solr.StandardRequestHandler
[junit4:junit4]   2> 1690 T3629 oasc.RequestHandlers.initHandlersFromConfig created /update: solr.UpdateRequestHandler
[junit4:junit4]   2> 1691 T3629 oasc.RequestHandlers.initHandlersFromConfig created /terms: org.apache.solr.handler.component.SearchHandler
[junit4:junit4]   2> 1691 T3629 oasc.RequestHandlers.initHandlersFromConfig created spellCheckCompRH: org.apache.solr.handler.component.SearchHandler
[junit4:junit4]   2> 1692 T3629 oasc.RequestHandlers.initHandlersFromConfig created spellCheckCompRH_Direct: org.apache.solr.handler.component.SearchHandler
[junit4:junit4]   2> 1693 T3629 oasc.RequestHandlers.initHandlersFromConfig created spellCheckWithWordbreak: org.apache.solr.handler.component.SearchHandler
[junit4:junit4]   2> 1694 T3629 oasc.RequestHandlers.initHandlersFromConfig created spellCheckWithWordbreak_Direct: org.apache.solr.handler.component.SearchHandler
[junit4:junit4]   2> 1694 T3629 oasc.RequestHandlers.initHandlersFromConfig created spellCheckCompRH1: org.apache.solr.handler.component.SearchHandler
[junit4:junit4]   2> 1695 T3629 oasc.RequestHandlers.initHandlersFromConfig created mltrh: org.apache.solr.handler.component.SearchHandler
[junit4:junit4]   2> 1696 T3629 oasc.RequestHandlers.initHandlersFromConfig created tvrh: org.apache.solr.handler.component.SearchHandler
[junit4:junit4]   2> 1696 T3629 oasc.RequestHandlers.initHandlersFromConfig created /mlt: solr.MoreLikeThisHandler
[junit4:junit4]   2> 1697 T3629 oasc.RequestHandlers.initHandlersFromConfig created /debug/dump: solr.DumpRequestHandler
[junit4:junit4]   2> 1704 T3629 oashl.XMLLoader.init xsltCacheLifetimeSeconds=60
[junit4:junit4]   2> 1709 T3629 oasc.SolrCore.initDeprecatedSupport WARNING solrconfig.xml uses deprecated <admin/gettableFiles>, Please update your config to use the ShowFileRequestHandler.
[junit4:junit4]   2> 1711 T3629 oasc.SolrCore.initDeprecatedSupport WARNING adding ShowFileRequestHandler with hidden files: [THROW.ERROR.ON.ADD.UPDATEPROCESSOR.JS, SOLRCONFIG-HIGHLIGHT.XML, SCHEMA-REQUIRED-FIELDS.XML, TRIVIAL.UPDATEPROCESSOR1.JS, BAD-SCHEMA-DUP-DYNAMICFIELD.XML, SCHEMA-MINIMAL.XML, SCHEMA-REPLICATION2.XML, SOLRCONFIG-CACHING.XML, SCHEMA-POSTINGSHIGHLIGHT.XML, SOLRCONFIG-REPEATER.XML, REGEX-BOOST-PROCESSOR-TEST.TXT, SOLRCONFIG-MERGEPOLICY.XML, CURRENCY.XML, BAD-SCHEMA-NONTEXT-ANALYZER.XML, SOLRCONFIG-TLOG.XML, SOLRCONFIG-MASTER.XML, SOLRCONFIG-COMPONENTS-NAME.XML, BAD-SCHEMA-UNIQUEKEY-MULTIVALUED.XML, SCHEMA11.XML, SOLRCONFIG-BASIC.XML, DA_COMPOUNDDICTIONARY.TXT, MISSLEADING.EXTENSION.UPDATEPROCESSOR.JS.TXT, SCHEMA-COPYFIELD-TEST.XML, SOLRCONFIG-SLAVE.XML, SOLRCONFIG-PROPINJECT-INDEXDEFAULT.XML, ELEVATE.XML, TRIVIAL.UPDATEPROCESSOR0.JS, BAD-SOLRCONFIG-BOGUS-SCRIPTENGINE-NAME.XML, SCHEMA-CHARFILTERS.XML, SCHEMA-IB.XML, SOLRCONFIG-QUERYSENDER.XML, SOLRCONFIG-SNIPPET-PROCESSOR.XML, DA_UTF8.XML, SCHEMA-REPLICATION1.XML, CONDITIONAL.UPDATEPROCESSOR.JS, MISSING.FUNCTIONS.UPDATEPROCESSOR.JS, HYPHENATION.DTD, SOLRCONFIG-ENABLEPLUGIN.XML, STEMDICT.TXT, SCHEMA-PHRASESUGGEST.XML, HUNSPELL-TEST.AFF, SCHEMA-SNIPPET-TYPE.XML, STOPTYPES-1.TXT, STOPWORDSWRONGENCODING.TXT, SCHEMA-NUMERIC.XML, SOLRCONFIG-TRANSFORMERS.XML, SOLRCONFIG-PROPINJECT.XML, BAD-SCHEMA-NOT-INDEXED-BUT-TF.XML, SOLRCONFIG-SIMPLELOCK.XML, WDFTYPES.TXT, STOPTYPES-2.TXT, SCHEMA-REVERSED.XML, BAD-SCHEMA-CURRENCY-FT-MULTIVALUED.XML, SOLRCONFIG-SPELLCHECKCOMPONENT.XML, SOLRCONFIG-PHRASESUGGEST.XML, BAD-SCHEMA-CURRENCY-MULTIVALUED.XML, SCHEMA-DFR.XML, BAD-SCHEMA-NOT-INDEXED-BUT-POS.XML, KEEP-1.TXT, OPEN-EXCHANGE-RATES.JSON, SCHEMA-SPATIAL.XML, STOPWITHBOM.TXT, SOLRCONFIG-SPELLCHECKER.XML, SOLRCONFIG-POSTINGSHIGHLIGHT.XML, SCHEMA-BINARYFIELD.XML, SOLRCONFIG-UPDATE-PROCESSOR-CHAINS.XML, BAD-SCHEMA-OMIT-TF-BUT-NOT-POS.XML, BAD-SCHEMA-DUP-FIELDTYPE.XML, SCHEMA-XINCLUDE.XML, SOLRCONFIG-MASTER1.XML, SCHEMA-BEHAVIOR.XML, SYNONYMS.TXT, BAD-SCHEMA-CURRENCY-DYNAMIC-MULTIVALUED.XML, SCHEMA.XML, SCHEMA_CODEC.XML, SOLRCONFIG-SOLR-749.XML, SOLRCONFIG-MASTER1-KEEPONEBACKUP.XML, SCHEMA-EFF.XML, STOP-2.TXT, SOLRCONFIG-FUNCTIONQUERY.XML, SOLRCONFIG-TERMINDEX.XML, SCHEMA-LMDIRICHLET.XML, SOLRCONFIG-ELEVATE.XML, STOPWORDS.TXT, SCHEMA-FOLDING.XML, SCHEMA-STOP-KEEP.XML, FUZZYSUGGEST.TXT, BAD-SCHEMA-NOT-INDEXED-BUT-NORMS.XML, SOLRCONFIG-SOLCOREPROPERTIES.XML, STOP-1.TXT, SOLRCONFIG-MASTER2.XML, SCHEMA-SPELLCHECKER.XML, SOLRCONFIG-RESPONSE-LOG-COMPONENT.XML, SOLRCONFIG-LAZYWRITER.XML, SCHEMA-LUCENEMATCHVERSION.XML, FRENCHARTICLES.TXT, BAD-MP-SOLRCONFIG.XML, SCHEMA15.XML, SOLRCONFIG-REQHANDLER.INCL, SCHEMASURROUND.XML, SOLRCONFIG-MASTER3.XML, HUNSPELL-TEST.DIC, SOLRCONFIG-XINCLUDE.XML, BAD-SCHEMA-CODEC-GLOBAL-VS-FT-MISMATCH.XML, SOLRCONFIG-SLAVE1.XML, SOLRCONFIG-DELPOLICY1.XML, SCHEMA-SIM.XML, SCHEMA-SNIPPET-FIELD.XML, SCHEMA-COLLATE.XML, STOP-SNOWBALL.TXT, BAD-SCHEMA-SIM-GLOBAL-VS-FT-MISMATCH.XML, PROTWORDS.TXT, SCHEMA-TRIE.XML, SOLRCONFIG_CODEC.XML, SCHEMA-SYNONYM-TOKENIZER.XML, BAD-SOLRCONFIG-INVALID-SCRIPTFILE.XML, JASUGGEST.TXT, SCHEMA-TFIDF.XML, SOLRCONFIG-SCRIPT-UPDATEPROCESSOR.XML, SCHEMA-LMJELINEKMERCER.XML, PHRASESUGGEST.TXT, BAD-SOLRCONFIG-MISSING-SCRIPTFILE.XML, BAD-SCHEMA-UNIQUEKEY-USES-DEFAULT.XML, OLD_SYNONYMS.TXT, SOLRCONFIG-DELPOLICY2.XML, XSLT, SOLRCONFIG-NATIVELOCK.XML, BAD-SCHEMA-DUP-FIELD.XML, SOLRCONFIG-NOCACHE.XML, SCHEMA-BM25.XML, ADDFIELDS.UPDATEPROCESSOR.JS, SOLRCONFIG-QUERYSENDER-NOQUERY.XML, SOLRCONFIG-ALTDIRECTORY.XML, COMPOUNDDICTIONARY.TXT, SOLRCONFIG_PERF.XML, SOLRCONFIG-INDEXCONFIG.XML, BAD-SCHEMA-ANALYZER-CLASS-AND-NESTED.XML, SCHEMA-NOT-REQUIRED-UNIQUE-KEY.XML, KEEP-2.TXT, BAD-SCHEMA-UNIQUEKEY-IS-COPYFIELD-DEST.XML, SCHEMA12.XML, MAPPING-ISOLATIN1ACCENT.TXT, BAD_SOLRCONFIG.XML, BAD-SCHEMA-EXTERNAL-FILEFIELD.XML]
[junit4:junit4]   2> 1714 T3629 oasc.CachingDirectoryFactory.close Releasing directory:/Users/jenkins/jenkins-slave/workspace/Lucene-Solr-trunk-MacOSX/solr/build/solr-core/test/J0/./solrtest-SoftAutoCommitTest-1359887594828
[junit4:junit4]   2> 1715 T3629 oass.SolrIndexSearcher.<init> Opening Searcher@5201ae49 main
[junit4:junit4]   2> 1716 T3629 oasu.CommitTracker.<init> Hard AutoCommit: disabled
[junit4:junit4]   2> 1716 T3629 oasu.CommitTracker.<init> Soft AutoCommit: disabled
[junit4:junit4]   2> 1717 T3629 oashc.SpellCheckComponent.inform Initializing spell checkers
[junit4:junit4]   2> 1726 T3629 oass.DirectSolrSpellChecker.init init: {name=direct,classname=DirectSolrSpellChecker,field=lowerfilt,minQueryLength=3}
[junit4:junit4]   2> 1768 T3630 oasc.SolrCore.registerSearcher [collection1] Registered new searcher Searcher@5201ae49 main{StandardDirectoryReader(segments_1:1)}
[junit4:junit4]   2> 1774 T3629 oasc.CoreContainer.registerCore registering core: collection1
[junit4:junit4]   2> 1783 T3629 oas.SolrTestCaseJ4.initCore ####initCore end
[junit4:junit4]   2> 1788 T3629 oas.SolrTestCaseJ4.setUp ###Starting testSoftAndHardCommitMaxTimeRapidAdds
[junit4:junit4]   2> 1789 T3629 oasc.CoreContainer.reload Reloading SolrCore 'collection1' using instanceDir: /Users/jenkins/jenkins-slave/workspace/Lucene-Solr-trunk-MacOSX/solr/build/solr-core/test-files/solr/collection1
[junit4:junit4]   2> 1790 T3629 oasc.SolrResourceLoader.<init> new SolrResourceLoader for directory: '/Users/jenkins/jenkins-slave/workspace/Lucene-Solr-trunk-MacOSX/solr/build/solr-core/test-files/solr/collection1/'
[junit4:junit4]   2> 1791 T3629 oasc.SolrResourceLoader.replaceClassLoader Adding 'file:/Users/jenkins/jenkins-slave/workspace/Lucene-Solr-trunk-MacOSX/solr/build/solr-core/test-files/solr/collection1/lib/classes/' to classloader
[junit4:junit4]   2> 1791 T3629 oasc.SolrResourceLoader.replaceClassLoader Adding 'file:/Users/jenkins/jenkins-slave/workspace/Lucene-Solr-trunk-MacOSX/solr/build/solr-core/test-files/solr/collection1/lib/README' to classloader
[junit4:junit4]   2> 1869 T3629 oasc.SolrConfig.<init> Using Lucene MatchVersion: LUCENE_50
[junit4:junit4]   2> 1957 T3629 oasc.SolrConfig.<init> Loaded SolrConfig: solrconfig.xml
[junit4:junit4]   2> 1958 T3629 oass.IndexSchema.readSchema Reading Solr Schema
[junit4:junit4]   2> 1964 T3629 oass.IndexSchema.readSchema Schema name=test
[junit4:junit4]   2> 2802 T3629 oass.OpenExchangeRatesOrgProvider.init Initialized with rates=open-exchange-rates.json, refreshInterval=1440.
[junit4:junit4]   2> 2813 T3629 oass.IndexSchema.readSchema default search field in schema is text
[junit4:junit4]   2> 2818 T3629 oass.IndexSchema.readSchema unique key field: id
[junit4:junit4]   2> 2827 T3629 oass.FileExchangeRateProvider.reload Reloading exchange rates from file currency.xml
[junit4:junit4]   2> 2833 T3629 oass.FileExchangeRateProvider.reload Reloading exchange rates from file currency.xml
[junit4:junit4]   2> 2838 T3629 oass.OpenExchangeRatesOrgProvider.reload Reloading exchange rates from open-exchange-rates.json
[junit4:junit4]   2> 2839 T3629 oass.OpenExchangeRatesOrgProvider.reload Reloading exchange rates from open-exchange-rates.json
[junit4:junit4]   2> 2840 T3629 oasc.SolrCore.<init> [collection1] Opening new SolrCore at /Users/jenkins/jenkins-slave/workspace/Lucene-Solr-trunk-MacOSX/solr/build/solr-core/test-files/solr/collection1/, dataDir=/Users/jenkins/jenkins-slave/workspace/Lucene-Solr-trunk-MacOSX/solr/build/solr-core/test/J0/./solrtest-SoftAutoCommitTest-1359887594828/
[junit4:junit4]   2> 2840 T3629 oasc.JmxMonitoredMap.<init> JMX monitoring is enabled. Adding Solr mbeans to JMX Server: com.sun.jmx.mbeanserver.JmxMBeanServer@38a1aa85
[junit4:junit4]   2> 2841 T3629 oasc.CachingDirectoryFactory.close Releasing directory:/Users/jenkins/jenkins-slave/workspace/Lucene-Solr-trunk-MacOSX/solr/build/solr-core/test/J0/./solrtest-SoftAutoCommitTest-1359887594828
[junit4:junit4]   2> 2842 T3629 oasc.SolrCore.getNewIndexDir New index directory detected: old=null new=/Users/jenkins/jenkins-slave/workspace/Lucene-Solr-trunk-MacOSX/solr/build/solr-core/test/J0/./solrtest-SoftAutoCommitTest-1359887594828/index/
[junit4:junit4]   2> 2843 T3629 oasc.SolrCore.initWriters created xml: solr.XMLResponseWriter
[junit4:junit4]   2> 2845 T3629 oasup.UpdateRequestProcessorChain.init inserting DistributedUpdateProcessorFactory into updateRequestProcessorChain "dedupe"
[junit4:junit4]   2> 2846 T3629 oasup.UpdateRequestProcessorChain.init inserting DistributedUpdateProcessorFactory into updateRequestProcessorChain "dedupe-allfields"
[junit4:junit4]   2> 2846 T3629 oasup.UpdateRequestProcessorChain.init inserting DistributedUpdateProcessorFactory into updateRequestProcessorChain "stored_sig"
[junit4:junit4]   2> 2847 T3629 oasup.UpdateRequestProcessorChain.init inserting DistributedUpdateProcessorFactory into updateRequestProcessorChain "uniq-fields"
[junit4:junit4]   2> 2848 T3629 oasup.UpdateRequestProcessorChain.init inserting DistributedUpdateProcessorFactory into updateRequestProcessorChain "distrib-dup-test-chain-implicit"
[junit4:junit4]   2> 2849 T3629 oasc.RequestHandlers.initHandlersFromConfig adding lazy requestHandler: solr.ReplicationHandler
[junit4:junit4]   2> 2849 T3629 oasc.RequestHandlers.initHandlersFromConfig created /replication: solr.ReplicationHandler
[junit4:junit4]   2> 2850 T3629 oasc.RequestHandlers.initHandlersFromConfig created standard: solr.StandardRequestHandler
[junit4:junit4]   2> 2851 T3629 oasc.RequestHandlers.initHandlersFromConfig created /get: solr.RealTimeGetHandler
[junit4:junit4]   2> 2853 T3629 oasc.RequestHandlers.initHandlersFromConfig created dismax: solr.SearchHandler
[junit4:junit4]   2> 2854 T3629 oasc.RequestHandlers.initHandlersFromConfig created mock: org.apache.solr.core.MockQuerySenderListenerReqHandler
[junit4:junit4]   2> 2854 T3629 oasc.RequestHandlers.initHandlersFromConfig created /admin/: org.apache.solr.handler.admin.AdminHandlers
[junit4:junit4]   2> 2855 T3629 oasc.RequestHandlers.initHandlersFromConfig created defaults: solr.StandardRequestHandler
[junit4:junit4]   2> 2856 T3629 oasc.RequestHandlers.initHandlersFromConfig adding lazy requestHandler: solr.StandardRequestHandler
[junit4:junit4]   2> 2856 T3629 oasc.RequestHandlers.initHandlersFromConfig created lazy: solr.StandardRequestHandler
[junit4:junit4]   2> 2857 T3629 oasc.RequestHandlers.initHandlersFromConfig created /update: solr.UpdateRequestHandler
[junit4:junit4]   2> 2858 T3629 oasc.RequestHandlers.initHandlersFromConfig created /terms: org.apache.solr.handler.component.SearchHandler
[junit4:junit4]   2> 2859 T3629 oasc.RequestHandlers.initHandlersFromConfig created spellCheckCompRH: org.apache.solr.handler.component.SearchHandler
[junit4:junit4]   2> 2860 T3629 oasc.RequestHandlers.initHandlersFromConfig created spellCheckCompRH_Direct: org.apache.solr.handler.component.SearchHandler
[junit4:junit4]   2> 2861 T3629 oasc.RequestHandlers.initHandlersFromConfig created spellCheckWithWordbreak: org.apache.solr.handler.component.SearchHandler
[junit4:junit4]   2> 2862 T3629 oasc.RequestHandlers.initHandlersFromConfig created spellCheckWithWordbreak_Direct: org.apache.solr.handler.component.SearchHandler
[junit4:junit4]   2> 2863 T3629 oasc.RequestHandlers.initHandlersFromConfig created spellCheckCompRH1: org.apache.solr.handler.component.SearchHandler
[junit4:junit4]   2> 2864 T3629 oasc.RequestHandlers.initHandlersFromConfig created mltrh: org.apache.solr.handler.component.SearchHandler
[junit4:junit4]   2> 2865 T3629 oasc.RequestHandlers.initHandlersFromConfig created tvrh: org.apache.solr.handler.component.SearchHandler
[junit4:junit4]   2> 2866 T3629 oasc.RequestHandlers.initHandlersFromConfig created /mlt: solr.MoreLikeThisHandler
[junit4:junit4]   2> 2867 T3629 oasc.RequestHandlers.initHandlersFromConfig created /debug/dump: solr.DumpRequestHandler
[junit4:junit4]   2> 2870 T3629 oashl.XMLLoader.init xsltCacheLifetimeSeconds=60
[junit4:junit4]   2> 2873 T3629 oasc.SolrCore.initDeprecatedSupport WARNING solrconfig.xml uses deprecated <admin/gettableFiles>, Please update your config to use the ShowFileRequestHandler.
[junit4:junit4]   2> 2874 T3629 oasc.SolrCore.initDeprecatedSupport WARNING adding ShowFileRequestHandler with hidden files: [THROW.ERROR.ON.ADD.UPDATEPROCESSOR.JS, SOLRCONFIG-HIGHLIGHT.XML, SCHEMA-REQUIRED-FIELDS.XML, TRIVIAL.UPDATEPROCESSOR1.JS, BAD-SCHEMA-DUP-DYNAMICFIELD.XML, SCHEMA-MINIMAL.XML, SCHEMA-REPLICATION2.XML, SOLRCONFIG-CACHING.XML, SCHEMA-POSTINGSHIGHLIGHT.XML, SOLRCONFIG-REPEATER.XML, REGEX-BOOST-PROCESSOR-TEST.TXT, SOLRCONFIG-MERGEPOLICY.XML, CURRENCY.XML, BAD-SCHEMA-NONTEXT-ANALYZER.XML, SOLRCONFIG-TLOG.XML, SOLRCONFIG-MASTER.XML, SOLRCONFIG-COMPONENTS-NAME.XML, BAD-SCHEMA-UNIQUEKEY-MULTIVALUED.XML, SCHEMA11.XML, SOLRCONFIG-BASIC.XML, DA_COMPOUNDDICTIONARY.TXT, MISSLEADING.EXTENSION.UPDATEPROCESSOR.JS.TXT, SCHEMA-COPYFIELD-TEST.XML, SOLRCONFIG-SLAVE.XML, SOLRCONFIG-PROPINJECT-INDEXDEFAULT.XML, ELEVATE.XML, TRIVIAL.UPDATEPROCESSOR0.JS, BAD-SOLRCONFIG-BOGUS-SCRIPTENGINE-NAME.XML, SCHEMA-CHARFILTERS.XML, SCHEMA-IB.XML, SOLRCONFIG-QUERYSENDER.XML, SOLRCONFIG-SNIPPET-PROCESSOR.XML, DA_UTF8.XML, SCHEMA-REPLICATION1.XML, CONDITIONAL.UPDATEPROCESSOR.JS, MISSING.FUNCTIONS.UPDATEPROCESSOR.JS, HYPHENATION.DTD, SOLRCONFIG-ENABLEPLUGIN.XML, STEMDICT.TXT, SCHEMA-PHRASESUGGEST.XML, HUNSPELL-TEST.AFF, SCHEMA-SNIPPET-TYPE.XML, STOPTYPES-1.TXT, STOPWORDSWRONGENCODING.TXT, SCHEMA-NUMERIC.XML, SOLRCONFIG-TRANSFORMERS.XML, SOLRCONFIG-PROPINJECT.XML, BAD-SCHEMA-NOT-INDEXED-BUT-TF.XML, SOLRCONFIG-SIMPLELOCK.XML, WDFTYPES.TXT, STOPTYPES-2.TXT, SCHEMA-REVERSED.XML, BAD-SCHEMA-CURRENCY-FT-MULTIVALUED.XML, SOLRCONFIG-SPELLCHECKCOMPONENT.XML, SOLRCONFIG-PHRASESUGGEST.XML, BAD-SCHEMA-CURRENCY-MULTIVALUED.XML, SCHEMA-DFR.XML, BAD-SCHEMA-NOT-INDEXED-BUT-POS.XML, KEEP-1.TXT, OPEN-EXCHANGE-RATES.JSON, SCHEMA-SPATIAL.XML, STOPWITHBOM.TXT, SOLRCONFIG-SPELLCHECKER.XML, SOLRCONFIG-POSTINGSHIGHLIGHT.XML, SCHEMA-BINARYFIELD.XML, SOLRCONFIG-UPDATE-PROCESSOR-CHAINS.XML, BAD-SCHEMA-OMIT-TF-BUT-NOT-POS.XML, BAD-SCHEMA-DUP-FIELDTYPE.XML, SCHEMA-XINCLUDE.XML, SOLRCONFIG-MASTER1.XML, SCHEMA-BEHAVIOR.XML, SYNONYMS.TXT, BAD-SCHEMA-CURRENCY-DYNAMIC-MULTIVALUED.XML, SCHEMA.XML, SCHEMA_CODEC.XML, SOLRCONFIG-SOLR-749.XML, SOLRCONFIG-MASTER1-KEEPONEBACKUP.XML, SCHEMA-EFF.XML, STOP-2.TXT, SOLRCONFIG-FUNCTIONQUERY.XML, SOLRCONFIG-TERMINDEX.XML, SCHEMA-LMDIRICHLET.XML, SOLRCONFIG-ELEVATE.XML, STOPWORDS.TXT, SCHEMA-FOLDING.XML, SCHEMA-STOP-KEEP.XML, FUZZYSUGGEST.TXT, BAD-SCHEMA-NOT-INDEXED-BUT-NORMS.XML, SOLRCONFIG-SOLCOREPROPERTIES.XML, STOP-1.TXT, SOLRCONFIG-MASTER2.XML, SCHEMA-SPELLCHECKER.XML, SOLRCONFIG-RESPONSE-LOG-COMPONENT.XML, SOLRCONFIG-LAZYWRITER.XML, SCHEMA-LUCENEMATCHVERSION.XML, FRENCHARTICLES.TXT, BAD-MP-SOLRCONFIG.XML, SCHEMA15.XML, SOLRCONFIG-REQHANDLER.INCL, SCHEMASURROUND.XML, SOLRCONFIG-MASTER3.XML, HUNSPELL-TEST.DIC, SOLRCONFIG-XINCLUDE.XML, BAD-SCHEMA-CODEC-GLOBAL-VS-FT-MISMATCH.XML, SOLRCONFIG-SLAVE1.XML, SOLRCONFIG-DELPOLICY1.XML, SCHEMA-SIM.XML, SCHEMA-SNIPPET-FIELD.XML, SCHEMA-COLLATE.XML, STOP-SNOWBALL.TXT, BAD-SCHEMA-SIM-GLOBAL-VS-FT-MISMATCH.XML, PROTWORDS.TXT, SCHEMA-TRIE.XML, SOLRCONFIG_CODEC.XML, SCHEMA-SYNONYM-TOKENIZER.XML, BAD-SOLRCONFIG-INVALID-SCRIPTFILE.XML, JASUGGEST.TXT, SCHEMA-TFIDF.XML, SOLRCONFIG-SCRIPT-UPDATEPROCESSOR.XML, SCHEMA-LMJELINEKMERCER.XML, PHRASESUGGEST.TXT, BAD-SOLRCONFIG-MISSING-SCRIPTFILE.XML, BAD-SCHEMA-UNIQUEKEY-USES-DEFAULT.XML, OLD_SYNONYMS.TXT, SOLRCONFIG-DELPOLICY2.XML, XSLT, SOLRCONFIG-NATIVELOCK.XML, BAD-SCHEMA-DUP-FIELD.XML, SOLRCONFIG-NOCACHE.XML, SCHEMA-BM25.XML, ADDFIELDS.UPDATEPROCESSOR.JS, SOLRCONFIG-QUERYSENDER-NOQUERY.XML, SOLRCONFIG-ALTDIRECTORY.XML, COMPOUNDDICTIONARY.TXT, SOLRCONFIG_PERF.XML, SOLRCONFIG-INDEXCONFIG.XML, BAD-SCHEMA-ANALYZER-CLASS-AND-NESTED.XML, SCHEMA-NOT-REQUIRED-UNIQUE-KEY.XML, KEEP-2.TXT, BAD-SCHEMA-UNIQUEKEY-IS-COPYFIELD-DEST.XML, SCHEMA12.XML, MAPPING-ISOLATIN1ACCENT.TXT, BAD_SOLRCONFIG.XML, BAD-SCHEMA-EXTERNAL-FILEFIELD.XML]
[junit4:junit4]   2> 2878 T3629 oasc.CachingDirectoryFactory.close Releasing directory:/Users/jenkins/jenkins-slave/workspace/Lucene-Solr-trunk-MacOSX/solr/build/solr-core/test/J0/./solrtest-SoftAutoCommitTest-1359887594828
[junit4:junit4]   2> 2879 T3629 oass.SolrIndexSearcher.<init> Opening Searcher@24192458 main
[junit4:junit4]   2> 2879 T3629 oasu.CommitTracker.<init> Hard AutoCommit: disabled
[junit4:junit4]   2> 2880 T3629 oasu.CommitTracker.<init> Soft AutoCommit: disabled
[junit4:junit4]   2> 2881 T3629 oashc.SpellCheckComponent.inform Initializing spell checkers
[junit4:junit4]   2> 2884 T3629 oass.DirectSolrSpellChecker.init init: {name=direct,classname=DirectSolrSpellChecker,field=lowerfilt,minQueryLength=3}
[junit4:junit4]   2> 2903 T3631 oasc.SolrCore.registerSearcher [collection1] Registered new searcher Searcher@24192458 main{StandardDirectoryReader(segments_1:1)}
[junit4:junit4]   2> 2909 T3629 oasc.CoreContainer.registerCore replacing core: collection1
[junit4:junit4]   2> 2910 T3629 oasc.SolrCore.close [collection1]  CLOSING SolrCore org.apache.solr.core.SolrCore@628b59b5
[junit4:junit4]   2> 2915 T3629 oasu.DirectUpdateHandler2.close closing DirectUpdateHandler2{commits=0,autocommits=0,soft autocommits=0,optimizes=0,rollbacks=0,expungeDeletes=0,docsPending=0,adds=0,deletesById=0,deletesByQuery=0,errors=0,cumulative_adds=0,cumulative_deletesById=0,cumulative_deletesByQuery=0,cumulative_errors=0}
[junit4:junit4]   2> 2916 T3629 oasc.SolrCore.closeSearcher [collection1] Closing main searcher on request.
[junit4:junit4]   2> 2916 T3629 oasc.CachingDirectoryFactory.close Releasing directory:/Users/jenkins/jenkins-slave/workspace/Lucene-Solr-trunk-MacOSX/solr/build/solr-core/test/J0/./solrtest-SoftAutoCommitTest-1359887594828/index
[junit4:junit4]   2> ASYNC  NEW_CORE C228 name=collection1 org.apache.solr.core.SolrCore@9c50e8d
[junit4:junit4]   2> 2924 T3629 C228 oasc.CachingDirectoryFactory.close Releasing directory:/Users/jenkins/jenkins-slave/workspace/Lucene-Solr-trunk-MacOSX/solr/build/solr-core/test/J0/./solrtest-SoftAutoCommitTest-1359887594828
[junit4:junit4]   2> 2927 T3629 C228 oasc.SolrDeletionPolicy.onInit SolrDeletionPolicy.onInit: commits:num=1
[junit4:junit4]   2> 		commit{dir=RateLimitedDirectoryWrapper(MockDirWrapper(org.apache.lucene.store.RAMDirectory@1c093f32 lockFactory=org.apache.lucene.store.NativeFSLockFactory@7481e656)),segFN=segments_1,generation=1,filenames=[segments_1]
[junit4:junit4]   2> 2927 T3629 C228 oasc.SolrDeletionPolicy.updateCommits newest commit = 1[segments_1]
[junit4:junit4]   2> 2929 T3629 C228 UPDATE [collection1] webapp=null path=null params={} {add=[5000]} 0 5
[junit4:junit4]   2> 2943 T3629 C228 UPDATE [collection1] webapp=null path=null params={} {add=[5001]} 0 1
[junit4:junit4]   2> 2952 T3629 C228 UPDATE [collection1] webapp=null path=null params={} {add=[5002]} 0 0
[junit4:junit4]   2> 2961 T3629 C228 UPDATE [collection1] webapp=null path=null params={} {add=[5003]} 0 0
[junit4:junit4]   2> 2971 T3629 C228 UPDATE [collection1] webapp=null path=null params={} {add=[5004]} 0 0
[junit4:junit4]   2> 2991 T3629 oas.SolrTestCaseJ4.tearDown ###Ending testSoftAndHardCommitMaxTimeRapidAdds
[junit4:junit4]   2> 2998 T3629 oas.SolrTestCaseJ4.setUp ###Starting testSoftAndHardCommitMaxTimeDelete
[junit4:junit4]   2> 2998 T3629 oasc.CoreContainer.reload Reloading SolrCore 'collection1' using instanceDir: /Users/jenkins/jenkins-slave/workspace/Lucene-Solr-trunk-MacOSX/solr/build/solr-core/test-files/solr/collection1
[junit4:junit4]   2> 2999 T3629 oasc.SolrResourceLoader.<init> new SolrResourceLoader for directory: '/Users/jenkins/jenkins-slave/workspace/Lucene-Solr-trunk-MacOSX/solr/build/solr-core/test-files/solr/collection1/'
[junit4:junit4]   2> 3000 T3629 oasc.SolrResourceLoader.replaceClassLoader Adding 'file:/Users/jenkins/jenkins-slave/workspace/Lucene-Solr-trunk-MacOSX/solr/build/solr-core/test-files/solr/collection1/lib/classes/' to classloader
[junit4:junit4]   2> 3000 T3629 oasc.SolrResourceLoader.replaceClassLoader Adding 'file:/Users/jenkins/jenkins-slave/workspace/Lucene-Solr-trunk-MacOSX/solr/build/solr-core/test-files/solr/collection1/lib/README' to classloader
[junit4:junit4]   2> 3069 T3629 oasc.SolrConfig.<init> Using Lucene MatchVersion: LUCENE_50
[junit4:junit4]   2> 3159 T3629 oasc.SolrConfig.<init> Loaded SolrConfig: solrconfig.xml
[junit4:junit4]   2> 3160 T3629 oass.IndexSchema.readSchema Reading Solr Schema
[junit4:junit4]   2> 3166 T3629 oass.IndexSchema.readSchema Schema name=test
[junit4:junit4]   2> 3431 T3633 oasu.DirectUpdateHandler2.commit start commit{,optimize=false,openSearcher=true,waitSearcher=true,expungeDeletes=false,softCommit=true}
[junit4:junit4]   2> 3432 T3633 oasc.CachingDirectoryFactory.close Releasing directory:/Users/jenkins/jenkins-slave/workspace/Lucene-Solr-trunk-MacOSX/solr/build/solr-core/test/J0/./solrtest-SoftAutoCommitTest-1359887594828
[junit4:junit4]   2> 3466 T3633 oass.SolrIndexSearcher.<init> Opening Searcher@3103f9c6 main
[junit4:junit4]   2> 3467 T3633 oasu.DirectUpdateHandler2.commit end_commit_flush
[junit4:junit4]   2> 3468 T3631 oasc.SolrCore.registerSearcher [collection1] Registered new searcher Searcher@3103f9c6 main{StandardDirectoryReader(segments_1:3:nrt _0(5.0):C5)}
[junit4:junit4]   2> 3469 T3631 oasc.CachingDirectoryFactory.close Releasing directory:/Users/jenkins/jenkins-slave/workspace/Lucene-Solr-trunk-MacOSX/solr/build/solr-core/test/J0/./solrtest-SoftAutoCommitTest-1359887594828/index
[junit4:junit4]   2> 4027 T3629 oass.OpenExchangeRatesOrgProvider.init Initialized with rates=open-exchange-rates.json, refreshInterval=1440.
[junit4:junit4]   2> 4038 T3629 oass.IndexSchema.readSchema default search field in schema is text
[junit4:junit4]   2> 4043 T3629 oass.IndexSchema.readSchema unique key field: id
[junit4:junit4]   2> 4051 T3629 oass.FileExchangeRateProvider.reload Reloading exchange rates from file currency.xml
[junit4:junit4]   2> 4056 T3629 oass.FileExchangeRateProvider.reload Reloading exchange rates from file currency.xml
[junit4:junit4]   2> 4061 T3629 oass.OpenExchangeRatesOrgProvider.reload Reloading exchange rates from open-exchange-rates.json
[junit4:junit4]   2> 4062 T3629 oass.OpenExchangeRatesOrgProvider.reload Reloading exchange rates from open-exchange-rates.json
[junit4:junit4]   2> 4063 T3629 oasc.SolrCore.<init> [collection1] Opening new SolrCore at /Users/jenkins/jenkins-slave/workspace/Lucene-Solr-trunk-MacOSX/solr/build/solr-core/test-files/solr/collection1/, dataDir=/Users/jenkins/jenkins-slave/workspace/Lucene-Solr-trunk-MacOSX/solr/build/solr-core/test/J0/./solrtest-SoftAutoCommitTest-1359887594828/
[junit4:junit4]   2> 4063 T3629 oasc.JmxMonitoredMap.<init> JMX monitoring is enabled. Adding Solr mbeans to JMX Server: com.sun.jmx.mbeanserver.JmxMBeanServer@38a1aa85
[junit4:junit4]   2> 4064 T3629 oasc.CachingDirectoryFactory.close Releasing directory:/Users/jenkins/jenkins-slave/workspace/Lucene-Solr-trunk-MacOSX/solr/build/solr-core/test/J0/./solrtest-SoftAutoCommitTest-1359887594828
[junit4:junit4]   2> 4064 T3629 oasc.SolrCore.getNewIndexDir New index directory detected: old=null new=/Users/jenkins/jenkins-slave/workspace/Lucene-Solr-trunk-MacOSX/solr/build/solr-core/test/J0/./solrtest-SoftAutoCommitTest-1359887594828/index/
[junit4:junit4]   2> 4065 T3629 oasc.SolrCore.initWriters created xml: solr.XMLResponseWriter
[junit4:junit4]   2> 4069 T3629 oasup.UpdateRequestProcessorChain.init inserting DistributedUpdateProcessorFactory into updateRequestProcessorChain "dedupe"
[junit4:junit4]   2> 4069 T3629 oasup.UpdateRequestProcessorChain.init inserting DistributedUpdateProcessorFactory into updateRequestProcessorChain "dedupe-allfields"
[junit4:junit4]   2> 4070 T3629 oasup.UpdateRequestProcessorChain.init inserting DistributedUpdateProcessorFactory into updateRequestProcessorChain "stored_sig"
[junit4:junit4]   2> 4070 T3629 oasup.UpdateRequestProcessorChain.init inserting DistributedUpdateProcessorFactory into updateRequestProcessorChain "uniq-fields"
[junit4:junit4]   2> 4071 T3629 oasup.UpdateRequestProcessorChain.init inserting DistributedUpdateProcessorFactory into updateRequestProcessorChain "distrib-dup-test-chain-implicit"
[junit4:junit4]   2> 4071 T3629 oasc.RequestHandlers.initHandlersFromConfig adding lazy requestHandler: solr.ReplicationHandler
[junit4:junit4]   2> 4072 T3629 oasc.RequestHandlers.initHandlersFromConfig created /replication: solr.ReplicationHandler
[junit4:junit4]   2> 4072 T3629 oasc.RequestHandlers.initHandlersFromConfig created standard: solr.StandardRequestHandler
[junit4:junit4]   2> 4073 T3629 oasc.RequestHandlers.initHandlersFromConfig created /get: solr.RealTimeGetHandler
[junit4:junit4]   2> 4074 T3629 oasc.RequestHandlers.initHandlersFromConfig created dismax: solr.SearchHandler
[junit4:junit4]   2> 4075 T3629 oasc.RequestHandlers.initHandlersFromConfig created mock: org.apache.solr.core.MockQuerySenderListenerReqHandler
[junit4:junit4]   2> 4075 T3629 oasc.RequestHandlers.initHandlersFromConfig created /admin/: org.apache.solr.handler.admin.AdminHandlers
[junit4:junit4]   2> 4076 T3629 oasc.RequestHandlers.initHandlersFromConfig created defaults: solr.StandardRequestHandler
[junit4:junit4]   2> 4076 T3629 oasc.RequestHandlers.initHandlersFromConfig adding lazy requestHandler: solr.StandardRequestHandler
[junit4:junit4]   2> 4076 T3629 oasc.RequestHandlers.initHandlersFromConfig created lazy: solr.StandardRequestHandler
[junit4:junit4]   2> 4078 T3629 oasc.RequestHandlers.initHandlersFromConfig created /update: solr.UpdateRequestHandler
[junit4:junit4]   2> 4079 T3629 oasc.RequestHandlers.initHandlersFromConfig created /terms: org.apache.solr.handler.component.SearchHandler
[junit4:junit4]   2> 4080 T3629 oasc.RequestHandlers.initHandlersFromConfig created spellCheckCompRH: org.apache.solr.handler.component.SearchHandler
[junit4:junit4]   2> 4081 T3629 oasc.RequestHandlers.initHandlersFromConfig created spellCheckCompRH_Direct: org.apache.solr.handler.component.SearchHandler
[junit4:junit4]   2> 4081 T3629 oasc.RequestHandlers.initHandlersFromConfig created spellCheckWithWordbreak: org.apache.solr.handler.component.SearchHandler
[junit4:junit4]   2> 4082 T3629 oasc.RequestHandlers.initHandlersFromConfig created spellCheckWithWordbreak_Direct: org.apache.solr.handler.component.SearchHandler
[junit4:junit4]   2> 4083 T3629 oasc.RequestHandlers.initHandlersFromConfig created spellCheckCompRH1: org.apache.solr.handler.component.SearchHandler
[junit4:junit4]   2> 4084 T3629 oasc.RequestHandlers.initHandlersFromConfig created mltrh: org.apache.solr.handler.component.SearchHandler
[junit4:junit4]   2> 4084 T3629 oasc.RequestHandlers.initHandlersFromConfig created tvrh: org.apache.solr.handler.component.SearchHandler
[junit4:junit4]   2> 4085 T3629 oasc.RequestHandlers.initHandlersFromConfig created /mlt: solr.MoreLikeThisHandler
[junit4:junit4]   2> 4086 T3629 oasc.RequestHandlers.initHandlersFromConfig created /debug/dump: solr.DumpRequestHandler
[junit4:junit4]   2> 4089 T3629 oashl.XMLLoader.init xsltCacheLifetimeSeconds=60
[junit4:junit4]   2> 4091 T3629 oasc.SolrCore.initDeprecatedSupport WARNING solrconfig.xml uses deprecated <admin/gettableFiles>, Please update your config to use the ShowFileRequestHandler.
[junit4:junit4]   2> 4093 T3629 oasc.SolrCore.initDeprecatedSupport WARNING adding ShowFileRequestHandler with hidden files: [THROW.ERROR.ON.ADD.UPDATEPROCESSOR.JS, SOLRCONFIG-HIGHLIGHT.XML, SCHEMA-REQUIRED-FIELDS.XML, TRIVIAL.UPDATEPROCESSOR1.JS, BAD-SCHEMA-DUP-DYNAMICFIELD.XML, SCHEMA-MINIMAL.XML, SCHEMA-REPLICATION2.XML, SOLRCONFIG-CACHING.XML, SCHEMA-POSTINGSHIGHLIGHT.XML, SOLRCONFIG-REPEATER.XML, REGEX-BOOST-PROCESSOR-TEST.TXT, SOLRCONFIG-MERGEPOLICY.XML, CURRENCY.XML, BAD-SCHEMA-NONTEXT-ANALYZER.XML, SOLRCONFIG-TLOG.XML, SOLRCONFIG-MASTER.XML, SOLRCONFIG-COMPONENTS-NAME.XML, BAD-SCHEMA-UNIQUEKEY-MULTIVALUED.XML, SCHEMA11.XML, SOLRCONFIG-BASIC.XML, DA_COMPOUNDDICTIONARY.TXT, MISSLEADING.EXTENSION.UPDATEPROCESSOR.JS.TXT, SCHEMA-COPYFIELD-TEST.XML, SOLRCONFIG-SLAVE.XML, SOLRCONFIG-PROPINJECT-INDEXDEFAULT.XML, ELEVATE.XML, TRIVIAL.UPDATEPROCESSOR0.JS, BAD-SOLRCONFIG-BOGUS-SCRIPTENGINE-NAME.XML, SCHEMA-CHARFILTERS.XML, SCHEMA-IB.XML, SOLRCONFIG-QUERYSENDER.XML, SOLRCONFIG-SNIPPET-PROCESSOR.XML, DA_UTF8.XML, SCHEMA-REPLICATION1.XML, CONDITIONAL.UPDATEPROCESSOR.JS, MISSING.FUNCTIONS.UPDATEPROCESSOR.JS, HYPHENATION.DTD, SOLRCONFIG-ENABLEPLUGIN.XML, STEMDICT.TXT, SCHEMA-PHRASESUGGEST.XML, HUNSPELL-TEST.AFF, SCHEMA-SNIPPET-TYPE.XML, STOPTYPES-1.TXT, STOPWORDSWRONGENCODING.TXT, SCHEMA-NUMERIC.XML, SOLRCONFIG-TRANSFORMERS.XML, SOLRCONFIG-PROPINJECT.XML, BAD-SCHEMA-NOT-INDEXED-BUT-TF.XML, SOLRCONFIG-SIMPLELOCK.XML, WDFTYPES.TXT, STOPTYPES-2.TXT, SCHEMA-REVERSED.XML, BAD-SCHEMA-CURRENCY-FT-MULTIVALUED.XML, SOLRCONFIG-SPELLCHECKCOMPONENT.XML, SOLRCONFIG-PHRASESUGGEST.XML, BAD-SCHEMA-CURRENCY-MULTIVALUED.XML, SCHEMA-DFR.XML, BAD-SCHEMA-NOT-INDEXED-BUT-POS.XML, KEEP-1.TXT, OPEN-EXCHANGE-RATES.JSON, SCHEMA-SPATIAL.XML, STOPWITHBOM.TXT, SOLRCONFIG-SPELLCHECKER.XML, SOLRCONFIG-POSTINGSHIGHLIGHT.XML, SCHEMA-BINARYFIELD.XML, SOLRCONFIG-UPDATE-PROCESSOR-CHAINS.XML, BAD-SCHEMA-OMIT-TF-BUT-NOT-POS.XML, BAD-SCHEMA-DUP-FIELDTYPE.XML, SCHEMA-XINCLUDE.XML, SOLRCONFIG-MASTER1.XML, SCHEMA-BEHAVIOR.XML, SYNONYMS.TXT, BAD-SCHEMA-CURRENCY-DYNAMIC-MULTIVALUED.XML, SCHEMA.XML, SCHEMA_CODEC.XML, SOLRCONFIG-SOLR-749.XML, SOLRCONFIG-MASTER1-KEEPONEBACKUP.XML, SCHEMA-EFF.XML, STOP-2.TXT, SOLRCONFIG-FUNCTIONQUERY.XML, SOLRCONFIG-TERMINDEX.XML, SCHEMA-LMDIRICHLET.XML, SOLRCONFIG-ELEVATE.XML, STOPWORDS.TXT, SCHEMA-FOLDING.XML, SCHEMA-STOP-KEEP.XML, FUZZYSUGGEST.TXT, BAD-SCHEMA-NOT-INDEXED-BUT-NORMS.XML, SOLRCONFIG-SOLCOREPROPERTIES.XML, STOP-1.TXT, SOLRCONFIG-MASTER2.XML, SCHEMA-SPELLCHECKER.XML, SOLRCONFIG-RESPONSE-LOG-COMPONENT.XML, SOLRCONFIG-LAZYWRITER.XML, SCHEMA-LUCENEMATCHVERSION.XML, FRENCHARTICLES.TXT, BAD-MP-SOLRCONFIG.XML, SCHEMA15.XML, SOLRCONFIG-REQHANDLER.INCL, SCHEMASURROUND.XML, SOLRCONFIG-MASTER3.XML, HUNSPELL-TEST.DIC, SOLRCONFIG-XINCLUDE.XML, BAD-SCHEMA-CODEC-GLOBAL-VS-FT-MISMATCH.XML, SOLRCONFIG-SLAVE1.XML, SOLRCONFIG-DELPOLICY1.XML, SCHEMA-SIM.XML, SCHEMA-SNIPPET-FIELD.XML, SCHEMA-COLLATE.XML, STOP-SNOWBALL.TXT, BAD-SCHEMA-SIM-GLOBAL-VS-FT-MISMATCH.XML, PROTWORDS.TXT, SCHEMA-TRIE.XML, SOLRCONFIG_CODEC.XML, SCHEMA-SYNONYM-TOKENIZER.XML, BAD-SOLRCONFIG-INVALID-SCRIPTFILE.XML, JASUGGEST.TXT, SCHEMA-TFIDF.XML, SOLRCONFIG-SCRIPT-UPDATEPROCESSOR.XML, SCHEMA-LMJELINEKMERCER.XML, PHRASESUGGEST.TXT, BAD-SOLRCONFIG-MISSING-SCRIPTFILE.XML, BAD-SCHEMA-UNIQUEKEY-USES-DEFAULT.XML, OLD_SYNONYMS.TXT, SOLRCONFIG-DELPOLICY2.XML, XSLT, SOLRCONFIG-NATIVELOCK.XML, BAD-SCHEMA-DUP-FIELD.XML, SOLRCONFIG-NOCACHE.XML, SCHEMA-BM25.XML, ADDFIELDS.UPDATEPROCESSOR.JS, SOLRCONFIG-QUERYSENDER-NOQUERY.XML, SOLRCONFIG-ALTDIRECTORY.XML, COMPOUNDDICTIONARY.TXT, SOLRCONFIG_PERF.XML, SOLRCONFIG-INDEXCONFIG.XML, BAD-SCHEMA-ANALYZER-CLASS-AND-NESTED.XML, SCHEMA-NOT-REQUIRED-UNIQUE-KEY.XML, KEEP-2.TXT, BAD-SCHEMA-UNIQUEKEY-IS-COPYFIELD-DEST.XML, SCHEMA12.XML, MAPPING-ISOLATIN1ACCENT.TXT, BAD_SOLRCONFIG.XML, BAD-SCHEMA-EXTERNAL-FILEFIELD.XML]
[junit4:junit4]   2> 4096 T3629 oasc.CachingDirectoryFactory.close Releasing directory:/Users/jenkins/jenkins-slave/workspace/Lucene-Solr-trunk-MacOSX/solr/build/solr-core/test/J0/./solrtest-SoftAutoCommitTest-1359887594828
[junit4:junit4]   2> 4098 T3629 oass.SolrIndexSearcher.<init> Opening Searcher@16e4e59 main
[junit4:junit4]   2> 4099 T3629 oasu.CommitTracker.<init> Hard AutoCommit: disabled
[junit4:junit4]   2> 4099 T3629 oasu.CommitTracker.<init> Soft AutoCommit: disabled
[junit4:junit4]   2> 4100 T3629 oashc.SpellCheckComponent.inform Initializing spell checkers
[junit4:junit4]   2> 4102 T3629 oass.DirectSolrSpellChecker.init init: {name=direct,classname=DirectSolrSpellChecker,field=lowerfilt,minQueryLength=3}
[junit4:junit4]   2> 4117 T3634 oasc.SolrCore.registerSearcher [collection1] Registered new searcher Searcher@16e4e59 main{StandardDirectoryReader(segments_1:3:nrt _0(5.0):C5)}
[junit4:junit4]   2> 4132 T3632 oasu.DirectUpdateHandler2.commit start commit{,optimize=false,openSearcher=true,waitSearcher=true,expungeDeletes=false,softCommit=false}
[junit4:junit4]   2> 4133 T3629 oasc.CoreContainer.registerCore replacing core: collection1
[junit4:junit4]   2> 4134 T3629 oasc.SolrCore.close [collection1]  CLOSING SolrCore org.apache.solr.core.SolrCore@9c50e8d
[junit4:junit4]   2> 4140 T3629 oasu.DirectUpdateHandler2.close closing DirectUpdateHandler2{commits=2,autocommit maxTime=1200ms,autocommits=1,soft autocommit maxTime=500ms,soft autocommits=1,optimizes=0,rollbacks=0,expungeDeletes=0,docsPending=5,adds=0,deletesById=0,deletesByQuery=0,errors=0,cumulative_adds=5,cumulative_deletesById=0,cumulative_deletesByQuery=0,cumulative_errors=0}
[junit4:junit4]   2> 4141 T3629 oasc.SolrCore.closeSearcher [collection1] Closing main searcher on request.
[junit4:junit4]   2> 4142 T3632 oasc.SolrDeletionPolicy.onCommit SolrDeletionPolicy.onCommit: commits:num=2
[junit4:junit4]   2> 		commit{dir=RateLimitedDirectoryWrapper(MockDirWrapper(org.apache.lucene.store.RAMDirectory@1c093f32 lockFactory=org.apache.lucene.store.NativeFSLockFactory@7481e656)),segFN=segments_1,generation=1,filenames=[segments_1]
[junit4:junit4]   2> 		commit{dir=RateLimitedDirectoryWrapper(MockDirWrapper(org.apache.lucene.store.RAMDirectory@1c093f32 lockFactory=org.apache.lucene.store.NativeFSLockFactory@7481e656)),segFN=segments_2,generation=2,filenames=[_0_Asserting_0.tim, _0_Asserting_0.tip, _0_Lucene41_0.pos, _0_MockFixedIntBlock_0.tib, _0_MockFixedIntBlock_0.skp, _0_MockFixedIntBlock_0.pyl, _0_Pulsing41_0.tim, _0_Pulsing41_0.tip, _0_MockFixedIntBlock_0.tii, _0.si, _0_Lucene41_0.tim, _0_Asserting_0.doc, _0_Lucene41_0.tip, _0.fnm, _0_MockFixedIntBlock_0.pos, _0_nrm.cfs, _0_MockFixedIntBlock_0.frq, _0_Pulsing41_0.doc, _0_Pulsing41_0.pos, _0_Lucene41_0.doc, _0_MockFixedIntBlock_0.doc, _0_nrm.cfe, segments_2, _0.fdx, _0_Asserting_0.pos, _0.fdt]
[junit4:junit4]   2> 4143 T3632 oasc.SolrDeletionPolicy.updateCommits newest commit = 2[_0_Asserting_0.tim, _0_Asserting_0.tip, _0_Lucene41_0.pos, _0_MockFixedIntBlock_0.tib, _0_MockFixedIntBlock_0.skp, _0_MockFixedIntBlock_0.pyl, _0_Pulsing41_0.tim, _0_Pulsing41_0.tip, _0_MockFixedIntBlock_0.tii, _0.si, _0_Lucene41_0.tim, _0_Asserting_0.doc, _0_Lucene41_0.tip, _0.fnm, _0_MockFixedIntBlock_0.pos, _0_nrm.cfs, _0_MockFixedIntBlock_0.frq, _0_Pulsing41_0.doc, _0_Pulsing41_0.pos, _0_Lucene41_0.doc, _0_MockFixedIntBlock_0.doc, _0_nrm.cfe, segments_2, _0.fdx, _0_Asserting_0.pos, _0.fdt]
[junit4:junit4]   2> 4144 T3629 oasc.CachingDirectoryFactory.close Releasing directory:/Users/jenkins/jenkins-slave/workspace/Lucene-Solr-trunk-MacOSX/solr/build/solr-core/test/J0/./solrtest-SoftAutoCommitTest-1359887594828/index
[junit4:junit4]   2> 4145 T3632 oasc.CachingDirectoryFactory.close Releasing directory:/Users/jenkins/jenkins-slave/workspace/Lucene-Solr-trunk-MacOSX/solr/build/solr-core/test/J0/./solrtest-SoftAutoCommitTest-1359887594828
[junit4:junit4]   2> ASYNC  NEW_CORE C229 name=collection1 org.apache.solr.core.SolrCore@3d4b87d6
[junit4:junit4]   2> 4155 T3629 C229 UPDATE [collection1] webapp=null path=null params={} {add=[529]} 0 3
[junit4:junit4]   2> 4158 T3632 oass.SolrIndexSearcher.<init> Opening Searcher@2de67730 main
[junit4:junit4]   2> 4159 T3632 oasc.SolrException.log SEVERE auto commit error...:org.apache.solr.common.SolrException: java.util.concurrent.RejectedExecutionException
[junit4:junit4]   2> 		at org.apache.solr.core.SolrCore.getSearcher(SolrCore.java:1660)
[junit4:junit4]   2> 		at org.apache.solr.core.SolrCore.getSearcher(SolrCore.java:1312)
[junit4:junit4]   2> 		at org.apache.solr.update.DirectUpdateHandler2.commit(DirectUpdateHandler2.java:573)
[junit4:junit4]   2> 		at org.apache.solr.update.CommitTracker.run(CommitTracker.java:216)
[junit4:junit4]   2> 		at java.util.concurrent.Executors$RunnableAdapter.call(Executors.java:439)
[junit4:junit4]   2> 		at java.util.concurrent.FutureTask$Sync.innerRun(FutureTask.java:303)
[junit4:junit4]   2> 		at java.util.concurrent.FutureTask.run(FutureTask.java:138)
[junit4:junit4]   2> 		at java.util.concurrent.ScheduledThreadPoolExecutor$ScheduledFutureTask.access$301(ScheduledThreadPoolExecutor.java:98)
[junit4:junit4]   2> 		at java.util.concurrent.ScheduledThreadPoolExecutor$ScheduledFutureTask.run(ScheduledThreadPoolExecutor.java:206)
[junit4:junit4]   2> 		at java.util.concurrent.ThreadPoolExecutor$Worker.runTask(ThreadPoolExecutor.java:886)
[junit4:junit4]   2> 		at java.util.concurrent.ThreadPoolExecutor$Worker.run(ThreadPoolExecutor.java:908)
[junit4:junit4]   2> 		at java.lang.Thread.run(Thread.java:680)
[junit4:junit4]   2> 	Caused by: java.util.concurrent.RejectedExecutionException
[junit4:junit4]   2> 		at java.util.concurrent.ThreadPoolExecutor$AbortPolicy.rejectedExecution(ThreadPoolExecutor.java:1768)
[junit4:junit4]   2> 		at java.util.concurrent.ThreadPoolExecutor.reject(ThreadPoolExecutor.java:767)
[junit4:junit4]   2> 		at java.util.concurrent.ThreadPoolExecutor.execute(ThreadPoolExecutor.java:658)
[junit4:junit4]   2> 		at java.util.concurrent.AbstractExecutorService.submit(AbstractExecutorService.java:92)
[junit4:junit4]   2> 		at java.util.concurrent.Executors$DelegatedExecutorService.submit(Executors.java:602)
[junit4:junit4]   2> 		at org.apache.solr.core.SolrCore.getSearcher(SolrCore.java:1588)
[junit4:junit4]   2> 		... 11 more
[junit4:junit4]   2> 	
[junit4:junit4]   2> 4168 T3629 C229 oasu.DirectUpdateHandler2.commit start commit{,optimize=false,openSearcher=true,waitSearcher=true,expungeDeletes=false,softCommit=false}
[junit4:junit4]   2> 4175 T3629 C229 oasc.SolrDeletionPolicy.onCommit SolrDeletionPolicy.onCommit: commits:num=2
[junit4:junit4]   2> 		commit{dir=RateLimitedDirectoryWrapper(MockDirWrapper(org.apache.lucene.store.RAMDirectory@1c093f32 lockFactory=org.apache.lucene.store.NativeFSLockFactory@7481e656)),segFN=segments_2,generation=2,filenames=[_0_Asserting_0.tim, _0_Asserting_0.tip, _0_Lucene41_0.pos, _0_MockFixedIntBlock_0.tib, _0_MockFixedIntBlock_0.skp, _0_MockFixedIntBlock_0.pyl, _0_Pulsing41_0.tim, _0_Pulsing41_0.tip, _0_MockFixedIntBlock_0.tii, _0.si, _0_Lucene41_0.tim, _0_Asserting_0.doc, _0_Lucene41_0.tip, _0.fnm, _0_MockFixedIntBlock_0.pos, _0_nrm.cfs, _0_MockFixedIntBlock_0.frq, _0_Pulsing41_0.doc, _0_Pulsing41_0.pos, _0_Lucene41_0.doc, _0_MockFixedIntBlock_0.doc, _0_nrm.cfe, segments_2, _0.fdx, _0_Asserting_0.pos, _0.fdt]
[junit4:junit4]   2> 		commit{dir=RateLimitedDirectoryWrapper(MockDirWrapper(org.apache.lucene.store.RAMDirectory@1c093f32 lockFactory=org.apache.lucene.store.NativeFSLockFactory@7481e656)),segFN=segments_3,generation=3,filenames=[_1_Lucene41_0.doc, _0_Lucene41_0.pos, _1_MockFixedIntBlock_0.pyl, _0_MockFixedIntBlock_0.tib, _1.fnm, _1_Asserting_0.tim, _0_Pulsing41_0.tim, _0_MockFixedIntBlock_0.tii, _0_Pulsing41_0.tip, _1_Asserting_0.tip, _0_Lucene41_0.tim, _0_Lucene41_0.tip, _0_Asserting_0.doc, _1_Asserting_0.pos, _0.fnm, _1_MockFixedIntBlock_0.frq, _0_MockFixedIntBlock_0.pos, _1_Pulsing41_0.doc, _1_Lucene41_0.pos, _1.fdx, _1_Pulsing41_0.tip, _1_MockFixedIntBlock_0.skp, _0_Lucene41_0.doc, _1.fdt, _1_Pulsing41_0.tim, _1_MockFixedIntBlock_0.pos, _0_Asserting_0.tim, _0_Asserting_0.tip, _1_MockFixedIntBlock_0.doc, _1_Asserting_0.doc, _0_MockFixedIntBlock_0.pyl, _0_MockFixedIntBlock_0.skp, _0.si, _1_nrm.cfs, _1_MockFixedIntBlock_0.tii, _1_Lucene41_0.tim, _1_Lucene41_0.tip, _0_nrm.cfs, _1_Pulsing41_0.pos, _1_nrm.cfe, _0_MockFixedIntBlock_0.frq, _0_Pulsing41_0.pos, _0_Pulsing41_0.doc, _0_MockFixedIntBlock_0.doc, _1.si, _0_nrm.cfe, _1_MockFixedIntBlock_0.tib, _0.fdx, _0_Asserting_0.pos, segments_3, _0.fdt]
[junit4:junit4]   2> 4175 T3629 C229 oasc.SolrDeletionPolicy.updateCommits newest commit = 3[_1_Lucene41_0.doc, _0_Lucene41_0.pos, _1_MockFixedIntBlock_0.pyl, _0_MockFixedIntBlock_0.tib, _1.fnm, _1_Asserting_0.tim, _0_Pulsing41_0.tim, _0_MockFixedIntBlock_0.tii, _0_Pulsing41_0.tip, _1_Asserting_0.tip, _0_Lucene41_0.tim, _0_Lucene41_0.tip, _0_Asserting_0.doc, _1_Asserting_0.pos, _0.fnm, _1_MockFixedIntBlock_0.frq, _0_MockFixedIntBlock_0.pos, _1_Pulsing41_0.doc, _1_Lucene41_0.pos, _1.fdx, _1_Pulsing41_0.tip, _1_MockFixedIntBlock_0.skp, _0_Lucene41_0.doc, _1.fdt, _1_Pulsing41_0.tim, _1_MockFixedIntBlock_0.pos, _0_Asserting_0.tim, _0_Asserting_0.tip, _1_MockFixedIntBlock_0.doc, _1_Asserting_0.doc, _0_MockFixedIntBlock_0.pyl, _0_MockFixedIntBlock_0.skp, _0.si, _1_nrm.cfs, _1_MockFixedIntBlock_0.tii, _1_Lucene41_0.tim, _1_Lucene41_0.tip, _0_nrm.cfs, _1_Pulsing41_0.pos, _1_nrm.cfe, _0_MockFixedIntBlock_0.frq, _0_Pulsing41_0.pos, _0_Pulsing41_0.doc, _0_MockFixedIntBlock_0.doc, _1.si, _0_nrm.cfe, _1_MockFixedIntBlock_0.tib, _0.fdx, _0_Asserting_0.pos, segments_3, _0.fdt]
[junit4:junit4]   2> 4176 T3629 C229 oasc.CachingDirectoryFactory.close Releasing directory:/Users/jenkins/jenkins-slave/workspace/Lucene-Solr-trunk-MacOSX/solr/build/solr-core/test/J0/./solrtest-SoftAutoCommitTest-1359887594828
[junit4:junit4]   2> 4179 T3629 C229 oass.SolrIndexSearcher.<init> Opening Searcher@560ae0fc main
[junit4:junit4]   2> 4180 T3629 C229 oasu.DirectUpdateHandler2.commit end_commit_flush
[junit4:junit4]   2> 4182 T3634 oasc.SolrCore.registerSearcher [collection1] Registered new searcher Searcher@560ae0fc main{StandardDirectoryReader(segments_3:5:nrt _0(5.0):C5 _1(5.0):C1)}
[junit4:junit4]   2> 4182 T3634 oasc.CachingDirectoryFactory.close Releasing directory:/Users/jenkins/jenkins-slave/workspace/Lucene-Solr-trunk-MacOSX/solr/build/solr-core/test/J0/./solrtest-SoftAutoCommitTest-1359887594828/index
[junit4:junit4]   2> 4182 T3629 C229 UPDATE [collection1] webapp=null path=null params={} {commit=} 0 15
[junit4:junit4]   2> 4194 T3629 C229 UPDATE [collection1] webapp=null path=null params={} {delete=[529]} 0 1
[junit4:junit4]   2> 4696 T3636 oasu.DirectUpdateHandler2.commit start commit{,optimize=false,openSearcher=true,waitSearcher=true,expungeDeletes=false,softCommit=true}
[junit4:junit4]   2> 4697 T3636 oasc.CachingDirectoryFactory.close Releasing directory:/Users/jenkins/jenkins-slave/workspace/Lucene-Solr-trunk-MacOSX/solr/build/solr-core/test/J0/./solrtest-SoftAutoCommitTest-1359887594828
[junit4:junit4]   2> 4697 T3636 oass.SolrIndexSearcher.<init> Opening Searcher@71f75ad9 main
[junit4:junit4]   2> 4698 T3636 oasu.DirectUpdateHandler2.commit end_commit_flush
[junit4:junit4]   2> 4699 T3634 oasc.SolrCore.registerSearcher [collection1] Registered new searcher Searcher@71f75ad9 main{StandardDirectoryReader(segments_3:7:nrt _0(5.0):C5)}
[junit4:junit4]   2> 4700 T3634 oasc.CachingDirectoryFactory.close Releasing directory:/Users/jenkins/jenkins-slave/workspace/Lucene-Solr-trunk-MacOSX/solr/build/solr-core/test/J0/./solrtest-SoftAutoCommitTest-1359887594828/index
[junit4:junit4]   2> 4708 T3629 C229 UPDATE [collection1] webapp=null path=null params={} {add=[550]} 0 1
[junit4:junit4]   2> 5210 T3636 oasu.DirectUpdateHandler2.commit start commit{,optimize=false,openSearcher=true,waitSearcher=true,expungeDeletes=false,softCommit=true}
[junit4:junit4]   2> 5210 T3636 oasc.CachingDirectoryFactory.close Releasing directory:/Users/jenkins/jenkins-slave/workspace/Lucene-Solr-trunk-MacOSX/solr/build/solr-core/test/J0/./solrtest-SoftAutoCommitTest-1359887594828
[junit4:junit4]   2> 5215 T3636 oass.SolrIndexSearcher.<init> Opening Searcher@1e28ba9d main
[junit4:junit4]   2> 5216 T3636 oasu.DirectUpdateHandler2.commit end_commit_flush
[junit4:junit4]   2> 5218 T3634 oasc.SolrCore.registerSearcher [collection1] Registered new searcher Searcher@1e28ba9d main{StandardDirectoryReader(segments_3:9:nrt _0(5.0):C5 _2(5.0):C1)}
[junit4:junit4]   2> 5218 T3634 oasc.CachingDirectoryFactory.close Releasing directory:/Users/jenkins/jenkins-slave/workspace/Lucene-Solr-trunk-MacOSX/solr/build/solr-core/test/J0/./solrtest-SoftAutoCommitTest-1359887594828/index
[junit4:junit4]   2> 5395 T3635 oasu.DirectUpdateHandler2.commit start commit{,optimize=false,openSearcher=true,waitSearcher=true,expungeDeletes=false,softCommit=false}
[junit4:junit4]   2> 5397 T3635 oasc.SolrDeletionPolicy.onCommit SolrDeletionPolicy.onCommit: commits:num=2
[junit4:junit4]   2> 		commit{dir=RateLimitedDirectoryWrapper(MockDirWrapper(org.apache.lucene.store.RAMDirectory@1c093f32 lockFactory=org.apache.lucene.store.NativeFSLockFactory@7481e656)),segFN=segments_3,generation=3,filenames=[_1_Lucene41_0.doc, _0_Lucene41_0.pos, _1_MockFixedIntBlock_0.pyl, _0_MockFixedIntBlock_0.tib, _1.fnm, _1_Asserting_0.tim, _0_Pulsing41_0.tim, _0_MockFixedIntBlock_0.tii, _0_Pulsing41_0.tip, _1_Asserting_0.tip, _0_Lucene41_0.tim, _0_Lucene41_0.tip, _0_Asserting_0.doc, _1_Asserting_0.pos, _0.fnm, _1_MockFixedIntBlock_0.frq, _0_MockFixedIntBlock_0.pos, _1_Pulsing41_0.doc, _1_Lucene41_0.pos, _1.fdx, _1_Pulsing41_0.tip, _1_MockFixedIntBlock_0.skp, _0_Lucene41_0.doc, _1.fdt, _1_Pulsing41_0.tim, _1_MockFixedIntBlock_0.pos, _0_Asserting_0.tim, _0_Asserting_0.tip, _1_MockFixedIntBlock_0.doc, _1_Asserting_0.doc, _0_MockFixedIntBlock_0.pyl, _0_MockFixedIntBlock_0.skp, _0.si, _1_nrm.cfs, _1_MockFixedIntBlock_0.tii, _1_Lucene41_0.tim, _1_Lucene41_0.tip, _0_nrm.cfs, _1_Pulsing41_0.pos, _1_nrm.cfe, _0_MockFixedIntBlock_0.frq, _0_Pulsing41_0.pos, _0_Pulsing41_0.doc, _0_MockFixedIntBlock_0.doc, _1.si, _0_nrm.cfe, _1_MockFixedIntBlock_0.tib, _0.fdx, _0_Asserting_0.pos, segments_3, _0.fdt]
[junit4:junit4]   2> 		commit{dir=RateLimitedDirectoryWrapper(MockDirWrapper(org.apache.lucene.store.RAMDirectory@1c093f32 lockFactory=org.apache.lucene.store.NativeFSLockFactory@7481e656)),segFN=segments_4,generation=4,filenames=[_2_Lucene41_0.pos, _2_Pulsing41_0.doc, _2_Lucene41_0.tim, _2_Asserting_0.pos, _0_Lucene41_0.pos, _0_MockFixedIntBlock_0.tib, _2_Lucene41_0.tip, _2_MockFixedIntBlock_0.tii, _2_Pulsing41_0.tim, _2_MockFixedIntBlock_0.tib, _2_MockFixedIntBlock_0.pyl, _0_Pulsing41_0.tim, _0_MockFixedIntBlock_0.tii, _0_Pulsing41_0.tip, _2_Pulsing41_0.tip, _2_MockFixedIntBlock_0.frq, _0_Lucene41_0.tim, _0_Lucene41_0.tip, _0_Asserting_0.doc, _0.fnm, _2.fdt, _0_MockFixedIntBlock_0.pos, _2_Lucene41_0.doc, _2.fdx, _2_Asserting_0.tim, _2_Pulsing41_0.pos, _2_Asserting_0.tip, _2_MockFixedIntBlock_0.pos, _0_Lucene41_0.doc, _2_MockFixedIntBlock_0.doc, _0_Asserting_0.tim, _2.si, _0_Asserting_0.tip, _2_MockFixedIntBlock_0.skp, _2_nrm.cfe, _0_MockFixedIntBlock_0.pyl, _0_MockFixedIntBlock_0.skp, _2_Asserting_0.doc, _0.si, _2_nrm.cfs, _0_nrm.cfs, _2.fnm, _0_MockFixedIntBlock_0.frq, _0_Pulsing41_0.pos, _0_Pulsing41_0.doc, _0_MockFixedIntBlock_0.doc, _0_nrm.cfe, _0.fdx, _0_Asserting_0.pos, _0.fdt, segments_4]
[junit4:junit4]   2> 5398 T3635 oasc.SolrDeletionPolicy.updateCommits newest commit = 4[_2_Lucene41_0.pos, _2_Pulsing41_0.doc, _2_Lucene41_0.tim, _2_Asserting_0.pos, _0_Lucene41_0.pos, _0_MockFixedIntBlock_0.tib, _2_Lucene41_0.tip, _2_MockFixedIntBlock_0.tii, _2_Pulsing41_0.tim, _2_MockFixedIntBlock_0.tib, _2_MockFixedIntBlock_0.pyl, _0_Pulsing41_0.tim, _0_MockFixedIntBlock_0.tii, _0_Pulsing41_0.tip, _2_Pulsing41_0.tip, _2_MockFixedIntBlock_0.frq, _0_Lucene41_0.tim, _0_Lucene41_0.tip, _0_Asserting_0.doc, _0.fnm, _2.fdt, _0_MockFixedIntBlock_0.pos, _2_Lucene41_0.doc, _2.fdx, _2_Asserting_0.tim, _2_Pulsing41_0.pos, _2_Asserting_0.tip, _2_MockFixedIntBlock_0.pos, _0_Lucene41_0.doc, _2_MockFixedIntBlock_0.doc, _0_Asserting_0.tim, _2.si, _0_Asserting_0.tip, _2_MockFixedIntBlock_0.skp, _2_nrm.cfe, _0_MockFixedIntBlock_0.pyl, _0_MockFixedIntBlock_0.skp, _2_Asserting_0.doc, _0.si, _2_nrm.cfs, _0_nrm.cfs, _2.fnm, _0_MockFixedIntBlock_0.frq, _0_Pulsing41_0.pos, _0_Pulsing41_0.doc, _0_MockFixedIntBlock_0.doc, _0_nrm.cfe, _0.fdx, _0_Asserting_0.pos, _0.fdt, segments_4]
[junit4:junit4]   2> 5400 T3635 oasc.CachingDirectoryFactory.close Releasing directory:/Users/jenkins/jenkins-slave/workspace/Lucene-Solr-trunk-MacOSX/solr/build/solr-core/test/J0/./solrtest-SoftAutoCommitTest-1359887594828
[junit4:junit4]   2> 5400 T3635 oass.SolrIndexSearcher.<init> Opening Searcher@6a3358b1 main
[junit4:junit4]   2> 5401 T3635 oasu.DirectUpdateHandler2.commit end_commit_flush
[junit4:junit4]   2> 5402 T3634 oasc.SolrCore.registerSearcher [collection1] Registered new searcher Searcher@6a3358b1 main{StandardDirectoryReader(segments_3:9:nrt _0(5.0):C5 _2(5.0):C1)}
[junit4:junit4]   2> 5402 T3634 oasc.CachingDirectoryFactory.close Releasing directory:/Users/jenkins/jenkins-slave/workspace/Lucene-Solr-trunk-MacOSX/solr/build/solr-core/test/J0/./solrtest-SoftAutoCommitTest-1359887594828/index
[junit4:junit4]   2> 7401 T3629 oas.SolrTestCaseJ4.tearDown ###Ending testSoftAndHardCommitMaxTimeDelete
[junit4:junit4]   2> 7409 T3629 oas.SolrTestCaseJ4.setUp ###Starting testSoftAndHardCommitMaxTimeMixedAdds
[junit4:junit4]   2> 7410 T3629 oasc.CoreContainer.reload Reloading SolrCore 'collection1' using instanceDir: /Users/jenkins/jenkins-slave/workspace/Lucene-Solr-trunk-MacOSX/solr/build/solr-core/test-files/solr/collection1
[junit4:junit4]   2> 7410 T3629 oasc.SolrResourceLoader.<init> new SolrResourceLoader for directory: '/Users/jenkins/jenkins-slave/workspace/Lucene-Solr-trunk-MacOSX/solr/build/solr-core/test-files/solr/collection1/'
[junit4:junit4]   2> 7411 T3629 oasc.SolrResourceLoader.replaceClassLoader Adding 'file:/Users/jenkins/jenkins-slave/workspace/Lucene-Solr-trunk-MacOSX/solr/build/solr-core/test-files/solr/collection1/lib/classes/' to classloader
[junit4:junit4]   2> 7412 T3629 oasc.SolrResourceLoader.replaceClassLoader Adding 'file:/Users/jenkins/jenkins-slave/workspace/Lucene-Solr-trunk-MacOSX/solr/build/solr-core/test-files/solr/collection1/lib/README' to classloader
[junit4:junit4]   2> 7474 T3629 oasc.SolrConfig.<init> Using Lucene MatchVersion: LUCENE_50
[junit4:junit4]   2> 7568 T3629 oasc.SolrConfig.<init> Loaded SolrConfig: solrconfig.xml
[junit4:junit4]   2> 7569 T3629 oass.IndexSchema.readSchema Reading Solr Schema
[junit4:junit4]   2> 7576 T3629 oass.IndexSchema.readSchema Schema name=test
[junit4:junit4]   2> 8401 T3629 oass.OpenExchangeRatesOrgProvider.init Initialized with rates=open-exchange-rates.json, refreshInterval=1440.
[junit4:junit4]   2> 8408 T3629 oass.IndexSchema.readSchema default search field in schema is text
[junit4:junit4]   2> 8412 T3629 oass.IndexSchema.readSchema unique key field: id
[junit4:junit4]   2> 8421 T3629 oass.FileExchangeRateProvider.reload Reloading exchange rates from file currency.xml
[junit4:junit4]   2> 8426 T3629 oass.FileExchangeRateProvider.reload Reloading exchange rates from file currency.xml
[junit4:junit4]   2> 8431 T3629 oass.OpenExchangeRatesOrgProvider.reload Reloading exchange rates from open-exchange-rates.json
[junit4:junit4]   2> 8431 T3629 oass.OpenExchangeRatesOrgProvider.reload Reloading exchange rates from open-exchange-rates.json
[junit4:junit4]   2> 8432 T3629 oasc.SolrCore.<init> [collection1] Opening new SolrCore at /Users/jenkins/jenkins-slave/workspace/Lucene-Solr-trunk-MacOSX/solr/build/solr-core/test-files/solr/collection1/, dataDir=/Users/jenkins/jenkins-slave/workspace/Lucene-Solr-trunk-MacOSX/solr/build/solr-core/test/J0/./solrtest-SoftAutoCommitTest-1359887594828/
[junit4:junit4]   2> 8433 T3629 oasc.JmxMonitoredMap.<init> JMX monitoring is enabled. Adding Solr mbeans to JMX Server: com.sun.jmx.mbeanserver.JmxMBeanServer@38a1aa85
[junit4:junit4]   2> 8433 T3629 oasc.CachingDirectoryFactory.close Releasing directory:/Users/jenkins/jenkins-slave/workspace/Lucene-Solr-trunk-MacOSX/solr/build/solr-core/test/J0/./solrtest-SoftAutoCommitTest-1359887594828
[junit4:junit4]   2> 8434 T3629 oasc.SolrCore.getNewIndexDir New index directory detected: old=null new=/Users/jenkins/jenkins-slave/workspace/Lucene-Solr-trunk-MacOSX/solr/build/solr-core/test/J0/./solrtest-SoftAutoCommitTest-1359887594828/index/
[junit4:junit4]   2> 8434 T3629 oasc.SolrCore.initWriters created xml: solr.XMLResponseWriter
[junit4:junit4]   2> 8436 T3629 oasup.UpdateRequestProcessorChain.init inserting DistributedUpdateProcessorFactory into updateRequestProcessorChain "dedupe"
[junit4:junit4]   2> 8437 T3629 oasup.UpdateRequestProcessorChain.init inserting DistributedUpdateProcessorFactory into updateRequestProcessorChain "dedupe-allfields"
[junit4:junit4]   2> 8437 T3629 oasup.UpdateRequestProcessorChain.init inserting DistributedUpdateProcessorFactory into updateRequestProcessorChain "stored_sig"
[junit4:junit4]   2> 8438 T3629 oasup.UpdateRequestProcessorChain.init inserting DistributedUpdateProcessorFactory into updateRequestProcessorChain "uniq-fields"
[junit4:junit4]   2> 8439 T3629 oasup.UpdateRequestProcessorChain.init inserting DistributedUpdateProcessorFactory into updateRequestProcessorChain "distrib-dup-test-chain-implicit"
[junit4:junit4]   2> 8439 T3629 oasc.RequestHandlers.initHandlersFromConfig adding lazy requestHandler: solr.ReplicationHandler
[junit4:junit4]   2> 8440 T3629 oasc.RequestHandlers.initHandlersFromConfig created /replication: solr.ReplicationHandler
[junit4:junit4]   2> 8440 T3629 oasc.RequestHandlers.initHandlersFromConfig created standard: solr.StandardRequestHandler
[junit4:junit4]   2> 8441 T3629 oasc.RequestHandlers.initHandlersFromConfig created /get: solr.RealTimeGetHandler
[junit4:junit4]   2> 8442 T3629 oasc.RequestHandlers.initHandlersFromConfig created dismax: solr.SearchHandler
[junit4:junit4]   2> 8443 T3629 oasc.RequestHandlers.initHandlersFromConfig created mock: org.apache.solr.core.MockQuerySenderListenerReqHandler
[junit4:junit4]   2> 8443 T3629 oasc.RequestHandlers.initHandlersFromConfig created /admin/: org.apache.solr.handler.admin.AdminHandlers
[junit4:junit4]   2> 8444 T3629 oasc.RequestHandlers.initHandlersFromConfig created defaults: solr.StandardRequestHandler
[junit4:junit4]   2> 8444 T3629 oasc.RequestHandlers.initHandlersFromConfig adding lazy requestHandler: solr.StandardRequestHandler
[junit4:junit4]   2> 8445 T3629 oasc.RequestHandlers.initHandlersFromConfig created lazy: solr.StandardRequestHandler
[junit4:junit4]   2> 8447 T3629 oasc.RequestHandlers.initHandlersFromConfig created /update: solr.UpdateRequestHandler
[junit4:junit4]   2> 8447 T3629 oasc.RequestHandlers.initHandlersFromConfig created /terms: org.apache.solr.handler.component.SearchHandler
[junit4:junit4]   2> 8448 T3629 oasc.RequestHandlers.initHandlersFromConfig created spellCheckCompRH: org.apache.solr.handler.component.SearchHandler
[junit4:junit4]   2> 8449 T3629 oasc.RequestHandlers.initHandlersFromConfig created spellCheckCompRH_Direct: org.apache.solr.handler.component.SearchHandler
[junit4:junit4]   2> 8450 T3629 oasc.RequestHandlers.initHandlersFromConfig created spellCheckWithWordbreak: org.apache.solr.handler.component.SearchHandler
[junit4:junit4]   2> 8450 T3629 oasc.RequestHandlers.initHandlersFromConfig created spellCheckWithWordbreak_Direct: org.apache.solr.handler.component.SearchHandler
[junit4:junit4]   2> 8451 T3629 oasc.RequestHandlers.initHandlersFromConfig created spellCheckCompRH1: org.apache.solr.handler.component.SearchHandler
[junit4:junit4]   2> 8452 T3629 oasc.RequestHandlers.initHandlersFromConfig created mltrh: org.apache.solr.handler.component.SearchHandler
[junit4:junit4]   2> 8453 T3629 oasc.RequestHandlers.initHandlersFromConfig created tvrh: org.apache.solr.handler.component.SearchHandler
[junit4:junit4]   2> 8454 T3629 oasc.RequestHandlers.initHandlersFromConfig created /mlt: solr.MoreLikeThisHandler
[junit4:junit4]   2> 8454 T3629 oasc.RequestHandlers.initHandlersFromConfig created /debug/dump: solr.DumpRequestHandler
[junit4:junit4]   2> 8457 T3629 oashl.XMLLoader.init xsltCacheLifetimeSeconds=60
[junit4:junit4]   2> 8459 T3629 oasc.SolrCore.initDeprecatedSupport WARNING solrconfig.xml uses deprecated <admin/gettableFiles>, Please update your config to use the ShowFileRequestHandler.
[junit4:junit4]   2> 8461 T3629 oasc.SolrCore.initDeprecatedSupport WARNING adding ShowFileRequestHandler with hidden files: [THROW.ERROR.ON.ADD.UPDATEPROCESSOR.JS, SOLRCONFIG-HIGHLIGHT.XML, SCHEMA-REQUIRED-FIELDS.XML, TRIVIAL.UPDATEPROCESSOR1.JS, BAD-SCHEMA-DUP-DYNAMICFIELD.XML, SCHEMA-MINIMAL.XML, SCHEMA-REPLICATION2.XML, SOLRCONFIG-CACHING.XML, SCHEMA-POSTINGSHIGHLIGHT.XML, SOLRCONFIG-REPEATER.XML, REGEX-BOOST-PROCESSOR-TEST.TXT, SOLRCONFIG-MERGEPOLICY.XML, CURRENCY.XML, BAD-SCHEMA-NONTEXT-ANALYZER.XML, SOLRCONFIG-TLOG.XML, SOLRCONFIG-MASTER.XML, SOLRCONFIG-COMPONENTS-NAME.XML, BAD-SCHEMA-UNIQUEKEY-MULTIVALUED.XML, SCHEMA11.XML, SOLRCONFIG-BASIC.XML, DA_COMPOUNDDICTIONARY.TXT, MISSLEADING.EXTENSION.UPDATEPROCESSOR.JS.TXT, SCHEMA-COPYFIELD-TEST.XML, SOLRCONFIG-SLAVE.XML, SOLRCONFIG-PROPINJECT-INDEXDEFAULT.XML, ELEVATE.XML, TRIVIAL.UPDATEPROCESSOR0.JS, BAD-SOLRCONFIG-BOGUS-SCRIPTENGINE-NAME.XML, SCHEMA-CHARFILTERS.XML, SCHEMA-IB.XML, SOLRCONFIG-QUERYSENDER.XML, SOLRCONFIG-SNIPPET-PROCESSOR.XML, DA_UTF8.XML, SCHEMA-REPLICATION1.XML, CONDITIONAL.UPDATEPROCESSOR.JS, MISSING.FUNCTIONS.UPDATEPROCESSOR.JS, HYPHENATION.DTD, SOLRCONFIG-ENABLEPLUGIN.XML, STEMDICT.TXT, SCHEMA-PHRASESUGGEST.XML, HUNSPELL-TEST.AFF, SCHEMA-SNIPPET-TYPE.XML, STOPTYPES-1.TXT, STOPWORDSWRONGENCODING.TXT, SCHEMA-NUMERIC.XML, SOLRCONFIG-TRANSFORMERS.XML, SOLRCONFIG-PROPINJECT.XML, BAD-SCHEMA-NOT-INDEXED-BUT-TF.XML, SOLRCONFIG-SIMPLELOCK.XML, WDFTYPES.TXT, STOPTYPES-2.TXT, SCHEMA-REVERSED.XML, BAD-SCHEMA-CURRENCY-FT-MULTIVALUED.XML, SOLRCONFIG-SPELLCHECKCOMPONENT.XML, SOLRCONFIG-PHRASESUGGEST.XML, BAD-SCHEMA-CURRENCY-MULTIVALUED.XML, SCHEMA-DFR.XML, BAD-SCHEMA-NOT-INDEXED-BUT-POS.XML, KEEP-1.TXT, OPEN-EXCHANGE-RATES.JSON, SCHEMA-SPATIAL.XML, STOPWITHBOM.TXT, SOLRCONFIG-SPELLCHECKER.XML, SOLRCONFIG-POSTINGSHIGHLIGHT.XML, SCHEMA-BINARYFIELD.XML, SOLRCONFIG-UPDATE-PROCESSOR-CHAINS.XML, BAD-SCHEMA-OMIT-TF-BUT-NOT-POS.XML, BAD-SCHEMA-DUP-FIELDTYPE.XML, SCHEMA-XINCLUDE.XML, SOLRCONFIG-MASTER1.XML, SCHEMA-BEHAVIOR.XML, SYNONYMS.TXT, BAD-SCHEMA-CURRENCY-DYNAMIC-MULTIVALUED.XML, SCHEMA.XML, SCHEMA_CODEC.XML, SOLRCONFIG-SOLR-749.XML, SOLRCONFIG-MASTER1-KEEPONEBACKUP.XML, SCHEMA-EFF.XML, STOP-2.TXT, SOLRCONFIG-FUNCTIONQUERY.XML, SOLRCONFIG-TERMINDEX.XML, SCHEMA-LMDIRICHLET.XML, SOLRCONFIG-ELEVATE.XML, STOPWORDS.TXT, SCHEMA-FOLDING.XML, SCHEMA-STOP-KEEP.XML, FUZZYSUGGEST.TXT, BAD-SCHEMA-NOT-INDEXED-BUT-NORMS.XML, SOLRCONFIG-SOLCOREPROPERTIES.XML, STOP-1.TXT, SOLRCONFIG-MASTER2.XML, SCHEMA-SPELLCHECKER.XML, SOLRCONFIG-RESPONSE-LOG-COMPONENT.XML, SOLRCONFIG-LAZYWRITER.XML, SCHEMA-LUCENEMATCHVERSION.XML, FRENCHARTICLES.TXT, BAD-MP-SOLRCONFIG.XML, SCHEMA15.XML, SOLRCONFIG-REQHANDLER.INCL, SCHEMASURROUND.XML, SOLRCONFIG-MASTER3.XML, HUNSPELL-TEST.DIC, SOLRCONFIG-XINCLUDE.XML, BAD-SCHEMA-CODEC-GLOBAL-VS-FT-MISMATCH.XML, SOLRCONFIG-SLAVE1.XML, SOLRCONFIG-DELPOLICY1.XML, SCHEMA-SIM.XML, SCHEMA-SNIPPET-FIELD.XML, SCHEMA-COLLATE.XML, STOP-SNOWBALL.TXT, BAD-SCHEMA-SIM-GLOBAL-VS-FT-MISMATCH.XML, PROTWORDS.TXT, SCHEMA-TRIE.XML, SOLRCONFIG_CODEC.XML, SCHEMA-SYNONYM-TOKENIZER.XML, BAD-SOLRCONFIG-INVALID-SCRIPTFILE.XML, JASUGGEST.TXT, SCHEMA-TFIDF.XML, SOLRCONFIG-SCRIPT-UPDATEPROCESSOR.XML, SCHEMA-LMJELINEKMERCER.XML, PHRASESUGGEST.TXT, BAD-SOLRCONFIG-MISSING-SCRIPTFILE.XML, BAD-SCHEMA-UNIQUEKEY-USES-DEFAULT.XML, OLD_SYNONYMS.TXT, SOLRCONFIG-DELPOLICY2.XML, XSLT, SOLRCONFIG-NATIVELOCK.XML, BAD-SCHEMA-DUP-FIELD.XML, SOLRCONFIG-NOCACHE.XML, SCHEMA-BM25.XML, ADDFIELDS.UPDATEPROCESSOR.JS, SOLRCONFIG-QUERYSENDER-NOQUERY.XML, SOLRCONFIG-ALTDIRECTORY.XML, COMPOUNDDICTIONARY.TXT, SOLRCONFIG_PERF.XML, SOLRCONFIG-INDEXCONFIG.XML, BAD-SCHEMA-ANALYZER-CLASS-AND-NESTED.XML, SCHEMA-NOT-REQUIRED-UNIQUE-KEY.XML, KEEP-2.TXT, BAD-SCHEMA-UNIQUEKEY-IS-COPYFIELD-DEST.XML, SCHEMA12.XML, MAPPING-ISOLATIN1ACCENT.TXT, BAD_SOLRCONFIG.XML, BAD-SCHEMA-EXTERNAL-FILEFIELD.XML]
[junit4:junit4]   2> 8464 T3629 oasc.CachingDirectoryFactory.close Releasing directory:/Users/jenkins/jenkins-slave/workspace/Lucene-Solr-trunk-MacOSX/solr/build/solr-core/test/J0/./solrtest-SoftAutoCommitTest-1359887594828
[junit4:junit4]   2> 8464 T3629 oass.SolrIndexSearcher.<init> Opening Searcher@5854ab3c main
[junit4:junit4]   2> 8465 T3629 oasu.CommitTracker.<init> Hard AutoCommit: disabled
[junit4:junit4]   2> 8465 T3629 oasu.CommitTracker.<init> Soft AutoCommit: disabled
[junit4:junit4]   2> 8466 T3629 oashc.SpellCheckComponent.inform Initializing spell checkers
[junit4:junit4]   2> 8468 T3629 oass.DirectSolrSpellChecker.init init: {name=direct,classname=DirectSolrSpellChecker,field=lowerfilt,minQueryLength=3}
[junit4:junit4]   2> 8481 T3637 oasc.SolrCore.registerSearcher [collection1] Registered new searcher Searcher@5854ab3c main{StandardDirectoryReader(segments_4:9:nrt _0(5.0):C5 _2(5.0):C1)}
[junit4:junit4]   2> 8487 T3629 oasc.CoreContainer.registerCore replacing core: collection1
[junit4:junit4]   2> 8488 T3629 oasc.SolrCore.close [collection1]  CLOSING SolrCore org.apache.solr.core.SolrCore@3d4b87d6
[junit4:junit4]   2> 8494 T3629 oasu.DirectUpdateHandler2.close closing DirectUpdateHandler2{commits=4,autocommit maxTime=1200ms,autocommits=1,soft autocommit maxTime=500ms,soft autocommits=2,optimizes=0,rollbacks=0,expungeDeletes=0,docsPending=0,adds=0,deletesById=0,deletesByQuery=0,errors=0,cumulative_adds=2,cumulative_deletesById=1,cumulative_deletesByQuery=0,cumulative_errors=0}
[junit4:junit4]   2> 8495 T3629 oasc.SolrCore.closeSearcher [collection1] Closing main searcher on request.
[junit4:junit4]   2> 8496 T3629 oasc.CachingDirectoryFactory.close Releasing directory:/Users/jenkins/jenkins-slave/workspace/Lucene-Solr-trunk-MacOSX/solr/build/solr-core/test/J0/./solrtest-SoftAutoCommitTest-1359887594828/index
[junit4:junit4]   2> ASYNC  NEW_CORE C230 name=collection1 org.apache.solr.core.SolrCore@1abb7c4d
[junit4:junit4]   2> 8509 T3629 C230 UPDATE [collection1] webapp=null path=null params={} {add=[529]} 0 3
[junit4:junit4]   2> 9010 T3639 oasu.DirectUpdateHandler2.commit start commit{,optimize=false,openSearcher=true,waitSearcher=true,expungeDeletes=false,softCommit=true}
[junit4:junit4]   2> 9011 T3639 oasc.CachingDirectoryFactory.close Releasing directory:/Users/jenkins/jenkins-slave/workspace/Lucene-Solr-trunk-MacOSX/solr/build/solr-core/test/J0/./solrtest-SoftAutoCommitTest-1359887594828
[junit4:junit4]   2> 9019 T3639 oass.SolrIndexSearcher.<init> Opening Searcher@6f69d1c6 main
[junit4:junit4]   2> 9020 T3639 oasu.DirectUpdateHandler2.commit end_commit_flush
[junit4:junit4]   2> 9022 T3637 oasc.SolrCore.registerSearcher [collection1] Registered new searcher Searcher@6f69d1c6 main{StandardDirectoryReader(segments_4:11:nrt _0(5.0):C5 _2(5.0):C1 _3(5.0):C1)}
[junit4:junit4]   2> 9022 T3637 oasc.CachingDirectoryFactory.close Releasing directory:/Users/jenkins/jenkins-slave/workspace/Lucene-Solr-trunk-MacOSX/solr/build/solr-core/test/J0/./solrtest-SoftAutoCommitTest-1359887594828/index
[junit4:junit4]   2> 9030 T3629 C230 UPDATE [collection1] webapp=null path=null params={} {add=[530]} 0 1
[junit4:junit4]   2> 9530 T3639 oasu.DirectUpdateHandler2.commit start commit{,optimize=false,openSearcher=true,waitSearcher=true,expungeDeletes=false,softCommit=true}
[junit4:junit4]   2> 9531 T3639 oasc.CachingDirectoryFactory.close Releasing directory:/Users/jenkins/jenkins-slave/workspace/Lucene-Solr-trunk-MacOSX/solr/build/solr-core/test/J0/./solrtest-SoftAutoCommitTest-1359887594828
[junit4:junit4]   2> 9542 T3639 oass.SolrIndexSearcher.<init> Opening Searcher@65da6a88 main
[junit4:junit4]   2> 9542 T3639 oasu.DirectUpdateHandler2.commit end_commit_flush
[junit4:junit4]   2> 9545 T3637 oasc.SolrCore.registerSearcher [collection1] Registered new searcher Searcher@65da6a88 main{StandardDirectoryReader(segments_4:13:nrt _0(5.0):C5 _2(5.0):C1 _3(5.0):C1 _4(5.0):C1)}
[junit4:junit4]   2> 9546 T3637 oasc.CachingDirectoryFactory.close Releasing directory:/Users/jenkins/jenkins-slave/workspace/Lucene-Solr-trunk-MacOSX/solr/build/solr-core/test/J0/./solrtest-SoftAutoCommitTest-1359887594828/index
[junit4:junit4]   2> 9709 T3638 oasu.DirectUpdateHandler2.commit start commit{,optimize=false,openSearcher=true,waitSearcher=true,expungeDeletes=false,softCommit=false}
[junit4:junit4]   2> 9712 T3638 oasc.SolrDeletionPolicy.onCommit SolrDeletionPolicy.onCommit: commits:num=2
[junit4:junit4]   2> 		commit{dir=RateLimitedDirectoryWrapper(MockDirWrapper(org.apache.lucene.store.RAMDirectory@1c093f32 lockFactory=org.apache.lucene.store.NativeFSLockFactory@7481e656)),segFN=segments_4,generation=4,filenames=[_2_Lucene41_0.pos, _2_Pulsing41_0.doc, _2_Lucene41_0.tim, _2_Asserting_0.pos, _0_Lucene41_0.pos, _0_MockFixedIntBlock_0.tib, _2_Lucene41_0.tip, _2_MockFixedIntBlock_0.tii, _2_Pulsing41_0.tim, _2_MockFixedIntBlock_0.tib, _2_MockFixedIntBlock_0.pyl, _0_Pulsing41_0.tim, _0_MockFixedIntBlock_0.tii, _0_Pulsing41_0.tip, _2_Pulsing41_0.tip, _2_MockFixedIntBlock_0.frq, _0_Lucene41_0.tim, _0_Lucene41_0.tip, _0_Asserting_0.doc, _0.fnm, _2.fdt, _0_MockFixedIntBlock_0.pos, _2_Lucene41_0.doc, _2.fdx, _2_Asserting_0.tim, _2_Pulsing41_0.pos, _2_Asserting_0.tip, _2_MockFixedIntBlock_0.pos, _0_Lucene41_0.doc, _2_MockFixedIntBlock_0.doc, _0_Asserting_0.tim, _2.si, _0_Asserting_0.tip, _2_MockFixedIntBlock_0.skp, _2_nrm.cfe, _0_MockFixedIntBlock_0.pyl, _0_MockFixedIntBlock_0.skp, _2_Asserting_0.doc, _0.si, _2_nrm.cfs, _0_nrm.cfs, _2.fnm, _0_MockFixedIntBlock_0.frq, _0_Pulsing41_0.pos, _0_Pulsing41_0.doc, _0_MockFixedIntBlock_0.doc, _0_nrm.cfe, _0.fdx, _0_Asserting_0.pos, _0.fdt, segments_4]
[junit4:junit4]   2> 		commit{dir=RateLimitedDirectoryWrapper(MockDirWrapper(org.apache.lucene.store.RAMDirectory@1c093f32 lockFactory=org.apache.lucene.store.NativeFSLockFactory@7481e656)),segFN=segments_5,generation=5,filenames=[_2_Lucene41_0.pos, _2_Asserting_0.pos, _4_Lucene41_0.doc, _3.fdt, _0_MockFixedIntBlock_0.tib, _0_MockFixedIntBlock_0.tii, _4_Lucene41_0.pos, _4_MockFixedIntBlock_0.pos, _2.fdt, _2.fdx, _4_Lucene41_0.tip, _4_Lucene41_0.tim, _2_Pulsing41_0.pos, _2_Asserting_0.tim, _2_Asserting_0.tip, _4_Pulsing41_0.tip, _4_MockFixedIntBlock_0.frq, _2_MockFixedIntBlock_0.doc, _3.si, _4_Pulsing41_0.tim, _3_Pulsing41_0.doc, _2.si, _0_Asserting_0.tim, _0_Asserting_0.tip, _3_MockFixedIntBlock_0.frq, _2_MockFixedIntBlock_0.skp, _4_Asserting_0.tip, _3.fnm, _3_Asserting_0.pos, _4_Asserting_0.pos, _2_nrm.cfe, _0_MockFixedIntBlock_0.pyl, _2_Asserting_0.doc, _4_Asserting_0.tim, _3_Pulsing41_0.tim, _2_nrm.cfs, _3_Pulsing41_0.tip, _4_Pulsing41_0.doc, _3_MockFixedIntBlock_0.pos, _2.fnm, _3.fdx, _0_MockFixedIntBlock_0.doc, _3_Asserting_0.doc, _0_Asserting_0.pos, _2_Pulsing41_0.doc, _3_nrm.cfe, _2_Lucene41_0.tim, _3_MockFixedIntBlock_0.skp, _4_MockFixedIntBlock_0.tib, _0_Lucene41_0.pos, _4.fnm, _4_nrm.cfe, _2_Lucene41_0.tip, _2_MockFixedIntBlock_0.tii, _2_Pulsing41_0.tim, _4.fdx, _3_MockFixedIntBlock_0.pyl, _2_MockFixedIntBlock_0.tib, _2_MockFixedIntBlock_0.pyl, _3_Lucene41_0.pos, _0_Pulsing41_0.tim, _0_Pulsing41_0.tip, _2_Pulsing41_0.tip, _2_MockFixedIntBlock_0.frq, _4_MockFixedIntBlock_0.tii, _4_Asserting_0.doc, _0_Lucene41_0.tim, _0_Asserting_0.doc, _0_Lucene41_0.tip, _0.fnm, _4_MockFixedIntBlock_0.skp, _0_MockFixedIntBlock_0.pos, _2_Lucene41_0.doc, _3_Pulsing41_0.pos, _3_nrm.cfs, _3_Lucene41_0.doc, _0_Lucene41_0.doc, _2_MockFixedIntBlock_0.pos, _4_MockFixedIntBlock_0.doc, _4_nrm.cfs, _3_MockFixedIntBlock_0.doc, _0_MockFixedIntBlock_0.skp, _3_Lucene41_0.tip, _3_Lucene41_0.tim, _0.si, _4_MockFixedIntBlock_0.pyl, _4_Pulsing41_0.pos, _3_MockFixedIntBlock_0.tib, _0_nrm.cfs, _4.fdt, _4.si, _0_MockFixedIntBlock_0.frq, _0_Pulsing41_0.doc, _0_Pulsing41_0.pos, _3_Asserting_0.tim, _3_Asserting_0.tip, _0_nrm.cfe, _0.fdx, segments_5, _0.fdt, _3_MockFixedIntBlock_0.tii]
[junit4:junit4]   2> 9713 T3638 oasc.SolrDeletionPolicy.updateCommits newest commit = 5[_2_Lucene41_0.pos, _2_Asserting_0.pos, _4_Lucene41_0.doc, _3.fdt, _0_MockFixedIntBlock_0.tib, _0_MockFixedIntBlock_0.tii, _4_Lucene41_0.pos, _4_MockFixedIntBlock_0.pos, _2.fdt, _2.fdx, _4_Lucene41_0.tip, _4_Lucene41_0.tim, _2_Pulsing41_0.pos, _2_Asserting_0.tim, _2_Asserting_0.tip, _4_Pulsing41_0.tip, _4_MockFixedIntBlock_0.frq, _2_MockFixedIntBlock_0.doc, _3.si, _4_Pulsing41_0.tim, _3_Pulsing41_0.doc, _2.si, _0_Asserting_0.tim, _0_Asserting_0.tip, _3_MockFixedIntBlock_0.frq, _2_MockFixedIntBlock_0.skp, _4_Asserting_0.tip, _3.fnm, _3_Asserting_0.pos, _4_Asserting_0.pos, _2_nrm.cfe, _0_MockFixedIntBlock_0.pyl, _2_Asserting_0.doc, _4_Asserting_0.tim, _3_Pulsing41_0.tim, _2_nrm.cfs, _3_Pulsing41_0.tip, _4_Pulsing41_0.doc, _3_MockFixedIntBlock_0.pos, _2.fnm, _3.fdx, _0_MockFixedIntBlock_0.doc, _3_Asserting_0.doc, _0_Asserting_0.pos, _2_Pulsing41_0.doc, _3_nrm.cfe, _2_Lucene41_0.tim, _3_MockFixedIntBlock_0.skp, _4_MockFixedIntBlock_0.tib, _0_Lucene41_0.pos, _4.fnm, _4_nrm.cfe, _2_Lucene41_0.tip, _2_MockFixedIntBlock_0.tii, _2_Pulsing41_0.tim, _4.fdx, _3_MockFixedIntBlock_0.pyl, _2_MockFixedIntBlock_0.tib, _2_MockFixedIntBlock_0.pyl, _3_Lucene41_0.pos, _0_Pulsing41_0.tim, _0_Pulsing41_0.tip, _2_Pulsing41_0.tip, _2_MockFixedIntBlock_0.frq, _4_MockFixedIntBlock_0.tii, _4_Asserting_0.doc, _0_Lucene41_0.tim, _0_Asserting_0.doc, _0_Lucene41_0.tip, _0.fnm, _4_MockFixedIntBlock_0.skp, _0_MockFixedIntBlock_0.pos, _2_Lucene41_0.doc, _3_Pulsing41_0.pos, _3_nrm.cfs, _3_Lucene41_0.doc, _0_Lucene41_0.doc, _2_MockFixedIntBlock_0.pos, _4_MockFixedIntBlock_0.doc, _4_nrm.cfs, _3_MockFixedIntBlock_0.doc, _0_MockFixedIntBlock_0.skp, _3_Lucene41_0.tip, _3_Lucene41_0.tim, _0.si, _4_MockFixedIntBlock_0.pyl, _4_Pulsing41_0.pos, _3_MockFixedIntBlock_0.tib, _0_nrm.cfs, _4.fdt, _4.si, _0_MockFixedIntBlock_0.frq, _0_Pulsing41_0.doc, _0_Pulsing41_0.pos, _3_Asserting_0.tim, _3_Asserting_0.tip, _0_nrm.cfe, _0.fdx, segments_5, _0.fdt, _3_MockFixedIntBlock_0.tii]
[junit4:junit4]   2> 9714 T3638 oasc.CachingDirectoryFactory.close Releasing directory:/Users/jenkins/jenkins-slave/workspace/Lucene-Solr-trunk-MacOSX/solr/build/solr-core/test/J0/./solrtest-SoftAutoCommitTest-1359887594828
[junit4:junit4]   2> 9714 T3638 oass.SolrIndexSearcher.<init> Opening Searcher@155ce94b main
[junit4:junit4]   2> 9715 T3638 oasu.DirectUpdateHandler2.commit end_commit_flush
[junit4:junit4]   2> 9716 T3637 oasc.SolrCore.registerSearcher [collection1] Registered new searcher Searcher@155ce94b main{StandardDirectoryReader(segments_4:13:nrt _0(5.0):C5 _2(5.0):C1 _3(5.0):C1 _4(5.0):C1)}
[junit4:junit4]   2> 9717 T3637 oasc.CachingDirectoryFactory.close Releasing directory:/Users/jenkins/jenkins-slave/workspace/Lucene-Solr-trunk-MacOSX/solr/build/solr-core/test/J0/./solrtest-SoftAutoCommitTest-1359887594828/index
[junit4:junit4]   2> 12920 T3629 oas.SolrTestCaseJ4.tearDown ###Ending testSoftAndHardCommitMaxTimeMixedAdds
[junit4:junit4]   2> 12922 T3629 oas.SolrTestCaseJ4.deleteCore ###deleteCore
[junit4:junit4]   2> 12923 T3629 oasc.CoreContainer.shutdown Shutting down CoreContainer instance=655319179
[junit4:junit4]   2> 12923 T3629 oasc.SolrCore.close [collection1]  CLOSING SolrCore org.apache.solr.core.SolrCore@1abb7c4d
[junit4:junit4]   2> 12934 T3629 oasu.DirectUpdateHandler2.close closing DirectUpdateHandler2{commits=3,autocommit maxTime=1200ms,autocommits=1,soft autocommit maxTime=500ms,soft autocommits=2,optimizes=0,rollbacks=0,expungeDeletes=0,docsPending=0,adds=0,deletesById=0,deletesByQuery=0,errors=0,cumulative_adds=2,cumulative_deletesById=0,cumulative_deletesByQuery=0,cumulative_errors=0}
[junit4:junit4]   2> 12935 T3629 oasc.SolrCore.decrefSolrCoreState Closing SolrCoreState
[junit4:junit4]   2> 12935 T3629 oasu.DefaultSolrCoreState.closeIndexWriter SolrCoreState ref count has reached 0 - closing IndexWriter
[junit4:junit4]   2> 12936 T3629 oasu.DefaultSolrCoreState.closeIndexWriter closing IndexWriter with IndexWriterCloser
[junit4:junit4]   2> 12937 T3629 C230 oasc.CachingDirectoryFactory.close Releasing directory:/Users/jenkins/jenkins-slave/workspace/Lucene-Solr-trunk-MacOSX/solr/build/solr-core/test/J0/./solrtest-SoftAutoCommitTest-1359887594828/index
[junit4:junit4]   2> 12938 T3629 oasc.SolrCore.closeSearcher [collection1] Closing main searcher on request.
[junit4:junit4]   2> 12939 T3629 oasc.CachingDirectoryFactory.close Releasing directory:/Users/jenkins/jenkins-slave/workspace/Lucene-Solr-trunk-MacOSX/solr/build/solr-core/test/J0/./solrtest-SoftAutoCommitTest-1359887594828/index
[junit4:junit4]   2> 135077 T3629 oasc.CachingDirectoryFactory.close SEVERE Timeout waiting for all directory ref counts to be released
[junit4:junit4]   2> 135078 T3629 oasc.SolrException.log SEVERE Error closing directory:java.lang.AssertionError: 1
[junit4:junit4]   2> 		at org.apache.solr.core.CachingDirectoryFactory.close(CachingDirectoryFactory.java:139)
[junit4:junit4]   2> 		at org.apache.solr.core.SolrCore.close(SolrCore.java:1011)
[junit4:junit4]   2> 		at org.apache.solr.core.CoreContainer.shutdown(CoreContainer.java:753)
[junit4:junit4]   2> 		at org.apache.solr.util.TestHarness.close(TestHarness.java:449)
[junit4:junit4]   2> 		at org.apache.solr.SolrTestCaseJ4.deleteCore(SolrTestCaseJ4.java:418)
[junit4:junit4]   2> 		at org.apache.solr.SolrTestCaseJ4.afterClass(SolrTestCaseJ4.java:95)
[junit4:junit4]   2> 		at sun.reflect.GeneratedMethodAccessor19.invoke(Unknown Source)
[junit4:junit4]   2> 		at sun.reflect.DelegatingMethodAccessorImpl.invoke(DelegatingMethodAccessorImpl.java:25)
[junit4:junit4]   2> 		at java.lang.reflect.Method.invoke(Method.java:597)
[junit4:junit4]   2> 		at com.carrotsearch.randomizedtesting.RandomizedRunner.invoke(RandomizedRunner.java:1559)
[junit4:junit4]   2> 		at com.carrotsearch.randomizedtesting.RandomizedRunner.access$600(RandomizedRunner.java:79)
[junit4:junit4]   2> 		at com.carrotsearch.randomizedtesting.RandomizedRunner$5.evaluate(RandomizedRunner.java:700)
[junit4:junit4]   2> 		at com.carrotsearch.randomizedtesting.rules.StatementAdapter.evaluate(StatementAdapter.java:36)
[junit4:junit4]   2> 		at com.carrotsearch.randomizedtesting.rules.SystemPropertiesRestoreRule$1.evaluate(SystemPropertiesRestoreRule.java:53)
[junit4:junit4]   2> 		at org.apache.lucene.util.AbstractBeforeAfterRule$1.evaluate(AbstractBeforeAfterRule.java:46)
[junit4:junit4]   2> 		at org.apache.lucene.util.TestRuleStoreClassName$1.evaluate(TestRuleStoreClassName.java:42)
[junit4:junit4]   2> 		at com.carrotsearch.randomizedtesting.rules.SystemPropertiesInvariantRule$1.evaluate(SystemPropertiesInvariantRule.java:55)
[junit4:junit4]   2> 		at com.carrotsearch.randomizedtesting.rules.NoShadowingOrOverridesOnMethodsRule$1.evaluate(NoShadowingOrOverridesOnMethodsRule.java:39)
[junit4:junit4]   2> 		at com.carrotsearch.randomizedtesting.rules.NoShadowingOrOverridesOnMethodsRule$1.evaluate(NoShadowingOrOverridesOnMethodsRule.java:39)
[junit4:junit4]   2> 		at com.carrotsearch.randomizedtesting.rules.StatementAdapter.evaluate(StatementAdapter.java:36)
[junit4:junit4]   2> 		at org.apache.lucene.util.TestRuleAssertionsRequired$1.evaluate(TestRuleAssertionsRequired.java:43)
[junit4:junit4]   2> 		at org.apache.lucene.util.TestRuleMarkFailure$1.evaluate(TestRuleMarkFailure.java:48)
[junit4:junit4]   2> 		at org.apache.lucene.util.TestRuleIgnoreAfterMaxFailures$1.evaluate(TestRuleIgnoreAfterMaxFailures.java:70)
[junit4:junit4]   2> 		at org.apache.lucene.util.TestRuleIgnoreTestSuites$1.evaluate(TestRuleIgnoreTestSuites.java:55)
[junit4:junit4]   2> 		at com.carrotsearch.randomizedtesting.rules.StatementAdapter.evaluate(StatementAdapter.java:36)
[junit4:junit4]   2> 		at com.carrotsearch.randomizedtesting.ThreadLeakControl$StatementRunner.run(ThreadLeakControl.java:358)
[junit4:junit4]   2> 		at java.lang.Thread.run(Thread.java:680)
[junit4:junit4]   2> 	
[junit4:junit4]   2> 135078 T3629 oasc.CachingDirectoryFactory.close Closing directory when closing factory:/Users/jenkins/jenkins-slave/workspace/Lucene-Solr-trunk-MacOSX/solr/build/solr-core/test/J0/./solrtest-SoftAutoCommitTest-1359887594828
[junit4:junit4]   2> 135079 T3629 oasc.CachingDirectoryFactory.closeDirectory Closing directory:/Users/jenkins/jenkins-slave/workspace/Lucene-Solr-trunk-MacOSX/solr/build/solr-core/test/J0/./solrtest-SoftAutoCommitTest-1359887594828
[junit4:junit4]   2> 256340 T3629 oas.SolrTestCaseJ4.endTrackingSearchers SEVERE ERROR: SolrIndexSearcher opens=13 closes=12
[junit4:junit4]   2> NOTE: test params are: codec=Lucene42: {timestamp=Lucene41(blocksize=128), range_facet_l=Lucene41(blocksize=128), id=MockFixedIntBlock(blockSize=593), range_facet_sl=MockFixedIntBlock(blockSize=593), text=PostingsFormat(name=Asserting), range_facet_si=Lucene41(blocksize=128), subject=Lucene41(blocksize=128), multiDefault=Lucene41(blocksize=128), intDefault=Pulsing41(freqCutoff=14 minBlockSize=46 maxBlockSize=101)}, sim=RandomSimilarityProvider(queryNorm=false,coord=no): {}, locale=sv, timezone=Pacific/Honolulu
[junit4:junit4]   2> NOTE: Mac OS X 10.8.2 x86_64/Apple Inc. 1.6.0_37 (64-bit)/cpus=2,threads=1,free=110041584,total=309854208
[junit4:junit4]   2> NOTE: All tests run in this JVM: [IndexSchemaRuntimeFieldTest, PingRequestHandlerTest, TestLFUCache, PluginInfoTest, FastVectorHighlighterTest, DateFieldTest, SolrCoreCheckLockOnStartupTest, TestExtendedDismaxParser, TestSolrDeletionPolicy1, TestLuceneMatchVersion, NotRequiredUniqueKeyTest, SolrIndexConfigTest, TestIBSimilarityFactory, TestDocumentBuilder, TestPHPSerializedResponseWriter, TermVectorComponentDistributedTest, RequiredFieldsTest, IndexBasedSpellCheckerTest, BasicZkTest, ShowFileRequestHandlerTest, TestSurroundQueryParser, TestPseudoReturnFields, TestPropInjectDefaults, SuggesterWFSTTest, TestLMDirichletSimilarityFactory, TestJoin, ExternalFileFieldSortTest, TestSolrCoreProperties, TestCoreContainer, BadComponentTest, HardAutoCommitTest, DirectUpdateHandlerTest, TestJmxIntegration, TestFastOutputStream, TestRealTimeGet, TestStressLucene, PathHierarchyTokenizerFactoryTest, TestReplicationHandler, AutoCommitTest, BasicFunctionalityTest, PeerSyncTest, TestConfig, TestPartialUpdateDeduplication, TestFastLRUCache, TestDistributedGrouping, UniqFieldsUpdateProcessorFactoryTest, BadIndexSchemaTest, TestXIncludeConfig, TestBinaryField, TestLazyCores, DisMaxRequestHandlerTest, CoreAdminHandlerTest, SignatureUpdateProcessorFactoryTest, TestSolr4Spatial, QueryParsingTest, ZkCLITest, SpellPossibilityIteratorTest, TestPostingsSolrHighlighter, ZkNodePropsTest, TestElisionMultitermQuery, TermVectorComponentTest, OpenExchangeRatesOrgProviderTest, ScriptEngineTest, DistributedTermsComponentTest, XmlUpdateRequestHandlerTest, DOMUtilTest, HighlighterConfigTest, TestSuggestSpellingConverter, UpdateParamsTest, TestFaceting, TestDFRSimilarityFactory, SOLR749Test, TestCSVResponseWriter, RequestHandlersTest, OverseerTest, ZkSolrClientTest, ReturnFieldsTest, ClusterStateTest, TestMultiCoreConfBootstrap, DocumentAnalysisRequestHandlerTest, BasicDistributedZk2Test, SpatialFilterTest, TestSearchPerf, SystemInfoHandlerTest, QueryElevationComponentTest, TestRangeQuery, TimeZoneUtilsTest, StatsComponentTest, TestReversedWildcardFilterFactory, TestNumberUtils, TestComponentsName, LeaderElectionIntegrationTest, CacheHeaderTest, SpellCheckComponentTest, UUIDFieldTest, TestCollationField, DateMathParserTest, TestUpdate, UpdateRequestProcessorFactoryTest, FieldAnalysisRequestHandlerTest, TestSystemIdResolver, TestQuerySenderNoQuery, TestDistributedSearch, DirectSolrSpellCheckerTest, TestSolrQueryParser, NumericFieldsTest, TestArbitraryIndexDir, DistributedQueryElevationComponentTest, TestStressRecovery, BinaryUpdateRequestHandlerTest, TestStressVersions, IndexReaderFactoryTest, TestSort, ChaosMonkeySafeLeaderTest, LegacyHTMLStripCharFilterTest, TestQueryUtils, JSONWriterTest, ClusterStateUpdateTest, TestRecovery, BasicDistributedZkTest, RecoveryZkTest, FullSolrCloudDistribCmdsTest, LeaderElectionTest, DistributedSpellCheckComponentTest, ZkControllerTest, TestRandomFaceting, SpellCheckCollatorTest, SoftAutoCommitTest]
[junit4:junit4]   2> NOTE: reproduce with: ant test  -Dtestcase=SoftAutoCommitTest -Dtests.seed=46F19C58A2CE7D28 -Dtests.slow=true -Dtests.locale=sv -Dtests.timezone=Pacific/Honolulu -Dtests.file.encoding=US-ASCII
[junit4:junit4] ERROR   0.00s | SoftAutoCommitTest (suite) <<<
[junit4:junit4]    > Throwable #1: java.lang.AssertionError: ERROR: SolrIndexSearcher opens=13 closes=12
[junit4:junit4]    > 	at __randomizedtesting.SeedInfo.seed([46F19C58A2CE7D28]:0)
[junit4:junit4]    > 	at org.junit.Assert.fail(Assert.java:93)
[junit4:junit4]    > 	at org.apache.solr.SolrTestCaseJ4.endTrackingSearchers(SolrTestCaseJ4.java:246)
[junit4:junit4]    > 	at org.apache.solr.SolrTestCaseJ4.afterClass(SolrTestCaseJ4.java:97)
[junit4:junit4]    > 	at sun.reflect.GeneratedMethodAccessor19.invoke(Unknown Source)
[junit4:junit4]    > 	at sun.reflect.DelegatingMethodAccessorImpl.invoke(DelegatingMethodAccessorImpl.java:25)
[junit4:junit4]    > 	at java.lang.reflect.Method.invoke(Method.java:597)
[junit4:junit4]    > 	at com.carrotsearch.randomizedtesting.RandomizedRunner.invoke(RandomizedRunner.java:1559)
[junit4:junit4]    > 	at com.carrotsearch.randomizedtesting.RandomizedRunner.access$600(RandomizedRunner.java:79)
[junit4:junit4]    > 	at com.carrotsearch.randomizedtesting.RandomizedRunner$5.evaluate(RandomizedRunner.java:700)
[junit4:junit4]    > 	at com.carrotsearch.randomizedtesting.rules.StatementAdapter.evaluate(StatementAdapter.java:36)
[junit4:junit4]    > 	at com.carrotsearch.randomizedtesting.rules.SystemPropertiesRestoreRule$1.evaluate(SystemPropertiesRestoreRule.java:53)
[junit4:junit4]    > 	at org.apache.lucene.util.AbstractBeforeAfterRule$1.evaluate(AbstractBeforeAfterRule.java:46)
[junit4:junit4]    > 	at org.apache.lucene.util.TestRuleStoreClassName$1.evaluate(TestRuleStoreClassName.java:42)
[junit4:junit4]    > 	at com.carrotsearch.randomizedtesting.rules.SystemPropertiesInvariantRule$1.evaluate(SystemPropertiesInvariantRule.java:55)
[junit4:junit4]    > 	at com.carrotsearch.randomizedtesting.rules.NoShadowingOrOverridesOnMethodsRule$1.evaluate(NoShadowingOrOverridesOnMethodsRule.java:39)
[junit4:junit4]    > 	at com.carrotsearch.randomizedtesting.rules.NoShadowingOrOverridesOnMethodsRule$1.evaluate(NoShadowingOrOverridesOnMethodsRule.java:39)
[junit4:junit4]    > 	at com.carrotsearch.randomizedtesting.rules.StatementAdapter.evaluate(StatementAdapter.java:36)
[junit4:junit4]    > 	at org.apache.lucene.util.TestRuleAssertionsRequired$1.evaluate(TestRuleAssertionsRequired.java:43)
[junit4:junit4]    > 	at org.apache.lucene.util.TestRuleMarkFailure$1.evaluate(TestRuleMarkFailure.java:48)
[junit4:junit4]    > 	at org.apache.lucene.util.TestRuleIgnoreAfterMaxFailures$1.evaluate(TestRuleIgnoreAfterMaxFailures.java:70)
[junit4:junit4]    > 	at org.apache.lucene.util.TestRuleIgnoreTestSuites$1.evaluate(TestRuleIgnoreTestSuites.java:55)
[junit4:junit4]    > 	at com.carrotsearch.randomizedtesting.rules.StatementAdapter.evaluate(StatementAdapter.java:36)
[junit4:junit4]    > 	at com.carrotsearch.randomizedtesting.ThreadLeakControl$StatementRunner.run(ThreadLeakControl.java:358)
[junit4:junit4]    > 	at java.lang.Thread.run(Thread.java:680)
[junit4:junit4] Completed in 256.42s, 3 tests, 1 failure <<< FAILURES!

[...truncated 358 lines...]
BUILD FAILED
/Users/jenkins/jenkins-slave/workspace/Lucene-Solr-trunk-MacOSX/build.xml:346: The following error occurred while executing this line:
/Users/jenkins/jenkins-slave/workspace/Lucene-Solr-trunk-MacOSX/build.xml:39: The following error occurred while executing this line:
/Users/jenkins/jenkins-slave/workspace/Lucene-Solr-trunk-MacOSX/solr/build.xml:178: The following error occurred while executing this line:
/Users/jenkins/jenkins-slave/workspace/Lucene-Solr-trunk-MacOSX/solr/common-build.xml:428: The following error occurred while executing this line:
/Users/jenkins/jenkins-slave/workspace/Lucene-Solr-trunk-MacOSX/lucene/common-build.xml:1176: The following error occurred while executing this line:
/Users/jenkins/jenkins-slave/workspace/Lucene-Solr-trunk-MacOSX/lucene/common-build.xml:841: There were test failures: 249 suites, 1038 tests, 1 suite-level error, 14 ignored (3 assumptions)

Total time: 73 minutes 55 seconds
Build step 'Invoke Ant' marked build as failure
Archiving artifacts
Recording test results
Description set: Java: 64bit/jdk1.6.0 -XX:+UseParallelGC
Email was triggered for: Failure
Sending email for trigger: Failure



Mime
View raw message