lucene-dev mailing list archives

Site index · List index
Message view « Date » · « Thread »
Top « Date » · « Thread »
From Policeman Jenkins Server <jenk...@thetaphi.de>
Subject [JENKINS] Lucene-Solr-trunk-Linux (32bit/ibm-j9-jdk7) - Build # 4289 - Failure!
Date Wed, 13 Feb 2013 14:45:48 GMT
Build: http://jenkins.thetaphi.de/job/Lucene-Solr-trunk-Linux/4289/
Java: 32bit/ibm-j9-jdk7 

No tests ran.

Build Log:
[...truncated 9459 lines...]
[junit4:junit4] Suite: org.apache.solr.update.HardAutoCommitTest
[junit4:junit4]   2> 0 T2537 oas.SolrTestCaseJ4.initCore ####initCore
[junit4:junit4]   2> Creating dataDir: /mnt/ssd/jenkins/workspace/Lucene-Solr-trunk-Linux/solr/build/solr-core/test/J0/./solrtest-HardAutoCommitTest-1360766613026
[junit4:junit4]   2> 1 T2537 oasc.SolrResourceLoader.<init> new SolrResourceLoader for directory: '/mnt/ssd/jenkins/workspace/Lucene-Solr-trunk-Linux/solr/build/solr-core/test-files/solr/collection1/'
[junit4:junit4]   2> 1 T2537 oasc.SolrResourceLoader.replaceClassLoader Adding 'file:/mnt/ssd/jenkins/workspace/Lucene-Solr-trunk-Linux/solr/build/solr-core/test-files/solr/collection1/lib/README' to classloader
[junit4:junit4]   2> 2 T2537 oasc.SolrResourceLoader.replaceClassLoader Adding 'file:/mnt/ssd/jenkins/workspace/Lucene-Solr-trunk-Linux/solr/build/solr-core/test-files/solr/collection1/lib/classes/' to classloader
[junit4:junit4]   2> 32 T2537 oasc.SolrConfig.<init> Using Lucene MatchVersion: LUCENE_50
[junit4:junit4]   2> 72 T2537 oasc.SolrConfig.<init> Loaded SolrConfig: solrconfig.xml
[junit4:junit4]   2> 73 T2537 oass.IndexSchema.readSchema Reading Solr Schema
[junit4:junit4]   2> 78 T2537 oass.IndexSchema.readSchema Schema name=test
[junit4:junit4]   2> 398 T2537 oass.OpenExchangeRatesOrgProvider.init Initialized with rates=open-exchange-rates.json, refreshInterval=1440.
[junit4:junit4]   2> 403 T2537 oass.IndexSchema.readSchema default search field in schema is text
[junit4:junit4]   2> 405 T2537 oass.IndexSchema.readSchema unique key field: id
[junit4:junit4]   2> 410 T2537 oass.FileExchangeRateProvider.reload Reloading exchange rates from file currency.xml
[junit4:junit4]   2> 413 T2537 oass.FileExchangeRateProvider.reload Reloading exchange rates from file currency.xml
[junit4:junit4]   2> 416 T2537 oass.OpenExchangeRatesOrgProvider.reload Reloading exchange rates from open-exchange-rates.json
[junit4:junit4]   2> 417 T2537 oass.OpenExchangeRatesOrgProvider.reload Reloading exchange rates from open-exchange-rates.json
[junit4:junit4]   2> 418 T2537 oasc.SolrResourceLoader.locateSolrHome JNDI not configured for solr (NoInitialContextEx)
[junit4:junit4]   2> 418 T2537 oasc.SolrResourceLoader.locateSolrHome using system property solr.solr.home: /mnt/ssd/jenkins/workspace/Lucene-Solr-trunk-Linux/solr/build/solr-core/test-files/solr
[junit4:junit4]   2> 419 T2537 oasc.SolrResourceLoader.<init> new SolrResourceLoader for directory: '/mnt/ssd/jenkins/workspace/Lucene-Solr-trunk-Linux/solr/build/solr-core/test-files/solr/'
[junit4:junit4]   2> 425 T2537 oasc.CoreContainer.<init> New CoreContainer 159635531
[junit4:junit4]   2> 425 T2537 oasc.SolrCore.<init> [collection1] Opening new SolrCore at /mnt/ssd/jenkins/workspace/Lucene-Solr-trunk-Linux/solr/build/solr-core/test-files/solr/collection1/, dataDir=/mnt/ssd/jenkins/workspace/Lucene-Solr-trunk-Linux/solr/build/solr-core/test/J0/./solrtest-HardAutoCommitTest-1360766613026/
[junit4:junit4]   2> 426 T2537 oasc.JmxMonitoredMap.<init> JMX monitoring is enabled. Adding Solr mbeans to JMX Server: com.sun.jmx.mbeanserver.JmxMBeanServer@c242216
[junit4:junit4]   2> 426 T2537 oasc.SolrCore.initDirectoryFactory org.apache.solr.core.MockDirectoryFactory
[junit4:junit4]   2> 427 T2537 oasc.CachingDirectoryFactory.get return new directory for /mnt/ssd/jenkins/workspace/Lucene-Solr-trunk-Linux/solr/build/solr-core/test/J0/./solrtest-HardAutoCommitTest-1360766613026 forceNew:false
[junit4:junit4]   2> 428 T2537 oasc.CachingDirectoryFactory.close Releasing directory:/mnt/ssd/jenkins/workspace/Lucene-Solr-trunk-Linux/solr/build/solr-core/test/J0/./solrtest-HardAutoCommitTest-1360766613026
[junit4:junit4]   2> 428 T2537 oasc.SolrCore.getNewIndexDir New index directory detected: old=null new=/mnt/ssd/jenkins/workspace/Lucene-Solr-trunk-Linux/solr/build/solr-core/test/J0/./solrtest-HardAutoCommitTest-1360766613026/index/
[junit4:junit4]   2> 429 T2537 oasc.SolrCore.initIndex WARNING [collection1] Solr index directory '/mnt/ssd/jenkins/workspace/Lucene-Solr-trunk-Linux/solr/build/solr-core/test/J0/./solrtest-HardAutoCommitTest-1360766613026/index' doesn't exist. Creating new index...
[junit4:junit4]   2> 430 T2537 oasc.CachingDirectoryFactory.get return new directory for /mnt/ssd/jenkins/workspace/Lucene-Solr-trunk-Linux/solr/build/solr-core/test/J0/./solrtest-HardAutoCommitTest-1360766613026/index forceNew:false
[junit4:junit4]   2> 971 T2537 oasc.SolrDeletionPolicy.onCommit SolrDeletionPolicy.onCommit: commits:num=1
[junit4:junit4]   2> 		commit{dir=RateLimitedDirectoryWrapper(MockDirWrapper(RateLimitedDirectoryWrapper(org.apache.lucene.store.NIOFSDirectory@/mnt/ssd/jenkins/workspace/Lucene-Solr-trunk-Linux/solr/build/solr-core/test/J0/index96869691tmp lockFactory=org.apache.lucene.store.NativeFSLockFactory@aa5069c6))),segFN=segments_1,generation=1,filenames=[segments_1]
[junit4:junit4]   2> 975 T2537 oasc.SolrDeletionPolicy.updateCommits newest commit = 1[segments_1]
[junit4:junit4]   2> 976 T2537 oasc.CachingDirectoryFactory.close Releasing directory:/mnt/ssd/jenkins/workspace/Lucene-Solr-trunk-Linux/solr/build/solr-core/test/J0/./solrtest-HardAutoCommitTest-1360766613026/index
[junit4:junit4]   2> 978 T2537 oasc.SolrCore.initWriters created xml: solr.XMLResponseWriter
[junit4:junit4]   2> 980 T2537 oasup.UpdateRequestProcessorChain.init inserting DistributedUpdateProcessorFactory into updateRequestProcessorChain "dedupe"
[junit4:junit4]   2> 981 T2537 oasup.UpdateRequestProcessorChain.init inserting DistributedUpdateProcessorFactory into updateRequestProcessorChain "dedupe-allfields"
[junit4:junit4]   2> 982 T2537 oasup.UpdateRequestProcessorChain.init inserting DistributedUpdateProcessorFactory into updateRequestProcessorChain "stored_sig"
[junit4:junit4]   2> 983 T2537 oasup.UpdateRequestProcessorChain.init inserting DistributedUpdateProcessorFactory into updateRequestProcessorChain "uniq-fields"
[junit4:junit4]   2> 984 T2537 oasup.UpdateRequestProcessorChain.init inserting DistributedUpdateProcessorFactory into updateRequestProcessorChain "distrib-dup-test-chain-implicit"
[junit4:junit4]   2> 985 T2537 oasc.RequestHandlers.initHandlersFromConfig adding lazy requestHandler: solr.ReplicationHandler
[junit4:junit4]   2> 985 T2537 oasc.RequestHandlers.initHandlersFromConfig created /replication: solr.ReplicationHandler
[junit4:junit4]   2> 986 T2537 oasc.RequestHandlers.initHandlersFromConfig created standard: solr.StandardRequestHandler
[junit4:junit4]   2> 987 T2537 oasc.RequestHandlers.initHandlersFromConfig created /get: solr.RealTimeGetHandler
[junit4:junit4]   2> 988 T2537 oasc.RequestHandlers.initHandlersFromConfig created dismax: solr.SearchHandler
[junit4:junit4]   2> 989 T2537 oasc.RequestHandlers.initHandlersFromConfig created mock: org.apache.solr.core.MockQuerySenderListenerReqHandler
[junit4:junit4]   2> 989 T2537 oasc.RequestHandlers.initHandlersFromConfig created /admin/: org.apache.solr.handler.admin.AdminHandlers
[junit4:junit4]   2> 990 T2537 oasc.RequestHandlers.initHandlersFromConfig created defaults: solr.StandardRequestHandler
[junit4:junit4]   2> 991 T2537 oasc.RequestHandlers.initHandlersFromConfig adding lazy requestHandler: solr.StandardRequestHandler
[junit4:junit4]   2> 992 T2537 oasc.RequestHandlers.initHandlersFromConfig created lazy: solr.StandardRequestHandler
[junit4:junit4]   2> 993 T2537 oasc.RequestHandlers.initHandlersFromConfig created /update: solr.UpdateRequestHandler
[junit4:junit4]   2> 994 T2537 oasc.RequestHandlers.initHandlersFromConfig created /terms: org.apache.solr.handler.component.SearchHandler
[junit4:junit4]   2> 995 T2537 oasc.RequestHandlers.initHandlersFromConfig created spellCheckCompRH: org.apache.solr.handler.component.SearchHandler
[junit4:junit4]   2> 995 T2537 oasc.RequestHandlers.initHandlersFromConfig created spellCheckCompRH_Direct: org.apache.solr.handler.component.SearchHandler
[junit4:junit4]   2> 996 T2537 oasc.RequestHandlers.initHandlersFromConfig created spellCheckWithWordbreak: org.apache.solr.handler.component.SearchHandler
[junit4:junit4]   2> 997 T2537 oasc.RequestHandlers.initHandlersFromConfig created spellCheckWithWordbreak_Direct: org.apache.solr.handler.component.SearchHandler
[junit4:junit4]   2> 998 T2537 oasc.RequestHandlers.initHandlersFromConfig created spellCheckCompRH1: org.apache.solr.handler.component.SearchHandler
[junit4:junit4]   2> 999 T2537 oasc.RequestHandlers.initHandlersFromConfig created mltrh: org.apache.solr.handler.component.SearchHandler
[junit4:junit4]   2> 999 T2537 oasc.RequestHandlers.initHandlersFromConfig created tvrh: org.apache.solr.handler.component.SearchHandler
[junit4:junit4]   2> 1000 T2537 oasc.RequestHandlers.initHandlersFromConfig created /mlt: solr.MoreLikeThisHandler
[junit4:junit4]   2> 1001 T2537 oasc.RequestHandlers.initHandlersFromConfig created /debug/dump: solr.DumpRequestHandler
[junit4:junit4]   2> 1004 T2537 oashl.XMLLoader.init xsltCacheLifetimeSeconds=60
[junit4:junit4]   2> 1006 T2537 oasc.SolrCore.initDeprecatedSupport WARNING solrconfig.xml uses deprecated <admin/gettableFiles>, Please update your config to use the ShowFileRequestHandler.
[junit4:junit4]   2> 1008 T2537 oasc.SolrCore.initDeprecatedSupport WARNING adding ShowFileRequestHandler with hidden files: [BAD-SCHEMA-NOT-INDEXED-BUT-TF.XML, SCHEMA-REQUIRED-FIELDS.XML, SOLRCONFIG-MASTER1-KEEPONEBACKUP.XML, SOLRCONFIG-PROPINJECT.XML, BAD-SCHEMA-NONTEXT-ANALYZER.XML, SCHEMA-BEHAVIOR.XML, SOLRCONFIG-PROPINJECT-INDEXDEFAULT.XML, STOP-2.TXT, SCHEMA11.XML, BAD-SCHEMA-UNIQUEKEY-USES-DEFAULT.XML, SCHEMA15.XML, SOLRCONFIG-NATIVELOCK.XML, SCHEMA-SIM.XML, CONDITIONAL.UPDATEPROCESSOR.JS, BAD-SOLRCONFIG-MISSING-SCRIPTFILE.XML, SOLRCONFIG-SCRIPT-UPDATEPROCESSOR.XML, SOLRCONFIG-REPEATER.XML, SOLRCONFIG-SPELLCHECKER.XML, SOLRCONFIG-NOCACHE.XML, SCHEMA-CHARFILTERS.XML, SOLRCONFIG-SOLCOREPROPERTIES.XML, SCHEMA-EFF.XML, SOLRCONFIG_CODEC.XML, BAD-SCHEMA-EXTERNAL-FILEFIELD.XML, HYPHENATION.DTD, TRIVIAL.UPDATEPROCESSOR1.JS, SCHEMA.XML, SOLRCONFIG-MERGEPOLICY.XML, SOLRCONFIG-PHRASESUGGEST.XML, SOLRCONFIG-SLAVE1.XML, SOLRCONFIG-BASIC.XML, SCHEMA-LMJELINEKMERCER.XML, JASUGGEST.TXT, BAD-MP-SOLRCONFIG.XML, BAD-SCHEMA-DUP-FIELD.XML, BAD-SCHEMA-UNIQUEKEY-MULTIVALUED.XML, SOLRCONFIG-MASTER.XML, SOLRCONFIG-HIGHLIGHT.XML, SCHEMA-TFIDF.XML, SCHEMA-REPLICATION1.XML, SYNONYMS.TXT, SOLRCONFIG-ELEVATE.XML, STOPWITHBOM.TXT, SOLRCONFIG-QUERYSENDER.XML, SOLRCONFIG-COMPONENTS-NAME.XML, SOLRCONFIG-SNIPPET-PROCESSOR.XML, WDFTYPES.TXT, SOLRCONFIG-DELPOLICY1.XML, BAD_SOLRCONFIG.XML, HUNSPELL-TEST.DIC, SCHEMA-NUMERIC.XML, SCHEMA-LUCENEMATCHVERSION.XML, KEEP-2.TXT, SCHEMA-STOP-KEEP.XML, SCHEMA-IB.XML, STOP-SNOWBALL.TXT, SOLRCONFIG-INDEXCONFIG.XML, SOLRCONFIG-SLAVE.XML, BAD-SCHEMA-NOT-INDEXED-BUT-NORMS.XML, STOPWORDSWRONGENCODING.TXT, THROW.ERROR.ON.ADD.UPDATEPROCESSOR.JS, STOPTYPES-1.TXT, SOLRCONFIG-SPELLCHECKCOMPONENT.XML, REGEX-BOOST-PROCESSOR-TEST.TXT, SOLRCONFIG-TLOG.XML, COMPOUNDDICTIONARY.TXT, SOLRCONFIG-POSTINGSHIGHLIGHT.XML, DA_COMPOUNDDICTIONARY.TXT, SOLRCONFIG-TERMINDEX.XML, BAD-SOLRCONFIG-INVALID-SCRIPTFILE.XML, SCHEMASURROUND.XML, OPEN-EXCHANGE-RATES.JSON, BAD-SCHEMA-DUP-FIELDTYPE.XML, PHRASESUGGEST.TXT, BAD-SCHEMA-CURRENCY-FT-MULTIVALUED.XML, SOLRCONFIG-MASTER2.XML, OLD_SYNONYMS.TXT, BAD-SCHEMA-UNIQUEKEY-IS-COPYFIELD-DEST.XML, SCHEMA-NOT-REQUIRED-UNIQUE-KEY.XML, BAD-SCHEMA-CODEC-GLOBAL-VS-FT-MISMATCH.XML, SCHEMA-LMDIRICHLET.XML, BAD-SCHEMA-NOT-INDEXED-BUT-POS.XML, SCHEMA-REVERSED.XML, BAD-SCHEMA-CURRENCY-MULTIVALUED.XML, SCHEMA-FOLDING.XML, SOLRCONFIG-CACHING.XML, MAPPING-ISOLATIN1ACCENT.TXT, ADDFIELDS.UPDATEPROCESSOR.JS, SCHEMA-BM25.XML, STOP-1.TXT, SOLRCONFIG-ENABLEPLUGIN.XML, MISSING.FUNCTIONS.UPDATEPROCESSOR.JS, SCHEMA12.XML, SOLRCONFIG-TRANSFORMERS.XML, SCHEMA-COPYFIELD-TEST.XML, BAD-SCHEMA-DUP-DYNAMICFIELD.XML, CURRENCY.XML, FUZZYSUGGEST.TXT, DA_UTF8.XML, SCHEMA-POSTINGSHIGHLIGHT.XML, MISSLEADING.EXTENSION.UPDATEPROCESSOR.JS.TXT, SOLRCONFIG-SOLR-749.XML, STOPWORDS.TXT, HUNSPELL-TEST.AFF, SOLRCONFIG_PERF.XML, SOLRCONFIG-SIMPLELOCK.XML, FRENCHARTICLES.TXT, SOLRCONFIG-LAZYWRITER.XML, SOLRCONFIG-RESPONSE-LOG-COMPONENT.XML, SCHEMA-REPLICATION2.XML, SCHEMA-SNIPPET-TYPE.XML, SCHEMA-SPATIAL.XML, SOLRCONFIG-XINCLUDE.XML, SCHEMA-SPELLCHECKER.XML, XSLT, SOLRCONFIG-DELPOLICY2.XML, KEEP-1.TXT, TRIVIAL.UPDATEPROCESSOR0.JS, BAD-SCHEMA-CURRENCY-DYNAMIC-MULTIVALUED.XML, SCHEMA-TRIE.XML, SCHEMA-BINARYFIELD.XML, BAD-SCHEMA-OMIT-TF-BUT-NOT-POS.XML, SCHEMA-MINIMAL.XML, STOPTYPES-2.TXT, SCHEMA_CODEC.XML, STEMDICT.TXT, SCHEMA-SYNONYM-TOKENIZER.XML, ELEVATE.XML, SCHEMA-COLLATE.XML, PROTWORDS.TXT, SCHEMA-XINCLUDE.XML, SCHEMA-SNIPPET-FIELD.XML, SOLRCONFIG-REQHANDLER.INCL, SCHEMA-PHRASESUGGEST.XML, SCHEMA-DFR.XML, BAD-SCHEMA-ANALYZER-CLASS-AND-NESTED.XML, SOLRCONFIG-MASTER1.XML, SOLRCONFIG-FUNCTIONQUERY.XML, SOLRCONFIG-MASTER3.XML, SOLRCONFIG-UPDATE-PROCESSOR-CHAINS.XML, SOLRCONFIG-ALTDIRECTORY.XML, BAD-SCHEMA-SIM-GLOBAL-VS-FT-MISMATCH.XML, SOLRCONFIG-QUERYSENDER-NOQUERY.XML, BAD-SOLRCONFIG-BOGUS-SCRIPTENGINE-NAME.XML]
[junit4:junit4]   2> 1011 T2537 oasc.CachingDirectoryFactory.close Releasing directory:/mnt/ssd/jenkins/workspace/Lucene-Solr-trunk-Linux/solr/build/solr-core/test/J0/./solrtest-HardAutoCommitTest-1360766613026
[junit4:junit4]   2> 1013 T2537 oass.SolrIndexSearcher.<init> Opening Searcher@44e30086 main
[junit4:junit4]   2> 1016 T2537 oasu.CommitTracker.<init> Hard AutoCommit: disabled
[junit4:junit4]   2> 1017 T2537 oasu.CommitTracker.<init> Soft AutoCommit: disabled
[junit4:junit4]   2> 1018 T2537 oashc.SpellCheckComponent.inform Initializing spell checkers
[junit4:junit4]   2> 1025 T2537 oass.DirectSolrSpellChecker.init init: {name=direct,classname=DirectSolrSpellChecker,field=lowerfilt,minQueryLength=3}
[junit4:junit4]   2> 1175 T2538 oasc.SolrCore.registerSearcher [collection1] Registered new searcher Searcher@44e30086 main{StandardDirectoryReader(segments_1:1)}
[junit4:junit4]   2> 1179 T2537 oasc.CoreContainer.registerCore registering core: collection1
[junit4:junit4]   2> 1181 T2537 oas.SolrTestCaseJ4.initCore ####initCore end
[junit4:junit4]   2> 1189 T2537 oas.SolrTestCaseJ4.setUp ###Starting testCommitWithin
[junit4:junit4]   2> ASYNC  NEW_CORE C125 name=collection1 org.apache.solr.core.SolrCore@69934410
[junit4:junit4]   2> 1200 T2537 C125 oasu.DirectUpdateHandler2.deleteAll [collection1] REMOVING ALL DOCUMENTS FROM INDEX
[junit4:junit4]   2> 1201 T2537 C125 oasc.CachingDirectoryFactory.close Releasing directory:/mnt/ssd/jenkins/workspace/Lucene-Solr-trunk-Linux/solr/build/solr-core/test/J0/./solrtest-HardAutoCommitTest-1360766613026
[junit4:junit4]   2> 1204 T2537 C125 oasc.SolrDeletionPolicy.onInit SolrDeletionPolicy.onInit: commits:num=1
[junit4:junit4]   2> 		commit{dir=RateLimitedDirectoryWrapper(MockDirWrapper(RateLimitedDirectoryWrapper(org.apache.lucene.store.NIOFSDirectory@/mnt/ssd/jenkins/workspace/Lucene-Solr-trunk-Linux/solr/build/solr-core/test/J0/index96869691tmp lockFactory=org.apache.lucene.store.NativeFSLockFactory@aa5069c6))),segFN=segments_1,generation=1,filenames=[segments_1]
[junit4:junit4]   2> 1205 T2537 C125 oasc.SolrDeletionPolicy.updateCommits newest commit = 1[segments_1]
[junit4:junit4]   2> 1207 T2537 C125 UPDATE [collection1] webapp=null path=null params={} {deleteByQuery=*:*} 0 7
[junit4:junit4]   2> 1211 T2537 oasc.CoreContainer.reload Reloading SolrCore 'collection1' using instanceDir: /mnt/ssd/jenkins/workspace/Lucene-Solr-trunk-Linux/solr/build/solr-core/test-files/solr/collection1
[junit4:junit4]   2> 1212 T2537 oasc.SolrResourceLoader.<init> new SolrResourceLoader for directory: '/mnt/ssd/jenkins/workspace/Lucene-Solr-trunk-Linux/solr/build/solr-core/test-files/solr/collection1/'
[junit4:junit4]   2> 1212 T2537 oasc.SolrResourceLoader.replaceClassLoader Adding 'file:/mnt/ssd/jenkins/workspace/Lucene-Solr-trunk-Linux/solr/build/solr-core/test-files/solr/collection1/lib/README' to classloader
[junit4:junit4]   2> 1213 T2537 oasc.SolrResourceLoader.replaceClassLoader Adding 'file:/mnt/ssd/jenkins/workspace/Lucene-Solr-trunk-Linux/solr/build/solr-core/test-files/solr/collection1/lib/classes/' to classloader
[junit4:junit4]   2> 1248 T2537 oasc.SolrConfig.<init> Using Lucene MatchVersion: LUCENE_50
[junit4:junit4]   2> 1398 T2537 oasc.SolrConfig.<init> Loaded SolrConfig: solrconfig.xml
[junit4:junit4]   2> 1399 T2537 oass.IndexSchema.readSchema Reading Solr Schema
[junit4:junit4]   2> 1453 T2537 oass.IndexSchema.readSchema Schema name=test
[junit4:junit4]   2> 2375 T2537 oass.OpenExchangeRatesOrgProvider.init Initialized with rates=open-exchange-rates.json, refreshInterval=1440.
[junit4:junit4]   2> 2420 T2537 oass.IndexSchema.readSchema default search field in schema is text
[junit4:junit4]   2> 2424 T2537 oass.IndexSchema.readSchema unique key field: id
[junit4:junit4]   2> 2513 T2537 oass.FileExchangeRateProvider.reload Reloading exchange rates from file currency.xml
[junit4:junit4]   2> 2519 T2537 oass.FileExchangeRateProvider.reload Reloading exchange rates from file currency.xml
[junit4:junit4]   2> 2560 T2537 oass.OpenExchangeRatesOrgProvider.reload Reloading exchange rates from open-exchange-rates.json
[junit4:junit4]   2> 2561 T2537 oass.OpenExchangeRatesOrgProvider.reload Reloading exchange rates from open-exchange-rates.json
[junit4:junit4]   2> 2562 T2537 oasc.SolrCore.<init> [collection1] Opening new SolrCore at /mnt/ssd/jenkins/workspace/Lucene-Solr-trunk-Linux/solr/build/solr-core/test-files/solr/collection1/, dataDir=/mnt/ssd/jenkins/workspace/Lucene-Solr-trunk-Linux/solr/build/solr-core/test/J0/./solrtest-HardAutoCommitTest-1360766613026/
[junit4:junit4]   2> 2562 T2537 oasc.JmxMonitoredMap.<init> JMX monitoring is enabled. Adding Solr mbeans to JMX Server: com.sun.jmx.mbeanserver.JmxMBeanServer@c242216
[junit4:junit4]   2> 2568 T2537 oasc.CachingDirectoryFactory.close Releasing directory:/mnt/ssd/jenkins/workspace/Lucene-Solr-trunk-Linux/solr/build/solr-core/test/J0/./solrtest-HardAutoCommitTest-1360766613026
[junit4:junit4]   2> 2575 T2537 oasc.SolrCore.getNewIndexDir New index directory detected: old=null new=/mnt/ssd/jenkins/workspace/Lucene-Solr-trunk-Linux/solr/build/solr-core/test/J0/./solrtest-HardAutoCommitTest-1360766613026/index/
[junit4:junit4]   2> 2579 T2537 oasc.SolrCore.initWriters created xml: solr.XMLResponseWriter
[junit4:junit4]   2> 2594 T2537 oasup.UpdateRequestProcessorChain.init inserting DistributedUpdateProcessorFactory into updateRequestProcessorChain "dedupe"
[junit4:junit4]   2> 2595 T2537 oasup.UpdateRequestProcessorChain.init inserting DistributedUpdateProcessorFactory into updateRequestProcessorChain "dedupe-allfields"
[junit4:junit4]   2> 2600 T2537 oasup.UpdateRequestProcessorChain.init inserting DistributedUpdateProcessorFactory into updateRequestProcessorChain "stored_sig"
[junit4:junit4]   2> 2601 T2537 oasup.UpdateRequestProcessorChain.init inserting DistributedUpdateProcessorFactory into updateRequestProcessorChain "uniq-fields"
[junit4:junit4]   2> 2611 T2537 oasup.UpdateRequestProcessorChain.init inserting DistributedUpdateProcessorFactory into updateRequestProcessorChain "distrib-dup-test-chain-implicit"
[junit4:junit4]   2> 2614 T2537 oasc.RequestHandlers.initHandlersFromConfig adding lazy requestHandler: solr.ReplicationHandler
[junit4:junit4]   2> 2615 T2537 oasc.RequestHandlers.initHandlersFromConfig created /replication: solr.ReplicationHandler
[junit4:junit4]   2> 2616 T2537 oasc.RequestHandlers.initHandlersFromConfig created standard: solr.StandardRequestHandler
[junit4:junit4]   2> 2618 T2537 oasc.RequestHandlers.initHandlersFromConfig created /get: solr.RealTimeGetHandler
[junit4:junit4]   2> 2619 T2537 oasc.RequestHandlers.initHandlersFromConfig created dismax: solr.SearchHandler
[junit4:junit4]   2> 2634 T2537 oasc.RequestHandlers.initHandlersFromConfig created mock: org.apache.solr.core.MockQuerySenderListenerReqHandler
[junit4:junit4]   2> 2641 T2537 oasc.RequestHandlers.initHandlersFromConfig created /admin/: org.apache.solr.handler.admin.AdminHandlers
[junit4:junit4]   2> 2642 T2537 oasc.RequestHandlers.initHandlersFromConfig created defaults: solr.StandardRequestHandler
[junit4:junit4]   2> 2642 T2537 oasc.RequestHandlers.initHandlersFromConfig adding lazy requestHandler: solr.StandardRequestHandler
[junit4:junit4]   2> 2643 T2537 oasc.RequestHandlers.initHandlersFromConfig created lazy: solr.StandardRequestHandler
[junit4:junit4]   2> 2644 T2537 oasc.RequestHandlers.initHandlersFromConfig created /update: solr.UpdateRequestHandler
[junit4:junit4]   2> 2645 T2537 oasc.RequestHandlers.initHandlersFromConfig created /terms: org.apache.solr.handler.component.SearchHandler
[junit4:junit4]   2> 2646 T2537 oasc.RequestHandlers.initHandlersFromConfig created spellCheckCompRH: org.apache.solr.handler.component.SearchHandler
[junit4:junit4]   2> 2647 T2537 oasc.RequestHandlers.initHandlersFromConfig created spellCheckCompRH_Direct: org.apache.solr.handler.component.SearchHandler
[junit4:junit4]   2> 2648 T2537 oasc.RequestHandlers.initHandlersFromConfig created spellCheckWithWordbreak: org.apache.solr.handler.component.SearchHandler
[junit4:junit4]   2> 2649 T2537 oasc.RequestHandlers.initHandlersFromConfig created spellCheckWithWordbreak_Direct: org.apache.solr.handler.component.SearchHandler
[junit4:junit4]   2> 2650 T2537 oasc.RequestHandlers.initHandlersFromConfig created spellCheckCompRH1: org.apache.solr.handler.component.SearchHandler
[junit4:junit4]   2> 2651 T2537 oasc.RequestHandlers.initHandlersFromConfig created mltrh: org.apache.solr.handler.component.SearchHandler
[junit4:junit4]   2> 2653 T2537 oasc.RequestHandlers.initHandlersFromConfig created tvrh: org.apache.solr.handler.component.SearchHandler
[junit4:junit4]   2> 2654 T2537 oasc.RequestHandlers.initHandlersFromConfig created /mlt: solr.MoreLikeThisHandler
[junit4:junit4]   2> 2655 T2537 oasc.RequestHandlers.initHandlersFromConfig created /debug/dump: solr.DumpRequestHandler
[junit4:junit4]   2> 2657 T2537 oashl.XMLLoader.init xsltCacheLifetimeSeconds=60
[junit4:junit4]   2> 2659 T2537 oasc.SolrCore.initDeprecatedSupport WARNING solrconfig.xml uses deprecated <admin/gettableFiles>, Please update your config to use the ShowFileRequestHandler.
[junit4:junit4]   2> 2661 T2537 oasc.SolrCore.initDeprecatedSupport WARNING adding ShowFileRequestHandler with hidden files: [BAD-SCHEMA-NOT-INDEXED-BUT-TF.XML, SCHEMA-REQUIRED-FIELDS.XML, SOLRCONFIG-MASTER1-KEEPONEBACKUP.XML, SOLRCONFIG-PROPINJECT.XML, BAD-SCHEMA-NONTEXT-ANALYZER.XML, SCHEMA-BEHAVIOR.XML, SOLRCONFIG-PROPINJECT-INDEXDEFAULT.XML, STOP-2.TXT, SCHEMA11.XML, BAD-SCHEMA-UNIQUEKEY-USES-DEFAULT.XML, SCHEMA15.XML, SOLRCONFIG-NATIVELOCK.XML, SCHEMA-SIM.XML, CONDITIONAL.UPDATEPROCESSOR.JS, BAD-SOLRCONFIG-MISSING-SCRIPTFILE.XML, SOLRCONFIG-SCRIPT-UPDATEPROCESSOR.XML, SOLRCONFIG-REPEATER.XML, SOLRCONFIG-SPELLCHECKER.XML, SOLRCONFIG-NOCACHE.XML, SCHEMA-CHARFILTERS.XML, SOLRCONFIG-SOLCOREPROPERTIES.XML, SCHEMA-EFF.XML, SOLRCONFIG_CODEC.XML, BAD-SCHEMA-EXTERNAL-FILEFIELD.XML, HYPHENATION.DTD, TRIVIAL.UPDATEPROCESSOR1.JS, SCHEMA.XML, SOLRCONFIG-MERGEPOLICY.XML, SOLRCONFIG-PHRASESUGGEST.XML, SOLRCONFIG-SLAVE1.XML, SOLRCONFIG-BASIC.XML, SCHEMA-LMJELINEKMERCER.XML, JASUGGEST.TXT, BAD-MP-SOLRCONFIG.XML, BAD-SCHEMA-DUP-FIELD.XML, BAD-SCHEMA-UNIQUEKEY-MULTIVALUED.XML, SOLRCONFIG-MASTER.XML, SOLRCONFIG-HIGHLIGHT.XML, SCHEMA-TFIDF.XML, SCHEMA-REPLICATION1.XML, SYNONYMS.TXT, SOLRCONFIG-ELEVATE.XML, STOPWITHBOM.TXT, SOLRCONFIG-QUERYSENDER.XML, SOLRCONFIG-COMPONENTS-NAME.XML, SOLRCONFIG-SNIPPET-PROCESSOR.XML, WDFTYPES.TXT, SOLRCONFIG-DELPOLICY1.XML, BAD_SOLRCONFIG.XML, HUNSPELL-TEST.DIC, SCHEMA-NUMERIC.XML, SCHEMA-LUCENEMATCHVERSION.XML, KEEP-2.TXT, SCHEMA-STOP-KEEP.XML, SCHEMA-IB.XML, STOP-SNOWBALL.TXT, SOLRCONFIG-INDEXCONFIG.XML, SOLRCONFIG-SLAVE.XML, BAD-SCHEMA-NOT-INDEXED-BUT-NORMS.XML, STOPWORDSWRONGENCODING.TXT, THROW.ERROR.ON.ADD.UPDATEPROCESSOR.JS, STOPTYPES-1.TXT, SOLRCONFIG-SPELLCHECKCOMPONENT.XML, REGEX-BOOST-PROCESSOR-TEST.TXT, SOLRCONFIG-TLOG.XML, COMPOUNDDICTIONARY.TXT, SOLRCONFIG-POSTINGSHIGHLIGHT.XML, DA_COMPOUNDDICTIONARY.TXT, SOLRCONFIG-TERMINDEX.XML, BAD-SOLRCONFIG-INVALID-SCRIPTFILE.XML, SCHEMASURROUND.XML, OPEN-EXCHANGE-RATES.JSON, BAD-SCHEMA-DUP-FIELDTYPE.XML, PHRASESUGGEST.TXT, BAD-SCHEMA-CURRENCY-FT-MULTIVALUED.XML, SOLRCONFIG-MASTER2.XML, OLD_SYNONYMS.TXT, BAD-SCHEMA-UNIQUEKEY-IS-COPYFIELD-DEST.XML, SCHEMA-NOT-REQUIRED-UNIQUE-KEY.XML, BAD-SCHEMA-CODEC-GLOBAL-VS-FT-MISMATCH.XML, SCHEMA-LMDIRICHLET.XML, BAD-SCHEMA-NOT-INDEXED-BUT-POS.XML, SCHEMA-REVERSED.XML, BAD-SCHEMA-CURRENCY-MULTIVALUED.XML, SCHEMA-FOLDING.XML, SOLRCONFIG-CACHING.XML, MAPPING-ISOLATIN1ACCENT.TXT, ADDFIELDS.UPDATEPROCESSOR.JS, SCHEMA-BM25.XML, STOP-1.TXT, SOLRCONFIG-ENABLEPLUGIN.XML, MISSING.FUNCTIONS.UPDATEPROCESSOR.JS, SCHEMA12.XML, SOLRCONFIG-TRANSFORMERS.XML, SCHEMA-COPYFIELD-TEST.XML, BAD-SCHEMA-DUP-DYNAMICFIELD.XML, CURRENCY.XML, FUZZYSUGGEST.TXT, DA_UTF8.XML, SCHEMA-POSTINGSHIGHLIGHT.XML, MISSLEADING.EXTENSION.UPDATEPROCESSOR.JS.TXT, SOLRCONFIG-SOLR-749.XML, STOPWORDS.TXT, HUNSPELL-TEST.AFF, SOLRCONFIG_PERF.XML, SOLRCONFIG-SIMPLELOCK.XML, FRENCHARTICLES.TXT, SOLRCONFIG-LAZYWRITER.XML, SOLRCONFIG-RESPONSE-LOG-COMPONENT.XML, SCHEMA-REPLICATION2.XML, SCHEMA-SNIPPET-TYPE.XML, SCHEMA-SPATIAL.XML, SOLRCONFIG-XINCLUDE.XML, SCHEMA-SPELLCHECKER.XML, XSLT, SOLRCONFIG-DELPOLICY2.XML, KEEP-1.TXT, TRIVIAL.UPDATEPROCESSOR0.JS, BAD-SCHEMA-CURRENCY-DYNAMIC-MULTIVALUED.XML, SCHEMA-TRIE.XML, SCHEMA-BINARYFIELD.XML, BAD-SCHEMA-OMIT-TF-BUT-NOT-POS.XML, SCHEMA-MINIMAL.XML, STOPTYPES-2.TXT, SCHEMA_CODEC.XML, STEMDICT.TXT, SCHEMA-SYNONYM-TOKENIZER.XML, ELEVATE.XML, SCHEMA-COLLATE.XML, PROTWORDS.TXT, SCHEMA-XINCLUDE.XML, SCHEMA-SNIPPET-FIELD.XML, SOLRCONFIG-REQHANDLER.INCL, SCHEMA-PHRASESUGGEST.XML, SCHEMA-DFR.XML, BAD-SCHEMA-ANALYZER-CLASS-AND-NESTED.XML, SOLRCONFIG-MASTER1.XML, SOLRCONFIG-FUNCTIONQUERY.XML, SOLRCONFIG-MASTER3.XML, SOLRCONFIG-UPDATE-PROCESSOR-CHAINS.XML, SOLRCONFIG-ALTDIRECTORY.XML, BAD-SCHEMA-SIM-GLOBAL-VS-FT-MISMATCH.XML, SOLRCONFIG-QUERYSENDER-NOQUERY.XML, BAD-SOLRCONFIG-BOGUS-SCRIPTENGINE-NAME.XML]
[junit4:junit4]   2> 2664 T2537 oasc.CachingDirectoryFactory.close Releasing directory:/mnt/ssd/jenkins/workspace/Lucene-Solr-trunk-Linux/solr/build/solr-core/test/J0/./solrtest-HardAutoCommitTest-1360766613026
[junit4:junit4]   2> 2665 T2537 oass.SolrIndexSearcher.<init> Opening Searcher@783948e9 main
[junit4:junit4]   2> 2666 T2537 oasu.CommitTracker.<init> Hard AutoCommit: disabled
[junit4:junit4]   2> 2666 T2537 oasu.CommitTracker.<init> Soft AutoCommit: disabled
[junit4:junit4]   2> 2667 T2537 oashc.SpellCheckComponent.inform Initializing spell checkers
[junit4:junit4]   2> 2669 T2537 oass.DirectSolrSpellChecker.init init: {name=direct,classname=DirectSolrSpellChecker,field=lowerfilt,minQueryLength=3}
[junit4:junit4]   2> 2714 T2539 oasc.SolrCore.registerSearcher [collection1] Registered new searcher Searcher@783948e9 main{StandardDirectoryReader(segments_1:2:nrt)}
[junit4:junit4]   2> 2730 T2537 oasc.CoreContainer.registerCore replacing core: collection1
[junit4:junit4]   2> 2749 T2537 oasc.SolrCore.close [collection1]  CLOSING SolrCore org.apache.solr.core.SolrCore@69934410
[junit4:junit4]   2> 2788 T2537 oasu.DirectUpdateHandler2.close closing DirectUpdateHandler2{commits=0,autocommits=0,soft autocommits=0,optimizes=0,rollbacks=0,expungeDeletes=0,docsPending=0,adds=0,deletesById=0,deletesByQuery=1,errors=0,cumulative_adds=0,cumulative_deletesById=0,cumulative_deletesByQuery=1,cumulative_errors=0}
[junit4:junit4]   2> 2789 T2537 oasc.SolrCore.closeSearcher [collection1] Closing main searcher on request.
[junit4:junit4]   2> 2790 T2537 oasc.CachingDirectoryFactory.close Releasing directory:/mnt/ssd/jenkins/workspace/Lucene-Solr-trunk-Linux/solr/build/solr-core/test/J0/./solrtest-HardAutoCommitTest-1360766613026/index
[junit4:junit4]   2> 2915 T2537 UPDATE [collection1] {add=[529]} 0 123
[junit4:junit4]   2> 4915 T2540 oasu.DirectUpdateHandler2.commit start commit{,optimize=false,openSearcher=true,waitSearcher=true,expungeDeletes=false,softCommit=false}
[junit4:junit4]   2> 4930 T2540 oasc.SolrDeletionPolicy.onCommit SolrDeletionPolicy.onCommit: commits:num=2
[junit4:junit4]   2> 		commit{dir=RateLimitedDirectoryWrapper(MockDirWrapper(RateLimitedDirectoryWrapper(org.apache.lucene.store.NIOFSDirectory@/mnt/ssd/jenkins/workspace/Lucene-Solr-trunk-Linux/solr/build/solr-core/test/J0/index96869691tmp lockFactory=org.apache.lucene.store.NativeFSLockFactory@aa5069c6))),segFN=segments_1,generation=1,filenames=[segments_1]
[junit4:junit4]   2> 		commit{dir=RateLimitedDirectoryWrapper(MockDirWrapper(RateLimitedDirectoryWrapper(org.apache.lucene.store.NIOFSDirectory@/mnt/ssd/jenkins/workspace/Lucene-Solr-trunk-Linux/solr/build/solr-core/test/J0/index96869691tmp lockFactory=org.apache.lucene.store.NativeFSLockFactory@aa5069c6))),segFN=segments_2,generation=2,filenames=[_0.si, segments_2, _0_Lucene40_0.frq, _0_Lucene40_0.prx, _0_Lucene40_0.tim, _0.fnm, _0.fdt, _0_Lucene40_0.tip, _0.fdx, _0_nrm.cfs, _0_nrm.cfe]
[junit4:junit4]   2> 4931 T2540 oasc.SolrDeletionPolicy.updateCommits newest commit = 2[_0.si, segments_2, _0_Lucene40_0.frq, _0_Lucene40_0.prx, _0_Lucene40_0.tim, _0.fnm, _0.fdt, _0_Lucene40_0.tip, _0.fdx, _0_nrm.cfs, _0_nrm.cfe]
[junit4:junit4]   2> 4931 T2540 oasc.CachingDirectoryFactory.close Releasing directory:/mnt/ssd/jenkins/workspace/Lucene-Solr-trunk-Linux/solr/build/solr-core/test/J0/./solrtest-HardAutoCommitTest-1360766613026
[junit4:junit4]   2> 4935 T2540 oass.SolrIndexSearcher.<init> Opening Searcher@789b77e0 main
[junit4:junit4]   2> 4935 T2540 oasu.DirectUpdateHandler2.commit end_commit_flush
[junit4:junit4]   2> 4937 T2539 oasc.SolrCore.registerSearcher [collection1] Registered new searcher Searcher@789b77e0 main{StandardDirectoryReader(segments_2:4:nrt _0(5.0):C1)}
[junit4:junit4]   2> 4937 T2539 oasc.CachingDirectoryFactory.close Releasing directory:/mnt/ssd/jenkins/workspace/Lucene-Solr-trunk-Linux/solr/build/solr-core/test/J0/./solrtest-HardAutoCommitTest-1360766613026/index
[junit4:junit4]   2> ASYNC  NEW_CORE C126 name=collection1 org.apache.solr.core.SolrCore@178958c1
[junit4:junit4]   2> 7084 T2537 C126 REQ [collection1] webapp=null path=null params={q=id:529&start=0&qt=standard&version=2.2&rows=20} hits=1 status=0 QTime=4168 
[junit4:junit4]   2> 7113 T2537 oas.SolrTestCaseJ4.assertQ SEVERE REQUEST FAILED: xpath=//result[@numFound=0]
[junit4:junit4]   2> 		xml response was: <?xml version="1.0" encoding="UTF-8"?>
[junit4:junit4]   2> 	<response>
[junit4:junit4]   2> 	<lst name="responseHeader"><int name="status">0</int><int name="QTime">4168</int></lst><result name="response" numFound="1" start="0"><doc><int name="id">529</int><int name="range_facet_si">529</int><arr name="range_facet_l"><long>529</long></arr><arr name="range_facet_sl"><long>529</long></arr><arr name="field_t"><str>what's inside?</str></arr><arr name="subject"><str>info</str></arr><int name="intDefault">42</int><date name="timestamp">2013-02-13T14:43:35.94Z</date><arr name="multiDefault"><str>muLti-Default</str></arr></doc></result>
[junit4:junit4]   2> 	</response>
[junit4:junit4]   2> 	
[junit4:junit4]   2> 		request was:q=id:529&start=0&qt=standard&version=2.2&rows=20
[junit4:junit4]   2> 7114 T2537 oasc.SolrException.log SEVERE REQUEST FAILED: q=id:529&start=0&qt=standard&version=2.2&rows=20:java.lang.RuntimeException: REQUEST FAILED: xpath=//result[@numFound=0]
[junit4:junit4]   2> 		xml response was: <?xml version="1.0" encoding="UTF-8"?>
[junit4:junit4]   2> 	<response>
[junit4:junit4]   2> 	<lst name="responseHeader"><int name="status">0</int><int name="QTime">4168</int></lst><result name="response" numFound="1" start="0"><doc><int name="id">529</int><int name="range_facet_si">529</int><arr name="range_facet_l"><long>529</long></arr><arr name="range_facet_sl"><long>529</long></arr><arr name="field_t"><str>what's inside?</str></arr><arr name="subject"><str>info</str></arr><int name="intDefault">42</int><date name="timestamp">2013-02-13T14:43:35.94Z</date><arr name="multiDefault"><str>muLti-Default</str></arr></doc></result>
[junit4:junit4]   2> 	</response>
[junit4:junit4]   2> 	
[junit4:junit4]   2> 		request was:q=id:529&start=0&qt=standard&version=2.2&rows=20
[junit4:junit4]   2> 		at org.apache.solr.SolrTestCaseJ4.assertQ(SolrTestCaseJ4.java:511)
[junit4:junit4]   2> 		at org.apache.solr.update.HardAutoCommitTest.testCommitWithin(HardAutoCommitTest.java:79)
[junit4:junit4]   2> 		at sun.reflect.NativeMethodAccessorImpl.invoke0(Native Method)
[junit4:junit4]   2> 		at sun.reflect.NativeMethodAccessorImpl.invoke(NativeMethodAccessorImpl.java:88)
[junit4:junit4]   2> 		at sun.reflect.DelegatingMethodAccessorImpl.invoke(DelegatingMethodAccessorImpl.java:55)
[junit4:junit4]   2> 		at java.lang.reflect.Method.invoke(Method.java:613)
[junit4:junit4]   2> 		at com.carrotsearch.randomizedtesting.RandomizedRunner.invoke(RandomizedRunner.java:1559)
[junit4:junit4]   2> 		at com.carrotsearch.randomizedtesting.RandomizedRunner.access$600(RandomizedRunner.java:79)
[junit4:junit4]   2> 		at com.carrotsearch.randomizedtesting.RandomizedRunner$6.evaluate(RandomizedRunner.java:737)
[junit4:junit4]   2> 		at com.carrotsearch.randomizedtesting.RandomizedRunner$7.evaluate(RandomizedRunner.java:773)
[junit4:junit4]   2> 		at com.carrotsearch.randomizedtesting.RandomizedRunner$8.evaluate(RandomizedRunner.java:787)
[junit4:junit4]   2> 		at com.carrotsearch.randomizedtesting.rules.SystemPropertiesRestoreRule$1.evaluate(SystemPropertiesRestoreRule.java:53)
[junit4:junit4]   2> 		at org.apache.lucene.util.TestRuleSetupTeardownChained$1.evaluate(TestRuleSetupTeardownChained.java:50)
[junit4:junit4]   2> 		at org.apache.lucene.util.TestRuleFieldCacheSanity$1.evaluate(TestRuleFieldCacheSanity.java:51)
[junit4:junit4]   2> 		at org.apache.lucene.util.AbstractBeforeAfterRule$1.evaluate(AbstractBeforeAfterRule.java:46)
[junit4:junit4]   2> 		at com.carrotsearch.randomizedtesting.rules.SystemPropertiesInvariantRule$1.evaluate(SystemPropertiesInvariantRule.java:55)
[junit4:junit4]   2> 		at org.apache.lucene.util.TestRuleThreadAndTestName$1.evaluate(TestRuleThreadAndTestName.java:49)
[junit4:junit4]   2> 		at org.apache.lucene.util.TestRuleIgnoreAfterMaxFailures$1.evaluate(TestRuleIgnoreAfterMaxFailures.java:70)
[junit4:junit4]   2> 		at org.apache.lucene.util.TestRuleMarkFailure$1.evaluate(TestRuleMarkFailure.java:48)
[junit4:junit4]   2> 		at com.carrotsearch.randomizedtesting.rules.StatementAdapter.evaluate(StatementAdapter.java:36)
[junit4:junit4]   2> 		at com.carrotsearch.randomizedtesting.ThreadLeakControl$StatementRunner.run(ThreadLeakControl.java:358)
[junit4:junit4]   2> 		at com.carrotsearch.randomizedtesting.ThreadLeakControl.forkTimeoutingTask(ThreadLeakControl.java:782)
[junit4:junit4]   2> 		at com.carrotsearch.randomizedtesting.ThreadLeakControl$3.evaluate(ThreadLeakControl.java:442)
[junit4:junit4]   2> 		at com.carrotsearch.randomizedtesting.RandomizedRunner.runSingleTest(RandomizedRunner.java:746)
[junit4:junit4]   2> 		at com.carrotsearch.randomizedtesting.RandomizedRunner$3.evaluate(RandomizedRunner.java:648)
[junit4:junit4]   2> 		at com.carrotsearch.randomizedtesting.RandomizedRunner$4.evaluate(RandomizedRunner.java:682)
[junit4:junit4]   2> 		at com.carrotsearch.randomizedtesting.RandomizedRunner$5.evaluate(RandomizedRunner.java:693)
[junit4:junit4]   2> 		at com.carrotsearch.randomizedtesting.rules.StatementAdapter.evaluate(StatementAdapter.java:36)
[junit4:junit4]   2> 		at com.carrotsearch.randomizedtesting.rules.SystemPropertiesRestoreRule$1.evaluate(SystemPropertiesRestoreRule.java:53)
[junit4:junit4]   2> 		at org.apache.lucene.util.AbstractBeforeAfterRule$1.evaluate(AbstractBeforeAfterRule.java:46)
[junit4:junit4]   2> 		at org.apache.lucene.util.TestRuleStoreClassName$1.evaluate(TestRuleStoreClassName.java:42)
[junit4:junit4]   2> 		at com.carrotsearch.randomizedtesting.rules.SystemPropertiesInvariantRule$1.evaluate(SystemPropertiesInvariantRule.java:55)
[junit4:junit4]   2> 		at com.carrotsearch.randomizedtesting.rules.NoShadowingOrOverridesOnMethodsRule$1.evaluate(NoShadowingOrOverridesOnMethodsRule.java:39)
[junit4:junit4]   2> 		at com.carrotsearch.randomizedtesting.rules.NoShadowingOrOverridesOnMethodsRule$1.evaluate(NoShadowingOrOverridesOnMethodsRule.java:39)
[junit4:junit4]   2> 		at com.carrotsearch.randomizedtesting.rules.StatementAdapter.evaluate(StatementAdapter.java:36)
[junit4:junit4]   2> 		at org.apache.lucene.util.TestRuleAssertionsRequired$1.evaluate(TestRuleAssertionsRequired.java:43)
[junit4:junit4]   2> 		at org.apache.lucene.util.TestRuleMarkFailure$1.evaluate(TestRuleMarkFailure.java:48)
[junit4:junit4]   2> 		at org.apache.lucene.util.TestRuleIgnoreAfterMaxFailures$1.evaluate(TestRuleIgnoreAfterMaxFailures.java:70)
[junit4:junit4]   2> 		at org.apache.lucene.util.TestRuleIgnoreTestSuites$1.evaluate(TestRuleIgnoreTestSuites.java:55)
[junit4:junit4]   2> 		at com.carrotsearch.randomizedtesting.rules.StatementAdapter.evaluate(StatementAdapter.java:36)
[junit4:junit4]   2> 		at com.carrotsearch.randomizedtesting.ThreadLeakControl$StatementRunner.run(ThreadLeakControl.java:358)
[junit4:junit4]   2> 		at java.lang.Thread.run(Thread.java:780)
[junit4:junit4]   2> 	
[junit4:junit4]   2> 7115 T2537 oas.SolrTestCaseJ4.tearDown ###Ending testCommitWithin
[junit4:junit4]   2> NOTE: reproduce with: ant test  -Dtestcase=HardAutoCommitTest -Dtests.method=testCommitWithin -Dtests.seed=CB9F93AAFAF84F5C -Dtests.multiplier=3 -Dtests.slow=true -Dtests.locale=mt_MT_PREEURO -Dtests.timezone=Africa/Luanda -Dtests.file.encoding=ISO-8859-1
[junit4:junit4] ERROR   6.01s J0 | HardAutoCommitTest.testCommitWithin <<<
[junit4:junit4]    > Throwable #1: java.lang.RuntimeException: Exception during query
[junit4:junit4]    > 	at __randomizedtesting.SeedInfo.seed([CB9F93AAFAF84F5C:714DFCD279D6A149]:0)
[junit4:junit4]    > 	at org.apache.solr.SolrTestCaseJ4.assertQ(SolrTestCaseJ4.java:518)
[junit4:junit4]    > 	at org.apache.solr.update.HardAutoCommitTest.testCommitWithin(HardAutoCommitTest.java:79)
[junit4:junit4]    > 	at sun.reflect.NativeMethodAccessorImpl.invoke0(Native Method)
[junit4:junit4]    > 	at sun.reflect.NativeMethodAccessorImpl.invoke(NativeMethodAccessorImpl.java:88)
[junit4:junit4]    > 	at sun.reflect.DelegatingMethodAccessorImpl.invoke(DelegatingMethodAccessorImpl.java:55)
[junit4:junit4]    > 	at java.lang.reflect.Method.invoke(Method.java:613)
[junit4:junit4]    > 	at com.carrotsearch.randomizedtesting.RandomizedRunner.invoke(RandomizedRunner.java:1559)
[junit4:junit4]    > 	at com.carrotsearch.randomizedtesting.RandomizedRunner.access$600(RandomizedRunner.java:79)
[junit4:junit4]    > 	at com.carrotsearch.randomizedtesting.RandomizedRunner$6.evaluate(RandomizedRunner.java:737)
[junit4:junit4]    > 	at com.carrotsearch.randomizedtesting.RandomizedRunner$7.evaluate(RandomizedRunner.java:773)
[junit4:junit4]    > 	at com.carrotsearch.randomizedtesting.RandomizedRunner$8.evaluate(RandomizedRunner.java:787)
[junit4:junit4]    > 	at com.carrotsearch.randomizedtesting.rules.SystemPropertiesRestoreRule$1.evaluate(SystemPropertiesRestoreRule.java:53)
[junit4:junit4]    > 	at org.apache.lucene.util.TestRuleSetupTeardownChained$1.evaluate(TestRuleSetupTeardownChained.java:50)
[junit4:junit4]    > 	at org.apache.lucene.util.TestRuleFieldCacheSanity$1.evaluate(TestRuleFieldCacheSanity.java:51)
[junit4:junit4]    > 	at org.apache.lucene.util.AbstractBeforeAfterRule$1.evaluate(AbstractBeforeAfterRule.java:46)
[junit4:junit4]    > 	at com.carrotsearch.randomizedtesting.rules.SystemPropertiesInvariantRule$1.evaluate(SystemPropertiesInvariantRule.java:55)
[junit4:junit4]    > 	at org.apache.lucene.util.TestRuleThreadAndTestName$1.evaluate(TestRuleThreadAndTestName.java:49)
[junit4:junit4]    > 	at org.apache.lucene.util.TestRuleIgnoreAfterMaxFailures$1.evaluate(TestRuleIgnoreAfterMaxFailures.java:70)
[junit4:junit4]    > 	at org.apache.lucene.util.TestRuleMarkFailure$1.evaluate(TestRuleMarkFailure.java:48)
[junit4:junit4]    > 	at com.carrotsearch.randomizedtesting.rules.StatementAdapter.evaluate(StatementAdapter.java:36)
[junit4:junit4]    > 	at com.carrotsearch.randomizedtesting.ThreadLeakControl$StatementRunner.run(ThreadLeakControl.java:358)
[junit4:junit4]    > 	at com.carrotsearch.randomizedtesting.ThreadLeakControl.forkTimeoutingTask(ThreadLeakControl.java:782)
[junit4:junit4]    > 	at com.carrotsearch.randomizedtesting.ThreadLeakControl$3.evaluate(ThreadLeakControl.java:442)
[junit4:junit4]    > 	at com.carrotsearch.randomizedtesting.RandomizedRunner.runSingleTest(RandomizedRunner.java:746)
[junit4:junit4]    > 	at com.carrotsearch.randomizedtesting.RandomizedRunner$3.evaluate(RandomizedRunner.java:648)
[junit4:junit4]    > 	at com.carrotsearch.randomizedtesting.RandomizedRunner$4.evaluate(RandomizedRunner.java:682)
[junit4:junit4]    > 	at com.carrotsearch.randomizedtesting.RandomizedRunner$5.evaluate(RandomizedRunner.java:693)
[junit4:junit4]    > 	at com.carrotsearch.randomizedtesting.rules.StatementAdapter.evaluate(StatementAdapter.java:36)
[junit4:junit4]    > 	at com.carrotsearch.randomizedtesting.rules.SystemPropertiesRestoreRule$1.evaluate(SystemPropertiesRestoreRule.java:53)
[junit4:junit4]    > 	at org.apache.lucene.util.AbstractBeforeAfterRule$1.evaluate(AbstractBeforeAfterRule.java:46)
[junit4:junit4]    > 	at org.apache.lucene.util.TestRuleStoreClassName$1.evaluate(TestRuleStoreClassName.java:42)
[junit4:junit4]    > 	at com.carrotsearch.randomizedtesting.rules.SystemPropertiesInvariantRule$1.evaluate(SystemPropertiesInvariantRule.java:55)
[junit4:junit4]    > 	at com.carrotsearch.randomizedtesting.rules.NoShadowingOrOverridesOnMethodsRule$1.evaluate(NoShadowingOrOverridesOnMethodsRule.java:39)
[junit4:junit4]    > 	at com.carrotsearch.randomizedtesting.rules.NoShadowingOrOverridesOnMethodsRule$1.evaluate(NoShadowingOrOverridesOnMethodsRule.java:39)
[junit4:junit4]    > 	at com.carrotsearch.randomizedtesting.rules.StatementAdapter.evaluate(StatementAdapter.java:36)
[junit4:junit4]    > 	at org.apache.lucene.util.TestRuleAssertionsRequired$1.evaluate(TestRuleAssertionsRequired.java:43)
[junit4:junit4]    > 	at org.apache.lucene.util.TestRuleMarkFailure$1.evaluate(TestRuleMarkFailure.java:48)
[junit4:junit4]    > 	at org.apache.lucene.util.TestRuleIgnoreAfterMaxFailures$1.evaluate(TestRuleIgnoreAfterMaxFailures.java:70)
[junit4:junit4]    > 	at org.apache.lucene.util.TestRuleIgnoreTestSuites$1.evaluate(TestRuleIgnoreTestSuites.java:55)
[junit4:junit4]    > 	at com.carrotsearch.randomizedtesting.rules.StatementAdapter.evaluate(StatementAdapter.java:36)
[junit4:junit4]    > 	at com.carrotsearch.randomizedtesting.ThreadLeakControl$StatementRunner.run(ThreadLeakControl.java:358)
[junit4:junit4]    > 	at java.lang.Thread.run(Thread.java:780)
[junit4:junit4]    > Caused by: java.lang.RuntimeException: REQUEST FAILED: xpath=//result[@numFound=0]
[junit4:junit4]    > 	xml response was: <?xml version="1.0" encoding="UTF-8"?>
[junit4:junit4]    > <response>
[junit4:junit4]    > <lst name="responseHeader"><int name="status">0</int><int name="QTime">4168</int></lst><result name="response" numFound="1" start="0"><doc><int name="id">529</int><int name="range_facet_si">529</int><arr name="range_facet_l"><long>529</long></arr><arr name="range_facet_sl"><long>529</long></arr><arr name="field_t"><str>what's inside?</str></arr><arr name="subject"><str>info</str></arr><int name="intDefault">42</int><date name="timestamp">2013-02-13T14:43:35.94Z</date><arr name="multiDefault"><str>muLti-Default</str></arr></doc></result>
[junit4:junit4]    > </response>
[junit4:junit4]    > 
[junit4:junit4]    > 	request was:q=id:529&start=0&qt=standard&version=2.2&rows=20
[junit4:junit4]    > 	at org.apache.solr.SolrTestCaseJ4.assertQ(SolrTestCaseJ4.java:511)
[junit4:junit4]    > 	... 41 more
[junit4:junit4]   2> 7191 T2537 oas.SolrTestCaseJ4.deleteCore ###deleteCore
[junit4:junit4]   2> 7191 T2537 oasc.CoreContainer.shutdown Shutting down CoreContainer instance=159635531
[junit4:junit4]   2> 7191 T2537 oasc.SolrCore.close [collection1]  CLOSING SolrCore org.apache.solr.core.SolrCore@178958c1
[junit4:junit4]   2> 7199 T2537 oasu.DirectUpdateHandler2.close closing DirectUpdateHandler2{commits=1,autocommits=1,soft autocommits=0,optimizes=0,rollbacks=0,expungeDeletes=0,docsPending=0,adds=0,deletesById=0,deletesByQuery=0,errors=0,cumulative_adds=1,cumulative_deletesById=0,cumulative_deletesByQuery=0,cumulative_errors=0}
[junit4:junit4]   2> 7199 T2537 oasc.SolrCore.decrefSolrCoreState Closing SolrCoreState
[junit4:junit4]   2> 7200 T2537 oasu.DefaultSolrCoreState.closeIndexWriter SolrCoreState ref count has reached 0 - closing IndexWriter
[junit4:junit4]   2> 7200 T2537 oasu.DefaultSolrCoreState.closeIndexWriter closing IndexWriter with IndexWriterCloser
[junit4:junit4]   2> 7201 T2537 C126 oasc.CachingDirectoryFactory.close Releasing directory:/mnt/ssd/jenkins/workspace/Lucene-Solr-trunk-Linux/solr/build/solr-core/test/J0/./solrtest-HardAutoCommitTest-1360766613026/index
[junit4:junit4]   2> 7201 T2537 oasc.SolrCore.closeSearcher [collection1] Closing main searcher on request.
[junit4:junit4]   2> 7202 T2537 oasc.CachingDirectoryFactory.close Releasing directory:/mnt/ssd/jenkins/workspace/Lucene-Solr-trunk-Linux/solr/build/solr-core/test/J0/./solrtest-HardAutoCommitTest-1360766613026/index
[junit4:junit4]   2> 7202 T2537 oasc.CachingDirectoryFactory.close Closing directory when closing factory:/mnt/ssd/jenkins/workspace/Lucene-Solr-trunk-Linux/solr/build/solr-core/test/J0/./solrtest-HardAutoCommitTest-1360766613026
[junit4:junit4]   2> 7202 T2537 oasc.CachingDirectoryFactory.closeDirectory Closing directory:/mnt/ssd/jenkins/workspace/Lucene-Solr-trunk-Linux/solr/build/solr-core/test/J0/./solrtest-HardAutoCommitTest-1360766613026
[junit4:junit4]   2> 7203 T2537 oasc.CachingDirectoryFactory.close Closing directory when closing factory:/mnt/ssd/jenkins/workspace/Lucene-Solr-trunk-Linux/solr/build/solr-core/test/J0/./solrtest-HardAutoCommitTest-1360766613026/index
[junit4:junit4]   2> 7203 T2537 oasc.CachingDirectoryFactory.closeDirectory Closing directory:/mnt/ssd/jenkins/workspace/Lucene-Solr-trunk-Linux/solr/build/solr-core/test/J0/./solrtest-HardAutoCommitTest-1360766613026/index
[junit4:junit4]   2> NOTE: test params are: codec=Lucene40, sim=RandomSimilarityProvider(queryNorm=true,coord=crazy): {}, locale=mt_MT_PREEURO, timezone=Africa/Luanda
[junit4:junit4]   2> NOTE: Linux 3.2.0-37-generic x86/IBM Corporation 1.7.0 (32-bit)/cpus=8,threads=1,free=124884024,total=253231104
[junit4:junit4]   2> NOTE: All tests run in this JVM: [UpdateRequestProcessorFactoryTest, SOLR749Test, TestExtendedDismaxParser, TestIndexingPerformance, RequestHandlersTest, SyncSliceTest, FastVectorHighlighterTest, WordBreakSolrSpellCheckerTest, DirectUpdateHandlerOptimizeTest, DistributedTermsComponentTest, PathHierarchyTokenizerFactoryTest, SpellCheckCollatorTest, DistributedSpellCheckComponentTest, TestBinaryResponseWriter, SolrRequestParserTest, TestRTGBase, TestLMDirichletSimilarityFactory, TestFastLRUCache, TestLFUCache, TestLMJelinekMercerSimilarityFactory, LoggingHandlerTest, MBeansHandlerTest, TestXIncludeConfig, IndexBasedSpellCheckerTest, OverseerCollectionProcessorTest, TermVectorComponentDistributedTest, ChaosMonkeySafeLeaderTest, TestQuerySenderNoQuery, AutoCommitTest, TestBadConfig, LeaderElectionIntegrationTest, DateMathParserTest, SortByFunctionTest, BinaryUpdateRequestHandlerTest, ClusterStateTest, TestCoreContainer, HighlighterConfigTest, TestPseudoReturnFields, TestConfig, BadComponentTest, TestWordDelimiterFilterFactory, TestLuceneMatchVersion, CoreAdminHandlerTest, SpatialFilterTest, TestRangeQuery, TestSolrQueryParser, TestFiltering, SpellPossibilityIteratorTest, TestNumberUtils, CSVRequestHandlerTest, TestRandomFaceting, FileBasedSpellCheckerTest, CopyFieldTest, SolrPluginUtilsTest, BasicDistributedZkTest, HardAutoCommitTest]
[junit4:junit4] Completed on J0 in 7.22s, 1 test, 1 error <<< FAILURES!

[...truncated 132 lines...]
BUILD FAILED
/mnt/ssd/jenkins/workspace/Lucene-Solr-trunk-Linux/build.xml:381: The following error occurred while executing this line:
/mnt/ssd/jenkins/workspace/Lucene-Solr-trunk-Linux/build.xml:374: The following error occurred while executing this line:
/mnt/ssd/jenkins/workspace/Lucene-Solr-trunk-Linux/build.xml:39: The following error occurred while executing this line:
/mnt/ssd/jenkins/workspace/Lucene-Solr-trunk-Linux/solr/build.xml:183: The following error occurred while executing this line:
/mnt/ssd/jenkins/workspace/Lucene-Solr-trunk-Linux/solr/common-build.xml:447: The following error occurred while executing this line:
/mnt/ssd/jenkins/workspace/Lucene-Solr-trunk-Linux/lucene/common-build.xml:1202: The following error occurred while executing this line:
/mnt/ssd/jenkins/workspace/Lucene-Solr-trunk-Linux/lucene/common-build.xml:865: There were test failures: 250 suites, 1040 tests, 1 error, 9 ignored (4 assumptions)

Total time: 40 minutes 44 seconds
Build step 'Invoke Ant' marked build as failure
Archiving artifacts
Recording test results
ERROR: Failed to archive test reports
hudson.util.IOException2: Failed to read /var/lib/jenkins/workspace/Lucene-Solr-trunk-Linux/lucene/build/core/test/TEST-org.apache.lucene.search.TestWildcardRandom.xml
	at hudson.tasks.junit.TestResult.parse(TestResult.java:284)
	at hudson.tasks.junit.TestResult.parsePossiblyEmpty(TestResult.java:223)
	at hudson.tasks.junit.TestResult.parse(TestResult.java:158)
	at hudson.tasks.junit.TestResult.parse(TestResult.java:141)
	at hudson.tasks.junit.TestResult.<init>(TestResult.java:117)
	at hudson.tasks.junit.JUnitParser$ParseResultCallable.invoke(JUnitParser.java:117)
	at hudson.tasks.junit.JUnitParser$ParseResultCallable.invoke(JUnitParser.java:90)
	at hudson.FilePath.act(FilePath.java:865)
	at hudson.FilePath.act(FilePath.java:838)
	at hudson.tasks.junit.JUnitParser.parse(JUnitParser.java:87)
	at hudson.tasks.junit.JUnitResultArchiver.parse(JUnitResultArchiver.java:122)
	at hudson.tasks.junit.JUnitResultArchiver.perform(JUnitResultArchiver.java:134)
	at hudson.tasks.BuildStepMonitor$1.perform(BuildStepMonitor.java:19)
	at hudson.model.AbstractBuild$AbstractBuildExecution.perform(AbstractBuild.java:810)
	at hudson.model.AbstractBuild$AbstractBuildExecution.performAllBuildSteps(AbstractBuild.java:785)
	at hudson.model.Build$BuildExecution.post2(Build.java:183)
	at hudson.model.AbstractBuild$AbstractBuildExecution.post(AbstractBuild.java:732)
	at hudson.model.Run.execute(Run.java:1593)
	at hudson.model.FreeStyleBuild.run(FreeStyleBuild.java:46)
	at hudson.model.ResourceController.execute(ResourceController.java:88)
	at hudson.model.Executor.run(Executor.java:236)
Caused by: org.dom4j.DocumentException: Error on line 122 of document file:///var/lib/jenkins/workspace/Lucene-Solr-trunk-Linux/lucene/build/core/test/TEST-org.apache.lucene.search.TestWildcardRandom.xml : Content is not allowed in trailing section. Nested exception: Content is not allowed in trailing section.
	at org.dom4j.io.SAXReader.read(SAXReader.java:482)
	at org.dom4j.io.SAXReader.read(SAXReader.java:264)
	at hudson.tasks.junit.SuiteResult.parse(SuiteResult.java:129)
	at hudson.tasks.junit.TestResult.parse(TestResult.java:267)
	... 20 more
Caused by: org.xml.sax.SAXParseException: Content is not allowed in trailing section.
	at com.sun.org.apache.xerces.internal.util.ErrorHandlerWrapper.createSAXParseException(ErrorHandlerWrapper.java:195)
	at com.sun.org.apache.xerces.internal.util.ErrorHandlerWrapper.fatalError(ErrorHandlerWrapper.java:174)
	at com.sun.org.apache.xerces.internal.impl.XMLErrorReporter.reportError(XMLErrorReporter.java:388)
	at com.sun.org.apache.xerces.internal.impl.XMLScanner.reportFatalError(XMLScanner.java:1427)
	at com.sun.org.apache.xerces.internal.impl.XMLDocumentScannerImpl$TrailingMiscDriver.next(XMLDocumentScannerImpl.java:1456)
	at com.sun.org.apache.xerces.internal.impl.XMLDocumentScannerImpl.next(XMLDocumentScannerImpl.java:647)
	at com.sun.org.apache.xerces.internal.impl.XMLNSDocumentScannerImpl.next(XMLNSDocumentScannerImpl.java:140)
	at com.sun.org.apache.xerces.internal.impl.XMLDocumentFragmentScannerImpl.scanDocument(XMLDocumentFragmentScannerImpl.java:511)
	at com.sun.org.apache.xerces.internal.parsers.XML11Configuration.parse(XML11Configuration.java:808)
	at com.sun.org.apache.xerces.internal.parsers.XML11Configuration.parse(XML11Configuration.java:737)
	at com.sun.org.apache.xerces.internal.parsers.XMLParser.parse(XMLParser.java:119)
	at com.sun.org.apache.xerces.internal.parsers.AbstractSAXParser.parse(AbstractSAXParser.java:1205)
	at com.sun.org.apache.xerces.internal.jaxp.SAXParserImpl$JAXPSAXParser.parse(SAXParserImpl.java:522)
	at org.dom4j.io.SAXReader.read(SAXReader.java:465)
	... 23 more
Description set: Java: 32bit/ibm-j9-jdk7 
Email was triggered for: Failure
Sending email for trigger: Failure



Mime
View raw message