lucene-dev mailing list archives

Site index · List index
Message view « Date » · « Thread »
Top « Date » · « Thread »
From Apache Jenkins Server <jenk...@builds.apache.org>
Subject [JENKINS] Lucene-Solr-Tests-trunk-java7 - Build # 3699 - Still Failing
Date Fri, 01 Feb 2013 21:02:00 GMT
Build: https://builds.apache.org/job/Lucene-Solr-Tests-trunk-java7/3699/

1 tests failed.
REGRESSION:  org.apache.solr.cloud.SyncSliceTest.testDistribSearch

Error Message:
shard1 should have just been set up to be inconsistent - but it's still consistent

Stack Trace:
java.lang.AssertionError: shard1 should have just been set up to be inconsistent - but it's still consistent
	at __randomizedtesting.SeedInfo.seed([F7EF88BAABE35641:760906A2DCBC367D]:0)
	at org.junit.Assert.fail(Assert.java:93)
	at org.junit.Assert.assertTrue(Assert.java:43)
	at org.junit.Assert.assertNotNull(Assert.java:526)
	at org.apache.solr.cloud.SyncSliceTest.doTest(SyncSliceTest.java:214)
	at org.apache.solr.BaseDistributedSearchTestCase.testDistribSearch(BaseDistributedSearchTestCase.java:794)
	at sun.reflect.NativeMethodAccessorImpl.invoke0(Native Method)
	at sun.reflect.NativeMethodAccessorImpl.invoke(NativeMethodAccessorImpl.java:57)
	at sun.reflect.DelegatingMethodAccessorImpl.invoke(DelegatingMethodAccessorImpl.java:43)
	at java.lang.reflect.Method.invoke(Method.java:601)
	at com.carrotsearch.randomizedtesting.RandomizedRunner.invoke(RandomizedRunner.java:1559)
	at com.carrotsearch.randomizedtesting.RandomizedRunner.access$600(RandomizedRunner.java:79)
	at com.carrotsearch.randomizedtesting.RandomizedRunner$6.evaluate(RandomizedRunner.java:737)
	at com.carrotsearch.randomizedtesting.RandomizedRunner$7.evaluate(RandomizedRunner.java:773)
	at com.carrotsearch.randomizedtesting.RandomizedRunner$8.evaluate(RandomizedRunner.java:787)
	at com.carrotsearch.randomizedtesting.rules.SystemPropertiesRestoreRule$1.evaluate(SystemPropertiesRestoreRule.java:53)
	at org.apache.lucene.util.TestRuleSetupTeardownChained$1.evaluate(TestRuleSetupTeardownChained.java:50)
	at org.apache.lucene.util.TestRuleFieldCacheSanity$1.evaluate(TestRuleFieldCacheSanity.java:51)
	at org.apache.lucene.util.AbstractBeforeAfterRule$1.evaluate(AbstractBeforeAfterRule.java:46)
	at com.carrotsearch.randomizedtesting.rules.SystemPropertiesInvariantRule$1.evaluate(SystemPropertiesInvariantRule.java:55)
	at org.apache.lucene.util.TestRuleThreadAndTestName$1.evaluate(TestRuleThreadAndTestName.java:49)
	at org.apache.lucene.util.TestRuleIgnoreAfterMaxFailures$1.evaluate(TestRuleIgnoreAfterMaxFailures.java:70)
	at org.apache.lucene.util.TestRuleMarkFailure$1.evaluate(TestRuleMarkFailure.java:48)
	at com.carrotsearch.randomizedtesting.rules.StatementAdapter.evaluate(StatementAdapter.java:36)
	at com.carrotsearch.randomizedtesting.ThreadLeakControl$StatementRunner.run(ThreadLeakControl.java:358)
	at com.carrotsearch.randomizedtesting.ThreadLeakControl.forkTimeoutingTask(ThreadLeakControl.java:782)
	at com.carrotsearch.randomizedtesting.ThreadLeakControl$3.evaluate(ThreadLeakControl.java:442)
	at com.carrotsearch.randomizedtesting.RandomizedRunner.runSingleTest(RandomizedRunner.java:746)
	at com.carrotsearch.randomizedtesting.RandomizedRunner$3.evaluate(RandomizedRunner.java:648)
	at com.carrotsearch.randomizedtesting.RandomizedRunner$4.evaluate(RandomizedRunner.java:682)
	at com.carrotsearch.randomizedtesting.RandomizedRunner$5.evaluate(RandomizedRunner.java:693)
	at com.carrotsearch.randomizedtesting.rules.StatementAdapter.evaluate(StatementAdapter.java:36)
	at com.carrotsearch.randomizedtesting.rules.SystemPropertiesRestoreRule$1.evaluate(SystemPropertiesRestoreRule.java:53)
	at org.apache.lucene.util.AbstractBeforeAfterRule$1.evaluate(AbstractBeforeAfterRule.java:46)
	at org.apache.lucene.util.TestRuleStoreClassName$1.evaluate(TestRuleStoreClassName.java:42)
	at com.carrotsearch.randomizedtesting.rules.SystemPropertiesInvariantRule$1.evaluate(SystemPropertiesInvariantRule.java:55)
	at com.carrotsearch.randomizedtesting.rules.NoShadowingOrOverridesOnMethodsRule$1.evaluate(NoShadowingOrOverridesOnMethodsRule.java:39)
	at com.carrotsearch.randomizedtesting.rules.NoShadowingOrOverridesOnMethodsRule$1.evaluate(NoShadowingOrOverridesOnMethodsRule.java:39)
	at com.carrotsearch.randomizedtesting.rules.StatementAdapter.evaluate(StatementAdapter.java:36)
	at org.apache.lucene.util.TestRuleAssertionsRequired$1.evaluate(TestRuleAssertionsRequired.java:43)
	at org.apache.lucene.util.TestRuleMarkFailure$1.evaluate(TestRuleMarkFailure.java:48)
	at org.apache.lucene.util.TestRuleIgnoreAfterMaxFailures$1.evaluate(TestRuleIgnoreAfterMaxFailures.java:70)
	at org.apache.lucene.util.TestRuleIgnoreTestSuites$1.evaluate(TestRuleIgnoreTestSuites.java:55)
	at com.carrotsearch.randomizedtesting.rules.StatementAdapter.evaluate(StatementAdapter.java:36)
	at com.carrotsearch.randomizedtesting.ThreadLeakControl$StatementRunner.run(ThreadLeakControl.java:358)
	at java.lang.Thread.run(Thread.java:722)




Build Log:
[...truncated 9411 lines...]
[junit4:junit4] Suite: org.apache.solr.cloud.SyncSliceTest
[junit4:junit4]   2> 0 T1932 oas.BaseDistributedSearchTestCase.initHostContext Setting hostContext system property: /r_ziz/a
[junit4:junit4]   2> 5 T1932 oas.SolrTestCaseJ4.setUp ###Starting testDistribSearch
[junit4:junit4]   2> Creating dataDir: /usr/home/hudson/hudson-slave/workspace/Lucene-Solr-Tests-trunk-java7/solr/build/solr-core/test/J0/./solrtest-SyncSliceTest-1359752327694
[junit4:junit4]   2> 6 T1932 oasc.ZkTestServer.run STARTING ZK TEST SERVER
[junit4:junit4]   2> 7 T1933 oasc.ZkTestServer$ZKServerMain.runFromConfig Starting server
[junit4:junit4]   2> 10 T1933 oazs.ZooKeeperServer.setTickTime tickTime set to 1000
[junit4:junit4]   2> 10 T1933 oazs.ZooKeeperServer.setMinSessionTimeout minSessionTimeout set to -1
[junit4:junit4]   2> 10 T1933 oazs.ZooKeeperServer.setMaxSessionTimeout maxSessionTimeout set to -1
[junit4:junit4]   2> 11 T1933 oazs.NIOServerCnxnFactory.configure binding to port 0.0.0.0/0.0.0.0:0
[junit4:junit4]   2> 11 T1933 oazsp.FileTxnSnapLog.save Snapshotting: 0x0 to /usr/home/hudson/hudson-slave/workspace/Lucene-Solr-Tests-trunk-java7/solr/build/solr-core/test/J0/./org.apache.solr.cloud.SyncSliceTest-1359752327693/zookeeper/server1/data/version-2/snapshot.0
[junit4:junit4]   2> 108 T1932 oasc.ZkTestServer.run start zk server on port:18314
[junit4:junit4]   2> 108 T1932 oaz.ZooKeeper.<init> Initiating client connection, connectString=127.0.0.1:18314 sessionTimeout=10000 watcher=org.apache.solr.common.cloud.ConnectionManager@56a085ff
[junit4:junit4]   2> 109 T1932 oascc.ConnectionManager.waitForConnected Waiting for client to connect to ZooKeeper
[junit4:junit4]   2> 109 T1938 oaz.ClientCnxn$SendThread.logStartConnect Opening socket connection to server localhost/127.0.0.1:18314. Will not attempt to authenticate using SASL (access denied ("javax.security.auth.AuthPermission" "getLoginConfiguration"))
[junit4:junit4]   2> 110 T1938 oaz.ClientCnxn$SendThread.primeConnection Socket connection established to localhost/127.0.0.1:18314, initiating session
[junit4:junit4]   2> 110 T1934 oazs.NIOServerCnxnFactory.run Accepted socket connection from /140.211.11.196:18315
[junit4:junit4]   2> 111 T1934 oazs.ZooKeeperServer.processConnectRequest Client attempting to establish new session at /140.211.11.196:18315
[junit4:junit4]   2> 111 T1936 oazsp.FileTxnLog.append Creating new log file: log.1
[junit4:junit4]   2> 114 T1936 oazs.ZooKeeperServer.finishSessionInit Established session 0x13c978df2140000 with negotiated timeout 10000 for client /140.211.11.196:18315
[junit4:junit4]   2> 114 T1938 oaz.ClientCnxn$SendThread.onConnected Session establishment complete on server localhost/127.0.0.1:18314, sessionid = 0x13c978df2140000, negotiated timeout = 10000
[junit4:junit4]   2> 114 T1939 oascc.ConnectionManager.process Watcher org.apache.solr.common.cloud.ConnectionManager@56a085ff name:ZooKeeperConnection Watcher:127.0.0.1:18314 got event WatchedEvent state:SyncConnected type:None path:null path:null type:None
[junit4:junit4]   2> 114 T1932 oascc.ConnectionManager.waitForConnected Client is connected to ZooKeeper
[junit4:junit4]   2> 115 T1932 oascc.SolrZkClient.makePath makePath: /solr
[junit4:junit4]   2> 118 T1937 oazs.PrepRequestProcessor.pRequest2Txn Processed session termination for sessionid: 0x13c978df2140000
[junit4:junit4]   2> 124 T1939 oaz.ClientCnxn$EventThread.run EventThread shut down
[junit4:junit4]   2> 124 T1932 oaz.ZooKeeper.close Session: 0x13c978df2140000 closed
[junit4:junit4]   2> 125 T1934 oazs.NIOServerCnxn.closeSock Closed socket connection for client /140.211.11.196:18315 which had sessionid 0x13c978df2140000
[junit4:junit4]   2> 125 T1932 oaz.ZooKeeper.<init> Initiating client connection, connectString=127.0.0.1:18314/solr sessionTimeout=10000 watcher=org.apache.solr.common.cloud.ConnectionManager@17849fe7
[junit4:junit4]   2> 126 T1932 oascc.ConnectionManager.waitForConnected Waiting for client to connect to ZooKeeper
[junit4:junit4]   2> 126 T1940 oaz.ClientCnxn$SendThread.logStartConnect Opening socket connection to server localhost/127.0.0.1:18314. Will not attempt to authenticate using SASL (access denied ("javax.security.auth.AuthPermission" "getLoginConfiguration"))
[junit4:junit4]   2> 127 T1940 oaz.ClientCnxn$SendThread.primeConnection Socket connection established to localhost/127.0.0.1:18314, initiating session
[junit4:junit4]   2> 127 T1934 oazs.NIOServerCnxnFactory.run Accepted socket connection from /140.211.11.196:18316
[junit4:junit4]   2> 127 T1934 oazs.ZooKeeperServer.processConnectRequest Client attempting to establish new session at /140.211.11.196:18316
[junit4:junit4]   2> 128 T1936 oazs.ZooKeeperServer.finishSessionInit Established session 0x13c978df2140001 with negotiated timeout 10000 for client /140.211.11.196:18316
[junit4:junit4]   2> 128 T1940 oaz.ClientCnxn$SendThread.onConnected Session establishment complete on server localhost/127.0.0.1:18314, sessionid = 0x13c978df2140001, negotiated timeout = 10000
[junit4:junit4]   2> 129 T1941 oascc.ConnectionManager.process Watcher org.apache.solr.common.cloud.ConnectionManager@17849fe7 name:ZooKeeperConnection Watcher:127.0.0.1:18314/solr got event WatchedEvent state:SyncConnected type:None path:null path:null type:None
[junit4:junit4]   2> 129 T1932 oascc.ConnectionManager.waitForConnected Client is connected to ZooKeeper
[junit4:junit4]   2> 129 T1932 oascc.SolrZkClient.makePath makePath: /collections/collection1
[junit4:junit4]   2> 140 T1932 oascc.SolrZkClient.makePath makePath: /collections/collection1/shards
[junit4:junit4]   2> 142 T1932 oascc.SolrZkClient.makePath makePath: /collections/control_collection
[junit4:junit4]   2> 145 T1932 oascc.SolrZkClient.makePath makePath: /collections/control_collection/shards
[junit4:junit4]   2> 147 T1932 oasc.AbstractZkTestCase.putConfig put /usr/home/hudson/hudson-slave/workspace/Lucene-Solr-Tests-trunk-java7/solr/build/solr-core/test-files/solr/collection1/conf/solrconfig.xml to /configs/conf1/solrconfig.xml
[junit4:junit4]   2> 148 T1932 oascc.SolrZkClient.makePath makePath: /configs/conf1/solrconfig.xml
[junit4:junit4]   2> 161 T1932 oasc.AbstractZkTestCase.putConfig put /usr/home/hudson/hudson-slave/workspace/Lucene-Solr-Tests-trunk-java7/solr/build/solr-core/test-files/solr/collection1/conf/schema.xml to /configs/conf1/schema.xml
[junit4:junit4]   2> 162 T1932 oascc.SolrZkClient.makePath makePath: /configs/conf1/schema.xml
[junit4:junit4]   2> 266 T1932 oasc.AbstractZkTestCase.putConfig put /usr/home/hudson/hudson-slave/workspace/Lucene-Solr-Tests-trunk-java7/solr/build/solr-core/test-files/solr/collection1/conf/stopwords.txt to /configs/conf1/stopwords.txt
[junit4:junit4]   2> 267 T1932 oascc.SolrZkClient.makePath makePath: /configs/conf1/stopwords.txt
[junit4:junit4]   2> 270 T1932 oasc.AbstractZkTestCase.putConfig put /usr/home/hudson/hudson-slave/workspace/Lucene-Solr-Tests-trunk-java7/solr/build/solr-core/test-files/solr/collection1/conf/protwords.txt to /configs/conf1/protwords.txt
[junit4:junit4]   2> 271 T1932 oascc.SolrZkClient.makePath makePath: /configs/conf1/protwords.txt
[junit4:junit4]   2> 281 T1932 oasc.AbstractZkTestCase.putConfig put /usr/home/hudson/hudson-slave/workspace/Lucene-Solr-Tests-trunk-java7/solr/build/solr-core/test-files/solr/collection1/conf/currency.xml to /configs/conf1/currency.xml
[junit4:junit4]   2> 281 T1932 oascc.SolrZkClient.makePath makePath: /configs/conf1/currency.xml
[junit4:junit4]   2> 285 T1932 oasc.AbstractZkTestCase.putConfig put /usr/home/hudson/hudson-slave/workspace/Lucene-Solr-Tests-trunk-java7/solr/build/solr-core/test-files/solr/collection1/conf/open-exchange-rates.json to /configs/conf1/open-exchange-rates.json
[junit4:junit4]   2> 285 T1932 oascc.SolrZkClient.makePath makePath: /configs/conf1/open-exchange-rates.json
[junit4:junit4]   2> 288 T1932 oasc.AbstractZkTestCase.putConfig put /usr/home/hudson/hudson-slave/workspace/Lucene-Solr-Tests-trunk-java7/solr/build/solr-core/test-files/solr/collection1/conf/mapping-ISOLatin1Accent.txt to /configs/conf1/mapping-ISOLatin1Accent.txt
[junit4:junit4]   2> 289 T1932 oascc.SolrZkClient.makePath makePath: /configs/conf1/mapping-ISOLatin1Accent.txt
[junit4:junit4]   2> 292 T1932 oasc.AbstractZkTestCase.putConfig put /usr/home/hudson/hudson-slave/workspace/Lucene-Solr-Tests-trunk-java7/solr/build/solr-core/test-files/solr/collection1/conf/old_synonyms.txt to /configs/conf1/old_synonyms.txt
[junit4:junit4]   2> 293 T1932 oascc.SolrZkClient.makePath makePath: /configs/conf1/old_synonyms.txt
[junit4:junit4]   2> 296 T1932 oasc.AbstractZkTestCase.putConfig put /usr/home/hudson/hudson-slave/workspace/Lucene-Solr-Tests-trunk-java7/solr/build/solr-core/test-files/solr/collection1/conf/synonyms.txt to /configs/conf1/synonyms.txt
[junit4:junit4]   2> 297 T1932 oascc.SolrZkClient.makePath makePath: /configs/conf1/synonyms.txt
[junit4:junit4]   2> 300 T1937 oazs.PrepRequestProcessor.pRequest2Txn Processed session termination for sessionid: 0x13c978df2140001
[junit4:junit4]   2> 307 T1941 oaz.ClientCnxn$EventThread.run EventThread shut down
[junit4:junit4]   2> 307 T1932 oaz.ZooKeeper.close Session: 0x13c978df2140001 closed
[junit4:junit4]   2> 307 T1934 oazs.NIOServerCnxn.closeSock Closed socket connection for client /140.211.11.196:18316 which had sessionid 0x13c978df2140001
[junit4:junit4]   2> 475 T1932 oejs.Server.doStart jetty-8.1.8.v20121106
[junit4:junit4]   2> 480 T1932 oejs.AbstractConnector.doStart Started SocketConnector@127.0.0.1:18317
[junit4:junit4]   2> 481 T1932 oass.SolrDispatchFilter.init SolrDispatchFilter.init()
[junit4:junit4]   2> 482 T1932 oasc.SolrResourceLoader.locateSolrHome JNDI not configured for solr (NoInitialContextEx)
[junit4:junit4]   2> 482 T1932 oasc.SolrResourceLoader.locateSolrHome using system property solr.solr.home: /usr/home/hudson/hudson-slave/workspace/Lucene-Solr-Tests-trunk-java7/solr/build/solr-core/test/J0/./org.apache.solr.cloud.SyncSliceTest-controljetty-1359752327996
[junit4:junit4]   2> 482 T1932 oasc.CoreContainer$Initializer.initialize looking for solr.xml: /usr/home/hudson/hudson-slave/workspace/Lucene-Solr-Tests-trunk-java7/solr/build/solr-core/test/J0/./org.apache.solr.cloud.SyncSliceTest-controljetty-1359752327996/solr.xml
[junit4:junit4]   2> 483 T1932 oasc.CoreContainer.<init> New CoreContainer 14269640
[junit4:junit4]   2> 484 T1932 oasc.CoreContainer.load Loading CoreContainer using Solr Home: '/usr/home/hudson/hudson-slave/workspace/Lucene-Solr-Tests-trunk-java7/solr/build/solr-core/test/J0/./org.apache.solr.cloud.SyncSliceTest-controljetty-1359752327996/'
[junit4:junit4]   2> 484 T1932 oasc.SolrResourceLoader.<init> new SolrResourceLoader for directory: '/usr/home/hudson/hudson-slave/workspace/Lucene-Solr-Tests-trunk-java7/solr/build/solr-core/test/J0/./org.apache.solr.cloud.SyncSliceTest-controljetty-1359752327996/'
[junit4:junit4]   2> 539 T1932 oashc.HttpShardHandlerFactory.getParameter Setting socketTimeout to: 60000
[junit4:junit4]   2> 540 T1932 oashc.HttpShardHandlerFactory.getParameter Setting urlScheme to: http://
[junit4:junit4]   2> 540 T1932 oashc.HttpShardHandlerFactory.getParameter Setting connTimeout to: 15000
[junit4:junit4]   2> 541 T1932 oashc.HttpShardHandlerFactory.getParameter Setting maxConnectionsPerHost to: 20
[junit4:junit4]   2> 541 T1932 oashc.HttpShardHandlerFactory.getParameter Setting corePoolSize to: 0
[junit4:junit4]   2> 542 T1932 oashc.HttpShardHandlerFactory.getParameter Setting maximumPoolSize to: 2147483647
[junit4:junit4]   2> 542 T1932 oashc.HttpShardHandlerFactory.getParameter Setting maxThreadIdleTime to: 5
[junit4:junit4]   2> 543 T1932 oashc.HttpShardHandlerFactory.getParameter Setting sizeOfQueue to: -1
[junit4:junit4]   2> 543 T1932 oashc.HttpShardHandlerFactory.getParameter Setting fairnessPolicy to: false
[junit4:junit4]   2> 544 T1932 oascsi.HttpClientUtil.createClient Creating new http client, config:maxConnectionsPerHost=20&maxConnections=10000&socketTimeout=60000&connTimeout=15000&retry=false
[junit4:junit4]   2> 566 T1932 oasc.CoreContainer.load Registering Log Listener
[junit4:junit4]   2> 586 T1932 oasc.CoreContainer.initZooKeeper Zookeeper client=127.0.0.1:18314/solr
[junit4:junit4]   2> 586 T1932 oasc.ZkController.checkChrootPath zkHost includes chroot
[junit4:junit4]   2> 587 T1932 oaz.ZooKeeper.<init> Initiating client connection, connectString=127.0.0.1:18314 sessionTimeout=60000 watcher=org.apache.solr.common.cloud.ConnectionManager@2c45fe62
[junit4:junit4]   2> 588 T1932 oascc.ConnectionManager.waitForConnected Waiting for client to connect to ZooKeeper
[junit4:junit4]   2> 588 T1951 oaz.ClientCnxn$SendThread.logStartConnect Opening socket connection to server localhost/127.0.0.1:18314. Will not attempt to authenticate using SASL (access denied ("javax.security.auth.AuthPermission" "getLoginConfiguration"))
[junit4:junit4]   2> 589 T1951 oaz.ClientCnxn$SendThread.primeConnection Socket connection established to localhost/127.0.0.1:18314, initiating session
[junit4:junit4]   2> 589 T1934 oazs.NIOServerCnxnFactory.run Accepted socket connection from /140.211.11.196:18318
[junit4:junit4]   2> 590 T1934 oazs.ZooKeeperServer.processConnectRequest Client attempting to establish new session at /140.211.11.196:18318
[junit4:junit4]   2> 591 T1936 oazs.ZooKeeperServer.finishSessionInit Established session 0x13c978df2140002 with negotiated timeout 20000 for client /140.211.11.196:18318
[junit4:junit4]   2> 591 T1951 oaz.ClientCnxn$SendThread.onConnected Session establishment complete on server localhost/127.0.0.1:18314, sessionid = 0x13c978df2140002, negotiated timeout = 20000
[junit4:junit4]   2> 592 T1952 oascc.ConnectionManager.process Watcher org.apache.solr.common.cloud.ConnectionManager@2c45fe62 name:ZooKeeperConnection Watcher:127.0.0.1:18314 got event WatchedEvent state:SyncConnected type:None path:null path:null type:None
[junit4:junit4]   2> 592 T1932 oascc.ConnectionManager.waitForConnected Client is connected to ZooKeeper
[junit4:junit4]   2> 593 T1937 oazs.PrepRequestProcessor.pRequest2Txn Processed session termination for sessionid: 0x13c978df2140002
[junit4:junit4]   2> 594 T1952 oaz.ClientCnxn$EventThread.run EventThread shut down
[junit4:junit4]   2> 594 T1934 oazs.NIOServerCnxn.closeSock Closed socket connection for client /140.211.11.196:18318 which had sessionid 0x13c978df2140002
[junit4:junit4]   2> 594 T1932 oaz.ZooKeeper.close Session: 0x13c978df2140002 closed
[junit4:junit4]   2> 595 T1932 oascsi.HttpClientUtil.createClient Creating new http client, config:maxConnections=500&maxConnectionsPerHost=16&socketTimeout=60000&connTimeout=15000
[junit4:junit4]   2> 607 T1932 oaz.ZooKeeper.<init> Initiating client connection, connectString=127.0.0.1:18314/solr sessionTimeout=30000 watcher=org.apache.solr.common.cloud.ConnectionManager@448e2986
[junit4:junit4]   2> 608 T1932 oascc.ConnectionManager.waitForConnected Waiting for client to connect to ZooKeeper
[junit4:junit4]   2> 608 T1953 oaz.ClientCnxn$SendThread.logStartConnect Opening socket connection to server localhost/127.0.0.1:18314. Will not attempt to authenticate using SASL (access denied ("javax.security.auth.AuthPermission" "getLoginConfiguration"))
[junit4:junit4]   2> 609 T1953 oaz.ClientCnxn$SendThread.primeConnection Socket connection established to localhost/127.0.0.1:18314, initiating session
[junit4:junit4]   2> 609 T1934 oazs.NIOServerCnxnFactory.run Accepted socket connection from /140.211.11.196:18319
[junit4:junit4]   2> 609 T1934 oazs.ZooKeeperServer.processConnectRequest Client attempting to establish new session at /140.211.11.196:18319
[junit4:junit4]   2> 611 T1936 oazs.ZooKeeperServer.finishSessionInit Established session 0x13c978df2140003 with negotiated timeout 20000 for client /140.211.11.196:18319
[junit4:junit4]   2> 611 T1953 oaz.ClientCnxn$SendThread.onConnected Session establishment complete on server localhost/127.0.0.1:18314, sessionid = 0x13c978df2140003, negotiated timeout = 20000
[junit4:junit4]   2> 611 T1954 oascc.ConnectionManager.process Watcher org.apache.solr.common.cloud.ConnectionManager@448e2986 name:ZooKeeperConnection Watcher:127.0.0.1:18314/solr got event WatchedEvent state:SyncConnected type:None path:null path:null type:None
[junit4:junit4]   2> 611 T1932 oascc.ConnectionManager.waitForConnected Client is connected to ZooKeeper
[junit4:junit4]   2> 613 T1937 oazs.PrepRequestProcessor.pRequest Got user-level KeeperException when processing sessionid:0x13c978df2140003 type:create cxid:0x2 zxid:0x1a txntype:-1 reqpath:n/a Error Path:/solr/overseer Error:KeeperErrorCode = NodeExists for /solr/overseer
[junit4:junit4]   2> 621 T1932 oascc.SolrZkClient.makePath makePath: /live_nodes
[junit4:junit4]   2> 623 T1932 oasc.ZkController.createEphemeralLiveNode Register node as live in ZooKeeper:/live_nodes/127.0.0.1:18317_r_ziz%2Fa
[junit4:junit4]   2> 623 T1937 oazs.PrepRequestProcessor.pRequest Got user-level KeeperException when processing sessionid:0x13c978df2140003 type:delete cxid:0x7 zxid:0x1c txntype:-1 reqpath:n/a Error Path:/solr/live_nodes/127.0.0.1:18317_r_ziz%2Fa Error:KeeperErrorCode = NoNode for /solr/live_nodes/127.0.0.1:18317_r_ziz%2Fa
[junit4:junit4]   2> 624 T1932 oascc.SolrZkClient.makePath makePath: /live_nodes/127.0.0.1:18317_r_ziz%2Fa
[junit4:junit4]   2> 633 T1932 oascc.SolrZkClient.makePath makePath: /overseer_elect/election
[junit4:junit4]   2> 647 T1937 oazs.PrepRequestProcessor.pRequest Got user-level KeeperException when processing sessionid:0x13c978df2140003 type:delete cxid:0x15 zxid:0x21 txntype:-1 reqpath:n/a Error Path:/solr/overseer_elect/leader Error:KeeperErrorCode = NoNode for /solr/overseer_elect/leader
[junit4:junit4]   2> 648 T1932 oascc.SolrZkClient.makePath makePath: /overseer_elect/leader
[junit4:junit4]   2> 651 T1932 oasc.Overseer.start Overseer (id=89112728548147203-127.0.0.1:18317_r_ziz%2Fa-n_0000000000) starting
[junit4:junit4]   2> 651 T1937 oazs.PrepRequestProcessor.pRequest Got user-level KeeperException when processing sessionid:0x13c978df2140003 type:create cxid:0x1a zxid:0x23 txntype:-1 reqpath:n/a Error Path:/solr/overseer Error:KeeperErrorCode = NodeExists for /solr/overseer
[junit4:junit4]   2> 659 T1937 oazs.PrepRequestProcessor.pRequest Got user-level KeeperException when processing sessionid:0x13c978df2140003 type:create cxid:0x1b zxid:0x24 txntype:-1 reqpath:n/a Error Path:/solr/overseer Error:KeeperErrorCode = NodeExists for /solr/overseer
[junit4:junit4]   2> 660 T1937 oazs.PrepRequestProcessor.pRequest Got user-level KeeperException when processing sessionid:0x13c978df2140003 type:create cxid:0x1c zxid:0x25 txntype:-1 reqpath:n/a Error Path:/solr/overseer Error:KeeperErrorCode = NodeExists for /solr/overseer
[junit4:junit4]   2> 661 T1937 oazs.PrepRequestProcessor.pRequest Got user-level KeeperException when processing sessionid:0x13c978df2140003 type:create cxid:0x1d zxid:0x26 txntype:-1 reqpath:n/a Error Path:/solr/overseer Error:KeeperErrorCode = NodeExists for /solr/overseer
[junit4:junit4]   2> 662 T1956 oasc.OverseerCollectionProcessor.run Process current queue of collection creations
[junit4:junit4]   2> 663 T1932 oascc.SolrZkClient.makePath makePath: /clusterstate.json
[junit4:junit4]   2> 665 T1932 oascc.ZkStateReader.createClusterStateWatchersAndUpdate Updating cluster state from ZooKeeper... 
[junit4:junit4]   2> 672 T1957 oasc.CoreContainer.create Creating SolrCore 'collection1' using instanceDir: /usr/home/hudson/hudson-slave/workspace/Lucene-Solr-Tests-trunk-java7/solr/build/solr-core/test/J0/./org.apache.solr.cloud.SyncSliceTest-controljetty-1359752327996/collection1
[junit4:junit4]   2> 672 T1955 oasc.Overseer$ClusterStateUpdater.run Starting to work on the main queue
[junit4:junit4]   2> 673 T1957 oasc.ZkController.createCollectionZkNode Check for collection zkNode:control_collection
[junit4:junit4]   2> 673 T1957 oasc.ZkController.createCollectionZkNode Collection zkNode exists
[junit4:junit4]   2> 674 T1957 oasc.ZkController.readConfigName Load collection config from:/collections/control_collection
[junit4:junit4]   2> 675 T1957 oasc.SolrResourceLoader.<init> new SolrResourceLoader for directory: '/usr/home/hudson/hudson-slave/workspace/Lucene-Solr-Tests-trunk-java7/solr/build/solr-core/test/J0/./org.apache.solr.cloud.SyncSliceTest-controljetty-1359752327996/collection1/'
[junit4:junit4]   2> 676 T1957 oasc.SolrResourceLoader.replaceClassLoader Adding 'file:/usr/home/hudson/hudson-slave/workspace/Lucene-Solr-Tests-trunk-java7/solr/build/solr-core/test/J0/org.apache.solr.cloud.SyncSliceTest-controljetty-1359752327996/collection1/lib/README' to classloader
[junit4:junit4]   2> 677 T1957 oasc.SolrResourceLoader.replaceClassLoader Adding 'file:/usr/home/hudson/hudson-slave/workspace/Lucene-Solr-Tests-trunk-java7/solr/build/solr-core/test/J0/org.apache.solr.cloud.SyncSliceTest-controljetty-1359752327996/collection1/lib/classes/' to classloader
[junit4:junit4]   2> 730 T1957 oasc.SolrConfig.<init> Using Lucene MatchVersion: LUCENE_50
[junit4:junit4]   2> 804 T1957 oasc.SolrConfig.<init> Loaded SolrConfig: solrconfig.xml
[junit4:junit4]   2> 905 T1957 oass.IndexSchema.readSchema Reading Solr Schema
[junit4:junit4]   2> 911 T1957 oass.IndexSchema.readSchema Schema name=test
[junit4:junit4]   2> 1584 T1957 oass.OpenExchangeRatesOrgProvider.init Initialized with rates=open-exchange-rates.json, refreshInterval=1440.
[junit4:junit4]   2> 1597 T1957 oass.IndexSchema.readSchema default search field in schema is text
[junit4:junit4]   2> 1601 T1957 oass.IndexSchema.readSchema unique key field: id
[junit4:junit4]   2> 1615 T1957 oass.FileExchangeRateProvider.reload Reloading exchange rates from file currency.xml
[junit4:junit4]   2> 1620 T1957 oass.FileExchangeRateProvider.reload Reloading exchange rates from file currency.xml
[junit4:junit4]   2> 1624 T1957 oass.OpenExchangeRatesOrgProvider.reload Reloading exchange rates from open-exchange-rates.json
[junit4:junit4]   2> 1625 T1957 oass.OpenExchangeRatesOrgProvider.reload Reloading exchange rates from open-exchange-rates.json
[junit4:junit4]   2> 1626 T1957 oasc.SolrCore.<init> [collection1] Opening new SolrCore at /usr/home/hudson/hudson-slave/workspace/Lucene-Solr-Tests-trunk-java7/solr/build/solr-core/test/J0/./org.apache.solr.cloud.SyncSliceTest-controljetty-1359752327996/collection1/, dataDir=./org.apache.solr.cloud.SyncSliceTest-1359752327693/control/data/
[junit4:junit4]   2> 1627 T1957 oasc.JmxMonitoredMap.<init> JMX monitoring is enabled. Adding Solr mbeans to JMX Server: com.sun.jmx.mbeanserver.JmxMBeanServer@6b8099d3
[junit4:junit4]   2> 1627 T1957 oasc.SolrCore.initDirectoryFactory solr.StandardDirectoryFactory
[junit4:junit4]   2> 1628 T1957 oasc.CachingDirectoryFactory.get return new directory for /usr/home/hudson/hudson-slave/workspace/Lucene-Solr-Tests-trunk-java7/solr/build/solr-core/test/J0/./org.apache.solr.cloud.SyncSliceTest-1359752327693/control/data forceNew:false
[junit4:junit4]   2> 1629 T1957 oasc.CachingDirectoryFactory.close Releasing directory:/usr/home/hudson/hudson-slave/workspace/Lucene-Solr-Tests-trunk-java7/solr/build/solr-core/test/J0/./org.apache.solr.cloud.SyncSliceTest-1359752327693/control/data
[junit4:junit4]   2> 1629 T1957 oasc.SolrCore.getNewIndexDir New index directory detected: old=null new=./org.apache.solr.cloud.SyncSliceTest-1359752327693/control/data/index/
[junit4:junit4]   2> 1630 T1957 oasc.SolrCore.initIndex WARNING [collection1] Solr index directory './org.apache.solr.cloud.SyncSliceTest-1359752327693/control/data/index' doesn't exist. Creating new index...
[junit4:junit4]   2> 1631 T1957 oasc.CachingDirectoryFactory.get return new directory for /usr/home/hudson/hudson-slave/workspace/Lucene-Solr-Tests-trunk-java7/solr/build/solr-core/test/J0/./org.apache.solr.cloud.SyncSliceTest-1359752327693/control/data/index forceNew:false
[junit4:junit4]   2> 1637 T1957 oasc.SolrDeletionPolicy.onCommit SolrDeletionPolicy.onCommit: commits:num=1
[junit4:junit4]   2> 		commit{dir=RateLimitedDirectoryWrapper(org.apache.lucene.store.NIOFSDirectory@/usr/home/hudson/hudson-slave/workspace/Lucene-Solr-Tests-trunk-java7/solr/build/solr-core/test/J0/org.apache.solr.cloud.SyncSliceTest-1359752327693/control/data/index lockFactory=org.apache.lucene.store.NativeFSLockFactory@5debf240),segFN=segments_1,generation=1,filenames=[segments_1]
[junit4:junit4]   2> 1637 T1957 oasc.SolrDeletionPolicy.updateCommits newest commit = 1[segments_1]
[junit4:junit4]   2> 1638 T1957 oasc.CachingDirectoryFactory.close Releasing directory:/usr/home/hudson/hudson-slave/workspace/Lucene-Solr-Tests-trunk-java7/solr/build/solr-core/test/J0/./org.apache.solr.cloud.SyncSliceTest-1359752327693/control/data/index
[junit4:junit4]   2> 1638 T1957 oasc.SolrCore.initWriters created xml: solr.XMLResponseWriter
[junit4:junit4]   2> 1640 T1957 oasup.UpdateRequestProcessorChain.init inserting DistributedUpdateProcessorFactory into updateRequestProcessorChain "dedupe"
[junit4:junit4]   2> 1640 T1957 oasup.UpdateRequestProcessorChain.init inserting DistributedUpdateProcessorFactory into updateRequestProcessorChain "dedupe-allfields"
[junit4:junit4]   2> 1641 T1957 oasup.UpdateRequestProcessorChain.init inserting DistributedUpdateProcessorFactory into updateRequestProcessorChain "stored_sig"
[junit4:junit4]   2> 1641 T1957 oasup.UpdateRequestProcessorChain.init inserting DistributedUpdateProcessorFactory into updateRequestProcessorChain "uniq-fields"
[junit4:junit4]   2> 1641 T1957 oasup.UpdateRequestProcessorChain.init inserting DistributedUpdateProcessorFactory into updateRequestProcessorChain "distrib-dup-test-chain-implicit"
[junit4:junit4]   2> 1642 T1957 oasc.RequestHandlers.initHandlersFromConfig adding lazy requestHandler: solr.ReplicationHandler
[junit4:junit4]   2> 1642 T1957 oasc.RequestHandlers.initHandlersFromConfig created /replication: solr.ReplicationHandler
[junit4:junit4]   2> 1642 T1957 oasc.RequestHandlers.initHandlersFromConfig created standard: solr.StandardRequestHandler
[junit4:junit4]   2> 1643 T1957 oasc.RequestHandlers.initHandlersFromConfig created /get: solr.RealTimeGetHandler
[junit4:junit4]   2> 1643 T1957 oasc.RequestHandlers.initHandlersFromConfig created dismax: solr.SearchHandler
[junit4:junit4]   2> 1644 T1957 oasc.RequestHandlers.initHandlersFromConfig created mock: org.apache.solr.core.MockQuerySenderListenerReqHandler
[junit4:junit4]   2> 1644 T1957 oasc.RequestHandlers.initHandlersFromConfig created /admin/: org.apache.solr.handler.admin.AdminHandlers
[junit4:junit4]   2> 1645 T1957 oasc.RequestHandlers.initHandlersFromConfig created defaults: solr.StandardRequestHandler
[junit4:junit4]   2> 1645 T1957 oasc.RequestHandlers.initHandlersFromConfig adding lazy requestHandler: solr.StandardRequestHandler
[junit4:junit4]   2> 1645 T1957 oasc.RequestHandlers.initHandlersFromConfig created lazy: solr.StandardRequestHandler
[junit4:junit4]   2> 1646 T1957 oasc.RequestHandlers.initHandlersFromConfig created /update: solr.UpdateRequestHandler
[junit4:junit4]   2> 1646 T1957 oasc.RequestHandlers.initHandlersFromConfig created /terms: org.apache.solr.handler.component.SearchHandler
[junit4:junit4]   2> 1646 T1957 oasc.RequestHandlers.initHandlersFromConfig created spellCheckCompRH: org.apache.solr.handler.component.SearchHandler
[junit4:junit4]   2> 1647 T1957 oasc.RequestHandlers.initHandlersFromConfig created spellCheckCompRH_Direct: org.apache.solr.handler.component.SearchHandler
[junit4:junit4]   2> 1647 T1957 oasc.RequestHandlers.initHandlersFromConfig created spellCheckWithWordbreak: org.apache.solr.handler.component.SearchHandler
[junit4:junit4]   2> 1648 T1957 oasc.RequestHandlers.initHandlersFromConfig created spellCheckWithWordbreak_Direct: org.apache.solr.handler.component.SearchHandler
[junit4:junit4]   2> 1648 T1957 oasc.RequestHandlers.initHandlersFromConfig created spellCheckCompRH1: org.apache.solr.handler.component.SearchHandler
[junit4:junit4]   2> 1648 T1957 oasc.RequestHandlers.initHandlersFromConfig created mltrh: org.apache.solr.handler.component.SearchHandler
[junit4:junit4]   2> 1649 T1957 oasc.RequestHandlers.initHandlersFromConfig created tvrh: org.apache.solr.handler.component.SearchHandler
[junit4:junit4]   2> 1649 T1957 oasc.RequestHandlers.initHandlersFromConfig created /mlt: solr.MoreLikeThisHandler
[junit4:junit4]   2> 1650 T1957 oasc.RequestHandlers.initHandlersFromConfig created /debug/dump: solr.DumpRequestHandler
[junit4:junit4]   2> 1664 T1957 oashl.XMLLoader.init xsltCacheLifetimeSeconds=60
[junit4:junit4]   2> 1669 T1957 oasc.SolrCore.initDeprecatedSupport WARNING solrconfig.xml uses deprecated <admin/gettableFiles>, Please update your config to use the ShowFileRequestHandler.
[junit4:junit4]   2> 1670 T1957 oasc.SolrCore.initDeprecatedSupport WARNING adding ShowFileRequestHandler with hidden files: [SCHEMA.XML, OLD_SYNONYMS.TXT, STOPWORDS.TXT, PROTWORDS.TXT, OPEN-EXCHANGE-RATES.JSON, SYNONYMS.TXT, CURRENCY.XML, MAPPING-ISOLATIN1ACCENT.TXT]
[junit4:junit4]   2> 1673 T1957 oasc.CachingDirectoryFactory.close Releasing directory:/usr/home/hudson/hudson-slave/workspace/Lucene-Solr-Tests-trunk-java7/solr/build/solr-core/test/J0/./org.apache.solr.cloud.SyncSliceTest-1359752327693/control/data
[junit4:junit4]   2> 1674 T1957 oass.SolrIndexSearcher.<init> Opening Searcher@5a93b3aa main
[junit4:junit4]   2> 1675 T1957 oasu.CommitTracker.<init> Hard AutoCommit: disabled
[junit4:junit4]   2> 1675 T1957 oasu.CommitTracker.<init> Soft AutoCommit: disabled
[junit4:junit4]   2> 1676 T1957 oashc.SpellCheckComponent.inform Initializing spell checkers
[junit4:junit4]   2> 1682 T1957 oass.DirectSolrSpellChecker.init init: {name=direct,classname=DirectSolrSpellChecker,field=lowerfilt,minQueryLength=3}
[junit4:junit4]   2> 1727 T1958 oasc.SolrCore.registerSearcher [collection1] Registered new searcher Searcher@5a93b3aa main{StandardDirectoryReader(segments_1:1)}
[junit4:junit4]   2> 1731 T1957 oasc.ZkController.publish publishing core=collection1 state=down
[junit4:junit4]   2> 1731 T1957 oasc.ZkController.publish numShards not found on descriptor - reading it from system property
[junit4:junit4]   2> 1732 T1937 oazs.PrepRequestProcessor.pRequest Got user-level KeeperException when processing sessionid:0x13c978df2140003 type:create cxid:0x50 zxid:0x29 txntype:-1 reqpath:n/a Error Path:/solr/overseer/queue Error:KeeperErrorCode = NoNode for /solr/overseer/queue
[junit4:junit4]   2> 2177 T1955 oascc.ZkStateReader.updateClusterState Updating cloud state from ZooKeeper... 
[junit4:junit4]   2> 2177 T1955 oasc.Overseer$ClusterStateUpdater.updateState Update state numShards=1 message={
[junit4:junit4]   2> 	  "operation":"state",
[junit4:junit4]   2> 	  "numShards":"1",
[junit4:junit4]   2> 	  "shard":null,
[junit4:junit4]   2> 	  "roles":null,
[junit4:junit4]   2> 	  "state":"down",
[junit4:junit4]   2> 	  "core":"collection1",
[junit4:junit4]   2> 	  "collection":"control_collection",
[junit4:junit4]   2> 	  "node_name":"127.0.0.1:18317_r_ziz%2Fa",
[junit4:junit4]   2> 	  "base_url":"http://127.0.0.1:18317/r_ziz/a"}
[junit4:junit4]   2> 2178 T1955 oasc.Overseer$ClusterStateUpdater.createCollection Create collection control_collection with numShards 1
[junit4:junit4]   2> 2178 T1955 oasc.Overseer$ClusterStateUpdater.updateState Assigning new node to shard shard=shard1
[junit4:junit4]   2> 2178 T1937 oazs.PrepRequestProcessor.pRequest Got user-level KeeperException when processing sessionid:0x13c978df2140003 type:create cxid:0x58 zxid:0x2c txntype:-1 reqpath:n/a Error Path:/solr/overseer/queue-work Error:KeeperErrorCode = NoNode for /solr/overseer/queue-work
[junit4:junit4]   2> 2197 T1954 oascc.ZkStateReader$2.process A cluster state change: WatchedEvent state:SyncConnected type:NodeDataChanged path:/clusterstate.json, has occurred - updating... (live nodes size: 1)
[junit4:junit4]   2> 2746 T1957 oasc.CoreContainer.registerCore registering core: collection1
[junit4:junit4]   2> 2746 T1957 oasc.ZkController.register Register replica - core:collection1 address:http://127.0.0.1:18317/r_ziz/a collection:control_collection shard:shard1
[junit4:junit4]   2> 2747 T1957 oascc.SolrZkClient.makePath makePath: /collections/control_collection/leader_elect/shard1/election
[junit4:junit4]   2> 2763 T1937 oazs.PrepRequestProcessor.pRequest Got user-level KeeperException when processing sessionid:0x13c978df2140003 type:delete cxid:0x72 zxid:0x36 txntype:-1 reqpath:n/a Error Path:/solr/collections/control_collection/leaders Error:KeeperErrorCode = NoNode for /solr/collections/control_collection/leaders
[junit4:junit4]   2> 2764 T1957 oasc.ShardLeaderElectionContext.runLeaderProcess Running the leader process.
[junit4:junit4]   2> 2765 T1937 oazs.PrepRequestProcessor.pRequest Got user-level KeeperException when processing sessionid:0x13c978df2140003 type:create cxid:0x73 zxid:0x37 txntype:-1 reqpath:n/a Error Path:/solr/overseer Error:KeeperErrorCode = NodeExists for /solr/overseer
[junit4:junit4]   2> 2775 T1957 oasc.ShardLeaderElectionContext.waitForReplicasToComeUp Enough replicas found to continue.
[junit4:junit4]   2> 2775 T1957 oasc.ShardLeaderElectionContext.runLeaderProcess I may be the new leader - try and sync
[junit4:junit4]   2> 2775 T1957 oasc.SyncStrategy.sync Sync replicas to http://127.0.0.1:18317/r_ziz/a/collection1/
[junit4:junit4]   2> 2776 T1957 oasc.SyncStrategy.syncReplicas Sync Success - now sync replicas to me
[junit4:junit4]   2> 2776 T1957 oasc.SyncStrategy.syncToMe http://127.0.0.1:18317/r_ziz/a/collection1/ has no replicas
[junit4:junit4]   2> 2776 T1957 oasc.ShardLeaderElectionContext.runLeaderProcess I am the new leader: http://127.0.0.1:18317/r_ziz/a/collection1/
[junit4:junit4]   2> 2776 T1957 oascc.SolrZkClient.makePath makePath: /collections/control_collection/leaders/shard1
[junit4:junit4]   2> 2780 T1937 oazs.PrepRequestProcessor.pRequest Got user-level KeeperException when processing sessionid:0x13c978df2140003 type:create cxid:0x7d zxid:0x3b txntype:-1 reqpath:n/a Error Path:/solr/overseer Error:KeeperErrorCode = NodeExists for /solr/overseer
[junit4:junit4]   2> 3701 T1955 oascc.ZkStateReader.updateClusterState Updating cloud state from ZooKeeper... 
[junit4:junit4]   2> 3725 T1954 oascc.ZkStateReader$2.process A cluster state change: WatchedEvent state:SyncConnected type:NodeDataChanged path:/clusterstate.json, has occurred - updating... (live nodes size: 1)
[junit4:junit4]   2> 3751 T1957 oasc.ZkController.register We are http://127.0.0.1:18317/r_ziz/a/collection1/ and leader is http://127.0.0.1:18317/r_ziz/a/collection1/
[junit4:junit4]   2> 3751 T1957 oasc.ZkController.register No LogReplay needed for core=collection1 baseURL=http://127.0.0.1:18317/r_ziz/a
[junit4:junit4]   2> 3751 T1957 oasc.ZkController.checkRecovery I am the leader, no recovery necessary
[junit4:junit4]   2> 3751 T1957 oasc.ZkController.publish publishing core=collection1 state=active
[junit4:junit4]   2> 3752 T1957 oasc.ZkController.publish numShards not found on descriptor - reading it from system property
[junit4:junit4]   2> 3754 T1957 oascc.ZkStateReader.updateClusterState Updating cloud state from ZooKeeper... 
[junit4:junit4]   2> 3755 T1932 oass.SolrDispatchFilter.init user.dir=/usr/home/hudson/hudson-slave/workspace/Lucene-Solr-Tests-trunk-java7/solr/build/solr-core/test/J0
[junit4:junit4]   2> 3756 T1932 oass.SolrDispatchFilter.init SolrDispatchFilter.init() done
[junit4:junit4]   2> 3756 T1932 oascsi.HttpClientUtil.createClient Creating new http client, config:maxConnections=128&maxConnectionsPerHost=32&followRedirects=false
[junit4:junit4]   2> 3772 T1932 oascsi.HttpClientUtil.createClient Creating new http client, config:
[junit4:junit4]   2> 3781 T1932 oaz.ZooKeeper.<init> Initiating client connection, connectString=127.0.0.1:18314/solr sessionTimeout=10000 watcher=org.apache.solr.common.cloud.ConnectionManager@71f7a0d0
[junit4:junit4]   2> 3782 T1932 oascc.ConnectionManager.waitForConnected Waiting for client to connect to ZooKeeper
[junit4:junit4]   2> 3783 T1959 oaz.ClientCnxn$SendThread.logStartConnect Opening socket connection to server localhost/127.0.0.1:18314. Will not attempt to authenticate using SASL (access denied ("javax.security.auth.AuthPermission" "getLoginConfiguration"))
[junit4:junit4]   2> 3783 T1959 oaz.ClientCnxn$SendThread.primeConnection Socket connection established to localhost/127.0.0.1:18314, initiating session
[junit4:junit4]   2> 3783 T1934 oazs.NIOServerCnxnFactory.run Accepted socket connection from /140.211.11.196:18324
[junit4:junit4]   2> 3784 T1934 oazs.ZooKeeperServer.processConnectRequest Client attempting to establish new session at /140.211.11.196:18324
[junit4:junit4]   2> 3785 T1936 oazs.ZooKeeperServer.finishSessionInit Established session 0x13c978df2140004 with negotiated timeout 10000 for client /140.211.11.196:18324
[junit4:junit4]   2> 3785 T1959 oaz.ClientCnxn$SendThread.onConnected Session establishment complete on server localhost/127.0.0.1:18314, sessionid = 0x13c978df2140004, negotiated timeout = 10000
[junit4:junit4]   2> 3785 T1960 oascc.ConnectionManager.process Watcher org.apache.solr.common.cloud.ConnectionManager@71f7a0d0 name:ZooKeeperConnection Watcher:127.0.0.1:18314/solr got event WatchedEvent state:SyncConnected type:None path:null path:null type:None
[junit4:junit4]   2> 3786 T1932 oascc.ConnectionManager.waitForConnected Client is connected to ZooKeeper
[junit4:junit4]   2> 3787 T1932 oascc.ZkStateReader.createClusterStateWatchersAndUpdate Updating cluster state from ZooKeeper... 
[junit4:junit4]   2> 3789 T1932 oasc.ChaosMonkey.monkeyLog monkey: init - expire sessions:true cause connection loss:true
[junit4:junit4]   2> 3990 T1932 oejs.Server.doStart jetty-8.1.8.v20121106
[junit4:junit4]   2> 3993 T1932 oejs.AbstractConnector.doStart Started SocketConnector@127.0.0.1:18328
[junit4:junit4]   2> 3994 T1932 oass.SolrDispatchFilter.init SolrDispatchFilter.init()
[junit4:junit4]   2> 3994 T1932 oasc.SolrResourceLoader.locateSolrHome JNDI not configured for solr (NoInitialContextEx)
[junit4:junit4]   2> 3995 T1932 oasc.SolrResourceLoader.locateSolrHome using system property solr.solr.home: /usr/home/hudson/hudson-slave/workspace/Lucene-Solr-Tests-trunk-java7/solr/build/solr-core/test/J0/./org.apache.solr.cloud.SyncSliceTest-jetty1-1359752331477
[junit4:junit4]   2> 3995 T1932 oasc.CoreContainer$Initializer.initialize looking for solr.xml: /usr/home/hudson/hudson-slave/workspace/Lucene-Solr-Tests-trunk-java7/solr/build/solr-core/test/J0/./org.apache.solr.cloud.SyncSliceTest-jetty1-1359752331477/solr.xml
[junit4:junit4]   2> 3995 T1932 oasc.CoreContainer.<init> New CoreContainer 79511924
[junit4:junit4]   2> 3996 T1932 oasc.CoreContainer.load Loading CoreContainer using Solr Home: '/usr/home/hudson/hudson-slave/workspace/Lucene-Solr-Tests-trunk-java7/solr/build/solr-core/test/J0/./org.apache.solr.cloud.SyncSliceTest-jetty1-1359752331477/'
[junit4:junit4]   2> 3997 T1932 oasc.SolrResourceLoader.<init> new SolrResourceLoader for directory: '/usr/home/hudson/hudson-slave/workspace/Lucene-Solr-Tests-trunk-java7/solr/build/solr-core/test/J0/./org.apache.solr.cloud.SyncSliceTest-jetty1-1359752331477/'
[junit4:junit4]   2> 4050 T1932 oashc.HttpShardHandlerFactory.getParameter Setting socketTimeout to: 60000
[junit4:junit4]   2> 4051 T1932 oashc.HttpShardHandlerFactory.getParameter Setting urlScheme to: http://
[junit4:junit4]   2> 4051 T1932 oashc.HttpShardHandlerFactory.getParameter Setting connTimeout to: 15000
[junit4:junit4]   2> 4052 T1932 oashc.HttpShardHandlerFactory.getParameter Setting maxConnectionsPerHost to: 20
[junit4:junit4]   2> 4052 T1932 oashc.HttpShardHandlerFactory.getParameter Setting corePoolSize to: 0
[junit4:junit4]   2> 4053 T1932 oashc.HttpShardHandlerFactory.getParameter Setting maximumPoolSize to: 2147483647
[junit4:junit4]   2> 4053 T1932 oashc.HttpShardHandlerFactory.getParameter Setting maxThreadIdleTime to: 5
[junit4:junit4]   2> 4054 T1932 oashc.HttpShardHandlerFactory.getParameter Setting sizeOfQueue to: -1
[junit4:junit4]   2> 4054 T1932 oashc.HttpShardHandlerFactory.getParameter Setting fairnessPolicy to: false
[junit4:junit4]   2> 4055 T1932 oascsi.HttpClientUtil.createClient Creating new http client, config:maxConnectionsPerHost=20&maxConnections=10000&socketTimeout=60000&connTimeout=15000&retry=false
[junit4:junit4]   2> 4074 T1932 oasc.CoreContainer.load Registering Log Listener
[junit4:junit4]   2> 4093 T1932 oasc.CoreContainer.initZooKeeper Zookeeper client=127.0.0.1:18314/solr
[junit4:junit4]   2> 4094 T1932 oasc.ZkController.checkChrootPath zkHost includes chroot
[junit4:junit4]   2> 4095 T1932 oaz.ZooKeeper.<init> Initiating client connection, connectString=127.0.0.1:18314 sessionTimeout=60000 watcher=org.apache.solr.common.cloud.ConnectionManager@4c6923b5
[junit4:junit4]   2> 4096 T1932 oascc.ConnectionManager.waitForConnected Waiting for client to connect to ZooKeeper
[junit4:junit4]   2> 4096 T1970 oaz.ClientCnxn$SendThread.logStartConnect Opening socket connection to server localhost/127.0.0.1:18314. Will not attempt to authenticate using SASL (access denied ("javax.security.auth.AuthPermission" "getLoginConfiguration"))
[junit4:junit4]   2> 4097 T1970 oaz.ClientCnxn$SendThread.primeConnection Socket connection established to localhost/127.0.0.1:18314, initiating session
[junit4:junit4]   2> 4097 T1934 oazs.NIOServerCnxnFactory.run Accepted socket connection from /140.211.11.196:18329
[junit4:junit4]   2> 4098 T1934 oazs.ZooKeeperServer.processConnectRequest Client attempting to establish new session at /140.211.11.196:18329
[junit4:junit4]   2> 4104 T1936 oazs.ZooKeeperServer.finishSessionInit Established session 0x13c978df2140005 with negotiated timeout 20000 for client /140.211.11.196:18329
[junit4:junit4]   2> 4104 T1970 oaz.ClientCnxn$SendThread.onConnected Session establishment complete on server localhost/127.0.0.1:18314, sessionid = 0x13c978df2140005, negotiated timeout = 20000
[junit4:junit4]   2> 4104 T1971 oascc.ConnectionManager.process Watcher org.apache.solr.common.cloud.ConnectionManager@4c6923b5 name:ZooKeeperConnection Watcher:127.0.0.1:18314 got event WatchedEvent state:SyncConnected type:None path:null path:null type:None
[junit4:junit4]   2> 4104 T1932 oascc.ConnectionManager.waitForConnected Client is connected to ZooKeeper
[junit4:junit4]   2> 4106 T1937 oazs.PrepRequestProcessor.pRequest2Txn Processed session termination for sessionid: 0x13c978df2140005
[junit4:junit4]   2> 4151 T1971 oaz.ClientCnxn$EventThread.run EventThread shut down
[junit4:junit4]   2> 4151 T1934 oazs.NIOServerCnxn.closeSock Closed socket connection for client /140.211.11.196:18329 which had sessionid 0x13c978df2140005
[junit4:junit4]   2> 4151 T1932 oaz.ZooKeeper.close Session: 0x13c978df2140005 closed
[junit4:junit4]   2> 4152 T1932 oascsi.HttpClientUtil.createClient Creating new http client, config:maxConnections=500&maxConnectionsPerHost=16&socketTimeout=60000&connTimeout=15000
[junit4:junit4]   2> 4164 T1932 oaz.ZooKeeper.<init> Initiating client connection, connectString=127.0.0.1:18314/solr sessionTimeout=30000 watcher=org.apache.solr.common.cloud.ConnectionManager@5841e204
[junit4:junit4]   2> 4165 T1932 oascc.ConnectionManager.waitForConnected Waiting for client to connect to ZooKeeper
[junit4:junit4]   2> 4165 T1972 oaz.ClientCnxn$SendThread.logStartConnect Opening socket connection to server localhost/127.0.0.1:18314. Will not attempt to authenticate using SASL (access denied ("javax.security.auth.AuthPermission" "getLoginConfiguration"))
[junit4:junit4]   2> 4166 T1972 oaz.ClientCnxn$SendThread.primeConnection Socket connection established to localhost/127.0.0.1:18314, initiating session
[junit4:junit4]   2> 4166 T1934 oazs.NIOServerCnxnFactory.run Accepted socket connection from /140.211.11.196:18330
[junit4:junit4]   2> 4166 T1934 oazs.ZooKeeperServer.processConnectRequest Client attempting to establish new session at /140.211.11.196:18330
[junit4:junit4]   2> 4192 T1936 oazs.ZooKeeperServer.finishSessionInit Established session 0x13c978df2140006 with negotiated timeout 20000 for client /140.211.11.196:18330
[junit4:junit4]   2> 4192 T1972 oaz.ClientCnxn$SendThread.onConnected Session establishment complete on server localhost/127.0.0.1:18314, sessionid = 0x13c978df2140006, negotiated timeout = 20000
[junit4:junit4]   2> 4193 T1973 oascc.ConnectionManager.process Watcher org.apache.solr.common.cloud.ConnectionManager@5841e204 name:ZooKeeperConnection Watcher:127.0.0.1:18314/solr got event WatchedEvent state:SyncConnected type:None path:null path:null type:None
[junit4:junit4]   2> 4193 T1932 oascc.ConnectionManager.waitForConnected Client is connected to ZooKeeper
[junit4:junit4]   2> 4194 T1937 oazs.PrepRequestProcessor.pRequest Got user-level KeeperException when processing sessionid:0x13c978df2140006 type:create cxid:0x1 zxid:0x49 txntype:-1 reqpath:n/a Error Path:/solr/overseer Error:KeeperErrorCode = NodeExists for /solr/overseer
[junit4:junit4]   2> 4242 T1937 oazs.PrepRequestProcessor.pRequest Got user-level KeeperException when processing sessionid:0x13c978df2140006 type:create cxid:0x2 zxid:0x4a txntype:-1 reqpath:n/a Error Path:/solr/overseer Error:KeeperErrorCode = NodeExists for /solr/overseer
[junit4:junit4]   2> 4266 T1932 oasc.ZkController.createEphemeralLiveNode Register node as live in ZooKeeper:/live_nodes/127.0.0.1:18328_r_ziz%2Fa
[junit4:junit4]   2> 4267 T1937 oazs.PrepRequestProcessor.pRequest Got user-level KeeperException when processing sessionid:0x13c978df2140006 type:delete cxid:0x4 zxid:0x4b txntype:-1 reqpath:n/a Error Path:/solr/live_nodes/127.0.0.1:18328_r_ziz%2Fa Error:KeeperErrorCode = NoNode for /solr/live_nodes/127.0.0.1:18328_r_ziz%2Fa
[junit4:junit4]   2> 4312 T1932 oascc.SolrZkClient.makePath makePath: /live_nodes/127.0.0.1:18328_r_ziz%2Fa
[junit4:junit4]   2> 4346 T1954 oascc.ZkStateReader$3.process Updating live nodes... (2)
[junit4:junit4]   2> 4346 T1960 oascc.ZkStateReader$3.process Updating live nodes... (2)
[junit4:junit4]   2> 4347 T1954 oascc.ZkStateReader$2.process A cluster state change: WatchedEvent state:SyncConnected type:NodeChildrenChanged path:/live_nodes, has occurred - updating... (live nodes size: 2)
[junit4:junit4]   2> 4349 T1932 oascc.ZkStateReader.createClusterStateWatchersAndUpdate Updating cluster state from ZooKeeper... 
[junit4:junit4]   2> 4357 T1974 oasc.CoreContainer.create Creating SolrCore 'collection1' using instanceDir: /usr/home/hudson/hudson-slave/workspace/Lucene-Solr-Tests-trunk-java7/solr/build/solr-core/test/J0/./org.apache.solr.cloud.SyncSliceTest-jetty1-1359752331477/collection1
[junit4:junit4]   2> 4357 T1974 oasc.ZkController.createCollectionZkNode Check for collection zkNode:collection1
[junit4:junit4]   2> 4358 T1974 oasc.ZkController.createCollectionZkNode Collection zkNode exists
[junit4:junit4]   2> 4358 T1974 oasc.ZkController.readConfigName Load collection config from:/collections/collection1
[junit4:junit4]   2> 4360 T1974 oasc.SolrResourceLoader.<init> new SolrResourceLoader for directory: '/usr/home/hudson/hudson-slave/workspace/Lucene-Solr-Tests-trunk-java7/solr/build/solr-core/test/J0/./org.apache.solr.cloud.SyncSliceTest-jetty1-1359752331477/collection1/'
[junit4:junit4]   2> 4361 T1974 oasc.SolrResourceLoader.replaceClassLoader Adding 'file:/usr/home/hudson/hudson-slave/workspace/Lucene-Solr-Tests-trunk-java7/solr/build/solr-core/test/J0/org.apache.solr.cloud.SyncSliceTest-jetty1-1359752331477/collection1/lib/README' to classloader
[junit4:junit4]   2> 4361 T1974 oasc.SolrResourceLoader.replaceClassLoader Adding 'file:/usr/home/hudson/hudson-slave/workspace/Lucene-Solr-Tests-trunk-java7/solr/build/solr-core/test/J0/org.apache.solr.cloud.SyncSliceTest-jetty1-1359752331477/collection1/lib/classes/' to classloader
[junit4:junit4]   2> 4416 T1974 oasc.SolrConfig.<init> Using Lucene MatchVersion: LUCENE_50
[junit4:junit4]   2> 4489 T1974 oasc.SolrConfig.<init> Loaded SolrConfig: solrconfig.xml
[junit4:junit4]   2> 4590 T1974 oass.IndexSchema.readSchema Reading Solr Schema
[junit4:junit4]   2> 4597 T1974 oass.IndexSchema.readSchema Schema name=test
[junit4:junit4]   2> 5230 T1974 oass.OpenExchangeRatesOrgProvider.init Initialized with rates=open-exchange-rates.json, refreshInterval=1440.
[junit4:junit4]   2> 5236 T1955 oascc.ZkStateReader.updateClusterState Updating cloud state from ZooKeeper... 
[junit4:junit4]   2> 5237 T1955 oasc.Overseer$ClusterStateUpdater.updateState Update state numShards=1 message={
[junit4:junit4]   2> 	  "operation":"state",
[junit4:junit4]   2> 	  "numShards":"1",
[junit4:junit4]   2> 	  "shard":"shard1",
[junit4:junit4]   2> 	  "roles":null,
[junit4:junit4]   2> 	  "state":"active",
[junit4:junit4]   2> 	  "core":"collection1",
[junit4:junit4]   2> 	  "collection":"control_collection",
[junit4:junit4]   2> 	  "node_name":"127.0.0.1:18317_r_ziz%2Fa",
[junit4:junit4]   2> 	  "base_url":"http://127.0.0.1:18317/r_ziz/a"}
[junit4:junit4]   2> 5238 T1974 oass.IndexSchema.readSchema default search field in schema is text
[junit4:junit4]   2> 5241 T1974 oass.IndexSchema.readSchema unique key field: id
[junit4:junit4]   2> 5268 T1960 oascc.ZkStateReader$2.process A cluster state change: WatchedEvent state:SyncConnected type:NodeDataChanged path:/clusterstate.json, has occurred - updating... (live nodes size: 2)
[junit4:junit4]   2> 5268 T1973 oascc.ZkStateReader$2.process A cluster state change: WatchedEvent state:SyncConnected type:NodeDataChanged path:/clusterstate.json, has occurred - updating... (live nodes size: 2)
[junit4:junit4]   2> 5268 T1954 oascc.ZkStateReader$2.process A cluster state change: WatchedEvent state:SyncConnected type:NodeDataChanged path:/clusterstate.json, has occurred - updating... (live nodes size: 2)
[junit4:junit4]   2> 5276 T1974 oass.FileExchangeRateProvider.reload Reloading exchange rates from file currency.xml
[junit4:junit4]   2> 5279 T1974 oass.FileExchangeRateProvider.reload Reloading exchange rates from file currency.xml
[junit4:junit4]   2> 5283 T1974 oass.OpenExchangeRatesOrgProvider.reload Reloading exchange rates from open-exchange-rates.json
[junit4:junit4]   2> 5284 T1974 oass.OpenExchangeRatesOrgProvider.reload Reloading exchange rates from open-exchange-rates.json
[junit4:junit4]   2> 5285 T1974 oasc.SolrCore.<init> [collection1] Opening new SolrCore at /usr/home/hudson/hudson-slave/workspace/Lucene-Solr-Tests-trunk-java7/solr/build/solr-core/test/J0/./org.apache.solr.cloud.SyncSliceTest-jetty1-1359752331477/collection1/, dataDir=./org.apache.solr.cloud.SyncSliceTest-1359752327693/jetty1/
[junit4:junit4]   2> 5285 T1974 oasc.JmxMonitoredMap.<init> JMX monitoring is enabled. Adding Solr mbeans to JMX Server: com.sun.jmx.mbeanserver.JmxMBeanServer@6b8099d3
[junit4:junit4]   2> 5285 T1974 oasc.SolrCore.initDirectoryFactory solr.StandardDirectoryFactory
[junit4:junit4]   2> 5286 T1974 oasc.CachingDirectoryFactory.get return new directory for /usr/home/hudson/hudson-slave/workspace/Lucene-Solr-Tests-trunk-java7/solr/build/solr-core/test/J0/./org.apache.solr.cloud.SyncSliceTest-1359752327693/jetty1 forceNew:false
[junit4:junit4]   2> 5287 T1974 oasc.CachingDirectoryFactory.close Releasing directory:/usr/home/hudson/hudson-slave/workspace/Lucene-Solr-Tests-trunk-java7/solr/build/solr-core/test/J0/./org.apache.solr.cloud.SyncSliceTest-1359752327693/jetty1
[junit4:junit4]   2> 5287 T1974 oasc.SolrCore.getNewIndexDir New index directory detected: old=null new=./org.apache.solr.cloud.SyncSliceTest-1359752327693/jetty1/index/
[junit4:junit4]   2> 5287 T1974 oasc.SolrCore.initIndex WARNING [collection1] Solr index directory './org.apache.solr.cloud.SyncSliceTest-1359752327693/jetty1/index' doesn't exist. Creating new index...
[junit4:junit4]   2> 5288 T1974 oasc.CachingDirectoryFactory.get return new directory for /usr/home/hudson/hudson-slave/workspace/Lucene-Solr-Tests-trunk-java7/solr/build/solr-core/test/J0/./org.apache.solr.cloud.SyncSliceTest-1359752327693/jetty1/index forceNew:false
[junit4:junit4]   2> 5304 T1974 oasc.SolrDeletionPolicy.onCommit SolrDeletionPolicy.onCommit: commits:num=1
[junit4:junit4]   2> 		commit{dir=RateLimitedDirectoryWrapper(org.apache.lucene.store.NIOFSDirectory@/usr/home/hudson/hudson-slave/workspace/Lucene-Solr-Tests-trunk-java7/solr/build/solr-core/test/J0/org.apache.solr.cloud.SyncSliceTest-1359752327693/jetty1/index lockFactory=org.apache.lucene.store.NativeFSLockFactory@5885cf0),segFN=segments_1,generation=1,filenames=[segments_1]
[junit4:junit4]   2> 5305 T1974 oasc.SolrDeletionPolicy.updateCommits newest commit = 1[segments_1]
[junit4:junit4]   2> 5306 T1974 oasc.CachingDirectoryFactory.close Releasing directory:/usr/home/hudson/hudson-slave/workspace/Lucene-Solr-Tests-trunk-java7/solr/build/solr-core/test/J0/./org.apache.solr.cloud.SyncSliceTest-1359752327693/jetty1/index
[junit4:junit4]   2> 5306 T1974 oasc.SolrCore.initWriters created xml: solr.XMLResponseWriter
[junit4:junit4]   2> 5307 T1974 oasup.UpdateRequestProcessorChain.init inserting DistributedUpdateProcessorFactory into updateRequestProcessorChain "dedupe"
[junit4:junit4]   2> 5308 T1974 oasup.UpdateRequestProcessorChain.init inserting DistributedUpdateProcessorFactory into updateRequestProcessorChain "dedupe-allfields"
[junit4:junit4]   2> 5308 T1974 oasup.UpdateRequestProcessorChain.init inserting DistributedUpdateProcessorFactory into updateRequestProcessorChain "stored_sig"
[junit4:junit4]   2> 5308 T1974 oasup.UpdateRequestProcessorChain.init inserting DistributedUpdateProcessorFactory into updateRequestProcessorChain "uniq-fields"
[junit4:junit4]   2> 5308 T1974 oasup.UpdateRequestProcessorChain.init inserting DistributedUpdateProcessorFactory into updateRequestProcessorChain "distrib-dup-test-chain-implicit"
[junit4:junit4]   2> 5309 T1974 oasc.RequestHandlers.initHandlersFromConfig adding lazy requestHandler: solr.ReplicationHandler
[junit4:junit4]   2> 5309 T1974 oasc.RequestHandlers.initHandlersFromConfig created /replication: solr.ReplicationHandler
[junit4:junit4]   2> 5309 T1974 oasc.RequestHandlers.initHandlersFromConfig created standard: solr.StandardRequestHandler
[junit4:junit4]   2> 5310 T1974 oasc.RequestHandlers.initHandlersFromConfig created /get: solr.RealTimeGetHandler
[junit4:junit4]   2> 5310 T1974 oasc.RequestHandlers.initHandlersFromConfig created dismax: solr.SearchHandler
[junit4:junit4]   2> 5310 T1974 oasc.RequestHandlers.initHandlersFromConfig created mock: org.apache.solr.core.MockQuerySenderListenerReqHandler
[junit4:junit4]   2> 5311 T1974 oasc.RequestHandlers.initHandlersFromConfig created /admin/: org.apache.solr.handler.admin.AdminHandlers
[junit4:junit4]   2> 5311 T1974 oasc.RequestHandlers.initHandlersFromConfig created defaults: solr.StandardRequestHandler
[junit4:junit4]   2> 5311 T1974 oasc.RequestHandlers.initHandlersFromConfig adding lazy requestHandler: solr.StandardRequestHandler
[junit4:junit4]   2> 5311 T1974 oasc.RequestHandlers.initHandlersFromConfig created lazy: solr.StandardRequestHandler
[junit4:junit4]   2> 5312 T1974 oasc.RequestHandlers.initHandlersFromConfig created /update: solr.UpdateRequestHandler
[junit4:junit4]   2> 5312 T1974 oasc.RequestHandlers.initHandlersFromConfig created /terms: org.apache.solr.handler.component.SearchHandler
[junit4:junit4]   2> 5313 T1974 oasc.RequestHandlers.initHandlersFromConfig created spellCheckCompRH: org.apache.solr.handler.component.SearchHandler
[junit4:junit4]   2> 5313 T1974 oasc.RequestHandlers.initHandlersFromConfig created spellCheckCompRH_Direct: org.apache.solr.handler.component.SearchHandler
[junit4:junit4]   2> 5313 T1974 oasc.RequestHandlers.initHandlersFromConfig created spellCheckWithWordbreak: org.apache.solr.handler.component.SearchHandler
[junit4:junit4]   2> 5314 T1974 oasc.RequestHandlers.initHandlersFromConfig created spellCheckWithWordbreak_Direct: org.apache.solr.handler.component.SearchHandler
[junit4:junit4]   2> 5314 T1974 oasc.RequestHandlers.initHandlersFromConfig created spellCheckCompRH1: org.apache.solr.handler.component.SearchHandler
[junit4:junit4]   2> 5314 T1974 oasc.RequestHandlers.initHandlersFromConfig created mltrh: org.apache.solr.handler.component.SearchHandler
[junit4:junit4]   2> 5315 T1974 oasc.RequestHandlers.initHandlersFromConfig created tvrh: org.apache.solr.handler.component.SearchHandler
[junit4:junit4]   2> 5315 T1974 oasc.RequestHandlers.initHandlersFromConfig created /mlt: solr.MoreLikeThisHandler
[junit4:junit4]   2> 5315 T1974 oasc.RequestHandlers.initHandlersFromConfig created /debug/dump: solr.DumpRequestHandler
[junit4:junit4]   2> 5324 T1974 oashl.XMLLoader.init xsltCacheLifetimeSeconds=60
[junit4:junit4]   2> 5327 T1974 oasc.SolrCore.initDeprecatedSupport WARNING solrconfig.xml uses deprecated <admin/gettableFiles>, Please update your config to use the ShowFileRequestHandler.
[junit4:junit4]   2> 5328 T1974 oasc.SolrCore.initDeprecatedSupport WARNING adding ShowFileRequestHandler with hidden files: [SCHEMA.XML, OLD_SYNONYMS.TXT, STOPWORDS.TXT, PROTWORDS.TXT, OPEN-EXCHANGE-RATES.JSON, SYNONYMS.TXT, CURRENCY.XML, MAPPING-ISOLATIN1ACCENT.TXT]
[junit4:junit4]   2> 5330 T1974 oasc.CachingDirectoryFactory.close Releasing directory:/usr/home/hudson/hudson-slave/workspace/Lucene-Solr-Tests-trunk-java7/solr/build/solr-core/test/J0/./org.apache.solr.cloud.SyncSliceTest-1359752327693/jetty1
[junit4:junit4]   2> 5331 T1974 oass.SolrIndexSearcher.<init> Opening Searcher@5c0609c3 main
[junit4:junit4]   2> 5332 T1974 oasu.CommitTracker.<init> Hard AutoCommit: disabled
[junit4:junit4]   2> 5332 T1974 oasu.CommitTracker.<init> Soft AutoCommit: disabled
[junit4:junit4]   2> 5333 T1974 oashc.SpellCheckComponent.inform Initializing spell checkers
[junit4:junit4]   2> 5344 T1974 oass.DirectSolrSpellChecker.init init: {name=direct,classname=DirectSolrSpellChecker,field=lowerfilt,minQueryLength=3}
[junit4:junit4]   2> 5404 T1975 oasc.SolrCore.registerSearcher [collection1] Registered new searcher Searcher@5c0609c3 main{StandardDirectoryReader(segments_1:1)}
[junit4:junit4]   2> 5407 T1974 oasc.ZkController.publish publishing core=collection1 state=down
[junit4:junit4]   2> 5407 T1974 oasc.ZkController.publish numShards not found on descriptor - reading it from system property
[junit4:junit4]   2> 6773 T1955 oascc.ZkStateReader.updateClusterState Updating cloud state from ZooKeeper... 
[junit4:junit4]   2> 6773 T1955 oasc.Overseer$ClusterStateUpdater.updateState Update state numShards=1 message={
[junit4:junit4]   2> 	  "operation":"state",
[junit4:junit4]   2> 	  "numShards":"1",
[junit4:junit4]   2> 	  "shard":null,
[junit4:junit4]   2> 	  "roles":null,
[junit4:junit4]   2> 	  "state":"down",
[junit4:junit4]   2> 	  "core":"collection1",
[junit4:junit4]   2> 	  "collection":"collection1",
[junit4:junit4]   2> 	  "node_name":"127.0.0.1:18328_r_ziz%2Fa",
[junit4:junit4]   2> 	  "base_url":"http://127.0.0.1:18328/r_ziz/a"}
[junit4:junit4]   2> 6774 T1955 oasc.Overseer$ClusterStateUpdater.createCollection Create collection collection1 with numShards 1
[junit4:junit4]   2> 6774 T1955 oasc.Overseer$ClusterStateUpdater.updateState Assigning new node to shard shard=shard1
[junit4:junit4]   2> 6786 T1954 oascc.ZkStateReader$2.process A cluster state change: WatchedEvent state:SyncConnected type:NodeDataChanged path:/clusterstate.json, has occurred - updating... (live nodes size: 2)
[junit4:junit4]   2> 6786 T1960 oascc.ZkStateReader$2.process A cluster state change: WatchedEvent state:SyncConnected type:NodeDataChanged path:/clusterstate.json, has occurred - updating... (live nodes size: 2)
[junit4:junit4]   2> 6786 T1973 oascc.ZkStateReader$2.process A cluster state change: WatchedEvent state:SyncConnected type:NodeDataChanged path:/clusterstate.json, has occurred - updating... (live nodes size: 2)
[junit4:junit4]   2> 7411 T1974 oasc.CoreContainer.registerCore registering core: collection1
[junit4:junit4]   2> 7411 T1974 oasc.ZkController.register Register replica - core:collection1 address:http://127.0.0.1:18328/r_ziz/a collection:collection1 shard:shard1
[junit4:junit4]   2> 7412 T1974 oascc.SolrZkClient.makePath makePath: /collections/collection1/leader_elect/shard1/election
[junit4:junit4]   2> 7427 T1937 oazs.PrepRequestProcessor.pRequest Got user-level KeeperException when processing sessionid:0x13c978df2140006 type:delete cxid:0x45 zxid:0x5b txntype:-1 reqpath:n/a Error Path:/solr/collections/collection1/leaders Error:KeeperErrorCode = NoNode for /solr/collections/collection1/leaders
[junit4:junit4]   2> 7428 T1974 oasc.ShardLeaderElectionContext.runLeaderProcess Running the leader process.
[junit4:junit4]   2> 7429 T1937 oazs.PrepRequestProcessor.pRequest Got user-level KeeperException when processing sessionid:0x13c978df2140006 type:create cxid:0x46 zxid:0x5c txntype:-1 reqpath:n/a Error Path:/solr/overseer Error:KeeperErrorCode = NodeExists for /solr/overseer
[junit4:junit4]   2> 7434 T1974 oasc.ShardLeaderElectionContext.waitForReplicasToComeUp Enough replicas found to continue.
[junit4:junit4]   2> 7434 T1974 oasc.ShardLeaderElectionContext.runLeaderProcess I may be the new leader - try and sync
[junit4:junit4]   2> 7434 T1974 oasc.SyncStrategy.sync Sync replicas to http://127.0.0.1:18328/r_ziz/a/collection1/
[junit4:junit4]   2> 7434 T1974 oasc.SyncStrategy.syncReplicas Sync Success - now sync replicas to me
[junit4:junit4]   2> 7435 T1974 oasc.SyncStrategy.syncToMe http://127.0.0.1:18328/r_ziz/a/collection1/ has no replicas
[junit4:junit4]   2> 7435 T1974 oasc.ShardLeaderElectionContext.runLeaderProcess I am the new leader: http://127.0.0.1:18328/r_ziz/a/collection1/
[junit4:junit4]   2> 7435 T1974 oascc.SolrZkClient.makePath makePath: /collections/collection1/leaders/shard1
[junit4:junit4]   2> 7453 T1937 oazs.PrepRequestProcessor.pRequest Got user-level KeeperException when processing sessionid:0x13c978df2140006 type:create cxid:0x50 zxid:0x60 txntype:-1 reqpath:n/a Error Path:/solr/overseer Error:KeeperErrorCode = NodeExists for /solr/overseer
[junit4:junit4]   2> 8290 T1955 oascc.ZkStateReader.updateClusterState Updating cloud state from ZooKeeper... 
[junit4:junit4]   2> 8312 T1954 oascc.ZkStateReader$2.process A cluster state change: WatchedEvent state:SyncConnected type:NodeDataChanged path:/clusterstate.json, has occurred - updating... (live nodes size: 2)
[junit4:junit4]   2> 8312 T1973 oascc.ZkStateReader$2.process A cluster state change: WatchedEvent state:SyncConnected type:NodeDataChanged path:/clusterstate.json, has occurred - updating... (live nodes size: 2)
[junit4:junit4]   2> 8312 T1960 oascc.ZkStateReader$2.process A cluster state change: WatchedEvent state:SyncConnected type:NodeDataChanged path:/clusterstate.json, has occurred - updating... (live nodes size: 2)
[junit4:junit4]   2> 8322 T1974 oasc.ZkController.register We are http://127.0.0.1:18328/r_ziz/a/collection1/ and leader is http://127.0.0.1:18328/r_ziz/a/collection1/
[junit4:junit4]   2> 8322 T1974 oasc.ZkController.register No LogReplay needed for core=collection1 baseURL=http://127.0.0.1:18328/r_ziz/a
[junit4:junit4]   2> 8322 T1974 oasc.ZkController.checkRecovery I am the leader, no recovery necessary
[junit4:junit4]   2> 8322 T1974 oasc.ZkController.publish publishing core=collection1 state=active
[junit4:junit4]   2> 8323 T1974 oasc.ZkController.publish numShards not found on descriptor - reading it from system property
[junit4:junit4]   2> 8325 T1974 oascc.ZkStateReader.updateClusterState Updating cloud state from ZooKeeper... 
[junit4:junit4]   2> 8326 T1932 oass.SolrDispatchFilter.init user.dir=/usr/home/hudson/hudson-slave/workspace/Lucene-Solr-Tests-trunk-java7/solr/build/solr-core/test/J0
[junit4:junit4]   2> 8327 T1932 oass.SolrDispatchFilter.init SolrDispatchFilter.init() done
[junit4:junit4]   2> 8327 T1932 oascsi.HttpClientUtil.createClient Creating new http client, config:maxConnections=128&maxConnectionsPerHost=32&followRedirects=false
[junit4:junit4]   2> 8512 T1932 oejs.Server.doStart jetty-8.1.8.v20121106
[junit4:junit4]   2> 8515 T1932 oejs.AbstractConnector.doStart Started SocketConnector@127.0.0.1:18335
[junit4:junit4]   2> 8516 T1932 oass.SolrDispatchFilter.init SolrDispatchFilter.init()
[junit4:junit4]   2> 8517 T1932 oasc.SolrResourceLoader.locateSolrHome JNDI not configured for solr (NoInitialContextEx)
[junit4:junit4]   2> 8517 T1932 oasc.SolrResourceLoader.locateSolrHome using system property solr.solr.home: /usr/home/hudson/hudson-slave/workspace/Lucene-Solr-Tests-trunk-java7/solr/build/solr-core/test/J0/./org.apache.solr.cloud.SyncSliceTest-jetty2-1359752336029
[junit4:junit4]   2> 8518 T1932 oasc.CoreContainer$Initializer.initialize looking for solr.xml: /usr/home/hudson/hudson-slave/workspace/Lucene-Solr-Tests-trunk-java7/solr/build/solr-core/test/J0/./org.apache.solr.cloud.SyncSliceTest-jetty2-1359752336029/solr.xml
[junit4:junit4]   2> 8518 T1932 oasc.CoreContainer.<init> New CoreContainer 1852995571
[junit4:junit4]   2> 8519 T1932 oasc.CoreContainer.load Loading CoreContainer using Solr Home: '/usr/home/hudson/hudson-slave/workspace/Lucene-Solr-Tests-trunk-java7/solr/build/solr-core/test/J0/./org.apache.solr.cloud.SyncSliceTest-jetty2-1359752336029/'
[junit4:junit4]   2> 8519 T1932 oasc.SolrResourceLoader.<init> new SolrResourceLoader for directory: '/usr/home/hudson/hudson-slave/workspace/Lucene-Solr-Tests-trunk-java7/solr/build/solr-core/test/J0/./org.apache.solr.cloud.SyncSliceTest-jetty2-1359752336029/'
[junit4:junit4]   2> 8574 T1932 oashc.HttpShardHandlerFactory.getParameter Setting socketTimeout to: 60000
[junit4:junit4]   2> 8575 T1932 oashc.HttpShardHandlerFactory.getParameter Setting urlScheme to: http://
[junit4:junit4]   2> 8575 T1932 oashc.HttpShardHandlerFactory.getParameter Setting connTimeout to: 15000
[junit4:junit4]   2> 8576 T1932 oashc.HttpShardHandlerFactory.getParameter Setting maxConnectionsPerHost to: 20
[junit4:junit4]   2> 8576 T1932 oashc.HttpShardHandlerFactory.getParameter Setting corePoolSize to: 0
[junit4:junit4]   2> 8577 T1932 oashc.HttpShardHandlerFactory.getParameter Setting maximumPoolSize to: 2147483647
[junit4:junit4]   2> 8577 T1932 oashc.HttpShardHandlerFactory.getParameter Setting maxThreadIdleTime to: 5
[junit4:junit4]   2> 8578 T1932 oashc.HttpShardHandlerFactory.getParameter Setting sizeOfQueue to: -1
[junit4:junit4]   2> 8578 T1932 oashc.HttpShardHandlerFactory.getParameter Setting fairnessPolicy to: false
[junit4:junit4]   2> 8578 T1932 oascsi.HttpClientUtil.createClient Creating new http client, config:maxConnectionsPerHost=20&maxConnections=10000&socketTimeout=60000&connTimeout=15000&retry=false
[junit4:junit4]   2> 8598 T1932 oasc.CoreContainer.load Registering Log Listener
[junit4:junit4]   2> 8619 T1932 oasc.CoreContainer.initZooKeeper Zookeeper client=127.0.0.1:18314/solr
[junit4:junit4]   2> 8619 T1932 oasc.ZkController.checkChrootPath zkHost includes chroot
[junit4:junit4]   2> 8620 T1932 oaz.ZooKeeper.<init> Initiating client connection, connectString=127.0.0.1:18314 sessionTimeout=60000 watcher=org.apache.solr.common.cloud.ConnectionManager@7a1c53a3
[junit4:junit4]   2> 8621 T1932 oascc.ConnectionManager.waitForConnected Waiting for client to connect to ZooKeeper
[junit4:junit4]   2> 8621 T1985 oaz.ClientCnxn$SendThread.logStartConnect Opening socket connection to server localhost/127.0.0.1:18314. Will not attempt to authenticate using SASL (access denied ("javax.security.auth.AuthPermission" "getLoginConfiguration"))
[junit4:junit4]   2> 8622 T1985 oaz.ClientCnxn$SendThread.primeConnection Socket connection established to localhost/127.0.0.1:18314, initiating session
[junit4:junit4]   2> 8622 T1934 oazs.NIOServerCnxnFactory.run Accepted socket connection from /140.211.11.196:18336
[junit4:junit4]   2> 8623 T1934 oazs.ZooKeeperServer.processConnectRequest Client attempting to establish new session at /140.211.11.196:18336
[junit4:junit4]   2> 8625 T1936 oazs.ZooKeeperServer.finishSessionInit Established session 0x13c978df2140007 with negotiated timeout 20000 for client /140.211.11.196:18336
[junit4:junit4]   2> 8625 T1985 oaz.ClientCnxn$SendThread.onConnected Session establishment complete on server localhost/127.0.0.1:18314, sessionid = 0x13c978df2140007, negotiated timeout = 20000
[junit4:junit4]   2> 8625 T1986 oascc.ConnectionManager.process Watcher org.apache.solr.common.cloud.ConnectionManager@7a1c53a3 name:ZooKeeperConnection Watcher:127.0.0.1:18314 got event WatchedEvent state:SyncConnected type:None path:null path:null type:None
[junit4:junit4]   2> 8625 T1932 oascc.ConnectionManager.waitForConnected Client is connected to ZooKeeper
[junit4:junit4]   2> 8627 T1937 oazs.PrepRequestProcessor.pRequest2Txn Processed session termination for sessionid: 0x13c978df2140007
[junit4:junit4]   2> 8638 T1986 oaz.ClientCnxn$EventThread.run EventThread shut down
[junit4:junit4]   2> 8638 T1934 oazs.NIOServerCnxn.closeSock Closed socket connection for client /140.211.11.196:18336 which had sessionid 0x13c978df2140007
[junit4:junit4]   2> 8638 T1932 oaz.ZooKeeper.close Session: 0x13c978df2140007 closed
[junit4:junit4]   2> 8639 T1932 oascsi.HttpClientUtil.createClient Creating new http client, config:maxConnections=500&maxConnectionsPerHost=16&socketTimeout=60000&connTimeout=15000
[junit4:junit4]   2> 8649 T1932 oaz.ZooKeeper.<init> Initiating client connection, connectString=127.0.0.1:18314/solr sessionTimeout=30000 watcher=org.apache.solr.common.cloud.ConnectionManager@b0e72ae
[junit4:junit4]   2> 8650 T1932 oascc.ConnectionManager.waitForConnected Waiting for client to connect to ZooKeeper
[junit4:junit4]   2> 8651 T1987 oaz.ClientCnxn$SendThread.logStartConnect Opening socket connection to server localhost/127.0.0.1:18314. Will not attempt to authenticate using SASL (access denied ("javax.security.auth.AuthPermission" "getLoginConfiguration"))
[junit4:junit4]   2> 8651 T1987 oaz.ClientCnxn$SendThread.primeConnection Socket connection established to localhost/127.0.0.1:18314, initiating session
[junit4:junit4]   2> 8652 T1934 oazs.NIOServerCnxnFactory.run Accepted socket connection from /140.211.11.196:18337
[junit4:junit4]   2> 8652 T1934 oazs.ZooKeeperServer.processConnectRequest Client attempting to establish new session at /140.211.11.196:18337
[junit4:junit4]   2> 8653 T1936 oazs.ZooKeeperServer.finishSessionInit Established session 0x13c978df2140008 with negotiated timeout 20000 for client /140.211.11.196:18337
[junit4:junit4]   2> 8654 T1987 oaz.ClientCnxn$SendThread.onConnected Session establishment complete on server localhost/127.0.0.1:18314, sessionid = 0x13c978df2140008, negotiated timeout = 20000
[junit4:junit4]   2> 8654 T1988 oascc.ConnectionManager.process Watcher org.apache.solr.common.cloud.ConnectionManager@b0e72ae name:ZooKeeperConnection Watcher:127.0.0.1:18314/solr got event WatchedEvent state:SyncConnected type:None path:null path:null type:None
[junit4:junit4]   2> 8654 T1932 oascc.ConnectionManager.waitForConnected Client is connected to ZooKeeper
[junit4:junit4]   2> 8655 T1937 oazs.PrepRequestProcessor.pRequest Got user-level KeeperException when processing sessionid:0x13c978df2140008 type:create cxid:0x1 zxid:0x6d txntype:-1 reqpath:n/a Error Path:/solr/overseer Error:KeeperErrorCode = NodeExists for /solr/overseer
[junit4:junit4]   2> 8657 T1937 oazs.PrepRequestProcessor.pRequest Got user-level KeeperException when processing sessionid:0x13c978df2140008 type:create cxid:0x2 zxid:0x6e txntype:-1 reqpath:n/a Error Path:/solr/overseer Error:KeeperErrorCode = NodeExists for /solr/overseer
[junit4:junit4]   2> 8664 T1932 oasc.ZkController.createEphemeralLiveNode Register node as live in ZooKeeper:/live_nodes/127.0.0.1:18335_r_ziz%2Fa
[junit4:junit4]   2> 8665 T1937 oazs.PrepRequestProcessor.pRequest Got user-level KeeperException when processing sessionid:0x13c978df2140008 type:delete cxid:0x4 zxid:0x6f txntype:-1 reqpath:n/a Error Path:/solr/live_nodes/127.0.0.1:18335_r_ziz%2Fa Error:KeeperErrorCode = NoNode for /solr/live_nodes/127.0.0.1:18335_r_ziz%2Fa
[junit4:junit4]   2> 8666 T1932 oascc.SolrZkClient.makePath makePath: /live_nodes/127.0.0.1:18335_r_ziz%2Fa
[junit4:junit4]   2> 8669 T1954 oascc.ZkStateReader$3.process Updating live nodes... (3)
[junit4:junit4]   2> 8669 T1973 oascc.ZkStateReader$3.process Updating live nodes... (3)
[junit4:junit4]   2> 8669 T1954 oascc.ZkStateReader$2.process A cluster state change: WatchedEvent state:SyncConnected type:NodeChildrenChanged path:/live_nodes, has occurred - updating... (live nodes size: 3)
[junit4:junit4]   2> 8669 T1973 oascc.ZkStateReader$2.process A cluster state change: WatchedEvent state:SyncConnected type:NodeChildrenChanged path:/live_nodes, has occurred - updating... (live nodes size: 3)
[junit4:junit4]   2> 8669 T1960 oascc.ZkStateReader$3.process Updating live nodes... (3)
[junit4:junit4]   2> 8670 T1960 oascc.ZkStateReader$2.process A cluster state change: WatchedEvent state:SyncConnected type:NodeChildrenChanged path:/live_nodes, has occurred - updating... (live nodes size: 3)
[junit4:junit4]   2> 8677 T1932 oascc.ZkStateReader.createClusterStateWatchersAndUpdate Updating cluster state from ZooKeeper... 
[junit4:junit4]   2> 8685 T1989 oasc.CoreContainer.create Creating SolrCore 'collection1' using instanceDir: /usr/home/hudson/hudson-slave/workspace/Lucene-Solr-Tests-trunk-java7/solr/build/solr-core/test/J0/./org.apache.solr.cloud.SyncSliceTest-jetty2-1359752336029/collection1
[junit4:junit4]   2> 8685 T1989 oasc.ZkController.createCollectionZkNode Check for collection zkNode:collection1
[junit4:junit4]   2> 8686 T1989 oasc.ZkController.createCollectionZkNode Collection zkNode exists
[junit4:junit4]   2> 8686 T1989 oasc.ZkController.readConfigName Load collection config from:/collections/collection1
[junit4:junit4]   2> 8687 T1989 oasc.SolrResourceLoader.<init> new SolrResourceLoader for directory: '/usr/home/hudson/hudson-slave/workspace/Lucene-Solr-Tests-trunk-java7/solr/build/solr-core/test/J0/./org.apache.solr.cloud.SyncSliceTest-jetty2-1359752336029/collection1/'
[junit4:junit4]   2> 8688 T1989 oasc.SolrResourceLoader.replaceClassLoader Adding 'file:/usr/home/hudson/hudson-slave/workspace/Lucene-Solr-Tests-trunk-java7/solr/build/solr-core/test/J0/org.apache.solr.cloud.SyncSliceTest-jetty2-1359752336029/collection1/lib/README' to classloader
[junit4:junit4]   2> 8689 T1989 oasc.SolrResourceLoader.replaceClassLoader Adding 'file:/usr/home/hudson/hudson-slave/workspace/Lucene-Solr-Tests-trunk-java7/solr/build/solr-core/test/J0/org.apache.solr.cloud.SyncSliceTest-jetty2-1359752336029/collection1/lib/classes/' to classloader
[junit4:junit4]   2> 8741 T1989 oasc.SolrConfig.<init> Using Lucene MatchVersion: LUCENE_50
[junit4:junit4]   2> 8817 T1989 oasc.SolrConfig.<init> Loaded SolrConfig: solrconfig.xml
[junit4:junit4]   2> 8918 T1989 oass.IndexSchema.readSchema Reading Solr Schema
[junit4:junit4]   2> 8924 T1989 oass.IndexSchema.readSchema Schema name=test
[junit4:junit4]   2> 9543 T1989 oass.OpenExchangeRatesOrgProvider.init Initialized with rates=open-exchange-rates.json, refreshInterval=1440.
[junit4:junit4]   2> 9556 T1989 oass.IndexSchema.readSchema default search field in schema is text
[junit4:junit4]   2> 9560 T1989 oass.IndexSchema.readSchema unique key field: id
[junit4:junit4]   2> 9574 T1989 oass.FileExchangeRateProvider.reload Reloading exchange rates from file currency.xml
[junit4:junit4]   2> 9579 T1989 oass.FileExchangeRateProvider.reload Reloading exchange rates from file currency.xml
[junit4:junit4]   2> 9583 T1989 oass.OpenExchangeRatesOrgProvider.reload Reloading exchange rates from open-exchange-rates.json
[junit4:junit4]   2> 9585 T1989 oass.OpenExchangeRatesOrgProvider.reload Reloading exchange rates from open-exchange-rates.json
[junit4:junit4]   2> 9586 T1989 oasc.SolrCore.<init> [collection1] Opening new SolrCore at /usr/home/hudson/hudson-slave/workspace/Lucene-Solr-Tests-trunk-java7/solr/build/solr-core/test/J0/./org.apache.solr.cloud.SyncSliceTest-jetty2-1359752336029/collection1/, dataDir=./org.apache.solr.cloud.SyncSliceTest-1359752327693/jetty2/
[junit4:junit4]   2> 9586 T1989 oasc.JmxMonitoredMap.<init> JMX monitoring is enabled. Adding Solr mbeans to JMX Server: com.sun.jmx.mbeanserver.JmxMBeanServer@6b8099d3
[junit4:junit4]   2> 9587 T1989 oasc.SolrCore.initDirectoryFactory solr.StandardDirectoryFactory
[junit4:junit4]   2> 9587 T1989 oasc.CachingDirectoryFactory.get return new directory for /usr/home/hudson/hudson-slave/workspace/Lucene-Solr-Tests-trunk-java7/solr/build/solr-core/test/J0/./org.apache.solr.cloud.SyncSliceTest-1359752327693/jetty2 forceNew:false
[junit4:junit4]   2> 9588 T1989 oasc.CachingDirectoryFactory.close Releasing directory:/usr/home/hudson/hudson-slave/workspace/Lucene-Solr-Tests-trunk-java7/solr/build/solr-core/test/J0/./org.apache.solr.cloud.SyncSliceTest-1359752327693/jetty2
[junit4:junit4]   2> 9589 T1989 oasc.SolrCore.getNewIndexDir New index directory detected: old=null new=./org.apache.solr.cloud.SyncSliceTest-1359752327693/jetty2/index/
[junit4:junit4]   2> 9589 T1989 oasc.SolrCore.initIndex WARNING [collection1] Solr index directory './org.apache.solr.cloud.SyncSliceTest-1359752327693/jetty2/index' doesn't exist. Creating new index...
[junit4:junit4]   2> 9590 T1989 oasc.CachingDirectoryFactory.get return new directory for /usr/home/hudson/hudson-slave/workspace/Lucene-Solr-Tests-trunk-java7/solr/build/solr-core/test/J0/./org.apache.solr.cloud.SyncSliceTest-1359752327693/jetty2/index forceNew:false
[junit4:junit4]   2> 9595 T1989 oasc.SolrDeletionPolicy.onCommit SolrDeletionPolicy.onCommit: commits:num=1
[junit4:junit4]   2> 		commit{dir=RateLimitedDirectoryWrapper(org.apache.lucene.store.NIOFSDirectory@/usr/home/hudson/hudson-slave/workspace/Lucene-Solr-Tests-trunk-java7/solr/build/solr-core/test/J0/org.apache.solr.cloud.SyncSliceTest-1359752327693/jetty2/index lockFactory=org.apache.lucene.store.NativeFSLockFactory@1fcb41b),segFN=segments_1,generation=1,filenames=[segments_1]
[junit4:junit4]   2> 9596 T1989 oasc.SolrDeletionPolicy.updateCommits newest commit = 1[segments_1]
[junit4:junit4]   2> 9596 T1989 oasc.CachingDirectoryFactory.close Releasing directory:/usr/home/hudson/hudson-slave/workspace/Lucene-Solr-Tests-trunk-java7/solr/build/solr-core/test/J0/./org.apache.solr.cloud.SyncSliceTest-1359752327693/jetty2/index
[junit4:junit4]   2> 9597 T1989 oasc.SolrCore.initWriters created xml: solr.XMLResponseWriter
[junit4:junit4]   2> 9599 T1989 oasup.UpdateRequestProcessorChain.init inserting DistributedUpdateProcessorFactory into updateRequestProcessorChain "dedupe"
[junit4:junit4]   2> 9599 T1989 oasup.UpdateRequestProcessorChain.init inserting DistributedUpdateProcessorFactory into updateRequestProcessorChain "dedupe-allfields"
[junit4:junit4]   2> 9599 T1989 oasup.UpdateRequestProcessorChain.init inserting DistributedUpdateProcessorFactory into updateRequestProcessorChain "stored_sig"
[junit4:junit4]   2> 9600 T1989 oasup.UpdateRequestProcessorChain.init inserting DistributedUpdateProcessorFactory into updateRequestProcessorChain "uniq-fields"
[junit4:junit4]   2> 9600 T1989 oasup.UpdateRequestProcessorChain.init inserting DistributedUpdateProcessorFactory into updateRequestProcessorChain "distrib-dup-test-chain-implicit"
[junit4:junit4]   2> 9600 T1989 oasc.RequestHandlers.initHandlersFromConfig adding lazy requestHandler: solr.ReplicationHandler
[junit4:junit4]   2> 9601 T1989 oasc.RequestHandlers.initHandlersFromConfig created /replication: solr.ReplicationHandler
[junit4:junit4]   2> 9601 T1989 oasc.RequestHandlers.initHandlersFromConfig created standard: solr.StandardRequestHandler
[junit4:junit4]   2> 9602 T1989 oasc.RequestHandlers.initHandlersFromConfig created /get: solr.RealTimeGetHandler
[junit4:junit4]   2> 9602 T1989 oasc.RequestHandlers.initHandlersFromConfig created dismax: solr.SearchHandler
[junit4:junit4]   2> 9603 T1989 oasc.RequestHandlers.initHandlersFromConfig created mock: org.apache.solr.core.MockQuerySenderListenerReqHandler
[junit4:junit4]   2> 9604 T1989 oasc.RequestHandlers.initHandlersFromConfig created /admin/: org.apache.solr.handler.admin.AdminHandlers
[junit4:junit4]   2> 9604 T1989 oasc.RequestHandlers.initHandlersFromConfig created defaults: solr.StandardRequestHandler
[junit4:junit4]   2> 9604 T1989 oasc.RequestHandlers.initHandlersFromConfig adding lazy requestHandler: solr.StandardRequestHandler
[junit4:junit4]   2> 9605 T1989 oasc.RequestHandlers.initHandlersFromConfig created lazy: solr.StandardRequestHandler
[junit4:junit4]   2> 9605 T1989 oasc.RequestHandlers.initHandlersFromConfig created /update: solr.UpdateRequestHandler
[junit4:junit4]   2> 9606 T1989 oasc.RequestHandlers.initHandlersFromConfig created /terms: org.apache.solr.handler.component.SearchHandler
[junit4:junit4]   2> 9606 T1989 oasc.RequestHandlers.initHandlersFromConfig created spellCheckCompRH: org.apache.solr.handler.component.SearchHandler
[junit4:junit4]   2> 9607 T1989 oasc.RequestHandlers.initHandlersFromConfig created spellCheckCompRH_Direct: org.apache.solr.handler.component.SearchHandler
[junit4:junit4]   2> 9607 T1989 oasc.RequestHandlers.initHandlersFromConfig created spellCheckWithWordbreak: org.apache.solr.handler.component.SearchHandler
[junit4:junit4]   2> 9608 T1989 oasc.RequestHandlers.initHandlersFromConfig created spellCheckWithWordbreak_Direct: org.apache.solr.handler.component.SearchHandler
[junit4:junit4]   2> 9608 T1989 oasc.RequestHandlers.initHandlersFromConfig created spellCheckCompRH1: org.apache.solr.handler.component.SearchHandler
[junit4:junit4]   2> 9609 T1989 oasc.RequestHandlers.initHandlersFromConfig created mltrh: org.apache.solr.handler.component.SearchHandler
[junit4:junit4]   2> 9609 T1989 oasc.RequestHandlers.initHandlersFromConfig created tvrh: org.apache.solr.handler.component.SearchHandler
[junit4:junit4]   2> 9610 T1989 oasc.RequestHandlers.initHandlersFromConfig created /mlt: solr.MoreLikeThisHandler
[junit4:junit4]   2> 9610 T1989 oasc.RequestHandlers.initHandlersFromConfig created /debug/dump: solr.DumpRequestHandler
[junit4:junit4]   2> 9622 T1989 oashl.XMLLoader.init xsltCacheLifetimeSeconds=60
[junit4:junit4]   2> 9626 T1989 oasc.SolrCore.initDeprecatedSupport WARNING solrconfig.xml uses deprecated <admin/gettableFiles>, Please update your config to use the ShowFileRequestHandler.
[junit4:junit4]   2> 9627 T1989 oasc.SolrCore.initDeprecatedSupport WARNING adding ShowFileRequestHandler with hidden files: [SCHEMA.XML, OLD_SYNONYMS.TXT, STOPWORDS.TXT, PROTWORDS.TXT, OPEN-EXCHANGE-RATES.JSON, SYNONYMS.TXT, CURRENCY.XML, MAPPING-ISOLATIN1ACCENT.TXT]
[junit4:junit4]   2> 9630 T1989 oasc.CachingDirectoryFactory.close Releasing directory:/usr/home/hudson/hudson-slave/workspace/Lucene-Solr-Tests-trunk-java7/solr/build/solr-core/test/J0/./org.apache.solr.cloud.SyncSliceTest-1359752327693/jetty2
[junit4:junit4]   2> 9631 T1989 oass.SolrIndexSearcher.<init> Opening Searcher@6d56aab2 main
[junit4:junit4]   2> 9632 T1989 oasu.CommitTracker.<init> Hard AutoCommit: disabled
[junit4:junit4]   2> 9632 T1989 oasu.CommitTracker.<init> Soft AutoCommit: disabled
[junit4:junit4]   2> 9633 T1989 oashc.SpellCheckComponent.inform Initializing spell checkers
[junit4:junit4]   2> 9639 T1989 oass.DirectSolrSpellChecker.init init: {name=direct,classname=DirectSolrSpellChecker,field=lowerfilt,minQueryLength=3}
[junit4:junit4]   2> 9693 T1990 oasc.SolrCore.registerSearcher [collection1] Registered new searcher Searcher@6d56aab2 main{StandardDirectoryReader(segments_1:1)}
[junit4:junit4]   2> 9698 T1989 oasc.ZkController.publish publishing core=collection1 state=down
[junit4:junit4]   2> 9698 T1989 oasc.ZkController.publish numShards not found on descriptor - reading it from system property
[junit4:junit4]   2> 9818 T1955 oascc.ZkStateReader.updateClusterState Updating cloud state from ZooKeeper... 
[junit4:junit4]   2> 9819 T1955 oasc.Overseer$ClusterStateUpdater.updateState Update state numShards=1 message={
[junit4:junit4]   2> 	  "operation":"state",
[junit4:junit4]   2> 	  "numShards":"1",
[junit4:junit4]   2> 	  "shard":"shard1",
[junit4:junit4]   2> 	  "roles":null,
[junit4:junit4]   2> 	  "state":"active",
[junit4:junit4]   2> 	  "core":"collection1",
[junit4:junit4]   2> 	  "collection":"collection1",
[junit4:junit4]   2> 	  "node_name":"127.0.0.1:18328_r_ziz%2Fa",
[junit4:junit4]   2> 	  "base_url":"http://127.0.0.1:18328/r_ziz/a"}
[junit4:junit4]   2> 9823 T1955 oasc.Overseer$ClusterStateUpdater.updateState Update state numShards=1 message={
[junit4:junit4]   2> 	  "operation":"state",
[junit4:junit4]   2> 	  "numShards":"1",
[junit4:junit4]   2> 	  "shard":null,
[junit4:junit4]   2> 	  "roles":null,
[junit4:junit4]   2> 	  "state":"down",
[junit4:junit4]   2> 	  "core":"collection1",
[junit4:junit4]   2> 	  "collection":"collection1",
[junit4:junit4]   2> 	  "node_name":"127.0.0.1:18335_r_ziz%2Fa",
[junit4:junit4]   2> 	  "base_url":"http://127.0.0.1:18335/r_ziz/a"}
[junit4:junit4]   2> 9823 T1955 oasc.Overseer$ClusterStateUpdater.updateState Collection already exists with numShards=1
[junit4:junit4]   2> 9824 T1955 oasc.Overseer$ClusterStateUpdater.updateState Assigning new node to shard shard=shard1
[junit4:junit4]   2> 9836 T1954 oascc.ZkStateReader$2.process A cluster state change: WatchedEvent state:SyncConnected type:NodeDataChanged path:/clusterstate.json, has occurred - updating... (live nodes size: 3)
[junit4:junit4]   2> 9836 T1973 oascc.ZkStateReader$2.process A cluster state change: WatchedEvent state:SyncConnected type:NodeDataChanged path:/clusterstate.json, has occurred - updating... (live nodes size: 3)
[junit4:junit4]   2> 9836 T1960 oascc.ZkStateReader$2.process A cluster state change: WatchedEvent state:SyncConnected type:NodeDataChanged path:/clusterstate.json, has occurred - updating... (live nodes size: 3)
[junit4:junit4]   2> 9836 T1988 oascc.ZkStateReader$2.process A cluster state change: WatchedEvent state:SyncConnected type:NodeDataChanged path:/clusterstate.json, has occurred - updating... (live nodes size: 3)
[junit4:junit4]   2> 10701 T1989 oasc.CoreContainer.registerCore registering core: collection1
[junit4:junit4]   2> 10701 T1989 oasc.ZkController.register Register replica - core:collection1 address:http://127.0.0.1:18335/r_ziz/a collection:collection1 shard:shard1
[junit4:junit4]   2> 10705 T1989 oasc.ZkController.register We are http://127.0.0.1:18335/r_ziz/a/collection1/ and leader is http://127.0.0.1:18328/r_ziz/a/collection1/
[junit4:junit4]   2> 10705 T1989 oasc.ZkController.register No LogReplay needed for core=collection1 baseURL=http://127.0.0.1:18335/r_ziz/a
[junit4:junit4]   2> 10705 T1989 oasc.ZkController.checkRecovery Core needs to recover:collection1
[junit4:junit4]   2> 10705 T1989 oasu.DefaultSolrCoreState.doRecovery Running recovery - first canceling any ongoing recovery
[junit4:junit4]   2> ASYNC  NEW_CORE C149 name=collection1 org.apache.solr.core.SolrCore@10a2c2f4 url=http://127.0.0.1:18335/r_ziz/a/collection1 node=127.0.0.1:18335_r_ziz%2Fa C149_STATE=coll:collection1 core:collection1 props:{shard=null, roles=null, state=down, core=collection1, collection=collection1, node_name=127.0.0.1:18335_r_ziz%2Fa, base_url=http://127.0.0.1:18335/r_ziz/a}
[junit4:junit4]   2> 10706 T1991 C149 P18335 oasc.RecoveryStrategy.run Starting recovery process.  core=collection1 recoveringAfterStartup=true
[junit4:junit4]   2> 10706 T1989 oascc.ZkStateReader.updateClusterState Updating cloud state from ZooKeeper... 
[junit4:junit4]   2> 10707 T1991 C149 P18335 oasc.RecoveryStrategy.doRecovery ###### startupVersions=[]
[junit4:junit4]   2> 10707 T1991 C149 P18335 oasc.ZkController.publish publishing core=collection1 state=recovering
[junit4:junit4]   2> 10707 T1991 C149 P18335 oasc.ZkController.publish numShards not found on descriptor - reading it from system property
[junit4:junit4]   2> 10708 T1932 oass.SolrDispatchFilter.init user.dir=/usr/home/hudson/hudson-slave/workspace/Lucene-Solr-Tests-trunk-java7/solr/build/solr-core/test/J0
[junit4:junit4]   2> 10709 T1991 C149 P18335 oascsi.HttpClientUtil.createClient Creating new http client, config:maxConnections=128&maxConnectionsPerHost=32&followRedirects=false
[junit4:junit4]   2> 10709 T1932 oass.SolrDispatchFilter.init SolrDispatchFilter.init() done
[junit4:junit4]   2> 10709 T1932 oascsi.HttpClientUtil.createClient Creating new http client, config:maxConnections=128&maxConnectionsPerHost=32&followRedirects=false
[junit4:junit4]   2> 10954 T1932 oejs.Server.doStart jetty-8.1.8.v20121106
[junit4:junit4]   2> 10967 T1932 oejs.AbstractConnector.doStart Started SocketConnector@127.0.0.1:18352
[junit4:junit4]   2> 10968 T1932 oass.SolrDispatchFilter.init SolrDispatchFilter.init()
[junit4:junit4]   2> 10969 T1932 oasc.SolrResourceLoader.locateSolrHome JNDI not configured for solr (NoInitialContextEx)
[junit4:junit4]   2> 10969 T1932 oasc.SolrResourceLoader.locateSolrHome using system property solr.solr.home: /usr/home/hudson/hudson-slave/workspace/Lucene-Solr-Tests-trunk-java7/solr/build/solr-core/test/J0/./org.apache.solr.cloud.SyncSliceTest-jetty3-1359752338422
[junit4:junit4]   2> 10970 T1932 oasc.CoreContainer$Initializer.initialize looking for solr.xml: /usr/home/hudson/hudson-slave/workspace/Lucene-Solr-Tests-trunk-java7/solr/build/solr-core/test/J0/./org.apache.solr.cloud.SyncSliceTest-jetty3-1359752338422/solr.xml
[junit4:junit4]   2> 10970 T1932 oasc.CoreContainer.<init> New CoreContainer 832778518
[junit4:junit4]   2> 10971 T1932 oasc.CoreContainer.load Loading CoreContainer using Solr Home: '/usr/home/hudson/hudson-slave/workspace/Lucene-Solr-Tests-trunk-java7/solr/build/solr-core/test/J0/./org.apache.solr.cloud.SyncSliceTest-jetty3-1359752338422/'
[junit4:junit4]   2> 10972 T1932 oasc.SolrResourceLoader.<init> new SolrResourceLoader for directory: '/usr/home/hudson/hudson-slave/workspace/Lucene-Solr-Tests-trunk-java7/solr/build/solr-core/test/J0/./org.apache.solr.cloud.SyncSliceTest-jetty3-1359752338422/'
[junit4:junit4]   2> 11080 T1932 oashc.HttpShardHandlerFactory.getParameter Setting socketTimeout to: 60000
[junit4:junit4]   2> 11081 T1932 oashc.HttpShardHandlerFactory.getParameter Setting urlScheme to: http://
[junit4:junit4]   2> 11082 T1932 oashc.HttpShardHandlerFactory.getParameter Setting connTimeout to: 15000
[junit4:junit4]   2> 11083 T1932 oashc.HttpShardHandlerFactory.getParameter Setting maxConnectionsPerHost to: 20
[junit4:junit4]   2> 11083 T1932 oashc.HttpShardHandlerFactory.getParameter Setting corePoolSize to: 0
[junit4:junit4]   2> 11084 T1932 oashc.HttpShardHandlerFactory.getParameter Setting maximumPoolSize to: 2147483647
[junit4:junit4]   2> 11085 T1932 oashc.HttpShardHandlerFactory.getParameter Setting maxThreadIdleTime to: 5
[junit4:junit4]   2> 11085 T1932 oashc.HttpShardHandlerFactory.getParameter Setting sizeOfQueue to: -1
[junit4:junit4]   2> 11086 T1932 oashc.HttpShardHandlerFactory.getParameter Setting fairnessPolicy to: false
[junit4:junit4]   2> 11087 T1932 oascsi.HttpClientUtil.createClient Creating new http client, config:maxConnectionsPerHost=20&maxConnections=10000&socketTimeout=60000&connTimeout=15000&retry=false
[junit4:junit4]   2> 11126 T1932 oasc.CoreContainer.load Registering Log Listener
[junit4:junit4]   2> 11157 T1932 oasc.CoreContainer.initZooKeeper Zookeeper client=127.0.0.1:18314/solr
[junit4:junit4]   2> 11158 T1932 oasc.ZkController.checkChrootPath zkHost includes chroot
[junit4:junit4]   2> 11158 T1932 oaz.ZooKeeper.<init> Initiating client connection, connectString=127.0.0.1:18314 sessionTimeout=60000 watcher=org.apache.solr.common.cloud.ConnectionManager@d56aafa
[junit4:junit4]   2> 11159 T1932 oascc.ConnectionManager.waitForConnected Waiting for client to connect to ZooKeeper
[junit4:junit4]   2> 11160 T2001 oaz.ClientCnxn$SendThread.logStartConnect Opening socket connection to server localhost/127.0.0.1:18314. Will not attempt to authenticate using SASL (access denied ("javax.security.auth.AuthPermission" "getLoginConfiguration"))
[junit4:junit4]   2> 11161 T2001 oaz.ClientCnxn$SendThread.primeConnection Socket connection established to localhost/127.0.0.1:18314, initiating session
[junit4:junit4]   2> 11161 T1934 oazs.NIOServerCnxnFactory.run Accepted socket connection from /140.211.11.196:18353
[junit4:junit4]   2> 11162 T1934 oazs.ZooKeeperServer.processConnectRequest Client attempting to establish new session at /140.211.11.196:18353
[junit4:junit4]   2> 11164 T1936 oazs.ZooKeeperServer.finishSessionInit Established session 0x13c978df2140009 with negotiated timeout 20000 for client /140.211.11.196:18353
[junit4:junit4]   2> 11164 T2001 oaz.ClientCnxn$SendThread.onConnected Session establishment complete on server localhost/127.0.0.1:18314, sessionid = 0x13c978df2140009, negotiated timeout = 20000
[junit4:junit4]   2> 11164 T2002 oascc.ConnectionManager.process Watcher org.apache.solr.common.cloud.ConnectionManager@d56aafa name:ZooKeeperConnection Watcher:127.0.0.1:18314 got event WatchedEvent state:SyncConnected type:None path:null path:null type:None
[junit4:junit4]   2> 11165 T1932 oascc.ConnectionManager.waitForConnected Client is connected to ZooKeeper
[junit4:junit4]   2> 11166 T1937 oazs.PrepRequestProcessor.pRequest2Txn Processed session termination for sessionid: 0x13c978df2140009
[junit4:junit4]   2> 11167 T2002 oaz.ClientCnxn$EventThread.run EventThread shut down
[junit4:junit4]   2> 11167 T1934 oazs.NIOServerCnxn.closeSock Closed socket connection for client /140.211.11.196:18353 which had sessionid 0x13c978df2140009
[junit4:junit4]   2> 11167 T1932 oaz.ZooKeeper.close Session: 0x13c978df2140009 closed
[junit4:junit4]   2> 11168 T1932 oascsi.HttpClientUtil.createClient Creating new http client, config:maxConnections=500&maxConnectionsPerHost=16&socketTimeout=60000&connTimeout=15000
[junit4:junit4]   2> 11181 T1932 oaz.ZooKeeper.<init> Initiating client connection, connectString=127.0.0.1:18314/solr sessionTimeout=30000 watcher=org.apache.solr.common.cloud.ConnectionManager@f528d36
[junit4:junit4]   2> 11182 T1932 oascc.ConnectionManager.waitForConnected Waiting for client to connect to ZooKeeper
[junit4:junit4]   2> 11182 T2003 oaz.ClientCnxn$SendThread.logStartConnect Opening socket connection to server localhost/127.0.0.1:18314. Will not attempt to authenticate using SASL (access denied ("javax.security.auth.AuthPermission" "getLoginConfiguration"))
[junit4:junit4]   2> 11183 T2003 oaz.ClientCnxn$SendThread.primeConnection Socket connection established to localhost/127.0.0.1:18314, initiating session
[junit4:junit4]   2> 11183 T1934 oazs.NIOServerCnxnFactory.run Accepted socket connection from /140.211.11.196:18354
[junit4:junit4]   2> 11183 T1934 oazs.ZooKeeperServer.processConnectRequest Client attempting to establish new session at /140.211.11.196:18354
[junit4:junit4]   2> 11186 T1936 oazs.ZooKeeperServer.finishSessionInit Established session 0x13c978df214000a with negotiated timeout 20000 for client /140.211.11.196:18354
[junit4:junit4]   2> 11186 T2003 oaz.ClientCnxn$SendThread.onConnected Session establishment complete on server localhost/127.0.0.1:18314, sessionid = 0x13c978df214000a, negotiated timeout = 20000
[junit4:junit4]   2> 11187 T2004 oascc.ConnectionManager.process Watcher org.apache.solr.common.cloud.ConnectionManager@f528d36 name:ZooKeeperConnection Watcher:127.0.0.1:18314/solr got event WatchedEvent state:SyncConnected type:None path:null path:null type:None
[junit4:junit4]   2> 11187 T1932 oascc.ConnectionManager.waitForConnected Client is connected to ZooKeeper
[junit4:junit4]   2> 11189 T1937 oazs.PrepRequestProcessor.pRequest Got user-level KeeperException when processing sessionid:0x13c978df214000a type:create cxid:0x1 zxid:0x7f txntype:-1 reqpath:n/a Error Path:/solr/overseer Error:KeeperErrorCode = NodeExists for /solr/overseer
[junit4:junit4]   2> 11190 T1937 oazs.PrepRequestProcessor.pRequest Got user-level KeeperException when processing sessionid:0x13c978df214000a type:create cxid:0x2 zxid:0x80 txntype:-1 reqpath:n/a Error Path:/solr/overseer Error:KeeperErrorCode = NodeExists for /solr/overseer
[junit4:junit4]   2> 11192 T1932 oasc.ZkController.createEphemeralLiveNode Register node as live in ZooKeeper:/live_nodes/127.0.0.1:18352_r_ziz%2Fa
[junit4:junit4]   2> 11193 T1937 oazs.PrepRequestProcessor.pRequest Got user-level KeeperException when processing sessionid:0x13c978df214000a type:delete cxid:0x4 zxid:0x81 txntype:-1 reqpath:n/a Error Path:/solr/live_nodes/127.0.0.1:18352_r_ziz%2Fa Error:KeeperErrorCode = NoNode for /solr/live_nodes/127.0.0.1:18352_r_ziz%2Fa
[junit4:junit4]   2> 11200 T1932 oascc.SolrZkClient.makePath makePath: /live_nodes/127.0.0.1:18352_r_ziz%2Fa
[junit4:junit4]   2> 11203 T1988 oascc.ZkStateReader$3.process Updating live nodes... (4)
[junit4:junit4]   2> 11204 T1960 oascc.ZkStateReader$3.process Updating live nodes... (4)
[junit4:junit4]   2> 11204 T1988 oascc.ZkStateReader$2.process A cluster state change: WatchedEvent state:SyncConnected type:NodeChildrenChanged path:/live_nodes, has occurred - updating... (live nodes size: 4)
[junit4:junit4]   2> 11204 T1954 oascc.ZkStateReader$3.process Updating live nodes... (4)
[junit4:junit4]   2> 11204 T1960 oascc.ZkStateReader$2.process A cluster state change: WatchedEvent state:SyncConnected type:NodeChildrenChanged path:/live_nodes, has occurred - updating... (live nodes size: 4)
[junit4:junit4]   2> 11204 T1973 oascc.ZkStateReader$3.process Updating live nodes... (4)
[junit4:junit4]   2> 11204 T1954 oascc.ZkStateReader$2.process A cluster state change: WatchedEvent state:SyncConnected type:NodeChildrenChanged path:/live_nodes, has occurred - updating... (live nodes size: 4)
[junit4:junit4]   2> 11205 T1973 oascc.ZkStateReader$2.process A cluster state change: WatchedEvent state:SyncConnected type:NodeChildrenChanged path:/live_nodes, has occurred - updating... (live nodes size: 4)
[junit4:junit4]   2> 11208 T1932 oascc.ZkStateReader.createClusterStateWatchersAndUpdate Updating cluster state from ZooKeeper... 
[junit4:junit4]   2> 11219 T2005 oasc.CoreContainer.create Creating SolrCore 'collection1' using instanceDir: /usr/home/hudson/hudson-slave/workspace/Lucene-Solr-Tests-trunk-java7/solr/build/solr-core/test/J0/./org.apache.solr.cloud.SyncSliceTest-jetty3-1359752338422/collection1
[junit4:junit4]   2> 11220 T2005 oasc.ZkController.createCollectionZkNode Check for collection zkNode:collection1
[junit4:junit4]   2> 11220 T2005 oasc.ZkController.createCollectionZkNode Collection zkNode exists
[junit4:junit4]   2> 11221 T2005 oasc.ZkController.readConfigName Load collection config from:/collections/collection1
[junit4:junit4]   2> 11222 T2005 oasc.SolrResourceLoader.<init> new SolrResourceLoader for directory: '/usr/home/hudson/hudson-slave/workspace/Lucene-Solr-Tests-trunk-java7/solr/build/solr-core/test/J0/./org.apache.solr.cloud.SyncSliceTest-jetty3-1359752338422/collection1/'
[junit4:junit4]   2> 11223 T2005 oasc.SolrResourceLoader.replaceClassLoader Adding 'file:/usr/home/hudson/hudson-slave/workspace/Lucene-Solr-Tests-trunk-java7/solr/build/solr-core/test/J0/org.apache.solr.cloud.SyncSliceTest-jetty3-1359752338422/collection1/lib/classes/' to classloader
[junit4:junit4]   2> 11224 T2005 oasc.SolrResourceLoader.replaceClassLoader Adding 'file:/usr/home/hudson/hudson-slave/workspace/Lucene-Solr-Tests-trunk-java7/solr/build/solr-core/test/J0/org.apache.solr.cloud.SyncSliceTest-jetty3-1359752338422/collection1/lib/README' to classloader
[junit4:junit4]   2> 11283 T2005 oasc.SolrConfig.<init> Using Lucene MatchVersion: LUCENE_50
[junit4:junit4]   2> 11349 T1955 oascc.ZkStateReader.updateClusterState Updating cloud state from ZooKeeper... 
[junit4:junit4]   2> 11351 T1955 oasc.Overseer$ClusterStateUpdater.updateState Update state numShards=1 message={
[junit4:junit4]   2> 	  "operation":"state",
[junit4:junit4]   2> 	  "numShards":"1",
[junit4:junit4]   2> 	  "shard":"shard1",
[junit4:junit4]   2> 	  "roles":null,
[junit4:junit4]   2> 	  "state":"recovering",
[junit4:junit4]   2> 	  "core":"collection1",
[junit4:junit4]   2> 	  "collection":"collection1",
[junit4:junit4]   2> 	  "node_name":"127.0.0.1:18335_r_ziz%2Fa",
[junit4:junit4]   2> 	  "base_url":"http://127.0.0.1:18335/r_ziz/a"}
[junit4:junit4]   2> 11360 T2004 oascc.ZkStateReader$2.process A cluster state change: WatchedEvent state:SyncConnected type:NodeDataChanged path:/clusterstate.json, has occurred - updating... (live nodes size: 4)
[junit4:junit4]   2> 11360 T1954 oascc.ZkStateReader$2.process A cluster state change: WatchedEvent state:SyncConnected type:NodeDataChanged path:/clusterstate.json, has occurred - updating... (live nodes size: 4)
[junit4:junit4]   2> 11360 T1960 oascc.ZkStateReader$2.process A cluster state change: WatchedEvent state:SyncConnected type:NodeDataChanged path:/clusterstate.json, has occurred - updating... (live nodes size: 4)
[junit4:junit4]   2> 11360 T1973 oascc.ZkStateReader$2.process A cluster state change: WatchedEvent state:SyncConnected type:NodeDataChanged path:/clusterstate.json, has occurred - updating... (live nodes size: 4)
[junit4:junit4]   2> 11360 T1988 oascc.ZkStateReader$2.process A cluster state change: WatchedEvent state:SyncConnected type:NodeDataChanged path:/clusterstate.json, has occurred - updating... (live nodes size: 4)
[junit4:junit4]   2> 11404 T2005 oasc.SolrConfig.<init> Loaded SolrConfig: solrconfig.xml
[junit4:junit4]   2> 11505 T2005 oass.IndexSchema.readSchema Reading Solr Schema
[junit4:junit4]   2> 11512 T2005 oass.IndexSchema.readSchema Schema name=test
[junit4:junit4]   2> 12128 T2005 oass.OpenExchangeRatesOrgProvider.init Initialized with rates=open-exchange-rates.json, refreshInterval=1440.
[junit4:junit4]   2> 12136 T2005 oass.IndexSchema.readSchema default search field in schema is text
[junit4:junit4]   2> 12139 T2005 oass.IndexSchema.readSchema unique key field: id
[junit4:junit4]   2> 12149 T2005 oass.FileExchangeRateProvider.reload Reloading exchange rates from file currency.xml
[junit4:junit4]   2> 12153 T2005 oass.FileExchangeRateProvider.reload Reloading exchange rates from file currency.xml
[junit4:junit4]   2> 12156 T2005 oass.OpenExchangeRatesOrgProvider.reload Reloading exchange rates from open-exchange-rates.json
[junit4:junit4]   2> 12157 T2005 oass.OpenExchangeRatesOrgProvider.reload Reloading exchange rates from open-exchange-rates.json
[junit4:junit4]   2> 12158 T2005 oasc.SolrCore.<init> [collection1] Opening new SolrCore at /usr/home/hudson/hudson-slave/workspace/Lucene-Solr-Tests-trunk-java7/solr/build/solr-core/test/J0/./org.apache.solr.cloud.SyncSliceTest-jetty3-1359752338422/collection1/, dataDir=./org.apache.solr.cloud.SyncSliceTest-1359752327693/jetty3/
[junit4:junit4]   2> 12158 T2005 oasc.JmxMonitoredMap.<init> JMX monitoring is enabled. Adding Solr mbeans to JMX Server: com.sun.jmx.mbeanserver.JmxMBeanServer@6b8099d3
[junit4:junit4]   2> 12158 T2005 oasc.SolrCore.initDirectoryFactory solr.StandardDirectoryFactory
[junit4:junit4]   2> 12159 T2005 oasc.CachingDirectoryFactory.get return new directory for /usr/home/hudson/hudson-slave/workspace/Lucene-Solr-Tests-trunk-java7/solr/build/solr-core/test/J0/./org.apache.solr.cloud.SyncSliceTest-1359752327693/jetty3 forceNew:false
[junit4:junit4]   2> 12159 T2005 oasc.CachingDirectoryFactory.close Releasing directory:/usr/home/hudson/hudson-slave/workspace/Lucene-Solr-Tests-trunk-java7/solr/build/solr-core/test/J0/./org.apache.solr.cloud.SyncSliceTest-1359752327693/jetty3
[junit4:junit4]   2> 12160 T2005 oasc.SolrCore.getNewIndexDir New index directory detected: old=null new=./org.apache.solr.cloud.SyncSliceTest-1359752327693/jetty3/index/
[junit4:junit4]   2> 12160 T2005 oasc.SolrCore.initIndex WARNING [collection1] Solr index directory './org.apache.solr.cloud.SyncSliceTest-1359752327693/jetty3/index' doesn't exist. Creating new index...
[junit4:junit4]   2> 12161 T2005 oasc.CachingDirectoryFactory.get return new directory for /usr/home/hudson/hudson-slave/workspace/Lucene-Solr-Tests-trunk-java7/solr/build/solr-core/test/J0/./org.apache.solr.cloud.SyncSliceTest-1359752327693/jetty3/index forceNew:false
[junit4:junit4]   2> 12165 T2005 oasc.SolrDeletionPolicy.onCommit SolrDeletionPolicy.onCommit: commits:num=1
[junit4:junit4]   2> 		commit{dir=RateLimitedDirectoryWrapper(org.apache.lucene.store.NIOFSDirectory@/usr/home/hudson/hudson-slave/workspace/Lucene-Solr-Tests-trunk-java7/solr/build/solr-core/test/J0/org.apache.solr.cloud.SyncSliceTest-1359752327693/jetty3/index lockFactory=org.apache.lucene.store.NativeFSLockFactory@6d0428aa),segFN=segments_1,generation=1,filenames=[segments_1]
[junit4:junit4]   2> 12165 T2005 oasc.SolrDeletionPolicy.updateCommits newest commit = 1[segments_1]
[junit4:junit4]   2> 12165 T2005 oasc.CachingDirectoryFactory.close Releasing directory:/usr/home/hudson/hudson-slave/workspace/Lucene-Solr-Tests-trunk-java7/solr/build/solr-core/test/J0/./org.apache.solr.cloud.SyncSliceTest-1359752327693/jetty3/index
[junit4:junit4]   2> 12166 T2005 oasc.SolrCore.initWriters created xml: solr.XMLResponseWriter
[junit4:junit4]   2> 12167 T2005 oasup.UpdateRequestProcessorChain.init inserting DistributedUpdateProcessorFactory into updateRequestProcessorChain "dedupe"
[junit4:junit4]   2> 12167 T2005 oasup.UpdateRequestProcessorChain.init inserting DistributedUpdateProcessorFactory into updateRequestProcessorChain "dedupe-allfields"
[junit4:junit4]   2> 12168 T2005 oasup.UpdateRequestProcessorChain.init inserting DistributedUpdateProcessorFactory into updateRequestProcessorChain "stored_sig"
[junit4:junit4]   2> 12168 T2005 oasup.UpdateRequestProcessorChain.init inserting DistributedUpdateProcessorFactory into updateRequestProcessorChain "uniq-fields"
[junit4:junit4]   2> 12168 T2005 oasup.UpdateRequestProcessorChain.init inserting DistributedUpdateProcessorFactory into updateRequestProcessorChain "distrib-dup-test-chain-implicit"
[junit4:junit4]   2> 12168 T2005 oasc.RequestHandlers.initHandlersFromConfig adding lazy requestHandler: solr.ReplicationHandler
[junit4:junit4]   2> 12169 T2005 oasc.RequestHandlers.initHandlersFromConfig created /replication: solr.ReplicationHandler
[junit4:junit4]   2> 12169 T2005 oasc.RequestHandlers.initHandlersFromConfig created standard: solr.StandardRequestHandler
[junit4:junit4]   2> 12169 T2005 oasc.RequestHandlers.initHandlersFromConfig created /get: solr.RealTimeGetHandler
[junit4:junit4]   2> 12170 T2005 oasc.RequestHandlers.initHandlersFromConfig created dismax: solr.SearchHandler
[junit4:junit4]   2> 12170 T2005 oasc.RequestHandlers.initHandlersFromConfig created mock: org.apache.solr.core.MockQuerySenderListenerReqHandler
[junit4:junit4]   2> 12170 T2005 oasc.RequestHandlers.initHandlersFromConfig created /admin/: org.apache.solr.handler.admin.AdminHandlers
[junit4:junit4]   2> 12171 T2005 oasc.RequestHandlers.initHandlersFromConfig created defaults: solr.StandardRequestHandler
[junit4:junit4]   2> 12171 T2005 oasc.RequestHandlers.initHandlersFromConfig adding lazy requestHandler: solr.StandardRequestHandler
[junit4:junit4]   2> 12171 T2005 oasc.RequestHandlers.initHandlersFromConfig created lazy: solr.StandardRequestHandler
[junit4:junit4]   2> 12172 T2005 oasc.RequestHandlers.initHandlersFromConfig created /update: solr.UpdateRequestHandler
[junit4:junit4]   2> 12172 T2005 oasc.RequestHandlers.initHandlersFromConfig created /terms: org.apache.solr.handler.component.SearchHandler
[junit4:junit4]   2> 12172 T2005 oasc.RequestHandlers.initHandlersFromConfig created spellCheckCompRH: org.apache.solr.handler.component.SearchHandler
[junit4:junit4]   2> 12173 T2005 oasc.RequestHandlers.initHandlersFromConfig created spellCheckCompRH_Direct: org.apache.solr.handler.component.SearchHandler
[junit4:junit4]   2> 12173 T2005 oasc.RequestHandlers.initHandlersFromConfig created spellCheckWithWordbreak: org.apache.solr.handler.component.SearchHandler
[junit4:junit4]   2> 12173 T2005 oasc.RequestHandlers.initHandlersFromConfig created spellCheckWithWordbreak_Direct: org.apache.solr.handler.component.SearchHandler
[junit4:junit4]   2> 12174 T2005 oasc.RequestHandlers.initHandlersFromConfig created spellCheckCompRH1: org.apache.solr.handler.component.SearchHandler
[junit4:junit4]   2> 12174 T2005 oasc.RequestHandlers.initHandlersFromConfig created mltrh: org.apache.solr.handler.component.SearchHandler
[junit4:junit4]   2> 12174 T2005 oasc.RequestHandlers.initHandlersFromConfig created tvrh: org.apache.solr.handler.component.SearchHandler
[junit4:junit4]   2> 12175 T2005 oasc.RequestHandlers.initHandlersFromConfig created /mlt: solr.MoreLikeThisHandler
[junit4:junit4]   2> 12175 T2005 oasc.RequestHandlers.initHandlersFromConfig created /debug/dump: solr.DumpRequestHandler
[junit4:junit4]   2> 12184 T2005 oashl.XMLLoader.init xsltCacheLifetimeSeconds=60
[junit4:junit4]   2> 12187 T2005 oasc.SolrCore.initDeprecatedSupport WARNING solrconfig.xml uses deprecated <admin/gettableFiles>, Please update your config to use the ShowFileRequestHandler.
[junit4:junit4]   2> 12188 T2005 oasc.SolrCore.initDeprecatedSupport WARNING adding ShowFileRequestHandler with hidden files: [SCHEMA.XML, OLD_SYNONYMS.TXT, STOPWORDS.TXT, PROTWORDS.TXT, OPEN-EXCHANGE-RATES.JSON, SYNONYMS.TXT, CURRENCY.XML, MAPPING-ISOLATIN1ACCENT.TXT]
[junit4:junit4]   2> 12189 T2005 oasc.CachingDirectoryFactory.close Releasing directory:/usr/home/hudson/hudson-slave/workspace/Lucene-Solr-Tests-trunk-java7/solr/build/solr-core/test/J0/./org.apache.solr.cloud.SyncSliceTest-1359752327693/jetty3
[junit4:junit4]   2> 12190 T2005 oass.SolrIndexSearcher.<init> Opening Searcher@4c133b2c main
[junit4:junit4]   2> 12191 T2005 oasu.CommitTracker.<init> Hard AutoCommit: disabled
[junit4:junit4]   2> 12191 T2005 oasu.CommitTracker.<init> Soft AutoCommit: disabled
[junit4:junit4]   2> 12192 T2005 oashc.SpellCheckComponent.inform Initializing spell checkers
[junit4:junit4]   2> 12196 T2005 oass.DirectSolrSpellChecker.init init: {name=direct,classname=DirectSolrSpellChecker,field=lowerfilt,minQueryLength=3}
[junit4:junit4]   2> 12240 T2006 oasc.SolrCore.registerSearcher [collection1] Registered new searcher Searcher@4c133b2c main{StandardDirectoryReader(segments_1:1)}
[junit4:junit4]   2> 12244 T2005 oasc.ZkController.publish publishing core=collection1 state=down
[junit4:junit4]   2> 12244 T2005 oasc.ZkController.publish numShards not found on descriptor - reading it from system property
[junit4:junit4]   2> 12871 T1955 oascc.ZkStateReader.updateClusterState Updating cloud state from ZooKeeper... 
[junit4:junit4]   2> 12872 T1955 oasc.Overseer$ClusterStateUpdater.updateState Update state numShards=1 message={
[junit4:junit4]   2> 	  "operation":"state",
[junit4:junit4]   2> 	  "numShards":"1",
[junit4:junit4]   2> 	  "shard":null,
[junit4:junit4]   2> 	  "roles":null,
[junit4:junit4]   2> 	  "state":"down",
[junit4:junit4]   2> 	  "core":"collection1",
[junit4:junit4]   2> 	  "collection":"collection1",
[junit4:junit4]   2> 	  "node_name":"127.0.0.1:18352_r_ziz%2Fa",
[junit4:junit4]   2> 	  "base_url":"http://127.0.0.1:18352/r_ziz/a"}
[junit4:junit4]   2> 12872 T1955 oasc.Overseer$ClusterStateUpdater.updateState Collection already exists with numShards=1
[junit4:junit4]   2> 12872 T1955 oasc.Overseer$ClusterStateUpdater.updateState Assigning new node to shard shard=shard1
[junit4:junit4]   2> 12884 T1988 oascc.ZkStateReader$2.process A cluster state change: WatchedEvent state:SyncConnected type:NodeDataChanged path:/clusterstate.json, has occurred - updating... (live nodes size: 4)
[junit4:junit4]   2> 12884 T2004 oascc.ZkStateReader$2.process A cluster state change: WatchedEvent state:SyncConnected type:NodeDataChanged path:/clusterstate.json, has occurred - updating... (live nodes size: 4)
[junit4:junit4]   2> 12884 T1954 oascc.ZkStateReader$2.process A cluster state change: WatchedEvent state:SyncConnected type:NodeDataChanged path:/clusterstate.json, has occurred - updating... (live nodes size: 4)
[junit4:junit4]   2> 12884 T1973 oascc.ZkStateReader$2.process A cluster state change: WatchedEvent state:SyncConnected type:NodeDataChanged path:/clusterstate.json, has occurred - updating... (live nodes size: 4)
[junit4:junit4]   2> 12884 T1960 oascc.ZkStateReader$2.process A cluster state change: WatchedEvent state:SyncConnected type:NodeDataChanged path:/clusterstate.json, has occurred - updating... (live nodes size: 4)
[junit4:junit4]   2> 13246 T2005 oasc.CoreContainer.registerCore registering core: collection1
[junit4:junit4]   2> 13246 T2005 oasc.ZkController.register Register replica - core:collection1 address:http://127.0.0.1:18352/r_ziz/a collection:collection1 shard:shard1
[junit4:junit4]   2> 13249 T2005 oasc.ZkController.register We are http://127.0.0.1:18352/r_ziz/a/collection1/ and leader is http://127.0.0.1:18328/r_ziz/a/collection1/
[junit4:junit4]   2> 13249 T2005 oasc.ZkController.register No LogReplay needed for core=collection1 baseURL=http://127.0.0.1:18352/r_ziz/a
[junit4:junit4]   2> 13249 T2005 oasc.ZkController.checkRecovery Core needs to recover:collection1
[junit4:junit4]   2> 13250 T2005 oasu.DefaultSolrCoreState.doRecovery Running recovery - first canceling any ongoing recovery
[junit4:junit4]   2> ASYNC  NEW_CORE C150 name=collection1 org.apache.solr.core.SolrCore@1d2cef85 url=http://127.0.0.1:18352/r_ziz/a/collection1 node=127.0.0.1:18352_r_ziz%2Fa C150_STATE=coll:collection1 core:collection1 props:{shard=null, roles=null, state=down, core=collection1, collection=collection1, node_name=127.0.0.1:18352_r_ziz%2Fa, base_url=http://127.0.0.1:18352/r_ziz/a}
[junit4:junit4]   2> 13250 T2007 C150 P18352 oasc.RecoveryStrategy.run Starting recovery process.  core=collection1 recoveringAfterStartup=true
[junit4:junit4]   2> 13250 T2005 oascc.ZkStateReader.updateClusterState Updating cloud state from ZooKeeper... 
[junit4:junit4]   2> 13251 T2007 C150 P18352 oasc.RecoveryStrategy.doRecovery ###### startupVersions=[]
[junit4:junit4]   2> 13251 T2007 C150 P18352 oasc.ZkController.publish publishing core=collection1 state=recovering
[junit4:junit4]   2> 13251 T2007 C150 P18352 oasc.ZkController.publish numShards not found on descriptor - reading it from system property
[junit4:junit4]   2> 13252 T1932 oass.SolrDispatchFilter.init user.dir=/usr/home/hudson/hudson-slave/workspace/Lucene-Solr-Tests-trunk-java7/solr/build/solr-core/test/J0
[junit4:junit4]   2> 13252 T1932 oass.SolrDispatchFilter.init SolrDispatchFilter.init() done
[junit4:junit4]   2> 13253 T2007 C150 P18352 oascsi.HttpClientUtil.createClient Creating new http client, config:maxConnections=128&maxConnectionsPerHost=32&followRedirects=false
[junit4:junit4]   2> 13253 T1932 oascsi.HttpClientUtil.createClient Creating new http client, config:maxConnections=128&maxConnectionsPerHost=32&followRedirects=false
[junit4:junit4]   2> 13442 T1932 oejs.Server.doStart jetty-8.1.8.v20121106
[junit4:junit4]   2> 13445 T1932 oejs.AbstractConnector.doStart Started SocketConnector@127.0.0.1:18357
[junit4:junit4]   2> 13446 T1932 oass.SolrDispatchFilter.init SolrDispatchFilter.init()
[junit4:junit4]   2> 13446 T1932 oasc.SolrResourceLoader.locateSolrHome JNDI not configured for solr (NoInitialContextEx)
[junit4:junit4]   2> 13447 T1932 oasc.SolrResourceLoader.locateSolrHome using system property solr.solr.home: /usr/home/hudson/hudson-slave/workspace/Lucene-Solr-Tests-trunk-java7/solr/build/solr-core/test/J0/./org.apache.solr.cloud.SyncSliceTest-jetty4-1359752340962
[junit4:junit4]   2> 13447 T1932 oasc.CoreContainer$Initializer.initialize looking for solr.xml: /usr/home/hudson/hudson-slave/workspace/Lucene-Solr-Tests-trunk-java7/solr/build/solr-core/test/J0/./org.apache.solr.cloud.SyncSliceTest-jetty4-1359752340962/solr.xml
[junit4:junit4]   2> 13448 T1932 oasc.CoreContainer.<init> New CoreContainer 1634914841
[junit4:junit4]   2> 13448 T1932 oasc.CoreContainer.load Loading CoreContainer using Solr Home: '/usr/home/hudson/hudson-slave/workspace/Lucene-Solr-Tests-trunk-java7/solr/build/solr-core/test/J0/./org.apache.solr.cloud.SyncSliceTest-jetty4-1359752340962/'
[junit4:junit4]   2> 13449 T1932 oasc.SolrResourceLoader.<init> new SolrResourceLoader for directory: '/usr/home/hudson/hudson-slave/workspace/Lucene-Solr-Tests-trunk-java7/solr/build/solr-core/test/J0/./org.apache.solr.cloud.SyncSliceTest-jetty4-1359752340962/'
[junit4:junit4]   2> 13503 T1932 oashc.HttpShardHandlerFactory.getParameter Setting socketTimeout to: 60000
[junit4:junit4]   2> 13503 T1932 oashc.HttpShardHandlerFactory.getParameter Setting urlScheme to: http://
[junit4:junit4]   2> 13504 T1932 oashc.HttpShardHandlerFactory.getParameter Setting connTimeout to: 15000
[junit4:junit4]   2> 13504 T1932 oashc.HttpShardHandlerFactory.getParameter Setting maxConnectionsPerHost to: 20
[junit4:junit4]   2> 13505 T1932 oashc.HttpShardHandlerFactory.getParameter Setting corePoolSize to: 0
[junit4:junit4]   2> 13505 T1932 oashc.HttpShardHandlerFactory.getParameter Setting maximumPoolSize to: 2147483647
[junit4:junit4]   2> 13506 T1932 oashc.HttpShardHandlerFactory.getParameter Setting maxThreadIdleTime to: 5
[junit4:junit4]   2> 13506 T1932 oashc.HttpShardHandlerFactory.getParameter Setting sizeOfQueue to: -1
[junit4:junit4]   2> 13507 T1932 oashc.HttpShardHandlerFactory.getParameter Setting fairnessPolicy to: false
[junit4:junit4]   2> 13507 T1932 oascsi.HttpClientUtil.createClient Creating new http client, config:maxConnectionsPerHost=20&maxConnections=10000&socketTimeout=60000&connTimeout=15000&retry=false
[junit4:junit4]   2> 13527 T1932 oasc.CoreContainer.load Registering Log Listener
[junit4:junit4]   2> 13548 T1932 oasc.CoreContainer.initZooKeeper Zookeeper client=127.0.0.1:18314/solr
[junit4:junit4]   2> 13548 T1932 oasc.ZkController.checkChrootPath zkHost includes chroot
[junit4:junit4]   2> 13549 T1932 oaz.ZooKeeper.<init> Initiating client connection, connectString=127.0.0.1:18314 sessionTimeout=60000 watcher=org.apache.solr.common.cloud.ConnectionManager@7154583f
[junit4:junit4]   2> 13550 T1932 oascc.ConnectionManager.waitForConnected Waiting for client to connect to ZooKeeper
[junit4:junit4]   2> 13550 T2017 oaz.ClientCnxn$SendThread.logStartConnect Opening socket connection to server localhost/127.0.0.1:18314. Will not attempt to authenticate using SASL (access denied ("javax.security.auth.AuthPermission" "getLoginConfiguration"))
[junit4:junit4]   2> 13551 T2017 oaz.ClientCnxn$SendThread.primeConnection Socket connection established to localhost/127.0.0.1:18314, initiating session
[junit4:junit4]   2> 13551 T1934 oazs.NIOServerCnxnFactory.run Accepted socket connection from /140.211.11.196:18358
[junit4:junit4]   2> 13552 T1934 oazs.ZooKeeperServer.processConnectRequest Client attempting to establish new session at /140.211.11.196:18358
[junit4:junit4]   2> 13554 T1936 oazs.ZooKeeperServer.finishSessionInit Established session 0x13c978df214000b with negotiated timeout 20000 for client /140.211.11.196:18358
[junit4:junit4]   2> 13554 T2017 oaz.ClientCnxn$SendThread.onConnected Session establishment complete on server localhost/127.0.0.1:18314, sessionid = 0x13c978df214000b, negotiated timeout = 20000
[junit4:junit4]   2> 13554 T2018 oascc.ConnectionManager.process Watcher org.apache.solr.common.cloud.ConnectionManager@7154583f name:ZooKeeperConnection Watcher:127.0.0.1:18314 got event WatchedEvent state:SyncConnected type:None path:null path:null type:None
[junit4:junit4]   2> 13554 T1932 oascc.ConnectionManager.waitForConnected Client is connected to ZooKeeper
[junit4:junit4]   2> 13556 T1937 oazs.PrepRequestProcessor.pRequest2Txn Processed session termination for sessionid: 0x13c978df214000b
[junit4:junit4]   2> 13562 T2018 oaz.ClientCnxn$EventThread.run EventThread shut down
[junit4:junit4]   2> 13562 T1934 oazs.NIOServerCnxn.closeSock Closed socket connection for client /140.211.11.196:18358 which had sessionid 0x13c978df214000b
[junit4:junit4]   2> 13562 T1932 oaz.ZooKeeper.close Session: 0x13c978df214000b closed
[junit4:junit4]   2> 13563 T1932 oascsi.HttpClientUtil.createClient Creating new http client, config:maxConnections=500&maxConnectionsPerHost=16&socketTimeout=60000&connTimeout=15000
[junit4:junit4]   2> 13573 T1932 oaz.ZooKeeper.<init> Initiating client connection, connectString=127.0.0.1:18314/solr sessionTimeout=30000 watcher=org.apache.solr.common.cloud.ConnectionManager@6b63f13c
[junit4:junit4]   2> 13574 T1932 oascc.ConnectionManager.waitForConnected Waiting for client to connect to ZooKeeper
[junit4:junit4]   2> 13574 T2019 oaz.ClientCnxn$SendThread.logStartConnect Opening socket connection to server localhost/127.0.0.1:18314. Will not attempt to authenticate using SASL (access denied ("javax.security.auth.AuthPermission" "getLoginConfiguration"))
[junit4:junit4]   2> 13575 T2019 oaz.ClientCnxn$SendThread.primeConnection Socket connection established to localhost/127.0.0.1:18314, initiating session
[junit4:junit4]   2> 13575 T1934 oazs.NIOServerCnxnFactory.run Accepted socket connection from /140.211.11.196:18359
[junit4:junit4]   2> 13575 T1934 oazs.ZooKeeperServer.processConnectRequest Client attempting to establish new session at /140.211.11.196:18359
[junit4:junit4]   2> 13576 T1936 oazs.ZooKeeperServer.finishSessionInit Established session 0x13c978df214000c with negotiated timeout 20000 for client /140.211.11.196:18359
[junit4:junit4]   2> 13576 T2019 oaz.ClientCnxn$SendThread.onConnected Session establishment complete on server localhost/127.0.0.1:18314, sessionid = 0x13c978df214000c, negotiated timeout = 20000
[junit4:junit4]   2> 13577 T2020 oascc.ConnectionManager.process Watcher org.apache.solr.common.cloud.ConnectionManager@6b63f13c name:ZooKeeperConnection Watcher:127.0.0.1:18314/solr got event WatchedEvent state:SyncConnected type:None path:null path:null type:None
[junit4:junit4]   2> 13577 T1932 oascc.ConnectionManager.waitForConnected Client is connected to ZooKeeper
[junit4:junit4]   2> 13578 T1937 oazs.PrepRequestProcessor.pRequest Got user-level KeeperException when processing sessionid:0x13c978df214000c type:create cxid:0x1 zxid:0x92 txntype:-1 reqpath:n/a Error Path:/solr/overseer Error:KeeperErrorCode = NodeExists for /solr/overseer
[junit4:junit4]   2> 13584 T1937 oazs.PrepRequestProcessor.pRequest Got user-level KeeperException when processing sessionid:0x13c978df214000c type:create cxid:0x2 zxid:0x93 txntype:-1 reqpath:n/a Error Path:/solr/overseer Error:KeeperErrorCode = NodeExists for /solr/overseer
[junit4:junit4]   2> 13585 T1932 oasc.ZkController.createEphemeralLiveNode Register node as live in ZooKeeper:/live_nodes/127.0.0.1:18357_r_ziz%2Fa
[junit4:junit4]   2> 13586 T1937 oazs.PrepRequestProcessor.pRequest Got user-level KeeperException when processing sessionid:0x13c978df214000c type:delete cxid:0x4 zxid:0x94 txntype:-1 reqpath:n/a Error Path:/solr/live_nodes/127.0.0.1:18357_r_ziz%2Fa Error:KeeperErrorCode = NoNode for /solr/live_nodes/127.0.0.1:18357_r_ziz%2Fa
[junit4:junit4]   2> 13592 T1932 oascc.SolrZkClient.makePath makePath: /live_nodes/127.0.0.1:18357_r_ziz%2Fa
[junit4:junit4]   2> 13601 T2004 oascc.ZkStateReader$2.process A cluster state change: WatchedEvent state:SyncConnected type:NodeChildrenChanged path:/live_nodes, has occurred - updating... (live nodes size: 4)
[junit4:junit4]   2> 13602 T1988 oascc.ZkStateReader$3.process Updating live nodes... (5)
[junit4:junit4]   2> 13602 T1973 oascc.ZkStateReader$3.process Updating live nodes... (5)
[junit4:junit4]   2> 13602 T1954 oascc.ZkStateReader$3.process Updating live nodes... (5)
[junit4:junit4]   2> 13602 T1960 oascc.ZkStateReader$3.process Updating live nodes... (5)
[junit4:junit4]   2> 13602 T1988 oascc.ZkStateReader$2.process A cluster state change: WatchedEvent state:SyncConnected type:NodeChildrenChanged path:/live_nodes, has occurred - updating... (live nodes size: 5)
[junit4:junit4]   2> 13602 T1973 oascc.ZkStateReader$2.process A cluster state change: WatchedEvent state:SyncConnected type:NodeChildrenChanged path:/live_nodes, has occurred - updating... (live nodes size: 5)
[junit4:junit4]   2> 13602 T1954 oascc.ZkStateReader$2.process A cluster state change: WatchedEvent state:SyncConnected type:NodeChildrenChanged path:/live_nodes, has occurred - updating... (live nodes size: 5)
[junit4:junit4]   2> 13603 T1960 oascc.ZkStateReader$2.process A cluster state change: WatchedEvent state:SyncConnected type:NodeChildrenChanged path:/live_nodes, has occurred - updating... (live nodes size: 5)
[junit4:junit4]   2> 13603 T2004 oascc.ZkStateReader$3.process Updating live nodes... (5)
[junit4:junit4]   2> 13606 T1932 oascc.ZkStateReader.createClusterStateWatchersAndUpdate Updating cluster state from ZooKeeper... 
[junit4:junit4]   2> 13614 T2021 oasc.CoreContainer.create Creating SolrCore 'collection1' using instanceDir: /usr/home/hudson/hudson-slave/workspace/Lucene-Solr-Tests-trunk-java7/solr/build/solr-core/test/J0/./org.apache.solr.cloud.SyncSliceTest-jetty4-1359752340962/collection1
[junit4:junit4]   2> 13615 T2021 oasc.ZkController.createCollectionZkNode Check for collection zkNode:collection1
[junit4:junit4]   2> 13616 T2021 oasc.ZkController.createCollectionZkNode Collection zkNode exists
[junit4:junit4]   2> 13616 T2021 oasc.ZkController.readConfigName Load collection config from:/collections/collection1
[junit4:junit4]   2> 13617 T2021 oasc.SolrResourceLoader.<init> new SolrResourceLoader for directory: '/usr/home/hudson/hudson-slave/workspace/Lucene-Solr-Tests-trunk-java7/solr/build/solr-core/test/J0/./org.apache.solr.cloud.SyncSliceTest-jetty4-1359752340962/collection1/'
[junit4:junit4]   2> 13619 T2021 oasc.SolrResourceLoader.replaceClassLoader Adding 'file:/usr/home/hudson/hudson-slave/workspace/Lucene-Solr-Tests-trunk-java7/solr/build/solr-core/test/J0/org.apache.solr.cloud.SyncSliceTest-jetty4-1359752340962/collection1/lib/classes/' to classloader
[junit4:junit4]   2> 13620 T2021 oasc.SolrResourceLoader.replaceClassLoader Adding 'file:/usr/home/hudson/hudson-slave/workspace/Lucene-Solr-Tests-trunk-java7/solr/build/solr-core/test/J0/org.apache.solr.cloud.SyncSliceTest-jetty4-1359752340962/collection1/lib/README' to classloader
[junit4:junit4]   2> 13678 T2021 oasc.SolrConfig.<init> Using Lucene MatchVersion: LUCENE_50
[junit4:junit4]   2>  C149_STATE=coll:collection1 core:collection1 props:{shard=shard1, roles=null, state=recovering, core=collection1, collection=collection1, node_name=127.0.0.1:18335_r_ziz%2Fa, base_url=http://127.0.0.1:18335/r_ziz/a}
[junit4:junit4]   2> 13737 T1991 C149 P18335 oasc.RecoveryStrategy.doRecovery Attempting to PeerSync from http://127.0.0.1:18328/r_ziz/a/collection1/ core=collection1 - recoveringAfterStartup=true
[junit4:junit4]   2> 13737 T1991 C149 P18335 oasu.PeerSync.sync PeerSync: core=collection1 url=http://127.0.0.1:18335/r_ziz/a START replicas=[http://127.0.0.1:18328/r_ziz/a/collection1/] nUpdates=100
[junit4:junit4]   2> 13738 T1991 C149 P18335 oasu.PeerSync.sync WARNING no frame of reference to tell of we've missed updates
[junit4:junit4]   2> 13738 T1991 C149 P18335 oasc.RecoveryStrategy.doRecovery PeerSync Recovery was not successful - trying replication. core=collection1
[junit4:junit4]   2> 13738 T1991 C149 P18335 oasc.RecoveryStrategy.doRecovery Starting Replication Recovery. core=collection1
[junit4:junit4]   2> 13738 T1991 C149 P18335 oasc.RecoveryStrategy.doRecovery Begin buffering updates. core=collection1
[junit4:junit4]   2> 13739 T1991 C149 P18335 oasu.UpdateLog.bufferUpdates Starting to buffer updates. FSUpdateLog{state=ACTIVE, tlog=null}
[junit4:junit4]   2> 13739 T1991 C149 P18335 oasc.RecoveryStrategy.replicate Attempting to replicate from http://127.0.0.1:18328/r_ziz/a/collection1/. core=collection1
[junit4:junit4]   2> 13739 T1991 C149 P18335 oascsi.HttpClientUtil.createClient Creating new http client, config:maxConnections=128&maxConnectionsPerHost=32&followRedirects=false
[junit4:junit4]   2> ASYNC  NEW_CORE C151 name=collection1 org.apache.solr.core.SolrCore@51345b3c url=http://127.0.0.1:18328/r_ziz/a/collection1 node=127.0.0.1:18328_r_ziz%2Fa C151_STATE=coll:collection1 core:collection1 props:{shard=shard1, roles=null, state=active, core=collection1, collection=collection1, node_name=127.0.0.1:18328_r_ziz%2Fa, base_url=http://127.0.0.1:18328/r_ziz/a, leader=true}
[junit4:junit4]   2> 13749 T1965 C151 P18328 REQ /get {getVersions=100&distrib=false&wt=javabin&qt=/get&version=2} status=0 QTime=0 
[junit4:junit4]   2> 13753 T1966 C151 P18328 oasu.DirectUpdateHandler2.commit start commit{,optimize=false,openSearcher=false,waitSearcher=true,expungeDeletes=false,softCommit=false}
[junit4:junit4]   2> 13755 T1966 C151 P18328 oasc.CachingDirectoryFactory.close Releasing directory:/usr/home/hudson/hudson-slave/workspace/Lucene-Solr-Tests-trunk-java7/solr/build/solr-core/test/J0/./org.apache.solr.cloud.SyncSliceTest-1359752327693/jetty1
[junit4:junit4]   2> 13762 T1966 C151 P18328 oasc.SolrDeletionPolicy.onInit SolrDeletionPolicy.onInit: commits:num=1
[junit4:junit4]   2> 		commit{dir=RateLimitedDirectoryWrapper(org.apache.lucene.store.NIOFSDirectory@/usr/home/hudson/hudson-slave/workspace/Lucene-Solr-Tests-trunk-java7/solr/build/solr-core/test/J0/org.apache.solr.cloud.SyncSliceTest-1359752327693/jetty1/index lockFactory=org.apache.lucene.store.NativeFSLockFactory@5885cf0),segFN=segments_1,generation=1,filenames=[segments_1]
[junit4:junit4]   2> 13763 T1966 C151 P18328 oasc.SolrDeletionPolicy.updateCommits newest commit = 1[segments_1]
[junit4:junit4]   2> 13770 T1966 C151 P18328 oasc.SolrDeletionPolicy.onCommit SolrDeletionPolicy.onCommit: commits:num=2
[junit4:junit4]   2> 		commit{dir=RateLimitedDirectoryWrapper(org.apache.lucene.store.NIOFSDirectory@/usr/home/hudson/hudson-slave/workspace/Lucene-Solr-Tests-trunk-java7/solr/build/solr-core/test/J0/org.apache.solr.cloud.SyncSliceTest-1359752327693/jetty1/index lockFactory=org.apache.lucene.store.NativeFSLockFactory@5885cf0),segFN=segments_1,generation=1,filenames=[segments_1]
[junit4:junit4]   2> 		commit{dir=RateLimitedDirectoryWrapper(org.apache.lucene.store.NIOFSDirectory@/usr/home/hudson/hudson-slave/workspace/Lucene-Solr-Tests-trunk-java7/solr/build/solr-core/test/J0/org.apache.solr.cloud.SyncSliceTest-1359752327693/jetty1/index lockFactory=org.apache.lucene.store.NativeFSLockFactory@5885cf0),segFN=segments_2,generation=2,filenames=[segments_2]
[junit4:junit4]   2> 13770 T1966 C151 P18328 oasc.SolrDeletionPolicy.updateCommits newest commit = 2[segments_2]
[junit4:junit4]   2> 13773 T1966 C151 P18328 oasc.CachingDirectoryFactory.close Releasing directory:/usr/home/hudson/hudson-slave/workspace/Lucene-Solr-Tests-trunk-java7/solr/build/solr-core/test/J0/./org.apache.solr.cloud.SyncSliceTest-1359752327693/jetty1
[junit4:junit4]   2> 13773 T1966 C151 P18328 oass.SolrIndexSearcher.<init> Opening Searcher@c9d435e realtime
[junit4:junit4]   2> 13773 T1966 C151 P18328 oasu.DirectUpdateHandler2.commit end_commit_flush
[junit4:junit4]   2> 13774 T2021 oasc.SolrConfig.<init> Loaded SolrConfig: solrconfig.xml
[junit4:junit4]   2> 13774 T1966 C151 P18328 /update {waitSearcher=true&openSearcher=false&commit=true&wt=javabin&commit_end_point=true&version=2&softCommit=false} {commit=} 0 21
[junit4:junit4]   2> 13775 T1991 C149 P18335 oash.ReplicationHandler.inform Commits will be reserved for  10000
[junit4:junit4]   2> 13775 T1991 C149 P18335 oash.SnapPuller.<init>  No value set for 'pollInterval'. Timer Task not started.
[junit4:junit4]   2> 13778 T1967 C151 P18328 oash.ReplicationHandler.inform Commits will be reserved for  10000
[junit4:junit4]   2> 13779 T1967 C151 P18328 REQ /replication {command=indexversion&qt=/replication&wt=javabin&version=2} status=0 QTime=2 
[junit4:junit4]   2> 13779 T1991 C149 P18335 oash.SnapPuller.fetchLatestIndex Master's generation: 2
[junit4:junit4]   2> 13780 T1991 C149 P18335 oash.SnapPuller.fetchLatestIndex Slave's generation: 1
[junit4:junit4]   2> 13780 T1991 C149 P18335 oash.SnapPuller.fetchLatestIndex Starting replication process
[junit4:junit4]   2> 13782 T1967 C151 P18328 oasc.CachingDirectoryFactory.close Releasing directory:/usr/home/hudson/hudson-slave/workspace/Lucene-Solr-Tests-trunk-java7/solr/build/solr-core/test/J0/./org.apache.solr.cloud.SyncSliceTest-1359752327693/jetty1
[junit4:junit4]   2> 13784 T1967 C151 P18328 oasc.CachingDirectoryFactory.close Releasing directory:/usr/home/hudson/hudson-slave/workspace/Lucene-Solr-Tests-trunk-java7/solr/build/solr-core/test/J0/./org.apache.solr.cloud.SyncSliceTest-1359752327693/jetty1/index
[junit4:junit4]   2> 13784 T1967 C151 P18328 REQ /replication {command=filelist&qt=/replication&wt=javabin&generation=2&version=2} status=0 QTime=2 
[junit4:junit4]   2> 13785 T1991 C149 P18335 oash.SnapPuller.fetchLatestIndex Number of files in latest index in master: 1
[junit4:junit4]   2> 13787 T1991 C149 P18335 oasc.CachingDirectoryFactory.get return new directory for /usr/home/hudson/hudson-slave/workspace/Lucene-Solr-Tests-trunk-java7/solr/build/solr-core/test/J0/./org.apache.solr.cloud.SyncSliceTest-1359752327693/jetty2/index.20130201125901473 forceNew:false
[junit4:junit4]   2> 13787 T1991 C149 P18335 oasc.CachingDirectoryFactory.close Releasing directory:/usr/home/hudson/hudson-slave/workspace/Lucene-Solr-Tests-trunk-java7/solr/build/solr-core/test/J0/./org.apache.solr.cloud.SyncSliceTest-1359752327693/jetty2
[junit4:junit4]   2> 13789 T1991 C149 P18335 oash.SnapPuller.fetchLatestIndex Starting download to RateLimitedDirectoryWrapper(org.apache.lucene.store.NIOFSDirectory@/usr/home/hudson/hudson-slave/workspace/Lucene-Solr-Tests-trunk-java7/solr/build/solr-core/test/J0/org.apache.solr.cloud.SyncSliceTest-1359752327693/jetty2/index.20130201125901473 lockFactory=org.apache.lucene.store.NativeFSLockFactory@6b0d60dd) fullCopy=true
[junit4:junit4]   2> 13793 T1967 C151 P18328 REQ /replication {file=segments_2&command=filecontent&checksum=true&wt=filestream&qt=/replication&generation=2} status=0 QTime=0 
[junit4:junit4]   2> 13795 T1991 C149 P18335 oasc.CachingDirectoryFactory.close Releasing directory:/usr/home/hudson/hudson-slave/workspace/Lucene-Solr-Tests-trunk-java7/solr/build/solr-core/test/J0/./org.apache.solr.cloud.SyncSliceTest-1359752327693/jetty2/index
[junit4:junit4]   2> 13795 T1991 C149 P18335 oash.SnapPuller.fetchLatestIndex Total time taken for download : 0 secs
[junit4:junit4]   2> 13796 T1991 C149 P18335 oash.SnapPuller.modifyIndexProps New index installed. Updating index properties... index=index.20130201125901473
[junit4:junit4]   2> 13799 T1991 C149 P18335 oasc.CachingDirectoryFactory.close Releasing directory:/usr/home/hudson/hudson-slave/workspace/Lucene-Solr-Tests-trunk-java7/solr/build/solr-core/test/J0/./org.apache.solr.cloud.SyncSliceTest-1359752327693/jetty2
[junit4:junit4]   2> 13800 T1991 C149 P18335 oasc.CachingDirectoryFactory.close Releasing directory:/usr/home/hudson/hudson-slave/workspace/Lucene-Solr-Tests-trunk-java7/solr/build/solr-core/test/J0/./org.apache.solr.cloud.SyncSliceTest-1359752327693/jetty2
[junit4:junit4]   2> 13800 T1991 C149 P18335 oasc.SolrCore.getNewIndexDir New index directory detected: old=./org.apache.solr.cloud.SyncSliceTest-1359752327693/jetty2/index/ new=./org.apache.solr.cloud.SyncSliceTest-1359752327693/jetty2/index.20130201125901473
[junit4:junit4]   2> 13809 T1991 C149 P18335 oasc.SolrDeletionPolicy.onInit SolrDeletionPolicy.onInit: commits:num=1
[junit4:junit4]   2> 		commit{dir=RateLimitedDirectoryWrapper(org.apache.lucene.store.NIOFSDirectory@/usr/home/hudson/hudson-slave/workspace/Lucene-Solr-Tests-trunk-java7/solr/build/solr-core/test/J0/org.apache.solr.cloud.SyncSliceTest-1359752327693/jetty2/index.20130201125901473 lockFactory=org.apache.lucene.store.NativeFSLockFactory@6b0d60dd),segFN=segments_2,generation=2,filenames=[segments_2]
[junit4:junit4]   2> 13810 T1991 C149 P18335 oasc.SolrDeletionPolicy.updateCommits newest commit = 2[segments_2]
[junit4:junit4]   2> 13818 T1991 C149 P18335 oasc.CachingDirectoryFactory.close Releasing directory:/usr/home/hudson/hudson-slave/workspace/Lucene-Solr-Tests-trunk-java7/solr/build/solr-core/test/J0/./org.apache.solr.cloud.SyncSliceTest-1359752327693/jetty2
[junit4:junit4]   2> 13819 T1991 C149 P18335 oasu.DefaultSolrCoreState.newIndexWriter Creating new IndexWriter...
[junit4:junit4]   2> 13819 T1991 C149 P18335 oasu.DefaultSolrCoreState.newIndexWriter Waiting until IndexWriter is unused... core=collection1
[junit4:junit4]   2> 13820 T1991 C149 P18335 oasu.DefaultSolrCoreState.newIndexWriter Rollback old IndexWriter... core=collection1
[junit4:junit4]   2> 13821 T1991 C149 P18335 oasc.CachingDirectoryFactory.close Releasing directory:/usr/home/hudson/hudson-slave/workspace/Lucene-Solr-Tests-trunk-java7/solr/build/solr-core/test/J0/./org.apache.solr.cloud.SyncSliceTest-1359752327693/jetty2/index.20130201125901473
[junit4:junit4]   2> 13823 T1991 C149 P18335 oasc.CachingDirectoryFactory.close Releasing directory:/usr/home/hudson/hudson-slave/workspace/Lucene-Solr-Tests-trunk-java7/solr/build/solr-core/test/J0/./org.apache.solr.cloud.SyncSliceTest-1359752327693/jetty2
[junit4:junit4]   2> 13827 T1991 C149 P18335 oasc.SolrDeletionPolicy.onInit SolrDeletionPolicy.onInit: commits:num=1
[junit4:junit4]   2> 		commit{dir=RateLimitedDirectoryWrapper(org.apache.lucene.store.NIOFSDirectory@/usr/home/hudson/hudson-slave/workspace/Lucene-Solr-Tests-trunk-java7/solr/build/solr-core/test/J0/org.apache.solr.cloud.SyncSliceTest-1359752327693/jetty2/index.20130201125901473 lockFactory=org.apache.lucene.store.NativeFSLockFactory@6b0d60dd),segFN=segments_2,generation=2,filenames=[segments_2]
[junit4:junit4]   2> 13828 T1991 C149 P18335 oasc.SolrDeletionPolicy.updateCommits newest commit = 2[segments_2]
[junit4:junit4]   2> 13828 T1991 C149 P18335 oasu.DefaultSolrCoreState.newIndexWriter New IndexWriter is ready to be used.
[junit4:junit4]   2> 13829 T1991 C149 P18335 oasc.CachingDirectoryFactory.close Releasing directory:/usr/home/hudson/hudson-slave/workspace/Lucene-Solr-Tests-trunk-java7/solr/build/solr-core/test/J0/./org.apache.solr.cloud.SyncSliceTest-1359752327693/jetty2
[junit4:junit4]   2> 13829 T1991 C149 P18335 oass.SolrIndexSearcher.<init> Opening Searcher@645edb48 main
[junit4:junit4]   2> 13831 T1990 oasc.SolrCore.registerSearcher [collection1] Registered new searcher Searcher@645edb48 main{StandardDirectoryReader(segments_2:1:nrt)}
[junit4:junit4]   2> 13831 T1990 oasc.CachingDirectoryFactory.close Releasing directory:/usr/home/hudson/hudson-slave/workspace/Lucene-Solr-Tests-trunk-java7/solr/build/solr-core/test/J0/./org.apache.solr.cloud.SyncSliceTest-1359752327693/jetty2/index
[junit4:junit4]   2> 13832 T1991 C149 P18335 oasu.DirectUpdateHandler2.commit start commit{,optimize=false,openSearcher=false,waitSearcher=false,expungeDeletes=false,softCommit=false}
[junit4:junit4]   2> 13869 T1991 C149 P18335 oasc.SolrDeletionPolicy.onCommit SolrDeletionPolicy.onCommit: commits:num=2
[junit4:junit4]   2> 		commit{dir=RateLimitedDirectoryWrapper(org.apache.lucene.store.NIOFSDirectory@/usr/home/hudson/hudson-slave/workspace/Lucene-Solr-Tests-trunk-java7/solr/build/solr-core/test/J0/org.apache.solr.cloud.SyncSliceTest-1359752327693/jetty2/index.20130201125901473 lockFactory=org.apache.lucene.store.NativeFSLockFactory@6b0d60dd),segFN=segments_2,generation=2,filenames=[segments_2]
[junit4:junit4]   2> 		commit{dir=RateLimitedDirectoryWrapper(org.apache.lucene.store.NIOFSDirectory@/usr/home/hudson/hudson-slave/workspace/Lucene-Solr-Tests-trunk-java7/solr/build/solr-core/test/J0/org.apache.solr.cloud.SyncSliceTest-1359752327693/jetty2/index.20130201125901473 lockFactory=org.apache.lucene.store.NativeFSLockFactory@6b0d60dd),segFN=segments_3,generation=3,filenames=[segments_3]
[junit4:junit4]   2> 13869 T1991 C149 P18335 oasc.SolrDeletionPolicy.updateCommits newest commit = 3[segments_3]
[junit4:junit4]   2> 13870 T1991 C149 P18335 oasc.CachingDirectoryFactory.close Releasing directory:/usr/home/hudson/hudson-slave/workspace/Lucene-Solr-Tests-trunk-java7/solr/build/solr-core/test/J0/./org.apache.solr.cloud.SyncSliceTest-1359752327693/jetty2
[junit4:junit4]   2> 13871 T1991 C149 P18335 oasu.DirectUpdateHandler2.commit end_commit_flush
[junit4:junit4]   2> 13871 T1991 C149 P18335 oasc.CachingDirectoryFactory.close Releasing directory:/usr/home/hudson/hudson-slave/workspace/Lucene-Solr-Tests-trunk-java7/solr/build/solr-core/test/J0/./org.apache.solr.cloud.SyncSliceTest-1359752327693/jetty2/index.20130201125901473
[junit4:junit4]   2> 13871 T1991 C149 P18335 oasc.CachingDirectoryFactory.close Releasing directory:/usr/home/hudson/hudson-slave/workspace/Lucene-Solr-Tests-trunk-java7/solr/build/solr-core/test/J0/./org.apache.solr.cloud.SyncSliceTest-1359752327693/jetty2/index
[junit4:junit4]   2> 13871 T1991 C149 P18335 oasc.RecoveryStrategy.replay No replay needed. core=collection1
[junit4:junit4]   2> 13872 T1991 C149 P18335 oasc.RecoveryStrategy.doRecovery Replication Recovery was successful - registering as Active. core=collection1
[junit4:junit4]   2> 13872 T1991 C149 P18335 oasc.ZkController.publish publishing core=collection1 state=active
[junit4:junit4]   2> 13872 T1991 C149 P18335 oasc.ZkController.publish numShards not found on descriptor - reading it from system property
[junit4:junit4]   2> 13875 T2021 oass.IndexSchema.readSchema Reading Solr Schema
[junit4:junit4]   2> 13885 T1991 C149 P18335 oasc.RecoveryStrategy.doRecovery Finished recovery process. core=collection1
[junit4:junit4]   2> 13895 T2021 oass.IndexSchema.readSchema Schema name=test
[junit4:junit4]   2> 14389 T1955 oascc.ZkStateReader.updateClusterState Updating cloud state from ZooKeeper... 
[junit4:junit4]   2> 14390 T1955 oasc.Overseer$ClusterStateUpdater.updateState Update state numShards=1 message={
[junit4:junit4]   2> 	  "operation":"state",
[junit4:junit4]   2> 	  "numShards":"1",
[junit4:junit4]   2> 	  "shard":"shard1",
[junit4:junit4]   2> 	  "roles":null,
[junit4:junit4]   2> 	  "state":"recovering",
[junit4:junit4]   2> 	  "core":"collection1",
[junit4:junit4]   2> 	  "collection":"collection1",
[junit4:junit4]   2> 	  "node_name":"127.0.0.1:18352_r_ziz%2Fa",
[junit4:junit4]   2> 	  "base_url":"http://127.0.0.1:18352/r_ziz/a"}
[junit4:junit4]   2> 14399 T1955 oasc.Overseer$ClusterStateUpdater.updateState Update state numShards=1 message={
[junit4:junit4]   2> 	  "operation":"state",
[junit4:junit4]   2> 	  "numShards":"1",
[junit4:junit4]   2> 	  "shard":"shard1",
[junit4:junit4]   2> 	  "roles":null,
[junit4:junit4]   2> 	  "state":"active",
[junit4:junit4]   2> 	  "core":"collection1",
[junit4:junit4]   2> 	  "collection":"collection1",
[junit4:junit4]   2> 	  "node_name":"127.0.0.1:18335_r_ziz%2Fa",
[junit4:junit4]   2> 	  "base_url":"http://127.0.0.1:18335/r_ziz/a"}
[junit4:junit4]   2> 14412 T2020 oascc.ZkStateReader$2.process A cluster state change: WatchedEvent state:SyncConnected type:NodeDataChanged path:/clusterstate.json, has occurred - updating... (live nodes size: 5)
[junit4:junit4]   2> 14412 T1960 oascc.ZkStateReader$2.process A cluster state change: WatchedEvent state:SyncConnected type:NodeDataChanged path:/clusterstate.json, has occurred - updating... (live nodes size: 5)
[junit4:junit4]   2> 14412 T1988 oascc.ZkStateReader$2.process A cluster state change: WatchedEvent state:SyncConnected type:NodeDataChanged path:/clusterstate.json, has occurred - updating... (live nodes size: 5)
[junit4:junit4]   2> 14412 T1973 oascc.ZkStateReader$2.process A cluster state change: WatchedEvent state:SyncConnected type:NodeDataChanged path:/clusterstate.json, has occurred - updating... (live nodes size: 5)
[junit4:junit4]   2> 14412 T2004 oascc.ZkStateReader$2.process A cluster state change: WatchedEvent state:SyncConnected type:NodeDataChanged path:/clusterstate.json, has occurred - updating... (live nodes size: 5)
[junit4:junit4]   2> 14412 T1954 oascc.ZkStateReader$2.process A cluster state change: WatchedEvent state:SyncConnected type:NodeDataChanged path:/clusterstate.json, has occurred - updating... (live nodes size: 5)
[junit4:junit4]   2> 14779 T2021 oass.OpenExchangeRatesOrgProvider.init Initialized with rates=open-exchange-rates.json, refreshInterval=1440.
[junit4:junit4]   2> 14803 T2021 oass.IndexSchema.readSchema default search field in schema is text
[junit4:junit4]   2> 14810 T2021 oass.IndexSchema.readSchema unique key field: id
[junit4:junit4]   2> 14828 T2021 oass.FileExchangeRateProvider.reload Reloading exchange rates from file currency.xml
[junit4:junit4]   2> 14837 T2021 oass.FileExchangeRateProvider.reload Reloading exchange rates from file currency.xml
[junit4:junit4]   2> 14845 T2021 oass.OpenExchangeRatesOrgProvider.reload Reloading exchange rates from open-exchange-rates.json
[junit4:junit4]   2> 14846 T2021 oass.OpenExchangeRatesOrgProvider.reload Reloading exchange rates from open-exchange-rates.json
[junit4:junit4]   2> 14848 T2021 oasc.SolrCore.<init> [collection1] Opening new SolrCore at /usr/home/hudson/hudson-slave/workspace/Lucene-Solr-Tests-trunk-java7/solr/build/solr-core/test/J0/./org.apache.solr.cloud.SyncSliceTest-jetty4-1359752340962/collection1/, dataDir=./org.apache.solr.cloud.SyncSliceTest-1359752327693/jetty4/
[junit4:junit4]   2> 14848 T2021 oasc.JmxMonitoredMap.<init> JMX monitoring is enabled. Adding Solr mbeans to JMX Server: com.sun.jmx.mbeanserver.JmxMBeanServer@6b8099d3
[junit4:junit4]   2> 14849 T2021 oasc.SolrCore.initDirectoryFactory solr.StandardDirectoryFactory
[junit4:junit4]   2> 14850 T2021 oasc.CachingDirectoryFactory.get return new directory for /usr/home/hudson/hudson-slave/workspace/Lucene-Solr-Tests-trunk-java7/solr/build/solr-core/test/J0/./org.apache.solr.cloud.SyncSliceTest-1359752327693/jetty4 forceNew:false
[junit4:junit4]   2> 14851 T2021 oasc.CachingDirectoryFactory.close Releasing directory:/usr/home/hudson/hudson-slave/workspace/Lucene-Solr-Tests-trunk-java7/solr/build/solr-core/test/J0/./org.apache.solr.cloud.SyncSliceTest-1359752327693/jetty4
[junit4:junit4]   2> 14851 T2021 oasc.SolrCore.getNewIndexDir New index directory detected: old=null new=./org.apache.solr.cloud.SyncSliceTest-1359752327693/jetty4/index/
[junit4:junit4]   2> 14852 T2021 oasc.SolrCore.initIndex WARNING [collection1] Solr index directory './org.apache.solr.cloud.SyncSliceTest-1359752327693/jetty4/index' doesn't exist. Creating new index...
[junit4:junit4]   2> 14854 T2021 oasc.CachingDirectoryFactory.get return new directory for /usr/home/hudson/hudson-slave/workspace/Lucene-Solr-Tests-trunk-java7/solr/build/solr-core/test/J0/./org.apache.solr.cloud.SyncSliceTest-1359752327693/jetty4/index forceNew:false
[junit4:junit4]   2> 14863 T2021 oasc.SolrDeletionPolicy.onCommit SolrDeletionPolicy.onCommit: commits:num=1
[junit4:junit4]   2> 		commit{dir=RateLimitedDirectoryWrapper(org.apache.lucene.store.NIOFSDirectory@/usr/home/hudson/hudson-slave/workspace/Lucene-Solr-Tests-trunk-java7/solr/build/solr-core/test/J0/org.apache.solr.cloud.SyncSliceTest-1359752327693/jetty4/index lockFactory=org.apache.lucene.store.NativeFSLockFactory@aa32589),segFN=segments_1,generation=1,filenames=[segments_1]
[junit4:junit4]   2> 14863 T2021 oasc.SolrDeletionPolicy.updateCommits newest commit = 1[segments_1]
[junit4:junit4]   2> 14864 T2021 oasc.CachingDirectoryFactory.close Releasing directory:/usr/home/hudson/hudson-slave/workspace/Lucene-Solr-Tests-trunk-java7/solr/build/solr-core/test/J0/./org.apache.solr.cloud.SyncSliceTest-1359752327693/jetty4/index
[junit4:junit4]   2> 14864 T2021 oasc.SolrCore.initWriters created xml: solr.XMLResponseWriter
[junit4:junit4]   2> 14866 T2021 oasup.UpdateRequestProcessorChain.init inserting DistributedUpdateProcessorFactory into updateRequestProcessorChain "dedupe"
[junit4:junit4]   2> 14867 T2021 oasup.UpdateRequestProcessorChain.init inserting DistributedUpdateProcessorFactory into updateRequestProcessorChain "dedupe-allfields"
[junit4:junit4]   2> 14867 T2021 oasup.UpdateRequestProcessorChain.init inserting DistributedUpdateProcessorFactory into updateRequestProcessorChain "stored_sig"
[junit4:junit4]   2> 14867 T2021 oasup.UpdateRequestProcessorChain.init inserting DistributedUpdateProcessorFactory into updateRequestProcessorChain "uniq-fields"
[junit4:junit4]   2> 14868 T2021 oasup.UpdateRequestProcessorChain.init inserting DistributedUpdateProcessorFactory into updateRequestProcessorChain "distrib-dup-test-chain-implicit"
[junit4:junit4]   2> 14868 T2021 oasc.RequestHandlers.initHandlersFromConfig adding lazy requestHandler: solr.ReplicationHandler
[junit4:junit4]   2> 14869 T2021 oasc.RequestHandlers.initHandlersFromConfig created /replication: solr.ReplicationHandler
[junit4:junit4]   2> 14870 T2021 oasc.RequestHandlers.initHandlersFromConfig created standard: solr.StandardRequestHandler
[junit4:junit4]   2> 14871 T2021 oasc.RequestHandlers.initHandlersFromConfig created /get: solr.RealTimeGetHandler
[junit4:junit4]   2> 14872 T2021 oasc.RequestHandlers.initHandlersFromConfig created dismax: solr.SearchHandler
[junit4:junit4]   2> 14872 T2021 oasc.RequestHandlers.initHandlersFromConfig created mock: org.apache.solr.core.MockQuerySenderListenerReqHandler
[junit4:junit4]   2> 14873 T2021 oasc.RequestHandlers.initHandlersFromConfig created /admin/: org.apache.solr.handler.admin.AdminHandlers
[junit4:junit4]   2> 14874 T2021 oasc.RequestHandlers.initHandlersFromConfig created defaults: solr.StandardRequestHandler
[junit4:junit4]   2> 14874 T2021 oasc.RequestHandlers.initHandlersFromConfig adding lazy requestHandler: solr.StandardRequestHandler
[junit4:junit4]   2> 14875 T2021 oasc.RequestHandlers.initHandlersFromConfig created lazy: solr.StandardRequestHandler
[junit4:junit4]   2> 14876 T2021 oasc.RequestHandlers.initHandlersFromConfig created /update: solr.UpdateRequestHandler
[junit4:junit4]   2> 14876 T2021 oasc.RequestHandlers.initHandlersFromConfig created /terms: org.apache.solr.handler.component.SearchHandler
[junit4:junit4]   2> 14877 T2021 oasc.RequestHandlers.initHandlersFromConfig created spellCheckCompRH: org.apache.solr.handler.component.SearchHandler
[junit4:junit4]   2> 14878 T2021 oasc.RequestHandlers.initHandlersFromConfig created spellCheckCompRH_Direct: org.apache.solr.handler.component.SearchHandler
[junit4:junit4]   2> 14879 T2021 oasc.RequestHandlers.initHandlersFromConfig created spellCheckWithWordbreak: org.apache.solr.handler.component.SearchHandler
[junit4:junit4]   2> 14879 T2021 oasc.RequestHandlers.initHandlersFromConfig created spellCheckWithWordbreak_Direct: org.apache.solr.handler.component.SearchHandler
[junit4:junit4]   2> 14880 T2021 oasc.RequestHandlers.initHandlersFromConfig created spellCheckCompRH1: org.apache.solr.handler.component.SearchHandler
[junit4:junit4]   2> 14881 T2021 oasc.RequestHandlers.initHandlersFromConfig created mltrh: org.apache.solr.handler.component.SearchHandler
[junit4:junit4]   2> 14882 T2021 oasc.RequestHandlers.initHandlersFromConfig created tvrh: org.apache.solr.handler.component.SearchHandler
[junit4:junit4]   2> 14883 T2021 oasc.RequestHandlers.initHandlersFromConfig created /mlt: solr.MoreLikeThisHandler
[junit4:junit4]   2> 14884 T2021 oasc.RequestHandlers.initHandlersFromConfig created /debug/dump: solr.DumpRequestHandler
[junit4:junit4]   2> 14914 T2021 oashl.XMLLoader.init xsltCacheLifetimeSeconds=60
[junit4:junit4]   2> 14924 T2021 oasc.SolrCore.initDeprecatedSupport WARNING solrconfig.xml uses deprecated <admin/gettableFiles>, Please update your config to use the ShowFileRequestHandler.
[junit4:junit4]   2> 14926 T2021 oasc.SolrCore.initDeprecatedSupport WARNING adding ShowFileRequestHandler with hidden files: [SCHEMA.XML, OLD_SYNONYMS.TXT, STOPWORDS.TXT, PROTWORDS.TXT, OPEN-EXCHANGE-RATES.JSON, SYNONYMS.TXT, CURRENCY.XML, MAPPING-ISOLATIN1ACCENT.TXT]
[junit4:junit4]   2> 14930 T2021 oasc.CachingDirectoryFactory.close Releasing directory:/usr/home/hudson/hudson-slave/workspace/Lucene-Solr-Tests-trunk-java7/solr/build/solr-core/test/J0/./org.apache.solr.cloud.SyncSliceTest-1359752327693/jetty4
[junit4:junit4]   2> 14934 T2021 oass.SolrIndexSearcher.<init> Opening Searcher@6e822855 main
[junit4:junit4]   2> 14936 T2021 oasu.CommitTracker.<init> Hard AutoCommit: disabled
[junit4:junit4]   2> 14936 T2021 oasu.CommitTracker.<init> Soft AutoCommit: disabled
[junit4:junit4]   2> 14937 T2021 oashc.SpellCheckComponent.inform Initializing spell checkers
[junit4:junit4]   2> 15008 T2021 oass.DirectSolrSpellChecker.init init: {name=direct,classname=DirectSolrSpellChecker,field=lowerfilt,minQueryLength=3}
[junit4:junit4]   2> 15060 T2024 oasc.SolrCore.registerSearcher [collection1] Registered new searcher Searcher@6e822855 main{StandardDirectoryReader(segments_1:1)}
[junit4:junit4]   2> 15065 T2021 oasc.ZkController.publish publishing core=collection1 state=down
[junit4:junit4]   2> 15066 T2021 oasc.ZkController.publish numShards not found on descriptor - reading it from system property
[junit4:junit4]   2> 15921 T1955 oascc.ZkStateReader.updateClusterState Updating cloud state from ZooKeeper... 
[junit4:junit4]   2> 15922 T1955 oasc.Overseer$ClusterStateUpdater.updateState Update state numShards=1 message={
[junit4:junit4]   2> 	  "operation":"state",
[junit4:junit4]   2> 	  "numShards":"1",
[junit4:junit4]   2> 	  "shard":null,
[junit4:junit4]   2> 	  "roles":null,
[junit4:junit4]   2> 	  "state":"down",
[junit4:junit4]   2> 	  "core":"collection1",
[junit4:junit4]   2> 	  "collection":"collection1",
[junit4:junit4]   2> 	  "node_name":"127.0.0.1:18357_r_ziz%2Fa",
[junit4:junit4]   2> 	  "base_url":"http://127.0.0.1:18357/r_ziz/a"}
[junit4:junit4]   2> 15923 T1955 oasc.Overseer$ClusterStateUpdater.updateState Collection already exists with numShards=1
[junit4:junit4]   2> 15923 T1955 oasc.Overseer$ClusterStateUpdater.updateState Assigning new node to shard shard=shard1
[junit4:junit4]   2> 15935 T2004 oascc.ZkStateReader$2.process A cluster state change: WatchedEvent state:SyncConnected type:NodeDataChanged path:/clusterstate.json, has occurred - updating... (live nodes size: 5)
[junit4:junit4]   2> 15935 T1960 oascc.ZkStateReader$2.process A cluster state change: WatchedEvent state:SyncConnected type:NodeDataChanged path:/clusterstate.json, has occurred - updating... (live nodes size: 5)
[junit4:junit4]   2> 15935 T2020 oascc.ZkStateReader$2.process A cluster state change: WatchedEvent state:SyncConnected type:NodeDataChanged path:/clusterstate.json, has occurred - updating... (live nodes size: 5)
[junit4:junit4]   2> 15935 T1988 oascc.ZkStateReader$2.process A cluster state change: WatchedEvent state:SyncConnected type:NodeDataChanged path:/clusterstate.json, has occurred - updating... (live nodes size: 5)
[junit4:junit4]   2> 15935 T1954 oascc.ZkStateReader$2.process A cluster state change: WatchedEvent state:SyncConnected type:NodeDataChanged path:/clusterstate.json, has occurred - updating... (live nodes size: 5)
[junit4:junit4]   2> 15935 T1973 oascc.ZkStateReader$2.process A cluster state change: WatchedEvent state:SyncConnected type:NodeDataChanged path:/clusterstate.json, has occurred - updating... (live nodes size: 5)
[junit4:junit4]   2> 16069 T2021 oasc.CoreContainer.registerCore registering core: collection1
[junit4:junit4]   2> 16069 T2021 oasc.ZkController.register Register replica - core:collection1 address:http://127.0.0.1:18357/r_ziz/a collection:collection1 shard:shard1
[junit4:junit4]   2> 16072 T2021 oasc.ZkController.register We are http://127.0.0.1:18357/r_ziz/a/collection1/ and leader is http://127.0.0.1:18328/r_ziz/a/collection1/
[junit4:junit4]   2> 16073 T2021 oasc.ZkController.register No LogReplay needed for core=collection1 baseURL=http://127.0.0.1:18357/r_ziz/a
[junit4:junit4]   2> 16073 T2021 oasc.ZkController.checkRecovery Core needs to recover:collection1
[junit4:junit4]   2> 16073 T2021 oasu.DefaultSolrCoreState.doRecovery Running recovery - first canceling any ongoing recovery
[junit4:junit4]   2> ASYNC  NEW_CORE C152 name=collection1 org.apache.solr.core.SolrCore@62ed8299 url=http://127.0.0.1:18357/r_ziz/a/collection1 node=127.0.0.1:18357_r_ziz%2Fa C152_STATE=coll:collection1 core:collection1 props:{shard=null, roles=null, state=down, core=collection1, collection=collection1, node_name=127.0.0.1:18357_r_ziz%2Fa, base_url=http://127.0.0.1:18357/r_ziz/a}
[junit4:junit4]   2> 16074 T2025 C152 P18357 oasc.RecoveryStrategy.run Starting recovery process.  core=collection1 recoveringAfterStartup=true
[junit4:junit4]   2> 16074 T2025 C152 P18357 oasc.RecoveryStrategy.doRecovery ###### startupVersions=[]
[junit4:junit4]   2> 16074 T2021 oascc.ZkStateReader.updateClusterState Updating cloud state from ZooKeeper... 
[junit4:junit4]   2> 16075 T2025 C152 P18357 oasc.ZkController.publish publishing core=collection1 state=recovering
[junit4:junit4]   2> 16075 T2025 C152 P18357 oasc.ZkController.publish numShards not found on descriptor - reading it from system property
[junit4:junit4]   2> 16075 T1932 oass.SolrDispatchFilter.init user.dir=/usr/home/hudson/hudson-slave/workspace/Lucene-Solr-Tests-trunk-java7/solr/build/solr-core/test/J0
[junit4:junit4]   2> 16076 T1932 oass.SolrDispatchFilter.init SolrDispatchFilter.init() done
[junit4:junit4]   2> 16076 T2025 C152 P18357 oascsi.HttpClientUtil.createClient Creating new http client, config:maxConnections=128&maxConnectionsPerHost=32&followRedirects=false
[junit4:junit4]   2> 16077 T1932 oascsi.HttpClientUtil.createClient Creating new http client, config:maxConnections=128&maxConnectionsPerHost=32&followRedirects=false
[junit4:junit4]   2> 16092 T1932 oascc.ZkStateReader.updateClusterState Updating cloud state from ZooKeeper... 
[junit4:junit4]   2> 16093 T1932 oasc.AbstractFullDistribZkTestBase.waitForThingsToLevelOut Wait for recoveries to finish - wait 15 for each attempt
[junit4:junit4]   2> 16093 T1932 oasc.AbstractDistribZkTestBase.waitForRecoveriesToFinish Wait for recoveries to finish - collection: collection1 failOnTimeout:true timeout (sec):15
[junit4:junit4]   2> 16094 T1932 oascc.ZkStateReader.updateClusterState Updating cloud state from ZooKeeper... 
[junit4:junit4]   2> 17096 T1932 oascc.ZkStateReader.updateClusterState Updating cloud state from ZooKeeper... 
[junit4:junit4]   2>  C150_STATE=coll:collection1 core:collection1 props:{shard=shard1, roles=null, state=recovering, core=collection1, collection=collection1, node_name=127.0.0.1:18352_r_ziz%2Fa, base_url=http://127.0.0.1:18352/r_ziz/a}
[junit4:junit4]   2> 17278 T2007 C150 P18352 oasc.RecoveryStrategy.doRecovery Attempting to PeerSync from http://127.0.0.1:18328/r_ziz/a/collection1/ core=collection1 - recoveringAfterStartup=true
[junit4:junit4]   2> 17278 T2007 C150 P18352 oasu.PeerSync.sync PeerSync: core=collection1 url=http://127.0.0.1:18352/r_ziz/a START replicas=[http://127.0.0.1:18328/r_ziz/a/collection1/] nUpdates=100
[junit4:junit4]   2> 17278 T2007 C150 P18352 oasu.PeerSync.sync WARNING no frame of reference to tell of we've missed updates
[junit4:junit4]   2> 17279 T2007 C150 P18352 oasc.RecoveryStrategy.doRecovery PeerSync Recovery was not successful - trying replication. core=collection1
[junit4:junit4]   2> 17279 T2007 C150 P18352 oasc.RecoveryStrategy.doRecovery Starting Replication Recovery. core=collection1
[junit4:junit4]   2> 17279 T2007 C150 P18352 oasc.RecoveryStrategy.doRecovery Begin buffering updates. core=collection1
[junit4:junit4]   2> 17279 T2007 C150 P18352 oasu.UpdateLog.bufferUpdates Starting to buffer updates. FSUpdateLog{state=ACTIVE, tlog=null}
[junit4:junit4]   2> 17279 T2007 C150 P18352 oasc.RecoveryStrategy.replicate Attempting to replicate from http://127.0.0.1:18328/r_ziz/a/collection1/. core=collection1
[junit4:junit4]   2> 17280 T2007 C150 P18352 oascsi.HttpClientUtil.createClient Creating new http client, config:maxConnections=128&maxConnectionsPerHost=32&followRedirects=false
[junit4:junit4]   2> 17281 T1965 C151 P18328 REQ /get {getVersions=100&distrib=false&wt=javabin&qt=/get&version=2} status=0 QTime=0 
[junit4:junit4]   2> 17293 T1969 C151 P18328 oasu.DirectUpdateHandler2.commit start commit{,optimize=false,openSearcher=false,waitSearcher=true,expungeDeletes=false,softCommit=false}
[junit4:junit4]   2> 17297 T1969 C151 P18328 oasc.SolrDeletionPolicy.onCommit SolrDeletionPolicy.onCommit: commits:num=2
[junit4:junit4]   2> 		commit{dir=RateLimitedDirectoryWrapper(org.apache.lucene.store.NIOFSDirectory@/usr/home/hudson/hudson-slave/workspace/Lucene-Solr-Tests-trunk-java7/solr/build/solr-core/test/J0/org.apache.solr.cloud.SyncSliceTest-1359752327693/jetty1/index lockFactory=org.apache.lucene.store.NativeFSLockFactory@5885cf0),segFN=segments_2,generation=2,filenames=[segments_2]
[junit4:junit4]   2> 		commit{dir=RateLimitedDirectoryWrapper(org.apache.lucene.store.NIOFSDirectory@/usr/home/hudson/hudson-slave/workspace/Lucene-Solr-Tests-trunk-java7/solr/build/solr-core/test/J0/org.apache.solr.cloud.SyncSliceTest-1359752327693/jetty1/index lockFactory=org.apache.lucene.store.NativeFSLockFactory@5885cf0),segFN=segments_3,generation=3,filenames=[segments_3]
[junit4:junit4]   2> 17298 T1969 C151 P18328 oasc.SolrDeletionPolicy.updateCommits newest commit = 3[segments_3]
[junit4:junit4]   2> 17298 T1969 C151 P18328 oasc.CachingDirectoryFactory.close Releasing directory:/usr/home/hudson/hudson-slave/workspace/Lucene-Solr-Tests-trunk-java7/solr/build/solr-core/test/J0/./org.apache.solr.cloud.SyncSliceTest-1359752327693/jetty1
[junit4:junit4]   2> 17299 T1969 C151 P18328 oasu.DirectUpdateHandler2.commit end_commit_flush
[junit4:junit4]   2> 17299 T1969 C151 P18328 /update {waitSearcher=true&openSearcher=false&commit=true&wt=javabin&commit_end_point=true&version=2&softCommit=false} {commit=} 0 7
[junit4:junit4]   2> 17300 T2007 C150 P18352 oash.ReplicationHandler.inform Commits will be reserved for  10000
[junit4:junit4]   2> 17300 T2007 C150 P18352 oash.SnapPuller.<init>  No value set for 'pollInterval'. Timer Task not started.
[junit4:junit4]   2> 17303 T1967 C151 P18328 REQ /replication {command=indexversion&qt=/replication&wt=javabin&version=2} status=0 QTime=0 
[junit4:junit4]   2> 17304 T2007 C150 P18352 oash.SnapPuller.fetchLatestIndex Master's generation: 3
[junit4:junit4]   2> 17304 T2007 C150 P18352 oash.SnapPuller.fetchLatestIndex Slave's generation: 1
[junit4:junit4]   2> 17304 T2007 C150 P18352 oash.SnapPuller.fetchLatestIndex Starting replication process
[junit4:junit4]   2> 17307 T1967 C151 P18328 oasc.CachingDirectoryFactory.close Releasing directory:/usr/home/hudson/hudson-slave/workspace/Lucene-Solr-Tests-trunk-java7/solr/build/solr-core/test/J0/./org.apache.solr.cloud.SyncSliceTest-1359752327693/jetty1
[junit4:junit4]   2> 17308 T1967 C151 P18328 oasc.CachingDirectoryFactory.close Releasing directory:/usr/home/hudson/hudson-slave/workspace/Lucene-Solr-Tests-trunk-java7/solr/build/solr-core/test/J0/./org.apache.solr.cloud.SyncSliceTest-1359752327693/jetty1/index
[junit4:junit4]   2> 17308 T1967 C151 P18328 REQ /replication {command=filelist&qt=/replication&wt=javabin&generation=3&version=2} status=0 QTime=1 
[junit4:junit4]   2> 17309 T2007 C150 P18352 oash.SnapPuller.fetchLatestIndex Number of files in latest index in master: 1
[junit4:junit4]   2> 17310 T2007 C150 P18352 oasc.CachingDirectoryFactory.get return new directory for /usr/home/hudson/hudson-slave/workspace/Lucene-Solr-Tests-trunk-java7/solr/build/solr-core/test/J0/./org.apache.solr.cloud.SyncSliceTest-1359752327693/jetty3/index.20130201125904997 forceNew:false
[junit4:junit4]   2> 17311 T2007 C150 P18352 oasc.CachingDirectoryFactory.close Releasing directory:/usr/home/hudson/hudson-slave/workspace/Lucene-Solr-Tests-trunk-java7/solr/build/solr-core/test/J0/./org.apache.solr.cloud.SyncSliceTest-1359752327693/jetty3
[junit4:junit4]   2> 17311 T2007 C150 P18352 oash.SnapPuller.fetchLatestIndex Starting download to RateLimitedDirectoryWrapper(org.apache.lucene.store.NIOFSDirectory@/usr/home/hudson/hudson-slave/workspace/Lucene-Solr-Tests-trunk-java7/solr/build/solr-core/test/J0/org.apache.solr.cloud.SyncSliceTest-1359752327693/jetty3/index.20130201125904997 lockFactory=org.apache.lucene.store.NativeFSLockFactory@2ef3fcbf) fullCopy=true
[junit4:junit4]   2> 17315 T1967 C151 P18328 REQ /replication {file=segments_3&command=filecontent&checksum=true&wt=filestream&qt=/replication&generation=3} status=0 QTime=0 
[junit4:junit4]   2> 17316 T2007 C150 P18352 oasc.CachingDirectoryFactory.close Releasing directory:/usr/home/hudson/hudson-slave/workspace/Lucene-Solr-Tests-trunk-java7/solr/build/solr-core/test/J0/./org.apache.solr.cloud.SyncSliceTest-1359752327693/jetty3/index
[junit4:junit4]   2> 17317 T2007 C150 P18352 oash.SnapPuller.fetchLatestIndex Total time taken for download : 0 secs
[junit4:junit4]   2> 17317 T2007 C150 P18352 oash.SnapPuller.modifyIndexProps New index installed. Updating index properties... index=index.20130201125904997
[junit4:junit4]   2> 17318 T2007 C150 P18352 oasc.CachingDirectoryFactory.close Releasing directory:/usr/home/hudson/hudson-slave/workspace/Lucene-Solr-Tests-trunk-java7/solr/build/solr-core/test/J0/./org.apache.solr.cloud.SyncSliceTest-1359752327693/jetty3
[junit4:junit4]   2> 17319 T2007 C150 P18352 oasc.CachingDirectoryFactory.close Releasing directory:/usr/home/hudson/hudson-slave/workspace/Lucene-Solr-Tests-trunk-java7/solr/build/solr-core/test/J0/./org.apache.solr.cloud.SyncSliceTest-1359752327693/jetty3
[junit4:junit4]   2> 17319 T2007 C150 P18352 oasc.SolrCore.getNewIndexDir New index directory detected: old=./org.apache.solr.cloud.SyncSliceTest-1359752327693/jetty3/index/ new=./org.apache.solr.cloud.SyncSliceTest-1359752327693/jetty3/index.20130201125904997
[junit4:junit4]   2> 17322 T2007 C150 P18352 oasc.SolrDeletionPolicy.onInit SolrDeletionPolicy.onInit: commits:num=1
[junit4:junit4]   2> 		commit{dir=RateLimitedDirectoryWrapper(org.apache.lucene.store.NIOFSDirectory@/usr/home/hudson/hudson-slave/workspace/Lucene-Solr-Tests-trunk-java7/solr/build/solr-core/test/J0/org.apache.solr.cloud.SyncSliceTest-1359752327693/jetty3/index.20130201125904997 lockFactory=org.apache.lucene.store.NativeFSLockFactory@2ef3fcbf),segFN=segments_3,generation=3,filenames=[segments_3]
[junit4:junit4]   2> 17323 T2007 C150 P18352 oasc.SolrDeletionPolicy.updateCommits newest commit = 3[segments_3]
[junit4:junit4]   2> 17324 T2007 C150 P18352 oasc.CachingDirectoryFactory.close Releasing directory:/usr/home/hudson/hudson-slave/workspace/Lucene-Solr-Tests-trunk-java7/solr/build/solr-core/test/J0/./org.apache.solr.cloud.SyncSliceTest-1359752327693/jetty3
[junit4:junit4]   2> 17324 T2007 C150 P18352 oasu.DefaultSolrCoreState.newIndexWriter Creating new IndexWriter...
[junit4:junit4]   2> 17324 T2007 C150 P18352 oasu.DefaultSolrCoreState.newIndexWriter Waiting until IndexWriter is unused... core=collection1
[junit4:junit4]   2> 17325 T2007 C150 P18352 oasu.DefaultSolrCoreState.newIndexWriter Rollback old IndexWriter... core=collection1
[junit4:junit4]   2> 17325 T2007 C150 P18352 oasc.CachingDirectoryFactory.close Releasing directory:/usr/home/hudson/hudson-slave/workspace/Lucene-Solr-Tests-trunk-java7/solr/build/solr-core/test/J0/./org.apache.solr.cloud.SyncSliceTest-1359752327693/jetty3/index.20130201125904997
[junit4:junit4]   2> 17326 T2007 C150 P18352 oasc.CachingDirectoryFactory.close Releasing directory:/usr/home/hudson/hudson-slave/workspace/Lucene-Solr-Tests-trunk-java7/solr/build/solr-core/test/J0/./org.apache.solr.cloud.SyncSliceTest-1359752327693/jetty3
[junit4:junit4]   2> 17329 T2007 C150 P18352 oasc.SolrDeletionPolicy.onInit SolrDeletionPolicy.onInit: commits:num=1
[junit4:junit4]   2> 		commit{dir=RateLimitedDirectoryWrapper(org.apache.lucene.store.NIOFSDirectory@/usr/home/hudson/hudson-slave/workspace/Lucene-Solr-Tests-trunk-java7/solr/build/solr-core/test/J0/org.apache.solr.cloud.SyncSliceTest-1359752327693/jetty3/index.20130201125904997 lockFactory=org.apache.lucene.store.NativeFSLockFactory@2ef3fcbf),segFN=segments_3,generation=3,filenames=[segments_3]
[junit4:junit4]   2> 17329 T2007 C150 P18352 oasc.SolrDeletionPolicy.updateCommits newest commit = 3[segments_3]
[junit4:junit4]   2> 17330 T2007 C150 P18352 oasu.DefaultSolrCoreState.newIndexWriter New IndexWriter is ready to be used.
[junit4:junit4]   2> 17330 T2007 C150 P18352 oasc.CachingDirectoryFactory.close Releasing directory:/usr/home/hudson/hudson-slave/workspace/Lucene-Solr-Tests-trunk-java7/solr/build/solr-core/test/J0/./org.apache.solr.cloud.SyncSliceTest-1359752327693/jetty3
[junit4:junit4]   2> 17330 T2007 C150 P18352 oass.SolrIndexSearcher.<init> Opening Searcher@7725bcfa main
[junit4:junit4]   2> 17332 T2006 oasc.SolrCore.registerSearcher [collection1] Registered new searcher Searcher@7725bcfa main{StandardDirectoryReader(segments_3:1:nrt)}
[junit4:junit4]   2> 17333 T2006 oasc.CachingDirectoryFactory.close Releasing directory:/usr/home/hudson/hudson-slave/workspace/Lucene-Solr-Tests-trunk-java7/solr/build/solr-core/test/J0/./org.apache.solr.cloud.SyncSliceTest-1359752327693/jetty3/index
[junit4:junit4]   2> 17333 T2007 C150 P18352 oasu.DirectUpdateHandler2.commit start commit{,optimize=false,openSearcher=false,waitSearcher=false,expungeDeletes=false,softCommit=false}
[junit4:junit4]   2> 17335 T2007 C150 P18352 oasc.SolrDeletionPolicy.onCommit SolrDeletionPolicy.onCommit: commits:num=2
[junit4:junit4]   2> 		commit{dir=RateLimitedDirectoryWrapper(org.apache.lucene.store.NIOFSDirectory@/usr/home/hudson/hudson-slave/workspace/Lucene-Solr-Tests-trunk-java7/solr/build/solr-core/test/J0/org.apache.solr.cloud.SyncSliceTest-1359752327693/jetty3/index.20130201125904997 lockFactory=org.apache.lucene.store.NativeFSLockFactory@2ef3fcbf),segFN=segments_3,generation=3,filenames=[segments_3]
[junit4:junit4]   2> 		commit{dir=RateLimitedDirectoryWrapper(org.apache.lucene.store.NIOFSDirectory@/usr/home/hudson/hudson-slave/workspace/Lucene-Solr-Tests-trunk-java7/solr/build/solr-core/test/J0/org.apache.solr.cloud.SyncSliceTest-1359752327693/jetty3/index.20130201125904997 lockFactory=org.apache.lucene.store.NativeFSLockFactory@2ef3fcbf),segFN=segments_4,generation=4,filenames=[segments_4]
[junit4:junit4]   2> 17335 T2007 C150 P18352 oasc.SolrDeletionPolicy.updateCommits newest commit = 4[segments_4]
[junit4:junit4]   2> 17336 T2007 C150 P18352 oasc.CachingDirectoryFactory.close Releasing directory:/usr/home/hudson/hudson-slave/workspace/Lucene-Solr-Tests-trunk-java7/solr/build/solr-core/test/J0/./org.apache.solr.cloud.SyncSliceTest-1359752327693/jetty3
[junit4:junit4]   2> 17336 T2007 C150 P18352 oasu.DirectUpdateHandler2.commit end_commit_flush
[junit4:junit4]   2> 17337 T2007 C150 P18352 oasc.CachingDirectoryFactory.close Releasing directory:/usr/home/hudson/hudson-slave/workspace/Lucene-Solr-Tests-trunk-java7/solr/build/solr-core/test/J0/./org.apache.solr.cloud.SyncSliceTest-1359752327693/jetty3/index.20130201125904997
[junit4:junit4]   2> 17337 T2007 C150 P18352 oasc.CachingDirectoryFactory.close Releasing directory:/usr/home/hudson/hudson-slave/workspace/Lucene-Solr-Tests-trunk-java7/solr/build/solr-core/test/J0/./org.apache.solr.cloud.SyncSliceTest-1359752327693/jetty3/index
[junit4:junit4]   2> 17337 T2007 C150 P18352 oasc.RecoveryStrategy.replay No replay needed. core=collection1
[junit4:junit4]   2> 17337 T2007 C150 P18352 oasc.RecoveryStrategy.doRecovery Replication Recovery was successful - registering as Active. core=collection1
[junit4:junit4]   2> 17337 T2007 C150 P18352 oasc.ZkController.publish publishing core=collection1 state=active
[junit4:junit4]   2> 17338 T2007 C150 P18352 oasc.ZkController.publish numShards not found on descriptor - reading it from system property
[junit4:junit4]   2> 17345 T2007 C150 P18352 oasc.RecoveryStrategy.doRecovery Finished recovery process. core=collection1
[junit4:junit4]   2> 17440 T1955 oascc.ZkStateReader.updateClusterState Updating cloud state from ZooKeeper... 
[junit4:junit4]   2> 17441 T1955 oasc.Overseer$ClusterStateUpdater.updateState Update state numShards=1 message={
[junit4:junit4]   2> 	  "operation":"state",
[junit4:junit4]   2> 	  "numShards":"1",
[junit4:junit4]   2> 	  "shard":"shard1",
[junit4:junit4]   2> 	  "roles":null,
[junit4:junit4]   2> 	  "state":"recovering",
[junit4:junit4]   2> 	  "core":"collection1",
[junit4:junit4]   2> 	  "collection":"collection1",
[junit4:junit4]   2> 	  "node_name":"127.0.0.1:18357_r_ziz%2Fa",
[junit4:junit4]   2> 	  "base_url":"http://127.0.0.1:18357/r_ziz/a"}
[junit4:junit4]   2> 17445 T1955 oasc.Overseer$ClusterStateUpdater.updateState Update state numShards=1 message={
[junit4:junit4]   2> 	  "operation":"state",
[junit4:junit4]   2> 	  "numShards":"1",
[junit4:junit4]   2> 	  "shard":"shard1",
[junit4:junit4]   2> 	  "roles":null,
[junit4:junit4]   2> 	  "state":"active",
[junit4:junit4]   2> 	  "core":"collection1",
[junit4:junit4]   2> 	  "collection":"collection1",
[junit4:junit4]   2> 	  "node_name":"127.0.0.1:18352_r_ziz%2Fa",
[junit4:junit4]   2> 	  "base_url":"http://127.0.0.1:18352/r_ziz/a"}
[junit4:junit4]   2> 17457 T1954 oascc.ZkStateReader$2.process A cluster state change: WatchedEvent state:SyncConnected type:NodeDataChanged path:/clusterstate.json, has occurred - updating... (live nodes size: 5)
[junit4:junit4]   2> 17457 T1988 oascc.ZkStateReader$2.process A cluster state change: WatchedEvent state:SyncConnected type:NodeDataChanged path:/clusterstate.json, has occurred - updating... (live nodes size: 5)
[junit4:junit4]   2> 17457 T1973 oascc.ZkStateReader$2.process A cluster state change: WatchedEvent state:SyncConnected type:NodeDataChanged path:/clusterstate.json, has occurred - updating... (live nodes size: 5)
[junit4:junit4]   2> 17457 T2020 oascc.ZkStateReader$2.process A cluster state change: WatchedEvent state:SyncConnected type:NodeDataChanged path:/clusterstate.json, has occurred - updating... (live nodes size: 5)
[junit4:junit4]   2> 17457 T1960 oascc.ZkStateReader$2.process A cluster state change: WatchedEvent state:SyncConnected type:NodeDataChanged path:/clusterstate.json, has occurred - updating... (live nodes size: 5)
[junit4:junit4]   2> 17457 T2004 oascc.ZkStateReader$2.process A cluster state change: WatchedEvent state:SyncConnected type:NodeDataChanged path:/clusterstate.json, has occurred - updating... (live nodes size: 5)
[junit4:junit4]   2> 18098 T1932 oascc.ZkStateReader.updateClusterState Updating cloud state from ZooKeeper... 
[junit4:junit4]   2> 19100 T1932 oascc.ZkStateReader.updateClusterState Updating cloud state from ZooKeeper... 
[junit4:junit4]   2>  C152_STATE=coll:collection1 core:collection1 props:{shard=shard1, roles=null, state=recovering, core=collection1, collection=collection1, node_name=127.0.0.1:18357_r_ziz%2Fa, base_url=http://127.0.0.1:18357/r_ziz/a}
[junit4:junit4]   2> 20096 T2025 C152 P18357 oasc.RecoveryStrategy.doRecovery Attempting to PeerSync from http://127.0.0.1:18328/r_ziz/a/collection1/ core=collection1 - recoveringAfterStartup=true
[junit4:junit4]   2> 20096 T2025 C152 P18357 oasu.PeerSync.sync PeerSync: core=collection1 url=http://127.0.0.1:18357/r_ziz/a START replicas=[http://127.0.0.1:18328/r_ziz/a/collection1/] nUpdates=100
[junit4:junit4]   2> 20096 T2025 C152 P18357 oasu.PeerSync.sync WARNING no frame of reference to tell of we've missed updates
[junit4:junit4]   2> 20097 T2025 C152 P18357 oasc.RecoveryStrategy.doRecovery PeerSync Recovery was not successful - trying replication. core=collection1
[junit4:junit4]   2> 20097 T2025 C152 P18357 oasc.RecoveryStrategy.doRecovery Starting Replication Recovery. core=collection1
[junit4:junit4]   2> 20097 T2025 C152 P18357 oasc.RecoveryStrategy.doRecovery Begin buffering updates. core=collection1
[junit4:junit4]   2> 20097 T2025 C152 P18357 oasu.UpdateLog.bufferUpdates Starting to buffer updates. FSUpdateLog{state=ACTIVE, tlog=null}
[junit4:junit4]   2> 20097 T2025 C152 P18357 oasc.RecoveryStrategy.replicate Attempting to replicate from http://127.0.0.1:18328/r_ziz/a/collection1/. core=collection1
[junit4:junit4]   2> 20097 T2025 C152 P18357 oascsi.HttpClientUtil.createClient Creating new http client, config:maxConnections=128&maxConnectionsPerHost=32&followRedirects=false
[junit4:junit4]   2> 20099 T1965 C151 P18328 REQ /get {getVersions=100&distrib=false&wt=javabin&qt=/get&version=2} status=0 QTime=0 
[junit4:junit4]   2> 20103 T1932 oascc.ZkStateReader.updateClusterState Updating cloud state from ZooKeeper... 
[junit4:junit4]   2> 20108 T1963 C151 P18328 oasu.DirectUpdateHandler2.commit start commit{,optimize=false,openSearcher=false,waitSearcher=true,expungeDeletes=false,softCommit=false}
[junit4:junit4]   2> 20111 T1963 C151 P18328 oasc.SolrDeletionPolicy.onCommit SolrDeletionPolicy.onCommit: commits:num=3
[junit4:junit4]   2> 		commit{dir=RateLimitedDirectoryWrapper(org.apache.lucene.store.NIOFSDirectory@/usr/home/hudson/hudson-slave/workspace/Lucene-Solr-Tests-trunk-java7/solr/build/solr-core/test/J0/org.apache.solr.cloud.SyncSliceTest-1359752327693/jetty1/index lockFactory=org.apache.lucene.store.NativeFSLockFactory@5885cf0),segFN=segments_2,generation=2,filenames=[segments_2]
[junit4:junit4]   2> 		commit{dir=RateLimitedDirectoryWrapper(org.apache.lucene.store.NIOFSDirectory@/usr/home/hudson/hudson-slave/workspace/Lucene-Solr-Tests-trunk-java7/solr/build/solr-core/test/J0/org.apache.solr.cloud.SyncSliceTest-1359752327693/jetty1/index lockFactory=org.apache.lucene.store.NativeFSLockFactory@5885cf0),segFN=segments_3,generation=3,filenames=[segments_3]
[junit4:junit4]   2> 		commit{dir=RateLimitedDirectoryWrapper(org.apache.lucene.store.NIOFSDirectory@/usr/home/hudson/hudson-slave/workspace/Lucene-Solr-Tests-trunk-java7/solr/build/solr-core/test/J0/org.apache.solr.cloud.SyncSliceTest-1359752327693/jetty1/index lockFactory=org.apache.lucene.store.NativeFSLockFactory@5885cf0),segFN=segments_4,generation=4,filenames=[segments_4]
[junit4:junit4]   2> 20111 T1963 C151 P18328 oasc.SolrDeletionPolicy.updateCommits newest commit = 4[segments_4]
[junit4:junit4]   2> 20112 T1963 C151 P18328 oasc.CachingDirectoryFactory.close Releasing directory:/usr/home/hudson/hudson-slave/workspace/Lucene-Solr-Tests-trunk-java7/solr/build/solr-core/test/J0/./org.apache.solr.cloud.SyncSliceTest-1359752327693/jetty1
[junit4:junit4]   2> 20112 T1963 C151 P18328 oasu.DirectUpdateHandler2.commit end_commit_flush
[junit4:junit4]   2> 20113 T1963 C151 P18328 /update {waitSearcher=true&openSearcher=false&commit=true&wt=javabin&commit_end_point=true&version=2&softCommit=false} {commit=} 0 5
[junit4:junit4]   2> 20113 T2025 C152 P18357 oash.ReplicationHandler.inform Commits will be reserved for  10000
[junit4:junit4]   2> 20113 T2025 C152 P18357 oash.SnapPuller.<init>  No value set for 'pollInterval'. Timer Task not started.
[junit4:junit4]   2> 20116 T1967 C151 P18328 REQ /replication {command=indexversion&qt=/replication&wt=javabin&version=2} status=0 QTime=0 
[junit4:junit4]   2> 20116 T2025 C152 P18357 oash.SnapPuller.fetchLatestIndex Master's generation: 4
[junit4:junit4]   2> 20117 T2025 C152 P18357 oash.SnapPuller.fetchLatestIndex Slave's generation: 1
[junit4:junit4]   2> 20117 T2025 C152 P18357 oash.SnapPuller.fetchLatestIndex Starting replication process
[junit4:junit4]   2> 20119 T1967 C151 P18328 oasc.CachingDirectoryFactory.close Releasing directory:/usr/home/hudson/hudson-slave/workspace/Lucene-Solr-Tests-trunk-java7/solr/build/solr-core/test/J0/./org.apache.solr.cloud.SyncSliceTest-1359752327693/jetty1
[junit4:junit4]   2> 20119 T1967 C151 P18328 oasc.CachingDirectoryFactory.close Releasing directory:/usr/home/hudson/hudson-slave/workspace/Lucene-Solr-Tests-trunk-java7/solr/build/solr-core/test/J0/./org.apache.solr.cloud.SyncSliceTest-1359752327693/jetty1/index
[junit4:junit4]   2> 20120 T1967 C151 P18328 REQ /replication {command=filelist&qt=/replication&wt=javabin&generation=4&version=2} status=0 QTime=1 
[junit4:junit4]   2> 20120 T2025 C152 P18357 oash.SnapPuller.fetchLatestIndex Number of files in latest index in master: 1
[junit4:junit4]   2> 20121 T2025 C152 P18357 oasc.CachingDirectoryFactory.get return new directory for /usr/home/hudson/hudson-slave/workspace/Lucene-Solr-Tests-trunk-java7/solr/build/solr-core/test/J0/./org.apache.solr.cloud.SyncSliceTest-1359752327693/jetty4/index.20130201125907808 forceNew:false
[junit4:junit4]   2> 20122 T2025 C152 P18357 oasc.CachingDirectoryFactory.close Releasing directory:/usr/home/hudson/hudson-slave/workspace/Lucene-Solr-Tests-trunk-java7/solr/build/solr-core/test/J0/./org.apache.solr.cloud.SyncSliceTest-1359752327693/jetty4
[junit4:junit4]   2> 20122 T2025 C152 P18357 oash.SnapPuller.fetchLatestIndex Starting download to RateLimitedDirectoryWrapper(org.apache.lucene.store.NIOFSDirectory@/usr/home/hudson/hudson-slave/workspace/Lucene-Solr-Tests-trunk-java7/solr/build/solr-core/test/J0/org.apache.solr.cloud.SyncSliceTest-1359752327693/jetty4/index.20130201125907808 lockFactory=org.apache.lucene.store.NativeFSLockFactory@6bca1f4e) fullCopy=true
[junit4:junit4]   2> 20125 T1967 C151 P18328 REQ /replication {file=segments_4&command=filecontent&checksum=true&wt=filestream&qt=/replication&generation=4} status=0 QTime=0 
[junit4:junit4]   2> 20126 T2025 C152 P18357 oasc.CachingDirectoryFactory.close Releasing directory:/usr/home/hudson/hudson-slave/workspace/Lucene-Solr-Tests-trunk-java7/solr/build/solr-core/test/J0/./org.apache.solr.cloud.SyncSliceTest-1359752327693/jetty4/index
[junit4:junit4]   2> 20126 T2025 C152 P18357 oash.SnapPuller.fetchLatestIndex Total time taken for download : 0 secs
[junit4:junit4]   2> 20127 T2025 C152 P18357 oash.SnapPuller.modifyIndexProps New index installed. Updating index properties... index=index.20130201125907808
[junit4:junit4]   2> 20128 T2025 C152 P18357 oasc.CachingDirectoryFactory.close Releasing directory:/usr/home/hudson/hudson-slave/workspace/Lucene-Solr-Tests-trunk-java7/solr/build/solr-core/test/J0/./org.apache.solr.cloud.SyncSliceTest-1359752327693/jetty4
[junit4:junit4]   2> 20128 T2025 C152 P18357 oasc.CachingDirectoryFactory.close Releasing directory:/usr/home/hudson/hudson-slave/workspace/Lucene-Solr-Tests-trunk-java7/solr/build/solr-core/test/J0/./org.apache.solr.cloud.SyncSliceTest-1359752327693/jetty4
[junit4:junit4]   2> 20129 T2025 C152 P18357 oasc.SolrCore.getNewIndexDir New index directory detected: old=./org.apache.solr.cloud.SyncSliceTest-1359752327693/jetty4/index/ new=./org.apache.solr.cloud.SyncSliceTest-1359752327693/jetty4/index.20130201125907808
[junit4:junit4]   2> 20132 T2025 C152 P18357 oasc.SolrDeletionPolicy.onInit SolrDeletionPolicy.onInit: commits:num=1
[junit4:junit4]   2> 		commit{dir=RateLimitedDirectoryWrapper(org.apache.lucene.store.NIOFSDirectory@/usr/home/hudson/hudson-slave/workspace/Lucene-Solr-Tests-trunk-java7/solr/build/solr-core/test/J0/org.apache.solr.cloud.SyncSliceTest-1359752327693/jetty4/index.20130201125907808 lockFactory=org.apache.lucene.store.NativeFSLockFactory@6bca1f4e),segFN=segments_4,generation=4,filenames=[segments_4]
[junit4:junit4]   2> 20132 T2025 C152 P18357 oasc.SolrDeletionPolicy.updateCommits newest commit = 4[segments_4]
[junit4:junit4]   2> 20133 T2025 C152 P18357 oasc.CachingDirectoryFactory.close Releasing directory:/usr/home/hudson/hudson-slave/workspace/Lucene-Solr-Tests-trunk-java7/solr/build/solr-core/test/J0/./org.apache.solr.cloud.SyncSliceTest-1359752327693/jetty4
[junit4:junit4]   2> 20133 T2025 C152 P18357 oasu.DefaultSolrCoreState.newIndexWriter Creating new IndexWriter...
[junit4:junit4]   2> 20134 T2025 C152 P18357 oasu.DefaultSolrCoreState.newIndexWriter Waiting until IndexWriter is unused... core=collection1
[junit4:junit4]   2> 20134 T2025 C152 P18357 oasu.DefaultSolrCoreState.newIndexWriter Rollback old IndexWriter... core=collection1
[junit4:junit4]   2> 20135 T2025 C152 P18357 oasc.CachingDirectoryFactory.close Releasing directory:/usr/home/hudson/hudson-slave/workspace/Lucene-Solr-Tests-trunk-java7/solr/build/solr-core/test/J0/./org.apache.solr.cloud.SyncSliceTest-1359752327693/jetty4/index.20130201125907808
[junit4:junit4]   2> 20135 T2025 C152 P18357 oasc.CachingDirectoryFactory.close Releasing directory:/usr/home/hudson/hudson-slave/workspace/Lucene-Solr-Tests-trunk-java7/solr/build/solr-core/test/J0/./org.apache.solr.cloud.SyncSliceTest-1359752327693/jetty4
[junit4:junit4]   2> 20138 T2025 C152 P18357 oasc.SolrDeletionPolicy.onInit SolrDeletionPolicy.onInit: commits:num=1
[junit4:junit4]   2> 		commit{dir=RateLimitedDirectoryWrapper(org.apache.lucene.store.NIOFSDirectory@/usr/home/hudson/hudson-slave/workspace/Lucene-Solr-Tests-trunk-java7/solr/build/solr-core/test/J0/org.apache.solr.cloud.SyncSliceTest-1359752327693/jetty4/index.20130201125907808 lockFactory=org.apache.lucene.store.NativeFSLockFactory@6bca1f4e),segFN=segments_4,generation=4,filenames=[segments_4]
[junit4:junit4]   2> 20138 T2025 C152 P18357 oasc.SolrDeletionPolicy.updateCommits newest commit = 4[segments_4]
[junit4:junit4]   2> 20139 T2025 C152 P18357 oasu.DefaultSolrCoreState.newIndexWriter New IndexWriter is ready to be used.
[junit4:junit4]   2> 20139 T2025 C152 P18357 oasc.CachingDirectoryFactory.close Releasing directory:/usr/home/hudson/hudson-slave/workspace/Lucene-Solr-Tests-trunk-java7/solr/build/solr-core/test/J0/./org.apache.solr.cloud.SyncSliceTest-1359752327693/jetty4
[junit4:junit4]   2> 20139 T2025 C152 P18357 oass.SolrIndexSearcher.<init> Open

[...truncated too long message...]

   > 	at org.junit.Assert.assertNotNull(Assert.java:526)
[junit4:junit4]    > 	at org.apache.solr.cloud.SyncSliceTest.doTest(SyncSliceTest.java:214)
[junit4:junit4]    > 	at org.apache.solr.BaseDistributedSearchTestCase.testDistribSearch(BaseDistributedSearchTestCase.java:794)
[junit4:junit4]    > 	at sun.reflect.NativeMethodAccessorImpl.invoke0(Native Method)
[junit4:junit4]    > 	at sun.reflect.NativeMethodAccessorImpl.invoke(NativeMethodAccessorImpl.java:57)
[junit4:junit4]    > 	at sun.reflect.DelegatingMethodAccessorImpl.invoke(DelegatingMethodAccessorImpl.java:43)
[junit4:junit4]    > 	at java.lang.reflect.Method.invoke(Method.java:601)
[junit4:junit4]    > 	at com.carrotsearch.randomizedtesting.RandomizedRunner.invoke(RandomizedRunner.java:1559)
[junit4:junit4]    > 	at com.carrotsearch.randomizedtesting.RandomizedRunner.access$600(RandomizedRunner.java:79)
[junit4:junit4]    > 	at com.carrotsearch.randomizedtesting.RandomizedRunner$6.evaluate(RandomizedRunner.java:737)
[junit4:junit4]    > 	at com.carrotsearch.randomizedtesting.RandomizedRunner$7.evaluate(RandomizedRunner.java:773)
[junit4:junit4]    > 	at com.carrotsearch.randomizedtesting.RandomizedRunner$8.evaluate(RandomizedRunner.java:787)
[junit4:junit4]    > 	at com.carrotsearch.randomizedtesting.rules.SystemPropertiesRestoreRule$1.evaluate(SystemPropertiesRestoreRule.java:53)
[junit4:junit4]    > 	at org.apache.lucene.util.TestRuleSetupTeardownChained$1.evaluate(TestRuleSetupTeardownChained.java:50)
[junit4:junit4]    > 	at org.apache.lucene.util.TestRuleFieldCacheSanity$1.evaluate(TestRuleFieldCacheSanity.java:51)
[junit4:junit4]    > 	at org.apache.lucene.util.AbstractBeforeAfterRule$1.evaluate(AbstractBeforeAfterRule.java:46)
[junit4:junit4]    > 	at com.carrotsearch.randomizedtesting.rules.SystemPropertiesInvariantRule$1.evaluate(SystemPropertiesInvariantRule.java:55)
[junit4:junit4]    > 	at org.apache.lucene.util.TestRuleThreadAndTestName$1.evaluate(TestRuleThreadAndTestName.java:49)
[junit4:junit4]    > 	at org.apache.lucene.util.TestRuleIgnoreAfterMaxFailures$1.evaluate(TestRuleIgnoreAfterMaxFailures.java:70)
[junit4:junit4]    > 	at org.apache.lucene.util.TestRuleMarkFailure$1.evaluate(TestRuleMarkFailure.java:48)
[junit4:junit4]    > 	at com.carrotsearch.randomizedtesting.rules.StatementAdapter.evaluate(StatementAdapter.java:36)
[junit4:junit4]    > 	at com.carrotsearch.randomizedtesting.ThreadLeakControl$StatementRunner.run(ThreadLeakControl.java:358)
[junit4:junit4]    > 	at com.carrotsearch.randomizedtesting.ThreadLeakControl.forkTimeoutingTask(ThreadLeakControl.java:782)
[junit4:junit4]    > 	at com.carrotsearch.randomizedtesting.ThreadLeakControl$3.evaluate(ThreadLeakControl.java:442)
[junit4:junit4]    > 	at com.carrotsearch.randomizedtesting.RandomizedRunner.runSingleTest(RandomizedRunner.java:746)
[junit4:junit4]    > 	at com.carrotsearch.randomizedtesting.RandomizedRunner$3.evaluate(RandomizedRunner.java:648)
[junit4:junit4]    > 	at com.carrotsearch.randomizedtesting.RandomizedRunner$4.evaluate(RandomizedRunner.java:682)
[junit4:junit4]    > 	at com.carrotsearch.randomizedtesting.RandomizedRunner$5.evaluate(RandomizedRunner.java:693)
[junit4:junit4]    > 	at com.carrotsearch.randomizedtesting.rules.StatementAdapter.evaluate(StatementAdapter.java:36)
[junit4:junit4]    > 	at com.carrotsearch.randomizedtesting.rules.SystemPropertiesRestoreRule$1.evaluate(SystemPropertiesRestoreRule.java:53)
[junit4:junit4]    > 	at org.apache.lucene.util.AbstractBeforeAfterRule$1.evaluate(AbstractBeforeAfterRule.java:46)
[junit4:junit4]    > 	at org.apache.lucene.util.TestRuleStoreClassName$1.evaluate(TestRuleStoreClassName.java:42)
[junit4:junit4]    > 	at com.carrotsearch.randomizedtesting.rules.SystemPropertiesInvariantRule$1.evaluate(SystemPropertiesInvariantRule.java:55)
[junit4:junit4]    > 	at com.carrotsearch.randomizedtesting.rules.NoShadowingOrOverridesOnMethodsRule$1.evaluate(NoShadowingOrOverridesOnMethodsRule.java:39)
[junit4:junit4]    > 	at com.carrotsearch.randomizedtesting.rules.NoShadowingOrOverridesOnMethodsRule$1.evaluate(NoShadowingOrOverridesOnMethodsRule.java:39)
[junit4:junit4]    > 	at com.carrotsearch.randomizedtesting.rules.StatementAdapter.evaluate(StatementAdapter.java:36)
[junit4:junit4]    > 	at org.apache.lucene.util.TestRuleAssertionsRequired$1.evaluate(TestRuleAssertionsRequired.java:43)
[junit4:junit4]    > 	at org.apache.lucene.util.TestRuleMarkFailure$1.evaluate(TestRuleMarkFailure.java:48)
[junit4:junit4]    > 	at org.apache.lucene.util.TestRuleIgnoreAfterMaxFailures$1.evaluate(TestRuleIgnoreAfterMaxFailures.java:70)
[junit4:junit4]    > 	at org.apache.lucene.util.TestRuleIgnoreTestSuites$1.evaluate(TestRuleIgnoreTestSuites.java:55)
[junit4:junit4]    > 	at com.carrotsearch.randomizedtesting.rules.StatementAdapter.evaluate(StatementAdapter.java:36)
[junit4:junit4]    > 	at com.carrotsearch.randomizedtesting.ThreadLeakControl$StatementRunner.run(ThreadLeakControl.java:358)
[junit4:junit4]    > 	at java.lang.Thread.run(Thread.java:722)
[junit4:junit4]   2> 147136 T1932 oas.SolrTestCaseJ4.deleteCore ###deleteCore
[junit4:junit4]   2> NOTE: test params are: codec=Lucene42: {range_facet_l=PostingsFormat(name=SimpleText), text=PostingsFormat(name=NestedPulsing), _version_=PostingsFormat(name=SimpleText), rnd_b=MockVariableIntBlock(baseBlockSize=65), intDefault=PostingsFormat(name=SimpleText), timestamp=PostingsFormat(name=SimpleText), id=MockVariableIntBlock(baseBlockSize=65), a_t=PostingsFormat(name=SimpleText), range_facet_sl=PostingsFormat(name=NestedPulsing), range_facet_si=PostingsFormat(name=Lucene41WithOrds), other_tl1=PostingsFormat(name=SimpleText), multiDefault=PostingsFormat(name=Lucene41WithOrds), a_si=PostingsFormat(name=Lucene41WithOrds)}, sim=DefaultSimilarity, locale=pl_PL, timezone=Pacific/Pitcairn
[junit4:junit4]   2> NOTE: FreeBSD 9.0-RELEASE amd64/Oracle Corporation 1.7.0_09 (64-bit)/cpus=16,threads=2,free=153950936,total=451936256
[junit4:junit4]   2> NOTE: All tests run in this JVM: [TestBinaryResponseWriter, TestJoin, DirectUpdateHandlerOptimizeTest, TestLazyCores, DirectSolrConnectionTest, SpellCheckCollatorTest, SuggesterFSTTest, TestNumberUtils, SolrCoreCheckLockOnStartupTest, TestComponentsName, ZkControllerTest, AlternateDirectoryTest, TestQuerySenderNoQuery, TestLMDirichletSimilarityFactory, SimplePostToolTest, WordBreakSolrSpellCheckerTest, MoreLikeThisHandlerTest, TestFiltering, NumericFieldsTest, QueryElevationComponentTest, SuggesterWFSTTest, DateFieldTest, TestConfig, TestCoreContainer, TestRangeQuery, PreAnalyzedFieldTest, TestJmxMonitoredMap, DateMathParserTest, TestFastLRUCache, TestWordDelimiterFilterFactory, TestIndexingPerformance, FileBasedSpellCheckerTest, TestPostingsSolrHighlighter, TestXIncludeConfig, TestLuceneMatchVersion, SpellCheckComponentTest, TermsComponentTest, SortByFunctionTest, TestSuggestSpellingConverter, DefaultValueUpdateProcessorTest, CoreAdminHandlerTest, ChaosMonkeyNothingIsSafeTest, CSVRequestHandlerTest, SolrPluginUtilsTest, DistributedSpellCheckComponentTest, TestIndexSearcher, TestPerFieldSimilarity, ClusterStateUpdateTest, TestZkChroot, TestLFUCache, TestPHPSerializedResponseWriter, TestDocumentBuilder, TestPartialUpdateDeduplication, TestSolrIndexConfig, LeaderElectionIntegrationTest, TestSolr4Spatial, TestElisionMultitermQuery, MinimalSchemaTest, TestFuzzyAnalyzedSuggestions, LoggingHandlerTest, BasicDistributedZkTest, TestDistributedSearch, SoftAutoCommitTest, TestFaceting, DistributedTermsComponentTest, SolrCoreTest, IndexBasedSpellCheckerTest, DirectUpdateHandlerTest, TestMultiCoreConfBootstrap, TestSort, BasicFunctionalityTest, SignatureUpdateProcessorFactoryTest, SampleTest, SolrRequestParserTest, TestRemoteStreaming, CacheHeaderTest, QueryEqualityTest, SpatialFilterTest, TestCSVResponseWriter, MBeansHandlerTest, CurrencyFieldTest, TestPseudoReturnFields, IndexSchemaTest, BinaryUpdateRequestHandlerTest, DistanceFunctionTest, TestQueryTypes, JsonLoaderTest, DocumentAnalysisRequestHandlerTest, TestReversedWildcardFilterFactory, RequestHandlersTest, RequiredFieldsTest, CopyFieldTest, TestQueryUtils, SolrCmdDistributorTest, TestSearchPerf, NotRequiredUniqueKeyTest, UpdateRequestProcessorFactoryTest, TestWriterPerf, NoCacheHeaderTest, BadComponentTest, SOLR749Test, TestPropInjectDefaults, TestCollationField, OutputWriterTest, SpellPossibilityIteratorTest, TestPhraseSuggestions, TestIBSimilarityFactory, TestDefaultSimilarityFactory, PluginInfoTest, OpenExchangeRatesOrgProviderTest, FileUtilsTest, TestSolrXMLSerializer, DOMUtilTest, ChaosMonkeySafeLeaderTest, UUIDFieldTest, RAMDirectoryFactoryTest, SystemInfoHandlerTest, TestUtils, ZkNodePropsTest, CircularListTest, AnalysisAfterCoreReloadTest, ShardRoutingCustomTest, SyncSliceTest]
[junit4:junit4] Completed on J0 in 147.16s, 1 test, 1 failure <<< FAILURES!

[...truncated 34 lines...]
BUILD FAILED
/usr/home/hudson/hudson-slave/workspace/Lucene-Solr-Tests-trunk-java7/build.xml:346: The following error occurred while executing this line:
/usr/home/hudson/hudson-slave/workspace/Lucene-Solr-Tests-trunk-java7/build.xml:39: The following error occurred while executing this line:
/usr/home/hudson/hudson-slave/workspace/Lucene-Solr-Tests-trunk-java7/solr/build.xml:178: The following error occurred while executing this line:
/usr/home/hudson/hudson-slave/workspace/Lucene-Solr-Tests-trunk-java7/solr/common-build.xml:428: The following error occurred while executing this line:
/usr/home/hudson/hudson-slave/workspace/Lucene-Solr-Tests-trunk-java7/lucene/common-build.xml:1176: The following error occurred while executing this line:
/usr/home/hudson/hudson-slave/workspace/Lucene-Solr-Tests-trunk-java7/lucene/common-build.xml:841: There were test failures: 249 suites, 1038 tests, 1 failure, 23 ignored (5 assumptions)

Total time: 34 minutes 31 seconds
Build step 'Invoke Ant' marked build as failure
Archiving artifacts
Recording test results
Email was triggered for: Failure
Sending email for trigger: Failure



Mime
View raw message